
##TITLE=AC1333_TANAH10083_7160795_mNxTH9sknc
##JCAMPDX= 6.0         $$ Bruker NMR JCAMP-DX V2.0
##DATA TYPE= NMR SPECTRUM
##DATA CLASS= NTUPLES
##ORIGIN= BRUKER
##OWNER= Administrator
$$ 1.72 TOPSPIN		Version 2.1
$$ 2012-12-01 00:48:41.383 -0500  Administrator@X
$$ Compression mode = diff/dup
##.OBSERVE FREQUENCY= 400.02188249412
##.OBSERVE NUCLEUS= ^1H
##.ACQUISITION MODE= SIMULTANEOUS (DQD)
##.ACQUISITION SCHEME= undefined
##.AVERAGES= 8
##.DIGITISER RES= 22
##SPECTROMETER/DATA SYSTEM= spect
##.PULSE SEQUENCE= zg30
##.SOLVENT NAME= COFFEE_meoh
##.SHIFT REFERENCE= INTERNAL, COFFEE_meoh, 1, 14.98509
##AUDIT TRAIL= $$ (NUMBER, WHEN, WHO, WHERE, PROCESS, VERSION, WHAT)
$$ ##TITLE= Audit trail, TOPSPIN		Version 2.1
$$ ##JCAMPDX= 5.01
$$ ##ORIGIN= Bruker BioSpin GmbH
$$ ##OWNER= Administrator
$$ $$ E:\/data/COFFEE/nmr/AC1333_TANAH10083_7160795_mNxTH9sknc/10/pdata/1/auditp.txt
$$ ##AUDIT TRAIL=  $$ (NUMBER, WHEN, WHO, WHERE, PROCESS, VERSION, WHAT)
(   1,<2012-12-01 00:48:32.136 -0500>,<Administrator>,<X>,<go>,<TOPSPIN 2.1>,
      <created by zg
	started at 2012-12-01 00:47:25.548 -0500,
	POWCHK enabled, PULCHK disabled,
       configuration hash MD5:
       86 BA 57 50 F2 9D 5C 9B 26 00 A9 28 5F 66 2E 89
       data hash MD5: 64K
       C5 06 88 76 25 A3 BE 1E DB 59 B8 2D 3C 12 73 D6>)
(   2,<2012-12-01 00:48:35.453 -0500>,<Administrator>,<X>,<proc1d>,<TOPSPIN 2.1>,
      <Start of raw data processing
       efp LB = 0 FT_mod = 6 PKNL = 1 PHC0 = 0 PHC1 = 0 SI = 32K 
       data hash MD5: 32K
       D4 73 87 6C B9 18 ED C6 DF 41 53 A3 95 60 48 35>)
(   3,<2012-12-01 00:48:36.038 -0500>,<Administrator>,<X>,<proc1d>,<TOPSPIN 2.1>,
      <pk PHC0 = 98.81104 PHC1 = 0 
       data hash MD5: 32K
       B7 B9 6D 2C EF AF 30 44 E4 81 18 88 11 94 04 E7>)
(   4,<2012-12-01 00:48:36.313 -0500>,<Administrator>,<X>,<proc1d>,<TOPSPIN 2.1>,
      <abs ABSG = 1 
       data hash MD5: 32K
       8D BD 7D B5 5B 7E 57 AC 55 A1 D9 1B 16 AC F1 EB>)
(   5,<2012-12-01 00:48:36.485 -0500>,<Administrator>,<X>,<proc1d>,<TOPSPIN 2.1>,
      <abs ABSG = 2 
       data hash MD5: 32K
       36 4E 95 60 E0 C0 54 7F 34 B9 EA C1 A9 81 89 7E>)
(   6,<2012-12-01 00:48:36.657 -0500>,<Administrator>,<X>,<proc1d>,<TOPSPIN 2.1>,
      <abs ABSG = 3 
       data hash MD5: 32K
       16 E6 FF F8 FA AA 7E 14 48 B7 0C 00 2A 74 A1 67>)
(   7,<2012-12-01 00:48:36.828 -0500>,<Administrator>,<X>,<proc1d>,<TOPSPIN 2.1>,
      <abs ABSG = 4 
       data hash MD5: 32K
       D3 2A 76 4C 4B 8D DE BD C1 7B 75 A9 FD E5 52 C9>)
(   8,<2012-12-01 00:48:37.000 -0500>,<Administrator>,<X>,<proc1d>,<TOPSPIN 2.1>,
      <abs ABSG = 5 
       data hash MD5: 32K
       43 F2 B3 CB 37 14 3E F2 17 06 4B 35 EA EE 7C C7>)
$$ ##END=
$$ 
$$ $$ hash MD5
$$ $$ 9E 55 A8 37 17 80 AD AD 58 9F 78 B4 61 9E 42 60
##$RELAX= 
##$RELAX= 
##$RELAX= 
##$RELAX= 
##$RELAX= 
##$RELAX= 
##$RELAX= 
$$ Bruker specific parameters
$$ --------------------------
##$DU= <E:\>
##$EXPNO= 10
##$NAME= <AC1333_TANAH10083_7160795_mNxTH9sknc>
$$ [...]
##$TP= (0..7)
150 150 150 150 150 150 150 150
##$TP07= 0
##$TPNAME0= <>
##$TPNAME1= <>
##$TPNAME2= <>
##$TPNAME3= <>
##$TPNAME4= <>
##$TPNAME5= <>
##$TPNAME6= <>
##$TPNAME7= <>
##$TPOAL= (0..7)
0.5 0.5 0.5 0.5 0.5 0.5 0.5 0.5
##$TPOFFS= (0..7)
0 0 0 0 0 0 0 0
##$TUNHIN= 0
##$TUNHOUT= 0
##$TUNXOUT= 0
##$USERA1= <user>
##$USERA2= <user>
##$USERA3= <user>
##$USERA4= <user>
##$USERA5= <user>
##$V9= 5
##$VALIST= <valist>
##$VCLIST= <CCCCCCCCCCCCCCC>
##$VD= 0
##$VDLIST= <DDDDDDDDDDDDDDD>
##$VPLIST= <PPPPPPPPPPPPPPP>
##$VTLIST= <TTTTTTTTTTTTTTT>
##$WBST= 1024
##$WBSW= 4
##$XGAIN= (0..3)
0 0 0 0
##$XL= 0
##$YL= 0
##$YMAX_a= 632824
##$YMIN_a= -534579
##$ZGOPTNS= <>
##$ZL1= 120
##$ZL2= 120
##$ZL3= 120
##$ZL4= 120
##$ABSF1= 14.98509
##$ABSF2= -5.573092
##$ABSG= 5
##$ABSL= 3
##$ALPHA= 0
##$AQORDER= 0
##$ASSFAC= 0
##$ASSFACI= 0
##$ASSFACX= 0
##$ASSWID= 0
##$AUNMP= <proc_prof1d_extract_pilot.lims>
##$AXLEFT= 0
##$AXNAME= <>
##$AXNUC= <1H>
##$AXRIGHT= 0
##$AXTYPE= 0
##$AXUNIT= <>
##$AZFE= 0.1
##$AZFW= 0.1
##$BCFW= 0
##$BC_mod= 0
##$BYTORDP= 0
##$COROFFS= 0
##$CY= 15
##$DATMOD= 1
##$DC= 0
##$DFILT= <>
##$DTYPP= 0
##$F1P= 0
##$F2P= 0
##$FCOR= 0.5
##$FTSIZE= 32768
##$FT_mod= 6
##$GAMMA= 0
##$GB= 0
##$INTBC= 1
##$INTSCL= 1
##$ISEN= 128
##$LB= 0
##$LEV0= 0
##$LPBIN= 0
##$MAXI= 10000
##$MC2= 0
##$MEAN= 0
##$ME_mod= 0
##$MI= 0
##$NCOEF= 0
##$NC_proc= -8
##$NLEV= 6
##$NOISF1= 0
##$NOISF2= 0
##$NSP= 0
##$NTH_PI= 0
##$NZP= 0
##$OFFSET= 14.98509
##$PC= 1
##$PHC0= 98.81104
##$PHC1= 0
##$PH_mod= 1
##$PKNL= yes
##$PPARMOD= 0
##$PPDIAG= 0
##$PPIPTYP= 0
##$PPMPNUM= 2147483647
##$PPRESOL= 1
##$PSCAL= 4
##$PSIGN= 0
##$PYNMP= <proc.py>
##$REVERSE= no
##$SF= 400.02
##$SI= 32768
##$SIGF1= 0
##$SIGF2= 0
##$SINO= 400
##$SIOLD= 32768
##$SPECTYP= <>
##$SREGLST= <1H.CDCl3>
##$SSB= 0
##$STSI= 32768
##$STSR= 0
##$SW_p= 8223.68421052631
##$SYMM= 0
##$S_DEV= 0
##$TDeff= 65536
##$TDoff= 0
##$TI= <>
##$TILT= no
##$TM1= 0
##$TM2= 0
##$TOPLEV= 0
##$USERP1= <user>
##$USERP2= <user>
##$USERP3= <user>
##$USERP4= <user>
##$USERP5= <user>
##$WDW= 1
##$XDIM= 32768
##$YMAX_p= 473013202
##$YMIN_p= -685494
##$CURPLOT= <Network HP LaserJet P1505>
##$CURPRIN= <$Network HP LaserJet P1505>
##$DFORMAT= <normdp>
##$LAYOUT= <+/1D_H.xwp>
##$LFORMAT= <normlp>
##$PFORMAT= <normpl>
##$SURQMSG= 1
$$ End of Bruker specific parameters
$$ ---------------------------------
##NTUPLES= NMR SPECTRUM
##VAR_NAME=  FREQUENCY,     SPECTRUM/REAL,   SPECTRUM/IMAG
##SYMBOL=    X,             R,               I
##VAR_TYPE=  INDEPENDENT,   DEPENDENT,       DEPENDENT
##VAR_FORM=  AFFN,          ASDF,            ASDF
##VAR_DIM=   32768,         32768,           32768
##UNITS=     HZ,            ARBITRARY UNITS, ARBITRARY UNITS
##FACTOR=    0.250966925370066, 1,           1
##FIRST=     8223.43324360094, -140087,      24391
##LAST=      0,             -132,            -414625
##MIN=       0,             -685494,         0
##MAX=       8223.43324360094, 473013202,    0
$$ Real data points
##PAGE= N=1
##DATA TABLE= (X++(R..R)), XYDATA
$$ [...]
23790 206176 -177839 -142139 7564 -36162 158963 -26811 -461489 -85488 82895 -29115 172944
23778 -228539 245810 217990 -258500 -4564 -27689 108727 -268947 1023 -111535 -32374 -340633
23767 -340633 51659 146680 9701 -234940 -63478 -351418 161728 -121745 -267614 120875
23756 6202 235949 196617 75479 86079 -196401 -92554 -382084 48398 24143 -99727 -332552
23745 -332552 -59050 48528 268127 -41831 124839 75595 148968 -82220 -5711 66954 -22699
23733 390665 -20712 -15358 -349345 -66193 -115860 33453 46254 -77255 -74809 109319 -286694
23721 24669 -199130 -119059 -103572 -137866 181538 -161196 51546 -108663 254412 -106221
23710 -73677 112261 -65574 111014 -139279 -29600 -239134 148926 237910 222047 -41733 48167
23698 -153734 178026 -123577 -5375 -261491 -503754 321036 -6392 192494 -449585 118522
23687 -73810 -299444 -393467 -60780 -45107 12481 -163654 34825 -546521 32067 -252272 -24864
23675 2581 272020 -135767 209694 -199292 -305426 -141619 -73039 81089 -215150 -195360
23665 -195360 52842 104006 348279 76141 211674 139594 -85640 30898 51776 90525 -131390
23653 -119731 -146036 46931 -211706 400826 -189344 128460 -24766 -191297 -146524 72500
23642 -169918 -139820 -190584 185896 -195278 -428000 206198 1088 -246749 -83908 52748 -18358
23630 391236 -212145 -104962 331840 -233257 -121095 29621 200722 176713 46111 237172
23620 237172 -95122 2415 -100967 -225955 92822 171293 -150325 -74979 220276 -165262 -47237
23608 -142026 71206 -55201 -179468 232233 302375 76127 8648 -48657 -93033 103947 -106117
23596 129566 -10264 -4842 207900 145124 194014 197002 219932 431157 152795 -55549 149726
23584 79733 203476 -12107 199632 375291 314745 76758 -64476 32842 291524 -55828 180541
23572 -120108 39869 19010 -84057 -23364 -287543 -182287 -159152 -33918 -307242 428050 41867
23560 -90503 2787 -369146 56284 -30046 -8367 -90274 81395 41551 94937 210741 -73812 171205
23547 729 -16031 483 -447605 121497 245455 -103036 64970 119443 -203044 -352491 -276627
23536 -276627 -87670 -37980 -196928 276736 -90651 -9967 93888 -41869 140429 -33013 17009
23524 191475 -314613 207082 162532 110972 -137067 127915 -27441 -75014 -236068 -258633
23514 -258633 -241900 69069 90086 258649 83802 -161659 -186108 15962 -126618 -42735 195189
23502 -162644 -179884 43639 154161 -392327 312184 -68729 -253903 -20054 377668 100432
23491 8542 91630 -327534 -133777 126735 -88310 38470 -128539 288074 18081 -57934 93708
23479 53747 -217273 19801 2818 -91681 234920 142872 171644 -324868 -83597 -110877 -215935
23468 -215935 17393 -80492 151075 -84627 29960 36516 -29999 -49087 -366997 -192869 -19680
23456 135413 -352175 99418 -71138 -87130 32643 142561 67104 -203210 -70772 -367864 128336
23444 -15843 -110076 263010 -73981 -21770 20661 108895 -22557 -33342 -2901 167042 -102427
23432 -267345 -150621 89890 -56541 -13566 -198736 -197708 -290968 109261 114647 343442 -90425
23420 44560 206962 345036 -290297 2912 -236779 84373 -203154 49655 48710 50106 -75426
23408 -225770 -22975 -340720 197164 145321 -271649 -150849 -155571 -156189 217742 37166 -172218
23396 153832 3763 -269630 -72417 -268827 80184 -213939 -147563 171532 41411 30984 -4999
23384 -155250 130676 -9256 394647 216720 -238251 -332820 241088 -53573 -70723 -258782
23374 -258782 45336 357528 192344 -427606 -134483 -248181 -112012 -248702 -86449 -100428
23364 -100428 37247 -190445 26523 123826 -84431 -82345 -85124 -63447 -177451 126088 193702
23353 193702 98374 -45263 -100851 -17273 297960 -190430 -112450 118787 -75845 -308154 237814
23341 -15658 93529 -150434 188344 167032 -385086 -14934 -53354 -92862 -115361 127604 -220426
23329 93267 44342 -221158 -100329 -57597 -320580 -282526 -411231 205683 190737 -145147
23318 404156 -299386 -192358 112796 119949 272895 -45778 95071 40843 258704 -56146 83408
23306 6077 -181735 23127 -177047 296124 61739 -199065 -270070 -114577 -213873 -27086 -49845
23295 -49845 196615 12219 234805 193371 51045 11066 -112435 10686 -138179 -233823 -171622
23284 -171622 103418 -139929 -173626 610 -126365 -167842 81295 237819 250157 -91240 75561
23272 101948 -21634 2493 -96110 -42368 -22262 -227457 291681 -100695 191657 -57521 -260680
23261 -260680 117723 -232532 -219402 -126085 -94900 -408981 -147030 -59949 254414 -39815
23250 -149820 -227927 300370 174496 29841 -148829 22488 -57249 -61483 -247909 169150 77346
23238 -80180 34462 139819 8387 -1135 -162355 -227291 53234 -345420 -5247 3678 -99095 -29878
23225 229376 -313044 -71984 246754 -159160 103586 -174986 -12770 -260640 -296635 417750
23214 284222 18821 -306801 -217720 87077 152989 68708 166788 -26803 -223673 188349 324898
23203 324898 -157248 -21736 243640 -22368 -123819 104252 -237523 -24769 -7496 301975
23192 -221617 173324 -55572 29486 -357862 -306696 -377490 -325354 -114821 -300172 143325
23181 -124601 -30716 -319428 -21633 95470 -97534 135151 369197 -160285 245814 -17771
23170 -42826 -7090 202895 134087 -39984 -312691 16009 254584 169246 -417836 -327920 138597
23158 -74381 380685 -86403 -175360 102575 246237 -94175 -49381 -203505 58527 -273175 38003
23146 331771 -129098 438131 -120543 -65876 -13810 79970 -61298 206614 -158867 96687
23135 -63549 -37028 70534 168469 158865 218583 -55055 160598 -293321 87039 38832 127149
23124 127149 147129 -229392 -135755 147420 57560 84208 -134022 107684 104743 278406 -258053
23112 88560 -53102 212735 166246 -229713 28684 -51874 -74047 -42197 111462 -152973 -102355
23101 -102355 236803 293051 -131411 56140 116575 332896 340468 94825 70342 162159 -147146
23089 242495 69388 180449 69 -228667 -249388 -42586 -149828 -42907 -42246 5080 -69042 68688
23076 -191837 41166 -79863 -1946 72601 138525 153296 73110 -210396 264385 -134869 -53769
23064 -52209 79412 -70165 -282953 82221 -279238 31788 36572 -34851 -155715 122252 278483
23053 278483 -25078 179887 536507 191474 150867 239070 -71040 -56389 -74432 418979 -102864
23041 276841 29008 179117 -249 24603 182719 -133680 -293844 108322 -239466 4552 -419646
23029 32625 66282 43837 -36661 78298 -305430 -183948 -271717 -159870 248944 -111104 -245023
23018 -245023 -144846 5186 -34089 27260 -126531 130343 58160 -115764 107732 148258 75963
23007 75963 -222288 -189204 113309 -72220 -206918 -339367 -3943 48199 -375988 83450 -231386
22995 66619 -178539 -183729 -128698 -47031 -127590 -59933 -150049 -99890 136625 -18076 -290972
22984 -290972 95089 35073 -84494 150308 13134 44948 38027 -2438 166185 19023 259565
22973 259565 -270513 131733 -201186 36381 -333100 25071 62210 -103235 -12759 -95519
22963 -95519 146226 -48510 -70609 40577 224614 -132903 161709 -86068 -319702 -397384 -220633
22952 -220633 106452 -29818 -48163 -36069 205050 8450 222130 -55865 -68554 -54237 27684
22940 -30921 221323 -172433 70783 -346298 -32081 280129 -120959 -56601 -225719 -152228
22930 -152228 -52684 -134323 -356447 -43009 -256854 -207633 25355 -26638 -137055 89855 303052
22919 303052 91274 262073 47254 54682 65726 -47492 -111803 54675 135079 -147168 244213
22907 45615 -113976 237919 -294365 327889 -64342 -335042 71730 -134144 -111208 48634
22896 151618 -281030 -368658 96732 173250 -99135 -232444 107627 -17966 -188636 -122152 61550
22884 -246782 19082 15837 68204 -119475 70172 177092 -90344 134142 -100879 -57223 212700
22872 -177506 -480641 -206074 93995 115204 123827 -282398 328342 77927 -207700 66037 -83606
22860 -77877 -154986 -203173 201745 115353 -246232 -84488 71149 -52800 -163982 -230232 -11631
22848 512291 8458 -171585 -320620 -191845 185050 191276 44373 117848 -25699 267377 -168721
22836 -156530 -73970 -143659 265825 -281350 37412 -193423 -79675 -339108 128813 158466
22826 158466 5725 -82622 -117602 209612 -39652 -243444 -105450 -146836 -87553 -17541 -429186
22815 -429186 129504 -187401 537 -85670 -56030 -54919 171046 -29639 -26351 -83509 -39774 -252331
22803 -252331 -223754 -234575 -317799 -34561 -73230 -53981 -81495 203412 -59679 352744 -86619
22791 -211953 -232055 -186608 -159920 -174889 202168 23219 -225080 162273 124674 47988 226764
22780 226764 -432565 -109142 77970 -33235 168428 237071 114011 -203453 -101382 -17573
22769 -6584 1957 35013 179774 -95467 155125 -79409 81470 -155270 -248147 72208 -86285
22757 -5266 10913 80255 -159026 249976 -220747 240761 -169624 -173819 280323 -237053 268715
22745 -30977 -11805 -252717 109402 -82224 -18960 5260 24444 36448 -41798 3111 134027
22734 134027 180246 40568 -264692 -58881 46359 -83699 -112670 -80924 309057 -60842 279094
22722 -338863 -111784 217275 106334 -159831 -75307 -128537 -151464 36996 -123099 -351902
22712 -351902 -326776 88777 -117281 49948 -368454 -76604 174897 -236489 281100 17665
22701 -126794 18739 -45990 -286023 -132872 59500 -29673 -126800 -148615 100375 198907 -159359
22689 39420 -338016 -245353 -46214 -144659 -172252 -18609 -475236 -8748 -72803 171816 109731
22678 109731 166241 217725 -70222 -173061 -141965 20081 -200671 244173 33815 -362595 -111040
22666 -74270 -346729 -155831 104639 -281153 43669 78294 -270626 -88970 -104030 -100044 380253
22654 44612 -287547 14157 156198 -153217 -185907 -71639 -340474 -82796 -21532 -981 -313195
22643 -313195 113674 -249474 120178 -358553 -240911 -165783 -269372 -20591 20241 243857
22633 243857 51433 28427 -118530 -86309 62850 1069 102927 -149159 -361915 -114691 32900
22621 -30808 219861 -88230 263760 -429689 -35637 -359575 237511 188985 -201679 -418283
22611 -418283 -129174 -129696 -32735 -32948 -156004 -116865 -362354 -301821 145149 26572 -276197
22599 -215403 230549 -17289 -108060 359635 101179 75896 -304169 52430 60599 296486 -161459
22587 -83464 -183097 -373367 -425307 -24272 -215553 6939 192128 -308711 206155 63431 -87569
22575 23768 -340136 -223620 108342 5446 20884 -15180 -193191 244600 -184050 -497803
22565 -497803 -278329 -206200 288561 238696 10604 -13093 106676 -49988 35679 -70221 68148
22553 317111 -145234 -279597 -132095 6599 196533 -35922 -48356 169174 -63023 143283
22542 -339617 -384507 -76751 58944 -85605 -471984 193542 168722 -138130 -46197 -396072 183690
22530 237628 52775 222515 -108445 -84725 45136 105263 -187516 -184430 -98878 214634 40496
22518 469397 -118401 106322 -173920 107502 -103363 90485 -39712 251976 -122554 105500
22507 -350826 148106 -95109 -114864 119762 -4246 9455 -10135 109933 -266167 -102952 -108637
22496 -108637 109658 -39571 -229477 -102011 130767 -243526 -33362 164943 -98979 -190928
22486 -190928 -219286 166694 196880 200882 91308 162706 -89562 -9433 -164896 -353168 -96905
22474 179726 -132934 16559 -91458 36928 -37088 -34216 -46898 104904 -72741 -80466 353518
22462 -16451 89366 -291414 118551 -47769 -41229 169954 -289140 36195 -44986 8536 -119516
22450 -8002 126526 -229132 52848 200191 -115559 -231948 -174558 -156173 -338048 22790 -261370
22438 -211226 127378 -104089 46479 -94588 -348977 138228 -118905 -32244 54987 -43209
22427 -310980 -183747 -462985 233787 -163975 -118816 22790 337382 -126436 41904 -147138
22416 -146784 15019 -231432 -235843 105971 259258 -185574 -9943 92589 -104459 -327311 138645
22404 69580 -47608 -379130 -162078 90879 -376484 -362629 60809 84078 243640 -85154 26918
22392 147547 91213 156588 -191015 -304032 -105971 -165459 175455 132450 -188437 -190745 -211822
22381 -211822 -37772 212749 -225871 -107788 -6215 -96879 77748 -77350 -356248 -38409 -202220
22370 -202220 97863 104960 216232 66596 -76981 -47650 190498 -105328 61919 3050 142376
22359 142376 -92613 -121582 105769 -129619 107693 -37536 -53566 -289006 -42469 3399 136346
22348 136346 -35248 -124632 56601 -71441 156647 -265543 -55257 107948 -4435 11333 168580
22337 168580 243300 -91014 -260644 219565 103023 -98131 -122492 -42046 -158215 -98207 -19238
22325 179479 -359726 -134998 -136303 -316824 -6263 -18046 11937 -246181 -394682 23390 -12376
22313 161423 -65022 -193742 -205707 -151465 -14950 -110298 -25115 74416 -136415 -190611 277081
22301 81665 125035 2670 -42573 54564 218049 11292 168796 -252086 17587 13161 53280
22290 53280 -90944 8262 -163742 -373657 17683 74385 -421078 -67825 -440688 63603 -107548
22278 130103 58736 -53661 10702 138492 106730 -101415 -283409 -54939 267455 126984
22267 23257 -102265 17706 -39599 -93521 92915 -56245 -83295 63374 148415 -230153 166262
22255 -48949 -182034 -124586 171765 -200059 -20681 -117534 442731 239100 -45887 -280773
22245 -280773 -85650 -70128 -323166 23321 -292417 163252 -70825 -168288 167121 -274207
22234 -150376 -53106 34495 116079 -385265 -258447 -2281 -310258 212594 -211665 44494 151834
22223 151834 31312 -164805 -80106 -358510 -46021 -257090 72722 -423307 -354983 -83047 -74334
22212 -74334 -89398 -48179 -67903 -38788 -123601 -209218 77209 168339 216832 -167359 302046
22200 -174791 -264158 52547 -118023 12734 -363242 -105696 -287473 -18265 205321 -158272
22189 174762 -82104 -195742 111839 -137204 388593 -78045 -10082 5103 -464973 183705
22178 103752 -111531 -151390 -110437 -57871 -91073 85018 360772 152889 105897 199513 -53710
22166 -242266 29817 -295310 -171273 -257750 100686 178621 -61273 -56432 -53013 -222076 113288
22154 -78179 38162 65600 56671 306067 48837 -68855 -231797 -26616 -29717 -44749 110130
22142 -82786 -122538 223081 -195394 -266794 -129629 377743 187355 -35816 -74750 -237685
22132 -237685 -47358 177385 -38172 -183832 37260 -364349 48059 220840 -70085 201778
22121 163294 -216867 158294 33725 -149740 10027 -94392 -277576 68508 -73118 67933 -92087
22109 -56800 8767 24474 89920 -33013 -164477 -27375 -357036 105237 -117045 11741 -238835
22097 -113809 -7647 7612 -56901 41636 58201 -25689 171270 -17773 118107 -252996 -5259
22085 278101 169027 -120791 -5364 -72051 -91730 105682 99332 247449 -118517 -38373 -230223
22074 -230223 -180138 167649 -202466 -217783 -172530 -295293 -258347 323833 -31849 135298
22063 91239 65600 -327127 -88037 -77689 -68522 254959 -67015 39656 78057 -109423 -32948
22051 99213 13422 135026 130386 -55868 -63709 -145757 -70978 -4670 -283540 -314160 94180 153301
22039 153301 -445878 147804 -503630 -24080 81706 -205216 -360271 77423 -163852 -149861
22029 -149861 95408 -320705 27029 221737 -333394 78789 -299992 -245859 87042 64634 79428
22018 79428 13949 -218511 53351 -30844 -28801 -340207 -71660 139862 132442 -205392 -196864
22007 -196864 -33554 -259848 54797 51117 -94821 64994 44982 -76944 168022 -114574 -41963
21995 -32759 79852 -298592 -302384 -41005 -178408 -67429 -41093 -147268 77390 -299976 -437456
21984 -437456 -144542 34832 -132287 21067 -172610 -327334 160763 -75352 -43753 329815
21973 131062 20988 142054 -234116 -143097 -81578 -84027 105412 23062 -285248 7987 -88477
21961 48844 -155822 126117 97348 -134110 -126055 54086 -34918 -94111 -19216 -75629 -58496
21950 -58496 -139851 -10170 -291199 182527 -156991 -85606 -74912 -178610 -77950 -102846 -25759
21938 -141796 -176140 -212121 395 61766 53475 76680 208537 -274726 230989 88253 229309
21927 229309 -149387 -51738 -167324 231548 -195711 -18415 -262672 -139679 -258591 -303585
21917 -303585 -110627 103976 -80039 129840 1322 -127 -182312 -264121 -144530 -228096 -12421
21905 -94234 -315095 45016 -10619 -127392 -123007 54763 -157863 -294856 -9989 52365 -266733
21893 268420 -18337 218780 29690 201565 31076 -8245 141517 -307950 -143962 -110099 152011
21881 80123 -249941 155438 -114105 -142532 -49965 41235 -278043 271027 -113709 -217864
21871 -217864 360113 -421890 104095 53887 -223624 -120580 -139703 -274315 -135332 161098
21860 86157 60417 -167143 -102658 32015 -122988 -75275 698 144905 142644 21004 67800 -87546
21847 -407082 215510 -226927 -261404 -290202 -148330 27420 -227779 -117886 -288273 -159102
21837 -159102 -5828 2285 -151346 -339336 56478 -9153 -52314 185408 -74009 -274853 218913
21825 376605 33445 171392 -197538 97567 -26974 57809 95781 -47767 151323 -21335 -114320
21814 -114320 -108463 -27287 -17915 29714 -57714 193747 129813 -150042 124722 44737 -229332
21802 107607 -142376 -57875 -33397 -123614 -76224 47015 -282314 295866 -143724 -58932 187505
21790 112542 -94935 195305 277174 28174 231147 -165354 -45274 153295 -132762 -140370 -219498
21779 -219498 -62159 100222 97828 -175044 154852 98085 -54399 149737 -275530 -333802 160358
21767 119445 154959 -107188 -56709 120473 194264 211845 95334 -11419 -171132 98625 -37080
21755 156589 -422294 -222612 84652 -107133 -229382 -155607 40139 16978 -421093 -78571
21744 -186050 -80421 -247328 168530 104375 57017 -77066 -30827 -35548 48733 -94594 -477755
21733 -477755 -139787 312313 13793 26813 -154551 -113760 236307 -383741 -43621 -33106
21723 -33106 -172981 78675 -34118 139935 30989 -107014 -145675 83232 237806 -122911 56262
21711 229069 122246 -17037 42364 -198849 -46720 76862 7443 -84109 42637 115759 -155664
21699 130575 -75726 167931 83859 -163828 -247538 64635 56973 -213661 -47700 3340 -70956
21687 66098 29896 -122945 -200352 -88534 250504 -252190 293438 211969 -127032 45506 -117577
21675 117428 -124319 27561 -320634 -23298 -234063 -91666 -201289 -96255 -206698 273342
21664 7760 95553 -178205 -12818 -135308 -23155 -298905 91673 -276278 -254507 -90272 -113530
21653 -113530 -306443 69948 8094 -101782 371934 -95376 -62592 63083 -139443 -156706 -209233
21642 -209233 207243 128788 318607 47330 -196570 -11421 -138947 293854 -189490 -212477
21632 -212477 -185445 -274724 75797 -475121 -207248 98037 -25485 -271213 -276973 103942 -171703
21620 288385 25743 -120840 -55251 -215433 114968 -13133 352743 26324 325246 -176874
21609 -291380 -265251 -141426 -44743 -50169 -172631 -336480 -191732 6421 108657 -76390 355
21597 -148657 2649 -116401 -220921 -321746 72262 -129557 66809 42244 4563 285039 201233
21586 201233 -77090 297036 -413266 52797 -260051 -96338 182799 106343 -156618 -144067
21576 -144067 -81048 -76623 31257 -448719 15701 -170493 -257703 -170923 -37472 226563 72219
21564 -90345 -54459 12288 -57803 65598 54056 -83547 -168864 364983 -265983 -154049 -20220
21552 -45654 306270 242136 82566 -157140 90618 -13517 -171229 -204059 -85467 -174749 -620115
21541 -620115 17105 -35291 -107094 80667 -86248 49862 -76299 -428847 -138128 -1488 -46716
21530 -46716 342429 -125315 -169996 -234865 142749 -110369 30223 45566 -15539 -31079 -90492
21519 -90492 -228178 -39634 -164090 13387 126415 -217233 -12925 279312 -287735 -47020
21508 -90668 -162452 -339530 -248042 -169477 -37509 -72366 128759 -182373 219662 157058 194839
21497 194839 -134243 -265931 -29524 45318 99086 203317 -185487 -30904 -34151 236183 -11435
21485 106849 -30684 -178084 -156029 -232942 -139880 -120285 -15895 -141396 24400 8419 106324
21474 106324 325018 -153254 142760 117235 40901 -22165 -377611 13269 -27568 -6076 -465064
21463 -465064 -223065 176152 -63430 58891 28819 -22762 131231 65129 97280 111507 -32388
21451 59694 -202292 -211024 152813 -187576 104692 187527 -166594 -380174 64659 104953 121701
21440 121701 34593 204296 248565 238222 640409 398065 164748 43200 -79105 -257044
21430 -257044 4048 199113 70001 -43290 185127 60953 187001 90449 116587 -78695 34272
21418 19278 -182859 -251474 310037 33137 9112 -277851 -49671 -219216 133769 -152541 -74447
21406 -182375 72483 -157866 -223400 -227173 33382 103793 78408 -315293 77838 -72303 131686
21394 -147353 44501 -97384 71718 -351141 44315 -192968 -64302 -92089 -264778 74265 -170984
21382 -121750 97370 197191 -49924 -30406 -253115 -361587 10199 115238 -75908 -276232 105000
21370 56322 -111659 97758 78966 43824 -117544 -288326 -153924 -199326 -104435 -273645 15693
21358 -131419 48430 -74389 197953 -421844 227925 -1332 -388624 -31906 -173823 -50691 -375621
21347 -375621 -32415 -208718 108837 -512372 19977 -79948 34776 -55159 -32546 -58514 93070
21335 -113097 -26047 108539 -156916 -55447 -110021 -54324 51112 36500 66870 -44980 -155231
21324 -155231 -476565 122189 -23308 -70608 -9934 -41147 454949 -126931 -9909 -14232 -375054
21313 -375054 -114894 -67756 281867 138700 173038 25934 -180578 -117747 -164457 44109 275031
21302 275031 99592 -262157 5369 -183326 -305412 -177486 -256604 -20569 -332967 -364462 -177889
21290 121603 -91756 200829 -30425 73793 -68339 -121588 -179323 -29635 282906 129017 316208
21279 316208 -132519 -92597 -109423 42732 50072 57695 -62235 3052 -303958 151846 171207
21268 171207 -158659 224418 217138 -174481 153398 -31810 17070 -84854 -231380 -254394 4084
21256 -163618 -24984 -375407 -30076 -105184 -83045 -288504 -40991 -18802 170424 -138048 6589
21244 -472229 -64484 27110 49135 49449 146571 10951 -137554 -73081 -136982 234668 107698
21232 126100 -147007 136745 238767 -52518 -153026 -139131 2361 -281352 -88996 3085 -32140
21220 -128532 -70993 142523 -286585 100803 -129920 -44809 260897 -331185 -227191 134245
21209 -97537 -91518 -84915 -104278 -279031 -226572 -82391 -124976 -48589 -343863 -31747 -211987
21198 -211987 -140889 92931 -250663 109960 -183853 29236 -133130 10355 181938 93049
21188 93049 51093 377066 -92948 -280534 -129347 -347490 -88905 294685 -342921 206066
21177 528080 58327 -137001 -35787 -155578 -84458 -353906 -278983 9392 107828 -26849 38868
21165 137896 -194777 -1552 -194674 -77653 -54606 201653 219783 104842 -29566 -74937 -60286
21154 -60286 74615 -16356 -135087 24872 199907 178307 -296685 116544 -141380 -197854 -127880
21143 -127880 -118664 610 -130893 -183885 450462 -39298 191111 231429 196105 -234494 1514
21131 286615 168178 191728 142497 -9314 -442654 -202835 392928 -80209 -21924 -332103 419262
21119 -338217 -445598 69375 96753 61703 -252408 -266516 -158782 130201 61447 -123387
21108 -163940 -85638 151736 -46968 -64453 -91726 -199207 -117954 261148 -199725 -108740 -4809
21096 56036 -451211 -161841 -45427 -181469 152755 -157550 -143790 210673 -270353 -441181
21086 -441181 -109386 -313348 -168071 -116827 80293 33674 437674 -31813 100586 -38743
21075 -220895 49781 324003 -124222 154198 -16886 30536 80698 -61248 -213427 -171564 55093
21063 -95914 -78887 26392 -167612 16170 -41978 -198266 164912 -191370 -379328 184142
21052 -159238 30808 -267148 -34489 350789 67605 -58230 115929 -265016 40939 -81863 368532
21040 -191913 -204524 -253413 123175 -344051 -107874 -141542 -125900 -90853 -202906 -1401 156493
21028 -132462 -342054 -434782 -54652 232726 -152354 -147087 95941 261106 224038 -112004 198730
21016 -367310 -300254 -487442 224148 122460 166760 -102998 92203 -233588 -16439 -95224
21006 -95224 108105 89117 316288 457663 210134 426571 -60900 -213457 31461 166388
20996 166388 27744 -20 179492 -231808 -120162 -16592 -14190 29298 -21116 -101096 173397
20984 -136865 -62608 -207874 -211447 173727 -29003 -228422 12641 145209 12234 -282750 -62050
20972 193509 35764 74456 161822 -233271 52176 -19550 73717 -152878 5988 -342982 -103911
20960 -40558 190986 -315642 -285669 14404 -107263 126247 584480 -87175 -152673 67904 -229432
20948 -51600 -52245 -131825 -201946 277080 100549 -3742 176730 417790 152778 242631 616919
20937 616919 177663 131640 -26084 -129009 482 11768 -129330 -303486 -70806 154956 -13952
20925 -196511 36752 -157107 -153874 -81814 -186613 55113 80913 315357 73175 -295718 -231676
20914 -231676 -389286 102623 -94530 -450269 36243 62550 -339091 172492 31290 -58688
20903 -190233 -103144 32145 -75152 -180059 -46016 -288181 -123532 249897 173143 39992 -236055
20891 45435 -212638 -132381 -277075 96981 84274 -217002 -62873 -81058 98784 -221149 241345
20879 -26238 -262158 174978 -39519 -235028 -21474 -103495 -65196 -6677 -63379 -47332 -204827
20868 -204827 -54134 -6407 -174763 -165176 139666 156749 -303793 12106 -211269 -55702 -243433
20857 -243433 94052 -78522 99514 -275005 -267707 68530 -173708 -108660 -274169 -212277 56820
20845 56416 -46873 -251249 138386 -88661 -362735 -81364 98582 -194948 -193209 143573 -251811
20833 -210894 -23734 -438951 34957 -101019 -78349 -433047 204330 -185142 -316392 261769
20822 -498504 -81461 -33785 -47652 -50273 169474 149675 -8486 121610 104903 -113759 74453
20810 -117441 143418 -81852 -249470 82081 -6923 -11673 -20459 149976 6179 -165594 52555
20798 -56479 227335 -57676 57143 134942 -133780 -155632 -296453 -123753 -100287 192707 -115408
20786 84049 184173 -76926 -146881 -9628 -352421 -172847 -27483 -66773 71796 57937 56670
20775 56670 -160411 -51752 18147 -120562 42877 44480 338269 -147936 -454647 223943 -310268
20763 -139197 25544 -264352 -6351 -35944 -129394 110578 118472 67956 -114568 -198904 2911
20751 48145 -51777 -306282 -281821 102575 96816 121505 220495 -164097 -320 -142200 -91816
20740 -91816 377921 31559 11041 176109 -114327 207117 -147840 -237665 -299472 -86295 70042
20728 -85752 138070 159327 -215899 221404 -110966 -46458 -442662 -55243 10922 -263294
20717 -223860 -266316 -244406 -400227 -170615 -348072 134897 94351 -110939 -116474 1340 -202536
20705 -9629 -17914 -86603 -82250 -7700 -165476 -80022 -199653 -84873 149348 -68870 -252085 182361
20692 -151129 -399481 -105212 -236888 -223191 -208038 -58898 -306359 -208836 172358 -99391
20681 -347875 27218 -102335 -103204 -39585 -422802 -194985 -78590 -104937 259092 -169423 104134
20669 295978 33382 -144458 -132659 -158981 -143985 -235494 35818 -338194 86464 -383123 -34480
20657 -93882 -160994 -63747 -115108 71900 -62983 -11023 -42601 -144782 -85835 -97889 257290
20645 14753 -5888 142773 -31422 -219132 -153689 161365 -272228 94522 -182868 -269281 -199376
20634 -199376 -181451 -106992 -523114 -16393 175637 142249 -236519 -42143 -25116 30730 -304137
20622 74867 -48843 -134613 -191025 -222530 205345 -160141 282944 -425054 -149656 22485 -252904
20610 184775 -120260 98879 173148 -304716 -293205 -44452 -202592 -264481 2037 191629 -197236
20598 -60248 -145571 -86294 -114654 4855 -54712 55361 -173875 -356834 234876 -77959 127656
20586 -21269 -223940 44597 -231719 -93545 -11474 -84469 -285255 83997 10775 -70413 -326910
20575 -326910 32636 121165 365319 314768 -239060 -94485 -182962 166813 6856 -234329 11865
20563 482322 -134941 -56314 192864 15329 68371 -284760 70481 -212219 -126967 293541
20552 -298136 153712 -211218 -85623 79704 170665 -103707 175364 232477 106041 -52987
20541 -79946 12912 -340025 184259 124021 95999 -76083 -13573 -458658 365241 -79203 55015
20529 -69456 14942 -208120 126213 262275 -76026 109543 34294 178913 -86397 -23470 -174232
20518 -174232 -193951 -189078 50652 66462 339714 50136 -222462 -103889 103387 16215 -111704
20506 29037 -410417 -314367 -158137 182 -114756 -89723 -158407 -109995 -140513 -282759 56647
20494 -90407 -314209 -414365 -173601 96048 -130981 59007 121240 -472717 -175369 98661
20483 -17294 39342 -281953 -33021 -213119 -105323 10640 -240091 -170908 336335 -50978 -247908
20472 -247908 -248441 -34352 226263 -168287 -248361 150160 -109129 -215311 -153878 185774 -68771
20460 16395 176564 -57418 35476 86313 384839 106263 29815 -145646 201874 -746 -37195
20449 -37195 55532 -160478 -195480 -59216 97616 135244 240875 24856 -30215 -213907 72464
20437 -223022 -138244 82817 -145135 32115 61827 -128908 16472 81566 -26998 -177139 -84479
20425 62302 -243620 -322535 72846 -351035 95587 139238 -49937 83850 -26374 -191862 94814
20413 -275882 -61755 64178 -256149 -56583 -36985 27766 122001 -216484 70648 -157897 220251
20401 -135018 -273811 92630 -250544 -252832 -103220 -257125 -94987 7083 -5443 162547 128896
20390 128896 -124256 -14930 194808 74187 -177410 43323 28156 245144 141549 -157396
20379 -485824 152123 -72821 95156 49458 164312 73858 -208089 -76388 -62078 74915 242177
20368 242177 -199048 -108261 -365948 -69444 -126316 3255 182212 -48785 -314708 20432 13652
20357 13652 -91380 -43963 115788 -297234 -71109 -34259 -307902 103994 333191 -135208
20346 -83275 -232336 145230 -365679 60347 136712 -93141 -64371 -46661 75335 240438 -355429
20334 -267124 -85189 -360536 -210128 14141 -128283 14664 -242232 102359 202870 12677
20323 -10372 -268171 -104438 85560 -132717 -107930 -491736 -248487 -142522 -284727 -93366
20312 -113004 -79059 260079 -333836 185396 161878 71169 -159787 -207755 -42162 -5972 -214148
20301 -214148 -64210 -176903 125392 -248840 -62663 20907 -183897 -189607 -113087 68008 67433
20290 67433 337588 -148374 96404 22338 126793 -391379 -343321 205416 157663 -508897
20279 333158 73719 -127162 239175 -27034 -2568 -142726 -53562 198789 -192089 -86260 -28541
20267 59097 167234 62104 -62506 -431756 -330851 -143796 90128 -64825 237976 -189592
20256 -3782 76918 -58101 -85209 -97847 -369891 -332210 -95534 -203240 -130892 -145189 13953
20244 30573 208186 -110744 -9955 -59874 -436138 56612 195805 118004 185965 -8305 90696
20232 129805 63818 88369 -174334 -130443 -216752 40739 50368 -393190 -210569 34068 -5962
20220 -125587 -215217 -102865 -35273 -146121 -50486 14136 -71546 -198527 104591 -113847
20209 195149 12390 -321586 9307 -161235 -332309 206812 -277760 -114268 -192272 -133356
20199 -133356 124097 374053 -4109 -131158 117702 -39710 69702 -18582 192469 7271 44854
20188 44854 100695 -256379 354044 -217427 -148174 -183870 -127201 -10864 -260451 328635 -57797
20176 -194915 -89103 18870 -188927 52460 145698 -334434 265164 126971 -505082 -14420
20165 -2981 -14569 196714 98281 31804 -153592 -51782 -17751 -43221 209371 376177 64948
20153 -233018 13201 -136171 -386422 238230 -124058 153949 235729 375518 816278 146423
20142 260689 239940 7926 432913 178103 225514 33033 347067 359061 403819 272851 -9244
20130 109411 -22770 -33950 -57181 218429 270633 -171596 -221674 98489 -40466 37800 -221196
20118 33688 152904 -155327 -225116 -25663 53437 187835 172230 -127968 230572 -369264
20107 -107135 -187293 -329781 -107847 -4735 -1606 169759 68266 262010 -154171 -87201 -155151
20096 -155151 -169009 -165426 159144 -265068 -393220 -65876 144296 -18107 96248 -67102 -70994
20085 -70994 245205 -93392 125870 566 -55578 105824 12334 -269474 42897 -122911 -357710
20074 -357710 218725 -416811 -139978 -288053 90462 32661 -21914 524705 -253175 -84035
20063 94711 -206738 -215585 -99135 -124049 124148 -236970 18776 46306 72504 -377339 -232253
20052 -232253 -12475 4249 107868 -126879 -375470 -122421 -269920 276052 -101124 -260283
20042 -260283 -23154 55169 -40576 -51133 -36876 132707 -315971 -100274 -175874 18413 -123555
20030 122717 158798 -195123 149815 79625 -49629 43864 -141042 -126316 -110049 127373 -276230
20018 78079 36239 230246 -237728 76116 57048 8055 331380 156817 -48120 225848 -384636
20006 158159 -39056 -6281 -117641 -119125 -380280 -284153 42510 -41033 102182 10284 109624
19995 109624 8041 534713 -42711 325698 243769 148252 186118 45494 174865 21013 244239
19984 244239 146302 439941 178833 145781 107286 -186766 249517 -194103 -350192 -369620
19974 -369620 85805 104877 -21182 -227959 -194174 53691 -324517 9187 -97270 -350347 110076
19962 165844 193263 186515 211758 -186031 111248 113300 -121032 174980 302223 -2226 304292
19950 424856 -184268 403631 -57958 306150 -168244 -215185 -320725 164147 -75272 -142090
19940 -142090 -127391 331267 72373 200918 -447688 -68409 214392 -162959 -139939 11131
19929 115475 108128 -191197 -362008 -111022 -84772 92537 69176 -348804 -49095 -106538 -18579
19917 -147617 47489 -146969 107215 -68624 -27528 -365723 310521 93950 -10914 -193726
19907 -193726 15281 -21767 -161319 276728 46036 12413 -128984 -357162 140254 -213981
19896 28272 -152788 226630 -190323 150880 147306 130710 -41027 94168 -298746 -341113 10397
19884 85250 -197479 -21985 -207639 -145342 11832 -110826 -174790 5535 -106843 171568 -207701
19872 124920 159618 -8156 68887 -341682 -128450 -340913 -223541 125964 -92287 318330
19861 -144087 -306882 -289999 178778 -98473 106324 -83366 161714 -112458 -264952 -149481
19851 -149481 2507 -161532 66847 -46530 2496 407258 177098 372615 -123870 -556336 -76997
19839 218670 -76539 38751 -191623 164775 -192186 -97373 237008 -264120 -223359 159228
19828 134165 64403 238868 44999 -201052 -38058 188379 78774 -272403 200230 -195627
19817 -192979 -69767 -145246 -175514 85758 -269811 -119176 29981 -49267 -436609 201006 116348
19806 116348 -197080 245632 -79243 54186 43399 -22486 -103374 -209288 -169194 -90935 -119465
19795 -119465 -60531 -417218 341718 84106 -52573 -104081 -66302 125646 193148 157426 -125085
19783 -41392 233594 -45321 -156752 -240270 -394192 -247050 -97235 -69301 161954 -174621
19772 -326355 -174475 8258 84878 -202431 237231 -6223 -153052 -12744 -350120 234760 -57844
19760 -27612 198660 -19812 6172 128408 -262402 104339 17703 -153219 320681 131510
19749 -38156 -300368 -12959 93471 49229 66170 -132977 203812 217911 -202581 50573 -130213
19737 -111465 -86765 74627 -72295 93697 247059 187591 149746 -187884 -24621 143665 527053
19726 527053 452382 186309 -47083 176987 -144784 181194 -113519 -46463 -154235 204587
19715 44601 -191898 229183 39011 -201551 -129357 91462 -66885 -22108 159140 386766 21908
19703 -263708 -33555 -187143 123376 -424137 -7991 418553 154002 243439 79510 612638
19693 612638 238123 274906 212373 -214849 230322 -32550 -387930 -39456 141273 -168838
19682 61664 -133845 -147529 144808 -48875 -36139 -286531 -236666 -27880 228183 -19707 -150954
19671 -150954 379225 -174303 74598 -12880 114674 -115210 -32911 -61292 44429 -111862
19660 181850 -356627 -138766 69914 -198422 -489615 -37017 -61432 -50323 5314 -29628 -260428
19649 -260428 -155614 -325425 164765 -149876 -282726 -158691 150365 -5872 150728 -224622
19638 7768 46863 11062 102430 -177774 -224627 318467 -18393 -193772 140757 18699 -361936
19626 -53818 106646 -123122 -188625 -35907 62397 300641 300727 -431796 -373426 -113252 217477
19614 -127226 290878 -154138 -14132 -55648 -162999 -9863 -317902 -172019 -111170 -114296 -34785
19602 362427 -526707 -534880 349497 -478431 -203159 -23582 5842 162446 -127397 -235369
19592 -235369 -171495 -156891 -148315 -82106 -143134 -154910 -179172 -15388 -223121 -292222 -32848
19580 -92930 153739 70597 -123749 -20230 144366 250737 90704 76683 -109843 -362865
19570 -362865 94935 14347 -245890 64647 -95380 -66877 272876 -316813 -270170 -117293 -234828
19559 -234828 -158270 65298 -238144 -232281 302270 -264382 -62151 -200751 -49878 -40793 318081
19547 -342883 -118563 167380 -81702 130750 -51149 -330859 148008 -164423 -180823 173853
19536 -242507 364256 -98666 -259511 -173977 -198746 200957 -120712 -128999 45821 -20332 135560
19524 110813 75578 -68364 -389675 207667 -133490 -184175 -221237 -219883 -25513 -148798 -117255
19513 -117255 -39614 231606 182082 -215807 -93651 99440 53843 115425 106323 62865 -114839
19501 -101501 -39826 -12367 31612 -126638 -432912 -19294 -68757 86355 -159390 -328987 -261394
19490 -261394 110392 -465094 24682 56079 139639 131026 59659 -291640 105828 88768 -27095
19478 26270 -23789 18367 -199567 -141135 131643 -204768 -306278 48082 -10040 -139040 -187274
19467 -187274 -29093 -57864 -313205 -58076 -156700 154186 -281314 -81012 -70869 88899 -496184
19455 61056 -64718 -193 -114716 -162864 -71078 211887 66207 -89298 -75658 33769 -93449 -39548
19442 -385199 -151580 -270796 -372688 -37133 -21530 -34122 91927 -118138 -394035 -212758
19432 -212758 82822 14708 -97540 -110512 215841 296690 9837 -95618 24526 -19421 -163655
19421 -163655 245876 -80221 115295 104787 -377003 -223803 103174 -35328 91162 -210203
19410 193743 -382845 275194 16063 -283656 -73045 -246439 -181406 189309 -158731 98747
19399 -311585 149342 -309793 121559 59924 -27761 -179518 -63997 -242597 182457 183223 -130684
19387 -286891 -361288 107126 254605 -75138 210539 -89965 -422392 -90060 -42825 -28152 -82396
19376 -82396 -71962 -9300 -117231 -198498 -196468 -60765 -85583 -23193 49468 -271949 35868 315071
19364 315071 75018 -345526 -42982 178376 111158 -147599 -49483 104523 -178845 184462
19353 -44502 -270893 -47809 35316 68956 -39652 -63901 -384905 137848 -342983 -141739 -117226
19342 -117226 -315585 -186669 106239 -15699 -355020 56997 33514 -325847 -469879 65495
19331 -18179 -109165 -55657 -274878 -94108 -288096 -114153 58220 67559 -33916 -30520 -303912
19320 -303912 30755 -68152 -186029 104238 -38160 -96836 -233416 -18958 89058 -534752 -264461
19308 -197152 -257218 -85842 -133328 221916 207226 -504108 -299799 -72948 -173629 -55241 43300
19296 -144065 -129146 50528 136290 2118 -194032 335717 -123154 146788 -69785 -290913 -47132
19284 -257911 -163250 -64243 450077 -284123 37582 -230345 -114055 -181422 46409 -24185 -62677
19273 -62677 -14034 122224 54090 129732 -34222 -61316 37518 8436 25805 -69151 -281033
19262 -281033 -33470 -197679 -159120 -260566 -402653 -156930 158755 83542 -279852 -366218
19252 -366218 -14916 21775 103728 -168359 8047 169588 -246971 -321516 -317703 335483 -199323
19240 77854 26154 -260051 -320672 277929 41096 181221 71788 149164 114382 -71158 43259
19228 13726 -126436 -53748 -219363 42494 -462505 -275834 57109 94284 4319 -104961 -96807
19217 -96807 -79108 160787 145375 -318511 -107055 -302889 -208581 -21430 123114 -101772
19206 45764 -31562 -135714 -77040 -213800 -60552 -108984 105399 110082 -309091 -3692 95689
19194 -127848 159738 -71092 -348067 -120289 106462 -268948 -84708 -203056 157148 -89229
19183 -421017 -98894 28090 -55553 -179750 122774 -79590 -73864 -104009 -147147 216763 -341625
19171 -156897 87056 91712 -299929 -434029 -44215 -107468 -74050 -20240 -72566 -46265 -68449
19160 -68449 238290 -141373 -395211 -122319 150007 -277980 92202 -222785 110150 250263
19150 250263 138243 18421 -163650 -68276 -146829 -297991 -39557 -301856 -117580 94013
19139 -435751 27548 47794 155122 -47173 -376997 -156833 144599 164644 -23868 244681
19128 100758 -21011 4920 -137386 117416 -85696 -41200 -194597 -62307 -70364 325002 -91094
19116 -37284 -260772 -152231 -283315 -121096 321011 67561 8415 104755 -108638 132385
19105 -391089 -15391 -173036 -236034 202574 -140560 129180 43463 77876 27497 13272 61617
19094 61617 71395 74516 92349 -58473 -379241 163486 -210667 -174491 30719 -234229 -6381
19082 -194157 -225101 8084 -291188 190484 16127 -2451 -204111 86957 169258 38555 -132175
19070 187471 -69914 -300289 32636 -201209 -67118 -238868 -369788 -306817 -41572 -49837 -389402
19059 -389402 217393 88366 -313746 -165164 -92343 -93263 -126380 -73088 -2296 -145819 -137075
19048 -137075 -28692 105995 -255792 -211640 84810 -76622 69614 -73828 -25606 -85842 -236551
19037 -236551 97911 26238 62351 216663 -147517 -242564 -99546 50244 12152 -156013 167971
19025 197075 -81693 -46685 131296 -64824 -15158 -257943 -89534 -153095 84362 -269907 105936
19013 221216 294539 -208240 -274240 -300277 -198914 351702 -60812 98591 99734 -372972 47276
19001 -234036 173325 -211025 -234893 -75626 -116563 -42161 -23107 77951 -253640 -89259 -103454
18990 -103454 -92709 -203163 -95331 67001 61268 -134069 -2362 259511 -79702 144492 -194210
18978 -89384 -176117 -5517 102652 -241551 -150149 -22725 -406982 39813 -64333 298991 40850
18966 294157 73191 213364 18332 203623 -231237 173308 57150 -245525 6970 196824
18956 196824 -70217 155173 -245272 -109931 -74814 77329 157392 163939 78646 -165174 -149717
18945 -149717 -396537 -627368 -73176 -89902 -175543 208690 -20161 98648 485 40176 16802
18933 -22338 -29735 -125867 239846 -6851 63772 -300879 -110448 -250948 -71838 -34231 10811
18921 -10047 -82815 245775 135236 -13908 92336 -180347 128567 -139428 246045 -121613
18910 -251378 -50499 -258427 43457 142934 220819 180897 375640 425739 191641 7386 -48074
18898 -41452 -211568 -192401 -134259 25799 -563919 -10339 111758 -279428 7071 -126996 68870
18886 -24227 32013 74770 146657 -45625 -33363 -172996 -327390 -22001 -284227 265473 -101957
18874 -260793 -1919 -21587 -145251 -186962 -90177 -173630 -394289 -241018 -216242 -31927 -87183
18863 -87183 -5726 103711 -186166 44863 56008 172685 -301672 91159 143050 -254486 182671
18851 -225431 -10501 226108 132688 -162133 -59928 -174291 205108 -31563 -198010 -176667
18841 -176667 217550 -112039 100230 -124905 -12330 -126289 -162127 -174122 -170092 -191920 257891
18829 60954 -15401 38990 -208450 152484 182527 -26739 -283436 28448 -147834 -37095 -182746
18818 -182746 219931 -36959 -136033 299465 -63754 -82153 98244 184685 -19015 113541 190016
18807 190016 -125995 218218 522177 382943 -126775 41528 -287638 103112 6674 -313828
18796 79842 -44687 -196661 -370524 -74234 28415 -97604 -255802 -42530 75346 -303837 163951
18784 -91849 -185617 -191552 -35628 234468 -80569 142088 272087 33647 9019 -180558 -115773
18773 -115773 -47055 -263445 -26522 -220671 -248467 123327 -116627 -267373 -244149 -57392
18762 289487 50977 -38505 -151428 -115673 19331 141127 -328344 -232213 66477 37677 -407726
18750 -90834 108899 -171880 -79249 -142379 124787 -297458 -184859 -42881 82654 -306985
18739 32827 194021 33540 -200884 -115402 -120905 68202 -222785 7685 45257 12588 -36859
18727 -139994 131996 -166736 -108959 228652 -96223 -215129 -18683 23392 -34356 150498
18716 59107 -207120 313371 -43335 -39868 32851 127817 38170 -101964 40113 -14391 -309520
18705 -309520 -93534 -262877 -330377 -118517 -88504 -11295 31319 23929 -379818 -73839 -115853
18694 -115853 77762 65594 188887 -15417 249550 -16139 -15791 49911 -156153 -124568 104316
18682 -246997 -209185 39943 -252568 220396 -176763 -99707 -311722 189592 167790 165788 349552
18671 349552 -52899 78992 -233778 16533 59609 40348 92510 -222388 -96751 -304845 -185977
18660 -185977 156330 -299022 -198744 -233933 244250 -71661 -135789 -29651 4194 -98741 -101591
18649 -101591 -111456 56202 -179114 117048 242481 -90197 -61574 542 -176609 -150159 37226
18637 -91528 -30220 1659 12453 30810 -298026 -46566 -91099 -63740 71349 -54637 -224106
18626 -224106 -432027 23063 171998 58046 298116 -43777 113775 56292 -122609 225241
18615 -88439 -150419 140457 -113565 -32152 -192262 -320151 159 -93595 -89422 -9113 72428 -194183
18602 83882 -69456 -211346 -374791 -5372 -121943 108487 22887 -62352 -245378 123197 6648
18590 -239666 303883 31621 -280718 -148256 -87029 -329871 -86537 80551 -204742 -36842
18579 -103650 42187 20079 48928 -45806 -77398 -108167 -79127 27021 144350 -133319 -87881
18568 -87881 89041 -328789 -434405 -206378 -136405 -57814 -161465 -221097 189781 256839 -67821
18556 -310978 61480 -5829 -407020 30414 93715 -206711 -3122 -105663 22787 119455 180687
18545 180687 -232577 173168 -117203 -84425 208905 -187271 -6262 -47566 613 -129435 168821
18533 -56907 221809 -52779 89967 55107 360445 130753 -141676 256185 134219 -130350
18522 -182595 -26855 -100507 -15853 233301 -170961 -132466 46765 -69158 -286982 -54558 -365708
18511 -365708 -173142 -353886 -44128 -228907 70301 -84970 211474 32876 -146401 -49643
18500 25989 126381 -145657 437252 135454 -7333 -22537 27760 62649 94089 -135936 -89913
18489 -89913 -81494 355874 -144098 -220423 -87942 -128449 -125269 -281832 58836 196054 -17104
18477 -259941 -216678 35027 69237 -167856 -198378 -136823 -53509 -39438 -53323 -174291 238400
18465 32733 106977 85137 -82602 -66131 285330 -198323 106843 -420093 54291 9266 130838
18454 130838 -288558 -209302 215675 92005 191158 165424 118530 253001 62017 72371 112409
18443 112409 223632 115205 -124698 236941 -151344 -210289 -428559 -92077 1360 217319
18433 217319 -273881 76460 -4031 -102730 174698 -303886 99877 183951 156129 96881 -141085
18421 -242764 -171935 46818 -100947 -78807 -214271 -21279 384986 188215 -9622 -172007 -125412
18410 -125412 -85528 -7795 53771 312160 -31683 66909 38024 -67693 198847 -161436 -199658
18399 -199658 172837 -51077 -211327 321275 -93474 158633 -257861 -76434 96816 148916
18389 148916 -128612 -37030 168442 309806 -221986 3487 -176998 -32669 103696 -74289
18378 -360537 -383591 30749 -55549 -133605 136243 -320522 -140241 -173631 -124864 -50302 248339
18366 30969 -220149 -7002 188015 45299 115124 -784 -109333 -250086 139423 -314698 -66280
18354 -449 50710 -129621 -82035 -87508 -138114 -286989 25765 234441 9121 -138650 87789 -41341
18341 158092 -220607 -100769 -143655 179248 -139501 -144220 102568 -11203 -330453 131342
18330 127751 -237362 112472 -306573 -21604 -131007 321216 -95686 -109043 312451 -78732
18319 -202106 -37400 167446 78520 -305744 -127115 -90600 49802 -249724 -104418 -286844
18309 -286844 -164161 -29139 16390 -307644 -166363 143318 29512 46924 75726 15790 116585
18298 116585 120251 52863 -164396 46252 89073 -35247 -168211 -230415 -113119 215753 -228100
18286 -236393 90435 32968 -63195 -105702 -89697 88702 215487 65130 48658 -228824 167068
18274 272326 -101594 -2443 -111598 338542 47850 6772 8834 168899 70525 -19603 -2663
18262 170213 -237044 42827 -95066 237974 -301236 -100988 -3625 274479 52782 -17214 282438
18250 -244170 53632 2620 -141490 -144126 188669 -207925 27699 49502 67344 169048 80563
18238 114475 56290 115359 -174602 247844 58774 -164925 -97073 268518 9479 65964 259659
18227 259659 10297 150152 107682 -117385 125934 137703 -93621 -298138 -337491 166668
18216 111588 200829 -196829 61234 -121904 163577 -143670 138885 -115172 -243871 -94401
18205 104175 -8166 34526 -320734 44565 205271 37808 -180501 -75327 -79474 164440 -385883
18193 121341 -273778 255448 -232911 -4697 -154958 -253752 -173148 -52345 215352 -60515 -120084
18182 -120084 -147131 -287759 92684 126358 -8064 23986 -208390 -53256 -295621 -153647 86452
18170 -376247 -14657 -96331 -292090 6678 240129 -6723 37903 179586 44914 -252794 -99674
18158 118281 76163 -210712 -195850 82681 -97185 -22575 161039 430642 -400548 130882
18147 6538 -120835 -180369 -334179 239925 -315038 3873 -130726 -4161 -20532 -295831 200089
18135 -159734 -21053 39669 -183240 -1299 33745 -20802 -164242 -169349 86275 178371 -298431
18123 155905 -2257 94611 265432 -82485 -190568 -118007 100879 -203995 6649 -3840 -77786
18112 -77786 161812 -292136 -207432 -116326 55113 -82970 45580 158377 -80959 190021 99083
18101 99083 -261952 401367 -236341 -20841 -53482 -287101 24912 42349 -164724 -213696 -231668
18090 -231668 -30727 122604 37824 54868 -118817 -167301 17527 63129 165211 246654 61616
18078 -7761 195302 -68208 -283568 182604 -32663 -397841 -13104 140699 143140 363022 -147826
18066 -17635 -127271 36767 243492 114637 -204512 -35334 -3824 -95072 116736 162256 -5748
18054 -107935 40210 14506 313148 -20124 185820 84214 84127 300833 481996 -82312 -106018
18043 -106018 -111172 -70974 137491 171822 108387 119472 219411 -70112 299506 -6513 -199985
18032 -199985 269382 44447 -67534 -241339 202616 86968 -80695 -208872 149393 -15319
18021 -178825 161971 132203 -103597 4642 311710 57759 -397556 187261 6360 156289 -2934
18009 -53901 -137435 -49715 306020 122501 -66853 176664 -372617 -146323 -328659 214739
17998 164331 -293888 -189771 -92590 -2034 -318485 -71486 184043 -114136 -256128 253086
17987 314843 10629 -344054 8675 -10490 -77688 155733 -11510 154645 -310895 106690 -179969
17975 1743 66855 325627 99381 -255596 -3567 -264060 -108790 187066 -225941 86398 -44112
17963 133574 419202 245823 -110442 195314 62722 52124 -68365 74109 -241593 95475
17952 137943 98329 59765 84844 834 214250 -197123 -15242 29228 95441 -26270 -263233
17941 -263233 54913 -4690 34748 323538 -269811 -165759 348081 -60693 -6874 -207998 212005
17929 48502 -13100 297508 -56787 207611 283091 -34428 189545 100620 -149849 -101605 7063
17917 -187186 -95293 389576 -200447 -95369 167723 -34520 -221448 346180 -244988 -115855
17906 256972 168881 -36685 -189130 -46841 117036 396298 164680 204852 -142098 37463
17895 31745 -149006 -273944 213090 119475 -19837 209576 102082 267719 -325276 197214
17884 116065 2472 42477 183584 10465 -307845 -93596 256971 -22859 -15867 324401 -144328
17872 -78471 219568 -94776 -61443 17013 199772 70287 174922 97062 56448 -50010 26138
17860 -127973 -223075 114516 -579408 142220 176625 -171353 -96688 70154 193222 65277
17849 -239302 71138 160069 -297687 104977 -147874 -35741 44917 258493 -16277 27897 -134680
17837 -49337 -37606 -12060 46505 164965 -5065 -111670 307787 273806 97019 180752 139621
17826 139621 -160169 73453 310357 -109358 -147723 112701 -160575 87007 -293414 325667
17815 325154 -14845 214177 61666 -86795 51289 33528 -9980 62912 172340 -69764 -134324
17804 -134324 -61055 1552 -99312 -17259 -1977 273328 -58806 258679 -5011 81315 -64957 27098
17791 -129147 -149279 197669 -49196 -113763 343272 -12829 169582 -148742 459937 -53535
17780 196781 -67532 -64521 -101210 121175 -204357 57044 132369 -288694 -119119 122968 -413837
17768 144725 154535 -302122 -76965 94686 -10913 75788 41786 -182786 -35541 -181215 25291
17756 -69126 254873 -112101 379885 267569 181721 -60220 178720 389865 164160 152109
17746 152109 103006 -367963 -131809 327903 359203 36205 143113 -18283 29345 288492
17736 288492 387817 -66226 36747 131517 196972 116589 148354 436117 -6601 93972 85619 -86939
17723 72955 -3408 160541 -96106 -45082 49003 67299 247995 274179 254008 -85227 266582
17711 -83967 -44779 -120860 -78926 106074 96105 -1955 -334037 57844 -45346 140663 188297
17700 188297 358148 188097 211529 197602 306089 277790 -46087 299728 -115470 157525
17689 352565 102607 146777 106847 -166935 451470 292047 -419287 -309150 214150 -80083
17678 31686 98860 79959 162615 336369 363863 202264 90750 378752 275905 191188 122069
17667 122069 48454 86877 255698 37987 -81130 39018 287256 127066 -5362 98164 555871
17656 555871 -61061 42222 -179556 274141 -239082 20025 183477 300636 124263 141710
17646 141710 99659 174341 324755 73702 287630 349760 111207 75443 36256 228248 158060
17635 158060 221028 157396 163553 189967 -38913 82465 -17133 86796 -302470 -17694 53105
17623 -122257 -64443 -95129 45188 198415 83108 121740 32509 340391 -30582 294728 51109
17611 -66738 36893 -11881 41867 255196 111081 33358 54195 318404 -93281 157330 376271
17600 376271 122115 317374 212881 110890 143570 96573 185069 -34148 289708 218895
17590 218895 126172 71329 236957 457957 126989 69208 -67496 206841 236605 360405
17580 360405 392874 -195992 172613 89759 154887 232181 268431 -192762 207774 112673 -91883
17568 262652 130370 227990 201889 189703 121716 247674 146441 257674 190932 152759 44299
17556 192123 414495 -119564 374264 27820 178856 38174 255671 84930 53459 319208
17546 319208 384839 390278 198634 172864 238223 236029 -41291 109984 138061 17794 122777
17535 122777 -78767 191762 225615 158148 435106 498111 363492 442434 322933 304721 574614
17524 574614 864825 1350568 908025 1244586 855010 750684 426569 627478 321952 108648
17513 248286 347876 679249 204982 363356 807141 1178341 1256799 997936 1293166 689255
17503 689255 882807 138845 401096 658134 256719 490296 317722 397271 51616 65359
17493 65359 405708 395839 157328 479234 334448 284981 144250 366385 231387 263692
17483 263692 442217 174679 -174829 206940 433910 156904 -49913 202696 435899 39531
17472 -19311 780372 67306 261006 203434 247523 131064 343430 326554 -24987 241969 120786
17460 416930 162910 366070 -174284 628525 278557 323428 13291 210150 304188 -69236
17449 159143 344305 752288 451128 516954 451070 246871 444909 585231 196706 407626
17439 407626 350186 -2362 276924 511750 604672 470129 321038 282587 300323 233584 279658
17428 279658 625386 27820 339565 91173 404577 200488 282731 548884 52306 231731
17418 231731 345646 67625 531200 405542 223525 152889 205625 212799 639228 383377
17408 383377 271009 422409 564869 250828 160079 6167 -322904 278763 222034 65206
17397 318383 -59070 357041 335345 90295 408567 347626 267736 207971 378781 463084 420189
17386 420189 480824 328352 329859 447375 605623 207141 494789 360732 179489 569289
17376 569289 400658 222707 245902 132586 213964 61894 133061 -97683 97470 220568 462811
17365 462811 120560 407293 127788 164174 266983 41202 30469 -69292 293808 264064
17355 264064 69145 266421 335739 310568 355267 128619 100608 289470 127940 77055 94408
17344 94408 413690 294039 204325 424729 449806 128661 39998 378497 411795 -74685 169962
17332 231492 -21821 243091 180064 350143 345960 298789 281032 -87809 586367 131422 463062
17321 463062 197214 404970 32237 155193 207314 209759 291117 218930 59026 166195 743845
17310 743845 313198 -57123 95896 72084 381506 102108 339243 272044 372224 330972
17300 330972 411059 368475 522874 188777 186569 205578 418918 334779 411331 374077 -37087
17288 404939 308000 535476 387683 298333 232992 174045 280143 84522 281556 240187 381094
17277 381094 451957 61692 190409 356034 293649 237746 -8558 361099 722067 336344 369915
17266 369915 325619 91129 410561 187050 376897 208875 602817 357497 335276 448159
17256 448159 -45692 378679 407092 260540 390572 444634 377014 314827 467895 162254
17245 248691 503231 390358 459503 65312 534653 182981 605942 332057 587395 393968
17235 393968 586481 755282 515703 240745 477593 501435 178505 138501 156327 392408
17225 392408 433329 372477 339863 537340 -121831 206394 543532 171731 410343 286642
17215 286642 378725 663126 213547 324361 173085 79774 447285 473608 220515 330254
17205 330254 434343 326507 397466 554115 585781 500233 134677 336758 414085 194439
17194 528787 516446 536108 39121 291271 288797 698928 218867 317393 628193 606817 491389
17183 491389 370163 666416 552169 245178 93373 493600 368565 401796 584324 180912
17172 338640 686486 565568 372105 629852 545875 740460 276980 624067 627602 73803
17161 337047 399802 449955 405810 470807 288277 410946 442380 163913 211324 310532 309715
17150 309715 535312 120163 377427 425728 293749 451759 441616 529561 354454 320439
17140 320439 463091 612877 646231 763623 446837 754769 289385 581130 696503 523216
17130 523216 674872 412804 380845 337944 743011 930911 652231 390405 540847 584248
17120 584248 693573 413835 421987 428469 676586 598363 713920 571641 555838 779259 531814
17109 531814 813285 587261 460220 725068 751303 838984 513091 807916 772533 470844
17099 470844 607017 851928 588842 955044 536125 529519 400300 504796 466615 831253
17089 831253 426807 844725 652128 695681 999985 393045 597019 573641 762047 457778
17079 457778 294724 830970 597813 1034275 442576 1008444 396959 497417 637025 754661
17069 754661 997360 450558 537632 544740 981131 841564 1232167 921216 768289 790402
17059 790402 992479 812041 1194072 892023 644672 605716 767320 735343 1113220 908145
17049 908145 819153 906229 927048 1015954 1277725 656526 570630 886540 1377037 881322
17039 881322 902923 1185002 762934 672011 669507 940072 610147 1307620 750998 903790
17029 903790 843170 873070 992955 1054204 862547 925902 929475 897089 1121441 1007052 1173213
17018 1173213 942835 978627 824701 914521 1094281 1259097 1184433 1048228 1219990 1046119
17008 1046119 920513 1001037 1083548 1346128 1091729 1118629 1200254 1123508 1202534 1074295
16998 1074295 1270687 1181361 1321612 769540 1414540 1114529 1104208 1231969 1178252 1531625
16988 1531625 1352921 1213193 1032841 1271414 1332822 1013875 1332398 1434283 1191182 1239153
16978 1239153 1200170 1455814 1168010 1279098 1566239 1242100 1344753 1077014 1364329 1199151
16968 1199151 1180309 1192602 1623263 1279716 1352693 1508992 1639664 1264457 1691003 1381638
16958 1381638 1600972 1599364 1536329 1871383 1405994 1654969 1514015 1802503 1689318 1791551
16948 1791551 1512911 1938069 1801697 1608034 1360481 1505645 1516828 1423367 1620825 1689744
16938 1689744 1840206 2142483 2112068 1617828 1888933 1809195 1881288 1871215 2333240 1766154
16928 1766154 1975225 2165010 1975646 2266701 2157306 2015605 2099729 2090293 2376086 2135996
16918 2135996 2301767 1986635 2188530 2372550 2235127 1968246 2089615 2490625 2330882
16909 2330882 2543155 2409235 2400635 2299066 2242277 2365948 2398182 2620890 2754234 2541368
16899 2541368 2855511 2837488 2438587 2503344 2766228 3167833 2942960 3064561 2891177 2678085
16889 2678085 2995017 3034143 3150678 2847493 2813331 2934290 3354214 3364654 3194325 3143263
16879 3143263 3414236 3111298 3012578 3617797 3369173 3578018 3651915 3712490 3409142 3679866
16869 3679866 4312612 4005530 3982722 3717946 3891549 3850110 4095396 4139005 4152133 4337668
16859 4337668 4290106 4327566 4700223 4229162 4241715 4702604 4724485 4754858 4508507 4772083
16849 4772083 5016870 5092950 4931711 5144853 5080225 5495422 5247001 5723206 5539455 5671617
16839 5671617 5758503 5908528 5698498 5918810 6266392 6030869 6413552 6311216 6626458 6639463
16829 6639463 6500043 6789595 7038299 7340630 7231755 7218265 7503489 7694373 7549855 7742890
16819 7742890 8185302 8268270 7974051 8167915 8741924 8447318 9093896 9360167 9265268 9448554
16809 9448554 9867765 9994266 10306670 10324901 10838296 10574985 10703412 11377443 11416718 11813492
16799 11813492 11776243 12179317 12543742 12420271 12559834 13403796 13949513 14039307 14318314 14381621
16789 14381621 15389763 15679912 16147318 16206770 16875932 17008238 17542628 17832179 18597620
16780 18597620 18906513 19445397 20293107 20857047 21564254 21978720 22669003 23421445 23942561
16771 23942561 24615058 25684149 26456531 27084866 28317808 29162128 29956792 30814112 31976914
16762 31976914 33160346 33957153 35496125 36722235 37728637 39338816 41150198 41995214
16754 41995214 43940518 45294572 46621596 48841857 50789287 52487501 54506435 56743516
16746 56743516 58567615 61257865 63478802 66052562 68511743 70924979 73768776 76213243
16738 76213243 79434535 81948161 84946606 88027243 91056705 94105104 97005118 99857619
16730 99857619 102614090 105329253 108261813 110626471 113083230 115168540 117028733 118635967
16722 118635967 120068313 121071040 121548318 122454382 122531216 122064878 121311760 120097520 118995844
16713 118995844 117316202 115265469 113223492 110995063 108448856 105533627 103153505 99956529
16705 99956529 97242820 94086461 91248569 88345981 85227829 82116486 79336792 76564979
16697 76564979 73595077 70839606 67978287 65941846 63110978 60922332 58329003 56334800
16689 56334800 54056915 52269560 50222206 48784986 46369274 44939634 43520925 41749371
16681 41749371 40188968 38854227 37595634 36210263 35023052 33498470 32665765 31378327
16673 31378327 30579440 29674425 28378031 27489891 27192038 25904056 24896627 24580919 23844791
16664 23844791 23055371 22559160 21555915 21320892 20192957 20114887 19043181 18886019 18281547
16655 18281547 17642997 17242947 16725003 16790483 15906254 15520896 15218846 14780920 14101256
16646 14101256 14155739 13700169 13241982 12916811 12351326 12558622 12156651 11861752 11548526
16637 11548526 10827720 11402595 10665726 10521607 10099362 10237579 9856116 9457693 9517342
16628 9517342 9204425 9003951 8782783 8581916 8700754 8249056 8336035 7856849 7853762 7873676
16618 7873676 7763608 7247100 7355724 7323457 7013968 6656702 6900286 6593850 6195844 6286290
16608 6286290 5921471 5960251 5713063 5928174 6098697 5786142 5805345 5532484 5556410 5326035
16598 5326035 5589792 5013652 5318021 5154966 5080470 5158564 5107186 4596532 4742654 4976050
16588 4976050 4615384 4354308 4394685 4205498 4176757 4182359 3970257 4279289 3988918 3978862
16578 3978862 4118830 3937158 3766057 4024004 3574661 3608380 3837719 3473301 3473925 3238563
16568 3238563 3412482 3467205 3446672 3239344 3331236 3302762 3267237 2894585 3136311 3123093
16558 3123093 3269589 2747941 2762923 2978959 2715902 2843493 2905486 2854545 2979035 2798981
16548 2798981 2618643 3148452 2313001 2524436 2305656 2539464 2541762 2228981 2451880 2444578
16538 2444578 2814829 2290723 2300587 2294537 2224463 2426504 2112472 2087031 2039012 2053884 2034172
16527 2034172 1978814 2032495 1943045 2262070 1781923 2053591 1996211 1938718 2094700 1893869
16517 1893869 2067999 1849505 1774666 1608283 1678134 1778167 1747354 1917436 1576842 1603441
16507 1603441 1626902 1441694 1726840 1765799 1746228 1664427 1843960 1269785 1477250 1487740
16497 1487740 1885325 1286853 1598976 1449772 1481268 1488692 1446165 1743031 1616188 1433784
16487 1433784 1577443 1592764 1432979 1475347 1153137 1384887 1504018 1484926 1566273 1425410
16477 1425410 1285371 1319752 910923 1076027 1000628 1478288 1210132 1245390 834872 1087992
16467 1087992 1214072 1257586 1030611 1052248 851683 1105333 1266208 841535 1316447 1086066
16457 1086066 1060765 860182 1031919 1337008 1161076 885780 1108615 947295 957201 664705
16447 664705 815624 1142239 1119562 1261793 1186565 996465 1054978 1130461 1169518 932978
16437 932978 789826 1089540 1001316 891997 800618 668740 762328 901496 827461 686055
16427 686055 990542 1112974 854540 904351 748659 804015 642822 843969 575734 471439
16417 471439 639095 773860 640453 725059 514912 589518 628970 511790 1048709 921759
16407 921759 585841 867303 926476 628567 616305 613434 583410 634800 704979 786723 670014
16396 670014 686991 601920 718602 631141 691767 668938 746725 625273 838814 463176 827852
16385 827852 757528 302017 723528 680454 572182 441072 479632 610197 617114 820065
16375 820065 518385 355202 845304 834762 295836 343918 696056 553221 134568 632131
16365 632131 568377 623924 721205 531502 808496 368051 460820 658261 489329 427110
16355 427110 197422 632097 420871 876651 511348 615622 717719 436664 508564 524444
16345 524444 629390 645194 358029 583351 454473 368215 662571 159091 469519 194311
16334 252887 396893 319289 437353 477131 176429 311226 283179 196322 471122 677774
16324 677774 400137 655056 421580 302286 338970 571015 158158 465671 414217 76112
16313 248567 296991 594963 290498 454845 536132 160749 374481 269901 326752 525004
16303 525004 158474 208316 342227 424320 120361 380231 132938 287453 329780 41592
16292 359358 537037 603334 383903 280576 223408 290657 362127 301575 245904 389338 -65413
16280 469452 289905 153917 494148 440057 579922 332322 141992 21062 -42290 66223
16269 82329 345249 567335 347699 267247 256091 140333 348848 7476 300227 -42680 392377
16257 497677 189528 213626 211414 394211 565291 249200 189274 138158 195648 31234 558579
16246 558579 253348 274247 58570 490016 -124598 434242 212404 -38531 459964 164838
16235 314736 263809 536430 168225 303575 396231 448257 39577 614537 294900 128003
16224 465246 368439 -17831 335824 457007 278621 269497 358488 625684 255882 252803 408305
16213 408305 359393 -240328 196756 140178 219687 112779 172190 133614 135305 135433 52912
16201 285202 200011 180187 126227 52014 36730 435690 192957 255347 337798 267505 267769
16190 267769 394338 -679 383512 133642 23651 268455 176671 184333 325072 93925 609494
16179 609494 -110602 282102 18382 328353 276138 123454 -34442 356608 180297 244484
16169 244484 315372 29358 348274 380897 214175 223493 34205 339856 -81960 275896 -114357
16157 -203603 -45740 -153650 182034 85574 172728 13159 18553 197734 357488 57257 -125559
16145 572603 254954 353934 -185781 24756 -135024 29919 -88842 261751 -41901 -151487
16135 -151487 62128 -91141 -38987 95143 156633 376373 254890 490653 152161 214719 187566
16124 187566 -17257 173485 126886 -78808 76305 345334 473203 -57715 6844 64842 113763
16113 113763 -70204 291671 438464 38521 51781 -115813 249635 264058 95983 7001 21394
16102 21394 64744 45020 -288192 -184234 -418163 513651 -67467 193436 -73602 66839 176946
16091 176946 -3312 54940 339083 -87670 -88914 -418909 128155 106064 -8056 79649 256787
16080 256787 -300725 155967 221017 144747 -21673 254824 154847 211180 156681 -248141 30509
16068 47703 -158125 -251036 -28770 -89574 184375 340647 37487 95895 -96838 212253 -160978
16056 116702 -79415 196924 27895 178049 -118237 456354 129241 -1373 151639 117107
16046 117107 157881 -169953 9029 55469 -66519 -353494 -183406 115291 485310 -55324 107357
16034 -302906 275290 58398 325693 -57372 119911 160361 -6794 -49086 275748 2689 -44432
16022 82076 7452 -93178 -11730 -81166 41746 21739 -21985 -172953 -83536 368052 113517
16010 -69466 149699 -98322 52464 -198232 77069 36605 267995 -137201 -33339 121974 143432
15999 143432 -50225 63645 -92017 240952 109502 35332 31058 128259 17012 357307 42377
15987 317863 405532 938987 813614 1168929 1046509 819723 717574 421876 114876 -155780
15976 175989 -131209 -51460 127891 480810 62945 -157637 -155377 51987 297818 75771 -43408
15964 86687 -218617 35210 150288 -90599 46695 -299992 234262 31584 -326264 166817
15953 283324 259497 -25039 271040 92628 -74058 353891 -100136 -13503 8197 -39688 -28325
15942 -28325 -202302 113646 -17600 29085 -62291 -194279 -272729 115787 -130077 30266 -251925
15930 -305157 135434 -162218 -120786 135470 -361432 118963 -197750 -132407 29303 -9990
15919 54665 -50083 79154 15391 16496 274953 232277 5262 -86777 -28783 93011 63854 -29316
15906 128091 12739 -231577 153904 12072 137392 113873 -34154 -4831 -254904 284303 -172286
15894 -171995 -144820 34774 -34693 161227 384305 95825 -141235 23833 -158047 -277553
15884 -277553 -185692 -761 94707 55958 220049 171600 322018 -198100 -69404 -25966 -111356
15873 -111356 -66027 -55629 -179331 -47224 34612 10868 -267636 358316 -81258 154298 355271
15862 355271 -60895 -203453 -36187 260365 2942 -355656 308373 60201 334797 101634
15851 -34597 -439133 253405 7858 -115781 -17441 -239875 234297 -70036 -178625 33565 66185
15840 66185 -197137 761 -68741 104364 -86889 -199279 351108 -75861 -49334 265023 268361
15829 268361 58946 276499 -43832 277986 -7971 -85298 7180 -46967 102561 -10415 40616
15817 10655 -248062 -21318 -6591 -68698 208710 -17474 169754 -340533 -38624 -211701 -2477
15805 -35605 -171531 -81054 -110376 -233877 -292649 291557 62759 -190857 255189 26092 -214185
15793 106140 22739 69303 -44738 14869 -30648 -191642 -22727 164964 39496 140712 44313
15781 93407 -94818 -398353 -420591 -49525 -56403 133354 272748 -75964 -1610 16135 -217695
15769 64405 -94125 -154429 168070 -216054 79863 -138951 19383 -172322 -123444 -140956 98376
15757 -47804 364767 -148924 -255429 94444 -348820 -81530 -197328 -255209 -7973 104905 33926
15745 -320492 264010 -11095 117087 -4377 375407 526406 -79312 -202226 -7589 -44731 -124739
15734 -124739 -2058 -206187 -125581 -160643 -97668 -152839 -134194 184492 -191229 -61174 207969
15722 -4910 -122047 -59030 -51903 20495 -230919 -90196 9781 -592377 -270738 -168910 -6507
15710 321754 314979 88795 -44738 -7280 -57501 224737 61005 75707 -211795 8119 -59613 -106034
15698 -106034 -31875 -139553 -54225 311723 -187543 -2177 -336104 -132131 280117 128176
15687 334599 95423 -69145 -68800 79324 -225197 -273562 1324 -149304 -11095 -158260 -214591
15676 -214591 -1581 -116318 -118101 144687 128119 321794 -158852 -344907 -192097 79559 198485
15665 198485 36178 128946 12165 519286 -204245 292146 -270875 100222 187015 -205859
15654 -43311 -347447 167285 155645 -168897 57898 -73929 26656 111352 -217745 322134 34861
15642 -8410 -149172 47522 4217 -188170 -121 -188681 -99789 -176817 42456 -341935 -220755
15631 -220755 -132908 -250003 21793 92234 49281 408162 224668 -49650 76128 459101 39194
15619 99315 164324 257943 -259331 81200 -94594 -148261 -20783 279410 -110098 -162221 -35568
15607 18826 -163379 132753 -21821 -347841 -194563 69289 -13452 -13187 -557 -112115 87545
15595 -85972 -133945 56953 27427 114990 66856 -113821 -70304 -73231 -152889 -299684 -295402 -64021
15582 197514 81639 -84330 -135460 -265809 92054 -25341 -37865 74152 -186116 -157647 -138995
15571 -138995 -44935 92148 29952 -236593 203444 112938 50447 -154588 137163 117325 329730
15560 329730 -123601 231474 -34750 52283 72555 93811 266766 -83034 187954 147485 -299429
15548 -11036 -50789 148831 -91254 4629 265604 -99275 260646 369241 148040 170434 231477
15537 231477 -224458 271417 -19338 141153 -38830 120236 -210690 -95116 128914 162149
15527 162149 -112269 76686 -1145 145462 377 179259 -83227 246307 15530 355114 310019
15516 310019 177186 134036 111320 411883 180859 -167127 -143162 -90376 -26936 158053
15505 259299 330162 20577 -122964 289146 297039 -135798 35167 13468 134874 -142203 80709
15493 39001 226761 -195607 101333 -104299 277454 33959 -11984 117567 119908 -12092 -26845
15482 -26845 -43091 153965 8370 45674 -127530 223350 588367 523994 512002 1007257 679499
15471 679499 749726 113055 91041 141665 215421 414781 -63285 40306 -86679 -158620 134424
15459 -74889 -161746 4135 487911 -212209 -38970 92445 -57422 580214 -38538 213234 18972
15447 -22020 45100 258977 197616 411856 816754 874476 1139996 1424522 1208734 885581
15437 885581 365829 441481 280699 -214108 90966 27455 532084 41634 -237415 97547
15426 198462 192793 63634 255657 84245 237223 111719 -57558 59344 28302 46608 99650
15415 99650 -79417 -243497 -376427 172994 246285 -361528 91395 -60764 155999 198266 131561
15404 131561 -82261 -208903 177385 -82731 -205539 118355 -165250 -42294 68124 -115051
15393 45461 -387764 -65702 -59155 -59675 -14102 -95161 -85080 241792 109170 4670 -39419 149770
15380 -26129 -15343 -136088 139051 86455 198472 -186759 313813 232790 322778 289968 73886
15368 84456 89568 282359 142255 -76400 -308726 222359 372022 132204 131587 329227 131703
15356 560259 673508 275260 144910 187409 140713 379580 163207 171831 106182 -156335
15345 374104 396631 130412 324997 606944 264601 373033 836719 345610 193776 537917
15335 537917 200594 354171 -132264 422124 -73338 443585 92636 77744 112109 42730
15324 -62328 402228 60524 84129 144239 -186187 -20413 56356 -206811 -230392 530230 53738
15312 303729 -69306 135550 552101 445196 255234 -18026 56048 -102269 204967 226602
15302 226602 296529 318571 351868 -73523 79493 276285 -37570 -83617 -50851 -102987 -233120
15291 -233120 68293 -87730 -20443 57334 -43971 32109 -12335 -226588 -69687 295688 97427
15279 -112360 255568 463466 -148600 -266932 18018 -55957 -4003 73547 -165781 300221
15268 -444080 -132756 206224 153356 38721 278428 18467 311251 217643 -109353 291816
15257 -111910 411792 -144396 -84171 -320416 160185 175569 -129843 -143952 -202860 -10612
15246 480432 529113 89046 220406 767262 1250535 1935200 1380377 1859105 1217724 249920
15235 393251 5739 290545 238041 -8194 -25553 16483 138848 160715 55865 316279 7268
15223 -113773 -35177 -251641 177057 102013 236267 101795 208428 -23080 166912 31979
15212 -40406 8817 -53415 204761 -74755 113106 19477 125867 -147901 147470 260737 174432
15201 174432 228120 -83414 -148746 -127304 -53490 39796 -31295 105729 142471 136594 247635
15190 247635 85873 87903 -54586 -2591 -100788 1741 214309 -47300 190640 449818 192659
15178 -156335 -133902 -112342 -34660 40945 -156269 6028 -14439 76139 -141756 -171927 -13291
15166 113347 189755 -273998 192777 135491 -24653 199120 33194 -203196 225892 62444
15155 -9588 157793 -166025 -117106 -190857 70368 -214296 132830 -98004 -8122 305898 209923
15144 209923 -9399 -5787 161047 -99701 328061 247286 -142741 -108471 -36086 -27000 34825
15132 -170989 -189277 -76200 -254922 89191 27437 404156 191257 638942 58677 339431
15122 339431 286770 428208 426092 266340 178021 311591 635992 195048 286543 -48844 -29017
15111 -29017 87500 -68116 82854 105971 224973 67273 -76019 2300 85883 226764 278641
15100 278641 280726 106718 340202 -682 410557 35910 -53267 -185974 325129 221076 199285
15089 199285 136411 162365 395743 68308 71451 41447 386756 223715 172261 3146 313327
15078 313327 521657 95715 460672 178205 -38870 128035 -36974 339271 188818 275775
15068 275775 31702 -11484 371735 284281 189503 355693 182904 174778 211945 83272 349940
15057 349940 -167572 581824 283285 214199 388010 42997 235088 124353 315258 471721
15047 471721 279380 441274 459284 229257 317486 347899 96879 368637 521609 142182
15036 386543 262606 303369 378268 -9670 163842 420874 800119 650065 1151858 672778
15026 672778 571074 717720 648524 363703 558587 322420 405535 489100 809425 130191
15015 617308 719853 500777 480581 666835 114761 426681 414609 945423 418817 595724
15005 595724 369751 494363 327212 699072 313060 632847 537377 555368 696744 484529
14995 484529 457195 161347 209545 185759 558292 468787 269962 606984 606621 430959 577276
14984 577276 608830 511221 645571 883774 1065141 1247499 970475 585749 746848 490538
14974 490538 393217 785322 786747 260309 571146 515357 1076211 459640 653432 69128
14963 884754 90366 184379 242141 203730 221721 -87667 100293 145211 211115 226067 387916
14952 387916 425412 678474 447403 530240 193533 95796 166802 493819 514857 501888 864092
14941 864092 735654 526035 501281 484295 419386 697665 504099 403026 759854 437797
14931 437797 961180 959550 1317947 1205971 1308436 1495788 1601910 1921368 1875310 2102121
14921 2102121 1400025 1797128 1512861 1866510 2420468 2835579 2938195 2346377 2126875
14912 2126875 1498699 1059637 1353139 1005116 1035869 844275 514581 431322 241426 623977
14902 623977 485872 341869 391172 411787 748436 429736 539118 210663 589497 174698
14891 539922 467293 518565 330037 286153 768545 813421 794078 616252 1375297 608941
14880 420177 783000 1106302 950752 814557 893078 473070 722394 746714 336507 367093
14870 367093 401895 705425 534195 458094 638964 731572 759264 754284 814250 569587 610861
14859 610861 444359 205645 196920 498495 545296 217155 550364 365752 485836 508801
14849 508801 525230 617422 486656 583415 758827 950312 899106 660342 1239413 1224267
14839 1224267 1089652 1131479 1139616 1279190 843733 886553 807352 571969 666160 658883 721482
14828 721482 517837 755175 533263 335090 434896 509420 555580 743723 153573 924091
14818 924091 651579 898060 953954 440445 899289 552529 655162 715580 563220 311768
14808 311768 858517 321603 807149 1117300 803163 1217822 1054966 821327 829568 342546
14797 542642 594156 561030 572565 590122 732712 701337 750123 680242 948532 543648 448404
14786 448404 438793 792448 610279 643820 645553 535234 439918 841532 731924 1030651 973682
14775 973682 633202 696799 791532 695558 813689 594062 596046 599144 823369 647684 748223
14764 748223 596478 620239 712551 314736 457123 779562 497121 466785 742766 486068
14754 486068 513611 589423 661587 385380 506581 437861 856621 552046 672694 599614
14744 599614 824279 597542 656642 810129 813126 107767 467114 506498 538088 710833
14734 710833 659869 671067 798206 812670 917706 877220 1548798 1289632 1774018 1980557
14724 1980557 2177320 2036759 1514334 964151 1113932 1198468 811726 991869 844297 808517
14714 808517 606380 885644 864476 731844 897602 1078033 854300 795005 834102 972781
14704 972781 1328758 1218183 984277 1511660 2023647 2207787 1783735 2259625 1587067 1403300
14694 1403300 775394 1211172 931112 1053232 1051288 888133 593238 703133 1045431 1140598
14684 1140598 819125 838223 776810 1070520 1363522 1154109 873902 886092 982024 558360
14674 558360 678234 834373 828302 981034 681106 990326 931367 712608 1225460 788198
14664 788198 896622 955763 857989 765688 800539 954141 960139 1219349 1057665 640632 906662
14653 906662 654233 1366613 1211174 1256039 1472273 1274260 1170673 1199158 1230333 935036
14643 935036 1432160 1050644 874651 1276420 1160355 1042943 1184472 1111393 1254829 1057909
14633 1057909 1162727 1087779 1014630 1165804 1153319 1105099 1044834 1305137 1291126 1252741 1367192
14622 1367192 1304082 1299491 852152 1250871 1346568 1173754 1185121 1391597 1428877 1716425
14612 1716425 1249952 1183971 1374011 1403445 1289066 1354472 1484208 1461845 1381995 1388316 1416560
14601 1416560 1725814 1593532 1230313 1397256 1428236 1524940 1856281 1371433 1620039 1435015
14591 1435015 1706836 1639072 1691896 1694258 1674667 1505185 1786086 1676655 1536888 1435104
14581 1435104 1597440 1354592 1559960 1381941 1748766 2018293 1836243 1665357 1883966
14572 1883966 1936145 1753756 1744446 1838404 1965082 2392712 2011798 2316309 2034000 2179760
14562 2179760 2124779 2432415 2430571 2185715 2375949 2585633 2752333 2906474 3089436 3216047
14552 3216047 3393337 4023061 4660156 6002216 8713757 15634122 30741983 48886844
14544 48886844 27249246 9821430 4396441 2866139 2458174 2701750 3830437 5363835
14536 5363835 3673581 1909383 1991306 1506115 1847864 1920697 2073084 2131728 1963067 1950370
14526 1950370 2184214 1964977 2053461 2098312 2380978 2224310 1985934 1973361 2440583 2322108
14516 2322108 2304165 2502242 2413509 2643029 2079377 2569650 2492290 2202341 2602069 2341681
14506 2341681 2592297 2600506 2395274 2589268 2506381 2357999 2537847 2701019 2893247 3162277
14496 3162277 2986356 2836573 2957031 3172550 2961620 3011287 3134946 3211666 3037498 3026287
14486 3026287 3186901 3418181 3097483 3084141 3247701 3372922 3371405 3431788 3341855 3490346
14476 3490346 3738913 3679598 3531357 3688662 3389447 3819698 3683235 3714604 4029197 4085424
14466 4085424 4144382 4397722 4152446 4163648 4368519 4464737 4596405 4116764 4172874 4339265
14456 4339265 4536478 4249523 4748607 4630152 4848048 4770142 4928445 4883788 4641708 4667103
14446 4667103 5030829 5257725 5054983 5050753 5336177 5432581 5336227 5718149 5602371 5800215
14436 5800215 5936471 5804094 6200100 5920256 5883961 6111323 6065275 6185304 6186004 6550866
14426 6550866 6700341 6695419 6498825 7076363 7193747 7002754 7420052 7534848 7933219 7719847
14416 7719847 8071825 7872311 7568995 8114121 7969872 8258456 8429460 8343464 8532709 8270962
14406 8270962 8952654 9233976 9118105 9319556 9563485 9515625 9398648 9895087 9814806 10047344
14396 10047344 9710038 10111079 10255933 10391050 10629139 10688969 10797083 11199888 11679610
14387 11679610 11694314 11558005 11977633 12263567 12804798 12832084 12981696 13479156 13670944 14286028
14377 14286028 13973629 14284005 14112527 15085113 14864029 15488749 15653344 16379055 16309292
14368 16309292 16484766 17059308 17580405 17948615 18490495 18608113 18836763 19155042 19355974
14359 19355974 19745831 20076097 20770621 21045301 21978071 22052498 22586773 23286190 23613836
14350 23613836 24440832 24877096 25658602 25775320 26764910 27496172 27872998 28940231 29962316
14341 29962316 30560559 31099108 32296013 33265668 33591912 34790030 35925391 37021565 38190147
14332 38190147 39304299 40435267 41764919 43132436 44473657 46099185 47658051 48832269
14324 48832269 50665511 52648264 54235561 56548149 58848582 60905062 63143425 65241238
14316 65241238 67204830 70213801 73147446 76105025 79086538 82570690 85587469 89362401
14308 89362401 93081738 97758494 102093672 106786007 111869374 117350627 122965280 129156096
14300 129156096 135278610 142489910 149530873 157304152 165383368 174100698 183076764 193133065
14292 193133065 203673588 214816424 226656300 239033230 252154891 266096957 280241824
14285 280241824 295502236 311080423 327145731 343610759 360300080 376963230 393473857
14278 393473857 409493731 424994173 438798455 451403923 462237639 469550779 473013202
14271 473013202 472981002 470873069 470520956 469537822 465737660 459261859 449151964 437029336
14263 437029336 423938911 408692146 392194940 375484587 358400221 341865624 324885898
14256 324885898 308596194 292956940 277433778 263071621 249144518 235807265 223181166
14249 223181166 211562232 201363466 191890760 181832457 172281315 164059690 156183381
14242 156183381 148605688 140935734 134493278 127879026 122060413 116920773 112148125 106560813
14234 106560813 101810197 97798786 93322299 90329614 86621285 83184724 79754801 76345195
14226 76345195 73693626 70968927 68447672 65791793 63194629 61310792 59273912 56973951
14218 56973951 55317325 53556645 51541288 50037711 48361596 47315503 45384063 43690028
14210 43690028 42512899 41137706 40365871 39381089 38492227 37245934 36161467 35026359
14202 35026359 34045417 33270979 32446107 31768845 30774178 29391216 28800647 28455848 27534781
14193 27534781 27052223 26353360 25515547 24925622 24632096 23542462 23012356 22765598 22156807
14184 22156807 21794184 21198140 20623152 20076339 19825882 19391113 19036355 18334565 18261965
14175 18261965 17856504 17405461 17274064 16754017 16453730 15734067 15610068 15698424 15032438
14166 15032438 14944530 14377945 14497058 14117627 13650794 13710878 13568427 13112576 12944325 12800389
14156 12800389 12279982 12327448 11948968 11637043 11562609 11469145 11133563 11096155 10659925 10735566
14146 10735566 10527028 10300511 10260161 10029154 9556275 9927830 9541398 9456081 9182406 9051630
14136 9051630 8849926 8613295 8821424 8804939 8269320 8640879 8186526 8105185 8108859 7998717
14126 7998717 7713498 7611266 7788413 7344593 7256120 7406313 7355179 6978964 7103385 6793866
14116 6793866 7033133 6911968 6423979 6613344 6522391 6140186 6580731 6473379 6205982 5741737
14106 5741737 5926977 6013429 6189673 5870566 5750459 5561374 5953805 5396228 5410738 5117497
14096 5117497 5427009 4948323 5090672 4839499 4983946 4854421 4947239 4925833 5244586 4833852
14086 4833852 4790234 4591083 4843643 4467597 4726850 4744254 3921751 4508315 4214906 4664312
14076 4664312 4176888 4366908 3899724 4071388 3863856 4326219 4025401 3798724 4049460
14067 4049460 4182868 3952723 4111952 3756820 3575864 3822097 3822017 3777709 3667398 3691866
14057 3691866 3596007 3849291 3837787 3290868 3376995 3572828 3304493 2890620 3464146 3138461
14047 3138461 3302524 3406634 2902710 3125239 2861988 3316342 2886564 3188958 3295796
14038 3295796 2628157 2956797 2774982 2751414 3198304 2787076 3073115 2852261 3120788 2623105
14028 2623105 2728625 3219472 2638793 2747988 2554337 2466838 2125400 2508034 2476528 2309681
14018 2309681 2285933 2743132 2492835 2206371 2310311 1793496 2387700 2445561 2225375 2332311
14008 2332311 2245990 2401781 1869162 2308516 2340031 1833730 1955735 1948214 2374620 1966493
13998 1966493 1857367 2019063 1996870 1673468 2093908 2028152 1913932 2247702 2416164 2888064
13988 2888064 4883955 9245189 22349964 46012588 35070474 16409981 8836153 5985542
13980 5985542 4229791 3687874 3625633 3188431 3090513 2674269 2467654 2372069 2503311 2181847
13970 2181847 2436681 2088391 2286748 2366109 2357076 2009742 2299654 1867572 2138725 2192561
13960 2192561 1674005 2027712 1878157 2096670 1791993 1886460 1620876 1828103 1894416 1885030
13950 1885030 1777863 1896350 1621841 1723249 1438445 1915592 1539902 1521278 1826246 1765847
13940 1765847 1458057 1602986 1577260 1739185 1647627 1723152 1384036 1225859 1338834 1495316
13930 1495316 1456420 1508040 1181440 1349458 1396544 1238848 1139967 1421744 1266919 1442784
13920 1442784 1504484 1461077 1744277 1368167 1374271 1683506 1242845 1440111 1343959 1030229
13910 1030229 1276723 1595076 1320954 1268307 1174052 735227 1206650 1398506 1513710 1018865
13900 1018865 1015259 1388548 1355956 1225922 1356516 1215687 985318 949569 1241245 1338343
13890 1338343 1290365 1311819 1087971 1204469 1159865 1228311 1025224 1458611 1403683 1453460
13880 1453460 1217059 1118267 933061 726763 1494552 792932 1045453 1273589 1169694 1073686
13870 1073686 757566 1145936 775137 798231 1019718 714549 1162095 962768 998891 840996
13860 840996 804962 1081593 1148074 699751 1115008 902244 1065603 690664 1124076 1027152
13850 1027152 845261 735609 979898 919354 1004451 931034 550056 621970 877048 661606
13840 661606 772027 1054759 988362 1057911 811244 803417 993987 518178 804955 833146
13830 833146 1115412 702687 634734 902108 628391 997942 822577 631337 857395 1060022
13820 1060022 723563 690930 837990 715609 576683 839517 667016 800875 640672 938374
13810 938374 789317 1121160 734016 698737 973120 989876 653136 555470 932281 689509
13800 689509 660426 452333 537233 606832 486416 639467 367550 765630 591179 594220
13790 594220 280730 471750 598507 651405 457730 740579 533362 910147 864188 925507
13780 925507 713185 682352 754357 817294 755980 823790 535327 455180 704548 756863 659574
13769 659574 579208 422983 575923 475289 673565 769363 362903 393738 830496 535528
13759 535528 983537 712951 548514 308560 483412 867579 803427 385464 140464 737025
13749 737025 480683 609876 542527 489036 684659 432297 546454 821953 609071 562832
13739 562832 468397 594100 694774 438136 398228 691978 403645 766059 499539 207521
13728 467335 385463 554361 826040 340253 645362 605668 159574 568989 391970 270264
13718 270264 580653 335118 279371 665167 1056542 370057 246995 286657 513268 579395
13708 579395 351437 550416 539810 493476 594599 491452 615794 278226 495879 443699
13698 443699 304211 264762 308276 634305 94590 693410 441837 642975 263930 287263
13688 287263 547040 378251 592850 489794 305562 568125 631397 636310 186935 378495
13678 378495 516053 290053 429361 132570 323580 391337 346088 84211 150501 436891
13668 436891 89527 397059 289259 233147 468307 439028 -6830 125725 619238 296548
13657 218220 235740 600618 130415 406478 793701 206374 841210 33365 548912 328316
13647 328316 595677 675344 256378 589338 433815 420189 491826 648697 151263 330916
13637 330916 696046 206436 573695 418752 169134 347185 505650 216228 479511 105722
13626 182171 441359 296124 598085 536760 201197 447222 466992 354738 89636 136391
13616 136391 393959 117619 487844 281350 274776 324687 222417 19609 603511 305950
13606 305950 443965 288104 455948 554526 578080 150880 722109 292480 364053 267709
13596 267709 224822 331095 604198 247701 131917 169468 169272 417973 255969 367812
13586 367812 191940 379227 103632 163802 164515 392108 391723 632117 451691 234532 462453
13575 462453 260743 221719 189891 309137 261309 381759 219653 367660 472502 337202
13565 337202 101503 189712 389196 107039 484454 275228 222351 -145434 177568 524013
13555 524013 158054 128978 273762 165706 155275 154352 242955 406247 375143 416383 324978
13544 324978 356704 -53337 121687 285808 313722 290848 89010 401623 389806 263115 248392
13533 248392 129858 201187 -49622 352266 -73080 225915 306533 416626 -61024 211237
13522 259040 163435 317428 242040 220561 41169 360124 273984 421491 226286 22660 17526
13511 17526 172653 235811 198102 6004 11047 480002 346651 233307 377507 351745 387
13499 118269 78616 119886 390387 337392 216170 291188 120568 250412 298905 267247 339867
13488 339867 258877 356982 100439 399682 308172 295033 116182 303533 162999 103592
13478 103592 131751 123854 -135912 104441 30407 -14912 -114933 519860 103561 7295 371294
13467 371294 183447 -148368 541625 -185836 116056 58239 345370 -202326 239718 27262
13456 33211 213698 305806 21726 214692 468593 32317 186511 95397 358433 -164740
13445 412208 168423 147745 332757 221303 144160 102042 173678 67261 61339 296791 205092
13434 205092 21647 353432 521114 85319 54069 68803 140160 415870 231209 80485 158464
13423 158464 -218967 290341 230067 -227880 226866 358334 231592 213525 -36127 269578
13412 257858 287484 381351 232609 56100 352252 -81387 -57572 209342 211362 276410 242563
13401 242563 176259 10947 489993 440944 -31262 -371792 578758 88260 346734 351846 -105479
13389 -72235 30256 259001 147768 192274 -92578 434019 178477 -13461 102728 272684
13379 272684 110357 79303 -74167 385666 75242 270278 37744 284069 236356 104905
13368 354671 465375 196732 86201 320411 119077 109449 22172 171917 -39040 281321
13357 401995 87762 327692 121455 30946 252206 117845 286013 187402 89987 364108
13347 364108 289264 44570 27086 242123 531570 356590 849980 337008 469469 248378
13337 248378 151107 445589 320150 209316 176572 340469 458764 143322 490507 102481
13326 159903 356865 198257 -30594 16052 41936 200570 114337 120238 52981 304127 372802
13315 372802 180304 157806 369297 205559 112880 430206 379600 1589 398016 -27664 162071
13303 384754 -147842 15684 -146190 16944 309861 178580 80514 25313 -19474 1155 44237
13292 44237 331346 -65425 -76920 165388 -62720 96130 162219 -29414 164136 -799 310588
13280 157850 220726 134429 -90799 -229961 52914 -85142 24452 -68554 217812 99920 479853
13269 479853 -98697 -125090 -83744 -6884 92130 40623 83028 -24859 -35298 57580 157468 -4460
13256 200328 -106026 204824 69878 -15096 -48185 -332187 -150357 212209 296980 105343
13245 203768 -351701 97240 404874 -11418 314520 -118601 32951 -26607 38946 -61069 -106530
13234 -106530 221942 -79352 51869 25551 341496 363169 -279 39407 88364 -9456 514212
13222 159200 -86234 -65071 264355 63192 -69881 245462 345644 -66600 240852 -58065 41318
13210 201880 74993 318649 39691 -1135 216902 163067 71833 241787 28834 300535 -167657
13198 40103 207572 -176025 -21180 -319077 39370 109204 -85600 -254128 78915 262288 -43222
13186 87206 -9460 97033 179437 54088 128328 -77167 -18286 103550 3031 273303 436849
13175 436849 -88625 104539 401619 230363 9508 -151918 -72160 55128 104773 -295039 -200324
13164 -200324 2631 119047 45327 247820 -56572 -80366 -67630 75689 399535 10569 254217
13153 254217 -164528 328063 -10236 -48488 280271 118126 119819 236345 -69487 399670
13142 55636 260226 154713 95457 186800 212421 96395 315881 -83901 -80123 111837 149075
13131 149075 -85553 57653 -218754 -103355 115927 267723 100228 119210 84345 200603
13121 200603 51915 -27942 349624 294647 109394 -221787 -103621 305771 385278 232876
13111 232876 225913 88991 110118 199376 47013 80863 220129 -200660 144392 114512 193308
13100 193308 20671 -467833 -87103 -42431 -74638 217752 15818 -74752 -186900 85134 -169814
13088 21847 -41768 -202472 161590 -66720 -105965 7166 163141 307783 32183 34531 -206807
13076 52882 68664 -24426 -273388 153972 -145366 -133554 -29935 49528 -41897 -104162 304723
13064 26472 292879 136647 -338395 113081 -285516 115552 236457 228368 -16700 -3315 -16055
13053 -16055 177326 -49997 113232 278494 -466558 173998 81059 108578 261449 142296
13043 142296 -36066 -61782 54885 -130643 215456 3013 -259565 -218695 22328 112676 86416
13032 86416 200816 -116030 201610 54795 -94617 -152498 -148377 -135651 147531 66042 -33113
13020 349922 316632 75163 156876 -48877 -76395 -88297 45994 73831 133228 362007 65837
13008 358070 470959 324242 290358 62421 178065 -335114 -36471 871 96359 -110564 -12131
12996 98099 29073 -60090 379776 145472 -62697 50515 289017 -106116 -204908 -99519 103496
12984 244371 244823 -16285 -149681 -20135 442386 110469 62415 -220138 -95769 -22819 156210
12972 -205170 124497 123255 -100214 23960 13311 114041 -225757 -186456 67402 -58962 268020
12960 100024 257064 -241054 -48054 94802 -227408 -268960 212131 175799 -30555 -37577 -212017
12949 -212017 -8858 100735 -2367 207939 12965 -150302 47539 136919 313181 -346600 282390
12937 303689 43107 -125233 3716 233546 -141350 -47670 400512 86394 90934 225617 186191
12926 186191 56283 49055 -172998 -208790 56811 -164057 -135350 -82812 -207837 46854 184923
12915 184923 -343155 -27483 26033 40449 -25294 19707 -95063 -20777 124842 17101 16940
12904 16940 -133875 66927 102217 -29303 -12341 126012 -105588 -152548 -193759 -9346 -96548
12893 -96548 224795 -226503 120101 -202509 6305 -71583 -299546 -37320 -196608 -44913 -170488
12882 -170488 44941 292111 -115821 205183 142580 -175147 -164485 -54173 -29667 -118105 -193721
12871 -193721 -6364 -120473 63466 -22410 205103 -29634 118759 183836 39325 -278985 121985
12859 53775 189047 -58395 -94614 60179 -288869 200899 -301242 -143465 -280879 -75759
12848 37546 75735 -218814 -104166 -57886 -83961 3349 275419 228546 342139 156811 89701
12837 89701 -68410 -63685 -80541 -192773 -46578 117738 92485 154427 -215988 -150143 -267360
12826 -267360 -53440 -42494 -61237 -79610 118100 -108056 129462 124794 41231 212049 120501
12815 120501 -213479 88713 -109397 36106 27095 11069 -96642 79787 -30569 98249 -36558
12803 -125783 -108913 30609 -197469 -104002 -162508 234496 69476 -133808 288165 483070
12793 483070 -7873 -230383 -153366 -213896 -43613 307425 183955 -58657 69859 -39812 143145
12781 442193 -53176 -85904 -20508 -109445 44014 -22031 133759 -149391 -148956 154293 -92402
12769 -35257 31349 6811 270166 -66625 -168989 -19781 31635 205635 -327858 61092 231405
12758 231405 395214 279365 -200594 117432 8265 -218013 -116474 -127072 -429249 -19790
12747 55961 -58792 -122548 -99252 -88006 -11557 -251208 -301768 275622 365621 361679 215434
12736 215434 7036 126762 -47820 22219 -133047 5083 -119503 -39122 23385 -236090 144623
12724 197532 155273 -384601 166100 -220798 -235554 147144 32926 98467 -121109 -265935
12714 -265935 136005 17047 129557 145524 -75938 -268850 12849 221618 54694 731056
12704 731056 -113947 -11129 -65033 486473 -148239 220314 132178 44900 57841 172118
12694 172118 -6744 -236919 -102144 -7622 -491000 30525 230287 -162390 105094 331176
12684 331176 164950 -204085 -129518 355592 -241551 -95711 136326 276548 -153669 123401
12673 158793 279268 -5473 193542 -36911 -175276 -34269 186667 154084 116175 350318 -23436
12661 -246531 -8657 96103 218734 97105 74485 159948 -98507 60299 -77534 231128 -78309
12649 194758 475288 114830 -100538 142704 149379 -202656 -185862 -159779 -286756 290661
12638 132589 36420 82277 -273333 -15611 -113467 -121918 -23881 -52276 -102296 -159140 -96205
12627 -96205 148675 295481 44091 368998 -22683 -424083 215794 -48295 -127038 83643 -18891
12615 -184459 -161763 -161050 36006 180703 -167408 -68701 -254326 116466 281641 247442 419384
12604 419384 104538 -223545 -94130 269601 -91102 -96682 281102 229460 110069 79896 -14314
12592 9754 -94817 -89930 -26878 -181823 154938 -272933 78145 -99146 -355650 -246504 63512
12580 -82435 -375184 -284232 32816 313951 84628 -35251 339755 -97791 -88608 320553 64080
12568 2633 21635 174826 64760 45826 -71489 230678 -14230 134293 99532 225571 -237526
12556 -152029 131742 155221 180155 -227203 861 -280482 -119750 12919 327425 -43472 -116840
12545 -116840 7096 214258 -97740 185636 -115077 117531 -341344 -132743 -188632 -80953
12534 -271590 -236554 45277 4197 -122992 -108310 148293 -183320 -118922 -286755 260396 86398
12522 307719 462949 91689 -52501 196740 -62381 -329877 -104180 -123054 -120633 -18925 221258
12510 88814 -317953 -234302 128571 -173692 182493 56543 75596 170702 13607 -25004 -32798
12499 -32798 -154916 -1996 275440 6317 -135239 213553 235938 79494 73940 280846 -223329
12487 274296 -29685 233650 -284943 -190800 102457 56690 -318020 -28254 79243 200736
12477 200736 -31964 50476 366831 114155 -89633 144293 -37189 -302919 -164329 339853
12466 -322989 -2978 -62043 191581 24076 25612 11762 -177159 180486 60935 -14447 -180046
12455 -180046 -123439 -31291 24704 -75309 16218 -188951 226613 -270239 -309309 39614 -40142
12443 -22440 20178 -185928 37716 350948 280746 -287785 -28949 79028 218502 32900 169187
12432 169187 -32122 241612 -127809 393397 51845 290059 29545 236642 -26229 73576
12421 33298 -82626 -75864 51955 220013 -224013 -286687 -130868 -79706 9606 119815 103944
12410 103944 -85277 108970 265456 -82889 85206 -12314 210523 327327 116628 320098
12400 320098 -222393 -184116 -52000 200936 -234606 -236810 -3650 127357 -12244 -260075 2179
12388 121874 -36469 -216908 -226922 37360 -167127 385987 -216179 -78725 155501 321429
12378 321429 166181 -2299 147657 -81209 -167117 -212324 -44905 90685 231206 155958 -67204
12366 -33528 -137566 -10871 69641 116002 -87386 38919 -95778 -60533 -199244 300309 98172
12354 51383 29849 -18196 -7796 50362 -9871 45438 -128148 -80708 228905 245764 129986
12343 129986 -54665 -84698 333058 69537 155905 -175145 -147428 247875 85326 117976 218453
12332 218453 138008 126394 -64853 243539 -84637 441115 340508 223975 43016 -238986
12321 382066 525491 30488 -43021 213567 390743 105965 215865 131358 128170 -296900
12310 61077 -265079 356240 -120126 241012 -82222 37500 148391 203248 135477 178210 -183163
12298 8350 5302 -208467 238816 192769 134832 40961 352891 -190905 165335 16169 254592
12287 254592 -152470 196906 27613 -70977 165420 -53546 280476 -183486 -250236 -18015
12276 17918 230486 194021 -42328 142464 269087 283457 8776 97621 3808 148664 209808
12265 209808 120640 -126578 60490 140742 75414 146853 107561 230788 254146 -268838 383131
12253 142718 126077 -158491 255757 -123158 -194711 -305024 241504 79204 6513 243837
12243 243837 103008 60563 251853 -394 176685 -178043 -77983 118881 -31740 -205265 225134
12231 -335831 151513 -246925 141824 -58010 80392 -122266 60395 33913 158534 -144801
12220 231107 -102700 356896 283960 325031 -26670 172787 301384 476199 93576 430611
12210 430611 185516 48166 296165 29544 74134 418071 177 242013 -38192 -16686 -14828
12199 -14828 26112 182298 328540 156379 33551 57245 220852 261572 104681 440949
12189 440949 84790 88706 180553 168489 392178 323775 248264 335294 -23719 73108 480036
12178 480036 -178098 398439 158067 463388 348317 308426 141094 241039 8692 449499
12168 449499 310113 454499 423462 191223 -35592 -47835 8830 -86065 170017 -68082 27841
12156 -45170 165018 39836 217249 18792 -102707 113887 63379 -62406 223791 93316 447236
12145 447236 468808 -23193 205553 603494 341126 267533 220709 276710 267186 25543 38265
12134 38265 -511061 23980 -133566 311404 198949 209002 -202844 234672 199167 -232552
12123 252531 269428 212643 -100584 -21415 247064 30805 179612 15856 -90020 -163504 275169
12111 131692 346635 270618 181478 79327 301021 105397 64367 9311 354443 217637 46945
12099 -75145 482210 108540 -153137 -211037 125293 343981 -14134 220359 55408 93301
12089 93301 -273703 -55986 -432924 -35153 304958 -97528 17760 -114640 224718 -90040 179729
12077 -250303 29458 -103327 43274 404248 68202 167607 108202 284658 -258862 140096
12066 168283 137875 101811 -134448 -107895 28652 -7553 178225 -81563 116501 38129 -46751
12054 338322 10031 324139 146725 235040 -22729 137262 68301 -43750 -5830 59367 148089
12043 148089 -67218 -53723 -92942 -240045 -11516 263537 -49192 -14071 137375 -313451 190542
12031 141755 223048 57161 172976 255897 62377 -28506 -319760 51664 110277 16452 -129259
12019 3461 13888 -193289 26749 185553 -103659 -169922 80453 -395901 -206232 -125335 347338
12007 211623 116837 134463 243975 -159284 88011 -23967 84474 329910 -113799 -225300
11997 -225300 -162671 -216398 96215 -158114 107416 181319 -210501 -176279 -6805 -239798 -265837
11986 -265837 -4781 46788 77769 -218116 -73355 71189 89228 15425 -154312 -170235 7911
11974 -115421 -19096 251821 -11625 -20362 -150411 -320807 17879 -347945 165400 195823 440124
11963 440124 -193786 9264 -136800 93688 6187 -255534 -240445 195739 -57749 -45540 -217825
11952 -217825 135776 58951 224937 85522 -11828 45613 -96211 -119764 23716 -121161 -135519
11941 -135519 62369 51640 -127348 -228337 396868 -172464 -87006 -22550 -417046 179781
11930 -258080 14455 174359 -162307 -56402 -439636 213073 -317244 2729 -28655 249584
11919 -379738 12386 -269467 -261265 -19762 -191396 -322809 96727 -188444 173121 -139700
11908 327671 170547 35259 697 -14035 -214444 79785 269077 -29877 -358612 122888 181923
11897 181923 -274871 159071 -150520 -19411 159274 -90766 -123239 -111650 168201 -125872
11886 -318663 -438314 74762 76632 178871 -28255 -26494 -145856 -44973 -185640 60730 162696
11875 162696 -241898 -160637 270530 -21467 118011 -72214 -151934 -21120 120383 214703 122586
11864 122586 -55024 -119780 -128316 -221681 -170944 -81569 -185608 -112815 -5595 -57390 -260931
11853 -260931 -162594 -87773 -121276 -56322 -198586 -314398 -156836 -46232 -203961 9738 114992
11842 114992 108402 -97956 -357014 -10027 303230 -161983 -78480 20075 58671 -397853 65490
11830 -85829 -117371 -6821 13927 -192637 98789 -58979 -130912 92081 -29469 -46198 182956
11818 33307 -195360 -85156 -128601 -69800 529684 -159672 -43444 -225993 144919 108663 123636
11807 123636 69678 17980 -65617 -133313 -98093 139207 -113152 -23172 -242852 140801 192775
11796 192775 -19345 -152723 -68052 98895 89271 227854 47348 -226268 -293128 -250599 -309972
11785 -309972 -329839 204787 268562 -65980 -126845 -140401 265402 45348 -64578 -92972 284612
11773 -113798 -6520 5596 81065 -155221 25025 -173187 543000 -73396 -137504 -228178 42586
11761 -73558 137518 100222 -273443 5194 -99071 134637 -237432 -197899 160111 261952 -43742
11749 93562 -144913 -90363 69523 128331 127072 -39424 34251 -324748 238384 -29973 165259
11737 -17644 292750 -122983 140611 -117430 -300739 33941 -62337 -13490 28967 183474
11727 183474 409092 264004 -193011 8919 167756 -115754 -369043 -164582 225705 173030
11717 173030 -58059 -30256 127107 105492 -261842 118703 -211078 -162830 321 -117226 -26908
11705 6037 4768 -69751 -188842 122633 -24482 -195701 202092 79848 14844 -26635 80281
11693 -133520 -137819 -112724 302777 -316348 17988 -112583 13802 118392 289662 22566 135899
11682 135899 -115901 403626 -52031 -126648 366829 4217 151155 230707 -25097 -123848 165921
11670 -83595 -95947 252739 -168684 -62717 -237404 41010 -37845 243515 -64687 -148600 -202524
11659 -202524 -177069 89841 -83065 24703 -111601 -25151 -121516 -275734 521 163721 188804
11648 188804 11954 -355453 -217295 -90948 -339849 -75348 131574 -236791 57207 -141579
11637 30636 -205806 98139 -17393 61254 32516 -167424 109613 -82166 273036 -169 -118842
11626 -118842 108501 -193794 -25047 234661 359003 26021 109921 -302169 474433 333771
11616 333771 -58556 -146531 -138501 -36035 131448 -173935 57656 -269937 166585 -250393 179542
11604 -1873 291780 -164120 -110121 -42738 20871 -128909 140463 -135945 395112 116287
11593 488398 -78114 22394 383927 -29268 39264 128876 -111832 231006 683 99068 26559
11581 162707 296156 82969 -109207 119820 26379 -60481 -180214 14957 -91092 310842
11570 -53459 56954 108186 293430 184965 -61231 194041 40799 169156 250681 3523 71131
11559 71131 -216661 -212944 131911 17494 279068 -103585 317252 -147823 -231960 148716
11548 -150380 -174551 -269453 -144082 -58961 -40831 -4957 -83515 104421 80648 -20509 144034
11536 17103 -65968 -259202 -22909 178978 -26472 249938 63745 -52664 243719 99317 -28215
11524 -89784 -47456 118269 32723 -27156 300086 -282652 -103788 79514 268617 93942 299322
11513 299322 198320 376539 -63585 -18709 150933 96283 289399 164462 268173 -31743
11502 -264093 121431 -63754 75321 -181000 78228 191288 -2822 111420 210281 230910 -13578
11490 -253309 -37722 218155 103418 220274 177472 113320 178156 -109141 48142 -100013
11479 55454 179508 -145693 75977 228451 1295 317456 34608 187707 81394 434095 -82995
11467 -117617 46684 3381 564540 66325 135632 -40986 -70022 276774 206860 353069 -46695
11455 155426 -100877 366202 -129533 -93525 217153 -21454 -121593 -99540 8970 293300
11445 293300 -20133 142745 -26284 227575 144474 31175 377960 225876 -146032 6223 290792
11434 290792 113162 -10252 252556 -71169 -195389 277485 184106 67639 -112914 62611
11423 -109404 -100878 85636 -181291 -238586 3566 10289 -56415 133641 141840 -73556 -2429 -82088
11411 -82088 278696 271972 -37018 154154 -163398 150395 173469 -192275 135983 -168785
11400 207147 -287587 -138230 -2330 -138396 -387646 191676 -265477 -146960 -17885 -146945
11390 -146945 -334971 -48931 -43553 197257 -25111 -214293 46717 172220 120600 -355860 -261323
11379 -261323 -101049 -178586 -329711 38626 -133096 332812 21888 -185212 95134 147144
11369 147144 292011 -27527 -29006 27567 -194499 121031 263098 -278848 -344840 -16848 471041
11357 71579 100111 -41802 -154355 64871 -35907 -206614 -4129 64199 -362589 -45937 -107698
11346 -107698 -353659 150836 141554 -69001 -17680 -282421 -96965 146968 1953 -69182 87643
11334 -102664 -68017 -199105 -59354 10945 127283 -133206 -42118 -144075 30391 127792 88121
11323 88121 276511 -386882 -67365 -30453 196187 -47333 -56115 -156482 92514 -113991 -1806
11311 -267375 17294 -32792 105631 -99222 -131651 48877 -34537 -326177 -359479 114032 -65252
11299 331288 95590 -214524 -74464 43653 2651 -101298 -93501 -6366 -78630 348151 -44684
11287 188865 -108109 -264026 379469 -340088 -107259 -248328 17229 188324 -546561 69166
11276 -107838 109119 -160086 58115 -14711 193333 59314 166749 40787 -6467 -279841 -428147
11265 -428147 -126485 -147348 -201938 121942 117235 82404 115953 -163848 -57565 -121972 212910
11253 33868 -300714 -15551 -102741 -11324 -85478 273839 6042 -204843 -38212 -95702 -51110
11242 -51110 278323 -11806 145139 -57134 157484 178631 -4532 153456 -97561 -51529 -111826
11231 -111826 -44897 -166244 32876 -203769 69096 -253252 172603 -48107 -279995 -195967
11221 -195967 136908 -108100 49622 -49023 -119148 -150169 303718 75501 227676 -499207
11210 -58542 -261820 -347090 -288957 -303935 74601 -22064 -226822 -58917 -127519 -87201 -105209
11199 -105209 -140629 149327 25421 -214591 51101 -212679 -268654 23229 -88802 29660 191491
11188 191491 -143721 -458483 -1702 -388732 -141362 45280 -38876 -8214 241565 -87697 -71619
11177 -71619 198837 -44775 204933 -104967 25751 299292 25860 -223410 -25337 -129903
11167 -129903 -54389 277670 -114893 -77226 145847 24402 108516 -44109 -314665 -154013
11156 105342 -104647 -112861 34178 164396 -5981 -61306 -220019 -145379 -26494 -221556 263649
11144 -1988 13077 104230 23390 -183215 -32576 52450 356350 286144 91640 -100169 102375
11132 198467 309818 -8923 -290453 182919 192242 -279022 -78225 -127584 145777 42817 -64513
11120 362225 -37120 43017 -195616 86009 46813 490452 301924 -79703 160880 -111376
11109 -158515 -24267 102439 -115835 -96453 148533 -27005 23644 -252886 264098 -12849
11098 -10826 321323 92998 -25157 381994 155466 108885 311216 164494 472152 643899
11088 643899 20618 111896 -19903 334897 219428 223705 31163 141245 179879 420229 297770
11077 297770 495545 415470 7309 284691 488972 349476 318104 98404 279550 39405 384534
11066 384534 65564 10687 24751 213240 621436 599891 325062 554493 498993 551336 573548
11055 573548 874118 736539 361122 710423 866709 620586 579493 823247 623329 645667
11045 645667 847703 1059842 712561 723264 1111647 808264 709542 719526 746557 737474 789600
11034 789600 553827 542263 526215 807127 342295 570879 522333 714917 968159 892919
11024 892919 842138 681139 736968 658529 657975 836239 835771 662767 725303 812486 455834
11013 455834 558072 356102 782558 298859 557893 673300 615328 545626 674845 653222
11003 653222 662047 598384 839760 738237 904878 639953 844729 255371 800664 421641
10993 421641 348345 676465 657706 574325 679738 594826 671714 901188 699751 803071
10983 803071 724944 980781 925427 913603 792410 1292534 976129 1522033 1380158 1535349
10973 1535349 1752869 1800552 1838610 2419024 2327634 2899263 2489999 2556362 3049157 2733985
10963 2733985 2654416 2612333 2284702 1928551 1619796 1719682 1244445 1279727 1331438 1574402
10953 1574402 1457835 1199164 1601528 1375154 1142231 758127 1051935 814595 449793
10944 449793 344404 589537 409062 -10002 122228 -5234 -121313 -135410 86630 -122598
10933 105650 199761 88125 -2230 159991 7570 367804 121486 353787 192158 -120914 77642
10921 -68783 -104835 326486 147888 -147578 262468 -113033 408469 146859 -73069 -122361
10911 -122361 148245 -133875 127298 300924 7542 -52633 372792 32353 -210237 -164389
10901 -164389 -16228 91451 -83395 309045 126081 173851 98371 62474 -77903 -108971 50840
10889 72343 153814 -193518 290193 -446998 -60443 -208013 -56480 104167 36062 12823 55487
10878 55487 -68127 180045 -192639 101806 -158652 -199865 -202552 -45989 -58290 -26496 107843
10866 21922 98605 190937 -36871 -191170 -115439 -53468 211521 134019 -141919 -102844 67165
10854 52383 13873 -108868 137234 -261314 -32982 -173355 -153449 -296893 -128830 -168549
10844 -168549 -77887 -198643 -118742 -122770 192863 -391816 103056 -27195 -93549 -440997 274267
10832 -267910 -132974 -74398 -258090 -152679 -19315 -279224 -76390 -251382 -191889 -131598
10822 -131598 290241 -290147 -46662 -200025 -180233 477052 9772 78265 -119541 175871
10811 -331929 8957 -6817 153533 -187501 -317260 285818 -292185 -18071 -273411 236383
10800 297711 -96378 79962 -83165 -3504 -51261 -144213 420409 -40562 -287703 -260952 237341
10788 -131124 -145997 67836 -167362 -130173 106700 -24197 26695 160353 -414610 -108454
10777 353560 202234 -161097 -127197 13736 256512 -232899 94722 -236883 -60822 77064
10766 -119915 265999 126809 89095 -142092 -245194 -38514 -220515 -163256 127397 100541
10756 100541 -136726 -314606 31895 -297410 -238680 -349809 -367362 -176595 218232 256646
10746 256646 137728 -60367 12538 168841 79781 66781 135441 45996 58023 -53747 -184405
10735 -184405 -6864 9043 202836 80504 -55562 -90622 -37637 -259380 44465 -148880 -482870
10724 -482870 103638 31452 127313 159421 244387 -91158 -118219 -109340 -124690 -211116 -41936
10712 -32825 233680 325572 18712 -241938 28529 -230334 -239585 -220427 208059 -294279 -337062
10701 -337062 -224186 193431 69015 -157925 -137872 74664 8009 -53738 -317714 -27787 12746
10689 -291828 -77099 -248194 189596 -306128 -371915 -249742 -50355 139167 347093 -154864
10678 -491482 205589 -187935 34025 -222189 -53254 -105201 -11420 137716 -107791 6554 131983
10667 131983 -143113 465867 -124215 -452861 203659 -217578 -48742 196996 -96931 20677
10656 -49187 -10305 -83629 -440356 -126791 -347599 -6580 -114263 108704 -43275 -4202 -79429
10645 -79429 -151999 -61680 15122 -429318 -218438 15628 -281719 -87527 103227 -62096 -265770
10634 -265770 51159 55429 -346751 82147 34773 152772 -211405 96322 -217399 -56558 -210690
10623 -210690 -54816 -116469 -9816 63090 100850 -10933 128027 -269380 -250024 -51396 -139135
10612 -139135 231912 -86976 -10358 -128596 211621 -79706 2145 -27796 -183856 79662 -181609
10600 -24144 301700 22354 -97767 -144300 24584 145263 51737 -26995 -288633 -201838 118460
10588 180852 299967 289889 67368 51741 189936 -274479 -30986 -381420 -324024 -144875
10577 -41009 -50795 72056 -48345 -119075 317893 -364786 -187557 -57639 -203331 64855 -214952
10565 -62027 -287353 9536 -200459 -44661 104250 117494 -9026 -57477 -115274 -299995 -20269
10553 -202435 -36923 206735 101733 -366878 166046 -285720 53747 -97168 -120589 149883
10542 280256 -140561 -48673 48657 135092 -34088 134288 31458 -158953 6573 96468 -76502
10530 -139179 151233 -242915 112436 -29561 -125053 8982 4735 81059 72767 -43471 -227874
10519 -227874 23242 87208 -71582 -39419 -161593 -37105 19434 -287788 55326 -22198 -284639
10508 -284639 204218 -68530 -131450 -277704 -110761 130426 -52166 95638 -2412 -112805 -218768
10497 -218768 -44724 -209154 -146033 -143117 -172739 110164 -84439 -51932 174001 -157036 -126267
10486 -126267 111674 240573 -161122 -332359 -156938 -48536 1465 103933 -16152 -57873
10476 -57873 61196 167426 581394 176515 255080 378344 297313 93805 252531 118773
10465 -47112 -205304 249250 25269 153995 -6249 -9361 -203940 424 -11971 -191549 4660 -95040
10452 -4485 154729 -69029 -157001 175258 150488 135820 -155763 -132792 91316 -66553 52416
10440 40889 -151641 -121336 -23181 415735 -172042 -144809 213221 112474 -27347 -21121 106779
10428 -216790 -285991 -255137 -24633 74114 -78704 -291238 -379314 -138010 -200586 -270128 -55572
10416 -287885 -233506 -175340 57290 234677 -9838 266002 -109091 30952 -132858 -162103 -304930
10405 -304930 210391 -206190 -114108 63176 66908 183482 -277760 291861 35863 12332 -54413
10393 -51153 -227869 200483 -88173 -177243 109927 -45821 67086 108787 72501 -159587 240999
10381 -41857 104802 69214 -48599 67248 107812 -47549 235142 297709 -40165 216555 420935
10370 420935 128683 162541 118363 225591 218833 315993 586770 326301 345018 392246 417870
10359 417870 616901 345568 153096 95047 131519 149594 525456 94978 64878 204158
10349 204158 383319 435847 847604 696662 218371 292879 366170 105804 234444 200894
10339 200894 303905 245052 355415 232737 -50226 220673 246693 -19385 154265 252404
10329 252404 288087 -149108 -224249 -34176 -46792 -312555 -6487 -79817 171134 63797 301928
10318 301928 156018 164554 207372 254341 7933 67883 355544 4775 63324 -98234 -4651 -92451
10306 -92451 124014 253814 -64182 -112943 45266 218024 34831 -20393 218663 -64208 -78474
10295 -78474 85296 -111834 -177211 373397 -30353 -247571 -10703 -391193 -109782 36140 186
10283 -236004 -12582 -238911 -135227 944 -151273 37861 54817 115462 -88746 -177870 -47703
10271 -41931 -139993 -95509 91465 19210 -24841 32141 338703 -119409 178750 160573 44679
10259 17354 190664 175028 75931 -142244 104169 303141 30305 -35616 52608 421826 293799
10248 293799 91511 68805 -54331 -78755 123933 -200722 3699 -170500 82857 62914 288338
10237 288338 225837 -71198 -248996 -133229 -167510 -24169 206167 -128924 21130 137078
10227 137078 -88390 -111274 -94244 -22110 96980 -46596 -89892 -327789 3194 -250534 -150629
10216 -150629 37280 7721 -234388 207348 -130627 -245219 -195044 -194571 -189273 287870 102356
10204 -214028 -151155 -41949 135889 -362081 159806 -368141 -12617 105695 -240015 -443207
10194 -443207 -254258 -299569 -8593 -67615 63073 -40409 -3453 -264001 -34268 23582 49806
10183 49806 -119039 -17114 -204403 -382003 48870 -212591 -153910 30520 -338293 145560
10172 -59583 -28590 -91902 -116456 -152001 162432 -293564 75768 74018 -344196 -243299 -461217
10161 -461217 140759 -207913 105180 -162260 -584413 -154316 164528 120494 -8391 -235951
10151 -235951 -481095 -28113 132723 -102681 -6200 52172 -262599 -172251 -166929 15555 -5220
10139 -260007 -161326 -68745 -205155 70836 -5771 -198837 180606 105099 -16484 -72843 -111157
10128 -111157 119402 -283003 -88138 353814 -206748 -69253 -283416 -8785 -94351 -32341 242114
10116 -24363 101232 -70296 146504 212245 -59971 2893 -49795 -342218 -256747 280908 -18207
10104 -69473 -46282 41137 -250063 -58987 -333705 -7995 -241939 -264869 -124343 181968 -85475
10092 -143974 176025 -124512 88225 24300 170835 -282828 -240189 -379557 -69515 -158454
10082 -158454 -111727 274901 208969 -52492 188880 -329795 150124 109788 -264054 82993
10071 -29274 -88746 -199632 -75006 -209340 -437088 211582 150217 -290604 -347847 -231671
10061 -231671 144438 -268423 -288744 -210221 94966 -382478 313969 -120882 -304068 -363339
10051 -363339 -166106 -37296 -287958 -100315 171260 -207199 35939 5501 -90828 43192 -48116
10039 203923 58882 -27654 -37555 9938 157271 -63963 353709 -168945 187428 175583 -109968
10027 -149999 9207 -243972 57617 -214860 -83942 341950 115361 51282 245169 93379 -77862
10015 -157910 -261912 -153615 244199 -179363 -145139 190739 297128 -43509 -112608 -162562
10005 -162562 38927 125899 127846 36986 354902 -467007 -62170 -106933 -297963 -37732 -23446
9994 -23446 -149023 -122242 -192775 -297157 -33902 -207761 -42007 -237008 -356632 -138990 -239282
9983 -239282 -48081 -53787 -109322 -266791 -67068 -331467 313238 -12287 44350 -14327 -395294
9972 -395294 132228 -63122 -8864 -87702 -4859 168795 46253 106660 -76565 -113674 -187199 56302
9959 -285572 -85722 48504 -144281 55909 205079 -32548 -351086 18216 140864 2560 236291
9948 236291 -132033 -244830 38574 -153106 56664 222637 -264756 -226182 -6151 -232719 -311339
9937 -311339 148409 -264769 -322705 -259108 -99943 -255661 -388923 -16251 -261451 -192044 -81379
9925 -7783 -146917 102845 -386229 83597 -70432 122701 -255630 -91477 3569 -179480 -79990
9913 -219165 -69017 134740 -243083 -214038 -106169 278968 -266672 52420 123715 -13876 -88987
9902 -88987 8774 82091 -50590 -182558 58587 22575 -258069 -171457 -42680 -184467 -49246
9890 -118145 -248888 74808 -113898 -36058 212617 -78955 -169599 -234363 20540 -44088 -386803
9879 -386803 100810 67695 -193985 -36880 -349002 -42404 152736 -242972 164409 396167
9869 396167 -143980 -408440 -449433 105295 295087 82868 -49059 -168777 -486096 -89908
9858 63142 -244228 -22847 -58562 -221313 21233 -304371 145355 -75967 -233073 104749 -392131
9846 28465 -28597 -497923 122581 -112541 52291 156594 -162832 -96203 -169204 46626 162574
9835 162574 -125158 -87256 -333763 -46094 33115 60121 31915 -228037 -74373 -150898 -83005
9824 -83005 -337782 -19245 82348 -207568 -199367 -78890 -28685 -27810 -75438 -95745 59755 -80398
9811 5097 -24908 -178231 101178 348983 -18596 139055 110313 -223314 32514 -160605 202511
9799 -254174 -67747 -19237 37568 -34020 -261860 -209058 -118925 366057 31049 -245644 111342
9787 -81084 -183787 -16333 -89543 -207027 52206 -498 -205203 -99250 -93614 -136922 -645927 -315529
9774 -202850 -328372 28829 -11111 -79805 68233 -55227 -220868 -231928 -234695 -116403 -139363
9763 -139363 -266268 61471 49814 -33611 -284354 -28847 55755 -205275 -2237 -84330 99167
9751 -90520 9024 -126122 -43475 -197426 290814 -181482 -203931 -149809 -186342 -269342 197195
9739 557844 -48338 -132658 -47549 -233808 36456 -241472 44491 -284748 -744 -111045 230902
9727 -36974 79006 -355802 -166418 127064 20154 -48714 -102109 -70023 149451 273136 -303447
9715 -149019 -102364 -104382 -256306 29486 120982 -169207 89387 -30856 -29478 66962 138640 79114
9703 79114 21772 -198244 -248851 88645 -73332 -74033 -175525 -130291 88386 -172528 -26045 -83343
9691 -83343 -373767 79815 -128871 -34260 45168 48748 -27131 -26405 106903 10783 239885 -136719
9678 31313 -12263 -382950 71979 -135928 78741 50367 1470 -226936 53560 -303019 67168
9666 -18660 -238540 -156455 -37401 -1240 46965 -89545 -402546 122207 -269239 -77155 -254010
9655 -254010 -62860 -1684 29340 -83856 87494 -38236 -85365 -209523 -186949 -52516 -118933 -407078
9643 -407078 -24311 101265 -322417 164240 234365 -4849 -276300 -7427 42766 -71709 106521
9631 -143317 -29491 -43367 -64519 21829 20697 109951 -82737 -178226 -204751 -55122 -245446 -23058
9618 129723 -230858 111025 287897 -182096 -163274 -59677 230586 197642 65924 -207963
9607 -117284 186679 -174657 178932 -227717 -129220 -317140 -76753 146182 75646 -62038
9596 -60339 -190323 -4061 66736 101436 -179002 -203044 405607 -434001 42757 -257169 -160668
9585 -160668 -31242 -82836 15896 3003 34002 510238 10442 -278032 234372 -75427 -167686
9574 -167686 -210225 87765 224931 -271213 17121 -303514 218965 111494 -345194 1203 23704
9563 23704 -127196 4777 162420 -16101 -85879 5246 77828 112071 -183390 -59929 -246559
9552 -246559 -54463 -42558 -68263 -5151 -51629 -169530 25088 63883 -128145 101525 311458
9541 311458 156547 -135980 -36312 178715 206613 -75591 -324931 -185044 128621 2863 -231691
9529 338305 -339667 20153 15167 103988 131589 -181199 -62925 -132405 -116255 -304735 -71326
9517 -4544 -82153 -259935 -359616 -314731 -227195 48429 -121968 68948 65076 254209 -250635
9505 -72106 114604 -280082 49145 12825 -263943 -104005 -276896 -254633 61405 -227519 -23150
9493 -299919 -253710 236625 -133744 -378133 -239492 28526 -145056 -64976 -136355 -345322
9483 -345322 -92238 -127961 157136 -231048 -3013 -87372 247159 34795 -313986 50156 104899
9472 104899 -236467 120574 35936 19677 -5605 -74361 171566 86078 -36144 220477 -71955
9460 -399528 -268894 54164 -95291 174464 -135253 -152154 -13153 -96239 -110233 161195 -64078
9448 -318410 -71888 143039 58770 -271156 -225343 -140980 -100659 -175674 -3532 -13044 126719
9436 56790 -63402 -327627 -225651 -242893 -44440 71413 -202736 -84531 -261084 272517 -99644
9424 -125144 -466914 -31050 4314 246095 23191 -171904 11402 -124808 248295 -117118 175089
9412 18993 218724 215434 -8847 -202179 -473166 142991 -163420 -91663 366856 179919 -114729
9400 -283033 -237880 53323 -440484 -22445 77017 325155 -92662 -64040 427896 -181191 156310
9388 1688 -356270 -113541 111872 -152020 -104933 40512 13582 -146998 98167 -340861 53506
9376 -17601 141776 43657 -387229 111738 60436 -343815 -21229 -140869 -91699 35696 12169
9364 -104566 -252292 274754 341679 -7218 -112849 15044 -243722 -93319 258398 295227 54018
9352 -33236 -34874 3441 -112156 -101755 -153657 6864 57265 -19578 -164147 -175442 -323434 -143612
9339 -232758 13053 -239884 -84774 -142309 -168987 -238528 -71402 -189734 35076 -211547 137446
9327 -84469 205661 -10946 -59962 44507 -504555 33047 66345 19753 -53333 -4372 153858
9315 -91706 28326 11699 19206 -26624 89678 195158 -214695 22780 113799 -177261 -173131 -100478
9303 -100478 -267593 -175777 -149688 -309434 -225597 -47569 -59888 212197 26257 23551 -253420
9291 78921 91583 -185620 14208 74982 -149701 -250389 9677 -1014 -93914 -89546 372774 -134236
9278 -93036 144165 -292608 86301 -9924 179315 -17773 167050 -55037 7940 117605 -175381
9266 -177219 -127427 -346224 -133962 209386 77435 -19130 -84411 -36051 -231962 -332683 221933
9254 214719 219352 340957 11566 83011 -65095 -21636 -71220 -147589 -261014 31583 -262255
9242 420345 -53387 -12167 -104649 -116343 10179 -58159 -101294 -63645 -228380 -6048 -19763 -283318
9230 -283318 -503853 -52849 448686 -28674 -47392 428627 -355780 129010 -446186 -293119
9220 -293119 65382 -178489 -354304 295275 -111508 -13047 78165 36709 -119267 -342020
9210 -342020 35407 22493 -262357 33072 -226147 12814 -4963 137397 127571 147196 -132482
9198 -57176 24017 -118093 -44633 -357385 -35892 -185729 168103 -293013 172368 -194562
9187 14968 260265 -88091 13521 316073 -337750 -55138 367392 -332336 -147371 39536 -93137
9175 -243319 -127526 -259922 -64162 92562 -153245 -13300 25026 114580 -505053 -174133 -88036
9164 -88036 -91941 -190562 -32149 147011 -147538 187241 -140423 -40561 20947 233986 -53921
9152 -44549 450084 287050 85993 -266149 -260889 43323 95872 -465911 -109376 -116782 -218602
9141 -218602 -51978 -130672 -172967 19627 -129232 -184482 -302491 50545 -198269 23138 -299801
9129 -310750 -141400 163702 -21925 399181 -685494 73429 87128 379655 -366958 143989
9118 4518 -58070 48048 -91170 -137101 -142445 132701 3832 -180636 11827 248438 70196 20032
9105 -45618 59 111381 -8686 -144151 -174770 -169509 -63882 -147290 230300 -160147 -28607 -51956
9093 -51956 -208146 54620 -170674 349841 -81511 227763 109285 -130652 142427 -347637
9082 -29512 -93847 -167887 -19934 64096 -72126 -44574 -5006 -303964 -227563 48192 -19063 218141
9069 -84413 59840 -20958 -64377 80985 -353569 103699 -171006 308187 48380 -143559 -159370
9058 -159370 -130054 22677 -162726 -186017 -11347 73113 78819 -149435 -63854 2056 -265110
9046 -320068 -32073 -27197 -7110 -232578 -120304 -285203 43625 -132128 -112768 -17548 -236829
9035 -236829 136718 126470 -84844 -125064 -112154 -70747 -190434 -42765 -96989 -285355 104258
9023 245975 -293454 -165803 -177504 35033 49875 206087 -73090 -13141 -143758 66601 -21107
9011 -28971 166435 -257022 -167675 61274 -32949 -109820 -146317 -7276 82542 -59141 -294619
9000 -294619 -13904 -11385 -6216 -320272 236705 -66716 -50785 -44760 -135684 -39618 30762 -152138
8987 -69964 -311487 -104190 154781 -189598 -357595 -67422 -117012 -125690 -160956 -199194 149564
8975 212817 -15172 124891 136740 -139046 -118417 30973 309203 -151102 -36754 -232190 -184666
8964 -184666 -198471 6743 -344427 261695 -169347 -103419 48738 -5087 -254121 -66054 49566
8952 24045 -92204 -71878 44248 143860 73356 -171460 193237 179522 108434 6174 -327160
8940 302539 252259 -125812 -35935 -249401 252317 -16068 147166 9567 360941 23019 213067
8929 213067 66671 126774 -172826 -118842 205911 196155 266651 307247 1108648 2632666 8611305
8918 8611305 10168306 3088224 570095 351277 277331 299224 385307 -248186 59690 177823
8908 177823 -118607 98700 41703 262421 64560 -255406 -221671 -88941 -99907 80861 146670
8897 146670 26720 -132373 185811 105292 59976 -44436 467027 149287 -84669 -344582 142801
8885 -52139 -109256 63173 59197 -216928 163692 30193 -160873 -19981 66604 -152663 44265
8873 251844 -191884 18887 -129862 -65689 151185 -137252 80067 -32013 -294177 -134004
8862 -49126 -202122 77496 -74049 86519 -105723 -90890 329586 -68678 -44277 -73090 -318512
8851 -318512 -256404 -246070 -173197 -43596 -68235 48699 -46994 262596 82097 -149776 -277836
8840 -277836 66832 -202345 -464787 -6601 -19849 133589 -35234 75431 -152896 -182347 -76576
8828 -6817 -178492 -299584 -126323 68261 -270612 -32504 -120816 41599 -61702 -130911 -223740
8817 -223740 -74748 -191470 -205368 393694 209655 298876 119477 -23551 -61982 -92596 -51561
8806 -51561 163645 -398814 -68807 341417 -200682 44721 146574 70328 -365394 181947
8795 -78373 -144904 -88267 -80426 -243773 -354544 157456 20339 -184878 203244 81400 -201681
8783 -223262 130501 -110087 -239283 -314198 38290 -219307 -53329 -3424 -162144 40669 -100887
8771 89640 233813 -200587 -180038 -105440 9392 -250823 170278 -65287 -1186 -27669 -34849 -7743
8758 -252036 -135710 61119 17197 -98385 -31139 -150027 -12961 -134079 -227312 -21332 -9169
8746 373036 -198018 41837 -255825 -94732 -222011 -20301 -227189 82575 121135 58481 84188
8735 84188 102847 55769 31391 -130175 -385970 -119914 -211569 -187508 24085 -276987 -141001
8724 -141001 46847 203457 -146852 7609 -11733 -54370 121217 176025 -215073 -76210 185913
8712 -41326 -302244 137707 -297809 222118 -306320 -194825 14351 -38736 -334128 -29616
8701 -271909 -298154 44071 146534 56441 27058 -4247 -282994 -78373 161113 -28314 -126454
8690 -126454 -128577 7342 -6330 127090 109713 -251821 -60023 -108555 333700 -140343 -58600
8678 -102661 -587361 5836 -186157 241716 -432101 136034 67433 419868 -574675 -250653
8667 -349253 -236927 6031 365616 140560 189100 -409044 353362 -44387 174436 -196477
8656 -422213 80358 40644 -243946 -189730 173322 32810 -162166 -224230 71348 215046 -41719
8644 118241 -76019 250582 -51227 -149262 -191563 56567 64071 28711 -66150 -22862 8792 -253252
8631 247892 -88256 -196941 95014 -46195 -5540 -254216 -145519 -345985 68583 -148737 125293
8619 -242701 -132393 57139 -237835 -117854 226116 -65060 -50069 -31103 204448 -53759 -151369
8608 -151369 -1532 138788 -136715 -293751 -75509 135966 -55265 224482 -396642 -224435
8598 -224435 28206 -168293 178031 26988 -59073 -188640 -22235 -149098 160008 -192951
8587 47697 -188 -265500 -186922 -36384 200150 115632 -70508 -266800 31144 -28919 -291230
8576 -291230 72411 -16600 -146767 -384776 25233 -318775 27939 241118 107544 -137865
8565 230927 -242928 -134134 106552 138374 -596932 26934 164344 -193306 145662 -318266
8554 126809 94002 -215977 -153026 -339243 -170001 -254114 -413552 236832 -81073 -401029
8544 -401029 -5291 209392 45720 -222826 86580 -181037 -303349 -208392 -226748 -22997 218270
8532 150246 76695 -191140 -38515 -231002 -336328 -140069 116327 25572 -226239 197540
8521 -506689 -73382 -215951 -357244 102574 58639 204233 60518 -49630 -203431 -104046 118182
8509 -16467 -7073 -69065 -175345 95819 103404 223802 161152 77513 -51427 -74187 -103533 189150
8496 -161248 -266659 68868 -67756 66506 191472 174061 51985 96873 -161816 -118448 -84452
8485 -84452 -36769 -70249 -150104 -20154 9486 -523013 -297067 -124186 -130366 -245053 159551
8473 -27712 -163318 174674 -333096 -71721 70819 31642 -85846 110189 82861 -90713 -328912
8462 -328912 -250589 -137838 -602 333789 513687 -13613 120118 -36404 -187903 -102222 -118393
8451 -118393 142107 140545 51296 -363792 -254129 48912 38986 -4586 -63752 -208250 -83964
8439 20485 -262546 -15005 -251867 -70422 -100312 -432705 -36189 23881 48978 55458 -2937 -357874
8427 -357874 105446 -54083 -63211 107239 -43779 -12994 264692 -112048 -173184 -282942 -13288
8415 -114367 -43273 -48404 -76900 26730 349554 -178961 -265018 -86168 -167164 105766 -34787
8403 -125875 -163638 -309002 -65946 304310 -184111 -188367 -167859 -223184 -112418 62808 -30569
8391 -88251 -88456 -298385 143779 -135719 -237994 -693 217446 -32448 -279955 64400 -161342
8379 -196611 114976 -189614 -29397 -126903 147633 48553 -153595 -152345 -133416 71301 351839
8368 351839 211377 -127403 -43482 2320 77680 -171677 133911 201322 -122745 -405222 -168641
8356 -112186 -46590 168296 7343 55316 308448 -36498 216831 131872 187244 -101191 -213099
8345 -213099 -67531 -10476 -388624 -149675 -311165 101090 875 109721 -71670 -303659 241995
8333 -135484 -60606 100028 -181298 -323208 -266080 -198326 -53874 -162291 24345 -267131 -76943
8321 82918 252120 -36844 173783 -36296 -23542 -235337 -214824 189295 132347 106766 40129
8309 -69317 -69069 -161052 -72934 11005 -189852 -205504 -42973 -298520 -107422 -149882 -60755 -395797
8297 -395797 -221911 160755 419473 -32960 -152617 -491319 -274859 -144808 -261345 300187
8286 88116 99205 89542 90508 -62941 209410 143027 -58149 -23677 -313548 22636 -282900 72032
8273 -59246 156224 114186 -157248 14675 57770 79934 -152834 90163 165309 146777 -183975
8261 -252018 -87468 -29305 -388255 -35924 -241893 -33472 -193831 -116303 37242 -256232 1038
8249 -27036 -140231 -44002 71322 73099 272724 -265111 183829 -55867 -279714 -75406 -170566
8238 -170566 63501 149341 155423 -43749 -217173 -458633 -217523 -124677 -189627 -235866 4369
8226 -100601 -173902 -108376 209738 280276 119629 44382 74640 131697 -123658 129877 36938
8214 -260856 -101468 -205580 -47740 -135332 -104210 -131812 97831 -184424 -12768 -240995 -251841
8203 -251841 38165 -42981 -40969 -260455 -54505 -43786 -56325 207049 47688 31911 -34125
8191 77879 -10805 227111 166374 -39608 17268 -290337 -162738 238570 276114 -28308 -28260 123182
8178 -251135 102392 216882 53219 -67831 121814 93996 153823 -83135 316827 -213898 155650
8166 149067 -17975 208062 -277763 -29636 -22019 -270573 -47449 -221459 -186951 -61332 -1805
8154 130568 366592 -50228 -35365 247882 -16348 -277284 -274393 154845 -68413 -267185 -243990
8143 -243990 -163169 -36241 136520 95779 -72602 -225436 369734 254448 380407 -137801
8132 77442 32463 270796 93463 -95922 -90255 149269 33321 -238392 -702 -113424 181879
8120 101906 42190 -220467 -42621 129165 -440128 -68254 -76120 32620 -94571 -276646 34440
8108 106259 -154968 -268448 89525 -296162 -208392 -300300 -251425 105244 52488 79486 165834
8097 165834 5449 -266220 -311968 -169691 -293413 -89381 -48617 -178727 -164034 103027 -188438
8085 127540 -63522 37279 251854 -348812 172593 -56525 -383040 78416 60505 117097 -37032
8073 18177 -11492 -58786 71998 -281639 99396 -50179 100898 -268300 -280121 -370263 -190031
8062 -190031 101282 -66134 224324 101366 -46337 -153402 -132672 238314 -106495 17071
8051 507562 27320 -200082 35501 -8377 -63196 -240477 -148978 -289466 141909 -303356 45119
8039 125586 17288 96871 -177898 72741 -305375 52590 146940 373765 -318862 -64650 166334
8027 -176791 255619 301239 -49684 -107618 -126453 -47221 -108938 -237777 -55865 -35004 -53064
8016 -53064 -170817 -59115 55979 254859 -46314 -279420 -37864 37779 101113 160604 -239134
8004 -78272 -64274 -250683 42366 -81911 80282 -206703 55893 -259341 -61170 -423942 -332662
7993 -332662 72057 -31511 -263505 -133873 -42824 -132567 -252169 342818 -281369 -384147
7983 -384147 -102983 -96634 -235986 79905 265964 -213650 140369 216824 219430 227928 200747
7972 200747 16989 49223 -23628 325413 -343134 -80078 53212 166239 19443 -59817 25319
7960 -115529 -138225 22391 78264 286483 213838 -284362 -102424 71614 -152456 20248 62306
7949 62306 -265469 123904 -297079 -89824 -61216 -136031 -34570 -212152 -272400 -1488 105317
7937 -106354 -366779 -166772 159116 -82991 -168353 91476 -241062 -22065 -7927 -61109 -171685
7926 -171685 159960 -14199 -87894 114798 -57602 -169539 -13268 20181 -239906 -167521 -158112
7915 -158112 214432 102711 -303209 -92315 169582 -109546 -63983 557584 -143876 -9932
7904 227748 66429 208711 -201833 -33905 157264 27011 -104167 18628 221949 -29693 -110476
7893 -110476 -199355 -155612 -187380 336433 117307 -24656 168445 68959 -15166 -253066 -244163
7882 -244163 22590 -205092 -335139 218525 46664 36879 246449 -82195 105267 212901 147933
7871 147933 255099 -331663 -62990 80928 229064 133195 -20354 -159027 -10987 -397759 179234
7859 60613 -294683 -161024 -183496 -39136 19918 65891 -166542 309949 101175 90808 122563
7848 122563 166228 -131098 -39668 -329649 -16344 -21669 -229985 -2178 -265275 17062 -119468
7836 150616 53850 -24465 -158542 41927 116388 -26766 -22157 -40466 -118066 -114601 -85336 -150333
7824 -150333 100577 30591 288648 -32949 -152670 -200114 -290395 -121395 -396574 -106920
7813 60160 60017 -173543 -92330 -214329 267228 -135980 -283837 125349 -99757 -71158 2163
7801 184581 62387 13119 -205800 -209105 -70306 14999 -89432 115842 107567 -398180 -174223
7789 -73844 113781 -355408 270875 6385 44203 137814 -179645 183935 49418 -79307 -88072
7778 -88072 -336213 227096 -258649 115940 146297 190085 29281 67213 10422 391634 -36490
7766 -366882 -17182 -11431 110549 -271836 304851 -133710 -215000 -379806 324985 52371 -70176
7754 69396 3873 95706 -126353 -61137 298541 178705 59279 194504 -168715 76026 173032
7743 173032 -252632 -119942 -46867 224395 -188090 -82990 -37616 107233 -22291 -36305 223684
7731 -118189 -119853 103745 -22552 -4340 -101309 -266877 162459 -247115 -142825 -111933 2287
7719 -140447 -197281 -42127 -460969 189666 55897 235756 409227 -36450 2049 140317 -191623
7707 -140750 -297259 303764 220597 -174507 -64349 -60881 93639 -87264 -13582 -34119 -181450
7696 -181450 -309080 41240 38579 -33877 -39369 142735 -164496 -75823 -157613 -177999 -35205
7684 12423 -197730 -36759 -55130 71868 84735 315895 9944 -127116 -67679 -61778 -235887
7673 -235887 72274 46012 2044 -400933 -194349 -33208 -202296 -33379 -40225 -185083 -30334
7661 -43936 -102298 -82305 -217575 74454 -517547 77664 -348653 -12716 -333480 113025 -100048
7649 223134 -29684 310780 -29646 -26663 -89811 -71919 -186556 130986 50248 -140662 -47866
7637 310075 -11564 36626 -298407 237998 100287 154268 -94776 -143966 11972 -139179 64080
7625 -93320 -177435 65037 192432 25159 49132 54669 -32217 36120 -231512 26289 -31336 -89697
7613 -89697 -85161 -65002 156224 -168934 196302 -149847 169245 -316153 2530 -233810 26659
7601 67433 -124688 39701 -69962 -4661 -145719 -255074 229247 -207143 214591 215808 -243381
7589 -263495 -10084 -61102 -42799 217715 184597 -104829 -174140 -358687 161343 -116343 38640
7577 10462 44115 -38737 -41628 -139784 -362205 -125471 420329 174357 137064 -316560 32309
7565 -122044 -195272 -177500 -364651 -160024 3792 55049 -51767 138968 -130564 976 -206507
7553 143553 -241516 -174101 -119432 56748 21402 68325 26096 212637 -57251 -183798 51944
7541 3619 447701 208373 353865 -43799 -289670 -77431 70209 147057 -30112 -234816 -207039
7530 -207039 67040 66253 266539 -99208 162758 -56528 195224 -33124 176584 -12585 -54254
7519 -54254 4659 -164620 409698 -129062 -14487 103950 4850 -170339 -102236 21287 -332220
7507 -192501 261992 -24293 -110228 -190836 69854 110674 -138358 144186 -134906 -134970 -14721
7495 260558 -19116 44445 18460 -345953 116282 186778 182418 -210162 240951 -130805 101532
7483 104907 60612 257813 -36116 130352 79823 -266050 30478 -201480 -207719 -55696 -34945
7472 -34945 494809 -148480 -407957 -15654 -181561 -5765 -37493 30174 -45 -159308 -354805
7461 -354805 -320619 -175008 182105 151429 -183959 143534 -223425 -224042 72719 -186524 90900
7449 -319245 -115668 3146 -81979 -15881 -256675 -152316 27316 115051 -49403 28070 -52853
7437 107038 -40701 112901 168750 -311013 -255093 96119 -362779 -40855 -251733 -29604 -62387
7426 -62387 -9656 -69798 -132515 195211 -39725 -360984 249404 99660 -103380 217423 35362
7414 -45512 -112755 322904 57292 -47292 50768 -119284 64266 -41893 -124031 -78372 -171745
7403 -171745 9030 -73975 -92546 -233015 -87975 63749 -28517 152033 -248126 -38223 40113
7391 -181189 105482 120763 -125090 -160667 -151022 216270 -47675 476086 92545 -143369 30971
7379 -1584 228826 -189158 -407387 -394309 63277 -76969 -69468 -64866 -144393 -276330 -416186
7368 -416186 -4650 -89542 -195757 81261 -89738 171873 -506428 -78917 -108463 -78241 -268546
7357 -268546 73247 -322732 276732 -115507 46508 92093 -69945 -243716 141602 82818 -95380
7345 -16357 -100769 -62785 61917 -115101 -151041 289855 -284346 7690 118943 -388354 277305
7333 176017 183567 270676 489722 -52131 39242 -168619 -153030 69479 -45200 -103130 -87015
7322 -87015 59657 139690 123063 -158288 306655 -250340 281185 109029 21267 -240936 -98928
7310 -4839 9847 39250 -299117 21231 -49987 -44307 -52005 172245 -245019 146137 -35263 184285
7297 -41689 -18780 172370 221162 -96676 -288515 -25961 -51615 69127 -255869 128953 -62260
7285 29462 -167500 27291 -335982 308346 -189493 -268178 -161492 -113563 34519 10218 -154582
7273 -123862 -150530 -226497 219072 9222 58488 17100 -98672 -66042 -276789 167582 206373
7262 206373 -10549 319605 215391 -103407 -73686 44525 -35355 -20516 -222694 -263225 36582
7250 -186272 -330269 62027 302989 -134641 -207743 -107929 366889 -120265 19623 -8208 -44654
7239 -44654 97642 87142 169150 91097 -237345 -234949 -226801 262255 -38202 176618 -16552 158929
7226 -264552 165128 -232809 -47132 169009 -87731 245318 -25981 190338 -169854 -77256
7215 -39736 -306182 43370 -172106 -390200 15188 -443392 6951 270685 -224655 -68257 -52910
7204 -52910 261280 144442 195296 -157783 53845 -4961 -40962 -381497 -129335 -82784 412545
7192 114591 -16250 -94397 -38668 113131 -189262 -95297 101373 109521 -63311 -142042 -294102
7181 -294102 -31721 142191 124670 105469 115110 109192 81931 -92441 188817 -459378 93739
7169 -6557 -73937 83829 -111801 -127270 -309406 -26883 202501 91272 160022 -113627 -133873
7158 -133873 50069 -57241 161631 52863 -10517 -59922 62631 315570 162683 339226 149143
7146 27971 -156405 -467370 -111061 -187518 -167674 -49292 88771 -118773 -101298 382335 200296
7135 200296 -184241 14234 62898 -57610 -66973 -90167 -169590 346699 126972 -50437 -33829
7124 -33829 130970 -214852 -146073 108827 164274 -167770 -129389 166712 -159064 -153632 -16598
7112 38946 99294 94378 -244729 -253 -342732 -260133 -19794 296439 -219910 -3456 13847 -80722
7099 -198747 -202732 140841 -19719 196683 41389 126809 -129653 -143158 265539 -242231 -43745
7087 -147043 -166880 -32669 23434 -361378 -81900 185081 78834 -219902 -150916 213226 -129416
7075 23341 -14171 -164836 169296 228210 61583 22564 -137580 45692 80310 -19459 24592
7063 -31511 75394 -54419 -69763 -118152 -411824 -262488 -114498 190336 -160689 -252700 279777
7051 -192857 167824 -212709 212644 -324728 45333 -83877 -172914 108624 121272 12433 110868
7040 110868 -95250 -77239 195092 -57251 -32958 -92476 28651 -31067 66411 -131547 -224718
7029 -224718 71647 -179901 -343679 -11360 -76707 -186930 46545 -80443 97508 -129468 -112096
7018 -112096 -152271 90573 -26810 -163385 56078 -140232 -336821 -87787 -3306 272554 80231
7006 181675 -114607 258767 114209 -96764 -45211 -122449 18773 -264820 -86407 153027 304060
6995 304060 -347098 68837 32008 54987 -182568 -231800 195602 -144910 -169543 33688 -29220
6983 367039 57110 240046 -139076 306948 -35342 -185492 22722 -85881 41955 -163942 -24160
6971 -13516 -136780 474506 -94123 20444 93113 13735 -175000 -141264 -131996 -102654 -290386
6960 -290386 -128808 -58765 122831 -105729 -404420 -6888 -401561 -230576 470053 278606
6950 278606 31860 254530 -225892 204710 -82732 103404 -155672 -42082 229861 29044
6939 377172 -91667 -166488 -109315 -167350 -115699 -100528 44212 -120821 -149014 61570 -261534
6927 -15163 353775 -49358 74520 -166947 317980 -105926 53816 102331 -19636 -248960 -173061
6916 -173061 6555 284584 -169254 55890 -117934 -25515 -274790 92399 15940 265411 -16852
6904 -91521 -53777 -179648 -146426 -182366 -61626 -110673 -289751 72420 120004 -237084 -49825
6892 96138 -121666 666 398093 269224 -241541 221319 -180737 141433 271636 -164566
6881 -208675 -110515 -141669 -40216 303063 102518 270817 -96446 133411 54755 -178404 258207
6869 75020 78408 -185260 -135025 -82477 146286 -14811 -210538 63789 -198233 14938 -86482
6857 82911 -209781 100613 -113841 401878 -2240 21921 82152 -83936 18921 -25278 20560
6845 -58499 327608 -10739 15349 99615 -192266 26592 234417 -101782 -261319 93603 173598
6834 173598 8560 166015 288509 106101 -307316 333944 -134814 94347 360107 33298
6823 -124833 -247677 295482 -258544 14915 22756 99712 -185825 -108835 172355 24008 25745
6812 25745 -17355 130992 -72984 161806 -181487 214938 -251249 63111 187235 160092 -37215
6800 -171246 -112084 -15553 92704 63317 -180385 -62750 41666 -388340 -99227 26519 94632
6789 94632 -231003 -118207 64426 93811 -195690 -39277 -227935 -38282 -137727 36433 91457
6778 91457 65287 393248 -40609 57324 11542 -33184 8626 234413 -89747 299473 52597
6766 104135 -74955 -171427 -120508 -191947 -5686 -126616 76622 43817 -35139 216156 -139431
6754 48594 -211973 -66392 -62803 -214408 -176985 -52359 -8290 163963 44302 -20840 22928 -182906
6741 121192 -289391 129250 93654 193822 197489 21087 -79143 299522 48104 124929 -178199
6729 157233 -9765 -15132 283336 13575 -60913 -251544 -425457 -20472 69809 -125914 282809
6717 -43265 -151821 -240487 -120060 -59190 -102231 129634 53291 -238485 163855 -171599 -140958
6706 -140958 -39048 218989 200522 -120501 44686 -108540 -130418 -190677 -119046 -131950 244518
6694 171631 -104253 103697 -32002 26538 -67875 -420075 81564 -166177 89265 -78068 333
6682 -86086 20152 20136 20756 -256066 -127661 -50451 -46448 161860 67950 -208599 269336 290062
6670 290062 -37060 -74304 114776 -78989 94382 -177716 32288 8514 81105 3241 -205907
6658 284746 21410 87820 262733 102545 -98062 -232831 -53279 100223 -79301 -71190 -189057
6647 -189057 -147718 73570 -10839 112114 166009 117703 327812 -38319 -184976 122338 164357
6636 164357 10116 53753 -221867 -94660 116214 -61101 159860 -55438 137277 100988 -125245
6624 185775 -269160 -5455 -123700 155211 -125263 59280 -190037 391253 190236 -189759
6613 -272166 -214766 187312 -74777 -68344 -468403 -17531 -15624 -103324 -441264 156291 15730
6601 -98597 -117832 -429766 -246959 -79454 -60579 -100836 -459068 -217719 222068 204163 114977
6590 114977 199134 -147206 35032 -310182 -146692 175349 12351 -360907 67130 198587
6580 198587 -22378 -166673 230701 116345 -77802 -110556 -128796 -189083 212500 -133550 189083
6568 106842 -458 -46821 -27190 286370 44719 52566 -147890 -75381 2608 -224063 116007 293073
6556 293073 245074 413369 4459 -164318 212900 9030 -106174 120737 38338 137552 36907
6544 88309 -86413 -121663 -22457 563136 -48337 -63913 -227508 115645 89170 30024 -111169
6532 -149319 112017 -45649 41844 64850 -61663 -139714 182670 134252 -66505 -293832 -118879
6520 72801 236573 200483 104848 -44635 3127 -32574 -45014 -177254 -116251 193495 30719
6508 -47598 -357269 165720 294635 -131909 127834 -267542 -165107 -210047 -81864 45206
6497 39196 217462 121052 -205883 208359 -128372 293699 -63213 20539 181069 -315777
6486 23841 455828 -85164 -126678 548 256778 511526 -154544 202214 3497 -159503 195415
6474 28459 251923 25652 32564 -284515 -28238 -38800 -270009 -345149 -209011 79287 -156953
6462 1407 255705 -255379 31525 -246394 -204688 -56207 171950 -90399 -151793 -39691 -19047
6450 -20678 37007 146252 194085 295291 100665 -22603 -15541 -218324 96537 -239736 194864
6438 55092 33799 -230119 278810 57603 409703 275867 -116933 -55949 -85539 63509 -103870
6426 -166767 49175 -187072 -113316 -265077 161597 -171815 1337 70909 -207703 -223606 174610
6414 -48032 -190069 114573 286476 213483 174058 59651 -167214 -272350 52855 7895 -207953
6402 268577 -58429 34029 81652 72009 -185301 -310077 -347765 204791 -147423 -151423 71038
6390 -7429 65231 70145 98328 -180182 -162903 -183341 -29333 111140 -59075 -30260 -275650 -311933
6378 -311933 -87971 -216345 -151537 57654 225752 -52107 -205828 151098 73016 154514 30638
6366 24753 230190 -199501 39575 -252323 35325 81472 306434 218541 -132745 119352 -93163
6354 299145 -231847 153354 -3454 2362 -187681 -118314 160410 43856 -254990 121271 -125748
6342 105582 -13922 46088 112444 -101611 -66537 -31978 -216844 -336152 103347 113775 361593
6331 361593 -84564 3824 105348 13091 -311434 19722 530509 171154 -174685 -406109 -172635
6319 -205287 -172236 -155256 311378 -149466 13429 -121607 -14139 80551 135937 245237 230625
6308 230625 60540 77071 -262304 232457 -32800 229579 9961 -85768 323818 -210359 198166
6296 -73248 142744 293921 -122530 104745 -124839 -49157 100962 79941 -267689 9406 -131881
6284 263517 -327082 -38349 -138033 -91038 -556598 -197844 269238 107275 -138962 105934
6273 -152751 -90179 -26799 270421 131570 -153347 6657 81185 -21370 -75040 -71973 360085
6261 95651 -46134 70085 -38762 -34362 37301 244661 75779 -69674 -8230 -108023 78985 27352
6248 7975 9318 -38746 22081 141723 8868 -236526 87829 52789 218730 -151458 29131 -131366
6235 85900 148159 159952 -95191 -75937 88159 -45845 165210 303417 -117418 -322071 -145754
6223 -253756 260005 -167951 -228886 398931 -29563 41332 84567 -252746 216820 19179 126866
6212 126866 40946 -152969 -125812 -131963 -225063 96838 61213 -74981 219534 9927 117185
6201 117185 68810 31621 56185 38866 77882 -231543 -258426 191778 419771 247202 -16679
6189 153907 47256 -135074 210695 -40074 131014 -54391 272987 33683 158443 -259091
6178 -222110 -23412 -274599 46607 -247113 209231 -3597 408292 165573 136581 -144001 -50869
6166 167351 -288503 131427 -237315 -352331 -93223 101852 -81860 -395751 57977 -173163
6155 -88025 -85791 -50889 -67517 -388077 412990 -87191 44646 51264 -45699 -45004 -162745 242751
6142 52293 124530 9143 354542 348737 -216221 -83940 126775 -273306 -56423 -143371 -101847
6131 -101847 -81241 216960 -133660 50422 -293097 146659 -174465 383006 -94910 3879 -96945
6119 -165300 -47032 -30869 309618 48005 -176868 -89624 35367 128533 -53412 104941 38914
6107 -101708 282443 -11986 123240 -47886 -396810 3 -242851 -182951 363584 -45600 251796
6095 218408 -73394 160711 -422952 -81861 -171550 -251890 -119121 -142873 -302649 -105274 -18150
6083 -100453 219092 9272 -47540 195891 10614 104695 -176627 -27234 -5825 -158757 142007
6071 -32474 -79453 62604 156903 -368080 233279 68384 -213404 58617 161880 -261528 -109010
6059 -146368 129995 -38157 6121 -8701 -101494 -183156 -37977 23784 -57625 -41402 -64812 202449
6046 55939 152101 13328 -102326 -77280 38829 361126 -143092 -90323 -274436 109265 -276761
6034 -95773 203436 89330 357392 242621 81267 -137395 229353 83168 148244 -204312 -134566
6023 -134566 24861 -194891 73018 26606 -209082 45634 -78543 43327 4108 272668 203239
6012 203239 104140 -207430 151598 -33902 152152 -44011 -32863 -108183 -135105 211043 246268
6001 246268 17576 -166926 -161883 100009 -29492 -2131 72710 -26499 -149973 265593 258828
5990 258828 -127179 252572 -184287 60270 93750 137308 -97596 -644 151190 40803 -121541
5978 -204668 66127 82489 17081 -13738 15544 68975 200980 77506 -236290 149254 102387
5967 102387 125403 172950 86361 173244 211318 -173685 -154708 -118949 94212 -83121 19188
5955 175309 76686 -25317 57946 -131365 -45474 53055 -96005 -156397 118234 6679 -70526
5943 -125573 36890 -114745 26039 6177 161317 43313 -97601 -159333 -62258 -62776 230738 -47886
5930 -47174 29350 -218022 -295408 -241998 116411 44302 122630 234598 -21986 157101 314250
5919 314250 -78597 -88638 80901 -275393 144365 -242386 -118431 235939 14183 -150340
5908 77522 212126 -33024 320450 -62606 151356 -25192 283550 -64908 -42914 238003 -19456
5896 -103810 99930 -19984 39024 29195 37806 84754 -506 -39662 -256849 -153803 213283 -168245
5883 -239033 -245096 -141980 43709 -152943 -240454 -157327 -219286 -145398 59099 188854 24401
5871 94971 -81706 -177178 -244908 107208 30972 -149941 182073 90360 -315483 192577 -40600
5859 21363 105629 168802 215633 -99221 -6387 304351 -208230 -170432 -64584 -46984 459462
5847 -191083 92966 -92832 24517 -74325 325075 -487383 327768 216198 419161 193674
5836 -28382 93182 134498 137450 193010 -161505 -1083 -273361 -68321 -169111 27155 110696 -102448
5823 2417 101160 93896 111229 -157465 49684 76190 384021 172909 242239 -62417 -25333 79603
5810 286044 41603 16358 -52043 43637 -113813 -140025 139737 24877 172718 -5704 -72958
5799 -72958 -104696 -175037 -6161 -38437 -38896 -186574 -61079 332899 18136 -30706 220362 272048
5787 272048 -37894 25885 -15223 42511 -37742 -40685 26929 -18956 226191 33371 94159 -370297
5774 45076 229032 15179 36183 121496 -94615 33726 -74282 195032 60815 38955 -134311
5762 -147990 143577 -177583 -155224 -79327 87302 -141838 96906 124985 16478 61553 -233024
5750 -235734 335428 -267076 -265862 112591 99992 -178705 42769 339943 99506 43455 146784
5739 146784 -69412 55432 115174 32217 14373 -265898 -190876 -166842 68456 -131299 -81316
5728 -81316 90735 -146374 181184 11346 -203038 -274979 201916 -31712 111343 362 -179617
5716 241299 -94513 106618 279015 -124203 137684 -37345 226208 -16078 -182890 337399
5705 -74340 161213 36339 -17405 -119220 203168 148196 292456 66473 -120069 51501 15282
5693 341104 -98038 23697 220813 175619 40071 307242 37530 -29387 -124286 -264137 -72046
5681 -201412 268558 127150 69655 -134891 195291 -223814 -73290 25604 -315808 134753
5670 253704 -76772 140508 328923 -30035 146146 -190790 98743 67226 -50579 30661 20054
5659 20054 -328097 -149760 -222644 107432 286134 351032 -36853 162428 93054 -46596 112012
5647 -35943 9887 -200490 -168971 -89781 14480 128228 -233217 17151 -124590 -86392 -82677
5636 -82677 -83839 -17021 -265508 -123309 -129058 -21273 173098 314977 205071 133259 4630
5624 -164021 -199247 63964 242786 -29201 -201472 287295 -446076 -39489 254626 -167640
5613 218228 -69348 22603 -149401 -100262 -122665 35405 -11277 45597 36363 10382 65188 -53386
5600 -188394 -110569 31616 151932 -86575 -373062 228314 219568 117754 -235818 -107046 3451
5588 -57644 184982 -136692 251808 -45522 71271 310702 394678 15278 -56809 215456 -143309
5576 345383 -19629 188611 60677 -177368 -42194 210968 165537 169099 -254225 109759 131680
5565 131680 -413051 129628 16970 -29054 -26649 -117080 -133256 54408 -107552 3579 -63528
5553 21759 -10385 -153371 66686 282622 396013 -70622 -20027 -159000 -29109 -169689 14905
5541 199227 -55304 70269 -1608 60854 -119572 -268706 -185124 -50093 92241 158029 -174762
5529 52412 -109855 -9051 -28632 -209306 158612 165298 -182280 169960 79946 -22618 -37375
5518 -37375 39560 -31678 -244967 147186 56057 -276248 251336 342292 77434 -377098 45006
5506 60479 -300490 408942 -5292 -145376 22444 -236319 -225542 -31037 -66882 -146513 -29675
5494 -45729 -281571 -54980 -87338 67294 191165 -140489 6329 131807 -136279 -271399 72455
5482 -9645 -101463 -33590 -139860 -90695 -168079 392029 -10088 -50596 340065 21569 8383 160498
5470 160498 -178162 173444 21967 48359 -662 -281737 167972 127460 348400 -124679 -255861
5459 -255861 43439 -88321 222407 -43354 80532 70202 -137785 -2266 21040 -159767 53347
5447 310704 87697 86276 -135804 93999 -10287 -15133 259085 -69980 168795 -145577 76910
5435 38523 4882 191271 -60603 -17189 41560 -105638 -76590 159996 5648 49921 -45059 -174401
5423 -174401 -58699 159438 133290 267995 409656 -21345 81205 -28935 362691 -45065 35054
5411 -83797 123552 -40230 -229307 269175 -51194 169873 187586 202331 -67447 255050 50924
5399 -254587 138141 -281816 213049 90109 -280675 74676 120525 29464 36165 -17333 -43532
5388 -43532 79505 -10872 390650 -201811 -292900 111578 31688 -140167 110106 10172 -231439
5376 -55754 355405 102189 -53321 152309 -8998 -51984 30877 5139 63856 -157227 -3383 -59883
5364 -59883 -176231 108437 -191975 -31989 -255614 -29189 129940 147934 168089 105417 -168525
5352 -99729 -2100 -45094 113144 -59103 290692 -200730 -88204 222665 115787 20439 -28808
5340 230631 -31351 257126 -58859 -342568 149909 266702 -237125 44485 192446 94546
5329 -96075 93461 32609 -58397 -94677 424362 132240 11613 -37546 -184554 367776 24636
5317 -39396 -189757 215882 -89062 -196693 140094 4304 169087 -111113 130744 -71484 -120431
5306 -120431 100046 239191 -72217 -266373 146487 -91577 -104356 103277 104914 260742 369368
5295 369368 -268983 -110319 -35587 -71613 34172 -234608 33372 -121190 164162 -68820 -139785
5284 -139785 68358 104723 63507 219467 9466 326959 58960 49628 133942 -173159 -482899
5273 -482899 -197050 142799 28870 -288272 -92423 137195 373622 285255 115854 -262948
5262 91700 -64122 89594 -66644 84373 37896 219116 75610 11639 -68172 -176383 223903
5250 -181590 38295 -277258 210401 91590 42021 -104598 -108867 164640 57399 -158375 78911
5238 261105 9473 -15491 -131812 44438 18091 19370 115798 137885 144667 -30861 -294805 27944
5225 -254351 148245 -213298 -119979 -53837 -44807 -155313 150158 159597 -91215 -505347 -66238
5213 78586 400091 -108633 363063 -54858 8665 -786 -167495 10978 43808 230249 -55369
5201 -357268 -46789 134534 57893 128045 -10022 141751 -268009 129700 -161377 26317 -107090
5189 -12173 -163817 -122953 59105 -295235 -198859 554018 341512 67578 31337 8301 318194
5178 318194 511402 -91563 -305761 5809 -190766 285009 270750 -29876 141432 -67082 -151633
5167 -151633 251465 118562 150060 -211299 -198891 8963 -24903 -46252 -74717 -30747 223533
5155 246160 241106 -121572 -32682 7242 353321 -451032 -80871 -210920 -183632 -88714 70515
5143 -294655 264322 -54991 84386 -324802 -72473 -43954 224947 545550 -154802 212626
5132 351454 -310295 -202916 50430 -184889 -22185 162806 282282 254683 223128 -86520 335771
5120 -115258 289527 32092 393943 253913 337197 -81604 -195808 -74074 236647 261346 -335423
5108 121816 14718 -204196 -192092 342621 39801 48493 162561 -98819 160246 233589 91235
5096 -100135 82615 162278 -150945 69010 -1248 75463 -78563 28277 -26704 95313 -81978 -27505
5083 237712 11261 272321 -85488 121709 972 -9680 421254 -275633 -54104 289257 -32437
5071 -311731 29973 118626 -40053 4213 183807 100219 320927 -5732 62454 178668 -78540
5059 108356 -34058 -412 -30258 -81199 -206225 249456 -145789 -2974 -203279 208253 -154964
5047 132661 -447835 151233 117329 -94591 -131132 -83734 -121428 362504 350933 134962 149460
5036 149460 197043 319402 -39883 203503 62290 95417 -112532 444104 -76732 -21364 185935
5024 -20276 61335 65916 219754 28257 37695 -306281 -62518 403482 -152463 211298 91955
5012 64829 62899 62618 -205654 74381 16913 87832 50743 264666 -24933 -213084 219751 -38944
4999 195168 -118556 388073 50360 203707 -86273 99215 66464 341934 165527 58918 -166826
4987 90249 11706 162831 6768 -122137 -68279 83698 160153 -73547 29063 -230996 -132263
4976 -132263 -263297 -334561 266115 -27225 58948 -216792 -503 -112120 60994 7635 72807
4965 72807 -66079 -309840 369016 -304606 -209593 -48710 -85940 91653 12962 256821 133920
4954 133920 -114484 -240137 234021 12474 -77445 -153556 280280 5572 313037 22686 -8149
4942 -471363 392923 28957 -138068 -157197 70678 120043 -240494 -95224 17581 26949 86990
4931 86990 77923 76177 -100777 -1538 124831 -128852 94112 86950 238301 -67149 104167 -43288
4918 -42134 -232378 -228134 -73257 142316 -67844 62233 -121164 -208990 -119432 237102 83817
4906 -123831 -100986 30790 -193277 -63228 -121362 -307615 136763 114070 244635 61843 -143873
4894 14358 -88065 -511952 -64402 418349 100197 49469 -76908 -278780 43554 371607 175818
4882 1662 77802 -253590 245647 -34375 93648 200115 -50770 68642 125381 -133842 142663
4870 -54027 -23066 -222730 138903 70190 84999 17654 286288 -236810 153673 20758 -85177
4858 -91002 -158152 -105773 -3991 -17318 14382 -35213 -85678 118737 -176579 46454 185465
4847 185465 48922 234394 277433 -83107 -405010 89979 -93940 129671 905 -30914 18144
4835 133229 -54312 63494 228232 -278114 -251428 -121551 94369 -284187 -239333 23987 221390
4824 221390 271228 79332 71221 -232070 313348 249956 78493 -9475 -194793 51984 86449
4813 86449 80358 -40050 -118221 100226 188945 -341185 261636 -21566 -178018 -88981 201752
4801 64737 -295402 3259 -72435 165201 -74862 306946 -239707 -261620 -253385 -50057 82650
4789 -4565 -119711 106067 21589 261665 21261 -210785 75263 60450 -63194 229648 74538
4777 -34423 -143184 -80633 122243 -191805 194329 -130576 -67358 -134678 -164629 -206988 -105
4765 146802 -279391 -89150 -197895 140529 307614 -112074 -113546 -190006 -275056 98236 -440394
4753 125899 183015 126522 57664 -182417 -202634 29682 -139568 17661 -42930 -116548 -93961
4742 -93961 -131200 -20333 -64720 -86368 60498 24408 -272860 -159143 286406 -180406 61232
4730 -162430 -52285 -252555 408549 52801 172092 -229458 264329 20073 -100814 -27656
4719 -107966 -170055 265553 -26040 -150899 408567 114810 176578 153551 -103926 178646
4708 -301940 9124 31516 313244 260251 -211058 174059 -106275 294078 161078 -145521
4697 19028 -75741 -114620 -83650 589227 -159314 -23945 -59711 324183 69344 164442 231512
4686 231512 8857 -95498 80837 -18345 64998 -20275 197563 226639 188983 -71186 -374754
4675 -374754 11218 -218571 119097 303524 80686 75901 -6796 242418 14681 244850 -150159
4663 45539 68729 90267 -55858 93348 -81876 -16372 66055 -102609 214552 -302084 79057
4651 -115714 270172 -16653 9027 39163 72083 -75259 -131494 -148249 -37457 -161204 172068
4639 -209440 76582 64533 11386 -114638 395148 -245683 -14434 135918 -26309 -307257 -272763
4628 -272763 -258824 198439 96922 -93257 -4494 -133294 -277901 155848 347393 48633 13698
4616 -167811 160102 325263 -260526 -135315 235749 -275400 45620 230221 -80767 6534
4605 -1361 124668 -188009 -220120 -51703 95750 -34549 88928 414272 -305257 -13796 -41417
4594 -41417 44864 81765 -44243 127037 -74547 -141208 140178 67831 -162585 -213696 34249
4582 -102591 58012 -224826 -139855 -329442 -11551 12285 41242 252623 50822 97575 73859
4571 73859 183146 -109348 200427 -143032 -167595 97367 198100 76674 -318310 140337
4560 253720 -81466 215277 -10811 12102 -111591 131965 215424 122384 289218 -45327 -135485
4549 -135485 52506 -14532 -209112 -16499 221555 205108 -48518 -150824 -61585 9111 252697
4538 252697 -89122 -24899 303031 166740 19510 270580 -103896 17165 72741 69078 165698
4527 165698 -5553 146202 -107480 284713 -188697 431339 253404 -31781 -140499 -54855
4516 -162402 308255 42400 250222 -258076 406775 -139921 -66108 -298158 -163312 131351
$$ [...]
##END NTUPLES=NMR SPECTRUM
##END=
