
##TITLE=AC1333_TANAH10083_7160795_mNxTH9sknc
##JCAMPDX= 6.0         $$ Bruker NMR JCAMP-DX V2.0
##DATA TYPE= NMR SPECTRUM
##DATA CLASS= NTUPLES
##ORIGIN= BRUKER
##OWNER= Administrator
$$ 1.72 TOPSPIN		Version 2.1
$$ 2012-12-01 01:01:44.376 -0500  Administrator@X
$$ Compression mode = diff/dup
##.OBSERVE FREQUENCY= 400.02188249412
##.OBSERVE NUCLEUS= ^1H
##.ACQUISITION MODE= SIMULTANEOUS (DQD)
##.ACQUISITION SCHEME= undefined
##.AVERAGES= 64
##.DIGITISER RES= 22
##SPECTROMETER/DATA SYSTEM= spect
##.PULSE SEQUENCE= noesygpps1d.comp
##.SOLVENT NAME= COFFEE_meoh
##.SHIFT REFERENCE= INTERNAL, COFFEE_meoh, 1, 14.96278
##AUDIT TRAIL= $$ (NUMBER, WHEN, WHO, WHERE, PROCESS, VERSION, WHAT)
$$ ##TITLE= Audit trail, TOPSPIN		Version 2.1
$$ ##JCAMPDX= 5.01
$$ ##ORIGIN= Bruker BioSpin GmbH
$$ ##OWNER= Administrator
$$ $$ E:\/data/COFFEE/nmr/AC1333_TANAH10083_7160795_mNxTH9sknc/12/pdata/1/auditp.txt
$$ ##AUDIT TRAIL=  $$ (NUMBER, WHEN, WHO, WHERE, PROCESS, VERSION, WHAT)
(   1,<2012-12-01 01:01:38.345 -0500>,<Administrator>,<X>,<go>,<TOPSPIN 2.1>,
      <created by zg
	started at 2012-12-01 00:50:08.466 -0500,
	POWCHK enabled, PULCHK disabled,
       configuration hash MD5:
       86 BA 57 50 F2 9D 5C 9B 26 00 A9 28 5F 66 2E 89
       data hash MD5: 64K
       7F DC 9C 92 CF 18 20 B5 E1 94 7F BE 32 7D 44 70>)
(   2,<2012-12-01 01:01:41.532 -0500>,<Administrator>,<X>,<proc1d>,<TOPSPIN 2.1>,
      <Start of raw data processing
       efp LB = 0.3 FT_mod = 6 PKNL = 1 PHC0 = 0 PHC1 = 0 SI = 128K 
       data hash MD5: 128K
       CA 13 0E A4 12 C4 9D 5D 2E 3B DD 27 3B 69 A5 E0>)
(   3,<2012-12-01 01:01:42.673 -0500>,<Administrator>,<X>,<proc1d>,<TOPSPIN 2.1>,
      <pk PHC0 = -78.88184 PHC1 = 0 
       data hash MD5: 128K
       EC 30 6F 70 96 5F C6 95 BE F2 B4 37 00 D2 7A 01>)
(   4,<2012-12-01 01:01:43.407 -0500>,<Administrator>,<X>,<proc1d>,<TOPSPIN 2.1>,
      <abs ABSG = 1 
       data hash MD5: 128K
       5D 4F E2 1E 67 DC 6F C0 9D 9B 87 CD 7D B0 29 26>)
(   5,<2012-12-01 01:01:43.579 -0500>,<Administrator>,<X>,<proc1d>,<TOPSPIN 2.1>,
      <abs ABSG = 2 
       data hash MD5: 128K
       CA 6C 27 69 3D E2 F0 41 5F 89 42 3F AA A8 33 C0>)
(   6,<2012-12-01 01:01:43.767 -0500>,<Administrator>,<X>,<proc1d>,<TOPSPIN 2.1>,
      <abs ABSG = 3 
       data hash MD5: 128K
       78 73 FC A2 B9 C2 69 D8 84 34 C5 7A 45 9F 46 D5>)
(   7,<2012-12-01 01:01:43.923 -0500>,<Administrator>,<X>,<proc1d>,<TOPSPIN 2.1>,
      <abs ABSG = 4 
       data hash MD5: 128K
       F6 43 E3 C2 8A 62 E4 24 1A D5 74 FB 78 B0 14 BD>)
(   8,<2012-12-01 01:01:44.064 -0500>,<Administrator>,<X>,<proc1d>,<TOPSPIN 2.1>,
      <abs ABSG = 5 
       data hash MD5: 128K
       6C DE 5D 11 F5 14 FC 25 E6 FA DD 1B FD 1C 96 F8>)
$$ ##END=
$$ 
$$ $$ hash MD5
$$ $$ 9C 4A B3 55 3E 34 09 F2 4F 08 87 B9 29 83 FA 9F
##$RELAX= 
##$RELAX= 
##$RELAX= 
##$RELAX= 
##$RELAX= 
##$RELAX= 
##$RELAX= 
##$RELAX= 
$$ Bruker specific parameters
$$ --------------------------
##$DU= <E:\>
##$EXPNO= 12
$$ [...]
##$TP07= 0
##$TPNAME0= <>
##$TPNAME1= <>
##$TPNAME2= <>
##$TPNAME3= <>
##$TPNAME4= <>
##$TPNAME5= <>
##$TPNAME6= <>
##$TPNAME7= <>
##$TPOAL= (0..7)
0.5 0.5 0.5 0.5 0.5 0.5 0.5 0.5
##$TPOFFS= (0..7)
0 0 0 0 0 0 0 0
##$TUNHIN= 0
##$TUNHOUT= 0
##$TUNXOUT= 0
##$USERA1= <user>
##$USERA2= <user>
##$USERA3= <user>
##$USERA4= <user>
##$USERA5= <user>
##$V9= 5
##$VALIST= <valist>
##$VCLIST= <CCCCCCCCCCCCCCC>
##$VD= 0
##$VDLIST= <DDDDDDDDDDDDDDD>
##$VPLIST= <PPPPPPPPPPPPPPP>
##$VTLIST= <TTTTTTTTTTTTTTT>
##$WBST= 1024
##$WBSW= 4
##$XGAIN= (0..3)
0 0 0 0
##$XL= 0
##$YL= 0
##$YMAX_a= 8381466
##$YMIN_a= -17442873
##$ZGOPTNS= <>
##$ZL1= 120
##$ZL2= 120
##$ZL3= 120
##$ZL4= 120
##$ABSF1= 14.96278
##$ABSF2= -5.595402
##$ABSG= 5
##$ABSL= 3
##$ALPHA= 0
##$AQORDER= 0
##$ASSFAC= 0
##$ASSFACI= 0
##$ASSFACX= 0
##$ASSWID= 0
##$AUNMP= <proc_prof1d_extract.lims>
##$AXLEFT= 0
##$AXNAME= <>
##$AXNUC= <1H>
##$AXRIGHT= 0
##$AXTYPE= 0
##$AXUNIT= <>
##$AZFE= 0.1
##$AZFW= 0.1
##$BCFW= 0
##$BC_mod= 0
##$BYTORDP= 0
##$COROFFS= 0
##$CY= 15
##$DATMOD= 1
##$DC= 0
##$DFILT= <>
##$DTYPP= 0
##$F1P= 0
##$F2P= 0
##$FCOR= 0.5
##$FTSIZE= 131072
##$FT_mod= 6
##$GAMMA= 0
##$GB= 0
##$INTBC= 1
##$INTSCL= 1
##$ISEN= 128
##$LB= 0.3
##$LEV0= 0
##$LPBIN= 0
##$MAXI= 10000
##$MC2= 0
##$MEAN= 0
##$ME_mod= 0
##$MI= 0
##$NCOEF= 0
##$NC_proc= -2
##$NLEV= 6
##$NOISF1= 0
##$NOISF2= 0
##$NSP= 0
##$NTH_PI= 0
##$NZP= 0
##$OFFSET= 14.96278
##$PC= 1
##$PHC0= -78.88184
##$PHC1= 0
##$PH_mod= 1
##$PKNL= yes
##$PPARMOD= 0
##$PPDIAG= 0
##$PPIPTYP= 0
##$PPMPNUM= 2147483647
##$PPRESOL= 1
##$PSCAL= 4
##$PSIGN= 0
##$PYNMP= <proc.py>
##$REVERSE= no
##$SF= 400.020008923537
##$SI= 131072
##$SIGF1= 0
##$SIGF2= 0
##$SINO= 400
##$SIOLD= 131072
##$SPECTYP= <>
##$SREGLST= <1H.CDCl3>
##$SSB= 0
##$STSI= 131072
##$STSR= 0
##$SW_p= 8223.68421052631
##$SYMM= 0
##$S_DEV= 0
##$TDeff= 65536
##$TDoff= 0
##$TI= <>
##$TILT= no
##$TM1= 0
##$TM2= 0
##$TOPLEV= 0
##$USERP1= <user>
##$USERP2= <user>
##$USERP3= <user>
##$USERP4= <user>
##$USERP5= <user>
##$WDW= 1
##$XDIM= 131072
##$YMAX_p= 419896095
##$YMIN_p= -24804
##$CURPLOT= <Network HP LaserJet P1505>
##$CURPRIN= <$Network HP LaserJet P1505>
##$DFORMAT= <normdp>
##$LAYOUT= <+/1D_H.xwp>
##$LFORMAT= <normlp>
##$PFORMAT= <normpl>
##$SURQMSG= 1
$$ End of Bruker specific parameters
$$ ---------------------------------
##NTUPLES= NMR SPECTRUM
##VAR_NAME=  FREQUENCY,     SPECTRUM/REAL,   SPECTRUM/IMAG
##SYMBOL=    X,             R,               I
##VAR_TYPE=  INDEPENDENT,   DEPENDENT,       DEPENDENT
##VAR_FORM=  AFFN,          ASDF,            ASDF
##VAR_DIM=   131072,        131072,          131072
##UNITS=     HZ,            ARBITRARY UNITS, ARBITRARY UNITS
##FACTOR=    0.0627417313425164, 1,          1
##FIRST=     8223.62146879497, 4139,         -57583
##LAST=      0,             5199,            -57819
##MIN=       0,             -24804,          0
##MAX=       8223.62146879497, 419896095,    0
$$ Real data points
##PAGE= N=1
##DATA TABLE= (X++(R..R)), XYDATA
$$ [...]
63213F89341J4307J5460J5676J5027J4103J3199J2141J0738Q969O669L546k87
$$ 689341 703648 719108 734784 749811 763914 777113 789254 799992 808961 815630 819176 818889
63201H18889m185p671j0868j3939j6459j7827j8058j7716j7172j6308j4917j2976
$$ 818889 814704 807033 796165 782226 765767 747940 729882 712166 694994 678686 663769 650793
63189F50793j0564p816n076k774j020N25K393M897P954J1118J3868J5937J7315
$$ 650793 640229 632413 627337 624563 623543 624068 626461 631358 639312 650430 664298 680235 697550
63176F97550J8055J8308J8522J9187K0173K0742K0504J9911J9507J9137J8444
$$ 697550 715605 733913 752435 771622 791795 812537 833041 852952 872459 891596 910040
63165I10040J7691J7327J7014J5947J4069J2138J0381P957M102p74n659j0103
$$ 910040 927731 945058 962072 978019 992088 1004226 1014607 1022564 1026666 1025892 1020233 1010130
63153A010130j4337j8490k2226k5060k6772k7566k7966k8310k8209k6814k3924
$$ 1010130 995793 977303 955077 930017 903245 875679 847713 819403 791194 764380 740456
63142G40456k0542j7930j6286j4781j2827j0795r329q374p263n678m083l025k321
$$ 740456 719914 701984 685698 670917 658090 647295 637966 629592 622329 616651 612568 609543 607222
63129F07222j323j4P54L25p68j390j119n01j30j21m66j234k077k224j424n12n15
$$ 607222 605899 605885 606639 606964 606196 604806 603687 603186 603056 602935 602469 601235 599158 596934 595510 594998 594483
63112E94483j410k246k303j725j084p59p53p74m68K45J032J529J764K006K309
$$ 594483 593073 590827 588524 586799 585715 584956 584203 583429 582961 583206 584238 585767 587531 589537 591846
63097E91846K444K299K107K156K439K607K345J778J506K006L031L858M163M251
$$ 591846 594290 596589 598696 600852 603291 605898 608243 610021 611527 613533 616564 620422 624585 628836
63083F28836M366M271L838L521L716M077M044L825M086M841N429N579N759O212
$$ 628836 633202 637473 641311 644832 648548 652625 656669 660494 664580 669421 674850 680429 686188 692400
63069F92400O453O067N424N162N374N708N921N949N761N452N317N508N965O870
$$ 692400 698853 704920 710344 715506 720880 726588 732509 738458 744219 749671 754988 760496 766461 773331
63055G73331Q643J1197J3663J5404J6838J8624K0564K2104K3558K5766K8556L0685
$$ 773331 781974 793171 806834 822238 839076 857700 878264 900368 923926 949692 978248 1008933
63043A008933L1560L2023L2921L3881L4178L4074L4311L4794L4806L4335L4216
$$ 1008933 1040493 1072516 1105437 1139318 1173496 1207570 1241881 1276675 1311481 1345816 1380032
63032A380032L4811L5492L5707L5765L6093L6320L5737L4202L1917K8562K3401
$$ 1380032 1414843 1450335 1486042 1521807 1557900 1594220 1629957 1664159 1696076 1724638 1748039
63021A748039J6333Q176k89q923j7616k5630l2163l7271m1571m5066m6968m6852
$$ 1748039 1764372 1772548 1772259 1763336 1745720 1720090 1687927 1650656 1609085 1564019 1517051 1470199
63009A470199m5320m3208m0584l7037l2608k7808k2886j7678j2186o790j744L120
$$ 1470199 1424879 1381671 1341087 1304050 1271442 1243634 1220748 1203070 1190884 1184094 1182350 1185470
62997A185470P979J2740J7253K1433K4957K7346K8636K9610L0897L2196L2837
$$ 1185470 1193449 1206189 1223442 1244875 1269832 1297178 1325814 1355424 1386321 1418517 1451354
62986A451354L2881L3034L3556L3848L3282L1918L0111K7770K4452K0023J4776
$$ 1451354 1484235 1517269 1550825 1584673 1617955 1649873 1679984 1707754 1732206 1752229 1767005
62975A767005Q831J785o702j6036k4944l2694l9789m6960n3781n8903o1664o2790
$$ 1767005 1775836 1777621 1770919 1754883 1729939 1697245 1657456 1610496 1556715 1497812 1436148 1373358
62963A373358o3242o2994o1449n8513n4660n0289m5719m1575l8417l6024l3576
$$ 1373358 1310116 1247122 1185673 1127160 1072500 1022211 976492 934917 896500 860476 826900
62952H26900l0658k7602k4886k2628k0690j8861j6936j5099j3944j3659j3444
$$ 826900 796242 768640 743754 721126 700436 681575 664639 649540 635596 621937 608493
62941F08493j2467j1169j0651j0885j0663r540q521q358q324p548o506o165o382
$$ 608493 596026 584857 574206 563321 552658 543118 534597 526239 517915 510367 503861 497696 491314
62928D91314o331n933n648n295m298l000k419k657k715k063j285q39l25M52P86
$$ 491314 484983 479050 473402 468107 463809 460809 458390 455733 453018 450955 449670 448831 448506 448958 449744
62913D49744K26m19j68N60N81j95n54K85J585K061J348J16p95r72m55M25J197
$$ 449744 449970 449551 449383 449943 450524 450329 449775 450060 451645 453706 455054 455170 454375 453403 452948 453373 454570
62896D54570J564J530J201N69k76r91j324j591k316l381m002l842l549l772m066
$$ 454570 456134 457664 458865 459434 459158 458167 456843 455252 452936 449555 445553 441711 438162 434390 430324
62881D30324l594k581k132k526k739j954o86J85N70O68O5j501k982k910j431k91
$$ 430324 426730 424149 422017 419491 416752 414798 414112 414297 414867 415535 415600 414099 411117 408207 406776 406485
62865D06485n91j586k046j843j584j400j026o33p05j203j517j449j565k264k925
$$ 406485 405894 404308 402262 400419 398835 397435 396409 395776 395071 393868 392351 390902 389337 387073 384148
62850C84148k571j330n83j317k711l062j974q24q43j588j863j408q16l58P3J11
$$ 384148 381577 380247 379664 378347 375636 372574 370600 369776 368933 367345 365482 364074 363258 362900 362973 363084
62834C63084p98k193k786k120j116o26m20n6J50j64m49L8R75J259N28l97o50l63
$$ 363084 362286 360093 357307 355187 354071 353445 353025 352969 353119 352955 352506 352544 353519 354778 355306 354909 354259 353896
62816C53896l91j181k135k135q43P21J256P54L94Q83J619J841J730J831K078K171
$$ 353896 353505 352324 350189 348054 347211 347932 349188 349942 350336 351219 352838 354679 356409 358240 360318 362489
62800C62489K412L247M287M646M257M081M905O502Q031Q896R128R313J0074J1410
$$ 362489 364901 368148 372435 377081 381338 385419 390324 396826 404857 413753 422881 432194 442268 453678
62786D53678J2681J3522J4373J5713J7240J8522J9965K2296K5256K7873K9972
$$ 453678 466359 479881 494254 509967 527207 545729 565694 587990 613246 641119 671091
62775F71091L2471L5883L9577M2845M5858M9031N2158N4770N6827N8389N9036
$$ 671091 703562 739445 779022 821867 867725 916756 968914 1023684 1080511 1138900 1197936
62764A197936N8265N6123N2920M8459M2191L4002K4347J3755K605q591j9159k8610
$$ 1197936 1256201 1312324 1365244 1413703 1455894 1489896 1514243 1527998 1530603 1522012 1502853 1474243
62752A474243l6722m3313m8297n1968n4849n7107n8335n8094n6518n4264n1895
$$ 1474243 1437521 1394208 1345911 1293943 1239094 1181987 1123652 1065558 1009040 954776 902881
62741I02881m9456m6643m3316l9808l6645l3963l1374k8454k5271k2302j9911
$$ 902881 853425 806782 763466 723658 687013 653050 621676 593222 567951 545649 525738
62730E25738j8073j6544j5130j3704j2141j0423q747p394o397n483m430l403k715
$$ 525738 507665 491121 475991 462287 450146 439723 430976 423582 417185 411702 407272 403869 401154
62717D01154k311j803j031k54M11J353K877M548N641O179O938Q366R988J1171
$$ 401154 398843 397040 396009 395755 396166 397519 400396 404944 410585 416764 423702 432068 442056 453227
62703D53227J2029J3260J5287J7910K0636K3095K5301K7699L0892L5004L9452
$$ 453227 465256 478516 493803 511713 532349 555444 580745 608444 639336 674340 713792
62692G13792M3597M7490N1660N6161O0271O3302O5375O7046O8321O8468O6845
$$ 713792 757389 804879 856539 912700 972971 1036273 1101648 1168694 1237015 1305483 1372328
62681A372328O3455N8446N1401M1727K9742J6815M184p949j9822l1109m1075m9438
$$ 1372328 1435783 1494229 1545630 1587357 1617099 1633914 1638098 1630149 1610327 1579218 1538143 1488705
62669A488705n6358o1620o4641o5528o5363o4967o3922o1417n7684n3788n0212
$$ 1488705 1432347 1370727 1306086 1240558 1175195 1110228 1046306 984889 927205 873417 823205
62658H23205m6423m1987l7408l3485l0377k7788k5709k4288k3111k1304j8660
$$ 823205 776782 734795 697387 663902 633525 605737 580028 555740 532629 511325 492665
62647D92665j6154j4800j4294j3394j1603r853r166r252r028q225p646p785p924
$$ 492665 476511 461711 447417 434023 422420 412567 403401 394149 385121 376896 369250 361465 353541
62634C53541p083n435m169l983m278l997k920j847j570k009k485k658k733k757
$$ 353541 346458 341023 336854 332871 328593 324596 321676 319829 318259 316250 313765 311107 308374 305617
62620C05617k193p31Q17J098j93j824k413j803q26j13K98N48P50J159K022L056
$$ 305617 303424 302693 303510 304608 304415 302591 300178 298375 297549 297436 297734 298282 299032 300191 302213 305269
62604C05269L559L240K667K642L297M097M659N241O348P968R550J0734J1872J3579
$$ 305269 308828 312068 314735 317377 320674 324771 329430 334671 341019 348987 358537 369271 381143 394722
62590C94722J5843J8028J9744K1397K3550K6075K8316K9910L1067L1979L2360
$$ 394722 410565 428593 448337 469734 493284 519359 547675 577585 608652 640631 672991
62579F72991L1687K9670K6427K2301J7650J2633P187J310m596r868j4153j7715
$$ 672991 704678 734348 760775 783076 800726 813359 820546 821856 817260 807392 793239 775524
62567G75524k1010k4108k6597k8058k8456k8048k7015k5371k3267k1198j9644
$$ 775524 754514 730406 703809 675751 647295 619247 592232 566861 543594 522396 502752
62556E02752j8541j7400j6026j4743j3744j2630j1054r541q989r371r550q679
$$ 502752 484211 466811 450785 436042 422298 409668 398614 389073 380084 370713 361163 352484
62544C52484p254o355o232o121n286l808k312j310r33j007j183j092o28RN60J036
$$ 352484 345230 338875 332643 326522 321236 317428 315116 313806 312873 311866 310683 309591 308963 308972 309532 310568
62528C10568J655K426L013L191L362M221N776P046P139O437O219P157Q740J0198
$$ 310568 312223 314649 317662 320853 324215 328436 334212 341258 348397 354834 361053 368210 376950 387148
62514C87148J1462J2900J4624J6520J8603K0847K2911K4574K6295K8815L2160
$$ 387148 398610 411510 426134 442654 461257 482104 505015 529589 555884 584699 616859
62503F16859L5518L8123L9740M0223L9181L6500L2769K8725K4363J9003J2198
$$ 616859 652377 690500 730240 770463 809644 846144 878913 907638 932001 951004 963202
62492I63202M331l738j1347j8247k4322k9320l2947l5139l6082l5966l4900l3184
$$ 963202 967533 963795 952448 934201 909879 880559 847612 812473 776391 740425 705525 672341
62480F72341l1396k9903k8403k6340k3762k1369j9612j8105j6177j3674j1080
$$ 672341 640945 611042 582639 556299 532537 511168 491556 473451 457274 443600 432520
62469D32520q972p651o982o485n709m726l981l525k764j397j46j0q63j480j008
$$ 432520 423548 415897 408915 402430 396721 391995 388014 384489 381725 380328 380182 380172 379309 377829 376821
62454C76821J05Q85J013R54J242K012L007L776L870L214K279J678J548J490J102
$$ 376821 376926 377811 378824 379778 381020 383032 386039 389815 393685 396899 399178 400856 402404 403894 404996
62439D04996M35k32q35j586k577l562m220m554m835n265n829o408o751o441n259
$$ 404996 405431 405199 404364 402778 400201 396639 392419 387865 383030 377765 371936 365528 358777 352336 347077
62424C47077l661k466j950j619j063n33l00K8R11J996K540K626L054M094N055
$$ 347077 343416 340950 339000 337381 336318 335785 335485 335513 336424 338420 340960 343586 346640 350734 355789
62409C55789N406N488N827O309O626O985P830R043J0006J0284R929R147Q107O990
$$ 355789 361195 366683 372510 378819 385445 392430 400260 409303 419309 429593 439522 448669 456776 463766
62395D63766N919M836L682K576J685R12j0j236k647l893m555m439l838l315l087
$$ 463766 469685 474521 478203 480779 482464 483376 483366 482130 479483 475590 471035 466596 462758 459443 456356
62380D56356k862k337j586p83J17J178K334L670N518P918J0320J2291J4194J6681
$$ 456356 453494 451157 449571 448788 448905 450083 452417 456087 461605 469523 479843 492134 506328 523009
62366E23009J9699K2556K4888K7047K9509L2388L5659L9327M3246M6938M9845
$$ 523009 542708 565264 590152 617199 646708 679096 714755 754082 797328 844266 894111
62355H94111N1631N2252N1784N0171M7071M2185L5766K8535K0852J2453L287n774
$$ 894111 945742 997994 1049778 1099949 1147020 1189205 1224971 1253506 1274358 1286811 1290098 1284324
62343A284324j3579j9718k4336k7464k9299l0855l3206l6013l7745l7601l6336
$$ 1284324 1270745 1251027 1226691 1199227 1169928 1139073 1105867 1069854 1032109 994508 958172
62332I58172l4922l3338l1169k8613k6167k3891k1627j9547j7809j6086j4073
$$ 958172 923250 889912 858743 830130 803963 780072 758445 738898 721089 705003 690930
62321F90930j2190j0987j0069q424n911l633k556k315j846q00R2O4p78j681k160
$$ 690930 678740 667753 657684 649260 643349 639716 637160 634845 632999 632199 632291 632355 631577 629896 627736
62306F27736k355k592k940l398m176n393o632p240p084o660o405o334o403o722
$$ 627736 625381 622789 619849 616451 612275 606882 600250 593010 585926 579266 572861 566527 560124 553402
62292E53402p174p251o558n229l631k042p92k43k22Q6J256K920M342N375O334
$$ 553402 546228 538977 532419 527190 523559 521517 520725 520482 520260 520346 521602 524522 528864 534239 540573
62277E40573P231P743P852P937Q220Q705R567J1072J2920J4270J4697J4804J5615
$$ 540573 547804 555547 563399 571336 579556 588261 597828 608900 621820 636090 650787 665591 681206
62264F81206J7485J9904K2185K4135K6078K8401L1209L4401L7880M1482M4760
$$ 681206 698691 718595 740780 764915 790993 819394 850603 885004 922884 964366 1009126
62253A009126M7229M8852M9833M9767M7496M2346L5103K7226J9339J1124K559
$$ 1009126 1056355 1105207 1155040 1204807 1252303 1294649 1329752 1356978 1376317 1387441 1390000
62242A390000n485j2065j7012k0802k3977k6881k9509l1402l2022l1432l0271
$$ 1390000 1384515 1372450 1355438 1334636 1310659 1283778 1254269 1222867 1190845 1159413 1129142
62231A129142k8993k7439k5307k2632j9602j6298j2955j0107q068o485m781k926
$$ 1129142 1100149 1072710 1047403 1024771 1005169 988871 975916 965809 957741 951256 946475 943549
62219I43549j469q21q06q72o01j8N31P80R15J379K317L326L898L959L872M015
$$ 943549 942080 941259 940453 939581 938980 938962 939493 940273 941188 942567 944884 948210 952108 956067 959939 963954
62203I63954M498N143N680O048O481P198Q055Q782R517J0700J2314J3788J4825
$$ 963954 968452 973595 979275 985323 991804 999002 1007057 1015839 1025356 1036056 1048370 1062158 1076983
62190A076983J5904J7490J9207K0412K1256K2502K4306K5855K6393K6019K5237
$$ 1076983 1092887 1110377 1129584 1149996 1171252 1193754 1218060 1243915 1270308 1296327 1321564
62179A321564K4181K2692K0878J9175J7940J7225J6903J6782J6702J6752J7404
$$ 1321564 1345745 1368437 1389315 1408490 1426430 1443655 1460558 1477340 1494042 1510794 1528198
62168A528198J9185K2149K5775K9473L3089L6781M0401M3213M4356M3548M1145
$$ 1528198 1547383 1569532 1595307 1624780 1657869 1694650 1735051 1778264 1822620 1866168 1907313
62157A907313L7587L3120K8134K3381J9420J6071J2820R616O820M391J811j023
$$ 1907313 1944900 1978020 2006154 2029535 2048955 2065026 2077846 2087462 2094282 2098673 2100484 2099461
62145B099461l411m634m730m136l061j603r6J314L041N370P641Q947R576J0761
$$ 2099461 2096050 2091416 2086686 2082550 2079489 2077886 2077790 2079104 2082145 2087515 2095156 2104103 2113679 2124440
62131B124440J2798J4396J4441J3594J3412J4389J5799J7056J8236J9308J9857
$$ 2124440 2137238 2151634 2166075 2179669 2193081 2207470 2223269 2240325 2258561 2277869 2297726
62120B297726J9912K0262K1450K2991K4063K4549K4900K5248K5326K5180K5287
$$ 2297726 2317638 2337900 2359350 2382341 2406404 2430953 2455853 2481101 2506427 2531607 2556894
62109B556894K5811K6196K5883K5040K4283K3788K3129K2061K1020K0684K1206
$$ 2556894 2582705 2608901 2634784 2659824 2684107 2707895 2731024 2753085 2774105 2794789 2815995
62098B815995K2151K3021K3606K3931K4212K4910K6398K8406L0012L0292K8875
$$ 2815995 2838146 2861167 2884773 2908704 2932916 2957826 2984224 3012630 3042642 3072934 3101809
62087C101809K5867K1760J7645J4925J4232J4838J5622J6303J7132J7631J6668
$$ 3101809 3127676 3149436 3167081 3182006 3196238 3211076 3226698 3243001 3260133 3277764 3294432
62076C294432J3999J0861Q575P141N774M355L683M443O424Q744J0524J1419J1766
$$ 3294432 3308431 3319292 3327867 3335008 3340782 3345137 3348820 3353263 3359687 3368431 3378955 3390374 3402140
62063C402140J2079J2275J1601R588O711L734O96k917p128j1288j4894j8054k0981
$$ 3402140 3414219 3426494 3438095 3447683 3454394 3458128 3458824 3455907 3448779 3437491 3422597 3404543 3383562
62050C383562k3521k5516k7266k9333l1975l4878l7393l8971l9599l9917m0629
$$ 3383562 3360041 3334525 3307259 3277926 3245951 3211073 3173680 3134709 3095110 3055193 3014564
62039C014564m1716m2366m1812m0143l8057l6040l4024l1870k9877k8582k8123
$$ 3014564 2972848 2930482 2888670 2848527 2810470 2774430 2740406 2708536 2678659 2650077 2621954
62028B621954k8036k7831k7561k7568k7861k8078k8043k7899k7654k7145k6668
$$ 2621954 2593918 2566087 2538526 2510958 2483097 2455019 2426976 2399077 2371423 2344278 2317610
62017B317610k6997k8212k9047k8190k6013k4170k3491k3148k2027k0104j8030
$$ 2317610 2290613 2262401 2233354 2205164 2179151 2154981 2131490 2108342 2086315 2066211 2048181
62006B048181j6053j3959j1664r338p118n133l650k772k228j771j645k292l802
$$ 2048181 2032128 2018169 2006505 1997167 1990049 1984916 1981266 1978494 1976266 1974495 1972850 1970558 1966756
61993A966756n992q925j2882j7741k2773k7138l0432l2759l4414l5540l5985l5591
$$ 1966756 1960764 1951839 1938957 1921216 1898443 1871305 1840873 1808114 1773700 1738160 1702175 1666584
61981A666584l4570l3376l2047l0103k7410k4741k2915k1685k0136j8148j6610
$$ 1666584 1632014 1598638 1566591 1536488 1509078 1484337 1461422 1439737 1419601 1401453 1384843
61970A384843j6046j5776j4867j3394j2115j1275j0374q987p357n974m976m067
$$ 1384843 1368797 1353021 1338154 1324760 1312645 1301370 1290996 1282009 1274652 1268678 1263702 1259635
61958A259635k890j405KQ79J305J971L509N804Q211J0359J2425J4642J6907J9037
$$ 1259635 1256745 1255340 1255342 1256221 1257526 1259497 1263006 1268810 1277021 1287380 1299805 1314447 1331354 1350391
61944A350391K1163K3680K6826L0410L3983L7246M0324M3527M6864M9911N2296
$$ 1350391 1371554 1395234 1422060 1452470 1486453 1523699 1564023 1607550 1654414 1704325 1756621
61933A756621N4124N5741N7253N8582N9792O1023O2212O3272O4540O6544O9356
$$ 1756621 1810745 1866486 1923739 1982321 2042113 2103136 2165348 2228620 2293160 2359704 2429060
61922B429060P2624P6353Q1126Q7480R5585J05858J19186J36135J56372J79390
$$ 2429060 2501684 2578037 2659163 2746643 2842228 2948086 3067272 3203407 3359779 3539169
61912C539169K05346K34731K67676L04235L44949L90335M40086M93499N50474
$$ 3539169 3744515 3979246 4246922 4551157 4896106 5286441 5726527 6220026 6770500
61903F770500O11060O73850P35431P91273Q36051Q62809Q62885Q27698P50846
$$ 6770500 7381560 8055410 8790841 9582114 10418165 11280974 12143859 12971557 13722403
61894A3722403O29363M65051K66215M7701j72299l76594n51648o88379p82838
$$ 13722403 14351766 14816817 15083032 15130733 14958434 14581840 14030192 13341813 12558975
61885A2558975q36483q54760q44517q12497p65394p09700o50579n91115n33053
$$ 12558975 11722492 10867732 10023215 9210718 8445324 7735624 7085045 6493930 5960877
61876E960877m77912m27094l81245l40081l02968k69428k39215k12178j88253
$$ 5960877 5482965 5055871 4674626 4334545 4031577 3762149 3522934 3310756 3122503
61867C122503j67359j49121j32778j17579j03364r0524p9236o8965n8970m9089
$$ 3122503 2955144 2806023 2673245 2555666 2452302 2361778 2282542 2213577 2154607 2105518
61857B105518l9669l0880k2555j4707p602j160N136J1453J7199K1761K5221K7912
$$ 2105518 2065849 2034969 2012414 1997707 1990105 1988945 1994081 2005534 2022733 2044494 2069715 2097627
61845B097627K9616K9750K8208K5414K1685J6999J1442N591L02l712o236p575
$$ 2097627 2127243 2156993 2185201 2210615 2232300 2249299 2260741 2266332 2266634 2262922 2256686 2249111
61833B249111q073p520n363j619K779O900J0599J4050J6957J8737J9085J7771
$$ 2249111 2241038 2233518 2228155 2226536 2229315 2236215 2246814 2260864 2277821 2296558 2315643 2333414
61821B333414J4318Q747K380l025o956j0199j3214j5380j6055j5486j4147j1838
$$ 2333414 2347732 2356479 2358859 2355834 2348878 2338679 2325465 2310085 2294030 2278544 2264397 2252559
61809B252559q059k926K875Q869J5139K1921K9179L6544M3602N0300N7088O4509
$$ 2252559 2244500 2241574 2244449 2253318 2268457 2290378 2319557 2356101 2399703 2450003 2507091 2571600
61797B571600P2673Q1303R0210R9458J09122J19278J30294J42837J57455J74357
$$ 2571600 2644273 2725576 2815786 2915244 3024366 3143644 3273938 3416775 3574230 3748587
61787C748587J93558K15063K38998K65924K96952L33152L74857M22013M75157
$$ 3748587 3942145 4157208 4396206 4662130 4959082 5292234 5667091 6089104 6564261
61778F564261N35580O04509O82473P69502Q65347R69242J079610J193716J306819
$$ 6564261 7099841 7704350 8386823 9156325 10021672 10990914 12070524 13264240 14571059
61769A4571059J411120J495695J547327J551422J493199J360461J147604Q58818
$$ 14571059 15982179 17477874 19025201 20576623 22069822 23430283 24577887 25436705
61761B5436705N09000J22673k69321o35676r51178j200290j376608j480930j520203
$$ 25436705 25945705 26068378 25799057 25163381 24212203 23011913 21635305 20154375 18634172
61752A8634172j506174j452416j371284j273029j166282j057929r52479q52570
$$ 18634172 17127998 15675582 14304298 13031269 11864987 10807058 9854579 9002009
61744I002009p60203o77025o03532n38780m81229m29680l83607l42985l07748
$$ 9002009 8241806 7564781 6961249 6422469 5941240 5511560 5127953 4784968 4477220
61735D477220k77110k49576k24025k00584j80026j62447j47041j33021j20199
$$ 4477220 4200110 3950534 3726509 3525925 3345899 3183452 3036411 2903390 2783191
61726B783191j08545r7806q7753p8525p0510o3999n9048n5532n3251n1995n1496
$$ 2783191 2674646 2576840 2489087 2410562 2340052 2276053 2217005 2161473 2108222 2056227 2004731
61715B004731n1272n0656m9213m7085m4846m3000m1544l9925l7560l4579l1893
$$ 2004731 1953459 1902803 1853590 1806505 1761659 1718659 1677115 1637190 1599630 1565051 1533158
61704A533158l0157k8924k7403k5840k5249k5618k5543k4138k2406k1800k2198
$$ 1533158 1503001 1474077 1446674 1420834 1395585 1369967 1344424 1320286 1297880 1276080 1253882
61693A253882k2302k1622k0861k0518k0149j9173j7632j5912j4440j3653j3692
$$ 1253882 1231580 1209958 1189097 1168579 1148430 1129257 1111625 1095713 1081273 1067620 1053928
61682A053928j3933j3490j2308j1172j0518r869q762p594p116p447q011q219p818
$$ 1053928 1039995 1026505 1014197 1003025 992507 982638 973876 966282 959166 951719 943708 935489 927671
61669I27671o823n370l706k163j168j089j853k820l381l696m412n615o574o707
$$ 927671 920848 915478 911772 909609 908441 907352 905499 902679 899298 895602 891190 885575 879001 872294
61655H72294o322o080n991n476m265k864j980j704j515r82l10n7l50p16p14n13
$$ 872294 865972 859892 853901 848425 844160 841296 839316 837612 836097 835115 834805 834748 834398 833682 832968 832455
61639H32455o18j205k014k797l531m126m230l512k116o57L21R34J865L499N287
$$ 832455 831837 830632 828618 825821 822290 818164 813934 810422 808306 807649 807970 808904 810769 814268 819555
61624H19555O330O423O109N666M712L009R69j013l135n597p961r746j1143j2436
$$ 819555 825885 832308 838417 844083 848795 851804 852773 851760 848625 843028 835067 825321 814178 801742
61610H01742j3109j2476j0896r468q579p700o602n850n768n846n546n087m951
$$ 801742 788633 776157 765261 755793 747214 739514 732912 727062 721294 715448 709902 704815 699864
61597F99864n120n234n073m505l390j895o55j91l10l06K84J352K398L054L485
$$ 699864 694744 689510 684437 679932 676542 674647 673992 673801 673491 673185 673469 674821 677219 680273 683758
61582F83758M297N843P778R511J0947J2384J3912J5381J6850J8545K0389K2227
$$ 683758 688055 693898 701676 711187 722134 734518 748430 763811 780661 799206 819595 841822
61570H41822K4358K7130L0026L2022L3024L4094L5928L7904L9078L9313L8916
$$ 841822 866180 893310 923336 955358 988382 1022476 1058404 1096308 1135386 1174699 1213615
61559A213615L7943L6508L5136L4052L2627L0408K8159K7000K6720K5993K4161
$$ 1213615 1251558 1288066 1323202 1357254 1389881 1420289 1448448 1475448 1502168 1528161 1552322
61548A552322K1908J9948J7960J5218J1691Q013M639J454j860n383q905j2164
$$ 1552322 1574230 1594178 1612138 1627356 1639047 1647060 1651699 1653153 1651293 1645910 1637005 1624841
61536A624841j5018j7375j9036j9832j9904j9545j8687j6881j4036j0797p821
$$ 1624841 1609823 1592448 1573412 1553580 1533676 1514131 1495444 1478563 1464527 1453730 1445909
61525A445909m911j336L115P857J2287J6431K0727K5504L0806L6564M2739M9387
$$ 1445909 1440998 1439662 1442777 1450634 1462921 1479352 1500079 1525583 1556389 1592953 1635692 1685079
61513A685079N6625O4529P3197Q2939R4150J06873J20687J35307J51086J68600
$$ 1685079 1741704 1806233 1879430 1962369 2056519 2163392 2284079 2419386 2570472 2739072
61503B739072J87847K08226K29153K50217K70623K88800L02676L10067L08742
$$ 2739072 2926919 3135145 3364298 3614515 3885138 4173938 4476614 4786681 5095423
61494E095423K96630K72447K36242J89370J34206P3984J2647m5733r7725j41094
$$ 5095423 5392053 5664500 5900742 6090112 6224318 6298302 6310949 6265216 6167491 6026397
61484F026397j74867j99148k14765k22819k24379k20459k12099k00294j85813
$$ 6026397 5851530 5652382 5437617 5214798 4990419 4769960 4557861 4357567 4171754
61475D171754j69242j51265j32799j14709r7407q0895o5139n0180l5857k1794
$$ 4171754 4002512 3851247 3718448 3603739 3506332 3425437 3360298 3310118 3274261 3252467
61465C252467p967M876J5799K4712L2584M0422M8247N5146O0238O3356O4890O5156
$$ 3252467 3244500 3249376 3265175 3289887 3322471 3362893 3411140 3466286 3526524 3589880 3654770 3719926
61453C719926O4138O1852N8846N6040N3988N2508N1258N0455N0744N2408N5094
$$ 3719926 3784064 3845916 3904762 3960802 4014790 4067298 4118556 4169011 4219755 4272163 4327257
61442D327257N8258O1488O4266O5916O6099O5092O3238O0272N5571M9008M1119
$$ 4327257 4385515 4447003 4511269 4577185 4643284 4708376 4771614 4831886 4887457 4936465 4977584
61431D977584L2421K2877J2337J268r336j8826k7349l5343m2723m8855n3165n5557
$$ 4977584 5010005 5032882 5045219 5046487 5037151 5018325 4990976 4955633 4912910 4864055 4810890 4755333
61419D755333n6205n5288n3014m9632m5286m0006l3974k7601k1281j5260r816
$$ 4755333 4699128 4643840 4590826 4541194 4495908 4455902 4421928 4394327 4373046 4357786 4347970
61408D347970n270j733Q13K094J682k87k989n944r518j3953j8362k1469k2996
$$ 4347970 4342700 4340967 4341780 4343874 4345556 4345269 4342280 4336336 4326818 4312865 4294503 4273034 4250038
61395D250038k3417k2575j9418j3280m639N627J7228L0488M5955O4098Q4881J07458
$$ 4250038 4226621 4204046 4184628 4171348 4166709 4172336 4189564 4220052 4266007 4330105 4414986 4522444
61383D522444J30788J54666J79677K05966K32574K58194K82052L03653L21912
$$ 4522444 4653232 4807898 4987575 5193541 5426115 5684309 5966361 6270014 6591926
61374F591926L34779L39585L33835L16047K86117K44889J93794J35364P3577J2705
$$ 6591926 6926705 7266290 7600125 7916172 8202289 8447178 8640972 8776336 8849913 8862618
61364H862618m4387r6363j42358j81754k14899k42674k64988k80789k90034k94528
$$ 8862618 8818231 8721868 8579510 8397756 8182857 7940183 7675195 7394406 7104372 6809844
61354F809844k96074k94680k89338k79889k67314k52780k37245k21483k05765
$$ 6809844 6513770 6219090 5929752 5649863 5382549 5129769 4892524 4671041 4465276
61345D465276j89728j73128j56343j39790j23478j07634r3046p9942o7260n3909
$$ 4465276 4275548 4102420 3946077 3806287 3682809 3575175 3482129 3402187 3334927 3281018
61335C281018m0311k7694j6393n789M370J3754K2375L0644L8423M4923M9719N3163
$$ 3281018 3240707 3213013 3196620 3190831 3195201 3208955 3231330 3261974 3300397 3345320 3395039 3448202
61323C448202N5662N7213N7730N7209N5513N2476M8313M3561L8695L4211L0768
$$ 3448202 3503864 3561077 3618807 3676016 3731529 3784005 3832318 3875879 3914574 3948785 3979553
61312C979553K8626K7167K5493K3274K0462J6574J1173M780j638p946j4624k1402
$$ 3979553 4008179 4035346 4060839 4084113 4104575 4121149 4132322 4137102 4135464 4127518 4112894 4091492
61300D091492k7274l2005l6435m0999m5056m8182n1040n4294n7548o0102o2046
$$ 4091492 4064218 4032213 3995778 3954779 3909723 3861541 3810501 3756207 3698659 3638557 3576511
61289C576511o3640o4238o2827n9459n5251n0907m6042m0079l3298k6652k0873
$$ 3576511 3512871 3448633 3385806 3326347 3271096 3220189 3174147 3134068 3100770 3074118 3053245
61278C053245j6080j2105q920o685n523n391o105p308q408q838q546q030p603
$$ 3053245 3037165 3025060 3016140 3009455 3003932 2998541 2992436 2985128 2976720 2967882 2959336 2951306 2943703
61265B943703o960n727m130k703j569m50P95K284M605Q637J4815K2992L2991M4777
$$ 2943703 2936743 2931016 2926886 2924183 2922614 2922164 2922959 2925243 2929848 2938485 2953300 2976292 3009283 3054060
61251C054060N8156P2755Q8268J04133J19111J31882J42053J49772J54256J53477
$$ 3054060 3112216 3184971 3273239 3377372 3496483 3628365 3770418 3920190 4074446 4227923
61241D227923J45591J29962J06546P5302L6997n912m9833r1295j27511j56438
$$ 4227923 4373514 4503476 4610022 4685324 4722321 4716409 4666576 4575281 4447770 4291332
61231D291332j77273j90633j97648j98903j94691j85988j74555j61938j48886
$$ 4291332 4114059 3923426 3725778 3526875 3332184 3146196 2971641 2809703 2660817
61222B660817j35666j22513j09624r7117q5289p4813o6331n9813n4409m9097m3516
$$ 2660817 2525151 2402638 2293014 2195897 2110608 2035795 1969464 1909651 1855242 1806145 1762629
61211A762629l8036l3006k8137k2891j7238j1666o459j467L446Q070J2114J5464
$$ 1762629 1724593 1691587 1663450 1640559 1623321 1611655 1605196 1603729 1607175 1615245 1627359 1642823
61199A642823J8014J9466J9524J8131J5429J1691P332K834j407n016p585q980
$$ 1642823 1660837 1680303 1699827 1717958 1733387 1745078 1752410 1755244 1753837 1748821 1741236 1732256
61187A732256r722j0599j1966j3671j5646j8102k0996k3769k5835k7004k7315
$$ 1732256 1722534 1711935 1699969 1686298 1670652 1652550 1631554 1607785 1581950 1554946 1527631
61176A527631k6813k5763k4735k4181k4058k4072k4097k4092k3813k2894k1334
$$ 1527631 1500818 1475055 1450320 1426139 1402081 1378009 1353912 1329820 1306007 1283113 1261779
61165A261779j9756j9018j9373k0037j9833j8338j6168j4099j2348j0904r992
$$ 1261779 1242023 1223005 1203632 1183595 1163762 1145424 1129256 1115157 1102809 1091905 1081913
61154A081913r661r445r140r522j1488j4706j7978k0696k3002k4592k4557k2710
$$ 1081913 1072252 1062807 1053667 1044145 1032657 1017951 999973 979277 956275 931683 907126 884416
61142H84416k0047j7472j4909j2158r741q203p134n688l729j914q00k83K46J293
$$ 884416 864369 846897 831988 819830 810089 801886 794752 789064 785335 783421 782621 782338 782584 783877
61128G83877K694L580L358K591K349K723K776K116J553J792K348K389J982J754
$$ 783877 786571 790151 793509 796100 798449 801172 803948 806064 807617 809409 811757 814146 816128 817882
61114H17882J895K151K473L061L949M935N554M965K414j735n983r093j1109j2619
$$ 817882 819777 821928 824401 827462 831411 836346 841900 846865 849279 847544 841561 832468 821359 808740
61100H08740j3788j4529j4965j5031j4275j2713j1263j0654j0453j0008r679j0142
$$ 808740 794952 780423 765458 750427 736152 723439 712176 701522 691069 681061 671382 661240
61088F61240j1001j1164j0426r574r007q259o995n642m779m539m702m905m700
$$ 661240 650239 639075 628649 619075 610068 601809 594814 589172 584393 579854 575152 570247 565547
61075E65547l893k736j509q9J556K839L184K873K662K712K743K915L678M708N055
$$ 565547 561654 558918 557409 557320 558876 561715 564899 567772 570434 573146 575889 578804 582482 587190 592245
61060E92245M487L875L932M278M187L635L163L094L303L602L919M250M596M966
$$ 592245 596732 600607 604539 608817 613004 616639 619802 622896 626199 629801 633720 637970 642566 647532
61046F47532N314N538N571N555N903O990Q495R375Q954Q005P947Q977R804R501
$$ 647532 652846 658384 663955 669510 675413 682403 690898 700273 709227 717232 725179 734156 743960 753461
61032G53461Q687Q462Q998R850J0708J1243J0943R919R141R138R273R060R150
$$ 753461 762148 770610 779608 789458 800166 811409 822352 832271 841412 850550 859823 868883 878033
61019H78033R956J0441R662Q583Q740R881J0702J1293J2838J5267J7360J9127
$$ 878033 887989 898430 908092 916675 925415 935296 945998 957291 970129 985396 1002756 1021883
61007A021883K1969K6255L0703L4621L8836M3880M9017N3659N7987O1670O3807
$$ 1021883 1043852 1070107 1100810 1135431 1174267 1218147 1267164 1320823 1378810 1440480 1504287
60996A504287O5007O7739P3746Q2648R3662J06789J21367J35593J48881J63046
$$ 1504287 1569294 1637033 1710779 1793427 1887089 1993878 2115245 2250838 2399719 2562765
60986B562765J80069K00713K26574K61199L07405L65746M37496N26733O37534
$$ 2562765 2742834 2943547 3170121 3431320 3738725 4104471 4541967 5068700 5706234
60977E706234P72582R37235J140417J386366J670249J987906K337708K686527
$$ 5706234 6478816 7416051 8556468 9942834 11613083 13600989 15938697 18625224
60969A8625224K925993K893486K482508J753268R23056K31863j87726l24692k21926
$$ 18625224 21551217 24444703 26927211 28680479 29603535 29835398 29647672 29322980 29101054
60960B9101054N5517L82412N58356L96197j44809r17985j687573k270540k601523
$$ 29101054 29156571 29538983 30097339 30493536 30348727 29430742 27743169 25472629 22871106
60951B2871106k702461k626070k427802k160893j870589j586774j325138j094052
$$ 22871106 20168645 17542575 15114773 12953880 11083291 9496517 8171379 7077327
60943G077327q97380p33846n99119m89616m02865l35525k83612k44217k14953
$$ 7077327 6179947 5446101 4846982 4357366 3954501 3618976 3335364 3091147 2876194
60934B876194j92301j72727j55133j40349j28236j17018j05467r4026q3495p4080
$$ 2876194 2683893 2511166 2356033 2215684 2087448 1970430 1864963 1770937 1687442 1613362
60924A613362o6124o0399n6992n4845n2931n1079m9333m7257m4411m0931l7174
$$ 1613362 1547238 1486839 1429847 1375002 1322071 1270992 1221659 1174402 1129991 1089060 1051886
60913A051886l3278k9376k5773k2648j9934j7714j6254j5382j4391j2926j1563
$$ 1051886 1018608 989232 963459 940811 920877 903163 886909 871527 857136 844210 832647
60902H32647j1013j1149j1236j0989j0869j1318j2112j2602j2403j1747j1108
$$ 832647 821634 810485 799249 788260 777391 766073 753961 741359 728956 717209 706101
60891G06101j0640j0008q857p299n848m898m427m215m106m073m072m005l719l118
$$ 706101 695461 685453 676596 669297 663449 658551 654124 649909 645803 641730 637658 633653 629934 626816
60877F26816k278j401o37n5K36J62m3J08P88J600K183K757L720M959O031O891
$$ 626816 624538 623137 622500 622445 622681 622843 622800 622908 623696 625296 627479 630236 633956 638915 644946 651837
60861F51837P841Q808R355R486R814J0592J1170J0850R936R388R694J0554J1460
$$ 651837 659678 668486 677841 687327 697141 707733 718903 729753 739689 749077 758771 769325 780785
60848G80785J2069J2096J1409J0412R885J0192J0869J1160J0811R996Q665O385
$$ 780785 792854 804950 816359 826771 836656 846848 857717 868877 879688 889684 898349 904734
60836I04734K915j240n103p987r850j0997j1678j2048j2222j2177j1805j1245
$$ 904734 907649 906409 901306 893319 883469 872472 860794 848746 836524 824347 812542 801297
60824H01297j1050j1609j2513j2820j2051j0614r177p926o648n220l808k622j690
$$ 801297 790247 778638 766125 753305 741254 730640 721463 713537 706889 701669 697861 695239 693549
60811F93549q46J73J509K964M098M636M776N017N711O788P833Q523R035R839J0945
$$ 693549 692703 692876 694385 697349 701447 706083 710859 715876 721587 728375 736208 744731 753766 763605 774550
60796G74550J1614J1246J0253R564R329Q872P909O940O198N122L497K205K048
$$ 774550 786164 797410 807663 817227 826556 835428 843337 850277 856475 861597 865094 867299 869347
60783H69347K412K128J248Q32J205J529J215P59Q22J279J593J533J231R69J113
$$ 869347 871759 873887 875135 875967 877172 878701 879916 880675 881497 882776 884369 885902 887133 888102 889215
60768H89215J741K265J963J010K81K4m82j640k781l239l394l977m973n921o737
$$ 889215 890956 893221 895184 896194 896475 896499 896017 894377 891596 888357 884963 880986 876013 870092 863355
60753H63355p434p483o358m471k847j937j454j127q80m30M61J341J431O95j65
$$ 863355 855921 848438 842080 837609 834762 832825 831371 830244 829364 828934 829395 830736 832167 832862 832697
60738H32697q57j842l295m482m673m195m067m800n896o449n991m875l873l379
$$ 832697 831840 829998 826703 822221 817548 813353 809286 804486 798590 792141 786150 781275 777402 774023
60724G74023l055k461j734j287j028m30N49J285J322Q78K97m57j476k544l495
$$ 774023 770968 768507 766773 765486 764458 764028 764577 765862 767184 768062 768359 767902 766426 763882 760387
60709G60387m621o308q420j0338j1538j1943j1903j1920j2236j2615j2655j2333
$$ 760387 755766 749458 741038 730700 719162 707219 695316 683396 671160 658545 645890 633557
60697F33557j1893j1254j0112q657p613p228o822n826m722m330m461m105k793
$$ 633557 621664 610410 600298 591641 584028 576800 569978 564152 559430 555100 550639 546534 543741
60684E43741j125J09P38R47Q69O96P90J299J866K026J797J648J973K810M046N648
$$ 543741 542616 542725 543463 544410 545279 545975 546765 548064 549930 551956 553753 555401 557374 560184 564230 569878
60668E69878P571R488J0793J1061J0542J0082J0393J1364J2186J2209J1561J0964
$$ 569878 577449 586937 597730 608791 619333 629415 639808 651172 663358 675567 687128 698092
60656F98092J0929J1297J1497J1259J0904J0926J1434J2126J2721J3183J3491
$$ 698092 709021 720318 731815 743074 753978 764904 776338 788464 801185 814368 827859
60645H27859J3474J2996J2115J0896R244P097M636K085o02l532o349q275q931
$$ 827859 841333 854329 866444 877340 886584 893681 898317 900402 899800 896268 889919 881644 872713
60632H72713q998r678j1438j3507j4762j4955j4803j4922j5082j4625j3425j2071
$$ 872713 863715 854037 842599 829092 814330 799375 784572 769650 754568 739943 726518 714447
60620G14447j1232j1042j1077j0749r723q193o701n619m827m023l169k333j274
$$ 714447 703215 692173 681096 670347 660624 652431 645730 640111 635284 631261 628092 625759 624485
60607F24485M15K695M964O698P906Q939J0069J1353J2677J3817J4596J4958J4755
$$ 624485 624900 627595 632559 639257 647163 656102 666171 677524 690201 704018 718614 733572 748327
60594G48327J3653J1617R358P809P099O604N986N537N342M892L942L023K484J666
$$ 748327 761980 773597 782955 790764 797863 804467 810453 815990 821332 826224 830166 833189 835673 837339
60580H37339j77k587m497n834p600j0254j2959j4672j5256j5189j4796j4247j3816
$$ 837339 837162 834575 830078 824244 816644 806390 793431 778759 763503 748314 733518 719271 705455
60567G05455j3632j3407j2816j1949j1086j0181q982p465n937m767m217m358m866
$$ 705455 691823 678416 665600 653651 642565 632384 623402 615937 610000 605233 601016 596658 591792
60554E91792n034m319k920j537n73J84J065J991K588K725K736L068L851M816N760
$$ 591792 586758 582439 579519 577982 577409 577593 578658 580649 583237 585962 588698 591766 595617 600433 606193
60539F06193O915Q747J1293J3987J6373J8788K1947K5930L0092L4028L8059M2254
$$ 606193 613108 621855 633148 647135 663508 682296 704243 730173 760265 794293 832352 874606
60527H74606M5474M6122M3639L8537L1072K0949Q693l569j3539k0462k4801k6786
$$ 874606 920080 966202 1009841 1048378 1079450 1100399 1109092 1105523 1091984 1071522 1046721 1019935
60515A019935k6337k4080k1241j8340j4999j1267q092o047m537k961j784j572
$$ 1019935 993598 969518 948277 929937 914938 903671 895579 889532 884995 882034 880250 878678
60503H78678j684r37Q30K860M889P352J0354J3546J7097K1702K7330L2979L8106
$$ 878678 876994 876057 876887 879747 884636 891988 902342 915888 932985 954687 982017 1014996 1053102
60490A053102M3307M8967N4103N7367N8655N8897N8750N8379N8309N9649O3439
$$ 1053102 1096409 1145376 1199479 1256846 1315501 1374398 1433148 1491527 1549836 1609485 1672924
60479A672924P0448Q1498R7296J17833J42490J70804K02418K35970K68386K95260
$$ 1672924 1743372 1824870 1922166 2039999 2182489 2353293 2555711 2791681 3060067 3355327
60469C355327L11486L11777K91734K49562J86972J08518K0430o9922j54522k26088
$$ 3355327 3666813 3978590 4270324 4519886 4706858 4815376 4835806 4765884 4611362 4385274
60459D385274k79588l12815l26176l22476l06366k82854k55685k27103j98774
$$ 4385274 4105686 3792871 3466695 3144219 2837853 2554999 2299314 2072211 1873437
60450A873437j72286j48650j27897j09602r3606p9978o8551n8759n0003m2096
$$ 1873437 1701151 1552501 1424604 1315002 1221396 1141418 1072867 1014108 964105 922009
60440I22009l5389l0375k6986k4382k1713j9073j7255j6566j6282j5538j4272
$$ 922009 886620 856245 829259 804877 783164 764091 746836 730270 713988 698450 684178
60429F84178j3032j2109j1347j0522r540q335p082o299o277o441n847m423l129
$$ 684178 671146 659037 647690 637168 627628 619293 612211 605912 599635 593194 587347 582924 579795
60416E79795k626k351j505m71m37j567k463j843k63O32K50l24N0J161K112K725
$$ 579795 577169 574818 573313 572842 572405 570838 568375 566532 566269 566901 567151 566827 566877 568038 570150 572875
60400E72875L499M426M825M407L836L835M282M616M698M842N172N399N204M626
$$ 572875 576374 580800 585625 590032 593868 597703 601985 606601 611299 616141 621313 626712 631916 636542
60386F36542M054L891M098M009K991J293j05p10j022j588k114k135k012k527l600
$$ 636542 640596 644487 648585 652594 655585 656878 656773 656063 655041 653453 651339 649204 647192 644665 641065
60371F41065m233l749k524j382p18l29K80J434K808L524L104K212J908K322K720
$$ 641065 636832 633083 630559 629177 628459 628130 628410 629844 632652 636176 639280 641492 643400 645722 648442
60356F48442K812L178M120M947M918M396M385N170N955N907N127M445M402M684
$$ 648442 651254 654432 658552 663499 668417 672813 677198 682368 688323 694230 699357 703802 708204 712888
60342G12888M682M401M346M494M014K548J117R64J759J941Q39n65j120q76n48
$$ 712888 717570 721971 726317 730811 734825 737373 738490 739454 741213 743154 743993 743428 742308 741432 740884
60327G40884m35l43m0O53J746K656K558J479N13M24N99l1j525k939l459k995j984
$$ 740884 740449 740106 740066 740719 742465 745121 747679 749158 749671 750095 750694 750663 749138 746199 742740 739745 737761
60310G37761j132r97j372j375o00K93N86N28P28J055R57N57M16M99K92n4L40J781
$$ 737761 736629 735632 734260 732885 732285 732578 733164 733692 734420 735475 736432 736989 737405 737904 738196 738142 738482 740263
60292G40263L495M650N267N765O167O142N451M223L000K564L220M195M294L276
$$ 740263 743758 748408 753675 759440 765607 771749 777200 781423 784423 786987 790207 794402 798696 801972
60278H01972K127J849K497L548M566N186N042M313L894M455N604O535P164Q001
$$ 801972 804099 805948 808445 811993 816559 821745 826787 831100 834994 839449 845053 851588 858752 866753
60264H66753R057R762J0067J0843J2663J4845J6329J7162J8329K0251K2268K3867
$$ 866753 875810 885572 895639 906482 919145 933990 950319 967481 985810 1006061 1028329 1052196
60252A052196K5667K8605L2652L6962M1098M5455N0574N6602O3435P0836P8349
$$ 1052196 1077863 1106468 1139120 1176082 1217180 1262635 1313209 1369811 1433246 1504082 1582431
60241A582431Q5586R2773J00538J09033J17725J26125J34130J41416J47048J50165
$$ 1582431 1668017 1760790 1861328 1970361 2088086 2214211 2348341 2489757 2636805 2786970
60231B786970J50639J48677J44090J36403J25521J11993R6669Q0314O3274M5451
$$ 2786970 2937609 3086286 3230376 3366779 3492300 3604293 3700962 3781276 3844550 3890001
60221C890001K6833Q122r577k5678m0119n2400o1427o6740o9120o9276o6661o0377
$$ 3890001 3916834 3924956 3915379 3889701 3849582 3797182 3735755 3669015 3599895 3530619 3463958 3403581
60209C403581n0839l9553k7466j4383N5J5612L1774M8164O4568Q0938R7365J13715
$$ 3403581 3352742 3313189 3285723 3271340 3271395 3287007 3318781 3366945 3431513 3512451 3609816 3723531
60197C723531J29323J43294J54860J63086J66653J64685J57630J46660J32330
$$ 3723531 3852854 3996148 4151008 4314094 4480747 4645432 4803062 4949722 5082052
60188E082052J14440R3088O9207M3934J8077p733l2904n6994p9457r9236j15000
$$ 5082052 5196492 5289580 5358787 5402721 5420798 5413065 5380161 5323167 5243710 5144474 5029474
60177E029474j25993j32291j34360j32586j27192j18189j05508q9507p1224n1753
$$ 5029474 4903481 4771190 4636830 4504244 4377052 4258863 4153355 4063848 3992624 3940871
60167C940871l1476j0256J1790L4114N5919P6149R3587J07526J17856J23977J24290
$$ 3940871 3909395 3899139 3910929 3945043 4000962 4077111 4170698 4278224 4396080 4520057 4644347
60156D644347J17750J05471Q9718P1647N1337K9758R082r312k5655m0024n1038
$$ 4644347 4762097 4867568 4957286 5028933 5080270 5110028 5119110 5109798 5084143 5044119 4993081
60145D993081n7201n8534n5964m9815l9862k6457j0621O741K5229M4764O5637
$$ 4993081 4935880 4877346 4821382 4771567 4731705 4705248 4694627 4701368 4726597 4771361 4836998
60134D836998Q8539J13906J41317J69904J99289K29814K61904K95454L29673L63347
$$ 4836998 4925537 5039443 5180760 5350664 5549953 5779767 6041671 6337125 6666798 7030145
60124G030145L95305M24672M50563M71605M86130M92863M91127M80433M60314
$$ 7030145 7425450 7850122 8300685 8772290 9258420 9751283 10242410 10722843 11183157
60115A1183157M30781L92502L46399K93248K33781J68855R9557K7408m5675j17985
$$ 11183157 11613938 12006440 12352839 12646087 12879868 13048723 13148280 13175688 13130013 13012028
60105A3012028j88374k55399l16338l67837m07643m35131m50220m52786m43325
$$ 13012028 12823654 12568255 12251917 11884080 11476437 11041306 10591086 10138300 9694975
60096I694975m23395l94938l59691l19415k75925k30439j83497j35841q8867m4001
$$ 9694975 9271580 8876642 8516951 8197536 7921611 7691172 7507675 7371834 7282967 7238966
60086G238966k217L5659O8926R7492J21487J40043J51242J53846J48277J35516
$$ 7238966 7236749 7272408 7341334 7438826 7560313 7700356 7851598 8005444 8153721 8289237
60076H289237J16005R0427O0709K9177k847l4755o5484r3596j18438j40402j60093
$$ 8289237 8405242 8495669 8556378 8585555 8582708 8547953 8482469 8388873 8270435 8130033 7969940
60065G969940j77710j93074k05729k15051k20717k22908k21762k16919k08002
$$ 7969940 7792230 7599156 7393427 7178376 6957659 6734751 6512989 6296070 6088068
60056F088068j95323j79703j61895j42441j21724r9850p6810n3056k9438o226
$$ 6088068 5892745 5713042 5551147 5408706 5286982 5187132 5110322 5057266 5027828 5021602
60046E021602J7193M1230O5295Q8509J10599J31327J49573J63773J72967J76836
$$ 5021602 5038795 5080025 5145320 5233829 5344428 5475755 5625328 5789101 5962068 6138904
60036F138904J75061J67300J53546J34077J09415Q0776M9938J7971j5247m9542
$$ 6138904 6313965 6481265 6634811 6768888 6878303 6959079 7009017 7026988 7011741 6962199
60026F962199q3202j14106j41446j65170j84379j97668k04807k06584k03133j93961
$$ 6962199 6878997 6764891 6623445 6458275 6273896 6076228 5871421 5664837 5461704 5267743
60016E267743j79824j62903j44578j24343j01818p8423n5945l4264j1867J1857
$$ 5267743 5087919 4925016 4780438 4656095 4554277 4475854 4419909 4385645 4373778 4385635
60006D385635L6067O0094Q4406J09609J35400J60917J85538K08685K29095K44997
$$ 4385635 4421702 4481796 4566202 4675811 4811211 4972128 5157666 5366351 5595446 5840443
59996E840443K55040K58643K55329K44224K24752J97658J64887J28458Q9762M9783
$$ 5840443 6095483 6354126 6609455 6853679 7078431 7276089 7440976 7569434 7659196 7708979
59986G708979R380l0861p0467j08463j43219j73085j96903k13750k22835k24010
$$ 7708979 7718359 7687498 7617031 7508568 7365349 7192264 6995361 6781611 6558776 6334766
59976F334766k18003k05818j88246j66217j41048j13900q5437n6446k8246j827
$$ 6334766 6116763 5910945 5722699 5556482 5415434 5301534 5216097 5159651 5131405 5129578
59966E129578K2879M6278O8066Q7647J05070J20690J34106J44389J51208J54833
$$ 5129578 5152457 5198735 5266801 5354448 5459518 5580208 5714314 5858703 6009911 6164744
59956F164744J55085J51163J42724J30448J15380R8360Q0234O1966M4287K7683
$$ 6164744 6319829 6470992 6613716 6744164 6859544 6957904 7038138 7100104 7144391 7172074
59946G172074J2806M52q933j5022j6887j3102k920J3188L4443O0768R2599J30031
$$ 7172074 7184880 7185332 7176399 7161377 7144490 7131388 7128468 7141656 7176099 7236867 7329466 7459497
59934G459497J72443K18728K67675L18215L69334M19622M66960N08935N43323
$$ 7459497 7631940 7850668 8118343 8436558 8805892 9225514 9692474 10201409 10744732
59925A0744732N67700N78627N71914N44152M93924M21708L29336K20106R9299
$$ 10744732 11312432 11891059 12462973 13007125 13501049 13922757 14252093 14472199 14571498
59916A4571498k6021j48195k60395l57467m35889m93569n30013n46634n46201
$$ 14571498 14545477 14397282 14136887 13779420 13343531 12849962 12319949 11773315 11227114
59907A1227114n31621n05330m69797m27930l82451l35077k86652k37807j89193
$$ 11227114 10695493 10190163 9720366 9292436 8909985 8574908 8288256 8050449 7861256
59898G861256j41454r5270n1090q506L3399P4649J13891J49943J82915K12741
$$ 7861256 7719802 7624532 7573442 7564936 7598335 7672984 7786875 7936818 8119733 8332474
59888H332474K37208K52907K57951K52461K36304K07940J66211J12355M9516j8964
$$ 8332474 8569682 8822589 9080540 9333001 9569305 9777245 9943456 10055811 10105327 10086363
59878A0086363r0049j60380k26128k83671l30314l64621l86407l96394l95788
$$ 10086363 9996314 9835934 9609806 9326135 8995821 8631200 8244793 7848399 7452611
59869G452611l86123l69290l47213l21410k93065k63405k33711k04964j77786
$$ 7452611 7066488 6697198 6349985 6028575 5735510 5472105 5238394 5033430 4855644
59860D855644j52624j29778j09593r2924q0960p3896p0211o7966o6588o6471o7097
$$ 4855644 4703020 4573242 4463649 4370725 4289765 4215869 4145658 4077692 4011104 3944633 3877536
59849C877536o6671o3868n8904n2601m5267l6985k8343k0315j3858r926r453j2825
$$ 3877536 3810865 3746997 3688093 3635492 3590225 3553240 3524897 3504582 3490724 3480798 3471345 3458520
59837C458520j9554k8507l8282m7411n4787o0031o3171o4082o2690n9423n4749
$$ 3458520 3438966 3410459 3372177 3324766 3269979 3209948 3146777 3082695 3020005 2960582 2905833
59826B905833m8435m0151l0757k1887j4038o185K349J0654J7533K3111K8320L3551
$$ 2905833 2857398 2817247 2786490 2764603 2750565 2744380 2746729 2757383 2774916 2798027 2826347 2859898
59814B859898L8756M4473N1666O0551P0102P8719Q4985Q7910Q7136Q3043P6415
$$ 2859898 2898654 2943127 2994793 3055344 3125446 3204165 3289150 3377060 3464196 3547239 3623654
59803C623654O7867N7683M6202L4119K2393J1786K619m935j0306j2693j1980q986
$$ 3623654 3691521 3749204 3795406 3829525 3851918 3863704 3866323 3861388 3851082 3838389 3826409 3817423
59791C817423m338K504J2448K5408M0495N7344P6335R7607J20941J46754J76205
$$ 3817423 3813085 3815589 3828037 3853445 3893940 3951284 4027619 4125226 4246167 4392921 4569126
59780D569126K09989K47811K89324L34619L83179M32782M79532N18151N41738
$$ 4569126 4779115 5026926 5316250 5650869 6034048 6466830 6946362 7464513 8006251
59771H006251N42013N10869M42748L37237K01520N0549r7029k25368l25155l92891
$$ 8006251 8548264 9059133 9501881 9839118 10040638 10091187 9994158 9768790 9443635 9050744
59761I050744m28980m37299m24525l97668l61989l21466k79839k39888k02375
$$ 9050744 8621764 8184465 7759940 7362272 7000283 6678817 6398978 6159090 5956715
59752E956715j67025j34221j04735p8287n3711l0457q861J1100L0314M9626O9090
$$ 5956715 5789690 5655469 5550734 5472447 5418736 5388279 5379418 5390518 5420832 5470458 5539548
59741E539548Q8347J07231J26051J45648J67022J90435K15108K40386K66962K96294
$$ 5539548 5627895 5735126 5861177 6006825 6173847 6364282 6579390 6819776 7086738 7383032
59731G383032L29083L65004M03771M45612M90530N37872N86777O36499O85857
$$ 7383032 7712115 8077119 8480890 8926502 9417032 9954904 10541681 11178180 11864037
59722A1864037P32681P74058Q06942Q28433Q35867Q27123Q01499P60736P09362
$$ 11864037 12596718 13370776 14177718 15006151 15842018 16669141 17470640 18231376 18940738
59713A8940738O53654N99915N53611N19468N01164N00283N15982N46003N87291
$$ 18940738 19594392 20194307 20747918 21267386 21768550 22268833 22784815 23330818 23918109
59704B3918109O35133O82607P22069P47295P53783P37714O96059O28068N35967
$$ 23918109 24553242 25235849 25957918 26705213 27458996 28196710 28892769 29520837 30056804
59695C0056804M24135K98212J65156L3118q9712j96543k82516l44456l80543l90282
$$ 30056804 30480939 30779151 30944307 30977425 30887713 30691170 30408654 30064198 29683655 29293373
59685B9293373l74562l35505k75981j99044j07702m834J07225K27094L53975M86654
$$ 29293373 28918811 28583306 28307325 28108281 28000579 27995745 28102970 28330064 28684039 29170693
59675B9170693O23177P61352Q98688J031262J152849J255310J329219J364036
$$ 29170693 29793870 30555222 31453910 32485172 33638021 34893331 36222550 37586586
59667C7586586J348875J274678J136225R32699O68093L52974N679l49861o89090
$$ 37586586 38935461 40210139 41346364 42279063 42947156 43300130 43305809 42955948 42266858
59658D2266858r90950j239393j423756j539491j588533j578270j519592j425158
$$ 42266858 41275908 40036515 38612759 37073268 35484735 33906465 32386873 30961715
59650C0961715j308438j183444j064664r66459r01314q76985q93639r42654j008585
$$ 30961715 29653277 28469833 27405169 26438710 25537396 24660411 23766772 22824118 21815533
59641B1815533j074044j124760j151870j151636j124822j076275j013030r41169
$$ 21815533 20741489 19616729 18464859 17313223 16188401 15112126 14099096 13157927
59633A3157927q64512p86264p10365o39960n75494n15784m60666m11215l67690
$$ 13157927 12293415 11507151 10796786 10156826 9581332 9065548 8604882 8193667 7825977
59624G825977l28747k93005k60269k30699k03788j78788j55545j34375j15413
$$ 7825977 7497230 7204225 6943956 6713257 6509469 6330681 6175136 6040761 5925348
59615E925348r8495q3484p0462n9774n1903m7210m5688m7110n1265n7949o6791
$$ 5925348 5826853 5743369 5672907 5613133 5561230 5514020 5468332 5421222 5369957 5312008 5245217
59604E245217p7189q8191r8408j06513j12152j15924j18229j18597j16437j11897
$$ 5245217 5168028 5079837 4981429 4874916 4762764 4646840 4528611 4410014 4293577 4181680
59594D181680j05406r7068q7165p6654o6405n6301m5949l5854k6915j9105j1604
$$ 4181680 4076274 3979206 3892041 3815387 3748982 3692681 3646732 3610878 3583963 3564858 3553254
59583C553254m054L249J0167J6623K1862K5037K6611K8048K9794L0716K9941K8312
$$ 3553254 3549200 3552449 3562616 3579239 3601101 3626138 3652749 3680797 3710591 3741307 3771248 3799560
59571C799560K7426K7968K9546L1662L4335L8168M4087N2641O3288P4776Q6390
$$ 3799560 3826986 3854954 3884500 3916162 3950497 3988665 4032752 4085393 4148681 4223457 4309847
59560D309847R8441J11539J25986J41951J59512J78298J97695K17695K38849K61104
$$ 4309847 4408288 4519827 4645813 4787764 4947276 5125574 5323269 5540964 5779813 6040917
59550F040917K83323L04314L23692L41264L56174L67168L73286L73889L68502
$$ 6040917 6324240 6628554 6952246 7293510 7649684 8016852 8390138 8764027 9132529
59541I132529L57225L40874L20292K95835K68134K38869K09991J82107J54141
$$ 9132529 9489754 9830628 10150920 10446755 10714889 10953758 11163749 11345856 11499997
59532A1499997J24690R3623O2594L4483J2313j774o830k585J1003L3490O3432
$$ 11499997 11624687 11718310 11780904 11815387 11827700 11825926 11819096 11816511 11827514 11861004 11924436
59521A1924436R8389J35363J70911K01034K21487K28575K19801J93996J51220
$$ 11924436 12022825 12158188 12329099 12530133 12751620 12980195 13199996 13393992 13545212
59512A3545212R2834K1602n8621j43572k29165l11494l86581m50556n00454n34869
$$ 13545212 13638046 13659648 13601027 13457455 13228290 12916796 12530215 12079659 11579205 11044336
59502A1044336n53933n58808n51249n33379n07462m75719m40188m02501l63727
$$ 11044336 10490403 9931595 9380346 8846967 8339505 7863786 7423598 7021097 6657370
59493F657370l24692k86518k50541k17451j86887j58154j31125j06120q3121o1453
$$ 6657370 6332678 6046160 5795619 5578168 5391281 5233127 5102002 4995882 4912761 4851308
59483D851308m0224j8857K728K4222M5352O6227Q7194J08456J30283J53330J78099
$$ 4851308 4811084 4792227 4794955 4819177 4864529 4930756 5017950 5126406 5256689 5410019 5588118
59472E588118K03924K29255K53247K76185K97859L16338L29060L34419L31473
$$ 5588118 5792042 6021297 6274544 6550729 6848588 7164926 7493986 7828405 8159878
59463H159878L18868K95198K60163K14573J59462R6208K7259m4049j14346j80396
$$ 8159878 8478746 8773944 9034107 9248680 9408142 9504350 9531609 9487560 9373214 9192818
59453I192818k38973k87657l25647l53134l70242l77373l76019l68093l54733
$$ 9192818 8953845 8666188 8340541 7987407 7617165 7239792 6863773 6495680 6140947
59444F140947l36844l16309k95326k74569k53331k31499k10033j89599j70177
$$ 6140947 5804103 5487794 5192468 4917899 4664568 4433069 4223036 4033437 3863260
59435C863260j52212j36584j23020j09992r6759q4187p3039o2784n2901m3896
$$ 3863260 3711048 3574464 3451444 3341452 3244693 3160506 3087467 3024683 2971782 2927886
59425B927886l6081k8592k0772j3521p974l608J040O256J1040J4758J7788K0564
$$ 2927886 2891805 2863213 2842441 2828920 2820946 2817338 2818378 2824634 2835674 2850432 2868220 2888784
59413B888784K3013K5128K7451L0675L4929L9173M1295L9478L4112K8041K4482
$$ 2888784 2911797 2936925 2964376 2995051 3029980 3069153 3110448 3149926 3184038 3212079 3236561
59402C236561K4922K9125L6312M5726N6809O9623Q4458J00300J14320J24172J30651
$$ 3236561 3261483 3290608 3326920 3372646 3429455 3499078 3583536 3683836 3798156 3922328 4052979
59391D052979J37250J47260J62118J82129K07361K37481K71746L09767L51771
$$ 4052979 4190229 4337489 4499607 4681736 4889097 5126578 5398324 5708091 6059862
59382F059862L97776M47018M98533N51720O05742O58527P06734P46607P74650
$$ 6059862 6457638 6904656 7403189 7954909 8560651 9219178 9925912 10672519 11447169
59373A1447169P87893P84317P63553P27163O78073O19807N56207M91389M29090
$$ 11447169 12235062 13019379 13782932 14510095 15188168 15807975 16364182 16855571 17284661
59364A7284661L71657L19864K73638K32362J94188J55931J14556O8603J7633l9044
$$ 17284661 17656318 17976182 18249820 18482182 18676370 18832301 18946857 19015460 19033093 18994049
59354A8994049j01802j68804k35869k98578l54000m00467m36916m63253m80670
$$ 18994049 18892247 18723443 18487574 18188996 17834996 17434529 16997613 16534360 16053690
59345A6053690m91158m97049n00965n05135n10047n14273n16035n14372n08735
$$ 16053690 15562532 15065483 14564518 14059383 13549336 13035063 12519028 12004656 11495921
59336A1495921m98518m83626m64687m42163m16156l87716l59299l32846l08209
$$ 11495921 10997403 10513777 10049090 9606927 9190771 8803055 8443756 8110910 7802701
59327G802701k84549k62449k43332k27282k13041k00035j88991j80386j73456
$$ 7802701 7518152 7255703 7012371 6785089 6572048 6372013 6183022 6002636 5829180
59318E829180j67134j60926j54549j47670j40492j33754j27558j20841j12655
$$ 5829180 5662046 5501120 5346571 5198901 5058409 4924655 4797097 4676256 4563601
59309D563601j03447r4402q5862p7072o7423n7255m7313l7900k8875k0200j2119
$$ 4563601 4460154 4365752 4279890 4202818 4135395 4078140 4030827 3992927 3964052 3943852 3931733
59298C931733m766K144R173J6814K5342L4682M4372N3920O3483P3868Q5543R7902
$$ 3931733 3926967 3929111 3938284 3955098 3980440 4015122 4059494 4113414 4176897 4250765 4336308 4434210
59286D434210J10049J22039J34607J47797J60676J72575J83751J94376K03661
$$ 4434210 4544259 4666298 4800905 4948702 5109378 5281953 5465704 5660080 5863741
59277E863741K10553K14728K16221K14456K08294J96836J79721J56877J28358
$$ 5863741 6074294 6289022 6505243 6719699 6927993 7124829 7304550 7461427 7589785
59268G589785R4225N4162P869m3432r6003j44874j86384k19265k43593k59503
$$ 7589785 7684010 7738172 7746041 7702609 7606606 7461732 7275348 7056083 6812490 6552987
59258F552987k67187k67526k62114k52527k39696k24076k06305j87542j68927
$$ 6552987 6285800 6018274 5756160 5503633 5263937 5039861 4833556 4646014 4477087
59249D477087j50880j33181j15720r8726q2321o6325n0691l5687k1388p323P149
$$ 4477087 4326207 4193026 4077306 3978580 3896259 3829934 3779243 3743556 3722168 3714845 3721994
59238C721994K2426L8706N6137P4686R4318J15461J38899J65056J93822K25234
$$ 3721994 3744420 3783126 3839263 3913949 4008267 4123728 4262627 4427683 4621505 4846739
59228D846739K59755K97620L38301L80950M24747M68399N09632N45433N72389
$$ 4846739 5106494 5404114 5742415 6123365 6548112 7016511 7526143 8071576 8643965
59219H643965N86646N84331N62671N20577M58132L76306K77566J66026M6467p6254
$$ 8643965 9230611 9814942 10377613 10898190 11356322 11732628 12010194 12176220 12222687 12146433
59209A2146433j96475l07540m03471m80622n37240n72401n86534n82440n64322
$$ 12146433 11949958 11642418 11238947 10758325 10221085 9648684 9062150 8479710 7915388
59200G915388n35656m98810m56449m12003l68278l26473k86892k49982k16308
$$ 7915388 7379732 6880922 6424473 6012470 5644192 5317719 5030827 4780845 4564537
59191D564537j86025j58924j34801j13555r5027p8847o4464n1453l9885l0092
$$ 4564537 4378512 4219588 4084787 3971232 3876205 3797358 3732894 3681441 3641556 3611464
59181C611464k1913j4596p756j997J965M425O294P770Q139O780L798l56n316j0758
$$ 3611464 3589551 3574955 3567199 3565202 3567167 3571592 3577886 3585656 3593795 3600575 3604373 3604017 3598701 3587943
59167C587943j6478k2626k9448l6601m3129m8273n2097n5150n7708n9387n9533
$$ 3587943 3571465 3548839 3519391 3482790 3439661 3391388 3339291 3284141 3226433 3167046 3107513
59156C107513n7967n5270n2169m8700m4372l9259l4308l0188k6329k1642j5916
$$ 3107513 3049546 2994276 2942107 2893407 2849035 2809776 2775468 2745280 2718951 2697309 2681393
59145B681393r998m718j60M125Q581J3285J7879K1949K5619K9501L3838L8162
$$ 2681393 2671395 2666677 2666517 2670642 2679223 2692508 2710387 2732336 2757955 2787456 2821294 2859456
59133B859456M2051M5871N0217N5026N9730O4082O8257P2350P6289Q0126Q3861
$$ 2859456 2901507 2947378 2997595 3052621 3112351 3176433 3244690 3317040 3393329 3473455 3557316
59122C557316Q7027Q8984Q9638Q9475Q8914Q7956Q6589Q5225Q4533Q4907Q6124
$$ 3557316 3644343 3733327 3822965 3912440 4001354 4089310 4175899 4261124 4345657 4430564 4516688
59111D516688Q7675Q9593R2824R8490J06855J17348J29381J42430J55342J66502
$$ 4516688 4604363 4693956 4786780 4885270 4992125 5109473 5238854 5381284 5536626 5703128
59101E703128J74940J80489J82387J78530J66595J45376J14577P4358K5991k7525
$$ 5703128 5878068 6058557 6240944 6419474 6586069 6731445 6846022 6920380 6946371 6918846
59091F918846q2441j35574j84292k25989k58692k81951k96352l02404l00640k92387
$$ 6918846 6836405 6700831 6516539 6290550 6031858 5749907 5453555 5151151 4850511 4558124
59081D558124k79479k63266k44610k24744k05227j87005j70104j54361j39886
$$ 4558124 4278645 4015379 3770769 3546025 3340798 3153793 2983689 2829328 2689442
59072B689442j26823j15136j04711r5437q7129p9667p2976o6820o0907n5364n0589
$$ 2689442 2562619 2447483 2342772 2247335 2160206 2080539 2007563 1940743 1879836 1824472 1773883
59061A773883m6443m2141l7353l2705k8740k5075k1189j7454j4604j2703j1348
$$ 1773883 1727440 1685299 1647946 1615241 1586501 1561426 1540237 1522783 1508179 1495476 1484128
59050A484128j0384r756r116q356q098q962j0769j3027j5556j7907j8955j8101
$$ 1484128 1473744 1463988 1454872 1446516 1438418 1429456 1418687 1405660 1390104 1372197 1353242 1335141
59038A335141j6331j4998j4065j2639j0710r130q088o940n384l694j751R74M439
$$ 1335141 1318810 1303812 1289747 1277108 1266398 1257268 1249180 1242240 1236856 1233162 1231411 1232385 1236824
59025A236824P886J0736J2837J4015J4234J4052J3995J3618J2181J0026Q269P293
$$ 1236824 1244710 1255446 1268283 1282298 1296532 1310584 1324579 1338197 1350378 1360404 1368673 1375966
59013A375966O583N989N938O361O587O537P005Q347R797J0394R931Q799P487O350
$$ 1375966 1382549 1388538 1394476 1400837 1407424 1413961 1420966 1429313 1439110 1449504 1459435 1468234 1475721 1482071
58999A482071N291L664J074j832m033n433o710q087r091r429r185q238o387m043
$$ 1482071 1487362 1491026 1492100 1490268 1486235 1480802 1474092 1466005 1456914 1447485 1438300 1430062 1423675 1419632
58985A419632j981l69J165K599L577M346N658P669R727J1398J2883J4419J5963
$$ 1419632 1417651 1417282 1418447 1421046 1424623 1428969 1434627 1442296 1452023 1463421 1476304 1490723 1506686
58972A506686J7570J9373K1297K3301K5761K8873L2058L4655L6830L8914M0412
$$ 1506686 1524256 1543629 1564926 1588227 1613988 1642861 1674919 1709574 1746404 1785318 1825730
58961A825730M0747M0507M0637M0780L9800L7816L6192L5551L5276L5038L5369
$$ 1825730 1866477 1906984 1947621 1988401 2028201 2066017 2102209 2137760 2173036 2208074 2243443
58950B243443L6461L7765L9158M1270M4329M7802N1503N5959O1376O7292P3510
$$ 2243443 2279904 2317669 2356827 2398097 2442426 2490228 2541731 2597690 2659066 2726358 2799868
58939B799868Q0328Q7682R4992J02120J09424J16903J24308J32104J41114J51195
$$ 2799868 2880196 2967878 3062870 3164990 3274414 3391317 3515625 3647729 3788843 3940038
58929C940038J61705J73242J87429K04716K23894K44112K65986K90285L16991
$$ 3940038 4101743 4274985 4462414 4667130 4891024 5135136 5401122 5691407 6008398
58920F008398L46118L78136M12976M49987M89262N31719N77405O25106O74062
$$ 6008398 6354516 6732652 7145628 7595615 8084877 8616596 9194001 9819107 10493169
58911A0493169P24515P75799Q25324Q70059R07574R34790R47263R40682R12056
$$ 10493169 11217684 11993483 12818807 13688866 14596440 15531230 16478493 17419175 18331231
58902A8331231Q58749P78076O69223N34593L78559K06259K4631j57044l29489
$$ 18331231 19189980 19968056 20637279 21171872 21550431 21756690 21781321 21624277 21294788
58893B1294788m85973o21800p32825q16209q72108r03097r12221r02481q77525
$$ 21294788 20808815 20187015 19454190 18637981 17765873 16862776 15950555 15048074 14170549
58884A4170549q41351p97310p48124o96497o44840n94667n46865n02275m61496
$$ 14170549 13329198 12531888 11783764 11087267 10442427 9847760 9300895 8798620 8337124
58875H337124m24580l91451l62197l36554l13650k92691k73290k54862k36564
$$ 8337124 7912544 7521093 7158896 6822342 6508692 6216001 5942711 5687849 5451285
58866E451285k18308k01038j85445j71125j57420j44240j31631j19509j08267
$$ 5451285 5232977 5031939 4846494 4675369 4517949 4373709 4242078 4122569 4014302
58857D014302r8577r0015q1003p0929o1219n3417m7186m1166l4843k8451k1855
$$ 4014302 3915725 3825710 3744707 3673778 3612559 3559142 3511956 3470790 3435947 3407496 3385641
58846C385641j4765p649j282M394J0181J6663K3818L1331L8753M5806N2836O0477
$$ 3385641 3370876 3363227 3361945 3366339 3376520 3393183 3417001 3448332 3487085 3532891 3585727 3646204
58834C646204O8703P6889Q5027R3934J03963J14439J24888J35805J47704J60376
$$ 3646204 3714907 3791796 3876823 3970757 4074720 4189159 4314047 4449852 4597556 4757932
58824D757932J73658J88016K03904K21410K41016K63577K89139L16842L46547
$$ 4757932 4931590 5119606 5323510 5544920 5785936 6049513 6338652 6655494 7002041
58815G002041L79336M15929M55857M98750N44984N94300O45190O96415P47652
$$ 7002041 7381377 7797306 8253163 8751913 9296897 9891197 10536387 11232802 11980454
58806A1980454P97641Q43101Q80526R07503R21059R16238Q87978Q33449P51599
$$ 11980454 12778095 13621196 14501722 15409225 16330284 17246522 18134500 18967949 19719548
58797A9719548O41948N05807L47775J74634o445j87522l59407n13877o46134p53909
$$ 19719548 20361496 20867303 21215078 21389712 21383267 21195745 20836338 20322461 19676327 18922418
58787A8922418q35260q89102r17168r23504r12142q86500q50425q07890p61608
$$ 18922418 18087158 17198056 16280888 15357384 14445242 13558742 12708317 11900427 11138819
58778A1138819p13082o63873o15622n69179n24829m83171m44863m09859l77819
$$ 11138819 10425737 9761864 9146242 8577063 8052234 7569063 7124200 6714341 6336522
58769F336522l48762l22555k98408k75821k55277k37051k20156k03625j87936
$$ 6336522 5987760 5665205 5366797 5090976 4835699 4598648 4378492 4174867 3986931
58760C986931j73949j61285j49098j37627j27449j17907j07823r7380q7824p9666
$$ 3986931 3812982 3651697 3502599 3364972 3237523 3119616 3011793 2914413 2826589 2746923
58750B746923p2486o6141o0762n5893n0938m6194m2267l8821l5015l0891k7231
$$ 2746923 2674437 2608296 2547534 2491641 2440703 2394509 2352242 2313421 2278406 2247515 2220284
58739B220284k4411k2421k1574k2179k3831k5899k8245l0674l2451l3282l3870
$$ 2220284 2195873 2173452 2151878 2129699 2105868 2079969 2051724 2021050 1988599 1955317 1921447
58728A921447l4580l4623l3694l3196l4385l6357l7536l8079l9051m0094l9966
$$ 1921447 1886867 1852244 1818550 1785354 1750969 1714612 1677076 1638997 1599946 1559852 1519886
58717A519886l8857l8079l7777l6859l5083l3400l2224l0967k9331k7613k5693
$$ 1519886 1481029 1442950 1405173 1368314 1333231 1299831 1267607 1236640 1207309 1179696 1154003
58706A154003k3071j9883j6853j4276j2076j0499r673q933p726o649o496o892
$$ 1154003 1130932 1111049 1094196 1079920 1067844 1057345 1047672 1038739 1031013 1024364 1017868 1010976
58694A010976p147p714r276j1095j1930j2067j2759j3996j4506j3763j2522j1413
$$ 1010976 1003829 996115 986839 975744 963814 951747 938988 924992 910486 896723 884201 872788
58682H72788j0398r437q492p179n427l988l285k488r41M69P50O64J515L019M071
$$ 872788 862390 852953 844461 837282 831855 827867 824582 822094 821153 821622 822372 823036 824551 827570 831641
58667H31641M776N794O550O134N298N462O265O233N385N005N147M552K946J392
$$ 831641 836417 842211 848761 854895 860193 865655 871920 878153 883538 888543 893690 898242 901188 902580
58653I02580M72j25l59P6P30J157K160M496P010Q105Q357R441J1092J1670J1279
$$ 902580 903052 902927 902568 902644 903374 904531 906691 911187 918197 926302 934659 944100 955192 966862 978141
58638I78141J1687J3306J4853J6006J7851K0551K3067K5328K8380L2151L5578
$$ 978141 989828 1003134 1017987 1033993 1051844 1072395 1095462 1120790 1149170 1181321 1216899
58627A216899L9077M4363N1476N8403O4198P0103P7027Q4263R1432R9582J09606
$$ 1216899 1255976 1300339 1351815 1410218 1474416 1544519 1621546 1705809 1797241 1896823 2006429
58616B006429J21390J35012J50884J68339J85948K03558K22095K41072K58272
$$ 2006429 2127819 2262831 2413715 2582054 2768002 2971560 3193655 3434727 3692999
58607C692999K72089K81998K86444K82536K68288K43313K07244J59888J03418
$$ 3692999 3965088 4247086 4533530 4816066 5084354 5327667 5534911 5694799 5798217
58598E798217M2238j9790q0008j35006j80818k15709k40570k56169k62397k60513
$$ 5798217 5840455 5820665 5740657 5605651 5424833 5209124 4968554 4712385 4449988 4189475
58588D189475k53339k42419k27449k09123j90063j72030j54712j37964j22830
$$ 4189475 3936136 3693717 3466268 3257145 3067082 2895052 2740340 2602376 2479546
58579B479546j09590r7365q6402p8227p2635o7280o1190n6051n2863n0070m6323
$$ 2479546 2369956 2272591 2186189 2107962 2035327 1968047 1906857 1850806 1797943 1747873 1701550
58568A701550m2493l9445l6232l2088k7956k4579k1252j7883j6088j6811j8845
$$ 1701550 1659057 1619612 1583380 1551292 1523336 1498757 1477505 1459622 1443534 1426723 1407878
58557A407878k1054k3908k7605l0909l3166l5246l7141l7048l4270l0756k8122
$$ 1407878 1386824 1362916 1335311 1304402 1271236 1235990 1198849 1161801 1127531 1096775 1068653
58546A068653k5501k1988j8849j7372j6599j5178j3574j2630j1759j0373r259
$$ 1068653 1043152 1021164 1002315 984943 968344 953166 939592 926962 915203 904830 895571
58535H95571q927q380p132o466p068p480o661n949o566p238o500n505o222q347
$$ 895571 886644 878264 871132 864666 857598 850118 843457 837508 830942 823704 817204 811699 805477 797130
58521G97130j0109j0827j0750r828q457q052r050r745q828p502p341p656o942
$$ 797130 787021 776194 765444 755616 747159 739107 730057 720312 711484 703982 696641 688985 682043
58508F82043n394m052k908j655r51j021n08J420L291L585L214L797M850N009M662
$$ 682043 676649 672597 669689 668034 667083 666062 665554 666974 670265 673850 677064 680861 685711 690720 695382
58493F95382N154O324P071P495Q422R470R473Q392P173O207N265M370L595K569
$$ 695382 700536 706860 713931 721426 729848 739318 748791 757183 764356 770563 775828 780198 783793 786362
58479G86362J083n53k306m422o211o381n278m926o016o815o027m719m239m356
$$ 786362 787445 786892 784586 780164 773953 767572 762294 757368 751352 744537 738510 733791 729552 725196
58465G25196m710n886p594p986o496n193n688o783o919o730p234p581o753n557
$$ 725196 720486 714600 707006 699020 692524 687331 681643 674860 667941 661211 653977 646396 639643 634086
58451F34086n014m444l159k184k348k498j500k37K61P93K240L763M575N577P323
$$ 634086 629072 624628 621469 619285 616937 614439 612939 612702 612963 613756 615996 619759 624334 629911 637234
58436F37234Q513Q493Q939J0945J2554J1565Q753O014L349O0l009m855o194p761
$$ 637234 645747 654240 663179 674124 686678 698243 706996 713010 716359 716419 713410 708555 702361 694600
58422F94600q560p884o993o746n824l409j187m40K92K225L732L541L765O572J0331
$$ 694600 686040 678156 671163 664417 658593 655184 653997 653557 653849 656074 659806 663347 667112 673684 684015
58407F84015J2318J2948J4057J5137J4808J3973J4047J3866J1597Q052M942J816
$$ 684015 696333 709281 723338 738475 753283 767256 781303 795169 806766 814818 819760 821576
58395H21576k199n624o907p418q837r705q059n408m378m342l229j727j771k522
$$ 821576 819377 813753 806846 799428 790591 780886 772827 767419 763041 758699 755470 753743 751972 749450
58381G49450j782o3O19N62J379K542K528J999K357K735J875J292K967N624O892
$$ 749450 747668 747605 748224 748786 750165 752707 755235 757234 759591 762326 764201 765493 768460 774084 780976
58366G80976P259Q283R011Q101P353Q925J1039J0821R343R377J0230R581Q489
$$ 780976 788235 796518 805529 813630 820983 829908 840947 851768 861111 870488 880718 890299 898788
58353H98788R493J1404J1226R803J0352J2492J3003J1499J0221R072O055K002
$$ 898788 908281 919685 930911 940714 951066 963558 976561 988060 998281 1007353 1013408 1015410
58341A015410k39q25k228m219m332k796k075k093o62J867L129L318M610O700P611
$$ 1015410 1015171 1014346 1012118 1007899 1003567 1000771 998696 996603 995941 997808 1000937 1004255 1008865 1015565 1023176
58326A023176Q091J0392J3402J3993J2503J2021J2973J3313J3274J4818J7084
$$ 1023176 1031267 1041659 1055061 1069054 1081557 1093578 1106551 1119864 1133138 1147956 1165040
58315A165040J7437J6487J7034J8849J9382J8709J8710J8496J5919J2433J1054
$$ 1165040 1182477 1198964 1215998 1234847 1254229 1272938 1291648 1310144 1326063 1338496 1349550
58304A349550J0700Q255M846M141N591N661M635N780Q651R859R746J1660J5196
$$ 1349550 1360250 1368505 1373351 1377492 1383083 1388744 1393379 1399159 1407810 1417669 1427415 1439075 1454271
58291A454271J6751J6363J7330J9562J9979J9001J9889K2127K2308K1123K2494
$$ 1454271 1471022 1487385 1504715 1524277 1544256 1563257 1583146 1605273 1627581 1648704 1671198
58280A671198K6268K8749K9888L2815L6877L8532L8599M1021M5074M6476M5615
$$ 1671198 1697466 1726215 1756103 1788918 1825795 1864327 1902926 1943947 1989021 2035497 2081112
58269B081112M6633M9008M8242M4476M2034M1052L8050L4188L4003L6497L6684
$$ 2081112 2127745 2176753 2224995 2269471 2311505 2352557 2390607 2424795 2458798 2495295 2531979
58258B531979L5375L7884M3581M6757M7492N1255N7808O1330O1731O4940P1430
$$ 2531979 2567354 2605238 2648819 2695576 2743068 2794323 2852131 2913461 2975192 3040132 3111562
58247C111562P5588P7007Q1143Q8031R1878R2683R6631J04130J09354J12291J18945
$$ 3111562 3187150 3264157 3345300 3433331 3525209 3617892 3714523 3818653 3928007 4040298 4159243
58236D159243J28882J35503J39428J48211J61859J72536J79669J90923K06969
$$ 4159243 4288125 4423628 4563056 4711267 4873126 5045662 5225331 5416254 5623223
58227E623223K20282K30515K45570K65935K83876K99719L22295L51739L79196
$$ 5623223 5843505 6074020 6319590 6585525 6869401 7169120 7491415 7843154 8222350
58218H222350M05054M39147M81530N22465N62981O14840O78652P43981Q12664
$$ 8222350 8627404 9066551 9548081 10070546 10633527 11248367 11927019 12671000 13483664
58209A3483664Q98528J002667J114466J238843J395259J588593J811287K075657
$$ 13483664 14382192 15384859 16499325 17738168 19133427 20722020 22533307 24608964
58201B4608964K410991K827591L321691L918545M669769N606730O744316Q133890
$$ 24608964 27019955 29847546 33169237 37087782 41757551 47364281 54108597 62242487
58193F2242487R861644J1998560J4615065J7826835K1717682K6203838L1072111
$$ 62242487 72104131 84102691 98717756 116544591 138262273 164466111 195538222
58186A95538222L6075536M0640935M3277729M1636371L3838039K0151500L316365
$$ 195538222 231613758 272254693 315532422 357168793 391006832 411158332 414474697
58179D14474697j2934687k5784701l4137873l8204601l8786381l6870667l3441770
$$ 414474697 401540010 375755309 341617436 303412835 264626454 227755787 194314017
58172A94314017k9315384k5053243k1008693j7393970j4297013j1705051r563899
$$ 194314017 164998633 139945390 118936697 101542727 87245714 75540663 65976764
58165F5976764p814517o387488n205636m206732l347001k584733j878319j194670
$$ 65976764 58162247 51774759 46569123 42362391 39015390 36430657 34552338 33357668
58157C3357668n06298K07947R51347J718853K508799L254261L709021L494100
$$ 33357668 32851370 33059317 34010664 35729517 38238316 41492577 45201598 48695698
58149D8695698K386463N82422j386287l013129m073436m586625m658476m410148
$$ 48695698 51082161 51664583 50278296 47265167 43191731 38605106 33946630 29536482
58141B9536482l975233l470205k960094k475578k045180j688214j397569j156427
$$ 29536482 25561249 22091044 19130950 16655372 14610192 12921978 11524409 10367982
58133A0367982r60771q09444o88494n83958m97454m33802l85451l42881l08288
$$ 10367982 9407211 8597767 7909273 7325315 6827861 6394059 6008608 5665727 5357439
58124E357439k85886k69773k53197k39005k30068k19892k03053j84754j70464
$$ 5357439 5071553 4801780 4548583 4309578 4079510 3859618 3656565 3471811 3301347
58115C301347j56217j38149j21375j10272r9912q6193p5024p2497p4722p5785
$$ 3301347 3145130 3006981 2885606 2775334 2675422 2589229 2514205 2441708 2366986 2291201
58105B291201p7132q0858q2343p7983p2349o9853o6902n9756n2439m9218m6659
$$ 2291201 2214069 2133211 2050868 1972885 1900536 1830683 1763781 1704025 1651586 1602368 1555709
58094A555709m0762l4917l3399l3526l1554l0004l2118l4979l4781l3424l3656
$$ 1555709 1514947 1480030 1446631 1413105 1381551 1351547 1319429 1284450 1249669 1216245 1182589
58083A182589l3386l0627k8409k9131k9728k7829k6624k8305k8918k5432k1686
$$ 1182589 1149203 1118576 1090167 1061036 1031308 1003479 976855 948550 919632 894200 872514
58072H72514k1464k1748j9010j6116j6564j7515j5116j1643j0785j0721q331n764
$$ 872514 851050 829302 810292 794176 777612 760097 744981 733338 722553 711832 703501 697737
58060F97737o322p966p132n298n807p699q298q473j0012j1245j0368r586j1044
$$ 697737 691415 683449 676317 671019 665212 657513 649215 640742 630730 619485 609117 599531 588487
58047E88487j2313j0797q824r341j0338q789o433o349p181o121m390m500n081
$$ 588487 576174 565377 556553 547212 536874 528085 521652 515303 508122 502001 497611 493111 488030
58034D88030l567j248o39o33Q68K213P99j971l125l071l636l859k286p99j616
$$ 488030 484463 483215 482576 481943 482811 485024 485823 483852 480727 477656 474020 470161 467875 467076 465460
58019D65460k960k140l44L2J63K233M717M947M094M864O421O309N321N781O873
$$ 465460 462500 460360 460016 460048 460211 462444 467161 472108 476202 481066 487487 493796 499117 504898 511771
58004E11771O315M883M770N175L949J986J518J608k03l178m711n000o177p959
$$ 511771 518086 522969 527739 532914 536863 538849 540367 541975 541772 538594 533883 528883 522706 514747
57990E14747q414p963q482r419q787p094o406o416n213l215k510k986k709j498
$$ 514747 506333 498370 489888 480469 471682 464588 458182 451766 446553 443338 440828 437842 435133 433635
57976D33635q45q98o17k90q45j505r17K98Q14J174K369L300K611J596K242L798
$$ 433635 432790 431892 431275 430985 430140 428635 427718 428016 428830 430004 432373 435673 438284 439880 442122 445920
57960D45920M459M897O775R094R575Q507P881P723O667N181M863N401N331M973
$$ 445920 450379 455276 462051 471145 480720 489227 497108 504831 511498 516679 521542 526943 532274 537247
57946E37247N563O470O265N527N553N466L766J480N07m9k383n916q198r092j0513
$$ 537247 542810 549280 555545 561072 566625 572091 575857 577337 577844 577795 575412 569496 561298 552206 541693
57931E41693j2733j4309j5155j6366j7492j7222j6241j6293j6974j6456j4830
$$ 541693 528960 514651 499496 483130 465638 448416 432175 415882 398908 382452 367622
57920C67622j3664j2895j1313r365q322p388m923j891o81j043n82J080K125K165
$$ 367622 353958 341063 329750 320385 312063 304675 299752 297861 297180 296137 295555 296635 298760 300925
57906C00925K747M256N570O644Q294R667R099P343O822P784Q310P968Q097Q578
$$ 300925 303672 307928 313498 320142 328436 338103 347202 354545 361367 369151 377461 385429 393526 402104
57892D02104P668N324L448K611J549R2m86k10m31r19r3J660K072Q72L49J450K432
$$ 402104 409772 415096 418544 421155 422704 422796 422310 422100 421669 420750 420657 422317 424389 425261 425610 427060 429492
57875D29492K171J794K177K591K771L673N229N808M906M091M331M606L956K839
$$ 429492 431663 433457 435634 438225 440996 444669 449898 455706 460612 464703 469034 473640 477596 480435
57861D80435J732L29j252k277k873l902n199n818o010o924q317q810q405q399
$$ 480435 482167 482496 481244 478967 476094 472192 466993 461175 455165 448241 439924 431114 422709 414310
57847D14310q742p962n879l870k363m93J555K589K995M588P390R293R351Q814
$$ 414310 405568 397606 391727 387857 385494 385001 386556 389145 392140 396728 404118 413411 422762 431576
57833D31576Q401P335N676M717M317K585q02l687m925o105q557j1172j2542j3014
$$ 431576 439977 447312 452988 457705 462022 464607 463805 460118 455193 449088 440531 429359 416817 403803
57819D03803j3247j2814j1571j0589j0506j0674j0741j1198j1627j0516p808n431
$$ 403803 390556 377742 366171 355582 345076 334402 323661 312463 300836 290320 282512 277081
57807B77081m378l401j686m82p51j270n91R42K491M314O693Q895J0469J2153J4304
$$ 277081 272703 269302 267616 267134 266383 265113 264522 265464 267955 272269 278962 287857 298326 310479 324783
57792C24783J5897J5993J4838J2713R436N835L825L854L985K612M48j245k656
$$ 324783 340680 356673 371511 384224 393660 399495 403320 407174 411159 413771 414219 412974 410318
57779D10318m376o009p170q471j0334j2033j2894j3222j3190j2301j0725r630
$$ 410318 405942 399933 392763 384292 373958 361925 349031 335809 322619 310318 299593 289963
57767B89963r406r052q017o988o127m600k574j679k344k805j954j037j208j557
$$ 289963 280557 271505 263488 256500 250373 245773 243199 241520 239176 236371 234417 233380 232172 230615
57753B30615j225j281k589l705l066j612j015p26R83M070P009R141J0773J1650
$$ 230615 229390 228109 225520 221815 218749 217137 216122 215396 216379 220449 227458 236599 247372 259022
57739B59022J1326J0478J0116R928Q934P289N978N229M636M269M378M521M295
$$ 259022 270348 280826 290942 300870 309804 317093 323071 328300 332936 337205 341583 346104 350399
57726C50399M357N441O939P740P966Q522R495J0221J0602J1087J1694J2063J2289
$$ 350399 354756 360197 367136 374876 382842 391364 400859 411080 421682 432769 444463 456526 468815
57713D68815J2752J3487J4428J5865J7851J9746K1094K2391K4231K6357K8315
$$ 468815 481567 495054 509482 525347 543198 562944 584038 606429 630660 657017 685332
57702F85332L0409L3138L6331L9651M3321M7640N2413N7568O3677P1205P9937
$$ 685332 715741 748879 785210 824861 868182 915822 968235 1025803 1089480 1160685 1240622
57691A240622Q9717J00935J13786J27966J43644J61515J81201K00918K19660K38222
$$ 1240622 1330339 1431274 1545060 1673026 1816670 1978185 2159386 2360304 2579964 2818186
57681B818186K56917K73542K84984K89581K86390K73420K48725K12858J68791
$$ 2818186 3075103 3348645 3633629 3923210 4209600 4483020 4731745 4944603 5113394
57672E113394J19959O9898K3053j6046m4680o2140o9178o9508p1640q6192j18969
$$ 5113394 5233353 5303251 5326304 5310258 5265578 5203438 5134260 5064752 4993112 4906920 4787951
57661D787951j66250k16936k59141k85580k94856k89511k73314k49820k22295
$$ 4787951 4621701 4404765 4145624 3860044 3565188 3275677 3002363 2752543 2530248
57652B530248j93663j65971j40281j17328r7728q1350o7321n4964m4168l4603
$$ 2530248 2336585 2170614 2030333 1913005 1815277 1733927 1666606 1611642 1567474 1532871
57642A532871k5579j7006r488k972L673J1101J8668K5883L3539M2480N2286O2268
$$ 1532871 1507292 1490286 1480798 1477826 1481499 1492600 1511268 1537151 1570690 1613170 1665456 1727724
57630A727724P2843Q4814R7988J11716J26125J41694J58091J74496J90579K06114
$$ 1727724 1800567 1885381 1983369 2095085 2221210 2362904 2520995 2695491 2886070 3092184
57620C092184K19919K30042K34679K32277K21269K00553J69975J29990Q1626K7360
$$ 3092184 3312103 3542145 3776824 4009101 4230370 4430923 4600898 4730888 4812514 4839874
57610D839874k8814q2955j32257j74218k06201k27001k37995k41523k38815k30479
$$ 4839874 4811060 4728105 4595848 4421630 4215429 3988428 3750433 3508910 3270095 3039616
57600C039616k18079k03811j89030j74145j59502j45353j31594j18483j07001
$$ 3039616 2821537 2617726 2428696 2254551 2095049 1949696 1818102 1699619 1592618
57591A592618r7557q9041q0276p1689o4442n8557n3142m7905m3217l9111l5387
$$ 1592618 1495061 1406020 1325744 1254055 1189613 1131056 1077914 1030009 986792 947681 912294
57580I12294l2219k9625k6912k3685k0757j8938j7621j5860j4080j3196j2653
$$ 912294 880075 850450 823538 799853 779096 760158 742537 726677 712597 699401 686748
57569F86748j1044q366o038m794m026l234k572j962r95J40Q50J339K461M311O146
$$ 686748 675704 667338 661300 656506 652480 649246 646674 644712 643717 643857 644707 646046 648507 652818 658964
57554F58964P711R482J1477J3046J4070J5292J7177J9428K1807K4541K7631L0653
$$ 658964 666675 676157 687634 700680 714750 730042 747219 766647 788454 812995 840626 871279
57542H71279L3517L6729M0700M5456N1115N7903O5596P3629Q1896R0859J00817
$$ 871279 904796 941525 982225 1027681 1078796 1136699 1202295 1275924 1357820 1448679 1549496
57531A549496J11644J23204J35366J47599J59097J69253J77473J82668J83443
$$ 1549496 1661140 1784344 1919710 2067309 2226406 2395659 2573132 2755800 2939243
57522B939243J78619J67092J47556J19305Q3257M1742k525m6737q7823j22975
$$ 2939243 3117862 3284954 3432510 3551815 3635072 3676814 3674289 3627552 3539729 3416754
57512C416754j50524j69908j81215j85259j83637j77789j68275j55636j41459
$$ 3416754 3266230 3096322 2915107 2729848 2546211 2368422 2200147 2044511 1903052
57503A903052j27665j15022j03167r1833q1236p1491o2559n4573m7522m0912l4463
$$ 1903052 1775387 1660365 1557198 1465365 1384129 1312638 1250079 1195506 1147984 1107072 1072609
57492A072609k8711k4109k0004j5476j0696o409k502J756O341J0594J4599J9201
$$ 1072609 1043898 1019789 999785 984309 973613 967204 964702 966458 972799 983393 997992 1017193
57480A017193K4676L0455L6238M2371M9017N5959O3311P1646Q1251R1985J03713
$$ 1017193 1041869 1072324 1108562 1150933 1199950 1255909 1319220 1390866 1472117 1564102 1667815
57469A667815J16212J28773J40736J52195J63268J72833J78861J79795J74581
$$ 1667815 1784027 1912800 2053536 2205731 2368999 2541832 2720693 2900488 3075069
57460C075069J61685J39454J07912O9311K6656j7634o1559j02852j38867j67040
$$ 3075069 3236754 3376208 3484120 3553431 3580087 3562453 3500894 3398042 3259175 3092135
57450C092135j85761j95367j97884j95294j88432j77993j65661j53143j40784
$$ 3092135 2906374 2711007 2513123 2317829 2129397 1951404 1785743 1632600 1491816
57441A491816j28270j16136j05247r5345q5647p6480o8788o2248n5575m8692m2981
$$ 1491816 1363546 1247410 1142163 1046818 961171 884691 815903 753655 698080 649388 606407
57430F06407l9124l6196l3274l0390k7608k4543k1419j9275j8445j7847j6478
$$ 606407 567283 531087 497813 467423 439815 415272 393853 374578 356133 338286 321808
57419C21808j4657j3232j2295j1399j0398r589r361r860j0642j0684r455p781
$$ 321808 307151 293919 281624 270225 259827 250238 240877 231017 220375 209691 200236 192455
57407A92455o882o734o304n280m458m345m505m444m150l614k751j922j688j916
$$ 192455 185573 178839 172535 167255 162797 158452 153947 149503 145353 141739 138988 137066 135378 133462
57393A33462k043k091k468k858k552j834j667j975j665n84Nn59j306j195n41j48
$$ 133462 131419 129328 126860 124002 121450 119616 117949 115974 114309 113725 113730 113171 111865 110670 110129 109981
57377A09981j59l57p91j362j610j392j124r69o39k12k31p33j084j082j174j348
$$ 109981 109822 109465 108674 107312 105702 104310 103186 102217 101578 101366 101135 100402 99318 98236 97062 95714
57361I5714r81j08L97K50K14N90N71k38q66m21N45R23M46m52j330j672j029J24
$$ 95714 94733 94625 95022 95272 95486 96076 96647 96409 95543 95122 95667 96590 97036 96584 95254 93582 92553 92677
57343I2677O40L73N32J702K680K227R35K85O54J349J881K215K198J726J104O62
$$ 92677 93317 93690 94222 95924 98604 100831 101766 102051 102705 104054 105935 108150 110348 112074 113178 113840
57327A13840L99M92J390K887L927L985L770L911L881L164K473K710L501L968M275
$$ 113840 114239 114731 116121 119008 122935 126920 130690 134601 138482 141646 144119 146829 150330 154298 158573
57312A58573N143O296O770O543O647P607Q824R532R585R297R198R888J1474J3234
$$ 158573 163716 170012 176782 183325 189972 197579 206403 215935 225520 234817 244015 253903 265377 278611
57298B78611J4345J4858J5384J6185J7157J8411K0154K2116K3774K5063K6281
$$ 278611 292956 307814 323198 339383 356540 374951 395105 417221 440995 466058 492339
57287D92339K7398K8068K8302K8572K9121K9589K9372K8086K5671K2221J7736
$$ 492339 519737 547805 576107 604679 633800 663389 692761 720847 746518 768739 786475
57276G86475J2056N222k117r107j5577k1934k8102l3130l6267l7843l8657l8917
$$ 786475 798531 803753 801636 792529 776952 755018 726916 693786 657519 619676 581019 542102
57264E42102l8318l6745l4419l1533k8206k4622k1135j8290j6650j6067j5350
$$ 542102 503784 467039 432620 401087 372881 348259 327124 308834 292184 276117 260767
57253B60767j3378j0604q539p624o647m701k574j531j626k079k517k883k771j881
$$ 260767 247389 236785 228246 220622 213975 209274 206700 205169 203543 201464 198947 196064 193293 191412
57239A91412p66k02r8J48N36N92L85N52J332K211K652K622K392K201K149K173
$$ 191412 190646 190444 190346 190494 191030 191622 192007 192559 193891 196102 198754 201376 203768 205969 208118 210291
57223B10291K207K440L139M070M597M605M850N975P587Q736Q968Q537P981P866
$$ 210291 212498 214938 218077 222147 226744 231349 236199 242174 249761 258497 267465 276002 283983 291849
57209B91849Q453R286R535R157R191J0462J2480J4159J5107J5575J5632J5177
$$ 291849 300302 309588 319123 328280 337471 347933 360413 374572 389679 405254 420886 436063
57197D36063J4566J4435J4886J5380J5429J5074J4658J4421J4278J3894J3070
$$ 436063 450629 465064 479950 495330 510759 525833 540491 554912 569190 583084 596154
57186E96154J2112J1536J1414J1340J1110J0931J0908J0911J1090J1908J3355
$$ 596154 608266 619802 631216 642556 653666 664597 675505 686416 697506 709414 722769
57175G22769J4653J5127J4925J4662J4755J5289J6035J6470J6273J5914J6140
$$ 722769 737422 752549 767474 782136 796891 812180 828215 844685 860958 876872 893012
57164H93012J6847J7256J7284J7769J9077K0475K1336K2025K2994K3912K4332
$$ 893012 909859 927115 944399 962168 981245 1001720 1023056 1045081 1068075 1091987 1116319
57153A116319K4507K4809K4985K4726K4369K4376K4513K4296K3776K3388K3293
$$ 1116319 1140826 1165635 1190620 1215346 1239715 1264091 1288604 1312900 1336676 1360064 1383357
57142A383357K3418K3703K3930K3679K2856K1912K1264K0929K0948K1556K2692
$$ 1383357 1406775 1430478 1454408 1478087 1500943 1522855 1544119 1565048 1585996 1607552 1630244
57131A630244K3949K5289K7195K9780L2455L4859L7475M0848M4787M8704N2184
$$ 1630244 1654193 1679482 1706677 1736457 1768912 1803771 1841246 1882094 1926881 1975585 2027769
57120B027769N4927N6618N7280N7446N7929N9770O4139P1645Q1787R3856J08051
$$ 2027769 2082696 2139314 2196594 2254040 2311969 2371739 2435878 2507523 2589310 2683166 2791217
57109B791217J24965J44382J65691J89239K16084K46812K82048L24093L76787
$$ 2791217 2916182 3060564 3226255 3415494 3631578 3878390 4160438 4484531 4861318
57100D861318M43862N28707O35224P67451R28645J122276J353110J625318J939584
$$ 4861318 5305180 5833887 6469111 7236562 8165207 9287483 10640593 12265911 14205495
57091A4205495K293107K680463L091689L510438L915325M279069M563141M722338
$$ 14205495 16498602 19179065 22270754 25781192 29696517 33975586 38538727 43261065
57083D3261065M731383M612602M426920M226761M016029L753423L385129K872609
$$ 43261065 47992448 52605050 57031970 61258731 65274760 69028183 72413312 75285921
57075G5285921K206190J411989N46248l31012j184262k003290k779117l486947
$$ 75285921 77492111 78904100 79450348 79119336 77935074 75931784 73152667 69665720
57067F9665720m091803m561213m870115n003946m966235m781712m487617m121984
$$ 69665720 65573917 61012704 56142589 51138643 46172408 41390696 36903079 32781095
57059C2781095l719018l308453k912718k544961k211947j917445j661665j440657
$$ 32781095 29062077 25753624 22840906 20295945 18083998 16166553 14504888 13064231
57051A3064231j249523j085329r45640q26485p23883o35793n60683m95862m38881
$$ 13064231 11814708 10729379 9783739 8957254 8233371 7597578 7036895 6541033 6102152
57042F102152l89214l46899l10762k79303k52059k28752k08372j90175j74413
$$ 6102152 5712938 5366039 5055277 4775974 4523915 4295163 4086791 3896616 3722203
57033C722203j61064j49165j38207j28749j20828j13333j05754r8944r3261q7659
$$ 3722203 3561139 3411974 3273767 3145018 3024190 2910857 2805103 2706159 2612898 2525239
57023B525239q1495p5570p0349o4948n8866n3047m8195m3720l9356l6093l4302
$$ 2525239 2443744 2368174 2297825 2232877 2174011 2120964 2072769 2029049 1989693 1953600 1919298
57012A919298l2716l0317k7610k4870k0994j5210q143l4J0301K3633L9327N7384
$$ 1919298 1886582 1856265 1828655 1803785 1782791 1767581 1759438 1759404 1769705 1793338 1832665 1890049
57000A890049P9550J07430J41381J80969K21657K48679K39760J81290Q2712k8163
$$ 1890049 1969599 2077029 2218410 2399379 2621036 2869715 3109475 3290765 3373477 3345314
56990C345314j24073j91420k28942k40863k33592k14526j89789j62749j35325
$$ 3345314 3221241 3029821 2800879 2560016 2326424 2111898 1922109 1759360 1624035
56981A624035j09709q8208p2324o2411n7636n6109n5650n4612n1905m7036m0735
$$ 1624035 1514326 1426118 1353794 1291383 1233747 1177638 1121988 1067376 1015471 968435 927700
56970I27700l4661k9620k4857j9729j4987j1270p638l002J958N932R205J3054
$$ 927700 893039 863419 838562 818833 803846 792576 784938 781936 783894 789826 799031 812085
56958H12085J7580K1771K5234K8111K9440K7227K0326R332l946j6910k6723l2038
$$ 812085 829665 851436 876670 904781 934221 961448 981774 991106 987160 970250 943527 911489
56946I11489l3979l4378l3529l0741k6415k1916j7799j3642r386n395j399L291
$$ 911489 877510 843132 809603 778862 752447 730531 712732 699090 689704 684309 682910 686201
56934F86201Q559J3716J8806K4506L0817L6678M0451L9905L2588J8047m84j7972
$$ 686201 694760 708476 727282 751788 782605 819283 859734 899639 932227 950274 949790 931818
56922I31818l1236l9896m4480m5299m3114l9263l4719k9879k5281k1552j8708
$$ 931818 900582 860686 816206 770907 727793 688530 653811 623932 598651 577099 558391
56911E58391j6387j4513j3025j1427r584q346q251q314p321n730m810m553l977
$$ 558391 542004 527491 514466 503039 493455 485109 476858 468544 461223 455493 450683 446130 442153
56898D42153l031k398j795l14J778L381M658O895J0196J3199J5405J7975K1675
$$ 442153 439122 436724 434929 434615 436393 439774 444432 451327 461523 474722 490127 508102 529777
56885E29777K5692K9022L1391L2073K9332K2211J1963J005q702j5860j9603k0072
$$ 529777 555469 584491 615882 647955 677287 699498 711461 712466 703764 687904 668301 648229
56873F48229j8587j6462j3964j0687o471j643L228P725J2109J7353K4149L2160
$$ 648229 629642 613180 599216 588529 582058 580415 583643 591368 603477 620830 644979 677139
56861F77139M0815N0264O0548P0044P5756P4914O5635M7066K0793q095l3200n0757
$$ 677139 717954 768218 828766 898810 974566 1049480 1115115 1162181 1182974 1174879 1141679 1090922
56849A090922o0603o3828o1319n4593m5974l6914k7384j7347p506J956J2092K3844
$$ 1090922 1030319 966491 905172 850579 804605 767691 740307 722960 715454 717410 729502 753346
56837G53346L7006N1127O6273Q2337R8448J13288J24580J27563J15919Q6302M2189
$$ 753346 790352 841479 907752 990089 1088537 1201825 1326405 1453968 1569887 1656189 1698378
56826A698378p352n2536q6846j08047j17156j16677j09113r6732q1991o7107n2906
$$ 1698378 1691026 1638490 1551644 1443597 1326441 1209764 1100651 1003919 921928 854821 801915
56815H01915l8986k5267j2480q33J0753K3331L6679N0000O3154P6096Q7152R2373
$$ 801915 762929 737662 725182 724349 735102 758433 795112 845112 908266 984362 1071514 1163887
56803A163887Q6976O8038L6977j18l5335o2962q1214r0775r2838q8694q0078o8985
$$ 1163887 1250863 1318901 1355878 1355760 1320425 1257463 1176249 1085474 992636 903942 823864 754879
56791G54879n7192m5965l5813k6469j7625r548k484M278J1814K0108K8178L5489
$$ 754879 697687 651722 615909 589440 571815 562267 559783 564061 575875 595983 624161 659650
56779F59650M1983M6350M5645L7478K2219K770j7061l3844m5437n1626n3642n2686
$$ 659650 701633 747983 793628 831106 853325 856095 839034 805190 759753 708127 654485 601799
56767F01799m9215m3724l7330l1244k6050k1792j8293j5298j2756j0954r957r133
$$ 601799 552584 508860 471530 440286 414236 392444 374151 358853 346097 335143 325186 316053
56755C16053p893o572n760n113l933k598k108k327k101j243q82j545k295k308
$$ 316053 308160 301588 295828 290715 286782 284184 282076 279749 277648 276405 275523 273978 271683 269375
56741B69375j969j811j639j371j556k334k904k737k355k251k110j782j966l021
$$ 269375 267406 265595 263956 262585 261029 258695 255791 253054 250699 248448 246338 244556 242590 239569
56727B39569l985l725k435j185n97o41j107j592j582j124q77j114j290j008n99
$$ 239569 235584 231859 229424 228239 227642 227001 225894 224302 222720 221596 220719 219605 218315 217307 216708
56712B16708l73j77o0m78j262j441p13j09m79j232j419j136r57q16l74J48M02
$$ 216708 216335 216158 216098 215620 214358 212917 212204 212095 211616 210384 208965 207829 206872 206056 205682 205830 206232
56695B06232N67P98O85R8j89M21J312J618J579J919K457K387J678J086J025J232
$$ 206232 206799 207597 208282 208380 208191 208612 209924 211542 213121 215040 217497 219884 221562 222648 223673 224905
56679B24905J406J446J229Q37P80J364K034J979J176L22q3r4Lr7o43j497k147
$$ 224905 226311 227757 228986 229823 230603 231967 234001 235980 237156 237478 237395 237301 237304 237207 236564 235067 232920
56662B32920k301k235k223k099j784j735k347l206l485k909j974j429j717k727
$$ 232920 230619 228384 226161 224062 222278 220543 218196 214990 211505 208596 206622 205193 203476 200749
56648B00749l875m627m972n167n216m990m659m393l851k724j569j189j393j418
$$ 200749 196874 192247 187275 182108 176892 171902 167243 162850 158999 156275 154706 153517 152124 150706
56634A50706j343j803k424k032o78J88n7k53N95J857K508K567K453K075J407R56
$$ 150706 149363 147560 145136 143104 142426 142614 142557 142304 142899 144756 147264 149831 152284 154359 155766 156722
56618A56722R15Q51P11J043J693J668R51Q95J916K512J641N68Q40J843J999J218
$$ 156722 157637 158488 159199 160242 161935 163603 164554 165449 167365 169877 171518 172086 172926 174769 176768 177986
56602A77986N18J39k26j43R29K217K418J524N90R7j84k27O6J61m10j080j032m36
$$ 177986 178504 178643 178417 178274 179203 181420 183838 185362 185952 186049 185865 185638 185704 185865 185455 184375 183343 182907
56584A82907J06O37J300J437O08k26J39J342K168K356K353J956Q32p4N37K184
$$ 182907 183013 183650 184950 186387 186995 186769 186908 188250 190418 192774 195127 197083 197915 197841 198378 200562
56568B00562L032K419J519J358J697J963K129K367K722L311M058M398L943L224
$$ 200562 203594 206013 207532 208890 210587 212550 214679 217046 219768 223079 227137 231535 235478 238702
56554B38702K950K941K611K096J912J938J737J434J332J090L77k28j09J40m32
$$ 238702 241652 244593 247204 249300 251212 253150 254887 256321 257653 258743 259120 258892 258783 258923 258491
56539B58491j532k100j956j734j649j505j581k132k464j800p05l28o11o09j89
$$ 258491 256959 254859 252903 251169 249520 248015 246434 244302 241838 240038 239333 239005 238394 237785 237596
56524B37596N8J34M09M10n96k057k718k550k538k799k553j860j604j787j495p29
$$ 237596 237654 237788 238197 238607 238011 235954 233236 230686 228148 225349 222796 220936 219332 217545 216050 215321
56508B15321n73j291j849j712j623k109k618k603k286j927j308m40J70K13k22
$$ 215321 214748 213457 211608 209896 208273 206164 203546 200943 198657 196730 195422 194982 195152 195365 195143
56493A95143j109k283k915k274r17o3P5K40O84R73J088J431J860J949K039K685
$$ 195143 194034 191751 188836 186562 185645 185582 185657 185897 186581 187554 188642 190073 191933 193882 195921 198606
56477A98606L331K993K002J592J898J994J772K059K831L123K841K896L282K883
$$ 198606 201937 204930 206932 208524 210422 212416 214188 216247 219078 222201 225042 227938 231220 234103
56463B34103J563P01R79J349Q58J7l93n54q69j160j238j292j245o72L01R46J008
$$ 234103 235666 236367 237346 238695 239553 239570 239177 238623 237754 236594 235356 234064 232819 232147 232448 233394 234402
56446B34402R02P81N16N15J310K356K576K071J830J894J453O57N46R85O37p61
$$ 234402 235304 236085 236601 237116 238426 240782 243358 245429 247259 249153 250606 251263 251809 252794 253431 252670
56430B52670j898k125k224k553k315j358p91j068j247q96r13j621j911j293r62
$$ 252670 250772 248647 246423 243870 241555 240197 239406 238338 237091 236195 235282 233661 231750 230457 229495
56415B29495j698k400j972j165j163j709j886j664j429r93k49J47k06o13l76J86
$$ 229495 227797 225397 223425 222260 221097 219388 217502 215838 214409 213416 213167 213314 213108 212495 212119 212305
56399B12305N33Q05J102Q97M8o34n45j14K19Q70K199L762N118O469P931R146J0080
$$ 212305 212838 213643 214745 215642 215690 215056 214511 214397 214616 215486 217685 221447 226565 233034 240965 250111 260191
56382B60191J1078J1733J0909Q448N542K968L77k225l863m177m124m303m083l159
$$ 260191 271269 283002 293911 302359 307901 310869 311246 309021 305158 300981 296857 292554 288471 285312
56368B85312k372k123j562l20M59o4j018j345j365j672j837j328n66K3P42J486
$$ 285312 282940 280817 279255 278935 279394 279330 278312 276967 275602 273930 272093 270765 270199 270222 270964 272450
56352B72450J272m0r67m91M26O13M59P11Q84L88q0K47P22N15J97O66J498J865
$$ 272450 273722 273682 272715 272224 272650 273263 273722 274433 275317 275705 275625 275872 276594 277109 277306 277972 279470 281335
56334B81335K176L285M861N911O301O448O270N655N309N883O848P259P160P227
$$ 281335 283511 286796 291657 297568 303869 310317 316587 322242 327551 333434 340282 347541 354701 361928
56320C61928P591P824P593O791N602M746M765M921L963K150J020R26N84n32j337
$$ 361928 369519 377343 384936 391727 397329 402075 406840 411761 415724 417874 418894 419820 420404 419872 418535
56305D18535j316j439k052k021j075p70j752k357j450m61p84j321o08N41O80L49
$$ 418535 417219 415780 413728 411707 410632 409862 408110 405753 404303 403842 403058 401737 401129 401670 402350 402699
56289D02699Q06J747K299K895M083N016N134N711P582R021Q375P189P929R982
$$ 402699 403505 405252 407551 410446 414529 419545 424679 430390 437972 446993 455368 462557 470486 480468
56275D80468J0888J0586J1278J3595J5858J7081J8174J9954K2128K4468K7213
$$ 480468 491356 501942 513220 526815 542673 559754 577928 597882 620010 644478 671691
56264F71691L0263L3387L6990M1368M5782M9571N3477N8376O3666O8454P3275
$$ 671691 701954 735341 772331 813699 859481 909052 962529 1020905 1084571 1153025 1226300
56253A226300P8868Q4157Q7397Q8607Q9015Q8883Q7567Q4987Q1246P5710O8099
$$ 1226300 1305168 1389325 1476722 1565329 1654344 1743227 1830794 1915781 1997027 2072737 2140836
56242B140836N9687N1801M4219L6610L0111K5563K1655J6952J2408R384O705K284
$$ 2140836 2200523 2252324 2296543 2333153 2363264 2388827 2410482 2427434 2439842 2449226 2455931 2458215
56230B458215l466q736j3875k0859k9785l8836m7313n5999o4693p2007p7631q2472
$$ 2458215 2454749 2446013 2432138 2411279 2381494 2342658 2295345 2239346 2174653 2102646 2025015 1942543
56218A942543q6613q9164q9986q9539q7499q3501p8739p4722p0904o5725n9350
$$ 1942543 1855930 1766766 1676780 1587241 1499742 1416241 1337502 1262780 1191876 1126151 1066801
56207A066801n3336m8181m3341l8965l5443l1991k7917k4385k2603k1278j8432
$$ 1066801 1013465 965284 921943 882978 847535 815544 787627 763242 740639 719361 700929
56196G00929j4739j2317j1118r499p569o837p024o370m841m001l882k913q54R65
$$ 700929 686190 673873 662755 653256 645687 638850 631826 625456 620615 616614 612732 609819 608965 609930
56182F09930K199L623M973N346N433O635Q333Q884Q761R738J1391J1723J0924
$$ 609930 612129 615752 620725 626071 631504 638139 646472 655356 664117 673855 685246 696969 707893
56169G07893J1086J2313J2483J1073R865R530Q733P056N753N225M612M185N195
$$ 707893 718979 731292 743775 754848 764713 774243 782976 790032 795785 801010 805622 809807 815002
56156H15002P188Q388Q910J0592J3512J5826J7280J9674K3544K7559L1625L7366
$$ 815002 822190 830578 839488 850080 863592 879418 896698 916372 939916 967475 999100 1036466
56144A036466M5038N3219O2086P3871Q9406J07177J26450J48213J72281J96254
$$ 1036466 1081504 1134723 1196809 1270680 1360086 1467263 1593713 1741926 1914207 2110461
56134B110461K17826K35371K45977K46024K34689K14502J88575J60094J34056
$$ 2110461 2328287 2563658 2809635 3055659 3290348 3504850 3693425 3853519 3987575
56125C987575J15394J04207R5605Q4785O9721M9544K4333k703k6401m4088n6679
$$ 3987575 4102969 4207176 4302781 4387566 4457287 4506831 4531164 4528461 4502060 4457972 4401293
56114D401293o5956p4281q6422j07049j35357j65531j92721k14969k29693k33395
$$ 4401293 4335337 4261056 4174634 4067585 3932228 3766697 3573976 3359007 3129314 2895919
56104B895919k26105k11953j94128j72943j49448j26694j06238q7334p0599n8466
$$ 2895919 2669814 2457861 2263733 2090790 1941342 1814648 1708410 1621076 1550477 1492011
56094A492011n0967m5090l9431l5452l3323l0753k7158k4695k3883k2367j9342
$$ 1492011 1441044 1395954 1356523 1321071 1287748 1256995 1229837 1205142 1181259 1158892 1139550
56083A139550j7062j6502j5631j3365j1229r831p715m901l454l414k343J08J569
$$ 1139550 1122488 1105986 1090355 1076990 1065761 1055930 1048215 1043314 1039860 1036446 1034103 1034211 1035780
56070A035780J730L085N888P323O860P377R683J0986J0315J0195J1472J1728J0532
$$ 1035780 1037510 1040595 1046483 1053806 1060666 1068043 1077726 1088712 1099027 1109222 1120694 1132422 1142954
56057A142954J0831J3387J5146J4921J5217J6730J6791J5058J4886J6990J7829
$$ 1142954 1153785 1167172 1182318 1197239 1212456 1229186 1245977 1261035 1275921 1292911 1310740
56046A310740J6389J6261J8742K0304J9457J9565K2039K3397K2148K1909K4472
$$ 1310740 1327129 1343390 1362132 1382436 1401893 1421458 1443497 1466894 1489042 1510951 1535423
56035A535423K6394K5909K6470K9908L2688L2763L3390L6428L8561L8049L8441
$$ 1535423 1561817 1587726 1614196 1644104 1676792 1709555 1742945 1779373 1817934 1855983 1894424
56024A894424M1606M4056M4079M5388M9590N2437N1785N1761N4601N6177N4313
$$ 1894424 1936030 1980086 2024165 2069553 2119143 2171580 2223365 2275126 2329727 2385904 2440217
56013B440217N3576N6762N9712N9767O1171O6675P1993P4117P6851Q2529Q6986
$$ 2440217 2493793 2550555 2610267 2670034 2731205 2797880 2869873 2943990 3020841 3103370 3190356
56002C190356Q8357R1778R9470J05701J07740J11806J21545J31080J36487J43380
$$ 3190356 3278713 3370491 3469961 3575662 3683402 3795208 3916753 4047833 4184320 4327700
55992D327700J55559J67327J75097J85042K00664K14781K23096K33339K51218
$$ 4327700 4483259 4650586 4825683 5010725 5211389 5426170 5649266 5882605 6133823
55983F133823K69935K84126L00985L26396L53537L76986M04315M41484M81220
$$ 6133823 6403758 6687884 6988869 7315265 7668802 8045788 8450103 8891587 9372807
55974I372807N18750N63700O22855O87479P52055Q28173R24564J032450J147538
$$ 9372807 9891557 10455257 11078112 11765591 12517646 13345819 14270383 15302833 16450371
55965A6450371J286144J461694J668029J906134K202752K580513L037470L581877
$$ 16450371 17736515 19198209 20866238 22772372 24975124 27555637 30593107 34174984
55957C4174984M257534N107472O147813P410363Q973609J0920094J3313642J6250977
$$ 34174984 38432518 43539990 49687803 57098166 66071775 76991869 90305511 106556488
55949A06556488J9849116K4107286K8861219L3919537L8984311M3070236M4074436
$$ 106556488 126405604 150512890 179374109 213293646 252277957 295348193 339422629
55942C39422629L9539224K8457248J2476994m811355j9879761l0753933l7088092
$$ 339422629 378961853 407419101 419896095 415084740 395204979 364451046 327362954
55935C27362954l9449763l8748854l5996596l2129519k7850110k3612080j9706221
$$ 327362954 287913191 249164337 213167741 181038222 153188112 129576032 109869811
55928A09869811j6299203j3430192j1056496r123298p576046o339994n337734
$$ 109869811 93570608 80140416 69083920 59960622 52384576 46044582 40706848
55921D0706848m522080l865018l328854k875730k491810k175076j909842j675977
$$ 40706848 36184768 32319750 28990896 26115166 23623356 21448280 19538438 17862461
55913A7862461j471392j302515j161861j035330r22245q28789p50017o76176o08999
$$ 17862461 16391069 15088554 13926693 12891363 11969118 11140329 10390312 9714136 9105137
55904I105137n54956n09768m65077m23210l90536l63333l34405l06759k86848
$$ 9105137 8550181 8040413 7575336 7152126 6761590 6398257 6063852 5757093 5470245
55895E470245k70795k50757k29010k12705k00363j85974j71244j61582j54769
$$ 5470245 5199450 4948693 4719683 4506978 4306615 4120641 3949397 3787815 3633046
55886C633046j45136j34507j28068j23720j16124j07085j01649r8060r1526q4021
$$ 3633046 3487910 3353403 3225335 3101615 2985491 2878406 2776757 2678697 2587171 2503150
55876B503150q0517p9159p4647o7900o3344o0125n4888m9729m8481m8402m4427
$$ 2503150 2422633 2343474 2268827 2200927 2137583 2077458 2022570 1972841 1924360 1875958 1831531
55865A831531l8647l6918l8732l8932l6984l6206l6017l3050k8140k4636k1514
$$ 1831531 1792884 1755966 1717234 1678302 1641318 1605112 1569095 1536045 1507905 1483269 1461755
55854A461755j5413p831l546l588o044j1457k0734k9992l4275l4712l5679l6978
$$ 1461755 1446342 1438511 1434965 1431377 1425333 1413876 1393142 1363150 1328875 1294163 1258484 1221506
55842A221506l5246l0948k7387k4522k0197j5791j4360j4788j3910j2785j4699
$$ 1221506 1186260 1155312 1127925 1103403 1083206 1067415 1053055 1038267 1024357 1011572 996873
55831I96873j8571k0524k0538k1454k2802k1822j9390j8754j9434j8301j5836
$$ 996873 978302 957778 937240 915786 892984 871162 851772 833018 813584 795283 779447
55820G79447j5346j6730j6834j5452j5272j6328j5991j4095j2860j2115r720o313
$$ 779447 764101 747371 730537 715085 699813 683485 667494 653399 640539 628424 618704 612391
55808F12391m555m100k317M75J578J289K576N491P011O414N982O172M829J537
$$ 612391 607836 603736 601419 601894 603472 604761 607337 612828 619839 626253 632235 638407 643236 644773
55794F44773j600l942o946j0558j2879j3570j3978j4039j2685j0935j0780j1377
$$ 644773 643173 639231 632285 621727 608848 595278 581300 567261 554576 543641 532861 521484
55782E21484j0227p673o221n886m436j923p87j559k560l751o668j0491j2399j2076
$$ 521484 511257 503584 497363 491477 487041 485118 484331 482772 480212 476461 469793 459302 446903 434827
55768D34827j1918j2506j1869r625p894p465o741n050l738l454l517m178o309
$$ 434827 422909 410403 398534 388909 381015 373550 366809 361759 358021 354567 351050 346872 340563
55755C40563q800r479q662q485q953q151o222n317n583n070l716l496m287l712
$$ 340563 331763 322284 313622 305137 296184 288033 281811 276494 270911 265841 262125 258629 254342 250630
55741B50630j711j197l142m873m517l548l463l290k026o02J84J152K724L651L044
$$ 250630 248919 247722 244580 239707 235190 231642 228179 224889 222863 222261 222445 223597 226321 229972 233016
55726B33016J662K88j297k994m004m330m823n446n335m599m031l313j739l72q36
$$ 233016 234678 234966 233669 230675 226671 222341 217518 212072 206737 202138 198107 194794 193055 192683 191847
55711A91847k231k069j48J411J952K933M647N554N386N883P605Q782Q109O186
$$ 191847 189616 187547 187399 188810 190762 193695 198342 203896 209282 215165 222770 231552 239661 245847
55697B45847L688O44k011k713j669n80J94J650L313L345J816Q60J108R50j74q42
$$ 245847 249535 250179 248168 245455 243786 243206 243400 245050 248363 251708 253524 254384 255492 256442 256268 255426
55681B55426o23q94j912k091j088n71j024q06N44J174L05l07L00N24o11j403m66
$$ 255426 254803 253909 251997 249906 248818 248247 247223 246417 246961 248135 248440 248133 248433 248957 248346 246943 246477
55664B46477P84O64k0K01Q88R10O27J000J817K324K441K281J717J237J761K841
$$ 246477 247261 247925 247905 248106 248994 249904 250531 251531 253348 255672 258113 260394 262111 263348 265109 267950
55648B67950K705Q59j154k298l436n223o655o880o707p115p828q316q721q924
$$ 267950 270655 271514 270360 268062 264626 259403 252748 245868 239161 232046 224218 215902 207181 198257
55634A98257q238o825n871n688n307m450m147m718n124m933m954n243m603k925
$$ 198257 190019 183194 177323 171635 166328 161878 157731 153013 147889 142956 138002 132759 128156 125231
55620A25231j868k226k641k068j424j680k235k383k535k822k324q69J60p1o49
$$ 125231 123363 121137 118496 116428 115004 113324 111089 108706 106171 103349 101025 100156 100316 100245 99596
55605I9596q21j271k314k748j854p89o72q78n70l10q04j470j524j210q65r6R99
$$ 99596 98775 97504 95190 92442 90588 89799 89127 88249 87679 87369 86565 85095 83571 82361 81496 81400 82399
55588H2399J287K90q48j057p23o14p87j219j994k361j305M10P40m89j158l17M02
$$ 82399 83686 83976 83128 82071 81348 80734 79947 78728 76734 74373 73068 73478 74218 73729 72571 72254 72656
55571G2656j38o46k2N20k30j177q94l0J62M2M45Q58O29N70J477K380K059J087
$$ 72656 72518 71872 71850 72370 72140 70963 70069 70039 70201 70243 70688 71546 72175 72745 74222 76602 78661 79748
55553G9748P00Q27Q02Q42J208J092n5j250j466j226j267r97J72J313J456J354
$$ 79748 80448 81275 82077 82919 84127 85219 85164 83914 82448 81222 79955 78958 79130 80443 81899 83253
55537H3253K051K937K994K732L099L518K966K078K204L091L299K472J553J129
$$ 83253 85304 88241 91235 93967 97066 100584 103550 105628 107832 110923 114222 116694 118247 119376
55523A19376R69Q08M53l74j347j501p86o38j953l730m782n504o611p516p548p524
$$ 119376 120345 121153 121606 121232 119885 118384 117598 116960 115007 111277 106495 100991 94380 86864 79316 71792
55507G1792q346r041p993n390k749p53R02K188K849L212L581L473K556J537R80
$$ 71792 63446 54405 46412 41022 38273 37520 38422 40610 43459 46671 50252 53725 56281 57818 58798
55492E8798L09p48j042J07J220O49q04j213n54l38r41j347j196j112j195r28m52
$$ 58798 59107 58359 57317 57424 58644 59293 58489 57276 56722 56384 55443 54096 52900 51788 50593 49665 49213
55475D9213l89n86l78J06K10j3j7J16n9l36k53m2j98n68q48j193j475r01N32J316
$$ 49213 48824 48238 47860 47966 48176 48163 48146 48262 48203 47867 47614 47572 47374 46806 45958 44765 43290 42389 42921 44237
55455D4237N34n14k68O11N24l83p99o10o27n80M33J863K158J185K74Mk84p69q13
$$ 44237 44771 44257 43989 44600 45124 44741 43942 43332 42705 42125 42558 44421 46579 47764 48038 48042 47758 46989 46176
55436D6176m46n01j063j232o22J28M68M09l7p76j096m03O55Q77J10p93j265j265
$$ 46176 45730 45229 44166 42934 42312 42440 42908 43317 43280 42504 41408 41005 41660 42537 42647 41854 40589 39324
55418C9324p38N6K53l96p07K69J476J348L06J5O92J065O89L63L22r7q57j004k60
$$ 39324 38586 38642 38895 38499 37792 38061 39537 40885 41191 41206 41898 42963 43652 44015 44337 44240 43383 42379 42119
55399D2119N52R29J171J390J345J209J294J144J84r59j192p56p49j132r59m12
$$ 42119 42671 43600 44771 46161 47506 48715 50009 51153 51337 50378 49186 48430 47681 46549 45590 45178
55383D5178p32j913k399j515m40j93k40J22M56J48l74l21K65O88N46K2l64k05
$$ 45178 44446 42533 40134 38619 38179 37986 37746 37868 38324 38472 38098 37777 38042 38730 39276 39298 38934 38729
55365C8729J87j68j615k967k753j155L13Q04P62O66L76j73o28q01q39p61m49o4
$$ 38729 38916 38748 37133 34166 31413 30258 30571 31375 32137 32803 33179 33006 32378 31577 30738 29977 29528 29464
55347B9464J48K46K78m3o45p74j05M86K40j84J75Q95R43M36K24L33K22P7L30M33
$$ 29464 29612 29858 30136 30093 29448 28674 28569 29055 29295 29111 29286 30181 31124 31560 31784 32117 32339 32416 32746 33179
55327C3179k91j050n95O06R22N6p91j004j038r50k98N39O51K18K51P62Q91P35
$$ 33179 32888 31838 31243 31849 32771 32827 32036 31032 29994 29044 28746 29285 29936 30154 30405 31167 32058 32793
55309C2793J170J940J852Q29m7n86j487k257j488M29J194q2j538j514p24m96o60
$$ 32793 33963 35903 37755 38584 38537 37951 36464 34207 32719 33148 34342 34260 32722 31208 30484 29988 29328
55292B9328m49nK45M73P64O96L42M93J211J467Q56L07L90M17J5Q0J143K120J892
$$ 29328 28879 28874 29119 29592 30356 31052 31394 31887 33098 34565 35421 35728 36118 36535 36550 36630 37773 39893 41785
55273D1785R70N08O27P08N37K33j82m73k61O4m38j556j737l06J344J659Q99K04
$$ 41785 42755 43263 43890 44598 45135 45368 45186 44713 44452 44516 44078 42522 40785 40479 41823 43482 44381 44585
55255D4585k11p38j185j152r74j246j756j811j231m54O8P1l52m94L21J533J697
$$ 44585 44374 43636 42451 41299 40325 39079 37323 35512 34281 33827 33895 33966 33614 33120 33441 34974 36671
55238C6671M95o32m77K90K58p18j517j269j33J063J480R22J57P4M83M47j29k48
$$ 36671 37166 36534 36057 36347 36605 35887 34370 33101 32968 34031 35511 36433 36590 36664 37147 37594 37465 37217
55220C7217N96J623J937J580R29N7q75j361j235q55l85L10R28Q55K68p1j80q04
$$ 37217 37813 39436 41373 42953 43882 43939 43064 41703 40468 39613 39228 39538 40466 41321 41589 41518 41338 40534
55202D0534j750j747m91O50O67K18J68J92k09n67l60KP1K43Q13J119O34qp1J31
$$ 40534 38784 37037 36546 37196 37863 38081 38249 38441 38232 37665 37305 37307 37378 37621 38434 39553 40187 40179 40108 40239
55182D0239j7l02k83j91l08k05M55J113J157Q29N46P3p48j276r78m02l26n59m38
$$ 40239 40222 39920 39637 39446 39138 38933 39388 40501 41658 42487 43033 43106 42358 41082 40104 39702 39376 38817 38379
55163C8379O4M98O43L95l88j345j639j064l64J1M83J172J335P29K88N43O03k19
$$ 38379 38443 38941 39584 39979 39591 38246 36607 35543 35179 35190 35673 36845 38180 38909 39197 39740 40343 40124
55145D0124r75o04K37L57J14O93J841K076R64k60m06M43J494K073J920J283P63
$$ 40124 39149 38545 38782 39139 39253 39946 41787 43863 44827 44567 44161 44604 46098 48171 50091 51374 52137
55128E2137O29N73M11M14N71L85j07JR40J433L54j532k574k302j471o84q5J05
$$ 52137 52766 53339 53750 54164 54735 55120 55013 55014 55954 57387 57741 56209 53635 51333 49862 49178 49093 49198
55110D9198k23o10o33n35n41j46J013K183K329J470L86m05p02l11M28N13l96j254
$$ 49198 48975 48365 47732 47197 46656 46510 47523 49706 52035 53505 53891 53486 52784 52473 52901 53414 53018 51764
55092E1764j083l68n0J7M61J050J230J265J610J778J149L20K99Q87J233J394J923
$$ 51764 50681 50313 50263 50280 50741 51791 53021 54286 55896 57674 58823 59143 59442 60329 61562 62956 64879
55075F4879K395J839M72n26p40p01o03k49l3n36j154o75P50J579J071J57j45M2
$$ 64879 67274 69113 69585 69059 68319 67618 67015 66766 66733 66197 65043 64368 65118 66697 67768 67925 67780 67822
55057F7822J82J59k2n12j183j607j652j497j054o7J173J991K204K118J777R56
$$ 67822 68004 68163 68141 67629 66446 64839 63187 61690 60636 60569 61742 63733 65937 68055 69832 70788
55041G0788j00p68r08r76j206j382j373j301j201j042q99p14j89O07J037Q48P19
$$ 70788 70688 69920 69012 68036 66830 65448 64075 62774 61573 60531 59632 58918 58729 59336 60373 61221 61940
55024F1940J158J515J045K40j5M4l24p83l90O86J351J316J208J081L71o31q02
$$ 61940 63098 64613 65658 65898 65883 65927 65603 64820 64430 65116 66467 67783 68991 70072 70443 69812 69010
55007F9010l4M20j33q03o02J32M87K53k12p03j166j423j299q55k51K74L97O2k95
$$ 69010 68976 69396 69263 68460 67858 67990 68477 68730 68518 67815 66649 65226 63927 63072 62821 63095 63492 63554 63259
54988F3259l07k66n89j003r28l64L17J088J946K247J443K50J2R64K092K616K663
$$ 63259 62952 62686 62097 61094 60166 59802 60119 61207 63153 65400 66843 67093 67105 68069 70161 72777 75440
54971G5440K510K203J987K191K652K929L009L066K778J937J302J779K890L325
$$ 75440 77950 80153 82140 84331 86983 89912 92921 95987 98765 100702 102004 103783 106673 109998
54957A09998K908K699L167L632L674L846M683O086P975J0383J2702J3973J4184
$$ 109998 112906 115605 118772 122404 126078 129924 134607 140693 148668 159051 171753 185726 199910
54944A99910J4179J4074J2954J0390P001L153j575o984j1590j4200j5184j5485
$$ 199910 214089 228163 241117 251507 258508 261661 260086 253102 241512 227312 212128 196643
54932A96643j5227j4173j2694j1423j0355r067p462n774m214k939k107j636j247
$$ 196643 181416 167243 154549 143126 132771 123704 116242 110468 106254 103315 101208 99572 98325
54919I8325q48n76m54m32n57n70L86K723N284O397O025N749O511P737Q899J0508
$$ 98325 97477 96901 96447 96015 95458 94888 95274 97997 103281 109678 115703 121452 127963 135700 144599 155107
54903A55107J2823J4782J5201J4188J2570J0493P483L468r85n129q389j0578j2099
$$ 155107 167930 182712 197913 212101 224671 235164 242647 246115 245130 240001 231612 221034 208935
54890B08935j3483j4521j4439j3103j1414j0165r157p828o229m878m055l619l284
$$ 208935 195452 180931 166492 153389 141975 131810 122653 114825 108596 103718 99663 96044 92760
54877I2760k841k387k269k555k701k235j526j201j080n75N7j30j269k390k684
$$ 92760 89919 87532 85263 82708 80007 77772 76246 75045 73965 73390 73447 73317 72048 69658 66974
54862F6974k236j372k86N05L94l88r02p99o20p03p19m98l34l59m62q65j739k302
$$ 66974 64738 63366 63080 63585 63979 63591 62689 61890 61270 60567 59848 59350 59016 58657 58195 57330 55591 53289
54844E3289j539O0R40P52P36J397J610O38n26q03n92o21n35K33J184J547J458
$$ 53289 51750 51810 52750 53502 54238 55635 57245 57883 57357 56554 55962 55341 54806 55039 56223 57770 59228
54827E9228J362J070M00j15m5J07j14k17K33O12K95j32J56P25O20J6p0O35J460
$$ 59228 60590 61660 62060 61945 61900 62007 61893 61676 61909 62521 62816 62684 62840 63565 64185 64201 64131 64766 66226
54808F6226J899J949J698J396J646K717M016M881N434O012O439O640P249Q697
$$ 66226 68125 70074 71772 73168 74814 77531 81547 86428 91862 97874 104313 110953 118202 126899
54794A26899J0296J1295J2138J3658J5489J6452J6096J4707J2162Q098L004j913
$$ 126899 137195 148490 160628 174286 189775 206227 222323 237030 249192 257290 260294 258381
54782B58381n953r081j1126j1916j1999j2166j2293j1628j0131q531p112n551
$$ 258381 252428 243347 232221 220305 208306 196140 183847 172219 162088 153557 146445 140894
54770A40894l981l084k921k684j902j032n26j27M92J096J342J425J855K866M239
$$ 140894 136913 133829 130908 128224 126322 125290 124764 124637 125129 126225 127567 128992 130847 133713 137952
54755A37952N492O194O437O894Q093R700J0988J1814J2578J3243J3079J1441Q370
$$ 137952 143444 149638 156075 162969 171062 180762 191750 203564 216142 229385 242464 253905 262275
54742B62275M362L1l967p183r703j1843j3556j4492j4637j4345j3707j2388j0427
$$ 262275 266637 266668 262701 255518 245815 233972 220416 205924 191287 176942 163235 150847 140420
54729A40420q623p769p656p303o118m589l602l355l181k568j800j360j065m53
$$ 140420 131797 124028 116372 109069 102951 98362 94760 91405 88224 85656 83856 82496 81431 80978
54715H0978K81N02K37J67M24L52k68p14n58m38r17j385j043k26J78J27K51O14
$$ 80978 81259 81761 81998 82165 82589 82941 82673 81959 81401 80963 80046 78661 77618 77392 77570 77697 77948 78562
54697G8562P25N03L53L60K92J92K32Q9n84j234r15K13R31N92q5j89K41O66R16
$$ 78562 79287 79790 80143 80503 80795 80987 81219 81308 80724 79490 78575 78788 79719 80311 80226 80037 80278 80944 81860
54678H1860J112J240J266J403J746J907J446N43j16j55J12K11K33O87J621K296
$$ 81860 82972 84212 85478 86881 88627 90534 91980 92523 92407 92252 92364 92575 92808 93495 95116 97412
54662I7412K030J151O09P56J063J103J083J218J275J141J220J745K253K287K146
$$ 97412 99442 100593 101202 101958 103021 104124 105207 106425 107700 108841 110061 111806 114059 116346 118492
54647A18492K307K517K136J202L88L7j98p20j479k122k363k263k320k934l633
$$ 118492 120799 123316 125452 126654 127042 127079 126881 126161 124682 122560 120197 117934 115614 112680 109047
54632A09047l340j794k15N2q86j861k212k187k030j631j105r23j203j373q90M3
$$ 109047 105707 103913 103698 103750 102864 101003 98791 96604 94574 92943 91838 90915 89712 88339 87449 87492
54616H7492P05O85L36L61R05J278Q69J91K98J151J446M20j017j620j429j261j214
$$ 87492 88197 88882 89218 89579 90484 91762 92631 92822 93120 94271 95717 96137 95120 93500 92071 90810 89596
54599H9596q04j96j42p44j264j281j166j190j031m45R4k1o71j117q89l44k47q43
$$ 89596 88792 88596 88454 87710 86446 85165 83999 82809 81778 81333 81427 81406 80735 79618 78729 78385 78138 77295
54581G7295j517j596j259j138j145n16Q16J693J203n6p99n79J08P11R25N85m6
$$ 77295 75778 74182 72923 71785 70640 70124 70940 72633 73836 73780 72981 72402 72510 73221 74146 74731 74685
54564G4685k65J06K44m55j215q36M78J355J130N69O70J520K441K645J762K66o77
$$ 74685 74420 74526 74770 74315 73100 72264 72742 74097 75227 75796 76466 77986 80427 83072 84834 85100 84423
54547H4423l13Q42J651J593R11j1p71q27o7P25P69L62L35P58J072J209J533J799
$$ 84423 84110 84952 86603 88196 89107 89096 88325 87498 87431 88156 88925 89287 89622 90380 91452 92661 94194 95993
54529I5993J250j48j430j870j676j304q35k35K81M62K48k79q61j149j132j165
$$ 95993 97243 97095 95665 93795 92119 90815 89980 89745 90026 90488 90736 90457 89596 88447 87315 86150
54513H6150j319j150n83l07o41p22J74J234J210M19K54J016J631J456J006P78
$$ 86150 84831 83681 83098 82791 82150 81428 81602 82836 84046 84465 84719 85735 87366 88822 89828 90606
54497I0606O85Q16J506K338K260J054l63j271j742j711p53P83J621J159K61r7
$$ 90606 91291 92107 93613 95951 98211 99265 98902 97631 95889 94178 93425 94208 95829 96988 97249 97152
54481I7152N1L15P33J230J221N49K2L50J123J521J407J138Q61N76L54O4n94j371
$$ 97152 97203 97518 98251 99481 100702 101251 101273 101623 102746 104267 105674 106812 107673 108249 108603 108667 108073 106702
54463A06702j426m89O00R75P38L76r0p22j016m93M32Q63M91k56q68j131j109j115
$$ 106702 105276 104787 105387 106362 107100 107476 107386 106664 105648 105155 105587 106450 106941 106685 105817 104686 103577 102462
54445A02462j427j767j460m19N50P19K41l42q46j214j144n72m9p1l11j74K01J99
$$ 102462 101035 99268 97808 97389 97939 98658 98899 98557 97711 96497 95353 94781 94732 94661 94350 94176 94377 94576
54427I4576k84o99o81n02n72q78r91n02N17J375J362N79n0J44P92J072Q02N54
$$ 94576 94292 93593 92912 92410 91838 90960 89969 89467 89984 91359 92721 93300 93250 93394 94186 95258 96060 96614
54409I6614P91J271J385R07K70J07N38J076J343J625K349L205L344K481J332P64
$$ 96614 97405 98676 100061 100968 101238 101345 101883 102959 104302 105927 108276 111481 114825 117306 118638 119402
54393A19402R10J256J266P19k63j227j648j403r13p07q79j076r30n13l43p98j554
$$ 119402 120312 121568 122834 123553 123290 122063 120415 119012 118099 117392 116513 115437 114507 113994 113651 112853 111299
54376A11299j901j567q99j72N98J069O15n44j115l79O66O48l50j260j709j994
$$ 111299 109398 107831 106932 106760 107358 108427 109042 108498 107383 107004 107670 108318 107968 106708 104999 103005
54360A03005j857q03N62R25J87l54Q7Q55J169J175J201J069O49L65O34J341K136
$$ 103005 101148 100345 100907 101832 102019 101665 101752 102607 103776 104951 106152 107221 107870 108235 108869 110210 112346
54343A12346K655K410J274L6l23K5J6o87j428j853k230k424j864q93p11j532k059
$$ 112346 115001 117411 118685 118721 118398 118423 118439 117752 116324 114471 112241 109817 107953 107060 106349 104817 102758
54326A02758j503p68r08j568j824j594j320j098r83j353k205k844k857k667k509
$$ 102758 101255 100487 99579 98011 96187 94593 93273 92175 91192 89839 87634 84790 81933 79266 76757
54311G6757j834m71N74L83n61j176j201r93o50j59J34Kk15j49J32N53J148J377
$$ 76757 74923 74452 75026 75409 74848 73672 72471 71478 70828 70669 70803 70805 70590 70441 70573 71126 72274 73651
54293G3651M27j287k129j447n09m12m89J02N86j01j289j548q98l89k02K55Q35
$$ 73651 74078 72791 70662 69215 68706 68294 67805 67907 68493 68392 67103 65555 64657 64268 64066 64321 65156
54276F5156Q66N12M33L82k84j055q11K33P43M06K37O51P97K10l99m54l96o10o49
$$ 65156 66022 66534 66967 67349 67065 66010 65199 65432 66175 66581 66818 67469 68266 68476 68077 67623 67227 66617 65968
54257F5968j28N21P71P52P49O01O1o68j175j221p24K06J092J383J060M82j91q99
$$ 65968 65840 66361 67132 67884 68633 69234 69295 68627 67452 66231 65507 65713 66805 68188 69248 69730 69539 68640
54239F8640j221p31J64N57K81O6L18N48K79j39p7M82R60Q08m4j093j545j042j29
$$ 68640 67419 66688 66852 67409 67690 67756 68074 68622 68901 68762 68685 69167 70127 70935 70891 69798 68253 67211 67082
54220F7082L13J21o5K57Q27J052O91Jn70p40n54k45P5M03O12N56M61O41Q20L34
$$ 67082 67395 67516 67451 67708 68535 69587 70278 70279 69709 68969 68415 68170 68245 68648 69260 69816 70277 70918 71738 72072
54200G2072p05j261p66Q0M19M16O26R23Q59N49K79j73r64j501j219o36n93r25
$$ 72072 71367 70106 69340 69420 69839 70255 70881 71804 72663 73212 73491 73318 72354 70853 69634 68998 68405 67480
54182F7480r36p76j104j646j405k44Q60J251J206J028N95J5k22j5J47j6k42k67
$$ 67480 66544 65768 64664 63018 61613 61369 62229 63480 64686 65714 66309 66324 66102 66087 66234 66218 65976 65709
54164F5709j17J31K94j3p55j108n07K93J80n92p92j19N90R29J292J636J347O43
$$ 65709 65592 65723 66017 66004 65249 64141 63634 63927 64107 63515 62723 62604 63194 64123 65415 67051 68398 69041
54146F9041O08J362J598O63k99j91K81j09j026j169m05Q6l84j191j569j632j857
$$ 69041 69649 71011 72609 73272 72973 72782 73063 72954 71928 70759 70354 70440 70056 68865 67296 65664 63807
54129F3807k175k008j051K85J258J464J105O05J67k19n45q09j069j226r76k59
$$ 63807 61632 59624 58573 58858 60116 61580 62685 63290 63457 63238 62693 61884 60815 59589 58613 58354
54113E8354M63P23O22N45N95O44O48N83L82L01P64J470J337O9j009o57M15O03
$$ 58354 58817 59540 60162 60707 61302 61946 62594 63177 63559 63860 64624 66094 67431 67500 66491 65834 66249 66852
54095F6852j84n88J8Q33J160J198J117O29r5l23R5L64m9p27j065q88k31O20Q65
$$ 66852 66668 66080 66098 66931 68091 69289 70406 71035 70940 70617 70712 71076 71027 70300 69235 68347 68116 68736 69601
54076F9601K9q64k70J560K660K112J177J105J328Q18j21n72m92k91K23J230J897
$$ 69601 69630 68766 68496 70056 72716 74828 76005 77110 78438 79256 79135 78563 78071 77780 78003 79233 81130
54059H1130J251k97j391j469j146j025r70o27J5O60R72Q42O30Q76J570K051J806
$$ 81130 82381 82084 80693 79224 78078 77053 76083 75456 75471 76131 77103 77945 78575 79451 81021 83072 84878
54042H4878J071M22K38O27J449K218K523K632L097L715L754L245L101L674M270
$$ 84878 85949 86371 86609 87236 88685 90903 93426 96058 99155 102870 106624 109869 112970 116644 120914
54027A20914M486M936N925O599O256N601N621N995N699M681L839L583L459L050
$$ 120914 125400 130336 136261 142860 149116 154717 160338 166333 172032 176713 180552 184135 187594 190644
54013A90644K434J780J050J90p69j629j932j374n27n51j783l250l994m165m264
$$ 190644 193078 194858 195908 196098 195329 193700 191768 190394 189867 189316 187533 184283 180289 176124 171860
53998A71860m155l583k985k901l094l092l064l319l411k790j877j530j699j629
$$ 171860 167705 164122 161137 158236 155142 152050 148986 145667 142256 139466 137589 136059 134360 132731
53984A32731j232j236j936k748l086k969k584j972j338j103j383j759j756j343
$$ 132731 131499 130263 128327 125579 122493 119524 116940 114968 113630 112527 111144 109385 107629 106286
53970A06286q78p04p95p44k81K66L89K25L98R31J102O18J63L05O98Q96J116J501
$$ 106286 105408 104704 103909 103165 102884 103150 103539 103764 104162 105093 106195 106813 106976 107281 107979 108875 109991 111492
53952A11492J490Q13L71J068K435L356L651L781L641K973K550L461N248O212N665
$$ 111492 112982 113795 114166 115234 117669 121025 124676 128457 132098 135071 137621 141082 146330 152542 158207
53937A58207M592L844L025J683L63k18k81n30j219k179l191l860l620k432j014
$$ 158207 162799 166643 169668 171351 171714 171496 171215 170685 169466 167287 164096 160236 156616 154184 153170
53922A53170K8Q87J913K778K987K900L476M878O023N855M753M134M769N960O522
$$ 153170 153198 154085 155998 158776 161763 164663 168139 173017 179040 184895 189648 193782 198551 204511 211033
53907B11033O138N405M930M933N538O657P544P284N933M560L862L407K566J403
$$ 211033 217171 222576 227506 232439 237977 244634 252178 259462 265395 269955 273817 277224 279790 281193
53893B81193K36r43j960k187j554j178k059l697m857n285n675o282o678o754o936
$$ 281193 281429 280486 278526 276339 274785 273607 271548 267851 262994 257709 252034 245752 239074 232320 225384
53878B25384p389p804p932p689o818n239l602k731k607k638k724l141l591l438
$$ 225384 217995 210191 202259 194570 187752 182513 178911 176180 173573 170935 168211 165070 161479 158041
53864A58041k848k690l111l285k766k138j933j847j483j116j211j757k436l033
$$ 158041 155193 152503 149392 146107 143341 141203 139270 137423 135940 134824 133613 131856 129420 126387
53850A26387l319l075k401j684j089o13n13j070j871k118j740j389j293r62k20
$$ 126387 123068 119993 117592 115908 114819 114206 113693 112623 110752 108634 106894 105505 104212 103250 103030
53835A03030M09O69Q94J060N27o76j368p57L86R32R30J070J325J224R34Q98Q35
$$ 103030 103439 104108 105002 106062 106589 105913 104545 103788 104174 105106 106036 107106 108431 109655 110589 111487 112322
53818A12322J62o83n52P34K112K816L185L608L638K722J273K40PK30N64J026J704
$$ 112322 112484 111801 111249 111983 114095 116911 120096 123704 127342 130064 131337 131577 131584 131814 132378 133404 135108
53801A35108K518L272L718L603K966K368K521L506M576M939M593M144L959L848
$$ 135108 137626 140898 144616 148219 151185 153553 156074 159580 164156 169095 173688 177832 181791 185639
53787A85639L640L539L620L339K164N47l63j49L53J85n26r44p69m92o03j069j653
$$ 185639 189279 192818 196438 199777 201941 202488 202125 201976 202329 202514 201988 201044 200275 199783 199180 198111 196458
53770A96458k274k883l321l525l690l970m228m193l821l282k757k358k157k074
$$ 196458 194184 191301 187980 184455 180765 176795 172567 168374 164553 161271 158514 156156 153999 151925
53756A51925j844j359r16q28q75n53J36O07N64M25N52O48L39j20k99m13r33j629
$$ 151925 150081 148722 147806 146978 146103 145550 145686 146293 146857 147282 147834 148482 148821 148701 148402 147989 147056 145427
53738A45427j822j495j305j507j654j514j382j289p85R9N11m7r80j490j615j704
$$ 145427 143605 142110 140805 139298 137644 136130 134748 133459 132674 132773 133284 133237 132257 130767 129152 127448
53722A27448j584r76j94K95N57P70O22r4p31n70jm4q75j601j401k38J362K591
$$ 127448 125864 124888 124694 124989 125546 126316 126938 126844 126113 125543 125542 125498 124623 123022 121621 121383 122745 125336
53704A25336K709J867J290J803K608K421J476J134J677J970J516J421K609M289
$$ 125336 128045 129912 131202 133005 135613 138034 139510 140644 142321 144291 145807 147228 149837 154126
53690A54126M976M338L188K262J750J689K059K583K936L035L006K958K914K755
$$ 154126 159102 163440 166628 168890 170640 172329 174388 176971 179907 182942 185948 188906 191820 194575
53676A94575K215J322O85R14J697K079J776J515J849K306K100J187J70m02l61
$$ 194575 196790 198112 198797 199711 201408 203487 205263 206778 208627 210933 213033 214220 214390 213988 213627
53661B13627J43P04R73J058J293J524J203L14l91m34k63m15o43l41M23J009J038
$$ 213627 213770 214474 215447 216505 217798 219322 220525 220839 220448 220014 219751 219336 218693 218352 218775 219784 220822
53644B20822P17M22L14L31L47L70O07J133J567J472J023P26N01k07j302j806j149
$$ 220822 221539 221961 222275 222606 222953 223323 223930 225063 226630 228102 229125 229851 230352 230145 228843 227037 225888
53627B25888M9R77J684K504L042K644J511N78L37M25L62J57J77P59J883L004L435
$$ 225888 225937 226914 228598 231102 234144 236788 238299 238877 239214 239639 240001 240158 240335 241094 242977 245981 249416
53610B49416L125K744K785L028L248L761M657N081M292L081L009M257N275M839
$$ 249416 252541 255285 258070 261098 264346 268107 272764 277845 282137 285218 288227 292484 297759 302598
53596C02598L549K836L265M316N304N843N738N100M482M474N073N686N781N379
$$ 302598 306147 308983 312248 316564 321868 327711 333449 338549 343031 347505 352578 358264 364045 369424
53582C69424M891M649M558M206L353K306J676J659J805J587J094Q84J237J752
$$ 369424 374315 378964 383522 387728 391081 393387 395063 396722 398527 400114 401208 402092 403329 405081
53568D05081J807J252N32J49R9l6n17j134j493j528j477j461j341j022o92n44
$$ 405081 406888 408140 408672 408821 408920 408884 408367 407233 405740 404212 402735 401274 399933 398911 398219 397675
53552C97675m17K0P30J257J276R52O10K60k53p84q36j05J113K109K310J719R61
$$ 397675 397258 397278 398008 399265 400541 401493 402103 402363 402110 401326 400490 400385 401498 403607 405917 407636 408597
53535D08597P75J301J894J894J445J277J784K712L689M592N286N510N247M850
$$ 408597 409372 410673 412567 414461 415906 417183 418967 421679 425368 429960 435246 440756 446003 450853
53521D50853M586M482M635N273O284P192P820Q434R029R140Q729Q627R425J0600
$$ 450853 455439 459921 464556 469829 476113 483305 491125 499559 508588 517728 526457 535084 544509 555109
53507E55109J1372J1876J2680J3607J4028J3997J4191J4841J5612J6471J7713
$$ 555109 566481 578357 591037 604644 618672 632669 646860 661701 677313 693784 711497
53496G11497J9141K0091K0398K0629K1197K1949K2667K3253K3388K2782K1904
$$ 711497 730638 750729 771127 791756 812953 834902 857569 880822 904210 926992 948896
53485I48896K1662K2152K2484K2061K1336K1014K1284K2065K3337K4818K5954
$$ 948896 970558 992710 1015194 1037255 1058591 1079605 1100889 1122954 1146291 1171109 1197063
53474A197063K6494K6626K6283K5027K2873K0637J9068J8185J7649J7165J6230
$$ 1197063 1223557 1250183 1276466 1301493 1324366 1345003 1364071 1382256 1399905 1417070 1433300
53463A433300J4353J2008J0665J1233J2867J3902J3509J2082J0404R016Q003O896
$$ 1433300 1447653 1459661 1470326 1481559 1494426 1508328 1521837 1533919 1544323 1553339 1561342 1568238
53451A568238N069K547N4j981m000o539r399j2012j4150j5817j6919j7554j8239
$$ 1568238 1573307 1575854 1575908 1573927 1569927 1563388 1553989 1541977 1527827 1512010 1495091 1477537 1459298
53438A459298j9325k0508k1380k2113k3141k4430k5549k6225k6454k6279k5828
$$ 1459298 1439973 1419465 1398085 1375972 1352831 1328401 1302852 1276627 1250173 1223894 1198066
53427A198066k5322k4748k3850k2621k1471k0626j9791j8698j7485j6240j4720
$$ 1198066 1172744 1147996 1124146 1101525 1080054 1059428 1039637 1020939 1003454 987214 972494
53416I72494j2912j1306j0131q836o840m311j749P18L073M961O259P605R626J1960
$$ 972494 959582 948276 938145 929309 922469 918158 916409 917127 920200 925161 931420 939025 948651 960611
53402I60611J3768J4958J6208J7947J9934K1716K3011K3799K4517K5849K7851
$$ 960611 974379 989337 1005545 1023492 1043426 1065142 1088153 1111952 1136469 1162318 1190169
53391A190169K9674L0720L1638L3452L6102L8676M0791M2783M4792M6626M8557
$$ 1190169 1219843 1250563 1282201 1315653 1351755 1390431 1431222 1474005 1518797 1565423 1613980
53380A613980N1211N4456N7275N9049O0183O1142O1678O1511O1169O1364O1900
$$ 1613980 1665191 1719647 1776922 1835971 1896154 1957296 2018974 2080485 2141654 2203018 2264918
53369B264918O1851O0729N8982N7183N5185N2357M8498M4200M0289L7123L4588
$$ 2264918 2326769 2387498 2446480 2503663 2558848 2611205 2659703 2703903 2744192 2781315 2815903
53358B815903L2536L0909K9454K7740K5501K2731J9422J5532J1186O504J239n001
$$ 2815903 2848439 2879348 2908802 2936542 2962043 2984774 3004196 3019728 3030914 3037418 3038657 3033656
53346C033656j2193k0045k8588l7838m6791n3671n7692n9797o1212o2026o1826
$$ 3033656 3021463 3001418 2972830 2934992 2888201 2834530 2776838 2717041 2655829 2593803 2531977
53335B531977o0920o0070n9440n8642n7539n6384n5405n4818n4911n5521n5854
$$ 2531977 2471057 2410987 2351547 2292905 2235366 2178982 2123577 2068759 2013848 1958327 1902473
53324A902473n5386n4516n3677n2371m9957m6934m4485m2869m1185l8645l5317
$$ 1902473 1847087 1792571 1738894 1686523 1636566 1589632 1545147 1502278 1461093 1422448 1387131
53313A387131l1665k8133k5164k2942k1159j9473j8063j7107j6092j4424j2489
$$ 1387131 1355466 1327333 1302169 1279227 1258068 1238595 1220532 1203425 1187333 1172909 1160420
53302A160420j1186j0462r264p051m482k476j261o04k81m7M58J499L125N219P332
$$ 1160420 1149234 1138772 1129508 1122457 1117975 1115499 1114238 1113634 1113353 1113306 1113764 1115263 1118388 1123607 1130939
53287A130939Q770R307R671J0812J2838J5155J7401J9670K1991K4169K6003K7213
$$ 1130939 1139709 1149016 1158687 1169499 1182337 1197492 1214893 1234563 1256554 1280723 1306726 1333939
53275A333939K7529K7296K7511K8512K9252K8712K7465K6655K6079K4686K2706
$$ 1333939 1361468 1388764 1416275 1444787 1474039 1502751 1530216 1556871 1582950 1607636 1630342
53264A630342K1562K1546K1274J9927J8506J8132J8343J7891J6315J3892J0860
$$ 1630342 1651904 1673450 1694724 1714651 1733157 1751289 1769632 1787523 1803838 1817730 1828590
53253A828590P492M354J742p44l547o636j0009j4071j8921k3789k7794l0828l3242
$$ 1828590 1836082 1840436 1842178 1841434 1837887 1831251 1821242 1807171 1788250 1764461 1736667 1705839 1672597
53240A672597l5092l6161l6451l6270l6018l6057l6363l6288l5178l3376l1940
$$ 1672597 1637505 1601344 1564893 1528623 1492605 1456548 1420185 1383897 1348719 1315343 1283403
53229A283403l1224l0516k9398k8600k8975l0258l1419l1805l1490l0986l0951
$$ 1283403 1252179 1221663 1192265 1163665 1134690 1104432 1073013 1041208 1009718 978732 947781
53218I47781l1649l2311l1598k9127k5978k3334k1278j9393j7797j6797j6032
$$ 947781 916132 883821 852223 823096 797118 773784 752506 733113 715316 698519 682487
53207F82487j4871j3394j2326j2145j2749j3769j4717j5035j4548j3738j3188
$$ 682487 667616 654222 641896 629751 617002 603233 588516 573481 558933 545195 532007
53196E32007j2884j2430j1683j0884j0236r694r099q454q125q678j0046j1150
$$ 532007 519123 506693 495010 484126 473890 464196 455097 446643 438518 429840 419794 408644
53184D08644j0921r712q875q862q766q019p371p614q298q533q244p778p048o023
$$ 408644 397723 388011 379136 370274 361508 353489 346118 338504 330206 321673 313429 305651 298603 292580
53170B92580n402n687o123n664m567l959m049m057l694l481l556l353k771k525
$$ 292580 287178 281491 275368 269704 265137 261178 257129 253072 249378 245897 242341 238988 236217 233692
53156B33692k919l207k661j601p58k99K4J48k90j359k641l536l650l028k138j462
$$ 233692 230773 227566 224905 223304 222546 222247 222271 222419 222129 220770 218129 214593 210943 207915 205777 204315
53140B04315j051o86l67l31n96r15j221j658k118k186j683r53m33k41k73l54k14
$$ 204315 203264 202578 202211 201880 201284 200369 199148 197490 195372 193186 191503 190550 190117 189876 189603 189249 189035
53123A89035L09R29J163J049J129J496J387K42j229j646n38J244K581L047K728
$$ 189035 189344 190273 191436 192485 193614 195110 196497 196739 195510 193864 193326 194570 197151 200198 202926
53108B02926J786N45l31l45K06M89N5p47j360j643j755j778j709j681j845k101
$$ 202926 204712 205257 204926 204581 204787 205276 205331 204584 203224 201581 199826 198048 196339 194658 192813 190712
53092A90712k232k286k520k950l218l048k620k318k255k199j944j637j612j929
$$ 190712 188480 186194 183674 180724 177506 174458 171838 169520 167265 165066 163122 161485 159873 157944
53078A57944k152j869j384j519k504l459l349k192r43k98j71j76j30QJ82J39k53
$$ 157944 155792 153923 152539 151020 148516 145057 141708 139516 138573 138275 138104 137928 137798 137806 137988 138127 137874
53061A37874o03l86K15M46Q0k68j59k6m06r81j031m88kNk43l36k25j42k25l97
$$ 137874 137271 136885 137100 137546 137626 137358 137199 137173 136767 135786 134755 134267 134265 134270 134027 133691 133466 133324 133099 132702
53041A32702n55p62j130j520j533j035m10n9J49M37M50l29j539k105j560n48J85
$$ 132702 132147 131385 130255 128735 127202 126167 125757 125698 125847 126284 126734 126405 124866 122761 121201 120653 120838
53024A20838N64O74K55p20j550j579j093q93j254j783k062j972j537r37m90l50
$$ 120838 121402 122076 122331 121611 120061 118482 117389 116496 115242 113459 111397 109425 107888 106951 106461 106111
53008A06111l47l39m13m85j90N39J118R98L80j37k48N8P60J572J870J385O94M70
$$ 106111 105764 105425 105012 104527 104337 104876 105994 106992 107372 107235 106987 107045 107805 109377 111247 112632 113326 113796
52990A13796N42L11k40n99n50k90J64R69J909K461K415J953J182J61p20r64o07
$$ 113796 114338 114649 114409 113810 113260 112970 113134 114103 116012 118473 120888 122841 124023 124184 123464 122500 121893
52973A21893n4O02J554K516K827K457K181K438K641K148J429J542K645L647L501
$$ 121893 121839 122441 123995 126511 129338 131795 133976 136414 139055 141203 142632 144174 146819 150466 153967
52958A53967K423J589J721K288K174J019m14j177j185j065j241j511j454r84l95
$$ 153967 156390 157979 159700 161988 164162 165181 164767 163590 162405 161340 160099 158588 157134 156150 155755
52943A55755o4j94o89j273j739j988j841j065K02J267J520J147Q57R23Q79L21
$$ 155755 155691 155497 154808 153535 151796 149808 147967 146902 147104 148371 149891 151038 151895 152818 153697 154018
52927A54018l73m22L29J168J351R04L98J35K7J51Q14J831K254J443J8q95j066
$$ 154018 153645 153223 153552 154720 156071 156975 157373 157508 157535 157686 158500 160331 162585 164028 164046 163151 162085
52910A62085j143j409j444j053n71j06O95J716K124J556Q43R18J575J996J916
$$ 162085 160942 159533 158089 157036 156465 156359 157054 158770 160894 162450 163293 164211 165786 167782 169698
52895A69698J627J284Q76N94N58M65R0j61J64P54R44P05N15M46J58l34n68l51
$$ 169698 171325 172609 173485 174079 174637 175102 175192 175031 175195 175949 176893 177598 178113 178559 178717 178383 177815 177464
52877A77464pJ58J26j19o63j319j634j347o39P1M28M16M47R36J644J841J313P29
$$ 177464 177457 177615 177741 177622 176959 175640 174006 172659 172020 172091 172519 172935 173382 174318 175962 177803 179116 179845
52859A79845O18O14K18k38j22M71J025J494K110K609K559K216K147K198J754R38
$$ 179845 180463 181077 181295 181057 180935 181406 182431 183925 186035 188644 191203 193419 195566 197764 199518 200456
52843B00456N01N22K86l04l45O09J660J724R55K61j4l02q96j466j510j025o08
$$ 200456 200957 201479 201765 201461 201116 201725 203385 205109 206064 206325 206311 206009 205113 203647 202137 201112 200504
52826B00504q75j754k492k566k361k542l009k969k097j001m87p86j590k371k614
$$ 200504 199629 197875 195383 192817 190456 187914 184905 181936 179839 178838 178351 177565 175975 173604 170990
52811A70990k145j405j050j206j450j484j476j675k081k502k661k276j384n63
$$ 170990 168845 167440 166390 165184 163734 162250 160774 159099 157018 154516 151855 149579 148195 147632
52797A47632m06q59j355j542j476j289j104j155j516j850j813j600j597j722j635
$$ 147632 147226 146367 145012 143470 141994 140705 139601 138446 136930 135080 133267 131667 130070 128348 126713
52782A26713j358j108p69k50m2o06j404j468q01l48n47r98j447k052k456j883
$$ 126713 125355 124247 123478 123228 123186 122580 121176 119708 118907 118559 118012 117014 115567 113515 111059 109176
52766A09176m91M85M28J51M13O80J32r58j736j920j673r66N3N36j56j392j984
$$ 109176 108685 109170 109598 109749 110162 110842 110974 110016 108280 106360 104687 103721 103774 104310 104154 102762 100778
52749A00778j760j537j652j532q19p5k7n30p74l11M33O22n0j025j491j273q53
$$ 100778 99018 97481 95829 94297 93478 93403 93376 92846 92072 91761 92194 92816 92766 91741 90250 88977 88124
52732H8124n88k66M12J274J838J771J012k84j608k199j626l15P62R10K47m88o62
$$ 88124 87536 87270 87682 88956 90794 92565 93577 93293 91685 89486 87860 87545 88307 89217 89464 88976 88314
52715H8314l27o7j71k58J43Q75J382J392R44L5j124j776j290j10P06R10J202J868
$$ 88314 87987 87920 87749 87491 87634 88509 89891 91283 92227 92262 91138 89362 88072 87962 88668 89578 90780 92648
52697I2648K244J837J078N85L76L00N19J011J266J021P73R13R35K29p82j093m91
$$ 92648 94892 96729 97807 98392 98768 99068 99587 100598 101864 102885 103658 104571 105506 105735 104953 103860 103369
52680A03369K29L12j87p34q96o38l07l26p04j025r90p95p23p21n84l55k06j79
$$ 103369 103598 103910 103723 102989 102093 101455 101148 100822 100118 99093 98103 97308 96585 95864 95280 94925 94719 94540
52662I4540k08k82m23o19q63j006p27K8P01P27L48K49M32K90j70j79N29J198J305
$$ 94540 94332 94050 93627 93008 92145 91139 90412 90440 91141 91868 92216 92465 92897 93187 93017 92838 93367 94565 95870
52643I5870J321J720K094K001J871K176K449K042J393J534K681M082N024N162
$$ 95870 97191 98911 101005 103006 104877 107053 109502 111544 112937 114471 117152 121234 126258 131420
52629A31420M286K568Q22l00j118k211l199l199k308j590j580j726j465r96o95
$$ 131420 135706 138274 139096 138796 137678 135467 132268 129069 126761 125171 123591 121865 120400 119404 118709
52614A18709n37l93l16k45Q7O73J075J010P24O12P36R02R04N70p3n70l48N88J483
$$ 118709 118172 117779 117463 117218 117305 117978 119053 120063 120787 121399 122135 123037 123941 124511 124438 123868 123520 124108 125591
52595A25591J564Q18m1k79K42J043J524J521J267R14M26j9O6Q13J626J793J326
$$ 125591 127155 127973 127932 127653 127895 128938 130462 131983 133250 134164 134590 134571 134637 135450 137076 138869 140195
52578A40195P49L76J71J85N67J157J513J367Q31J48m22p02p96j045j528j757j269
$$ 140195 140944 141320 141491 141676 142243 143400 144913 146280 147111 147259 146837 146135 145339 144294 142766 141009 139740
52561A39740k50P85J656K381K645K115J168O35P46Q74N35nk85l00k32j0L97O10
$$ 139740 139490 140275 141931 144312 146957 149072 150240 150875 151621 152495 153030 153025 152740 152440 152208 152198 152595 153205
52543A53205K94j56L6R43J652J352M17r9K21P71R51R08J028J161R68O67P28J027
$$ 153205 153499 153343 153379 154322 155974 157326 157743 157644 157865 158636 159587 160495 161523 162684 163652 164319 165047 166074
52525A66074R99O44N44Q38R90P85P56J209J524J015n3q87j137r79o80n22p37j054
$$ 166074 167073 167717 168261 169099 170089 170874 171630 172839 174363 175378 175325 174438 173301 172322 171642 171120 170383 169329
52507A69329p71K17J044J011N22K71J15m09r47p24J20O40L66l33j087j864k411
$$ 169329 168558 168775 169819 170830 171352 171623 171738 171329 170382 169658 169778 170418 170784 170451 169364 167500 165089
52490A65089k298j647j155j089r99n77j69j02j56l2P9j63o47q84n94NM26L59p6
$$ 165089 162791 161144 159989 158900 157901 157324 157155 157053 156897 156865 156944 156781 156134 155250 154656 154661 155087 155446 155370
52471A55370m67n97o14o42n19j16L21N03N29O33O87L93j62n51n44l03p8L3J31
$$ 155370 154903 154306 153692 153050 152531 152415 152736 153239 153768 154401 155088 155481 155319 154768 154224 153921 153843 153876 154007
52452A54007M74J165J721J412K81o60o40q8J77K05O08J375J832J680J363J257
$$ 154007 154481 155646 157367 158779 159060 158400 157760 157672 157849 158054 158662 160037 161869 163549 164912 166169
52436A66169J202R70P60R80J709K435K367J267k0l40L47R46Q60P02R69J060M60
$$ 166169 167371 168341 169101 170081 171790 174225 176592 177859 177839 177499 177846 178792 179652 180354 181323 182383 182843
52419A82843l4M99J511J806J448J392J695J572J013P73P55Q4j084j403m51N24
$$ 182843 182809 183308 184819 186625 188073 189465 191160 192732 193745 194518 195273 195357 194273 192870 192419 192943
52403A92943N73L93Q62J541J531R24L88R2j00O5P90J567J732J336Q91N85K76n2
$$ 192943 193516 193909 194771 196312 197843 198767 199155 199247 199147 199212 200002 201569 203301 204637 205528 206113 206389 206337
52385B06337k70l12l4P09J592J941J599J150R51O10j50p50n51J03L27p4m23j37
$$ 206337 206067 205755 205721 206430 208022 209963 211562 212712 213663 214273 214123 213373 212822 212925 213252 213178 212755 212618
52367B12618O30J227J213Q50Q75J557K161J873J038P46J164J369R75P69J202J457
$$ 212618 213248 214475 215688 216538 217413 218970 221131 223004 224042 224788 225952 227321 228296 229065 230267 231724
52351B31724Q15O1M33J847L190L859L989L590K580J522J183J400J308P86P16J556
$$ 231724 232539 232600 233033 234880 238070 241929 245918 249508 252088 253610 254793 256193 257501 258287 259003 260559
52335B60559K529K585J687P18M15P49J112J014N84L91O56Q71N08j59l66J27Q43
$$ 260559 263088 265673 267360 268078 268493 269242 270354 271368 271952 272343 272999 273870 274378 274219 273853 273980 274823
52318B74823J377J832K363K759K733K395K127K139K339K573K834L165L445L495
$$ 274823 276200 278032 280395 283154 285887 288282 290409 292548 294887 297460 300294 303459 306904 310399
52304C10399L408L628M443N530O289O603O882P357P756P855P935Q346Q963R395
$$ 310399 313807 317435 321878 327408 333697 340300 347182 354539 362295 370150 378085 386431 395394 404789
52290D04789R571R729J0005J0357J0824J1497J2184J2390J1802J0743R990J0061
$$ 404789 414360 424089 434094 444451 455275 466772 478956 491346 503148 513891 523881 533942
52278E33942J0727J1301J1407J1200J0843J0146R067Q164P970Q101P581O120M475
$$ 533942 544669 555970 567377 578577 589420 599566 608633 616797 624767 632868 640449 646569 651044
52265F51044L525L372L505L406K896K206J770J621J175O7j013j062j86N03M64
$$ 651044 654569 657941 661446 664852 667748 669954 671724 673345 674520 674587 673574 672512 672326 672829 673293
52250F73293K11J68K2l61l82L34J267J899K554L628M681N143N350O014P132Q257
$$ 673293 673504 673672 673694 673333 672951 673285 674552 676451 679005 682633 687314 692457 697807 703821 710953 719210
52234G19210R474J1105J2639J3072J2342J1561J1549J1863J1619J0745R989R938
$$ 719210 728684 739789 752428 765500 777842 789403 800952 812815 824434 835179 845168 855106
52222H55106J0392J0680J0349R495Q441P331O161N060M183L394K426J377O38K57
$$ 855106 865498 876178 886527 896022 904463 911794 917955 923015 927198 930592 933018 934395 935033 935290
52208I35290k18j104k237l319m132m380l927l316l399m182m747m589m261m315
$$ 935290 935072 933968 931731 928412 924280 919900 915973 912657 909258 905076 900329 895740 891479 887164
52194H87164m438m227l991m036l856k854j384k94R1j50j073k346k804j705j12
$$ 887164 882726 878499 874508 870472 866616 863762 862378 862084 862175 862025 860952 858606 855802 854097 853985
52179H53985J61j106k316k225j313p49r07j307j389r72l61j67p00j473j776j659
$$ 853985 854146 853040 850724 848499 847186 846437 845530 844223 842834 841862 841501 841334 840634 839161 837385 835726
52163H35726j829k586l400l703l535l270l085k901k520j742o45K48L42m62j814
$$ 835726 833897 831311 827911 824208 820673 817403 814318 811417 808897 807155 806510 806758 807100 806638 804824
52148H04824l321m616n283n165m718m603m957n387n502n140m286l280k826l345
$$ 804824 801503 796887 791604 786439 781721 777118 772161 766774 761272 756132 751846 748566 745740 742395
52134G42395m387n197n549n568n098m007k926k759l498m276m622m836n091n018
$$ 742395 738008 732811 727262 721694 716596 712589 709663 706904 703406 699130 694508 689672 684581 679563
52120F79563m448l775l293k805k247k043k431l034l367l312k769j475L41J684
$$ 679563 675115 671340 668047 665242 662995 660952 658521 655487 652120 648808 646039 644564 644905 646589
52106F46589J855J435J597K643L862M703N432O447P521Q167Q440Q940R971J1086
$$ 646589 648444 649879 651476 654119 657981 662684 668116 674563 682084 690251 698691 707631 717602 728688
52092G28688J1758J2261J3373J5236J6992J7799J7800J7654J7512J7090J6534
$$ 728688 740446 752707 766080 781316 798308 816107 833907 851561 869073 886163 902697
52081I02697J6491J7121J7612J7046J5411J3492J1956J0876R999R139Q195P018
$$ 902697 919188 936309 953921 970967 986378 999870 1011826 1022702 1032701 1041840 1050035 1057053
52069A057053N578M258L600L569L309K059J05j698l124m602o096o859o646o261
$$ 1057053 1062631 1066889 1070489 1074058 1077367 1079426 1079531 1077833 1074709 1070107 1064011 1057152 1050506 1044245
52055A044245o393o623o226n338m545l957l484l478m153m743m262k916j764j199
$$ 1044245 1037852 1031229 1025003 1019665 1015120 1011163 1007679 1004201 1000048 995305 991043 988127 986363 985164
52041I85164o76P5P08J110J611K131K099J525J225J684K452L052L699M598N242
$$ 985164 984488 984563 985271 986381 987992 990123 992222 993747 994972 996656 999108 1002160 1005859 1010457 1015699
$$ [...]
##END NTUPLES=NMR SPECTRUM
##END=
