
##TITLE=AC1333_TANAH10083_7160795_mNxTH9sknc
##JCAMPDX= 6.0         $$ Bruker NMR JCAMP-DX V2.0
##DATA TYPE= NMR SPECTRUM
##DATA CLASS= NTUPLES
##ORIGIN= BRUKER
##OWNER= Administrator
$$ 1.72 TOPSPIN		Version 2.1
$$ 2013-01-30 02:54:20.973 -0500  Administrator@X
$$ Compression mode = diff/dup
##.OBSERVE FREQUENCY= 400.02188249412
##.OBSERVE NUCLEUS= ^1H
##.ACQUISITION MODE= SIMULTANEOUS (DQD)
##.ACQUISITION SCHEME= undefined
##.AVERAGES= 8
##.DIGITISER RES= 22
##SPECTROMETER/DATA SYSTEM= spect
##.PULSE SEQUENCE= zg30
##.SOLVENT NAME= COFFEE_meoh
##.SHIFT REFERENCE= INTERNAL, COFFEE_meoh, 1, 14.98509
##AUDIT TRAIL= $$ (NUMBER, WHEN, WHO, WHERE, PROCESS, VERSION, WHAT)
$$ ##TITLE= Audit trail, TOPSPIN		Version 2.1
$$ ##JCAMPDX= 5.01
$$ ##ORIGIN= Bruker BioSpin GmbH
$$ ##OWNER= Administrator
$$ $$ E:\/data/COFFEE/nmr/AC1333_TANAH10083_7160795_mNxTH9sknc/20/pdata/1/auditp.txt
$$ ##AUDIT TRAIL=  $$ (NUMBER, WHEN, WHO, WHERE, PROCESS, VERSION, WHAT)
(   1,<2013-01-30 02:54:12.739 -0500>,<Administrator>,<X>,<go>,<TOPSPIN 2.1>,
      <created by zg
	started at 2013-01-30 02:53:06.254 -0500,
	POWCHK enabled, PULCHK disabled,
       configuration hash MD5:
       86 BA 57 50 F2 9D 5C 9B 26 00 A9 28 5F 66 2E 89
       data hash MD5: 64K
       F5 B6 04 6E CE D4 95 C4 53 DE BA 2A 18 BE 87 D5>)
(   2,<2013-01-30 02:54:15.786 -0500>,<Administrator>,<X>,<proc1d>,<TOPSPIN 2.1>,
      <Start of raw data processing
       efp LB = 0 FT_mod = 6 PKNL = 1 PHC0 = 0 PHC1 = 0 SI = 32K 
       data hash MD5: 32K
       78 9B FD DC AC 51 C9 51 43 ED 9D 36 D8 20 A9 75>)
(   3,<2013-01-30 02:54:16.254 -0500>,<Administrator>,<X>,<proc1d>,<TOPSPIN 2.1>,
      <pk PHC0 = 97.10815 PHC1 = 0 
       data hash MD5: 32K
       FF BA 00 2E 48 8F B0 11 0F 12 E5 5F E3 C5 8B 4F>)
(   4,<2013-01-30 02:54:16.489 -0500>,<Administrator>,<X>,<proc1d>,<TOPSPIN 2.1>,
      <abs ABSG = 1 
       data hash MD5: 32K
       67 3D B8 02 9F BA 73 71 E4 D8 25 A2 DC 4D B1 B8>)
(   5,<2013-01-30 02:54:16.629 -0500>,<Administrator>,<X>,<proc1d>,<TOPSPIN 2.1>,
      <abs ABSG = 2 
       data hash MD5: 32K
       D7 EF 8D 60 B5 0C B0 AC 46 6C 5D 89 53 72 22 90>)
(   6,<2013-01-30 02:54:16.770 -0500>,<Administrator>,<X>,<proc1d>,<TOPSPIN 2.1>,
      <abs ABSG = 3 
       data hash MD5: 32K
       CB 00 1F F8 39 2B C6 B0 64 CB 25 C0 DF 24 C3 DB>)
(   7,<2013-01-30 02:54:16.926 -0500>,<Administrator>,<X>,<proc1d>,<TOPSPIN 2.1>,
      <abs ABSG = 4 
       data hash MD5: 32K
       A8 1C B1 33 FD F7 74 A7 39 08 62 EB C1 4E FD 4E>)
(   8,<2013-01-30 02:54:17.114 -0500>,<Administrator>,<X>,<proc1d>,<TOPSPIN 2.1>,
      <abs ABSG = 5 
       data hash MD5: 32K
       AA 00 BC A8 0E 9B 25 A1 F6 B6 65 9A 51 1C 91 F7>)
$$ ##END=
$$ 
$$ $$ hash MD5
$$ $$ B3 D2 63 7D 80 3A E1 81 08 91 6A 86 A1 5F 0C CE
##$RELAX= 
##$RELAX= 
##$RELAX= 
##$RELAX= 
##$RELAX= 
##$RELAX= 
##$RELAX= 
$$ Bruker specific parameters
$$ --------------------------
##$DU= <E:\>
##$EXPNO= 20
##$NAME= <AC1333_TANAH10083_7160795_mNxTH9sknc>
$$ [...]
150 150 150 150 150 150 150 150
##$TP07= 0
##$TPNAME0= <>
##$TPNAME1= <>
##$TPNAME2= <>
##$TPNAME3= <>
##$TPNAME4= <>
##$TPNAME5= <>
##$TPNAME6= <>
##$TPNAME7= <>
##$TPOAL= (0..7)
0.5 0.5 0.5 0.5 0.5 0.5 0.5 0.5
##$TPOFFS= (0..7)
0 0 0 0 0 0 0 0
##$TUNHIN= 0
##$TUNHOUT= 0
##$TUNXOUT= 0
##$USERA1= <user>
##$USERA2= <user>
##$USERA3= <user>
##$USERA4= <user>
##$USERA5= <user>
##$V9= 5
##$VALIST= <valist>
##$VCLIST= <CCCCCCCCCCCCCCC>
##$VD= 0
##$VDLIST= <DDDDDDDDDDDDDDD>
##$VPLIST= <PPPPPPPPPPPPPPP>
##$VTLIST= <TTTTTTTTTTTTTTT>
##$WBST= 1024
##$WBSW= 4
##$XGAIN= (0..3)
0 0 0 0
##$XL= 0
##$YL= 0
##$YMAX_a= 603172
##$YMIN_a= -508241
##$ZGOPTNS= <>
##$ZL1= 120
##$ZL2= 120
##$ZL3= 120
##$ZL4= 120
##$ABSF1= 14.98509
##$ABSF2= -5.573092
##$ABSG= 5
##$ABSL= 3
##$ALPHA= 0
##$AQORDER= 0
##$ASSFAC= 0
##$ASSFACI= 0
##$ASSFACX= 0
##$ASSWID= 0
##$AUNMP= <proc_prof1d_extract_pilot.lims>
##$AXLEFT= 0
##$AXNAME= <>
##$AXNUC= <1H>
##$AXRIGHT= 0
##$AXTYPE= 0
##$AXUNIT= <>
##$AZFE= 0.1
##$AZFW= 0.1
##$BCFW= 0
##$BC_mod= 0
##$BYTORDP= 0
##$COROFFS= 0
##$CY= 15
##$DATMOD= 1
##$DC= 0
##$DFILT= <>
##$DTYPP= 0
##$F1P= 0
##$F2P= 0
##$FCOR= 0.5
##$FTSIZE= 32768
##$FT_mod= 6
##$GAMMA= 0
##$GB= 0
##$INTBC= 1
##$INTSCL= 1
##$ISEN= 128
##$LB= 0
##$LEV0= 0
##$LPBIN= 0
##$MAXI= 10000
##$MC2= 0
##$MEAN= 0
##$ME_mod= 0
##$MI= 0
##$NCOEF= 0
##$NC_proc= -8
##$NLEV= 6
##$NOISF1= 0
##$NOISF2= 0
##$NSP= 0
##$NTH_PI= 0
##$NZP= 0
##$OFFSET= 14.98509
##$PC= 1
##$PHC0= 97.10815
##$PHC1= 0
##$PH_mod= 1
##$PKNL= yes
##$PPARMOD= 0
##$PPDIAG= 0
##$PPIPTYP= 0
##$PPMPNUM= 2147483647
##$PPRESOL= 1
##$PSCAL= 4
##$PSIGN= 0
##$PYNMP= <proc.py>
##$REVERSE= no
##$SF= 400.02
##$SI= 32768
##$SIGF1= 0
##$SIGF2= 0
##$SINO= 400
##$SIOLD= 32768
##$SPECTYP= <>
##$SREGLST= <1H.CDCl3>
##$SSB= 0
##$STSI= 32768
##$STSR= 0
##$SW_p= 8223.68421052631
##$SYMM= 0
##$S_DEV= 0
##$TDeff= 65536
##$TDoff= 0
##$TI= <>
##$TILT= no
##$TM1= 0
##$TM2= 0
##$TOPLEV= 0
##$USERP1= <user>
##$USERP2= <user>
##$USERP3= <user>
##$USERP4= <user>
##$USERP5= <user>
##$WDW= 1
##$XDIM= 32768
##$YMAX_p= 456410504
##$YMIN_p= -645518
##$CURPLOT= <Network HP LaserJet P1505>
##$CURPRIN= <$Network HP LaserJet P1505>
##$DFORMAT= <normdp>
##$LAYOUT= <+/1D_H.xwp>
##$LFORMAT= <normlp>
##$PFORMAT= <normpl>
##$SURQMSG= 1
$$ End of Bruker specific parameters
$$ ---------------------------------
##NTUPLES= NMR SPECTRUM
##VAR_NAME=  FREQUENCY,     SPECTRUM/REAL,   SPECTRUM/IMAG
##SYMBOL=    X,             R,               I
##VAR_TYPE=  INDEPENDENT,   DEPENDENT,       DEPENDENT
##VAR_FORM=  AFFN,          ASDF,            ASDF
##VAR_DIM=   32768,         32768,           32768
##UNITS=     HZ,            ARBITRARY UNITS, ARBITRARY UNITS
##FACTOR=    0.250966925370066, 1,           1
##FIRST=     8223.43324360094, -32184,       -101040
##LAST=      0,             -170654,         -185582
##MIN=       0,             -645518,         0
##MAX=       8223.43324360094, 456410504,    0
$$ Real data points
##PAGE= N=1
##DATA TABLE= (X++(R..R)), XYDATA
$$ [...]
23804 -5102 -62511 1392 8864 -228288 132536 111587 -258558 -129424 30231 -1097 -56287 -164732
23792 -164732 30792 50926 -284207 88059 -62058 -25363 -8187 306863 96087 -184917 199455
23780 -219940 289219 31243 175375 201471 179854 178907 128790 80798 -214355 -189396 166754
23768 -59184 -273065 136538 -273628 -166932 -337645 -203680 146241 -303406 -80263 247130
23757 21959 -23688 197289 -15108 60565 18372 -201299 -240651 73992 -204271 -309293 1029
23745 6681 -582311 -7483 -112311 -312777 -132814 44829 18080 314174 -304550 -232953 -16540
23733 -24725 -270004 355875 -31736 7143 68511 -112436 -117366 75841 -145836 219839 21055
23721 122703 52284 -298833 -41668 -203822 -41250 -47174 -299711 -63215 149968 -26422 310209
23709 82028 95664 -176884 -254788 25180 61499 -103235 147639 41921 -123057 -242661 291646
23697 -66463 -2997 -247758 -116016 -300798 64249 536189 -276747 46980 -72137 103773 85379
23686 85379 -82019 -310679 -138629 228799 -116106 -106966 107144 -127833 55627 -177677
23675 89344 37793 107448 -15020 174782 -15316 -148021 -212787 221103 95057 -168391 42684
23663 -134253 23849 -35042 51376 -2556 -85429 -373074 -318872 -148296 383336 41508 -54805
23651 63752 -10011 8822 149694 -116917 72237 -48062 -421650 107858 29931 -142992 -240891
23640 -240891 210634 174293 25346 -92449 -140501 4511 103843 98422 67274 97894 -97631 1194
23627 -224855 -328239 90729 165750 -205506 45948 219448 -260867 86505 -58556 4449 -75981
23615 99144 46579 -119906 20928 -46474 225682 291664 208923 -242480 127081 -30506 -56719
23604 -56719 158140 -114540 166418 161576 -190251 90744 -7444 35946 20695 -64551 -320584
23593 -320584 60991 236847 149503 346226 84447 210155 -96175 85752 -114516 46899 39502
23582 39502 11346 -96728 -124704 139963 -179865 116202 333574 -5355 144303 -219494 -210099
23571 -210099 94776 321805 -480746 173957 73547 -13087 -46721 97051 -126469 435348
23560 31897 10658 -63280 -48676 -174527 -353804 1838 -49961 -59597 -87815 -220198 -98120
23548 158622 369400 33981 -48288 -143563 237096 42142 281352 74183 144280 -127726 62778
23536 22690 39684 79238 158368 45065 285242 -24674 135923 -81132 -103883 -241263 -107615
23524 44179 231434 -235061 -277420 -331470 -183453 -17256 192598 -90413 -191248 58599 -159497
23512 -112055 -79813 -188219 49133 96735 299936 107067 42876 -78978 -75772 -177064 -44347
23500 42526 27661 86546 399145 -164711 33687 202444 80483 203751 -957 29919 117478
23489 117478 209519 69920 -24288 51755 81550 106859 -205588 -115632 98089 196040 -100243
23477 -217600 -261636 39818 -138709 114931 -21736 -303061 -208160 6911 -65096 -119740 -242412
23466 -242412 133637 -100056 -241485 23318 24610 -90483 322176 80452 -193283 84698 30172
23454 -344313 -182208 -74180 52287 -168235 -86992 40863 -40521 61694 6277 145069 -133213
23442 -157549 114926 -68182 -40563 199538 -125918 5857 238645 -71219 -422259 -68993 72702
23430 -67381 -291097 -227181 -39512 66887 56806 17849 162078 -104297 -154737 -4892 -224041
23419 -224041 -217231 2431 35076 -51999 -51267 -186952 -90879 23102 -54661 -20778 134158 -118583
23406 -121822 -64764 24797 111307 -110805 -246893 -411018 171671 -45625 9324 287850 66210
23394 -12060 -98508 -174694 -389481 -433882 39636 -140450 47635 259012 183691 -194264 168083
23382 262111 24113 -174331 163965 -107506 7317 -113704 -179194 105106 -99137 146002
23371 -300422 -40923 842 -87972 64259 94014 14525 -48302 16376 -281612 -8444 -159083 -311595
23359 -311595 45892 227018 -171942 -129697 173455 37001 283239 1062 96487 -491926 -163541
23347 -1415 477001 17848 -196251 67423 100413 5570 -239393 -182480 -46078 -151094 -14572
23335 -253097 241755 -22282 130913 -8451 133781 -76700 62238 -65976 -11224 -144878 -48382
23323 105222 50675 69588 -81241 177982 -21807 203772 35191 3946 317985 74295 126235
23312 126235 -248573 -49880 38606 396851 -183532 25535 118099 -60502 61464 34364 -203085
23300 69025 -274039 -131087 5142 -14495 204214 126651 -22494 -170638 103727 255658 -214760
23288 -173491 -58357 -294270 246295 152319 -188918 -105205 37855 -8639 -85029 43948 -61542
23276 -168597 91321 217186 -98347 -152575 136480 -89395 272005 -298570 -94199 -64606 -123385
23265 -123385 73110 150490 39843 14659 -232613 -4179 3525 -72405 96237 122475 49191 -137141
23252 108191 -188025 -247446 -179176 -19395 371959 -175677 128444 11895 -123391 127131
23241 -76299 116715 353380 326242 -50323 -248175 -131252 103488 133048 46799 167272
23231 167272 -132517 59361 -60973 -52777 79932 -111089 -270784 -257192 -292607 53335 -57131
23219 152149 215389 -369894 283633 7146 2749 234511 -210147 -306398 -241877 55355 110784
23208 110784 147727 -61026 99277 363149 194305 -57437 -379 -375520 50163 181 32226 -286660
23195 202409 86136 -383975 51602 -197068 -102454 -175434 -61917 -311851 -8455 129593 -321214
23183 -326907 -421818 15354 258880 -155764 -264829 144619 -72434 -79195 331376 -205856
23172 -88151 -32280 -21922 -128043 -228396 -97875 -189286 -540487 -12546 -273256 -131669 123124
23160 193303 -63190 -292913 183086 32691 405263 -224278 -172976 42430 61527 70517 -174558
23148 33579 -57588 251950 -35861 -37506 -245800 -30098 -13663 -270151 -402282 -136093 95623
23136 98677 -261858 -48749 349643 13605 42067 13024 111297 104149 323824 32276 65644
23125 65644 268227 5340 -230437 133765 9305 -170920 96827 4832 77375 75956 49571 109047
23113 109047 138166 -89668 -62851 34750 -162604 -16614 -225787 -275050 -247836 172975 240568
23102 240568 250599 -2703 -98920 286845 60892 -364238 364696 258137 -122481 259380
23091 -106138 -2382 -111551 -163610 39049 -36983 98972 -73232 260488 -214016 -85113 -219809
23080 -219809 36440 -57828 139348 -329860 -55932 -312658 -1059 -378036 15231 201348 -45057
23068 377458 -90148 61675 17459 26408 -223139 329591 16029 179916 -373747 66677 152107
23057 152107 289276 -36635 -44867 237092 339013 31898 -16165 -3173 -457330 130750 87474
23046 87474 -170923 -23860 -251934 221692 -165467 -269114 218813 66889 -101629 99768
23035 68639 -187585 -210904 314942 26665 -84163 139639 254174 171566 109726 166727 -59683
23023 88933 268509 160035 -115995 -128189 128058 -356320 -95938 -253159 278426 202915
23013 202915 -57612 -108052 -99069 -146460 -156591 180223 -214827 -142132 15636 -221134 265249
23001 -60569 -40346 -205266 -39899 -33420 -20692 -109270 -255500 101242 -472575 3537 -252394
22989 252981 -405670 57013 143534 -285750 44765 223135 -227128 105620 339345 -181438
22978 -24012 -174313 207144 -291018 217595 39528 -94656 -107289 24289 -198807 -25364 -420681
22967 -420681 -112836 329943 -107787 -462455 -164081 177248 -174637 -78583 -29814 80490
22956 28724 -96457 -15788 10922 53753 12159 -72115 207738 23527 64660 90640 -278899
22944 -114144 25255 129536 -220990 -236463 -139082 -151912 -199660 -57059 -57317 -175886 -194978
22933 -194978 -108297 -54289 171870 25601 92573 -93125 245082 -18641 11562 -61318 245305
22921 -222653 -248383 60967 4979 243737 66131 118532 -92518 89557 -21378 219256 159902
22910 159902 -360726 238704 -470215 -114538 -118257 -227639 140197 -56506 -200522 -279384
22900 -279384 165847 -190991 142421 -33729 175239 -188263 231604 -90819 -169932 128814
22889 10168 -396009 -61773 -3373 -142197 109811 -241997 -25829 201624 -240022 -193123 -41867
22877 67536 -94664 50144 297379 -16475 4600 126327 153296 255236 -89504 -121967 -196005
22866 -196005 1818 -20816 264124 -237615 -141549 -115661 26756 127169 45895 -31644 -362228
22855 -362228 103586 49716 -9650 29 -82549 -121045 -38275 43407 -47742 222540 -138165 9323
22842 38250 -132891 -259156 -73446 123889 -67840 -51281 -124985 108836 -122232 -75640 -43287
22831 -43287 -105638 16665 -184748 44724 -58057 -335646 -53638 273524 -107196 56156 -100040
22819 -127417 -232485 -250259 55968 -73605 -1888 -135271 -15548 154050 96404 -231721 -38597
22807 244598 -255913 -117909 -133033 -90969 15172 -400 -136301 534717 180401 178991 74582
22795 -146477 108981 -347528 82764 -225365 133246 97218 -364073 68418 19803 -31911
22784 -24040 141963 -215551 -80254 -115830 -130958 -112248 35379 5180 157873 214036 41203
22772 46437 63792 -74359 131117 254689 -42103 -55552 52189 -24313 -84512 -83290 49863
22760 51761 -249550 81738 -9480 142082 114389 -21942 181285 155709 29738 40418 -229029
22748 -336077 203549 -75918 221820 -127192 114002 -79197 164220 -196511 -156326 -244961
22738 -244961 -156598 -160873 269247 -163436 -298037 264420 -91732 -193047 222421 100365
22727 -216361 -453899 20202 258715 -153303 100426 -148675 10821 -41825 -125022 -470440
22717 -470440 -38797 -44009 25195 -21044 -169145 24208 -26098 -107487 127033 12419 -1834
22705 -207728 24382 -168032 -73639 113207 401625 -359992 -123217 52775 -167426 -1065
22694 14640 90599 -225274 -123929 -13963 -9759 -178984 -148543 -199346 143889 -26194 80171
22682 -27922 -312778 12636 -204816 99419 -389854 -184552 122634 49663 -190026 236305
22671 -283121 196988 177482 101968 -134196 -157068 -239636 -81699 26912 -3899 -77379 -459605
22660 -459605 184198 -342965 92848 30178 -238947 217153 -96826 -50310 -79105 -103152 -68754
22649 -68754 12127 -7796 -173186 153748 -118814 25561 284393 204816 -113299 24609 -74631
22637 -48431 -103939 103193 -138846 -155602 -8309 -3912 54319 58249 -272528 63164 -25702 99647
22624 -512 -119630 -193968 -297492 301418 -144734 -200381 150504 46620 351086 -186167 91541
22612 -5064 92340 -239289 27681 -74284 218711 -59460 -54363 -65943 -479706 304441 -17763
22600 -104933 156256 -175708 164928 -238016 20667 -263023 214128 -41967 48248 573666
22590 573666 -212815 141099 19827 -4749 -523212 39809 -190515 -23234 180213 -51415 265327
22578 357851 -84843 -465895 -180860 28577 -294615 -215828 124839 -18214 248972 174481
22568 174481 -43883 -235263 -257585 -147028 -15335 -61025 78051 18710 -102324 119220 -78814
22556 61517 -350139 -154628 -109907 119007 135075 -312724 -105294 170590 243866 54432
22545 -86708 12569 -139320 -28760 225738 151743 -237293 -21988 70356 142789 -25407 -234070
22534 -234070 -54253 -162579 -118085 79195 -7180 76186 -208441 -150522 -209933 -138507 170972
22522 32858 -68208 -64982 -18457 225019 9414 -125706 -281449 88691 43708 -8680 -23340 81312
22509 10737 19886 -35601 -190826 -72014 -84854 208039 -165071 -208961 -98343 -77015 153047
22497 267632 -254136 153899 -270372 -199607 270966 -55614 173121 -118658 -360827 18783
22486 -103847 60774 -8098 187451 -255633 -185481 84216 -172175 277891 60271 224079 -5348
22474 110824 389656 -323789 -54886 -379665 -185004 -16216 36585 104181 -228399 -27219
22463 -397262 73403 -135167 -111016 159524 115445 7590 151656 -1755 -338422 77943 -34786
22451 -315152 200479 59081 -146194 208469 -197199 -424001 12562 -174968 -162899 -99482
22441 -99482 61941 181551 -82295 -297360 32429 -224819 -256912 184676 -284308 272271
22430 -239828 -155450 115165 -223366 111493 57065 170157 4962 -225882 167460 -74470
22419 -277108 182759 -36375 -260788 -117331 -20250 -147567 -37183 -447774 25390 -275197
22408 -11248 -178711 -127941 -73693 -176822 -257775 -81938 -167945 28706 8354 -57074 -256955
22397 -256955 -141500 -110099 301581 -11227 46377 204761 109990 -241735 -243463 -312070 81126
22385 -91157 -42646 -241507 -150973 -128740 -886 -137700 -381816 73682 -7483 110663 13068
22373 6720 198597 -116312 -175246 -90206 -350851 -108182 136271 -398227 235350 -125319
22362 -236885 41740 -79202 360251 -120026 -161862 76292 -58381 -103305 102563 35096 -59995
22350 202099 -75031 -16138 114528 -24852 -62195 -100661 -115080 -182006 -86399 155145 -244404
22338 122322 -118255 166455 -71586 -201098 -109363 -333027 168316 25137 19798 -3667 -93569
22327 -93569 82602 -432431 -238958 50847 -120905 -53521 -118239 28282 -98338 -189015 148995
22315 54734 31718 -5297 11469 -256656 37504 336325 -167631 294474 53583 -71471 -118159
22304 -118159 -37140 -464993 -216969 -5618 237749 127424 -190368 156526 202758 -46780
22293 199765 16073 -139464 -255303 -88756 26978 -195856 -181327 14311 -99138 -138126 -20129
22281 -82183 -145604 -47714 22833 -194717 -138208 91248 250171 -125665 204332 -438211 -132237
22269 -157903 -95805 -333964 -306445 2416 38038 138972 -140698 -23975 -436339 242699 105108
22257 -163155 52379 98365 71697 -266470 -254737 -115832 -106115 31680 83060 -43959 -444429
22246 -444429 151547 -19354 -157657 -132036 121405 -127277 -54797 272058 -135918 154747
22235 87567 94017 195751 356509 57497 -48318 91414 91165 -88526 17997 -6027 109813 58527
22223 58527 -30041 -74440 -34213 -136343 -59652 114199 -2724 -31598 16316 384777 -205150
22211 -139099 -86518 -12581 32236 -125425 -24138 237720 100604 67708 -418 -175313 -9182
22199 -287930 -153598 -116815 190998 -198509 220091 264525 -180486 -58926 -76102 -39389
22189 -39389 191909 -117753 -248148 65919 182271 97184 -226701 -206291 128797 -44949
22178 190703 -113824 -23450 -108608 226620 13075 -404292 -241127 -77979 -35370 -75304 -177653
22167 -177653 -236967 51699 -217759 -77355 160394 -58358 73614 -93802 -48687 -135786 16958
22155 15300 -12532 -136307 44098 51494 -152567 -126940 -45652 -357112 -31460 -330968 103473
22143 22242 -255619 30762 -437606 -329969 -382927 -139323 -2123 -155688 -36089 166583 -126796
22131 -35274 -190877 -62403 -21127 -19217 126492 -107782 38375 14858 -327651 181822 15877
22119 74373 -296239 -346489 10846 -17080 -22866 196521 -140172 -131403 382459 92809 -25258
22107 -261212 -157001 -326410 -45267 -63447 49255 -194856 3591 27623 15104 -269583 -16802
22095 -12665 -11389 -72224 51626 -70075 99568 -284805 12930 27429 -105276 37192 -130149
22083 -65967 119685 -390233 -50949 -81806 97834 -201078 -92444 202047 -180779 -304751
22073 -304751 46211 146829 -205448 -63971 31994 118724 -145039 -111473 -135151 39080 -208148
22061 -13111 17079 -320280 -98826 -49083 56067 173897 -127767 -124231 -78949 -169625 75073
22049 87927 -125867 -85920 28904 35989 -242526 -35734 -190267 -30510 126118 -267091 -496114
22038 -496114 -112353 137857 -41507 -163015 -301074 33786 61283 19516 -45619 -33880 16112
22026 68290 -65892 65901 -187620 -329554 -179266 -90093 -98222 -81644 -35555 317587 -15142
22014 79095 -110339 45602 329405 184996 79859 -189881 -58661 137529 -320104 -286071
22004 -286071 -141799 -194810 86556 -112395 386950 135838 -182079 70078 -57232 94066
21993 -79366 -285419 67417 -7523 -52023 -229303 275054 30383 97633 -102473 -16586 143712
21981 250912 206059 8610 65951 -138629 51953 10268 -30567 299042 -331379 181951 239322
21970 239322 -23265 -91779 -151207 -345864 -101736 76577 152856 -115913 -319909 10371 133014
21959 133014 -154608 -117745 188988 -69239 -1067 43712 -130254 -301458 167513 42008 -18731
21947 -8234 249453 -203349 215469 431467 45445 164159 -99086 -112225 -203247 -339510 -13306
21935 -206489 -191368 -17778 -147243 89059 -306690 94107 -128297 -82134 -330459 231147
21924 -9636 99228 143152 -194800 101273 47707 -233006 -331108 -104153 305788 -26748 68324
21912 -200670 -21030 87276 52250 -57224 67691 -93486 -210209 -118735 -114135 152468 15288
21900 -209286 -22466 46049 82756 -103260 -1049 -57617 -321564 -62095 178956 -109681 -433015
21889 -433015 7951 23268 -346802 34069 -102307 735 145580 -267975 -240814 48421 -48600
21877 -140448 139950 -116191 -63554 -54595 92188 -191918 134193 -86579 -222034 -98423 367102
21865 -245034 -76810 -497204 3592 -18109 107260 -213939 -263826 89709 -1310 -114571 -40253
21853 249249 46926 64702 -57991 -137029 -135398 158212 -138203 -90273 51649 258649 -102032
21841 66356 -291418 128598 -212993 172621 55750 92123 -205531 49687 -278783 -121989
21830 65088 -7899 27054 219439 -139743 -106395 -150089 -72405 -119078 256125 247880 -339918
21818 -221530 -317218 -60889 114398 -35890 -109803 -480357 43454 -82360 -72636 81529 -199358
21806 107290 81348 68494 -44562 -365668 -290332 -27631 125094 -208679 -27082 42520 60828
21795 60828 -166258 -259323 -278663 51387 81955 -179593 65482 100457 -24437 -214931 29876
21783 29160 40366 -235474 210757 46835 -21028 -65592 159179 -17804 101650 -155525 -22579
21771 -154032 -73139 -106772 -148306 180064 87563 215511 187389 -197044 -141174 -53672 242200
21759 59756 226505 -161194 -18205 286534 -276013 96746 608312 49930 1392 -134572 -313754
21748 -313754 23045 -447067 -28491 -36312 -439421 -203255 110438 -218214 -34487 -5086 -207499
21737 -207499 85569 130183 195324 145618 117000 -42762 -28178 -86131 188436 -54470 211674
21725 141157 86938 -70365 209109 37133 44387 -70304 -48661 69261 253400 161472 363179
21714 363179 30043 38456 -314964 -59950 -229838 137452 -151794 -90476 45589 -275049 -62314
21702 -64153 -40344 -346076 228189 -100881 -243733 15856 -97474 -255739 -139640 -187226
21692 -187226 -175221 -210752 -28569 121603 -28659 148433 29535 -91120 -420198 10922 118755
21681 118755 -223212 -167348 -67420 23062 -223215 324968 371321 -40769 -15515 -369448 -37157
21669 -139546 -228501 134168 -229429 -189699 -353085 105863 -122665 90095 -51412 106416
21658 -274476 67828 -200310 -68049 -251452 162695 105909 134107 -274308 111611 138306
21648 138306 27654 -117066 -161727 -30607 176218 -221584 -19029 -139153 203055 -68519
21637 -204539 -285166 -283854 -174426 87828 -80807 -300309 -172206 -54133 237219 15202 50743
21626 50743 41317 241237 -289184 39455 -35489 -26387 -189355 -268770 -295282 61174 93090
21615 93090 -64635 59409 -12979 -239223 -74232 149090 -26362 14714 -70574 146132 -85885
21603 28991 84294 -38411 176227 77055 -79230 -177772 -83658 208286 -160121 -323510 5060
21591 129519 -112200 -15970 -17990 219789 -236012 -15298 -267379 -154494 52744 -63621 36633
21579 -164991 -3253 245222 -467437 -117172 -157222 -21259 113298 -187852 -60463 298665
21568 36638 -204496 -238144 -246449 -124321 140406 6211 -53254 -58181 -75015 -40288 -146638
21557 -146638 -87613 -184379 -67103 327839 -261785 181927 -87907 -281648 169307 89118
21547 89118 -271306 -18388 -51765 7007 -90152 -92495 -48505 -225082 72082 -148923 381785
21535 240136 -53916 5681 66774 75561 -218909 149471 431855 -237953 -71364 7979 126314
21524 126314 -122170 -16550 -190529 -200621 -129794 18973 15351 -5453 -165530 -172326 -85900
21512 34751 -242881 -16103 -358626 -92438 -12992 -195047 81992 88691 125113 -121653 187841
21500 -143830 -164610 130194 -77539 -197818 -201503 -366190 -195638 -362857 -47697 79334 -7073
21488 -238316 228071 172828 239679 374609 131390 1805 -11578 223938 -132570 -266435
21478 -266435 212089 -49725 -296013 359588 -266994 -64133 4543 204298 -194735 39553
21467 -11070 194678 -179684 34073 114168 231770 -240792 90574 -12455 -62892 18547 13937
21456 13937 93758 192778 179546 157786 -1864 108704 175001 -443381 -93373 -178670 -137583
21445 -137583 455784 -156948 103306 -15438 162382 130977 -155556 314116 327529 332052
21435 332052 242610 302908 -85218 12371 31242 27825 -74432 76619 188103 -61497 -92836
21424 -92836 -44543 74435 -37913 -143411 -116496 121438 25899 1640 -47863 60268 99433
21413 99433 -98574 -274146 -153359 -61598 102910 -92183 -111046 -95880 40528 -239850 -221071
21402 -221071 -201159 -20085 -120102 -140041 -332637 -109287 -249648 105489 192531 -124318
21391 93799 -191267 -95228 120894 -174759 -78127 -476546 157067 -309374 -155977 50827
21380 -148277 -43285 9278 24854 -52548 8354 -46983 -89830 -12089 179888 -236666 -9860 -59235
21368 -59235 93204 75022 -138395 -296345 -32326 262739 159025 69855 -190540 -309 -158654
21357 -158654 -2185 -371057 67115 -69032 40735 -354587 -12173 -248334 45004 -12466 -75639
21346 -75639 10791 -158567 -82829 -38178 174485 -45387 -85662 -5659 -126046 -73804 -10514
21334 9203 -486374 -151282 -166836 163849 -370222 -414409 -123184 -192290 -188509 -24608 343189
21322 -92572 -248374 219038 -18373 -292042 -93192 156076 -318433 -284075 96159 -201727
21311 -39510 -82482 -156107 -29656 291071 -116836 -12334 42250 145992 132156 51194 16755
21299 120060 -202096 -185981 69232 -79691 56760 126838 218386 -130557 -299876 -403331 -25112
21287 -66212 -609991 570 -49462 -321078 -66408 146807 200592 -184634 -261546 -18416 107292
21275 -85908 64394 -128694 -89410 -6796 -29841 22463 167244 4870 -56634 -35226 -121760 -179291
21263 -179291 219273 27375 142554 -467482 182337 -52882 -215288 -71340 -277016 259338
21252 -319742 -34596 25035 -353184 138459 -111184 -193478 -388696 148572 29887 -281399
21241 40429 70257 -198885 -84495 -391978 -6903 6846 148832 -19173 -253634 -493115 66212
21229 -177459 -201179 -52588 448056 -86994 -338738 241966 -61659 55118 83984 74832 56790
21218 56790 -1930 -32077 -135329 155227 -108832 20981 -37370 -246913 229234 -129308 44537
21206 -190721 -155860 -299953 47731 38919 -187247 -239961 173493 -97984 173508 -450931 -272288
21195 -272288 -15706 -191631 -45220 -23641 -6210 12025 -129653 -117169 169877 129508 -82705
21183 -93735 -20070 -107513 -353868 11804 -259547 45270 -103363 7005 -264290 37931 -164757
21171 -211707 -37701 233855 -139253 167060 -1958 -29961 229745 155264 -222123 53293 -107504
21159 -28221 103132 239652 -54114 -219084 95594 89291 -25498 31290 -117101 41637 -160070
21147 -39342 -111738 -60479 42764 -302287 -194002 152124 -49159 -513917 -117389 -217904
21137 -217904 -193902 204061 -306412 -116667 -167490 -347083 295173 85094 77609 -2511 -354107
21126 -354107 -291235 -157492 -263053 36614 50909 135895 114955 -175796 22825 -216708 -142648
21115 -142648 17118 171246 -205328 302412 -31948 -140465 -450588 128113 120671 -72413
21104 168877 -105304 28661 -228304 -99087 21311 55733 -41415 170108 127214 -24195 -26200
21093 -26200 -50925 238934 -118469 56676 -52202 -370479 10151 -214973 107081 -97402 282609
21081 98161 -139028 -187319 -141328 -15506 -77556 35169 -174566 60835 93893 -138951 -87636
21070 -87636 -119256 -6912 171155 105617 -121546 -287698 -54399 -3060 186988 -32804 -331664
21059 -331664 -25800 -6205 6904 44646 -249072 -79671 -286031 19185 55977 -113111 -181492
21048 -181492 -20890 51371 -120629 -68575 97343 28708 -298054 98279 232059 -14964 25656
21036 -40975 -219603 31511 273173 -132246 166944 -59257 166998 304868 65194 56327 62574
21025 62574 10448 -178213 72037 -201591 -4909 138600 402786 -80786 -60031 -76464 162054
21013 -123716 -300534 -183277 60546 143830 161544 80712 -34597 236885 170437 461008 315623
21002 315623 257983 -4617 19288 -178843 -223764 -284935 36901 -240852 -128448 130740 -52375
20990 80227 141700 -162087 -446982 -34339 101316 71390 -6282 -182015 -21024 66659 14590
20978 -99662 55107 -53132 -26696 -159853 -53774 -225853 -96692 -70786 135824 -321501 55259
20966 -217227 191945 -343530 -147816 155371 -131007 -2422 -32184 -169340 -123264 -12559
20955 2321 -183801 91633 141411 64690 -27661 -24216 -6898 101645 -155148 5542 -19002 -184644
20943 -184644 -128500 -215382 219217 548951 262499 40147 200424 284879 -281665 -276839 137926
20931 -151384 36201 -55843 3997 -199117 -36362 -81867 -121982 110224 19789 -117681 43742
20919 -211727 -201719 -255635 133085 -108912 -296868 -111791 -65848 5458 -394751 562 -316278
20907 -254549 -198887 -209639 -15201 -120806 63559 91232 78506 -45850 259642 -2450 -16644
20896 -16644 -1124 -31105 -256212 -100752 135610 -54548 -238218 -251479 43305 149637 -69511
20884 73980 292 4853 -274012 -16576 42683 -44741 134657 -89048 -34568 47935 3272 -421605
20871 -326582 -265420 -100387 -32124 -262052 54419 93131 92763 1283 -116713 -392263 -232412
20860 -232412 -274451 259135 307690 -69266 -329202 -189681 -20843 -144858 -83479 -43346 246398
20848 -82952 -207515 141798 -123711 -69999 341136 -101019 -201979 -15146 20860 -410881
20837 193623 -196992 -234348 -43429 -188549 179307 -78388 82509 -161959 -113352 -269549
20827 -269549 -156540 -77332 28901 -266926 -58992 9419 119582 -218661 142156 88861 277909
20816 277909 196785 -102398 -93687 -459150 259135 197447 -276795 -152779 -153418 -122698 -149459
20805 -149459 -60828 -13434 17091 63906 -288549 142072 21775 111385 237750 -210753 -289805
20794 -289805 -160887 -443496 -91152 -119957 103751 -116161 -197636 101489 273793 -47395
20783 3321 -21264 196795 11278 -248153 -29438 20039 55224 191530 -94804 -54858 -304955
20772 -304955 -4267 -282900 74244 47059 -212010 -29937 10490 -133209 -163654 -76159 -152238
20761 -152238 51469 -326682 116154 102259 35960 -126539 168522 -115671 -493219 215823
20750 -200953 -98220 14803 -109463 37358 -189481 -71704 -15877 -224964 -174733 -49633 -77447
20739 -77447 -212643 -80916 74 -31310 -347589 -184412 -117297 -32551 -24805 -245434 -205247 -127656
20727 -127656 -169516 -133378 216426 294195 4343 -86008 -280021 153336 -77413 -88051 -87875
20716 -87875 -189979 -284742 -18708 36900 -284157 -142523 -16231 43724 -189190 90384 -60389
20704 -185232 -110532 -195998 107182 29312 -81102 -62830 51738 14145 54670 -173592 -173895
20693 -173895 115699 -63959 -3451 -72146 -127816 -150287 -138552 -51 -10491 -93885 110564 91039
20681 91039 -46072 -154869 -68676 -86501 -143000 38272 4972 274702 -117406 1959 -138688
20669 4173 54044 -113426 -257257 -3084 -102605 -343005 28545 69162 143741 -336495 438093
20657 -120844 116829 -156065 62315 -98256 -47349 190583 237946 7087 -265386 31719 179275
20646 179275 -242208 -182298 -235735 33321 -33532 -109528 -308390 -154038 -288043 -28257 -299982
20635 -299982 2685 209524 65640 -458940 120514 10739 5405 247927 -5659 116563 -26435
20623 34496 125075 -228046 -189687 79846 185505 39483 -156245 -275215 -100297 26821 -3990
20611 -222354 -311688 -91396 -99333 -54248 271490 2199 7703 -151318 -286912 82922 98107
20600 98107 207579 -254479 -224631 -197030 -18605 -384415 179223 24158 -41441 -221748 -33734
20588 -12111 -214460 -146212 92881 54182 -194918 11872 -270989 -149802 -11296 -141817 40767
20576 -90226 -79464 73530 -17237 54003 -214100 506019 72500 -138851 62703 -119380 -211557
20565 -211557 -114388 -130977 63399 132910 -140088 -337477 -72417 212264 -326218 16036 -141136
20553 -280209 -253988 132714 -379896 -107623 -134117 -186395 170310 -52584 53703 50040 129718
20542 129718 -191749 -229349 70078 43254 111575 -331325 -191141 -121113 -50379 129147 -30152
20530 -37310 -315659 -109500 4479 -167689 167951 -7025 64861 -34667 144436 -194238 -262350
20519 -262350 -233701 275730 153755 -49975 -209416 -86462 -201913 -263043 -48802 78044 -17799
20507 -200097 -109481 -339912 -112618 -6361 -258579 -104660 177812 -188452 -157389 -68183
20496 -6751 -105440 -6569 -178995 -35484 -251917 285799 -17678 56945 242839 -326501 -206806
20485 -206806 -238789 -22846 -265916 154654 -19334 -195534 7551 -297553 128079 -80226 90448
20473 48703 -2637 271547 -46248 -268828 156477 -396108 -97750 22710 -42918 -231012 -72260
20461 180713 69955 285882 -84286 179183 79319 -134730 13459 203267 135510 -215501
20450 -45084 60635 -96680 -54390 135724 104354 99277 -211177 -12673 66117 -28924 -294441
20439 -294441 -200151 -193849 81865 -283081 37429 -91678 11490 13617 -123386 190741 -152166
20427 297961 -101255 -251296 -138036 -68076 -275863 40260 -79420 -300145 85249 -62638
20416 -1015 -81232 -232772 286323 50774 264624 -33849 -17587 -251603 -190733 -319469 167920
20404 -186541 -255491 -245379 -579664 -158500 42513 24329 -52621 -151346 -305145 -330388 -112734
20392 -188709 -34827 118910 91614 82548 -313147 178557 -108607 -12542 41928 274462 -411755
20380 -135831 -76397 101681 194894 -27998 -367948 227717 19257 -24045 176746 121619 -141596
20368 -16825 7478 94296 -178095 -120870 93103 -103785 140437 263322 -75296 86829 153155
20357 153155 283902 116638 -82077 -100020 -23127 -333554 31915 -18755 -154332 -215123 34562
20345 -37950 36552 -17715 -186543 -51012 -199918 -118711 79298 -66992 -41229 209025 -75371
20333 133709 92741 -16368 -89074 100173 -46102 157726 -61598 -66169 -188709 -168675 -66788
20321 -89319 -294734 179195 -282231 135919 18194 -50033 100862 -12318 -236425 -199193
20311 -199193 -93614 33878 -415140 -112623 -10302 -355566 -119478 -11339 -152608 -204876
20301 -204876 79956 96134 -230423 -120454 -45131 199460 -164972 -38961 -100626 120737
20290 -30663 -82435 71865 30318 46163 137790 274915 38015 -40902 -108263 55546 -67110
20278 28729 -138377 228859 -96304 -119627 -162550 -84481 -24939 -224386 -88398 -26389 -78458
20267 -78458 -126847 116401 -6343 186632 54862 -144099 57240 -115548 -282868 -211610 -227595
20256 -227595 -257009 -36730 -199134 -181851 -35427 -196664 -207645 -471513 -118771 -104185 185151
20244 -128138 -361903 -179789 -195961 164376 36723 -267039 -56972 146801 -269003 -140941
20234 -140941 320387 -293432 -40403 176335 -90367 -186602 30107 16287 215615 -54678 383942
20222 80045 208517 48016 234765 -190500 48852 206438 149523 -117805 -245397 -200532
20212 -200532 118382 -186035 81590 -174885 118465 -138401 -287015 -6265 -205379 184573
20201 222614 -482291 66744 146479 8521 276875 -146113 43329 -72748 219954 -58686 337331
20189 -166061 562815 29951 -356356 -126040 205218 255199 4902 -151876 48379 -127621
20178 -273227 -72287 -164082 -189308 -40576 111593 66383 51769 -378124 37322 -327285 -32673
20166 8633 -41260 184661 31334 -188701 118191 -27663 -283963 -139018 -178325 109275 25197
20154 126761 -150702 26386 -29049 200420 178504 141809 165689 -117289 474855 431239 434367
20143 434367 383360 -94253 165462 287820 428497 181231 342449 482523 230812 385976
20133 385976 149090 18784 120341 -41875 161228 -3474 -161186 -284595 190206 11330
20122 -117326 -49255 -42532 35210 -20117 -11029 32915 -194469 38002 -295066 63650 -426403
20110 -132309 -38570 41835 -236031 -187516 82529 -107151 5254 -77774 77542 169458 34387
20098 74882 -27275 -233969 -75489 81005 -118717 209746 -15335 16948 -180916 -122542 26739
20086 -404861 66903 -91052 -41427 22201 -113159 -221916 -70210 -246237 -331968 26061 -142393
20074 -9631 -265623 -103517 830 -201193 -58573 -7617 73427 -218614 -303137 119816 190506
20063 190506 -150674 20261 109608 -81116 200957 -31992 -75840 -404572 -77285 66121 18614
20051 269176 -211443 -175619 10935 28462 -410277 230686 92618 -27511 -169336 -39464 -119252
20040 -119252 -243322 48908 66856 10972 -37605 16684 -34743 203242 -216963 -128240 -262046
20029 -262046 -202546 -392635 -70729 -112370 -280037 -70308 -56056 176379 227448 -5757 27720
20017 -53280 -186042 -199354 -77389 138072 6261 -94869 108803 35846 216722 -335461 -200004
20006 -200004 -205540 247922 230503 -126663 -76297 40094 2461 248540 277330 -30035 219466
19994 171636 -201642 -88019 265563 298070 539714 110199 35099 -124617 239090 241908
19984 241908 353587 212160 134688 138542 7310 69273 -85591 170418 -72443 271640 -132445
19972 -41897 -35328 -174018 -16489 219752 -185774 -72161 38828 -51106 -193355 211782 -18478
19960 270247 138251 272063 506597 227834 153627 -29850 219997 -22757 312281 213772
19950 213772 92703 199348 -146484 359697 -50323 251412 -80621 -128211 -2790 213622 -61462
19938 217065 -182560 10717 49989 -72966 -19280 -71619 81304 -84737 -55234 -107801 -225853
19927 -225853 -323740 131411 -107999 -115864 -141381 -378865 118014 181580 245902 -245774 -360879
19916 -360879 -316081 77743 50127 -258983 -133984 66787 102897 -45554 -337500 -509567 -193644
19904 7775 -228008 104491 13232 -79039 -3831 59911 151471 -70185 -94565 35732 -115897
19892 -484059 110986 102533 351017 -276195 -31968 276654 -160528 13458 -110949 168838
19881 -70330 -439683 -167887 -142322 199127 -158047 119294 178997 85432 -360207 -145320
19870 -151146 -192450 156754 -209538 -393720 -159913 -139907 -341847 -197103 -43683 155653
19859 -208317 214754 30708 -348252 -190248 -99989 -149114 -97536 91463 -180490 -251208 121428
19847 -310397 167290 -398635 -119679 100088 -135466 -91436 505092 -77998 180129 -81174
19836 156195 -4116 167751 70745 -92438 -128077 -202756 -115407 -24680 -260897 16106 -45906
19824 -125041 -110336 -94159 -36667 28228 105652 -443315 429282 67067 -183542 -168138 -169871
19813 -169871 -341540 183788 -72655 -279265 80965 -223610 -159108 -254484 -15580 -182885
19803 -182885 -12386 210761 -192736 498 32766 -7522 -77266 -221298 397894 -180703 -68303
19791 -42891 -254392 -105675 -173330 -369640 -80023 300875 -111862 -72125 -20688 -122969
19781 -122969 44114 173889 -19994 -117252 147223 -193545 -99890 31753 100532 -256371 -215859
19770 -215859 92109 -308724 -167946 -107755 -29349 -171732 -256409 -378334 -131147 -26093
19759 86373 -133661 -75982 -61382 -215635 160271 -191022 24701 111910 243123 -116531
19748 -154206 75570 -57106 -124782 -321052 -91405 144058 -278048 125716 383792 169474
19737 181403 -72244 2321 88945 25827 144377 -257998 51246 -88759 105914 315274 355165
19726 355165 747410 394574 43454 -19789 65357 241370 -167677 26615 -174840 12285
19715 -287350 -57114 239241 1753 -345841 -14451 59609 -35563 37807 -63361 47728 -179335
19703 301793 -81605 235735 -75717 20460 5415 69400 -40486 483456 212043 544581 654068
19692 654068 184230 -25978 -67974 -137965 -241217 144383 -118614 -41737 102507 255470
19682 255470 -118379 -391467 70196 -231602 -215531 -82233 149422 -110165 201802 151706
19672 151706 26550 -222135 -191021 -167064 -85590 341006 -329024 225453 -169812 -57144
19661 -329064 110127 80950 14021 -153530 -246846 12493 -140337 -192410 -243455 123674 -110206
19649 58827 325807 435529 158308 -99080 -181111 61457 29421 -250279 77002 -286439 -51128
19637 -188052 64579 -374387 113789 -104659 -20504 101126 17210 85746 12989 189823
19627 189823 83700 80644 -54066 64845 152249 109666 -49576 -357877 -45236 -115497 -148846
19616 -148846 33812 139522 -272550 486742 106904 119923 -216656 7041 -122119 -103676
19606 -103676 -8739 33194 -32227 -196849 -74498 -62534 45907 119742 91819 -89075 -116292
19595 -116292 -277929 -223059 -24577 209227 127613 -66801 -70170 -318068 1670 -334606 -176994
19584 -176994 -51032 74555 153384 94038 155027 132584 13932 -44781 242022 32040 -61223
19572 -154535 -152345 -259361 -92311 -70307 -46298 -251171 -269429 -117949 -61992 186955 -86780
19560 -188617 -1718 -209794 171180 -288131 -46958 -224660 192756 2253 67302 -135013 -131275
19549 -131275 -28375 130249 -528383 -458775 -163513 -50554 106572 -6280 96174 60592 63111
19538 63111 -217330 -16682 -75226 524897 -187488 -46587 39967 147843 -177847 -69898 -152390
19527 -152390 -114498 -290636 -221900 -51127 -405414 -37083 -257548 -145370 -317287 118825
19516 -183936 -286496 -149169 163042 -553760 -139329 -223521 -135556 103704 -530872 -150298
19505 11443 128704 46812 -166843 -180981 -107513 55818 -90692 -366529 -559212 -27724 -120911
19494 -120911 -62118 268537 -3163 -6568 -29554 49224 21794 -297312 49171 -133115 -5570
19482 -36352 -176349 -278105 9260 174771 -178842 -33597 -96247 -112293 170857 34746 -352935
19470 -48987 -9694 -76330 -517675 73089 -170965 192888 70403 241251 259023 -30514 -171908
19459 -171908 15489 -291800 36465 28638 -285973 84273 -259576 32108 -15557 -186511 194266
19447 261761 44187 -346520 -39382 -12803 -190497 37923 -184832 150576 -383529 -206758
19437 -206758 -185850 -36101 5160 134956 -245598 -139784 271560 57350 208683 73437 -316677
19425 -2084 17000 -169940 -109423 44069 -281812 267306 -126054 -281975 136880 79264 -406676
19413 143086 -122148 -43719 47756 -594034 -105039 -64493 -67081 179170 54014 67062 59567
19402 59567 -194394 -63325 69445 43389 -163165 19723 -220037 -316562 -79385 -359460 -398858
19391 -398858 -110031 -27379 107363 -102110 -62576 179974 79475 243472 -2282 39203 -211823
19379 -64833 -197589 103812 -93751 21521 -125895 -22570 -6419 112278 53489 177434 -147759
19367 134229 -93817 63881 -96288 30310 -56735 -221810 -152852 86659 146816 140794 -136717
19355 25884 -123721 48977 -275893 -100533 -322870 52829 206551 -128762 -119395 -130076 -123711
19344 -123711 -345853 -91371 -24788 -349564 -240885 -71161 18367 -6117 35884 205898 -179410
19332 -273725 63009 -117419 -89087 -93276 -73827 -47958 163492 8833 -203210 -116248 94118
19320 -67799 -269850 -317383 161671 63135 -139592 -91528 -18954 235133 -28414 437 146628
19309 146628 146339 -69431 54948 -59572 -233834 134378 117441 -65914 6713 -38310 8289 -99604
19296 -102950 -68584 -33216 -41431 37310 -365794 -202469 37239 -257187 -333189 -338342 -147679
19284 31474 -115604 9566 -169073 11222 -146943 -194501 -99389 -145082 43216 -286365 102813
19272 -31170 -151505 140452 -63839 -131876 -75407 119759 88946 -193658 155800 -107297
19261 2786 -5644 51302 -536342 -26797 -38701 82460 -337861 -265679 52216 -143979 66727
19249 -41827 -201494 -415725 -188789 43715 296571 -73845 -33097 114516 67944 5515 219683
19238 219683 6140 -85242 -18535 125113 -43850 -41994 -142411 -278729 -306845 -89545 -125255
19227 -125255 -144795 172163 -103081 -195832 86985 75752 60028 151468 39165 -240202 -51895
19215 -239000 -14523 409633 -128374 -5665 -136533 -58543 92185 36939 13810 -14586 184937
19203 90055 -133960 -257966 -373232 -50153 16879 -147230 220229 174662 -108243 -116650 -153435
19192 -153435 -169720 -120777 167815 -112574 -157321 -9742 -252113 106390 -132730 124354
19181 112401 -94839 -230612 440300 -56611 152111 -272933 100414 -40364 129181 31789
19170 -235834 139504 -33360 473874 -266342 -53622 -216353 192659 14774 -332680 -397053
19160 -397053 -79734 -131054 -99347 130899 21196 151834 -35562 -205657 -188446 37485 -85544
19148 -185009 187428 231048 -58535 -148460 44582 -94168 -495674 -263303 181267 -175159
19137 174605 -40857 -508868 96877 -104858 -30094 -321391 -26629 16392 -54858 -81569 -280498
19126 -280498 -64010 -5204 -301051 277453 -106252 -35376 -88053 528628 123687 207363 10423
19114 -12410 105895 57086 148077 28738 148147 -142112 -78236 -40619 -195442 -1356 -86670
19103 -86670 -57501 -268713 87442 -64384 -5219 -193444 251135 -175567 119013 -112818 -292066
19092 -292066 -4479 334988 -31564 -9586 -73428 -134922 61422 -198129 80657 -229154 -224240
19081 -224240 81831 -264768 -156741 -245216 -188561 -283140 -279611 4693 -68810 54534 -161170
19069 -270316 -25942 -62186 8752 55080 -269576 -9315 -46120 -431329 256686 -194543 301470
19057 -1811 220488 -205798 38255 54451 17967 130846 -218733 -52314 -154658 -84522 -128824
19046 -128824 -334177 89679 -285001 -48823 62769 131894 -171759 145912 -83599 -168741 -213943
19035 -213943 -191057 -134544 -156375 177336 223107 -104903 -128776 116735 -71437 20833 -383110
19023 -12811 71718 -234747 -51678 -15270 -24083 135935 239505 -26105 -174978 -46305 55807
19011 74725 -171771 -29936 -7646 285606 73416 37837 -141930 -198767 -233414 122682 -261179
18999 -72391 -4232 -338731 108995 -185275 173216 -159902 -1136 72295 -348960 22147 156974
18988 156974 -10480 -24299 25384 47039 -147448 -57433 -251580 -65416 -72529 -190335 -112472
18977 -112472 -127583 -249818 -150933 290414 -508991 -375946 -127062 -34599 305719 505511
18967 505511 567302 558570 239960 -7493 -4691 84246 80841 343237 88402 -93153 -67642 -180222
18955 -180222 82161 -73222 -215203 -340288 -8314 286656 -36990 -118781 -215931 177257 -350490
18943 98573 -135285 -73068 -5288 -249219 233083 -432024 48241 -423146 -116197 -242796
18933 -242796 267052 -40656 -99198 -67220 221404 16699 -310206 80202 298778 -396763
18922 759 -100011 -349679 -132931 -37049 103095 277971 143323 32553 -109238 -24986 65586
18910 224645 494964 -166740 -4872 275278 140549 674761 480619 141424 249731 -121630
18899 25741 113431 -100498 -80425 -75478 -69510 -75645 205371 -205646 -194007 82209 -12716 193322
18886 -877 235374 310677 -246711 -18687 -150230 -494408 89237 -150215 115016 112975 -12850
18874 206565 -201356 276944 69492 61686 -197832 -280324 -57311 99954 -190885 -71700 -428984
18863 -428984 321723 136978 488349 137992 -238064 36640 -177989 -171433 73785 -290191
18852 92595 -610881 -68831 -130168 147409 -46483 197393 97463 60703 -86620 58869 -64300
18840 168061 170886 -374682 -65833 -113291 158031 35805 -57506 124798 -356149 185749 -304196
18828 109940 -84087 -313571 -135228 37479 61256 84149 -196059 -38094 -43859 -219232 7205
18816 -33390 4374 -58440 79194 270082 394479 -9523 -315484 109731 16807 -47876 283499
18804 254305 53118 -69621 -38652 75727 149855 49095 54352 -137225 93626 -43452 -172146
18793 -172146 55546 -303833 -192861 -96710 178348 -237498 -73020 -168498 -5059 18289 -38421
18781 -75103 -145798 163024 153145 116745 -112117 -134842 -144516 -234356 136466 -128474 112444
18769 -331503 180754 -201811 -19272 -278209 177405 -27674 -67912 -256777 85505 17069
18758 90140 92124 348841 -15602 -75497 27020 103933 -290840 -248859 13818 -270606 174969
18746 -18838 -28631 316200 -112884 308686 -80609 -186937 -121520 313624 -155417 300759
18735 1484 -52160 -76262 -276381 -373854 47520 -35415 -53164 215039 -36923 -148194 -76521
18724 -76521 -74984 -149472 -12625 -93268 -98240 -150117 153216 35140 198760 189876 -123030 125905
18711 114544 13677 114933 -264012 -179884 25522 26784 -63809 -434065 140927 -39381 71772
18699 -451263 -57928 -285988 -15485 239878 -6985 -27480 242027 -192196 -285515 -24901 -243716
18688 -243716 -316095 -48688 84709 3834 -249948 3376 -203386 -195157 -291851 137512 -102088
18676 -9613 113891 -122010 50800 -191716 109507 -462015 -95593 223285 -19971 108266
18665 -155183 -76517 -73632 -87675 321526 -9891 180728 -71275 -263352 -163325 -333685 176670
18653 -182652 6610 -233979 209744 77829 14465 101842 -185080 -184281 -258034 -135087 -88704
18642 -88704 302065 -221355 -18022 68302 -138708 -68564 -106779 -158561 -70603 26707 -435962
18630 -65751 -121820 -310727 -136657 -164282 -346474 64954 216107 394219 -232327 -10727
18619 98952 -174583 87722 171581 -207905 234108 96317 19715 -279861 96871 -502877 -205527
18607 52101 263937 114423 -265498 -104706 -215515 63680 -305949 -77234 -176861 172851
18596 205607 -49303 209050 21085 -151343 -84150 5327 -598 -409197 -78782 288718 -35740
18584 -60573 -72125 -123577 40776 -59009 -45807 60611 -283115 -122715 -295247 -145392 8656
18572 -205601 37162 83104 44992 374402 -5543 -216599 240416 -274800 119006 -99149 -235848
18561 -235848 -244677 99229 -128772 -366987 -282572 -40773 102026 6084 -285159 175740 1134
18549 -380711 -78363 -161971 106939 133092 46667 117527 -403097 -108640 -75278 127370 -88702
18537 251297 -371200 120250 -214129 -40755 493872 101659 13811 -196475 172946 -37659
18526 -72191 163982 -1788 123245 -26924 -38612 -127961 138570 -32551 -366650 41404 17916
18514 -291872 -339997 -62107 -70592 124986 -180085 95953 301008 5171 -221821 -187632 11631
18502 162939 274597 -274910 11174 -44000 259530 49558 -76949 72728 57312 -113560 -88463
18491 -88463 -86606 -46016 -115460 -75970 -36733 -30220 75881 -13405 -209636 115018 -181861
18479 -95196 136027 -285283 -182868 -21720 -33647 71419 131642 -170192 -439289 -269496
18469 -269496 -54237 -266413 -301700 -88402 -150070 -48469 79751 102249 -207607 -65210 -230272
18458 -230272 -79046 185689 150853 33029 -169914 94404 -88615 59084 -98512 -78433 -25109
18446 290483 85437 -230906 20196 -164808 141807 -118443 -165032 336817 76761 -321456
18435 94798 -161954 -87897 -188374 -139861 99076 -197206 -11720 -387555 -63559 -124221 132639
18423 -500239 2842 32708 185503 301101 -95369 -156477 210295 54657 -59369 91007 -334962
18411 -246981 -97160 -148888 -164060 351573 -125539 -121185 16354 -4338 253433 116246 -297412
18399 46091 -251654 29129 -195351 89065 -209225 77992 -51258 89726 117272 70328 -307931
18387 104545 -164522 -102431 -159334 214131 -63533 -6614 -469681 -241915 141313 243321
18377 243321 32321 -132571 -376864 -24932 2275 -39196 10400 121433 236549 133415 142921
18366 142921 95164 -130767 -219806 7264 -114119 257945 42908 -183786 -141986 88358 -55106
18354 -58112 -71153 122112 194104 -109674 -20219 169530 268290 76553 -95959 -126862 -304242
18343 -304242 -239738 180242 38332 -221071 -2702 51926 -280175 -156557 -33000 -6293 42432
18331 46824 -24436 -251104 41445 360211 58342 -319287 -134485 -65513 -48383 -67520 20064
18319 241666 -201852 -133393 -6766 172806 -42259 -19712 -200783 -165132 -44001 53021 -91159
18307 240680 -149653 153824 62195 -2366 -199324 57469 99181 -131426 -131151 104636 426241
18296 426241 11510 32148 -200517 227806 -149830 -95467 19491 -144309 -73673 -27105 -24430
18285 -24430 -131380 36309 -163254 -162452 86849 73086 28562 -51868 320106 -23599 87458
18273 48441 -195219 -43663 -282901 22480 12933 51259 223317 53313 -11009 81460 160362
18262 160362 14241 -43988 -149391 -261235 -78613 -181655 62789 -92169 -177482 89034 165405
18251 165405 11010 249595 -126176 -253166 112275 222590 -156229 -304618 -142793 -342841
18241 -342841 302191 193697 100876 46649 -101496 -88203 -148075 65191 219376 308025 69723
18229 21083 -102360 -325048 226632 -191005 -25988 133509 -58228 78254 -103917 -174313
18219 -174313 275343 45353 -283924 154201 89084 42624 -14746 -114452 38234 -74850 -55492
18208 -55492 -177595 -323010 -81233 -18334 -44142 -342739 -138492 -45322 -83587 -5857 -41450
18197 -41450 52059 49043 -69599 -295056 70558 149279 56655 -3330 -306307 -259951 43741 -40631
18184 369758 362765 366262 -129115 -75403 249773 -193292 31571 89818 -121182 -33135 135362
18172 -282699 -77309 -101770 -22673 -287100 -111905 -171699 47701 -210326 41304 10283 -33473
18160 -22669 211710 -164964 -75672 -127004 273699 6237 299616 -10276 6302 -70345 -43298
18149 -43298 -144150 -204681 123822 -153120 341218 23499 216701 -275881 258072 -203703
18138 -148253 11421 197164 -31338 -47666 -137618 -103872 -169646 295383 100175 -356914 226790
18126 223112 -193319 -172123 -103026 -33435 -123277 -111286 2226 351059 88561 237071 -88095
18114 21460 263909 -241328 143535 318964 -9483 135969 47659 -57410 -115782 49669 -207988
18102 458880 -235229 263847 40092 39892 69875 -46221 72460 -9679 113191 -136733 31782
18090 -155953 -141767 -36565 -1384 239470 50225 70625 -57456 156709 -24392 -235581 -83412
18078 -166192 9280 143018 210953 -51914 -98698 32818 -165195 -346412 -169147 129470 149008
18067 149008 -301410 159535 -88775 -228388 -303787 -112488 -122582 64724 243530 -183689
18056 31713 -226534 -56819 49609 244144 32132 446608 -235204 19488 104156 46520 -3738
18044 -10626 -22858 -161400 262295 238036 -67601 -46438 -81300 -39316 265101 -56559 -76377
18033 -76377 293583 -345208 1397 -124939 -226201 -125448 -163499 -39514 230331 98224 -277211
18021 186118 -139420 197489 302747 -218669 228167 251956 -70184 -59268 -34284 -7606 -172483
18010 -172483 -251946 182253 -253800 37980 4359 169985 -85399 -409881 249889 40614 -14643
17998 62750 -279391 123489 34982 -151542 -169846 44301 -110149 180517 166872 -128130
17987 102343 283476 50632 59056 -244342 -29798 100824 -17975 179367 66233 144332 -262321
17975 107950 130694 -98728 254556 -113616 -44710 20083 -81137 -85143 237250 236849 127439
17964 127439 -139358 52846 -21750 -244495 150439 58521 69149 -100350 130788 -132025
17953 -89564 -39217 142417 43320 -87383 145264 -260560 -101869 178192 244791 134878
17943 134878 42484 -289265 -193254 14321 -260384 125345 433125 -27428 230 34068 -62307
17931 85144 6654 257849 -125812 184525 -30585 174103 120514 183482 -150945 168643 227625
17920 227625 -149208 91411 251017 30238 -177680 -98137 -162889 158377 -63611 -120344 157267
17908 31479 -89595 189710 -264083 214129 -191755 193901 -63369 165171 11961 -161115
17897 181838 -41437 308924 366440 -58306 -390979 -124710 112557 45085 -26379 -33440 -178833
17886 -178833 -15432 160761 151105 -113456 384274 228255 71540 52194 30388 -93333 429298
17874 360291 -319852 -74511 -23441 103109 -185494 -99011 -19462 -144888 -29099 -297500
17864 -297500 4567 17666 1711 -265778 71194 -44448 -267671 130817 140028 173344 -55187
17852 129195 -141249 -16863 199571 7150 76304 513583 -131399 207616 -245341 63827
17841 148812 -167205 194533 -57632 -116132 187457 216010 155836 -310886 -108573 149462
17830 309674 48464 40412 -38683 116095 -312914 72563 -57590 140578 -256125 -92065 -51575
17819 -51575 246971 161092 -87037 -102136 29047 -40079 -167335 181951 -95415 45255 131030
17808 131030 201084 123067 419418 144169 -85949 153034 54585 189101 286094 10387 19334
17797 19334 -73795 57423 206947 -123419 229575 -14276 -26031 -21873 -712 27297 34974 -187910
17784 439112 29985 151446 42577 -55965 14121 8720 243453 -243717 -57029 183878 31373
17772 188083 308994 77382 115306 162772 178461 114205 -10517 86532 -43419 48307 300975
17761 300975 -440409 -79531 140440 -114936 102342 284527 77163 -222437 70726 -85363
17750 -13213 -560 -200647 461537 -75965 210501 -175220 134281 23584 58447 220444 200101
17739 200101 439820 87385 -27219 1509 101318 -79674 236992 158262 -178902 -142348 45604
17727 -26187 -398074 267851 22151 -135837 111091 -110817 -131602 -265998 -14605 127466
17716 189721 12852 -197494 -182239 10251 317759 -80835 77315 -84188 236169 -117341 175400
17704 199331 -202544 94554 23323 80972 202660 192250 -19593 -8052 118906 312280 37751
17692 400987 372627 -33319 16932 -13361 374584 -31842 53528 -40543 353565 143511 -92115
17680 -52560 400737 222997 93762 -190202 -86819 202137 304312 -187425 -99247 42486
17669 163215 -67088 71050 -76669 -57034 244090 28356 146500 -17542 36558 8033 125203
17658 125203 20115 -273505 431049 285639 -64523 86078 210836 109716 178750 277050
17648 277050 -148219 233463 117071 -48589 466665 469317 277407 -6692 272900 -167338
17637 364297 -61960 -234808 237160 171122 418599 -325185 282716 2376 236305 280430
17627 280430 -2473 12088 98812 299836 112617 350791 134915 8790 269271 213928 347393
17616 347393 135754 25300 186423 282272 84929 -36384 78565 127843 -82676 360709 18073
17604 331896 202505 203017 343975 -225189 -55962 72067 -156000 411024 131877 115988 -87253
17592 335803 153188 -50917 525 148423 -222963 14390 270026 153559 72714 -17626 103988
17580 235634 9146 124622 -152141 213792 445736 -277548 143310 251499 21788 182230
17570 182230 130171 24828 34563 76447 240779 33427 43715 282458 32668 499340 238546
17558 35225 378782 217113 429527 238085 402372 -56866 255197 317738 200369 -113036
17547 -33301 279127 -116019 93452 283151 -52482 335846 28634 19998 38188 279888 299097
17536 299097 582306 379804 -43685 253339 237729 69578 457640 339353 276229 463946
17526 463946 376462 898231 1468347 1025411 1380421 981717 849678 347639 248144 382594
17516 382594 710639 153965 607149 485209 512381 838508 545106 844796 1213868 1083424
17506 1083424 967118 1020709 520617 485494 427044 427187 -90877 378205 160059 169735 502427
17495 502427 203675 379104 260002 666931 376240 26632 294018 162884 357370 52671
17484 83119 254392 166599 268994 -56053 218307 207207 372399 91022 243275 337438 221015
17473 221015 302019 241606 501684 296119 362725 279903 332474 289271 262380 197953 138535
17462 138535 259279 258768 293413 39281 -74507 197817 50421 455414 295290 21809 62194
17451 62194 304719 693365 679521 495850 215583 179547 238283 679431 296344 606073
17441 606073 310397 208953 112634 476652 457397 493092 -59643 293705 557615 316537
17431 316537 389854 293880 498884 465718 495229 605897 221843 327329 173466 370878
17421 370878 155877 634215 378232 671178 232679 396617 225545 551987 493149 507107
17411 507107 535014 -119834 233153 133119 234243 331987 101081 157382 162110 320603
17401 320603 140702 -63657 157101 196309 385359 331683 228757 311708 400220 210122
17391 210122 518742 401393 160304 103404 228645 360718 317267 147740 408459 -131399
17380 18893 316773 409027 290126 168915 102491 -23747 72613 131221 388422 -74844 420523
17368 114960 491926 268964 205261 198462 -12705 370479 392285 730531 148746 195331 -78690
17356 142254 350953 537959 206395 -56444 19142 102847 327249 99336 266283 364473
17346 364473 390868 -57878 -57554 260849 98508 382883 246130 645039 307962 224515 388183
17335 388183 721973 455656 63891 217774 230675 265699 -59341 19496 451052 10815 352202
17324 352202 284705 -100318 549912 -238810 574883 300955 333961 358023 -104772 194362
17313 535102 65495 606008 537878 182773 321416 215672 191766 379004 203589 109780
17303 109780 336689 123434 456804 324106 289539 405998 283474 485457 336380 236100
17293 236100 -73333 284905 357196 250578 213394 247514 142478 547894 342108 193335
17283 193335 89873 377051 322627 255699 523318 151278 574518 282565 271727 375796
17273 375796 268816 362142 387758 552095 118360 362228 189118 367945 306375 105952
17262 372521 418205 430096 411388 343515 398159 116055 104718 139406 400324 479893 559433
17251 559433 74614 289683 612277 363569 71583 493701 271598 212056 422730 -8861
17240 503686 445142 424283 261541 698827 354669 272671 171561 485557 463829 316526
17230 316526 240916 178900 270500 361772 264005 420551 415917 317530 -12860 698656 116282
17218 123959 56898 377293 -83093 446147 329782 460848 305864 391352 387603 582957
17208 582957 195480 623779 107088 372574 320380 504404 677838 560570 405532 333261
17198 333261 76101 192872 92354 536300 534279 241667 330814 134119 650793 329644
17188 329644 289964 105259 579787 312992 294508 492637 380583 201698 241964 311638
17178 311638 460413 322170 485478 435372 462170 434137 378413 422661 551963 281692
17168 281692 391089 675554 817568 649115 383452 601766 376755 -7896 226383 464031
17158 464031 443073 404408 127331 460915 486836 460867 605637 432492 713374 481334
17148 481334 670060 394807 465028 486046 587178 384418 323765 505026 370500 359574
17138 359574 474731 528783 680646 772460 667312 358797 229422 446286 253520 635424
17128 635424 857186 568187 769322 333782 424283 673098 258630 537628 761038 599532
17118 599532 834770 817992 420440 406406 288436 653769 625481 353640 509873 493949
17108 493949 814195 734623 746781 515024 621519 236598 437064 366878 489286 594794
17098 594794 678439 377996 605619 963708 429514 887390 602410 718496 385425 650724
17088 650724 801145 457834 565144 280739 682710 857162 826178 1022508 483166 507594
17078 507594 786246 492079 1005583 705307 623911 799785 975249 621079 784092 730218
17068 730218 897999 652308 934583 877345 630619 775826 539256 409741 706863 543253
17058 543253 746716 289677 913575 676041 801599 858034 483742 965229 677227 1000418
17048 1000418 982472 966211 921700 700902 947743 917290 900545 800501 484966 1019878
17038 1019878 915499 1019749 845459 859972 677807 569751 948475 975550 938490 984690
17028 984690 988600 841705 1132658 1053809 1077031 946175 1329759 1106734 963699 1136325
17018 1136325 917596 1053440 989924 980934 633622 1148656 1039270 1140078 804086 1097841
17008 1097841 861324 910655 1156891 1133216 855371 1174800 1049248 1023200 1248405 1285450
16998 1285450 1233112 1037715 1185710 1300382 1156670 963355 1257530 1018572 916090 719788
16988 719788 1382456 1267842 1211353 1365456 1308512 1383287 1231438 915666 1416829 1486558
16978 1486558 1246753 1207516 1273649 1512574 1547758 1360631 1317077 1427025 1250067 993737
16968 993737 1610271 1226271 1181066 1368900 1625681 1498674 1645646 1459245 1422573 1354049
16958 1354049 1473551 1758263 1638836 1437148 1536050 1724287 1568744 1727963 1764568 1688692
16948 1688692 1603663 1682822 1698724 1848147 1698862 1352219 1519264 1590198 1572286 1638972
16938 1638972 2000864 1896074 1769428 1736002 1802368 1838033 1960749 1637173 2010073 2133486
16928 2133486 2032822 2170927 1625359 1902167 2290517 2188727 2061342 2213293 2247429 2383118
16918 2383118 2426467 2407927 2246032 2293282 2417127 2163756 2276869 2396180 2364505 2711209
16908 2711209 2467519 2540256 2458340 2636680 2489134 2725719 2763963 2392443 2608710 2525714
16898 2525714 2554982 3070083 2864622 2646810 2938482 2589251 2990687 2908740 3195340 2791712
16888 2791712 2902445 2878304 3219700 3158718 3292734 3170136 2970689 3400519 3214336 3037659
16878 3037659 3252197 3475864 3289940 3496004 3639355 3213516 3635879 3624002 3800022 3553308
16868 3553308 3837963 3825415 4004292 4207054 3989510 3895492 3759877 4312893 3795781 4213029
16858 4213029 4175702 4711697 4377465 4489676 4696406 4737355 5154494 4666690 4828563 4586500
16848 4586500 5161642 4964214 5473375 5020073 5140160 5482673 5311811 5595533 5762147
16839 5762147 5904112 5980503 6074615 6221294 6246388 6144726 6093080 6345624 6775730 6743045
16829 6743045 6625996 6634526 7180772 7301188 7199315 7325521 7514167 7536190 7910589 8106636
16819 8106636 8043591 8207621 8240083 8839647 8684977 8801856 9162529 9444819 9531530 9772410
16809 9772410 9676093 9970160 10505452 10381058 10950917 11045755 11390367 11596214 11782627 11965821
16799 11965821 12236771 12583189 13016221 13156204 13092964 13676202 14176017 14386683 14829462
16790 14829462 14880152 15166273 16093620 16001871 16820865 16584467 17622230 17791968 18467646
16781 18467646 19040546 19754934 19955864 20446837 21144033 21739044 22344895 22885860 23593256
16772 23593256 24282702 25044440 25691437 26532189 27745538 28499675 29089791 30380674 31254935
16763 31254935 32617704 33647351 34730281 35851742 37077835 38174252 39774103 41020407
16755 41020407 42522418 43979001 45446540 47412433 49194373 50729757 52974522 54780998
16747 54780998 56574141 58940734 61196239 63153797 65842018 68284646 70597623 73084043
16739 73084043 75687337 78563622 81205340 84100159 86859077 89232861 92060089 94603220
16731 94603220 97150445 99821723 102234507 104367235 106402267 108541270 110151805 111510241
16723 111510241 112728786 113549242 114196766 114354806 114328348 113861017 113147259 111967475 111298844
16714 111298844 109468748 107936579 105600476 103816724 101378986 98979249 96205202 93633162
16706 93633162 91041445 88188434 85560365 82997355 80129436 77098235 74687550 71847544
16698 71847544 69508967 66760075 64618716 62343345 59556627 57889932 55630336 53417051
16690 53417051 51556764 49410210 47844968 46175183 44364130 42821767 41064937 39958810
16682 39958810 38422649 36964327 35468925 34439088 33320584 32208522 31465238 30143596
16674 30143596 29397287 28128551 27340572 26086724 25642002 24767954 23826485 23518730 22743028
16665 22743028 21840840 21354393 20744907 19889624 19273052 18951446 18472202 17809859 17418013
16656 17418013 17080717 16721513 16004251 15331262 15258201 14586316 14560877 14247116 13502625 13371473
16646 13371473 12981456 12611738 12335005 12415244 11834434 11730647 11246958 11104928 10909332
16637 10909332 10468082 10375781 10373343 9822710 9740252 9342628 9336617 8850288 8903599 8744254
16627 8744254 8218088 8340045 7960886 8042287 8150073 7646036 7625486 7407179 7256556 6918806
16617 6918806 6939022 6850344 6857923 6381662 6461304 6196788 6337564 6243916 6054581 5889029
16607 5889029 5979621 5693447 5855397 5791025 5626688 4993566 5114551 5349087 5228174 5067946
16597 5067946 4898643 4641502 4791104 5043882 4716333 5100554 4601758 4523248 4254764 4339829
16587 4339829 4398372 4165795 4109367 4167309 3946227 4211416 4081550 3542295 3721536 3568328
16577 3568328 3704710 3673187 3422692 3653706 3197483 3249478 3578127 3393168 3141377 3380088
16567 3380088 3121391 3069692 3255873 2911316 3369978 2871639 3107778 2742047 2927238 2958145
16557 2958145 2455165 2308024 2946022 2454149 2985037 2333507 2513321 2723099 2306431
16548 2306431 2384566 2588625 2505597 2415940 2196461 2390438 2488265 2465610 2435106 1944582
16538 1944582 2372366 2134037 2381050 2116407 2061287 2133527 2021678 2057477 2252658 2023300
16528 2023300 2215838 1883949 2045446 2100391 2012347 2167677 1968802 1973756 1900424 1622898
16518 1622898 1932871 1638692 1664329 1747900 1878799 1501236 1797052 1765348 1644290 1698448
16508 1698448 1746897 1555061 1368491 1260146 1844737 1520746 1439639 1581407 1680559 1594544
16498 1594544 1433949 1553560 1211257 1361903 1487246 1463072 1665730 1154968 1451922 1309053
16488 1309053 1169622 1449719 1169220 1473924 1052627 1205459 1173688 1168235 1324275 1440432
16478 1440432 1005135 1283995 1253532 998423 1032424 1339825 1367983 1312745 1253421 1132295
16468 1132295 977220 1046461 1102941 1141277 835992 889443 953961 1214970 1206900 1005841 1094022
16457 1094022 1120925 1169955 1276833 1158651 1266378 857005 843243 858181 550680 1154847
16447 1154847 875414 688246 1113813 777866 520627 915523 828940 581766 973902 859770
16437 859770 784034 478332 650248 857832 1172580 824501 756727 684334 1068874 838049
16427 838049 1085270 1173063 889751 783283 1098103 654530 784408 1012029 620894 765688
16417 765688 743205 780256 639297 521295 788027 842118 848260 524855 448288 511938 1070089
16406 1070089 569105 723903 789496 585395 1079587 666429 946680 627124 654397 165634
16395 636955 836864 490777 620702 577241 285888 371722 583733 490961 852252 724942
16385 724942 864042 650334 465153 359712 596340 602827 407583 414958 538323 737132
16375 737132 635492 462749 591062 531785 412140 571917 516385 570463 277437 398541
16365 398541 525443 458060 350896 282653 452251 476100 201284 686627 371247 786466
16355 786466 127451 403054 743035 354431 583995 564778 605227 293046 569785 682849
16345 682849 629352 145368 756615 490294 242579 267573 329332 340975 311567 415284
16335 415284 459701 60124 592145 771583 391120 561443 285242 301423 487050 562977
16325 562977 43140 554863 306735 338249 533460 402470 356614 339098 476642 286836
16315 286836 228287 489034 218330 236398 463433 285859 505692 268991 448460 140460
16304 238927 212073 481831 436704 451269 257113 471251 311008 510950 344623 521300
16294 521300 264364 323367 383305 490551 269866 448277 637461 71823 331235 271772
16284 271772 301848 451724 528242 146499 193313 470411 325158 462836 383196 361986
16274 361986 293196 728634 147268 504452 544785 116746 572324 311989 212539 536965
16264 536965 610264 406728 335129 403001 195864 243535 114371 269751 425581 419014 214644
16253 214644 164959 129351 195859 265982 395583 -113648 103142 384491 289992 -183690
16242 123139 305118 333583 292811 432666 216124 124516 499431 183315 -63095 521870
16231 246345 213400 419835 69820 269952 51619 -151290 16443 347471 250002 93724 22749
16219 225427 -47127 171228 130859 73581 221990 120652 75679 335334 178171 267980
16209 267980 330185 181974 116163 211152 127679 381674 199898 241590 103141 139073 4626
16197 279336 206514 341439 137617 273620 113453 -85803 163881 4147 -24899 150977
16186 -144984 20633 88189 157659 10932 73690 278267 291678 143540 151376 203062 104830
16175 104830 167846 157765 693 284999 188490 72178 49546 47537 151066 -19317 138445
16163 175158 303937 -164998 -185681 264733 215275 12848 229575 410302 113408 -173328
16152 98854 65515 104314 136188 594153 70215 -127064 55393 -3101 54236 184125 -7728
16140 158036 -60386 272158 -15548 143971 -157560 160417 203576 -25979 180251 333891
16130 333891 265076 302330 255053 17877 198273 285078 144569 -51163 175277 353626 192126
16119 192126 1905 -139129 168085 20212 -263756 393536 -52110 19782 125561 309173
16109 309173 118187 131207 455218 -94401 204924 409964 177457 -63383 -31567 -156491
16099 -156491 189404 314207 222570 232933 170124 24445 -50378 279104 442590 151739
16088 53373 -135918 173849 84928 16026 -249256 -33884 28187 140638 234068 242811 -99136
16076 448327 -60138 -24767 68587 -172115 155172 -184847 -103097 -14071 -94451 256099 24608
16064 315851 -56047 -52014 -19779 282520 -19156 48595 -60559 442827 -75801 16094 -46438
16052 124452 184461 176059 332315 164167 -248997 -236037 -127149 -111779 177170 166440 -145223
16040 272345 -71406 246510 170706 46360 -57129 184668 -236890 251673 157060 -204987
16029 273413 304677 44157 85092 180319 116754 -234 -24410 -139482 -249629 319197 22630
16017 7935 -19769 -28594 -105726 -141566 130109 -421095 -157261 -451227 1985 -41324 -141901
16006 -141901 13796 -23248 232145 208572 -44927 59337 212726 -17237 -40324 164326 55233
15994 29331 398885 -110331 -222421 128425 336272 260237 362935 702393 581015 1133607
15984 1133607 935304 1221050 727585 195102 275521 97999 231861 -205809 8618 -89251
15973 284858 210308 -25561 144131 -78091 32570 154605 286697 -48634 -46610 373617 -36950
15961 -148574 59162 8886 -36390 -158980 1151 -266390 -48674 213752 44049 -91610 53395
15949 -144097 75282 -18858 -64047 -62132 -76831 366582 47686 154292 -192603 -437535 -42011
15937 -152670 50491 -12958 53474 221719 5092 -5387 -81934 -9519 242118 -65803 105554
15925 -157430 -74762 68737 -10848 78177 -201537 239014 348369 -90329 -234206 207424
15914 146818 -77963 -71859 -339718 126725 5778 447338 83797 93085 -221940 207802 197044
15903 197044 -92024 148814 -30878 168870 -432342 126616 -175549 -118363 134082 -130205
15892 -427354 -298633 159350 -7395 -35516 160324 -115075 131547 -48407 -63466 115000
15881 14443 -94160 353199 -101652 -143497 10096 -70763 -21314 -156125 -52953 28227 -57486
15869 -182561 229753 -18408 -35021 -15931 -158873 50886 -295548 -147146 -303721 -72363
15858 155510 40716 -198241 394940 52298 -20835 70888 224577 274296 -250848 6867 -384762
15846 124251 -3531 105957 -373191 -68732 103039 -132346 75019 150941 -333515 -42946 153857
15834 45442 -304136 -27906 424486 47397 401838 139419 -109865 116650 84187 63263
15824 63263 -302955 -91942 13989 -121612 12275 -113034 -81790 -324233 88390 -231088 148137
15812 -348855 -288541 -32591 -284732 -77547 -12464 32727 -108750 315875 -30077 -60667 -119989
15801 -119989 201786 -2705 170168 -157553 25657 -88423 -116644 -159430 -149599 -59547 -195718
15790 -195718 56210 224888 -21863 448780 -67826 -284880 206009 -221017 -202023 -144907
15780 -144907 -106762 129759 53764 66170 34425 -5433 -48114 -16953 -79162 -97212 -128603
15769 -128603 -191312 -55594 193602 127853 -27812 -26772 -78732 -11442 22634 -46685 148159
15757 138146 -160497 338445 18987 508018 23574 22268 -307459 -25352 -171682 -296340
15747 -296340 270329 -272702 163975 65431 94529 -150245 -51753 -188438 -252742 37582
15736 -277663 144636 15037 230085 32534 -194001 -65083 40780 -23467 153035 133343 -369819
15724 49871 -336249 156485 -337824 -85880 5787 -279161 142203 201161 -530954 -209906
15713 -148613 -145114 33058 411138 27250 24508 -77627 -254835 -57165 76509 -14293 -11824 440231
15700 -147407 -321415 32031 -68253 -154330 -120329 2103 128521 12080 -251683 57870 -168268
15688 -87033 -177563 277965 7513 -149732 -78555 -48707 178488 -139336 90982 -47933 126743
15676 119603 426430 55857 275211 -292293 60954 -113544 404217 98228 -93129 -16881
15665 -6245 -80950 -155434 84450 -15209 -221773 -166700 30757 -223027 -219485 32469 -163841
15653 43663 -180730 -269033 7794 19397 32669 67136 13799 3868 -71814 259370 -77699 44451
15640 73092 -88634 -88795 136388 -81328 234657 -90310 -120206 281221 282399 -24134 202919
15628 125360 -263552 -4354 -231546 -10354 -62863 -230534 -148080 2736 802 45260 -62129 -96337
15616 -96337 -1751 -39889 77082 -62604 -226051 -23642 17503 118014 -111826 -482282 -33921
15604 123571 223409 -47074 -13668 -485 -143190 -32228 -91276 113001 -11433 -101182 -126741
15593 -126741 87444 18707 159348 16798 -257640 42172 134520 9227 32068 -92269 132603
15581 65096 -217817 153701 -58322 61259 247863 86773 -376464 -197084 191834 257637
15571 257637 118015 -189745 -103221 17539 -145965 323622 -168003 105811 -246094 -172306
15561 -172306 106867 -41846 381952 -109436 -35334 120138 -418344 -75035 153749 -263835
15550 -95078 -293827 -436055 163796 47849 180104 -12817 -32504 221230 -93222 -70713 255068
15538 77187 154615 -86351 359599 304031 17330 77577 -208112 20454 178831 39473 -34806
15526 -116429 -47286 -40120 178266 405424 78552 297616 44817 40656 -166531 258909 -100824
15514 135563 146138 -381869 175206 -225596 165929 147052 -470208 -131190 250568 217353
15504 217353 -235564 -286354 -73738 -98668 82121 -237805 -60502 -241921 -28456 180045 201140
15493 201140 -27730 221290 226790 -79265 11315 102849 101440 -328368 89436 51088 2400 87401
15481 87401 -310461 131104 93876 87595 151523 442583 743776 987514 660255 635286 169810
15469 -109301 71099 -58627 161095 132000 173784 61361 -82337 20805 -37794 252951 293647
15458 293647 120491 -125959 250218 -363646 11334 480362 140189 93899 177806 73607
15447 193862 84974 381859 235148 276214 669009 1233102 1587013 1315761 1271791 669480
15437 669480 319595 44687 163287 282976 7667 -35715 -77945 173584 -204623 218749
15426 112593 88565 67587 141630 -65855 -88738 311635 95821 -232685 -75604 40590 -34209
15414 -32272 -66188 31069 15503 165682 -106492 -179702 -4433 -198138 -45986 -35901 -16598
15402 96081 67898 -132450 86032 -74703 -360859 49238 -235458 324005 21214 -56486 -99285
15391 -99285 362742 54554 108993 -11317 -30183 96524 -232893 147027 343131 -190538 257740
15379 190855 89573 51663 67144 78291 291032 376409 527554 249822 292501 122892 132106
15368 132106 302387 347676 3137 460241 -17600 112917 -55684 358781 475638 158971
15357 283248 206265 139518 150383 -79556 80816 588892 -15283 243589 236130 172458 -36148
15345 -65573 345928 209783 261732 365161 60742 311219 572135 -281431 328400 -149813
15334 -112478 226955 292804 45710 19600 -69057 219914 64976 217365 89483 225687 127393
15323 127393 187059 260143 42449 365165 146171 24480 -116110 51873 12845 377593 19552
15311 168610 -93656 -90530 -11855 241423 136177 -28225 75449 475305 -235285 32778 270745
15300 270745 -233916 39967 -95812 119816 161328 62829 295057 -161835 -273810 211487
15289 262504 23051 84998 273712 -150606 175417 -69123 -33381 -9439 -318110 -157928 -360909
15278 -360909 156284 267901 61418 134364 -33541 -257504 341477 112111 163656 -261897
15267 -152857 -113307 314430 -64987 -111071 37376 235010 -256770 43945 -89686 187961 203577
15256 203577 2915 22400 -99968 168080 5405 237136 57897 -84460 153780 278325 440442
15245 440442 54037 361031 602279 1018703 2105256 1596766 1518043 1759379 529454 127601
15234 5869 325700 -50018 196057 261434 165979 -85857 -386071 153688 -58564 -131949 225374
15222 207919 432096 130673 22990 31571 401387 293757 42427 -27301 169785 -243478
15211 181749 222396 -6756 294937 -19012 385279 463144 74549 381072 138385 91308 79466
15200 79466 59 -6354 -12174 -38351 85478 218595 51840 -125066 4859 -2787 41650 -31580 -164435
15187 -164435 20370 -51896 100001 189939 433812 43169 356519 -127152 -26947 -6172 136936
15175 264688 247098 -97484 171091 8025 238880 -114903 -175805 37442 -7695 -3123 -85542
15164 -85542 191972 -130794 -102342 -84753 90810 277601 -203923 130922 -1877 50732 -88144
15152 37035 -202811 75381 -144879 294925 -123087 -91636 -6721 404644 92320 -131529 -49068
15140 163954 193813 39028 187402 180544 114288 42841 252289 142166 38116 15745 -15167
15128 22740 129520 362722 -208306 361092 -199796 187921 -165876 141920 471175 87595
15117 219390 429311 335848 332886 195250 278377 344143 336370 96387 144175 -5541 170802
15105 190920 16211 -42501 204294 33694 232227 253382 205199 478142 278627 -23776 -17303
15094 -17303 -77086 168507 291296 84451 -179100 55234 43075 326145 25447 160136 -95828
15082 211889 258677 346666 155770 25875 -69240 134378 -356065 269897 475664 -125242
15071 -9078 185119 206524 491046 140327 260583 26374 208768 -16437 549616 165470
15060 -81996 4681 99338 417384 312135 650929 307922 8783 569204 185556 144903 379083
15049 379083 418913 259930 268450 451447 461733 138410 358894 400993 431924 312374 491007
15038 491007 565880 546738 472443 152477 259569 147545 327564 310532 613287 879473
15028 879473 448288 630131 849539 445115 786179 170935 442083 496222 559840 593195
15018 593195 382540 431478 427350 547021 647082 218538 507544 522630 214344 291224
15008 291224 511360 553220 650684 550187 356242 214391 463332 473959 543932 442098
14998 442098 606261 672556 549852 430203 394490 479221 564354 134392 -89528 464936
14987 265670 592629 354400 248931 571811 571490 696566 726009 837591 635043 896324
14977 896324 632281 632865 382153 538915 497452 631711 849643 821642 713587 631786 594592
14966 594592 427927 692113 395907 477885 415433 520762 291068 68299 82454 44961
14956 44961 181679 386235 313385 246089 170591 281464 626525 429404 506353 286112
14946 286112 365328 702159 466914 840848 770902 584225 626407 637239 281000 325773
14936 325773 441980 461223 534055 456555 811787 529522 1193410 1114187 1226955 1444761
14926 1444761 1445610 1747373 2021928 1832700 1519118 1576239 1907437 1810268 2051062 2407698
14916 2407698 2583074 2266756 1778080 1540110 1467117 1211599 1105625 758679 765024 313216
14905 597850 148135 331664 243641 468652 417375 342616 270217 342229 542321 812073
14895 812073 684753 224782 113244 174747 576287 399162 418857 221370 554163 784639
14885 784639 1106354 834024 903994 851096 682516 577443 872376 925361 726940 667981
14875 667981 744062 441968 262225 509376 422679 629878 282649 568678 440401 568046
14865 568046 558799 795352 330037 537006 863462 534002 449097 320060 157397 557032
14855 557032 175686 393653 -214947 480562 397139 272408 395222 641740 507189 695866
14845 695866 796198 1061722 1189494 1160542 1050960 923996 1395685 1303838 992203 736679
14835 736679 1028033 1140616 829606 849263 693552 358243 447331 539628 465641 425257
14825 425257 370421 596236 785795 614748 509970 491369 746348 555173 1041175 429231
14814 426654 574774 704018 617612 600857 668747 298376 787578 617316 765608 1355916
14804 1355916 646359 1064625 905572 381003 559502 531733 859527 318473 506917 315733
14794 315733 472973 551539 541118 585593 759811 614004 439377 309578 440910 582583
14784 582583 332293 717743 626510 593839 754564 926451 824593 983376 592014 558216
14774 558216 981309 775880 596484 364179 514993 292625 518684 485637 725807 469084
14764 469084 251904 659604 794795 694626 946012 449685 460900 768906 567672 529875
14754 529875 484284 813883 456332 758064 642094 479903 936648 507882 459875 465402
14744 465402 444133 435980 334486 417304 674607 889256 431707 416590 630274 200072
14733 889052 1158077 873746 1071848 886561 1111618 984982 1643836 1617695 1781347 2131654
14723 2131654 1675866 1073286 1096316 983814 790120 575351 864182 647981 1069558 807453
14713 807453 644667 560876 1042372 417375 669582 779250 669962 1128710 854072 1217811
14703 1217811 1227140 1327187 1639516 1844204 1940099 1598500 1592192 1408402 1349281 780225
14693 780225 834510 1009618 898286 989012 789916 1001992 667245 786590 1014161 701533
14683 701533 939670 808516 734662 1018186 861614 665258 734787 660654 903555 402260
14672 680500 847970 1024115 788680 664271 1205727 768593 1187011 833994 897806 857151
14662 857151 725090 676923 671057 1036023 964591 961025 969271 1106042 1484417 862630 947922
14651 947922 1348071 1226677 1281087 1289336 1187605 1168731 1048088 816633 1061983 886183
14641 886183 1002090 1135045 711131 1043119 1389282 684092 1024774 1123404 1602369 1382466
14631 1382466 1199459 1118215 1213716 1002205 1152699 1046702 866952 1455726 753969 911190
14621 911190 1116262 1231683 1062658 1438793 942286 1263414 1464923 1267245 1034513 1654767
14611 1654767 1215210 1392753 1637084 1280992 1282057 1530918 1070392 1655709 1521362 1270717
14601 1270717 1454241 1173560 1425278 1382939 1379093 1434813 1570291 1442984 1206517 1357232
14591 1357232 1262422 1430012 1554675 1343043 1876302 1729903 1282621 1595005 1561379 1697309
14581 1697309 1679910 1660548 1347415 1584131 1580446 1883608 1641216 1539411 1887617 1836264
14571 1836264 1597488 2303426 1831097 1797909 1815430 1936558 1733449 1907637 1885098 2001267
14561 2001267 1971804 2290210 2454788 2645404 2384293 2513319 2827581 2978658 2750667 3283261
14551 3283261 3820870 4746990 6802221 10085116 17955158 34687083 44876731 20035175
14542 6508428 3174772 2700753 2351087 2664387 3087007 4702197 4820199 2614783 1746666
14533 1746666 1725013 1742490 1948952 1615564 2101849 2074358 2032141 1750766 2033893 1770635
14523 1770635 2074545 1986848 1898340 2022699 2042803 2323044 2100311 2169372 2030099 2212479
14513 2212479 2391890 2161815 2126326 2453513 2433704 2743003 2691758 2555043 2624684 2469719
14503 2469719 2720250 2970278 2789373 2339012 2641759 3014836 2885966 2850966 2807128 2228078
14493 2228078 2911098 3031839 2883301 3118209 2990019 3350605 3104094 3039706 2990574 2958392
14483 2958392 2988970 3413008 3109147 3111085 2985190 3412668 3527676 3358215 3487306 3542414
14473 3542414 3218106 3892650 3568284 3926527 3904535 3910777 3911849 3618228 4019422 4083789
14463 4083789 3811890 3969398 4296745 4161018 3610736 4231981 4267467 3967851 4353296 4229037
14453 4229037 4685309 4455477 4348081 4685434 4654257 4610627 4322100 4666380 4660743 4826321
14443 4826321 5110884 4895860 5139134 5426569 5209612 5165811 5437899 5285517 5561555 5362437
14433 5362437 5472161 5808327 5888555 5597693 5944940 6022142 5968000 6216218 6250352 6460740
14423 6460740 6576255 6562052 6925273 7372525 7685779 7606593 7175357 7546315 7584437 7204245
14413 7204245 7545054 7481977 7729008 7540526 7868233 8184739 8197112 8277241 8434590 8862990
14403 8862990 9128823 8927089 9179576 8659609 8786796 9049056 9719691 9543056 9943437
14394 9943437 9760931 9954725 10016717 10156379 10134972 10586339 10850113 11067517 11035100 11345635
14384 11345635 11529608 12170344 12486678 12591693 12848433 13263872 12844503 13375940 13513155
14375 13513155 13793651 14340806 14647546 14738641 15048611 15056235 15360819 16205103 16000497 16813975
14365 16813975 17243234 17408028 17459279 17945114 18363739 18526465 18930319 19371988 20156031
14356 20156031 20577352 21058654 21615234 22182755 22545197 23232597 23351187 23982326 24608091
14347 24608091 25333746 25825799 26209886 27193498 27925661 28988132 29580349 29873310 31202351
14338 31202351 31762238 32788918 33966223 34593536 35673748 37087378 37792463 39227957
14330 39227957 40306257 41551988 42923411 44571456 46220685 47716553 48868242 50604345
14322 50604345 52495117 54615936 56350115 58468105 60512777 62659645 65069289 67521257
14314 67521257 70309166 73057531 76288389 79369153 82703747 85889333 90082877 93924945
14306 93924945 98469774 102943539 107761741 112966597 118262648 124301195 130431941 136707401
14298 136707401 143929175 151493308 159824959 168433248 177803939 187337545 197773025 209070542
14290 209070542 220733782 233350897 246410499 260260716 274718632 289604252 305349761
14283 305349761 321478432 337755373 354335196 371256443 387615231 403536151 418499388
14276 418499388 432351048 444010610 451266354 454397856 456410504 456362003 455722662 456387172
14268 456387172 454462891 450510909 440945474 429244150 416294927 402495412 387605223
14261 387605223 371336852 354626400 337578365 321139973 304627229 289039932 273808036
14254 273808036 259376328 245338077 231969885 219593760 207753305 196654238 186381730
14247 186381730 178376530 168726037 159865020 152366595 144559804 137485288 130726292 124339493
14239 124339493 118135472 113009351 108219069 103158002 98166251 94299167 90059248 86412609
14231 86412609 83139479 79725047 76280379 73326744 70352676 67878877 65122040 62504046
14223 62504046 60145098 58256812 56080607 54218041 52276499 50417181 48730575 47122271
14215 47122271 45497642 44323778 43324658 41637709 40042149 38957690 37641050 37107584
14207 37107584 36297983 35192107 34066925 33150607 31480464 31245122 30006275 30061576 28603479
14198 28603479 27541421 26884366 26084329 25598609 25299884 24553007 23862116 23178903 22735734
14189 22735734 21651662 21368961 21096588 20697508 19755003 19680880 18998028 18893063 18388858
14180 18388858 17790580 17582126 17044798 16803558 16724660 16134128 16064632 16123563 15426253 14881786
14170 14881786 14622850 14354080 13975239 13888670 13727331 13116152 13442037 13040704 12734357
14161 12734357 12820807 12106287 12070665 11642602 11549787 11315131 11299977 11113441 10861799 10746536
14151 10746536 10586158 10506696 10106174 10083953 9641956 9835880 9521599 9399713 8854903 9058601
14141 9058601 8857335 8345722 8873976 8455643 8963065 8189082 7951403 8141469 7644019
14132 7644019 8039258 7783542 7697940 7738282 7219043 7436561 7185662 7326194 7011610 6965431
14122 6965431 6846027 6584028 6549556 6772568 6316062 6403413 6478341 6225811 6077549 6049439
14112 6049439 5872984 6089732 5888533 5528823 5700388 5615314 5556239 5650787 5085726 5373909
14102 5373909 5311669 5190593 5121242 5317902 4848418 4787360 5063734 4986620 4603959 4544393
14092 4544393 4719363 4658087 4509703 4366120 4478656 4499140 4374579 4320221 4280810 4087753
14082 4087753 4225721 3937386 3994338 4090465 3866389 3957167 3925043 3936761 4189687 3947413
14072 3947413 3616239 3822131 3608325 3335609 3585031 3551895 3736799 3289232 3334576 3486556
14062 3486556 3394683 3575415 3491735 3655736 3116422 3492455 3286013 3486319 3151298 3233289
14052 3233289 3221062 3302740 3046931 3126252 3283306 3068606 2846849 2932355 2464223 2702569
14042 2702569 2553105 2778566 3008674 2827155 2911371 2985992 2672677 2662840 2556078 2572257
14032 2572257 2760948 2558019 2631013 2504917 2438231 2632829 2226615 2215225 2709024 2353005
14022 2353005 2352384 2121870 2522725 2226024 2124514 2151157 1882777 1895109 2244058 2082794
14012 2082794 2191941 2036366 1884682 1822276 1884938 2045672 2016952 1897466 1840578 1766917
14002 1766917 1722901 1903741 1831734 1791849 1915532 1858473 1850896 1722517 1698208 1646281 1869223
13991 1869223 1681194 2365817 3261298 5549977 11674480 26828104 45845138 28224754
13983 28224754 11704341 6820923 4923406 4016814 3250186 2844596 2873775 2989284 2467126
13974 2467126 2297837 2374208 2226389 2269255 2109247 2012100 1989108 2151740 2305552 2175744
13964 2175744 1969556 1628334 1957578 1706206 1728152 1630383 1639612 1750144 1777143 1590588
13954 1590588 1568666 1829278 1623666 1580430 1807712 1805311 1679509 1223138 1553917 1656253
13944 1656253 1169360 1701133 1959930 1407147 1189834 1175940 1310700 1390893 1433110 1756075
13934 1756075 1418995 1251719 1145759 1081912 1249952 1307114 1360915 1236519 1370406 1067291
13924 1067291 1283994 1270874 1085850 1355554 1327981 991243 1019687 1261069 1198617 1442158
13914 1442158 1108440 1370043 1241355 1260748 1583810 910948 1078799 1546466 956533 1359499
13904 1359499 1093835 1290988 932146 1093215 1068627 1432063 1262838 1140122 908969 1273016
13894 1273016 795699 923974 1187898 1146126 988142 1405077 1048371 1385564 1210457 1027673
13884 1027673 1057837 1410622 1083072 606106 655575 909478 864576 1184382 955253 1367305
13874 1367305 841862 964613 1180737 1181969 843848 563603 1062713 1118208 1103572 1049091
13864 1049091 1112210 1003510 737647 1056950 1276301 1163267 855199 897726 891279 933023
13854 933023 935028 922981 699475 784855 864627 996964 954865 783050 826736 783738 699027
13843 699027 632135 700133 543419 845858 831208 615217 952041 953245 710223 971765
13833 971765 676915 1029494 580061 736151 875094 788592 724385 664400 884169 671682
13823 671682 864978 627066 989533 471416 557675 566607 488324 728985 1108509 714582
13813 714582 642124 564166 960862 412639 815731 747826 577562 602691 674822 786986
13803 786986 627992 744569 770629 676630 854252 516332 786011 562492 685125 943727
13793 943727 893213 424348 266393 573725 540986 641693 597141 263281 796459 755952
13783 755952 934179 673154 658588 432908 352093 822544 867179 727133 435780 440759
13773 440759 684268 752690 738808 508395 509404 553399 674866 784942 605705 469082
13763 469082 781760 666942 430335 405225 341763 816978 669400 264745 593417 373567
13753 373567 613590 535741 459210 551697 681743 549117 595100 422070 452019 425832 260955
13742 260955 384757 596153 523041 464555 271030 611137 651588 621449 413840 616082
13732 616082 305192 254142 503466 309409 587151 697454 469872 503129 655288 367918
13722 367918 173097 772610 411603 257312 437369 466786 424678 518751 716827 467196
13712 467196 193078 462165 572395 361261 460494 312249 514586 531525 729338 383193
13702 383193 456428 174580 113690 296653 304308 363052 448802 285793 536235 420603 25787
13690 285363 144085 251998 268370 96757 420020 236863 604277 483744 120355 161471
13680 161471 501477 464651 518385 307074 248600 525222 528858 620901 716137 246399 599481
13669 599481 261037 344611 582390 523088 634222 313468 280409 293772 189911 388886
13659 388886 467483 233167 264379 403613 275983 114092 80075 196849 426818 188304
13648 504324 444849 384875 558425 139756 277833 440191 272036 418628 586754 165807
13637 564732 359801 612980 313577 383999 294913 135220 356757 286507 459161 674938
13627 674938 191614 155850 359565 391374 71682 394347 172197 149555 397743 655021
13617 655021 395586 191460 256695 464465 438651 574458 158008 484179 457788 275853
13607 275853 92287 20612 372736 452995 457253 500996 270622 633798 -30919 575134 402254
13596 402254 333258 401679 193559 141445 320321 322051 106957 148158 131084 250044 228441
13585 228441 339137 92781 369204 54012 58548 399133 357514 407784 436612 484821 39192
13573 180227 157616 148499 443870 243960 281220 623390 317266 346916 408526 255992 37890
13561 317937 302570 359333 -48383 375635 361870 520947 206873 396639 195832 157583
13551 157583 28634 202739 -169062 128638 560651 64981 3264 28101 304853 211233 418041
13540 418041 175452 310497 292467 18341 140684 362650 365458 853589 20489 369565
13530 369565 71056 391935 -52364 189871 72630 118922 206702 290106 -49864 560331 283237
13519 283237 367079 516822 132297 398960 102598 -42814 303809 357460 176002 638614
13509 638614 206881 153591 386190 80298 187645 216993 166515 246747 446439 79568 126648
13498 126648 150294 -65488 284014 619232 62597 326421 237988 145383 -26134 354935 214112
13487 214112 28110 220864 27500 -62021 390597 204035 505634 190146 -65148 300788
13476 347779 252349 108512 242257 -68991 43079 82348 153389 15926 39478 147693 311568
13465 311568 85296 276671 106283 17755 21305 269158 353880 461663 117760 49774 155407
13454 155407 196602 167185 263683 421016 173452 79166 175579 208904 28783 400 -5516 44444
13441 50020 -5495 130455 305004 141923 251014 182740 84527 94182 380185 177140 122144
13430 122144 -94729 80887 174209 134965 340679 325912 174138 203931 198902 171099 361960
13419 361960 3270 9347 324632 89823 -95611 230561 178618 211895 246477 122864 215204
13408 215204 200671 95032 40386 173400 -102756 23078 350240 139142 -20149 227880
13397 467701 111356 246225 24458 379436 210255 425543 108869 -64566 320568 -140963
13386 -5570 147491 -61125 398383 -186647 82644 382285 -21614 -81341 183319 458300 261857
13375 261857 228867 66612 3554 128474 387985 -41089 294483 -9267 390181 42703 115570
13364 115570 15682 121904 38189 237385 200350 548409 295236 -465960 223017 165347
13354 165347 37318 181882 137853 327595 223330 -37052 193331 7134 81752 80398 122905
13343 122905 45903 258272 282776 310031 431276 480908 412912 288882 277475 357687 221145
13332 221145 239819 253266 -115626 162746 402126 283614 -132653 -53576 68003 316646
13322 316646 174547 26496 79317 121781 118370 -29187 294727 327358 212484 109999 441768
13311 441768 133576 418696 310809 200461 -12943 -125537 65445 41319 289681 77451
13300 55863 172385 99745 390707 188301 188609 -126773 345877 9421 36428 160113 -99922
13288 -175525 -46174 66872 159769 143319 95502 392915 227964 17047 -55411 78947 123518
13277 123518 211908 234976 376867 225162 379761 -88394 249399 62997 -27811 36197 346431
13266 346431 100622 17688 142028 95325 286950 194321 46684 58037 -105215 29969 388998
13255 388998 -103041 108908 -55226 -35925 -111384 335284 97514 29578 -42185 265897 245582
13244 245582 212376 233328 -109272 210755 -185004 -25228 155326 -250958 109880 -45429
13233 206451 238179 -16661 49456 51040 69653 164251 208750 229486 -102437 105201 -161615
13221 53250 86836 -2727 -85361 -100091 12525 14833 214194 -25727 130838 124251 -219612 -124759
13209 -124759 181553 -46634 -127845 128756 282617 45727 123464 -79212 -193068 -14043 103532
13197 195011 184073 149847 -169504 -180177 166853 68461 18704 339817 174941 53879 71486
13186 71486 -371408 78879 186500 96732 100230 22263 233470 187030 -182336 -67877 -140310
13175 -140310 -222148 198165 45201 -78976 174560 244136 19586 261514 134201 -157688
13164 -55821 -127493 -30889 -118977 298991 74073 244220 119438 -105469 128020 94798 67221
13153 67221 26447 302878 -98369 73650 40562 -102339 43256 17805 -78826 -48077 26673
13141 -158911 -143945 115581 -124145 224429 -69027 176888 185787 226663 -291181 299840
13130 213039 -85971 71953 -2212 -72696 56577 271123 115695 -219612 180942 40246 52048
13119 52048 -138370 430923 113677 79 13318 -235276 -121714 330564 239757 86327 56331
13108 56331 319404 -2294 -80934 5160 -26283 14034 -52975 189004 -26410 244056 118404
13096 121970 -276886 -84378 308737 76119 183210 -292093 1091 292493 74016 169870 1776
13084 58682 -68772 322333 34096 247597 137135 340796 16089 240412 19250 5944 -83649
13072 101002 34652 192749 295308 161117 1891 198549 -88480 -8964 -85074 149622 452026
13061 452026 -141194 -186334 489431 -94971 80229 157304 -106182 264285 197388 26457 131915
13050 131915 -72904 98377 72890 127334 68151 -110311 -83745 -209726 184432 218057 219683
13039 219683 91304 127665 52770 -221212 109251 51265 -123459 125813 -179011 125407
13028 -85181 79899 -237355 50993 -211733 185966 -185870 -66777 -161458 91654 188065 -166422
13016 -93327 -98040 -124172 -262436 278725 72650 135714 176581 17 -40260 -250110 292041 24684
13003 -118769 124081 41252 -196928 -181446 32461 -34539 309502 221482 35641 47842 18947
12991 40009 -53886 104148 151377 80218 -140513 -40370 -124863 -35706 -8818 -79692 -380651
12980 -380651 -243828 -150766 281307 -180461 -32709 79345 92789 -126431 -3232 457147 -23338
12968 -182716 -43491 24111 -126435 -213520 -405386 -239012 -31342 -130732 -91648 35482 46706
12957 46706 79764 317979 331251 75320 142010 614 87479 452 -154772 -264732 151933 -117292
12944 92709 -263280 96455 221274 -160332 -38186 -136074 24453 164206 -244438 114136
12933 209574 -75239 -407823 82611 85302 240468 168959 39504 -268182 -36098 -223515 -154426
12922 -154426 -336803 152160 -161915 12461 124644 -104028 -21042 -45162 -95024 20939
12911 -239330 -346586 -69898 64539 41414 74479 63370 309605 -208827 92059 -102879 109919
12899 27974 -69124 -193333 46554 -187341 -43768 278383 -24483 23451 117521 -151732 321159
12887 -163978 17322 -289502 -141287 15628 189728 129117 6614 114986 -44619 2887 -93398
12875 7013 253069 22022 -309432 76277 182658 75749 202761 -237870 -47461 -195450 -32484
12863 -56477 24095 166676 -186833 -36283 -56428 -136060 110662 -52251 90660 23111 66090
12852 66090 5745 -2821 32059 -300565 175257 -208669 -218389 -198867 80901 225032 -207311
12840 63061 -209979 -59422 -132162 135216 212344 -81685 -185473 -283885 -251812 99025 -258720
12828 17083 -207472 -126881 154353 159578 11799 -26359 291384 27777 32739 -15771 365651
12816 143522 416896 172967 -77908 -84257 -58090 223407 80726 6858 12037 135536 169576
12805 169576 66911 -324130 113525 -46231 9554 -33444 45447 -422620 124684 243305 126181
12794 126181 -16616 -33149 -48886 -103483 -103194 2216 58440 -85490 -417375 -207814 -97653 -28429
12781 7683 272937 -30791 -226586 72228 234358 35166 2583 -91722 -249975 -41724 -57962
12770 -57962 -161818 26553 106811 136477 -74664 -337026 33701 -111264 -123910 260645 106993
12758 106304 261991 54927 -380925 172013 153760 55411 -82722 -400604 -89514 -225954
12748 -225954 63088 100688 -142795 -187372 -127798 22127 -97811 -182042 -117603 -61311 -314073
12737 -314073 97046 -200985 -340565 -306351 -211838 -518597 1608 -200133 111824 -327875
12726 -152943 201708 254540 349031 289716 -56827 4648 -148615 -44045 -55011 172295 -7864
12714 -132072 -350210 66577 -16025 229875 552431 -47372 -122665 393313 122904 16224
12703 288566 206998 -110869 207293 369237 -45088 -159292 63450 9918 -31621 34154 -21211
12691 137470 -23053 18084 -69680 -116437 512978 -92489 82188 58767 -129194 -192644 301935
12679 86017 120507 230538 147088 -191582 -22091 13420 80624 275867 171474 -35038 108704
12667 355954 -81678 -33744 -58974 -275166 -20587 -68915 273395 -72061 -30422 -47171 -17190
12655 133213 -187489 35704 -76468 -36511 -65166 -117437 -83102 -75863 90787 74165 -137866
12643 -77275 384338 -41064 40470 -37217 361002 319842 55354 61455 148460 -152066 242966
12631 96784 343422 75406 -179786 268005 202473 216915 31692 -178113 104798 192104 94919
12619 311221 193407 -309750 -150886 -173056 242447 -212321 21317 -114865 -36967 -10238
12608 -30066 19100 -205923 -173414 -156561 -17081 54750 25080 -101182 -206669 275499 307568
12597 307568 238729 -24577 -249102 -374382 207754 -99019 47680 -239703 314422 26915
12586 287720 87760 -24695 -115921 -31994 164755 -27631 -28373 210866 173041 314990 1728
12574 -174697 -153874 57074 127941 162660 56251 -73211 121411 -195135 114236 295087 119481
12562 107987 -110466 -84480 65348 15533 -87757 -28479 -203256 27617 32120 181077 -285437
12550 -10173 -230702 92573 -267000 86321 -106910 126737 97744 150520 186896 382863 182651
12538 13862 158831 -212947 304932 20912 -72186 211227 74995 -370605 -44346 88192 -107552
12526 132778 234689 291727 58780 101598 -368614 -237704 203566 11270 338746 181569
12516 181569 -99881 -140800 228314 -191717 -82397 -156705 -72202 -123599 -75898 -162423 -6649
12504 -307621 126617 144750 -73478 45041 21260 162316 330146 -48399 174182 455744
12494 455744 -81332 355421 58841 -39832 -258420 213283 -264822 238432 -460021 331014
12483 -48068 390246 258450 63501 -111741 45575 -124461 -108845 -129023 -193629 -271432 104488
12471 163479 -48407 508701 -118988 36103 127486 177121 102757 -238260 105390 -10229 -79680
12460 -79680 269645 262516 -23680 388844 -252 -175193 -468282 -11044 310618 88975 -144857
12448 -96075 -90604 -12496 -332090 159399 -1250 55600 -324504 23487 -128070 -211232 -60108
12436 -40397 -38576 -198809 -71371 -27922 -216198 -507089 -211891 -10963 104262 -63795 -97804
12425 -97804 -90598 245464 63584 -8242 -133655 -33125 65801 84219 85507 49235 -201376 -227888
12413 -227888 -263876 330161 438784 -357183 181627 179651 72680 -217797 -19961 157746
12402 179218 -194173 -181065 4283 61560 -94351 -100623 329102 204895 -35163 217145 84626
12390 -103590 202326 13395 69165 265249 -4468 2562 130521 -124195 66758 77892 88622
12379 88622 58106 -126608 199454 103524 -64125 -7145 145381 -72342 114915 328876 -7462
12367 295041 -61366 82123 -141440 138517 -81755 -44477 299633 -222464 -328949 174830
12356 56217 -7144 -78213 155440 225900 4269 93088 33310 -54761 299479 212593 -141748
12344 243174 -79559 295143 -80125 111809 -109959 124831 216507 -36174 -181563 -406110
12334 -406110 469196 -100476 117279 62569 -164029 468412 42856 248843 136030 -31175
12323 -31562 278314 -49574 127741 293741 455450 -29981 -37016 109211 -106375 30344 156795
12312 156795 96767 273682 253765 26213 400195 26866 -107166 252301 -22002 485063
12301 74294 -96356 135294 -13511 80794 13870 -78370 -223197 -48893 116102 130268 196263
12290 196263 -316725 40067 37558 312125 40907 110793 167472 27303 269696 291162 404195
12279 404195 305032 123261 400306 144159 588734 101427 -82928 110763 -120321 149255
12268 -30784 107690 52114 69921 53763 -201951 -118525 -7369 384227 236415 -4671 98480
12256 1898 -90455 -12609 -383437 179299 -278437 17590 28940 284316 -249791 196789 -375441
12244 290240 -294 187318 -341266 -166600 286818 80843 30527 -427917 4066 -406652 199824
12232 136974 -142559 164566 137899 467458 -128033 -51985 233372 55444 224303 205908
12222 205908 309253 560268 -21585 177070 293793 183794 161878 369933 91495 267012
12212 267012 258734 6071 240724 -34474 272359 -52718 -35619 -150451 -113405 86043 153716
12201 153716 292620 472739 43518 180721 -38850 283214 200981 364247 -2047 668738
12190 25424 378810 113534 584824 124190 144563 315832 281097 172685 138039 569996
12180 569996 356657 377595 167665 263101 273193 311550 202675 40148 -224245 -31141 215749
12168 -28308 195693 475166 242281 277650 44360 170995 530751 96100 88312 281806 29240
12156 -74530 123810 132133 76890 160795 2668 -68372 -15792 -54840 129552 396114 400426 81104
12143 96854 -208997 281331 -168335 134538 18942 -144264 210837 220333 86637 -111706
12132 337607 406305 10707 51372 347001 -5659 -3237 133925 234464 398061 108146 271707
12121 271707 249837 -136037 247502 -9095 198040 279202 185431 166942 369874 368040 -146813
12109 308431 98160 302315 160682 -102949 101054 233128 174267 -34697 328401 125044
12098 226856 264164 48655 -72209 -190033 178091 -149185 -272094 247013 191062 -65096
12087 -19746 -188641 42676 82786 -268 21656 204543 -86247 293773 -119941 211281 -301730
12075 173433 272665 -220588 -32808 19812 401251 -294764 74688 155769 -135942 44579 -165871
12063 -206110 -125912 12770 -140821 -125115 102925 213626 159544 192084 214166 241487 86558
12051 -117107 -51059 66272 -23578 262403 -983 -103256 -157808 -210784 263322 16794 243435
12040 243435 249839 101793 -59533 -322482 -112662 118774 -9127 -25250 39296 63945 -26729
12028 190955 -191814 -71672 108828 -71314 28266 3764 -94719 -49942 -143708 -489974 -12229
12016 43753 -122165 28379 -4948 -74966 25337 99339 112220 -263397 94523 -1905 105638
12004 891 -188510 215006 251923 212439 -137719 -355932 113811 -98433 30454 92874 -135389
11992 23031 71733 42273 33992 -87071 211099 45162 263574 -194963 31830 215838 103665
11980 -131200 -88599 277080 -441182 214758 122843 225747 -136065 -7059 -57216 -8647 15276
11968 35010 -238142 -97168 59334 3315 162443 144488 99139 -187595 -246867 97174 258056
11957 258056 12935 -137960 -282643 -43497 -89022 24195 -187991 112272 158155 93083 -94840
11945 -280816 58811 75923 144084 308282 -234204 -34424 -106327 -39895 -189504 -252105 -104532
11933 -83399 -93696 -86670 -299582 5828 -107080 -141124 -272039 -43502 -18694 -1410 189195
11921 -36780 228614 -60225 174782 229441 246191 -26041 64956 206084 -52565 -143661 -34347
11909 74507 147822 -31187 252574 -124499 -59398 -91478 -306047 -239247 157333 -63735 -99066
11898 -99066 -208610 792 9246 264762 184109 -32244 68930 187457 -146550 34719 89411
11887 89411 35238 -13385 -144422 -50907 111760 -292664 116634 -237689 -131360 -40945
11876 -114930 -25550 -158670 86199 -102069 -268870 42346 34586 -79937 199988 -32081 267762
11864 58082 -361549 -422108 -152651 -294992 -330058 -46013 -289757 -369231 -45735 34939 -32215
11852 -166093 73852 -57964 -111143 -128254 -265390 148417 -11850 -35528 -49255 -9825 -260727
11841 -260727 212224 118529 -2901 -134465 157818 -66323 -244105 107041 -128162 118279
11830 167985 49610 -29991 -212939 -214720 -96425 -119861 32621 -32570 -89815 -277274 -247330
11819 -247330 16461 -11060 122040 -114206 173924 -11941 54931 66519 -19714 -259647 91219
11807 496810 -52456 -71335 -103430 -256588 -112413 -113738 -71681 -138391 -425407 -144206 -187819
11796 -187819 81348 13952 -118866 4325 -91132 68490 -145174 -190670 -180012 -6904 383617
11784 -101625 201498 -259153 66490 -178327 49072 -121687 -16816 36139 78752 71178 8840
11772 -176503 -218811 -384180 208917 -36828 51747 -108740 -176427 -257798 337373 81625 -151873
11760 56363 -181023 -34495 -142492 -21884 89313 530152 134720 -33855 25576 260234 -28918
11748 -303017 -232315 -283596 136695 147009 4241 -64300 -6107 -423551 312079 -30374 -211121
11737 -211121 -282328 81145 -313670 96867 -250480 198980 198195 -77715 187890 53680 -197438
11725 -43076 131511 73923 -160500 -224024 236621 72672 -185292 183697 -80772 58390 33716
11714 33716 259070 -135736 132996 -113654 192781 153254 -71577 -109039 72494 -67106 275475
11702 -56259 -268411 -66522 -56798 13413 143562 112643 16169 56881 -24872 142654 -110589
11690 -59228 177159 178095 -161884 273053 415 198281 144370 119770 42367 138487 -79539 -221713
11678 -221713 -183342 81551 -148755 -9057 73880 133788 -187785 -125269 311786 -50061 400362
11666 135290 178467 174570 227472 274546 -18502 -197796 -63966 -24334 -187554 -374492 189632
11654 61584 16286 -124944 63620 -290789 -49065 -360519 -74645 -64098 39350 199200 305088
11643 305088 277701 -185371 -232081 -90812 -337044 -171269 43059 182393 167616 -213758
11632 80545 -37713 -386852 -122939 -253108 -93579 90221 -173626 -23755 -71271 -194554 334730
11620 -107832 358915 397438 41456 60954 100816 -338883 -104319 -139053 -104230 154151 -94171
11608 197755 505554 -84050 -111826 52889 186554 -4397 -68118 316112 122217 140948 -200406
11596 70503 -149411 -109263 217812 214289 -251637 -186370 -13796 108248 92589 -79317 125533
11584 321276 92648 -174264 -125272 -3094 244913 126446 76472 -59637 -102631 -95000 -83801
11573 -83801 156446 -15920 82427 176079 56848 81582 45359 -133553 -36788 404226 200443
11561 -10659 -104920 -103665 113574 19016 -418093 -64215 44506 76161 383415 -123304 -4049
11549 91835 -128514 31143 18426 -16411 52373 173017 -118207 -195015 160721 -4135 128249
11537 -18385 -127466 89859 93290 317291 178972 -44897 -101684 -108737 -111661 -148640 -170873 328866
11524 -28346 -65049 -342543 184687 -64301 203373 137565 379858 -197024 305765 183840
11514 183840 8853 297376 -8522 88625 -137654 256945 122496 235198 185664 177094 -6869
11502 28011 -163947 32772 8207 -54977 229780 -72687 51432 19501 -36488 5710 -1395 -141559
11490 -141559 367799 122927 299161 177905 -49035 210870 223805 148425 269053 280784
11480 280784 256703 89129 93299 160228 -65106 -75977 237014 306104 -152402 84433 -128887
11468 38511 215299 181672 -122703 313080 236763 66866 285795 82762 139853 47209 -183147
11456 210478 29948 -106546 116214 162482 -14220 174925 133530 318580 247921 276885 24584
11444 -171054 -51956 129921 -208449 155954 107072 -31412 253619 -54065 31006 -22662 -665
11432 122618 -23308 60542 217998 5897 101358 51300 283925 47060 215273 465135 255935
11421 255935 100102 242775 101036 -104630 -74821 4342 50854 -190743 229472 -253981
11410 157592 186896 -185513 -245170 217107 -119147 38908 -12983 103897 -270176 -263505 -333289
11399 -333289 -178138 -15652 -36167 -328110 -23538 -58219 86161 -105893 285851 66163 70490
11388 70490 20495 -80910 -89425 -8892 15652 -48604 -91289 9196 173927 24633 122087 -131452
11375 -77843 42398 98723 -15811 230028 -119523 -65916 -171909 -193250 391569 345761 68384
11363 614757 -310212 -467231 -10624 81843 37797 -299204 -201323 -42818 -92138 -9724 179038
11351 -78382 26477 -83996 -318075 158713 -24962 -368672 38086 -188145 272440 -14629 -2797
11339 -67433 -95416 197146 37953 -333907 242042 -218050 42600 -198923 22826 -221114
11328 149865 -79008 -176417 -15748 -92605 -246589 -474347 -26644 -27033 175045 -4681 70641
11316 61463 154756 -137720 -198841 3564 -191 -38118 -46017 46391 -27160 -24510 -28995 29789 -104021
11302 -126061 158699 -499306 278227 281430 30253 5751 287443 156347 227806 -132455 -75961
11291 -75961 -457445 -325486 77745 -18882 30166 236115 9234 -440115 4193 76968 -432339
11279 -6971 -62360 -342545 -103270 23828 -210 -301424 36679 -53349 -250240 24424 298977
11268 298977 -93890 259384 -5810 -185664 117041 -102924 -296074 -11131 49422 -44306 -40760
11257 -40760 27101 213094 -151514 288378 128335 -57741 6899 72346 -143598 -368398 -267824
11246 -267824 -139216 -207300 206700 -377284 -131412 -301881 -88788 -98155 72163 -175984
11235 175122 -132895 115605 -373496 114963 186926 45527 -154873 -118508 127787 -52365
11224 40895 -112429 219033 -41435 142572 143782 31284 -54970 -512722 -51372 18174 -153544
11212 -198796 96725 -223856 -304615 240040 120344 -135569 145462 -121417 -86879 -127351
11202 -127351 7667 -126712 -242110 -68285 -38738 -158065 -277199 76114 114011 -76077 -198470
11191 -198470 -85247 -32140 -414792 17094 59611 -229247 -264349 -11777 14188 -161047 33503
11179 96566 -282247 -218747 248039 -285160 138317 -222378 -116859 46287 -256321 65400
11168 32877 -102283 54250 -38098 -24819 -171472 -174311 -125132 18423 54377 -31978 -363105
11157 -363105 53134 -293886 -149013 209637 86927 -8686 -102049 53709 -595423 -48788 -127915
11146 -127915 -216623 251215 67111 -70194 -30928 368105 40440 103835 264260 -47669 105473
11134 198567 -16848 -116537 100798 75740 -138973 23566 -21027 -132380 88222 76867 287167
11123 287167 161891 -235067 182606 -363134 135525 -129545 154526 -74201 13478 -134956
11112 -184823 227987 172513 -181699 44235 -140458 -44800 41371 79337 267303 -20025 273837
11100 17685 30359 -99795 29619 194675 97248 398050 257766 477421 -65946 126148 -194970
11088 143466 178142 423241 338472 -21474 297032 -62402 566390 -179345 256921 332973
11078 332973 124651 385004 401164 185097 579055 -126796 364524 697817 453496 229524
11068 229524 67125 443619 313185 341379 80448 375618 302740 6058 239871 506669 459102
11057 459102 484436 385766 265283 516986 657742 1061350 585939 478893 803103 1007627
11047 1007627 801197 967835 951789 573734 926247 806779 1066381 1098672 633897 924832
11037 924832 999844 855021 1160400 560388 799106 859369 787519 943076 496282 802697
11027 802697 640899 1121854 741569 826860 1181714 636723 789034 500315 828865 875293
11017 875293 787086 718066 755326 581927 443355 784119 470746 583812 536741 581997
11007 581997 644131 521346 692746 793260 770066 719005 684631 550497 416212 625756
10997 625756 756625 545758 723096 602683 538295 569346 723805 458289 639199 528746
10987 528746 733531 1090333 799747 785647 562237 831918 821616 1292210 1200901 1419826
10977 1419826 1580489 1102594 1285830 1493375 1729092 2061469 2143721 2284051 2641935 2616439
10967 2616439 2896740 3033516 3358340 3016966 3347376 2607158 1877140 1992401 1918008 1904255
10957 1904255 1574830 1665508 1565532 1484815 1313274 1288924 1301048 1279060 790676 1011214
10947 1011214 1031578 775968 670481 222063 427740 365219 330042 190336 449339 70584
10936 202954 163438 475318 99260 208259 260989 107161 -217896 29278 -200202 -210399
10926 -210399 -172622 -66357 303135 146127 -82424 209070 -192701 133324 -6057 40698 81270
10915 81270 -301252 -24433 241691 328734 73454 -100055 169376 -261844 -57523 272681
10904 199146 275123 -55229 -177380 -265848 -1630 135463 -221447 150452 8728 -105485 127670
10892 106002 214964 -12216 19557 -309245 116835 13200 -24062 -21318 -363893 -129574 -59770
10880 138392 -182737 -37993 -38755 -151072 120913 -92298 -205286 -11761 -108854 -36019 -174528
10869 -174528 -125000 -118909 -213299 84354 -61238 -96590 151007 -67229 299445 35568 -116763
10857 93398 -230573 -38219 -77151 257175 -177419 19040 20674 103831 -225598 -165059 -204619
10846 -204619 225505 -224463 -167993 150538 -55395 -163632 -255273 22736 -38248 -177777
10836 -177777 -145124 -86001 141696 -186778 173621 -28584 29909 310527 223646 218702 47509
10824 -248003 -181435 156521 -139102 -153009 -86054 -101894 -97657 -28253 306483 96802 141762
10813 141762 -233758 -396230 41153 100337 44496 91397 -4976 123866 81287 -98081 277470
10801 -149649 55437 -126634 -269046 193097 224824 -181180 -177893 -218148 -167690 -117268 206566
10789 -60555 354477 74738 45465 94010 -199907 131281 25424 51260 -88533 -108916 70408
10777 15145 -54625 93369 -7062 -60134 23090 42607 24893 -477 -193360 -14385 -55794 9486
10764 -259421 -89888 -54391 -288652 59833 -150033 -419816 -166857 -205835 -99515 -401873
10754 -401873 -219521 200601 -54206 -8062 120144 106415 -303932 87778 -93441 187527 59139
10742 -158835 41405 232742 -44252 -187173 -172742 -115334 142748 -220468 88403 -32205 49535
10730 11163 -214529 -105761 162403 -23095 -337 -228996 -299052 -131371 58023 -261850 -164047
10719 -164047 -198437 175009 -15399 -143974 242483 -168141 -27887 8112 -369492 -283631 -32366
10707 72572 -10888 -123401 -108813 81181 -102461 173888 -368388 -362825 336299 94184 -227668
10695 -425086 73522 39840 -207986 -221944 -121135 -148994 -151892 -34472 17808 -377985 214510
10683 287832 26689 -140254 -115021 141156 167287 62992 -186768 97463 145516 7937 73333
10672 73333 -139064 -166716 198327 49289 -461290 -155464 86735 198064 -71708 -194275
10662 -194275 22894 213590 -344346 -8380 -185721 -61785 -239172 -111994 133652 -131151
10651 -207584 -122290 -179325 -146933 54369 -166883 105549 -135712 161725 -34853 165681
10640 372794 -128001 279946 -139079 131001 125998 -140465 -220740 -228285 -40364 -102751 -29590
10628 -274235 -260831 9432 281615 -159210 -31191 -33324 -105590 -84731 126273 -319989 348106
10616 -85509 268383 409831 57191 -223290 -70686 -83446 -57687 170930 -168553 -151214 -61005
10604 -76654 -91984 -227000 -305343 -177516 -317434 -74802 -51786 -325270 67747 -91213 16286
10592 229759 45559 -272864 -90879 122896 -228017 -257302 -285967 -98973 56016 189275 46088
10580 -107028 -191106 -260868 32732 -82725 -4951 126151 -53340 102816 126056 12180 -30277
10568 -102872 -60240 -86048 135523 161408 -43023 -236556 32262 313225 208063 -198685
10557 59048 -53643 91575 -409512 36905 261708 -153842 -89776 25178 -63813 -22821 -29241
10546 -29241 -12595 -45360 -1857 33646 -349040 -33321 77833 77171 -150888 -110847 175109 18396
10533 -381528 -28065 -146238 -11606 211728 -265929 79382 130564 -356800 -155108 144470
10522 -219177 -115713 95889 126907 -390699 312201 -22827 231311 -152989 30660 -227897
10511 -200095 1027 47025 -151779 43066 75467 174693 37869 -71678 -176608 -89732 -268955
10500 -268955 -48225 -175826 -23948 -368063 52428 -182354 110533 -113029 175406 -93327
10489 -105329 -85958 64547 -65206 92550 279062 -26527 -71941 120034 33033 82825 88908
10478 88908 -70221 -61623 -9173 231028 153817 232644 191597 24930 14497 36974 133967 -136763
10465 58462 21785 203999 199929 -235993 151931 -73458 7292 -33441 -258455 -66136 -153251
10454 -153251 6139 -266732 -178615 -267629 -141741 -6215 -72017 100924 -630334 28265 90091
10443 90091 117079 -177761 -128638 -139070 179369 190538 -96400 -323685 15463 -88878 -139435
10432 -139435 -144412 61980 -101913 9986 283265 -139502 -182408 4350 -217032 -269372 -73831
10420 101041 47098 146363 -394011 -258703 -177897 -197686 -68060 -162912 52022 235491 -185041
10408 21090 47604 -483141 -166830 12308 -107415 83179 -168768 -330129 -68956 -132300 25458
10396 -212773 27486 126778 109700 157930 150576 93516 -86252 -30400 -9468 193626 -243028
10384 18207 264401 -93084 219614 535890 105161 133166 -37991 429059 89834 398936
10374 398936 -40914 414144 264012 515362 127145 455282 220785 385755 238810 441299
10364 441299 690305 609359 274347 427010 353354 395775 238960 276876 353954 138282
10353 67908 245227 268387 168099 295524 233964 809332 456082 162980 245745 413361
10343 413361 29062 321391 131692 428282 443629 512370 176669 -74166 -67889 525990 49920
10331 372746 -8575 488728 404639 56215 36998 -32418 396883 75106 183684 159069 194888
10320 194888 -16834 313509 246112 202752 -172745 137125 109607 231791 -180251 120124
10309 57422 -39195 124361 -121666 148062 -133184 149779 12625 -166475 222008 -180903
10298 -172088 116696 112610 -235780 -168012 2980 1100 -309912 -15248 58732 11484 149977
10287 149977 341219 -46355 -201306 -73271 33535 -95733 30859 65297 -94560 -303381 -230009
10276 -230009 -66228 -210959 -60959 300437 121121 -144599 90138 -26918 -106185 -154865 -232042
10265 -232042 -216041 108006 147135 -181417 -294726 113697 -137559 208039 45079 -28907
10254 314075 56829 -83083 -98856 388705 74046 100310 84391 -243059 32314 -38467 26370
10242 -19593 -21685 -30187 174916 -275888 -185523 -3540 120840 61037 -373976 3028 -270571
10230 11015 -246394 -309421 -78890 -75124 -188030 183753 51482 -18320 96702 -173266 222208
10218 8559 1124 -47847 -10782 109228 20209 9174 16885 -5433 22425 121882 -21843 188897
10205 -324770 -214652 -233802 -72920 234026 -149989 -142121 266139 -20731 7002 -58572 95342
10193 -301057 -260337 231044 -67753 -397222 -251440 -291419 113597 217457 108931 -4380
10182 142012 -107772 -36841 275049 -168918 -382852 -167086 -203113 -116698 -99856 -328971
10172 -328971 -86506 -274261 -401686 53473 177588 219620 -204343 -119260 167049 -50950
10161 -204352 62200 -132175 289825 -138568 -242595 -387501 -211119 -245594 -85369 -369459
10151 -369459 -309053 51793 -124228 -332491 -151969 -401020 137042 -189048 -113798 -564996
10141 -564996 13503 -210830 -1277 -69109 -189834 -52123 -154744 -143473 -476023 -266677 286745
10129 -157380 138354 19519 -187694 179587 -10435 122796 -191016 50710 61418 -190006
10118 -144684 19712 31008 -174617 61675 -105564 67585 -231312 -136305 -22900 172 -132075
10106 58370 -61472 -123305 -122840 83019 176330 -58715 -227695 -72861 -12727 -183098 28352 134749
10094 134749 47492 70982 -236277 -210084 86246 -125352 144788 -114882 -222593 105996
10083 46506 -71910 48697 60241 -39570 -350034 17101 240358 -27114 -240501 181213 -128520
10071 -175441 -104409 -173331 229557 205099 -357806 -73781 -233133 -141023 -202977 297331 150959
10060 150959 268712 -27473 91037 45982 -13236 -69618 -43530 -66851 -35726 -15911 -124096
10049 -124096 190770 40093 150587 -262292 -88380 -456082 -63950 199321 38996 -252731
10038 -52628 279225 -37639 88117 -60306 -142568 194418 -356068 -207163 418011 95097 -242505
10026 -42697 -197611 -450941 -121566 -159666 -91961 -110776 22308 72881 -232973 164143 -48819
10014 133391 69931 222347 -128185 -270444 101000 -30718 -303534 -62546 143303 -100212
10003 -117838 -159607 135763 -21241 69691 458883 -38665 -6471 -16526 -180951 197638 -161651
9991 243498 -367855 -198794 -179889 -12116 -292023 -285743 -4437 184600 -61333 -84028 -223315
9980 -223315 -250719 -246191 -99866 73153 -21408 55010 98666 -353092 -69665 -491398 500607
9968 -179970 66609 356431 -53449 -445630 79184 186975 133934 -11293 201147 -150553 -95806
9957 -95806 -263848 -125875 -155528 -63821 -122121 -396129 327476 -150572 -73578 -45715 -176607
9946 -176607 -13860 -138406 156207 -24084 -91963 -194438 -175910 -363160 -327930 -67899 -143180
9935 -143180 -212935 89823 -118440 -390725 27927 195226 33133 -201588 -127076 20386 -35063
9923 115513 -243272 66585 -302881 -10641 -10314 223418 -117947 197443 12329 -4406 -2923
9912 -2923 -76758 -145916 -5157 -356785 101208 158272 -11582 -142772 -154816 -236881 151041
9900 -118701 191843 -44243 -5736 -35982 69978 -59066 194360 37386 -193353 -73219 -4386
9888 165192 -191670 -308339 2877 60255 -59144 -230893 -84394 142084 -188415 -153564 -73076
9876 -40250 -219530 -35123 25186 -232978 -188780 -237740 -97837 -137747 40255 -107311 110314
9864 -356757 -108024 4540 -28148 -127248 -46153 -195731 166566 91776 7211 176894 -409472
9852 -147065 -55171 -574 76029 164799 -195211 -36037 -181013 137840 -174992 -26733 -88230
9841 -88230 -196548 114325 -24506 60833 -142792 -37259 -269783 -151938 4087 -7379 -49241
9830 -49241 -119410 10670 20648 -129111 -209094 -29918 72777 1022 -112391 110604 -389381
9818 72766 8119 370978 59699 -385753 -256217 -35389 -85250 -269604 -129404 -241791 -120029
9806 -907 -191695 -123708 179293 -266926 160551 -334108 27575 15294 -292188 -109359 5571
9794 -80631 -214753 53356 -29884 170786 -93748 -222588 153437 -196862 -157125 -4130 20018
9782 -277272 -109914 -346086 -77413 -18187 -121641 26799 -52434 34817 38975 80352 -87369
9770 -463499 -59576 297757 19716 63243 156468 -96532 -47597 -50748 -146568 -166628 -415088
9759 -415088 -392376 245631 395999 -353224 -26898 97967 10056 -70576 -163858 444774 190437
9747 262341 -412518 -302868 58912 -182502 -9251 -233556 -186561 -385073 -73199 232682 -57266
9735 369679 -242070 -173313 166531 189627 -171943 -29561 -130020 -17148 -178377 -100923 32637
9723 -239595 134550 -195650 106779 43812 -114713 -135032 274002 -78167 -2462 60982 45615
9712 45615 -160262 -470450 -276992 -302411 -97052 11734 7862 -106168 -7382 138795 -86433
9700 20500 125503 -519228 120272 -30256 -153070 -74670 -37502 237914 59898 13799 43151
9689 43151 -69932 100601 -89895 -332575 -202966 -157979 386900 -72707 -39479 -2770 -93295
9678 -93295 59415 -36994 138581 343421 -70131 -135020 260076 -39430 -216797 -160614 23344
9666 55651 -15100 52960 91074 -196311 -354427 -151464 -61398 -5216 -273654 -130444 107820
9654 -14671 -15445 199413 -513471 -60524 -211424 -67662 3818 119233 62409 -117867 20305
9642 -147579 79114 -57179 100355 9719 -25122 154051 -2448 -41030 334830 395263 -75368
9630 -173534 -141624 -220333 159073 -76009 -45450 -77960 -111966 -346051 -1215 261002 91211
9618 -243999 141518 -59349 -281893 -64392 -143661 57310 366993 198371 159627 327448 -204445
9606 80654 134177 68571 -249232 -124609 353764 412387 109683 -160729 -26534 -53783 -164203
9595 -164203 -315099 -116533 -7667 106342 -75384 -61976 -125182 -126610 -25038 -55697 115630
9583 80054 -11528 72755 -7956 -188571 -117970 -138347 -99359 -76366 -104896 -113860 -197684 77170
9570 -189278 100862 220969 225446 -149833 -7846 76706 -189860 220723 240906 -69089 -64278
9559 -64278 -9511 32117 131836 80981 -148813 -136466 -52944 -5728 -22349 -214747 -8819 -143447
9547 -143447 -122843 113732 -147224 89843 -319048 -14874 -101457 -255685 -280149 -69630 -133758
9536 -133758 -459446 156660 68301 24874 -107674 -295276 39424 -86573 -170227 72572 187329
9525 187329 28138 -166129 -99957 175314 -199163 8700 -31757 -184349 -326053 -126443 -165923
9514 -165923 201876 -161524 -38723 -93926 -140086 -297292 -8298 51982 21564 160737 142771
9503 142771 -296017 -428114 27437 3166 303440 -238492 -330790 -243430 82074 -388252 -391751
9492 -391751 146996 -62838 -269573 247358 -44241 -129191 -119991 155222 -272168 -129405 137026
9480 -160397 50813 -129246 4592 -122463 -162688 -143584 112748 -113700 -243717 -249582 -538757
9469 -538757 -129555 -30711 83378 43117 41462 -268086 -46791 -407080 95052 -66334 -39107
9458 -39107 23837 334277 112579 220612 -119653 -40375 4741 -58228 -40339 -226516 61911
9446 -24999 -164576 -193729 -57099 -320840 53374 14876 -177656 -7624 -77532 107745 -53189
9434 -179334 -159239 -195097 84093 69143 -13323 101861 9946 -1743 27817 -148919 201 -157230
9421 -36584 -331697 217320 -142936 6217 -561720 11153 -358263 -37168 -17852 -113514 99112
9409 154847 56473 -65972 -237604 -176702 234082 -102612 155743 209643 -112022 -430209
9399 -430209 38889 85311 -307744 -232273 -62064 460547 26125 394405 32337 -174174 -31312
9387 -136855 48047 222691 -12190 -20513 -82657 126527 -239547 151310 38108 -144558 -244994
9376 -244994 148625 490200 190361 248952 -281268 12693 -27172 212432 -52963 38907 -53455
9364 3102 -125605 -276491 -191766 -148446 113205 -222496 -127710 100582 -19391 -149170 57561
9352 58398 -17406 -296092 -59311 26932 113145 -135226 17144 29323 -291388 311220 -110356
9340 232217 -67946 156543 -291039 -350469 -299320 -420783 144661 -434354 -13431 293854
9329 -207112 -249701 103342 297430 -39832 -188442 -20026 -72572 146377 -218788 110306
9318 -173362 -248684 -119681 13584 -363877 -212511 60773 -190359 -107811 -123005 -1241 -128725
9307 -128725 -93969 -3143 223112 -231769 20056 -50484 -101582 4581 8605 -48087 6591 -319725
9294 65476 10963 29371 189457 72906 128806 -60872 -94234 48305 8475 35971 -131878 -13185
9281 -58611 -164122 -220774 -67697 -213298 -15479 -206526 -186139 -341208 -106099 -70832 -181917
9270 -181917 -280879 -200791 -316167 -114287 -190494 -130513 -36407 531 -102024 -43941 -393380
9259 -393380 -118766 -149879 -110546 47136 -140383 -481141 -69706 14264 26555 -121540 -77027
9248 -77027 169453 34754 7381 -22303 3297 -108382 -386596 -184441 -109811 -195168 300134
9236 -303199 119149 77934 -179944 31064 -282688 -107308 122250 -252761 273363 196289
9226 196289 161235 -164381 89985 -55451 -49672 86639 142390 100414 122394 110621 136376 76614
9214 76614 109220 -80925 137213 61417 -235224 -67411 -155552 -269642 20692 -225259 -350064
9203 -350064 161376 152092 -58723 -212376 -176163 -168733 -467212 -165444 -190339 -150166 -12547
9191 -105891 -196827 293936 79262 -405060 -50200 -119098 -135173 56890 237365 66583 -504575
9179 -277660 -227962 79141 90830 -19582 95874 37012 -144734 -195291 93961 163944 -221608
9167 -313186 -87439 -240293 -86165 -244791 -81151 -200687 21656 123271 -550023 26463 90496
9156 90496 101787 201055 -58051 -393680 145400 29805 17472 134064 129544 123636 -142423
9144 -82098 -113505 -186984 261804 5799 98648 8071 -264649 -40580 -18752 -378513 -106633
9132 -122279 97375 92869 42604 -317716 -153604 -268992 -52646 84191 -55162 -180564 28223
9120 125626 400615 -61947 158515 -1870 -154939 -245102 -39727 -134886 -290147 244615 121058
9108 -13557 103590 13066 -61231 74937 -566595 62238 -1111 -278538 -361383 -62639 -382073
9097 -382073 218109 47254 317447 26162 -150663 -345263 244282 -3129 -200417 68503 -59309
9085 274546 -116963 -11309 -48853 -109514 241405 -210128 56224 131551 -106661 -123184 -56055
9073 18907 227039 -167086 112479 -214922 -22507 145881 -19390 -87260 -220798 -284700 -99732
9061 186033 175614 96157 -341715 -188446 -57532 -129226 118386 32211 -168977 17472 132144
9050 132144 201618 252494 -332545 384222 29655 -156260 -126533 -176445 -140024 -165897 41619
9038 11814 -174024 -158390 -57343 -70318 -18375 -18685 23321 -256262 -191387 -121856 -5320 -234567
9026 -234567 -404199 326809 154345 -136308 -123952 -42772 151478 39006 -7262 -228079 -17003
9014 91523 -94801 -198322 -168104 -191701 -330839 47047 74141 -279492 -236826 142970 -239844
9002 -225039 -214907 -120428 -34015 -74222 -207972 -92882 116532 188640 149001 -109737 -110259
8991 -110259 187709 -8433 3446 -203868 118348 -170340 -170933 -195673 263014 -144945 4288
8979 -35087 306106 -159080 -225373 -103844 -100677 -26263 -174020 -203047 -180492 221896 -171091
8967 41540 -251491 95523 -259782 -59551 72857 16258 -315504 33021 -24080 -186471 -136033
8956 -136033 -105114 30394 37968 129609 -77634 391916 67210 -203714 -246664 -109129 -336562
8945 -336562 -19148 -176566 74011 -248027 -59244 157261 -108642 -42805 172936 130548 -178599
8933 -53852 89946 156770 75289 3149 -263423 26009 160133 91522 225854 -29488 177516
8921 470053 1273440 4330158 12947461 12639287 2711597 783949 273980 385448 206445
8912 206445 58357 159449 497234 52282 -62853 -140564 356854 356890 15917 -310250 -144276
8900 -51791 -946 205295 77248 -83718 -95966 -53236 -13832 -184580 -55642 42905 -37726 -306502
8888 -306502 173261 -120160 -194423 -220472 -8443 -89076 -41533 26504 -204611 -282329 -315645
8877 -315645 -58625 170437 -21848 -356775 -48023 41889 290622 -26411 -22862 -32793 -285151
8866 -285151 49722 153670 -10450 35904 104532 -317257 -281791 -64746 -96568 109247 38784
8854 305922 -155301 127325 -91186 21000 -13910 -46833 -50970 -138501 129714 56379 69068
8843 69068 14281 8747 45221 -20115 96793 -50075 -96665 243414 47987 -2227 -168650 194940
8830 33026 -396646 381108 -20503 -135823 -5120 42789 339493 -11492 -143350 138450 34623
8818 71340 -64241 165047 -338664 -78434 -139109 168738 -64553 128523 -190324 -81335 -155918
8807 -155918 37850 71550 34335 -146769 -289500 -227484 -244436 -241789 -265812 -110429 -90175
8796 -90175 130275 -226547 -415929 193799 -27254 -152087 -80151 -253797 -86248 -175981 -1456
8784 -33953 21060 249147 -197686 -148376 -126716 -21180 18271 42349 146233 -357299 84060
8772 -112475 -20069 30184 -96120 -3435 27272 -323105 -107531 -116964 125136 -74076 -366595
8761 -366595 -70821 149574 -24967 94543 27031 -117265 43460 -53031 -147515 -214366 113141
8749 -17028 -36635 -80781 19742 -68498 -105476 -26619 182390 -115481 -304495 167234 -31230
8737 -13242 -234733 -228298 -171359 -159035 204733 6600 102892 151059 144085 -49191 7101 155865
8725 155865 -68334 -184169 19985 -322398 -144031 -315512 -776 154213 66158 61067 50262
8714 50262 -171488 -112037 353322 -20992 6605 -337460 -120526 239814 -287706 -135333 -111719
8703 -111719 -180776 -316408 -192385 126273 -163312 -143304 35811 48234 97426 -228682 -155440
8692 -155440 128775 221866 466666 -159615 -201832 122712 177077 28068 12834 -15028 22206
8680 -96554 16601 55210 329892 379085 -155487 64846 72624 -279020 -252720 79929 -225421
8668 7593 174722 86375 83396 -110966 -128278 -297073 64563 125008 -29321 -28633 -8862 182244
8655 40896 -178102 74146 7087 -150241 90287 124040 -321193 6283 -107851 -60907 57357
8643 -53866 94784 278079 -166534 -120134 39844 11844 -48625 74212 -8331 -166677 261233
8631 145392 -70577 -39360 81410 68831 -52125 -271537 74218 -270860 -193978 256843 129346
8620 129346 68516 -28170 59100 526556 -82480 -10717 -173362 -186675 -155547 15226 14444 89089
8608 89089 -365401 5867 -168234 -368563 -33149 -8892 -9387 33613 172752 -411498 45028 -144007
8595 -112493 11989 -20667 -107521 -30911 261072 -30047 -66262 -43284 -138912 -79519 -388745
8584 -388745 -209702 153009 -192058 226901 -28478 -200345 166962 -218559 234844 -293099
8573 -173563 -267409 52709 -244321 -9286 -201501 96 -39904 43632 -444958 68664 72292 -72472
8560 80773 52153 -29605 -77768 -19991 -58173 25755 -126467 35763 -37555 40376 -253743
8548 97316 -149397 -5716 124739 -199075 43610 123365 -98316 42407 -23808 -119655 290759
8536 -143920 -98694 -316291 -323473 -170068 80727 -350487 8016 63902 -98490 125725 -1294
8524 -27384 212623 213565 -109613 -297674 -14233 151106 -143464 -243285 94607 -14201 -327849
8513 -327849 142861 60341 -205968 -179204 26059 -66024 64819 -132338 -289972 -267049 173918
8501 -265733 115154 -276793 -35104 106294 57564 175612 52699 36435 33509 451207 47540
8489 61107 -349766 -1559 66739 -47088 39249 -382426 275143 -331544 -156823 183634 -114373
8477 -205451 -114038 117757 -439555 -1422 -297984 -55714 -70261 -75727 -17301 111577 -23757
8465 312074 -72452 266536 104869 -56059 -317748 -86009 223603 -115141 212097 76978
8454 168343 -253241 -39413 -111642 -295550 -12167 10033 37636 -92262 107255 476841 -9568
8442 -166344 -92193 -266527 8877 113673 -314969 -87801 -155824 -300052 -227357 121719 -69217
8430 -67754 149087 58641 339471 -212489 -170039 -25987 -103043 -153678 -99974 -229232 -185116
8419 -185116 33386 -135915 -5621 -250394 238916 -337587 -52300 19585 101915 -281516 -242635
8408 -242635 -289739 76628 -102077 -20787 62690 -7146 -224710 -96764 -24669 -72230 73317
8396 -78800 204416 -275604 233084 -147436 -150422 -61218 -148403 -26095 73330 398281 24760
8384 -278062 -116057 -19419 -49814 202448 -169531 8940 45440 -127461 323857 88875 -275831
8372 213947 -241974 83638 249602 205322 167266 205953 -150406 18130 -81070 -380479 -22707
8360 -137488 189293 -261734 -164608 85677 92171 -225283 -245751 -209777 -94080 361226 -104153
8348 -26225 -266131 -311382 -80655 40604 -44200 90064 -20259 145378 -267584 -189450 14821
8336 -157969 27426 57272 26928 139183 -64102 94039 -250219 -328190 -2949 -38972 49239
8324 92875 218433 -215742 -143062 6260 -177481 220950 -59782 226879 110186 -180493 8092
8312 -86706 1707 -85375 -280404 97089 -177799 -39874 104023 -25893 -166105 -18670 -286630
8301 -286630 82702 -145252 -264333 -29168 -154445 -83793 -200244 -309638 105033 -19610
8290 16217 33527 -259353 -73138 -86072 -176577 113516 95444 -121283 -321004 -96048 465162
8278 14048 -356267 205620 -332866 -216279 -59126 -318426 244339 179733 -245436 130891
8267 -42349 150499 -147608 308104 -115946 -274851 20947 -75938 -100244 93958 97256 -162368
8255 8452 188590 -159728 51521 -245363 -15433 -124808 -229205 168046 54277 -117013 295093
8243 -220894 80302 -51020 -95801 94196 -28845 -460928 -106571 -244422 -230636 105637 184414
8232 184414 -40749 79673 -329364 -183599 -24712 281631 -14547 113839 36347 -336727 -1540
8220 -7578 -57137 -63207 -92470 -16943 -119971 -34678 96035 -138782 33247 -168443 27348 -235045
8207 -99505 365910 -215345 -126708 -90299 -32852 199517 30530 15071 -90194 -107 50908 198799
8195 198799 78404 374774 48333 86015 279122 23018 -37228 -120503 -102946 36449 -223015
8183 15875 -110028 -79926 188933 148197 -83604 49713 -226060 -47176 -75446 -32181 21238
8171 -6237 93656 296304 124337 -138807 75797 -2999 -257946 -486509 -114490 -224343 -159548
8160 -159548 -124655 211002 94527 -137052 -46762 -131502 76088 -202440 177 -15172 52484
8148 -151139 19254 -32772 60688 180329 18679 -320970 -62909 -8258 -311327 19126 44471
8137 44471 -52586 127367 18017 -123885 -99342 -95218 -139965 -21370 -86332 -41327 -191671
8126 -191671 100993 -124532 14538 -114423 188186 117310 33167 -18035 -36004 7349 -128430
8114 -420166 -71156 44994 -63730 -306483 124 -37062 -309812 85196 -86897 13149 -113845
8102 14242 -159218 -213323 -102343 -68504 75883 191962 188264 82358 -143740 -137356 178505
8090 81734 -113745 -50572 323212 -98995 -201470 90559 -278227 -103466 -93763 87816 12497
8078 -16249 89905 -42484 151113 8081 -93578 -136469 20549 -147513 -220728 -97438 153457
8066 -93860 246285 140848 -236886 -82464 218161 140542 83238 94826 -230294 -290335 -145354
8055 -145354 -258791 80373 -199698 201377 -261896 -108314 9423 131570 -74800 -87495 184254
8043 182968 138694 -21301 -27482 -232867 57467 32941 -154378 -270630 -3358 -229578 40453
8031 -76469 208407 -17301 -83289 236204 48552 -11920 128370 -277688 -417017 -1767 -149716
8020 -149716 179618 60694 87733 -185550 225493 -28191 -15281 -60176 -284911 -59623 -132636
8009 -132636 -114102 -32623 -29720 180204 -76756 -49810 -44996 123964 -200221 1791 -141993
7997 -4377 -192730 154987 -9526 -317710 25310 67515 -310673 158042 -45199 -37767 -177637
7986 -177637 -121496 -19751 -251179 -133730 -171855 -56312 171230 14731 -7150 120294 276846
7975 276846 266242 91931 90108 -131888 -104541 116862 262383 118099 -14851 61090 -125586
7963 -176484 82445 12300 408515 13995 -113969 17034 -263014 -256244 -84049 221586 -83184
7951 238120 146661 -207937 -57087 3328 -202222 34582 -458491 163605 -141417 -108199 -305970
7940 -305970 26618 -52928 -281561 -46104 -109433 64492 -241608 -149159 -193886 -90214 -217098
7929 -217098 -293399 -252895 246816 -115729 49200 27053 -427552 -139349 -181513 101218 -71632
7917 75935 -14396 36450 121016 -109762 -139477 -159183 -173394 1815 57490 -46614 -946 -202806
7905 -202806 -56188 -43793 13355 237536 -137388 -39313 -65716 80859 -239527 22207 152355
7894 152355 -93746 -234146 -80873 229177 -102117 34843 42548 -197021 317345 -31288 -77656
7883 -77656 2323 -22553 -223709 128964 94539 -173070 -97277 -35458 -39214 -193461 84176
7871 143704 67102 202857 217297 -156139 34835 87933 99788 14827 16651 -86171 -221787
7860 -221787 -58104 -247730 -344562 -88924 31406 81154 195061 92241 343411 -134891 24618
7848 166810 -49853 -515732 123271 29469 -161314 -270472 -42274 -160449 -61840 2314 -377750
7836 -7904 -62680 -65321 -272625 117833 257739 -183802 195506 43402 -143213 179322 81134
7824 -182421 -216623 166061 76482 22151 54020 -136340 250002 187514 305846 -233604 -195904
7813 -195904 -77985 -149732 -63994 -156664 -18711 -234048 -76140 -89688 -111512 -145465 -59916
7801 -162116 -304745 171565 123419 -104051 -36179 21984 -21947 -11801 32529 43513 29546
7790 29546 92673 208201 5283 -165894 63132 -106430 -319587 -72450 -89594 -84451 -219932
7779 -219932 -2787 -4879 -12479 85685 57506 -169317 -8743 129442 -201677 11881 -196796 -168840
7767 -168840 23260 202350 -270218 -91202 155020 86176 -144073 24207 -65280 -310153 18683
7755 -67347 41903 79489 -57299 97464 94964 -103543 105291 204803 37158 -106546 -91289
7744 -91289 -202220 147173 -42111 -284066 240564 -55768 -251328 -15480 160824 -154614
7733 -129300 -211749 -198883 -172755 -138950 14022 2955 -306156 14663 -193133 270731 182806
7722 182806 -128530 -226386 87650 17914 107789 244400 -396 166923 4505 134499 77578
7711 77578 10718 2016 55531 -123267 -236366 -95819 -41732 -221183 227562 -51896 -178634
7700 -178634 3503 327371 155618 -1562 -348200 138770 -187388 -83887 -38252 -316507 -28648
7688 36036 -7044 -25931 19294 -7958 -230010 -120689 -224891 -261807 110738 -262538 -201138
7677 -201138 -90958 -177197 -45125 -79711 65220 -35144 325523 44952 39818 -260220 -39936
7665 -2804 19635 -44599 -93125 -58149 -12397 -126708 -141581 40377 -66134 -271744 209566
7653 -94828 78733 265408 69076 271468 -118585 164200 -52655 -119020 -268745 66702 241738
7642 241738 123099 -26470 126572 -216164 15335 -86686 -366896 148665 198564 13140 -97646
7630 -32663 155592 290692 -198413 -131530 39753 -199902 -182055 89083 -229273 101979 171918
7619 171918 389014 -95590 127838 -150108 -9052 -21989 -73348 -174973 -179 125135 -109612
7607 -37249 88255 57546 76161 -358538 132550 -252326 -327604 -347720 117213 56813 -30124
7595 -14905 -106992 133412 247658 101750 -222604 -50609 20207 54399 84266 495692 -67610
7583 193828 93802 -43046 -31781 185027 -23335 -36324 -150602 -2978 70780 144766 -166204
7571 389894 40187 83538 -53140 -15947 85312 -98977 274701 -163329 -41560 -101888 -177472
7560 -177472 146709 3384 -136009 -215955 71680 -159542 96574 -204041 179903 -87960 -3889
7548 187557 91868 -3262 37378 -201735 -165789 80465 -57350 -121852 312036 -61351 143651
7536 -293809 -45353 -161608 -10414 194694 -181852 128879 156061 -1949 -83679 -415270 -17953
7524 -185459 -320407 -229738 -152367 35466 65878 134406 -149550 -77800 -35525 -89186 -577288
7513 -577288 -171772 27554 8532 38912 -14710 22731 -190549 144546 68472 -351111 -1502
7501 3264 55779 -130100 -2761 17886 -166233 -91392 83026 -3253 -257725 -135273 -399083
7490 -399083 89990 161722 170211 -183503 101410 -20048 -164779 132704 -156075 -36262 -58234
7479 -58234 -9739 -123264 116363 -289395 -108869 5577 141036 -83578 23436 101376 -289071
7467 -90478 192291 12671 -206955 -13982 -97397 161632 29567 79506 314073 113476 -50770
7455 7559 -48962 -324989 181709 -233260 -392003 432316 -94546 180003 -60999 221322 261306
7444 261306 -63287 334746 -356220 -102199 -91592 -87556 29630 242011 -144225 233190 -128203
7432 283697 -109913 -45598 -307361 253600 34289 10346 -322762 27716 31825 -289710 162438
7420 -200747 8286 -106862 39139 76917 -239084 -90046 -67268 333764 15065 -89637 -86561
7409 -86561 -157791 -64371 48922 -191139 -130306 100039 -45308 -55671 -302470 165411 173979
7398 173979 166559 -64648 -76775 217822 -41702 103999 212141 163896 -62705 68209 37120
7387 37120 -99989 -2286 41905 -161264 -137534 -213028 -132639 -143270 92737 -156844 176164
7375 330860 225885 182556 62165 400799 123379 -253065 -9966 39373 -4106 -29017 176746
7363 -45719 -330566 -149258 166562 -57778 -152758 152043 -63990 -241745 241835 62561 7312
7351 264702 36492 -70523 8171 58731 106235 161668 181536 924 8457 136376 181923 78636
7338 -89735 153545 306883 -191923 -45266 -35281 50184 -213689 122474 -683 55252 -230113
7326 61274 -49534 145308 -4236 -74149 -90365 219855 -235301 -73747 76165 73016 -169645
7314 -286759 -47045 -247097 -148736 -117927 -238266 -155812 -9837 55929 255286 -74162 -159626
7303 -159626 136230 -66147 -130222 177051 -47674 -197750 50220 -38837 4323 -227438 41135
7291 220397 246849 -234507 336888 179578 -283388 -180269 55240 16849 -258447 -134227
7281 -134227 93485 -61188 75857 -41004 55939 -50239 -201834 -171506 -10868 -373861 195145
7269 -243769 115276 -180394 67408 41074 -185280 191345 -4608 216843 -33903 -11651 98088
7257 -119041 92775 311011 220660 -7611 -124779 -107685 211564 81623 -108104 -21683 -220903
7246 -220903 188328 -243990 162634 -299246 -61762 -27164 -80260 118295 108802 252920 -153430
7234 -32368 211500 273522 -148075 -73832 -114822 -237988 -252356 -162392 199601 -22115 -249907
7223 -249907 285311 231546 17936 -220526 189841 9707 175727 84758 -453082 -88763 386919
7211 -215686 28464 -80089 -151680 19566 -187387 30125 -143131 74726 -11048 382534 -109181
7199 -343363 130131 31432 -269784 93630 80556 14827 -115181 -58839 -74215 -250040 -302338
7188 -302338 84003 12215 -284003 374118 -15061 -99070 -208619 -187400 -28618 -19065 -431480
7177 -431480 -226523 144365 -143755 -97215 78957 88617 233440 26287 124451 -170496 -117823
7166 -117823 234 170066 241538 334117 -66583 -29640 -287751 223166 -58210 83184 -290642
7154 47178 143962 131119 -85402 -56321 79678 114326 -73833 -264390 328245 -296078 33171
7142 -209349 290218 -458570 151958 -21924 210976 -169257 -110953 -72488 -308242 69762
7131 -103897 119873 -134707 -271188 11686 -253228 166338 19530 87967 37878 252755
7121 252755 -35230 -149818 -66028 -93007 -127718 87051 48161 219437 -322828 -116529 -11909
7109 -148239 253137 133851 -38800 -98671 -15649 358493 12488 244760 -109013 -70170 -130205
7098 -130205 118380 -93762 28465 234290 -365442 -193515 140361 -32271 -174416 -357745
7088 -357745 -23101 -268527 4573 266059 -42752 43740 -110955 14083 456129 10975 47595
7077 47595 8311 23406 -315709 131650 -207180 147169 -166810 59482 -78308 138526 92
7065 231461 -62068 -222791 -32548 -170750 -134984 187879 -212122 -61904 -75417 -40496 59661
7053 -364222 -23281 149891 -131559 114339 -41558 -127626 -310871 -66528 64444 232653 -156556
7041 -222526 301915 203129 42562 269957 -33191 113503 -9440 -166259 -36812 -6698 -83288
7030 -83288 62784 182271 9462 161046 69292 380232 -167553 -96023 271747 32463 -158095
7018 -76543 -110029 231271 -306721 72290 213391 -48338 -242908 -129050 148204 -126893
7007 -162696 -288959 -75764 -102627 -87869 147048 -141305 -235343 -103417 -50997 90802 109789
6996 109789 15003 -153428 -81106 -3661 -305005 66905 51557 278316 305087 168281 1630
6984 -235634 -133986 58125 -418985 -51672 8565 124275 61144 -242525 -86670 76491 54432
6973 54432 64320 168833 60729 -122949 -234015 -315690 9453 159641 9378 97936 2144 -55452
6960 -169510 32053 -134604 107276 -159410 -66189 -115083 163436 -78794 -317316 -113059
6949 -69272 -310694 -371219 83548 39259 -71963 -222570 -43883 -459928 51191 165461 3491
6937 -4113 -226055 -360647 415548 -112183 28430 34414 107461 -209916 11331 136496 290780
6926 290780 143420 -40766 -360619 -84696 -181550 113854 -130 -191149 -48097 -183311 37996
6914 -227828 133217 31331 -26020 -215324 -24611 -122246 356655 -223503 -202865 102307 -61497
6902 116030 -21983 322090 -80785 424313 -435989 -169764 113418 -254099 -154270 100722
6891 366987 -381076 -74913 -293630 213366 116802 -137055 145860 194585 -279142 66942
6880 155095 18054 -69619 98635 359858 184237 157242 63848 -197462 -21812 69605 -69627
6868 321915 164941 -226235 257709 -196660 -134450 98140 -46297 -76623 22497 -204398 14215
6856 205454 -125206 -119207 126599 -39700 -148364 -110858 -102379 23277 75736 -128150 -100420
6845 -100420 -107888 -50315 -455101 5303 -186418 -106889 31152 -519561 -214005 27547 105255
6834 105255 -107109 -52949 -102661 -419461 -80904 -267497 -110524 -19265 48012 -21368 -253637
6823 -253637 71652 -71127 -28229 292444 200236 140701 -238344 -130578 -25340 25547 -246609
6811 -124295 -211843 139747 -8196 39163 -174154 88332 169635 -122258 -73794 74105 79572
6800 79572 10044 -179322 -105855 355425 -193428 118666 -345971 -124635 -126901 -24157 -149436
6789 -149436 -68438 112022 -224232 -20040 -34776 -3912 -145904 115395 69142 113728 -1997
6777 -71902 122509 -37433 288391 93134 -3770 14107 143871 239356 -65102 96075 -20793
6765 86461 73659 134172 -327983 -112851 -145414 50574 -18351 -199994 3526 -22166 173093
6753 -35404 50073 -27605 -7187 -335554 -179196 177780 -189805 -196251 31591 -330605 -43120
6741 -178390 75490 -159334 -76297 252576 -239048 176317 14349 -96106 137664 -179144
6730 -191774 38223 97789 -136920 89610 99110 -28719 26370 11212 -180113 134203 -133702
6718 -286383 136811 217304 43088 172398 -85031 266228 -112223 102595 -41596 392534
6707 15285 32226 86884 -38540 -206962 -88618 100546 -178991 152975 -147238 19032 -88741
6695 -307563 220581 176455 112469 65762 186342 94486 -224309 217814 -25997 -52522 -237439
6684 -237439 -40566 -186034 146304 100745 -143395 -231876 115497 88857 -215 -129141 -34618
6672 206838 94481 25050 -5854 -282401 -155437 -57468 -315634 5343 -104623 -332931 -26092
6660 -170902 -159453 18616 -319221 -244193 260974 -163814 270691 87167 -194958 -169685 294864
6648 -22597 -233473 197478 -219445 -280065 213569 -110345 -52723 -209 313718 -5632 44790
6636 -224892 -258380 307959 -190754 48841 25742 81326 439604 -184585 311367 -26495 5097
6624 -219129 -113652 189016 86681 -137315 -9187 -82158 -52186 214663 91889 -242553 4881
6612 -196873 63659 33573 -45343 -70591 36894 -170410 12778 19243 -282786 141776 114771
6601 114771 257660 -13697 24621 110778 -136345 57979 393664 -134567 192707 303 -2315
6589 182771 61111 -36599 112444 -28799 -162492 -187045 -67028 -68860 -230348 236653 214957
6578 214957 249314 22773 -283000 41372 -144214 131262 87459 -45851 -50648 -54760 82309
6566 45971 -37604 -99796 87962 -93933 38792 21143 -154331 -50860 -17355 -58749 -294259
6555 -294259 -124825 -303088 123417 -97343 123430 169046 -84434 -146538 155323 -135705
6544 -182110 -30868 -75574 28345 397319 96705 95293 -200259 13083 -122582 -58382 193640
6532 -153657 -86055 32125 238461 -52588 -108189 -338421 -100862 74974 -18860 74414 79694
6521 79694 -135517 -39772 -86523 -101241 -115165 104911 -28379 19288 -44618 44602 62018
6510 62018 144551 -190644 -41291 154339 -1747 -127183 -44684 -273599 254200 -105832 -124730
6499 -124730 -153114 35070 -149093 35670 165818 -81096 30334 156522 93840 129449 127621
6488 127621 256398 -34795 254641 130591 -7248 151092 16507 -367035 -147364 -108204 -239549
6477 -239549 -16088 11788 285142 -285650 287503 69686 30720 -58947 -54463 115008 -47816
6465 -55425 136379 -48694 -348036 160395 52636 -22044 -106283 -106910 414054 -373041 -208990
6454 -208990 -28156 -63113 199256 -177796 -354645 -71876 -409272 -80023 -110312 147358 -435458
6442 -70544 -151424 -185006 -53566 -167284 72518 -249624 131802 -80801 37260 232871 65144
6430 254704 -144804 -22887 -97269 -7216 40895 35314 104885 40050 104566 -47604 222275 -78223
6417 -181290 -43463 108372 219147 192555 -77620 99399 -93526 232259 144486 -16656 31548
6405 214182 -116557 23328 344094 -62534 -244861 -268477 131601 222505 -613 -112528 31184
6393 53507 -66185 -206554 -69164 22500 147291 -125833 -37191 5300 264775 -265376 35910
6381 29495 -45345 200176 -86412 29455 -331296 155558 202584 281040 120490 63799 -149728
6369 -98018 92964 -311288 -2992 357761 -24260 -107112 -19015 162295 201608 57588 294617
6358 294617 -260564 246927 144072 102802 340599 229061 325335 67104 151099 -130470
6347 -78886 -103379 -82510 -306991 -114543 -192415 -8048 72510 -105955 -194973 -204386 -167906 157465
6334 -12981 -176546 -193381 66952 -216854 -7973 36421 -2693 -23930 92017 -102872 -196168 -51226
6321 28428 160590 46783 -158968 70132 -311435 55305 -457071 -11811 -176383 -158176 -26945
6309 374848 -99639 79188 121991 -82103 378409 -155221 72803 279559 -129781 -89263 40484
6297 188169 44268 -43435 -166929 -232371 -87488 -28831 182443 164099 -84768 -163608 -106414
6286 -106414 -105790 44441 -130397 -35626 -61303 -18790 -20916 116458 137687 159281 299233 260793
6274 260793 333133 -279607 -227742 186340 459790 225273 3943 77644 -52481 -68804 -88310
6263 -88310 -85768 42075 5639 -212709 81042 249869 -223334 253446 -87781 -5119 337593
6251 -150919 79350 31519 178583 -123989 -179418 78277 180175 148900 315766 10994 -241231
6239 -58935 -139066 -233750 -59113 21992 -114867 -109011 4503 192547 -116612 -251137 -85204
6227 -302696 -134022 75997 -23548 -67621 16321 -84093 327149 6935 147327 210005 164774
6216 164774 -8261 -181084 245214 -35705 -126099 -166271 136237 103111 -5121 99205 77756
6205 77756 -101209 -25015 -199441 38158 -22322 -150372 -372605 203010 -131843 35692 163749
6194 163749 -149320 -16746 237957 29777 -117039 101210 10205 -114579 79828 110185 202844
6183 202844 -152176 -200892 29383 -248600 -42783 -205527 127213 14986 223777 -137382
6172 115144 -429229 -171876 36218 -126314 -293012 -3616 66393 -58666 -19010 130687 -16221
6160 94499 -451803 76037 24679 -40468 80221 -124172 9328 -35980 169948 303534 -42990
6148 145348 -109322 85380 348806 154776 172838 242871 -29560 -174524 22407 4991 317266
6137 317266 417849 -10732 26084 68499 -78 -82038 -191080 34024 125056 -109214 206085
6125 10469 -177636 277735 -204676 -167204 -50578 80601 62226 -237799 -252192 49755 -154633
6113 -91884 -78497 -13721 -68581 -409906 138876 -78610 -129324 5997 -134075 259437 208618
6102 208618 254011 169599 10526 143810 146649 59429 151658 -8619 300246 155585 -21924
6090 -37250 483695 -103004 -125632 275572 -126501 -27496 39083 -228626 108428 65853 -62179
6078 -183137 -61743 38407 56546 -3319 -344963 -68999 -90377 -52207 117858 -74040 51411
6066 95044 -103238 -243529 -259237 4361 -99756 129809 -6747 -128815 -39786 133616 223491
6055 223491 -331879 307720 53816 43594 70213 143643 84616 -376650 -132337 145493 -97963
6043 -87824 -66375 -68811 353 -36008 -203451 -21740 89647 -129125 106215 -188173 -200594 -67070
6030 50832 83496 225546 -81425 5208 5383 -216334 -203551 197829 -144737 123980 31908
6018 -138247 90789 -283384 -96154 222817 -182380 211169 -223169 -147700 164622 86519
6008 86519 -272861 42206 -156652 -360855 199026 162062 -44745 -128266 -50879 -178730 188351
5996 -124562 91674 -136512 -161053 -185146 -163284 126401 -266329 23668 -33853 74725 122900
5985 122900 205275 97258 -1718 -148204 174278 -65143 64787 177733 351822 -96187 -34058
5973 -48343 -161809 246423 -300174 178238 -99473 -299150 365332 155395 334052 64008
5962 6473 -164466 -191368 -120259 133179 122116 229862 38498 -231193 75673 42688 200758
5951 200758 -217642 -192765 86634 15283 -210870 283991 -120641 10768 -57412 -35621 24763
5939 73156 -174069 -26529 171155 108836 98908 -50557 -292879 -73347 392823 40910 106488
5928 106488 -213484 -102460 63181 -103068 50651 -13157 -324931 103791 -74693 34440 -104232
5916 -18116 20055 -120068 31152 -105697 -65118 -210935 -257718 343988 -302597 -176132 -202684
5905 -202684 113459 -53584 -139731 233190 71951 97750 111194 354989 -47865 277199 -40360
5893 404281 31262 -171617 -15754 -238366 -183804 55104 196950 -483636 -121441 -29421 195194
5881 168386 11201 -155452 319017 184712 82068 -42056 13202 35315 -147072 -45466 180230
5869 31020 96053 21546 -139589 91344 -35328 137298 16170 -103624 42972 -225169 187698
5857 25179 3791 -27091 -233465 146186 175881 -103732 -158951 -191787 -55958 -39197 279929
5845 119895 161703 -44685 -263652 -49816 296658 -63216 238831 10427 -149040 76906 11646
5833 -71883 11115 -355699 -434869 -33662 -158495 -434619 25923 -332276 229792 284749 -119565
5821 -25336 -370077 858 -121226 -156042 108829 -14302 -110355 -92681 128368 -168005 54075
5809 -140432 -163036 -126995 -232645 -109316 -211724 -76034 255124 75722 62667 113473 -16547
5797 36439 -184841 -51303 181135 -115164 371410 -137118 -254814 118698 91159 -94478
5786 92735 12447 -151450 5792 -63824 -506106 129376 -126565 -133417 176543 312921 209472
5775 209472 -172151 234639 -87727 134030 -56304 -64197 -139967 117381 3355 178008 24933
5763 263379 -128257 369518 76713 -63065 -291014 121621 160799 198290 321241 -34161 9454
5751 -91454 -9411 222576 12693 -63660 261228 -36798 -176699 -94934 9354 181195 -77914
5739 -315867 73530 -205454 31748 -73845 154743 99007 -104479 -37686 -285119 116583 139262
5728 139262 -293523 159716 272217 167875 -125218 139077 -27197 -94329 -156981 335518
5717 -13977 -201900 -238064 183971 -50643 34747 -185707 -242813 230291 130390 -210804 16557
5705 88718 -145588 193640 -148813 -171014 113844 122690 173137 41785 -131910 198134 -32012
5693 115850 -3798 -5284 240725 173196 -107212 -100577 -137655 -37001 -216467 -12921 -224278
5682 -224278 248943 53164 -102786 -138412 -40099 99553 -83716 30543 -204018 -409327 127367
5670 -80196 -91170 -107383 -162582 -197880 332430 -214284 -145272 20421 185035 -93106 -229963
5659 -229963 124625 327840 98102 -18190 123689 63900 267419 -1177 66902 347760 -148818
5647 213869 -57129 134989 130390 -157601 -76887 -2755 79806 -184895 128425 297026 38563
5635 -98216 141355 -41151 -203754 37158 -93447 -75985 -154172 -44958 -635 32699 -50802 179548
5622 50688 -323179 -90766 -8586 -27366 113854 271168 -118496 -4274 -77321 213 34536 57783
5610 57783 -60021 -217803 131404 30267 -71251 -72730 -146479 69159 10320 -37849 13747 111487
5598 111487 -53547 66037 -112945 -11044 -34664 -26746 13608 109659 146283 10148 -7072 -129303
5586 -129303 169591 11466 -108506 -132878 175264 -9015 180660 -164117 -139214 83969 -134721
5574 151709 15051 243356 -130623 -85620 35327 345274 145524 -59179 -391239 -51092 -228902
5563 -228902 241824 -8736 -24358 -113872 -152518 -156860 -119018 -140030 -359479 -143550 18857
5551 134606 77559 -228902 66915 78236 76247 18369 -317313 -195504 15589 199430 -336286
5539 88726 -421884 112952 34201 218705 3618 25076 -55876 335829 -206129 191332 -89420
5527 40370 270534 -99145 -305766 175887 96274 73451 -135199 -132971 277150 -151584 63134
5515 -200052 79609 42920 163695 -32074 207789 177829 2193 74529 156921 -7060 284296
5503 111304 -174862 132394 187950 -163111 -61896 309546 85735 111371 -86608 -117780 -61062
5492 -61062 2066 -188477 179909 -115305 171176 93144 134445 99135 -131319 17994 267012
5481 267012 -88018 -76238 53308 27185 22492 -74876 93550 -280073 99039 41677 24150 -126483
5468 280648 -285488 -27061 101632 49389 -214128 83456 -79534 284530 48261 -23767 226869
5456 246912 -118774 -13876 175119 77183 196355 164197 11095 112983 51348 69218 160952
5445 160952 24455 -204504 82554 -88373 -14365 166524 207545 166062 -111739 -7448 294676
5433 275683 348449 183554 -79907 86519 113748 95955 -234936 224757 -139780 92433 -11789
5421 359461 75950 74183 76203 371718 -193967 126316 -57571 -73217 130434 86106 204179
5410 204179 36732 451012 61540 -165683 -5050 -282562 133047 189174 229187 90275 -116541
5398 -181873 -90384 -35358 -108665 130712 -373533 37936 159015 -105889 161310 145340 -208205
5386 182033 234427 146908 -289236 -84663 401352 -143755 -14358 4402 293451 46706 -39036
5374 -124391 480145 137047 38960 117791 -55838 -47957 -46407 154890 58140 353822 -222411
5362 194844 56680 -7710 69316 -128419 -36989 -239338 118151 -80764 -95819 119113 -17684
5350 -95347 93359 114166 -516293 4405 195072 4252 -24468 50274 -219073 10533 36572 14762
5337 72901 -97149 -37972 -312697 62549 -307222 -70592 105891 68256 -55760 -75833 -11874
5325 -306339 -76600 -41989 -155975 -263896 -110072 -242342 198437 -7968 -250580 -133847
5315 -133847 169702 -19638 -75363 67259 -34407 -265781 48486 96098 74597 179202 -43998
5303 -54705 151780 -73370 38280 -62157 173610 80368 -179179 75181 -59333 167708 -16473
5291 -148639 250102 -277153 145040 -193433 -207273 -231321 31381 144456 145747 37901 -20364
5279 -82994 72118 187867 140378 367807 206616 -17398 -241515 4279 58167 -348046 205809
5267 -81649 166626 93149 271831 527034 69089 244744 -133942 47203 -256374 -154819
5257 -154819 -324400 57528 -167527 -260841 -75151 317922 -107935 205737 -14504 -248082
5247 -248082 24920 329536 6121 111688 5496 -97267 -357140 -23814 174516 77398 179639
5236 179639 14159 -42606 -55027 -160675 -135140 159108 -58698 89856 95888 -206531 90335
5224 84527 15694 337971 194724 -56813 37497 1540 30892 -43725 52863 652 330627 335314
5212 335314 52188 20766 -17641 195161 -109776 179732 -112137 127457 -43611 -193086
5202 -193086 -71862 -114735 263106 -192403 -183846 196462 104253 178104 202950 12864 325109
5191 325109 -78471 214906 -108523 -134309 151438 -47246 201750 -128826 118419 -13035
5180 48171 58891 -191664 -207645 56474 301247 -33981 25571 -225294 80307 -169414 369931
5168 164183 -168800 -39290 175055 -78204 -188574 -205687 -79307 63650 64903 -126108 -10346
5156 -216599 177820 107189 145477 -104289 170242 90742 1121 122996 173638 -158808 -185721
5145 -185721 87003 201682 10745 202046 165209 -67860 3971 192270 -194560 -107282 -67981
5134 -67981 -58180 175337 91065 -21809 -189573 101511 309655 -168897 214455 265965 -320233
5122 170616 -15371 -133652 -306947 -102022 313287 16272 145880 32939 -41044 141372
5111 -125562 124642 -109910 -104387 -179889 -76402 -81711 57723 -77594 38872 -94351 -33955 152011
5098 72074 116259 -176475 -47281 -248817 147541 1524 -177163 -52871 -16166 -41621 37586
5086 65187 153758 -195494 20298 160922 -46408 -297708 -245931 35470 -6754 52032 -46956
5074 -156881 -20062 23837 147849 -206942 166778 -155308 32110 221487 -21444 2588 -44436
5062 -108617 301840 -295352 204702 41309 -170869 -203222 -45149 321779 -75709 -61938 460183
5050 -59488 -16612 -13402 114284 10901 173480 64125 80594 59495 -70960 87914 78669 -378910
5037 282244 85608 40805 -12056 143646 -199079 146108 215639 21666 -45434 20736 333108
5026 333108 169087 -381977 101437 337295 -43185 138392 -24046 -1472 -245440 3373 314496
5015 314496 70643 -246408 227667 -177587 13323 90716 -178427 12026 325210 147472
5004 206427 316689 30910 -11167 -84028 -19796 -172151 221754 -221814 -64231 -136198 295833
4992 60658 229408 -26542 100068 211422 -71746 -9081 -25111 -159148 58804 -161611 -195374
4981 -195374 142520 -6776 47894 30847 -106977 -177221 234157 254621 238393 68164 -107032
4969 -3333 216779 -16458 226003 -315001 -39741 -71762 -163600 -39258 -43040 131673 12590
4957 -10454 -141222 -31138 32541 115554 -217891 148186 -203016 -83387 -66561 -199183 -214320
4946 -214320 37158 -329656 141664 -178118 -127241 -98118 -558 158963 12692 233761 95055
4934 219266 -42258 25266 179711 -283114 251598 -15455 -133834 10192 60241 -58893 -199116
4923 -199116 14605 -112654 112234 40555 506322 34207 -35911 3550 91628 388458 118321
4911 -252078 264345 78967 59879 69836 -76102 -19315 -51125 -93155 -53440 308199 502870
4900 502870 -164322 -9573 48354 198890 -14530 -13146 -3690 -352868 57495 7270 -188617 33937
4887 -285499 69552 29351 83524 -119253 -47601 -85697 -82005 209542 427448 108042 -308083
4875 -8293 116410 -272291 -2412 9337 114875 45020 152408 -60758 154159 -42432 -217649
4864 -217649 -169275 -45551 -128973 -35978 -44299 -9652 -73981 222206 303393 39059 187559 -340689
4851 83176 380200 -117944 -129180 -214908 60446 -214215 339859 211023 147750 -20842 103577
4839 -104494 49266 164913 -8005 -318179 236468 38800 -70905 56614 187864 -103707 -158447
4828 -158447 402801 -292912 10373 -34454 20862 71985 94587 147948 -245298 -66805 99913
4816 -142131 -252579 -24631 74849 80983 -57527 120440 144788 -60582 -44890 22128 -10827
4804 -154781 -4838 153472 -485 32401 201658 64223 -120800 67819 34977 -2043 -266687 -182990
4792 -182990 -109153 -212820 248996 -142861 -48398 62496 -217362 274653 -168515 133136
4781 49038 6685 -16672 361253 185716 -100049 199280 267148 185408 55444 371135 144870
4769 58363 72664 -110082 -67128 -3885 -96656 25782 253379 -174078 211578 155687 219822
4758 219822 275029 239717 -226034 -194053 -129645 -210580 374417 37209 60224 -25851 -206399
4747 -206399 40930 226897 67388 102402 205142 -120237 -385679 -37133 12087 -200195 107042
4735 124953 -109062 6139 98647 147069 70367 130649 -203025 99823 120910 -47534 -379039
4724 -379039 59597 104534 169291 -34612 127388 -350810 9894 177371 244139 23683 22445
4713 22445 -38696 274759 263018 -36870 -7774 81487 -27165 80615 322001 -21151 -44778 1100
4700 4334 -107662 188338 -82012 178001 26008 142697 117215 315482 23431 35547 -65184
4688 109589 200022 -125013 35888 350029 421256 -216421 -212156 -373069 -161963 -114125 350556
4676 13679 119303 140249 -309030 -41781 316958 143988 159144 -234492 -56495 42906 217392
4665 217392 26534 65435 149626 320957 170920 67857 87360 289449 -100522 239728 160898
4654 160898 15040 -242033 8081 154529 -271192 -160125 -373954 179818 12278 -82733 -138789
4643 -138789 14389 -112529 -155165 -109787 -49919 81902 -82968 108728 174455 214753 -74313
4631 142761 58838 182238 -363238 148070 -347279 -81424 143752 250064 195365 224348
4621 224348 181132 100766 -35190 153285 89264 170963 -335134 178934 -451355 -61682 29142
4609 -77679 -188597 114845 24595 16196 297756 134906 -303583 -103098 -81692 -228059 101723
4597 -2114 144656 128897 -88973 38748 -276093 193779 87651 -299736 -107058 46045 -16280
4585 -103090 -89441 -273522 -101759 -175258 278973 194285 149213 -298765 -20100 150642 385448
4574 385448 3501 6309 -51586 -44656 -82474 59397 246659 -241118 108792 25983 -35197 -152793
4562 -152793 98798 277360 261822 126267 292673 40915 -51397 -82673 -24905 48858 218664
4551 218664 150908 204409 204282 109457 -361461 -187738 154357 305564 184336 37233 36755
4540 36755 -153509 146088 -102165 -304326 1457 -41538 299762 -164032 48321 -219929 -194220
4529 -194220 142475 -5485 -152913 80082 372808 202293 17757 123126 -263743 -3419 127449
4517 -43922 151759 -191404 13882 348966 -151433 -385016 -202287 37281 206158 147905
4507 147905 -36851 -52494 -83223 -104230 85294 -145446 -23369 108460 122360 -203772 215658
4495 -165403 -64461 314977 -43773 260671 85575 132908 -9003 96366 237507 -80553 -18689
4483 -144733 59825 -70841 -92164 -79842 68347 129781 287380 48910 15148 35472 -175216
4471 46399 198946 124084 -137185 -161111 69222 114936 70327 154828 202804 217625 59341
4459 22487 -183727 182442 -387349 -47604 116158 -117724 154807 190124 12727 -47891 20079
4447 60114 21186 -22113 -15381 -91553 -14962 140697 -12759 -34043 34391 43554 321918 20385
$$ [...]
##END NTUPLES=NMR SPECTRUM
##END=
