
##TITLE=AC1333_TANAH10083_7160795_mNxTH9sknc
##JCAMPDX= 6.0         $$ Bruker NMR JCAMP-DX V2.0
##DATA TYPE= NMR SPECTRUM
##DATA CLASS= NTUPLES
##ORIGIN= BRUKER
##OWNER= Administrator
$$ 1.72 TOPSPIN		Version 2.1
$$ 2013-01-30 03:07:24.100 -0500  Administrator@X
$$ Compression mode = diff/dup
##.OBSERVE FREQUENCY= 400.02188249412
##.OBSERVE NUCLEUS= ^1H
##.ACQUISITION MODE= SIMULTANEOUS (DQD)
##.ACQUISITION SCHEME= undefined
##.AVERAGES= 64
##.DIGITISER RES= 22
##SPECTROMETER/DATA SYSTEM= spect
##.PULSE SEQUENCE= noesygpps1d.comp
##.SOLVENT NAME= COFFEE_meoh
##.SHIFT REFERENCE= INTERNAL, COFFEE_meoh, 1, 14.96277
##AUDIT TRAIL= $$ (NUMBER, WHEN, WHO, WHERE, PROCESS, VERSION, WHAT)
$$ ##TITLE= Audit trail, TOPSPIN		Version 2.1
$$ ##JCAMPDX= 5.01
$$ ##ORIGIN= Bruker BioSpin GmbH
$$ ##OWNER= Administrator
$$ $$ E:\/data/COFFEE/nmr/AC1333_TANAH10083_7160795_mNxTH9sknc/22/pdata/1/auditp.txt
$$ ##AUDIT TRAIL=  $$ (NUMBER, WHEN, WHO, WHERE, PROCESS, VERSION, WHAT)
(   1,<2013-01-30 03:07:18.131 -0500>,<Administrator>,<X>,<go>,<TOPSPIN 2.1>,
      <created by zg
	started at 2013-01-30 02:55:47.723 -0500,
	POWCHK enabled, PULCHK disabled,
       configuration hash MD5:
       86 BA 57 50 F2 9D 5C 9B 26 00 A9 28 5F 66 2E 89
       data hash MD5: 64K
       A4 E0 9E 15 70 F8 EB 43 F8 1B DA 56 33 1A 55 0A>)
(   2,<2013-01-30 03:07:21.272 -0500>,<Administrator>,<X>,<proc1d>,<TOPSPIN 2.1>,
      <Start of raw data processing
       efp LB = 0.3 FT_mod = 6 PKNL = 1 PHC0 = 0 PHC1 = 0 SI = 128K 
       data hash MD5: 128K
       87 53 E4 9C 46 FA 23 FC EE EE D0 59 6D 50 ED 43>)
(   3,<2013-01-30 03:07:22.319 -0500>,<Administrator>,<X>,<proc1d>,<TOPSPIN 2.1>,
      <pk PHC0 = -80.48584 PHC1 = 0 
       data hash MD5: 128K
       B6 AE 03 8F 78 55 5C 71 E7 9A B2 6A C1 E4 34 7D>)
(   4,<2013-01-30 03:07:23.006 -0500>,<Administrator>,<X>,<proc1d>,<TOPSPIN 2.1>,
      <abs ABSG = 1 
       data hash MD5: 128K
       AE 48 85 D2 49 CC 5A 91 C5 04 43 F8 95 12 6F 0C>)
(   5,<2013-01-30 03:07:23.209 -0500>,<Administrator>,<X>,<proc1d>,<TOPSPIN 2.1>,
      <abs ABSG = 2 
       data hash MD5: 128K
       DB 83 27 D0 BD 9C 4B BB D7 F7 11 E6 16 76 EB 5C>)
(   6,<2013-01-30 03:07:23.381 -0500>,<Administrator>,<X>,<proc1d>,<TOPSPIN 2.1>,
      <abs ABSG = 3 
       data hash MD5: 128K
       0E 68 AB 0E 0A F0 AA 6D 90 3C 6C 23 37 39 7F 61>)
(   7,<2013-01-30 03:07:23.553 -0500>,<Administrator>,<X>,<proc1d>,<TOPSPIN 2.1>,
      <abs ABSG = 4 
       data hash MD5: 128K
       5D B9 21 01 65 82 1E 96 33 C1 5D 34 A2 09 4F E7>)
(   8,<2013-01-30 03:07:23.741 -0500>,<Administrator>,<X>,<proc1d>,<TOPSPIN 2.1>,
      <abs ABSG = 5 
       data hash MD5: 128K
       C3 51 D5 31 0F 66 F1 8E 5D 71 9B 1C 11 39 2C 86>)
$$ ##END=
$$ 
$$ $$ hash MD5
$$ $$ 57 4B 64 6C 35 E6 3B B7 37 15 D6 DF 19 74 AC B8
##$RELAX= 
##$RELAX= 
##$RELAX= 
##$RELAX= 
##$RELAX= 
##$RELAX= 
##$RELAX= 
##$RELAX= 
$$ Bruker specific parameters
$$ --------------------------
##$DU= <E:\>
##$EXPNO= 22
$$ [...]
##$TP07= 0
##$TPNAME0= <>
##$TPNAME1= <>
##$TPNAME2= <>
##$TPNAME3= <>
##$TPNAME4= <>
##$TPNAME5= <>
##$TPNAME6= <>
##$TPNAME7= <>
##$TPOAL= (0..7)
0.5 0.5 0.5 0.5 0.5 0.5 0.5 0.5
##$TPOFFS= (0..7)
0 0 0 0 0 0 0 0
##$TUNHIN= 0
##$TUNHOUT= 0
##$TUNXOUT= 0
##$USERA1= <user>
##$USERA2= <user>
##$USERA3= <user>
##$USERA4= <user>
##$USERA5= <user>
##$V9= 5
##$VALIST= <valist>
##$VCLIST= <CCCCCCCCCCCCCCC>
##$VD= 0
##$VDLIST= <DDDDDDDDDDDDDDD>
##$VPLIST= <PPPPPPPPPPPPPPP>
##$VTLIST= <TTTTTTTTTTTTTTT>
##$WBST= 1024
##$WBSW= 4
##$XGAIN= (0..3)
0 0 0 0
##$XL= 0
##$YL= 0
##$YMAX_a= 8452648
##$YMIN_a= -17638064
##$ZGOPTNS= <>
##$ZL1= 120
##$ZL2= 120
##$ZL3= 120
##$ZL4= 120
##$ABSF1= 14.96277
##$ABSF2= -5.595411
##$ABSG= 5
##$ABSL= 3
##$ALPHA= 0
##$AQORDER= 0
##$ASSFAC= 0
##$ASSFACI= 0
##$ASSFACX= 0
##$ASSWID= 0
##$AUNMP= <proc_prof1d_extract.lims>
##$AXLEFT= 0
##$AXNAME= <>
##$AXNUC= <1H>
##$AXRIGHT= 0
##$AXTYPE= 0
##$AXUNIT= <>
##$AZFE= 0.1
##$AZFW= 0.1
##$BCFW= 0
##$BC_mod= 0
##$BYTORDP= 0
##$COROFFS= 0
##$CY= 15
##$DATMOD= 1
##$DC= 0
##$DFILT= <>
##$DTYPP= 0
##$F1P= 0
##$F2P= 0
##$FCOR= 0.5
##$FTSIZE= 131072
##$FT_mod= 6
##$GAMMA= 0
##$GB= 0
##$INTBC= 1
##$INTSCL= 1
##$ISEN= 128
##$LB= 0.3
##$LEV0= 0
##$LPBIN= 0
##$MAXI= 10000
##$MC2= 0
##$MEAN= 0
##$ME_mod= 0
##$MI= 0
##$NCOEF= 0
##$NC_proc= -2
##$NLEV= 6
##$NOISF1= 0
##$NOISF2= 0
##$NSP= 0
##$NTH_PI= 0
##$NZP= 0
##$OFFSET= 14.96277
##$PC= 1
##$PHC0= -80.48584
##$PHC1= 0
##$PH_mod= 1
##$PKNL= yes
##$PPARMOD= 0
##$PPDIAG= 0
##$PPIPTYP= 0
##$PPMPNUM= 2147483647
##$PPRESOL= 1
##$PSCAL= 4
##$PSIGN= 0
##$PYNMP= <proc.py>
##$REVERSE= no
##$SF= 400.020008927458
##$SI= 131072
##$SIGF1= 0
##$SIGF2= 0
##$SINO= 400
##$SIOLD= 131072
##$SPECTYP= <>
##$SREGLST= <1H.CDCl3>
##$SSB= 0
##$STSI= 131072
##$STSR= 0
##$SW_p= 8223.68421052631
##$SYMM= 0
##$S_DEV= 0
##$TDeff= 65536
##$TDoff= 0
##$TI= <>
##$TILT= no
##$TM1= 0
##$TM2= 0
##$TOPLEV= 0
##$USERP1= <user>
##$USERP2= <user>
##$USERP3= <user>
##$USERP4= <user>
##$USERP5= <user>
##$WDW= 1
##$XDIM= 131072
##$YMAX_p= 402891687
##$YMIN_p= -12973
##$CURPLOT= <Network HP LaserJet P1505>
##$CURPRIN= <$Network HP LaserJet P1505>
##$DFORMAT= <normdp>
##$LAYOUT= <+/1D_H.xwp>
##$LFORMAT= <normlp>
##$PFORMAT= <normpl>
##$SURQMSG= 1
$$ End of Bruker specific parameters
$$ ---------------------------------
##NTUPLES= NMR SPECTRUM
##VAR_NAME=  FREQUENCY,     SPECTRUM/REAL,   SPECTRUM/IMAG
##SYMBOL=    X,             R,               I
##VAR_TYPE=  INDEPENDENT,   DEPENDENT,       DEPENDENT
##VAR_FORM=  AFFN,          ASDF,            ASDF
##VAR_DIM=   131072,        131072,          131072
##UNITS=     HZ,            ARBITRARY UNITS, ARBITRARY UNITS
##FACTOR=    0.0627417313425164, 1,          1
##FIRST=     8223.62146879497, 2330,         -65348
##LAST=      0,             4604,            -65809
##MIN=       0,             -12973,          0
##MAX=       8223.62146879497, 402891687,    0
$$ Real data points
##PAGE= N=1
##DATA TABLE= (X++(R..R)), XYDATA
$$ [...]
$$ plain form
63194 710004 694773 679709 665666 653957 645105 638719 634415 632279 632464 634969 639905 647453 657403
63181 657403 669128 682177 696510 712114 728848 746712 765698 785213 804280 822588 840817
63170 840817 859561 878406 896566 913933 930911 947496 963106 977200 989530 999826 1007656 1012612
63158 1012612 1014354 1012545 1006973 997637 984487 967338 946332 922285 896222 868883 841091 814202
63146 814202 789433 766822 745559 725400 707069 691126 677193 664700 653849 645341 639407 635474
63134 635474 632579 629849 626897 624089 622196 621495 621442 621495 621887 623100 624800 625864 625482 623778 621381 618837
63118 618837 616501 614477 612415 609745 606382 602959 600178 598151 596598 595417 594744 594602 594819 595212 595598
63103 595598 595753 595682 595885 596990 599026 601398 603701 606279 609651 613539 616878 618918 620107 621632 624104
$$ packed form
63194G10004j5231j5064j4043j1709q852o386m304k136J85K505M936P548R950
63181F57403J1725J3049J4333J5604J6734J7864J8986J9515J9067J8308J8229
63170H40817J8744J8845J8160J7367J6978J6585J5610J4094J2330J0296P830M956
63158A012612J742j809n572r336j3150j7149k1006k4047k6063k7339k7792k6889
63146H14202k4769k2611k1263k0159j8331j5943j3933j2493j0851q508n934l933
63134F35474k895k730k952k808j893p01n3N3L92J213J700J064l82j704k397k544
63118F18837k336k024k062k670l363l423k781k027j553j181o73j42K17L93L86
63103E95598J55p1K03J105K036K372K303K578L372L888L339K040J189J525K472
$$ plain form
63088 624104 626943 629251 631143 633870 638500 644758 651385 657395 662658 667456 671985 676396 680911 685644
63074 685644 690499 695429 700579 706018 711483 716592 721181 725371 729428 733685 738377 743405 748462 753599
63060 753599 759455 766690 775394 785320 796496 809220 823500 838984 855584 873888 894686 918113
63048 918113 943366 969370 995841 1023692 1054128 1087190 1121398 1155096 1187916 1220623 1253772
63037 1253772 1287066 1320027 1352747 1385677 1419025 1452602 1486158 1519661 1553303 1587209 1620926
63026 1620926 1653156 1682153 1706389 1724740 1736227 1740104 1736272 1725159 1706960 1681432 1648789 1610459
63014 1610459 1568524 1524536 1479347 1433920 1389717 1348080 1309611 1274542 1243523 1217679 1197798
63003 1197798 1183718 1174657 1170062 1169929 1174377 1183250 1196285 1213441 1234695 1259534 1286922 1315913
$$ packed form
63088F24104K839K308J892K727M630O258O627O010N263M798M529M411M515M733
63074F85644M855M930N150N439N465N109M589M190M057M257M692N028N057N137
63060G53599N856P235Q704R926J1176J2724J4280J5484J6600J8304K0798K3427
63048I18113K5253K6004K6471K7851L0436L3062L4208L3698L2820L2707L3149
63037A253772L3294L2961L2720L2930L3348L3577L3556L3503L3642L3906L3717
63026A620926L2230K8997K4236J8351J1487L877l832j1113j8199k5528l2643l8330
63014A610459m1935m3988m5189m5427m4203m1637l8469l5069l1019k5844j9881
63003A197798j4080r061m595j33M448Q873J3035J7156K1254K4839K7388K8991
$$ plain form
62991 1315913 1346084 1377314 1409292 1441408 1473121 1504377 1535631 1567344 1599290 1630299 1658845
62980 1658845 1683924 1705275 1722718 1735412 1741873 1740712 1731269 1713551 1687655 1653497 1611270 1562025
62968 1562025 1507497 1449312 1388704 1326938 1265460 1205265 1146650 1090070 1036833 988204 944060
62957 944060 903241 865243 830760 800360 773366 748507 725103 703148 682702 663803 646737
62946 646737 631803 618771 606934 595671 584754 574161 563894 554015 544672 535952 527739 519767
62934 519767 511880 504322 497634 492062 487197 482459 477783 473537 469851 466569 463760 461732 460430 459434
62920 459434 458713 458747 459610 460606 461241 461988 463469 465369 466766 467178 466637 465100 462664 460204 458972 459344 460506
62903 460506 461504 462115 462623 463223 463898 464543 465047 465409 465714 465745 464810 462407 459016 455719 453006 450444 447542
$$ packed form
62991A315913L0171L1230L1978L2116L1713L1256L1254L1713L1946L1009K8546
62980A658845K5079K1351J7443J2694O461j161r443j7718k5896l4158m2227m9245
62968A562025n4528n8185o0608o1766o1478o0195n8615n6580n3237m8629m4144
62957I44060m0819l7998l4483l0400k6994k4859k3404k1955k0446j8899j7066
62946F46737j4934j3032j1837j1263j0917j0593j0267r879r343q720q213p972
62934E19767p887p558o688n572m865m738m676m246l686l282k809k028j302r96
62920D59434p21L4Q63R96O35P47J481J900J397M12n41j537k436k460j232L72J162
62903D60506R98O11N08O00O75O45N04L62L05L1r35k403l391l297k713k562k902
$$ plain form
62886 447542 444391 441279 438257 435385 432918 430826 428551 425706 422738 420386 418706 417144 415514 414288
62872 414288 413786 413584 413076 412269 411631 411256 410612 409206 407184 405156 403639 402790 402409 401976 400836 398733 396082
62855 396082 393495 391130 388798 386601 384945 383858 382748 381041 378723 376043 373066 369862 366801 364321
62841 364321 362539 361307 360419 359554 358326 356778 355614 355525 356399 357478 358114 358130 357715 357367 357679 358639 359277
62824 359277 358566 356718 355105 354784 355508 356273 356429 355977 355131 354022 352840 352028 352101 353153 354626 355798 356542
62807 356542 357351 358617 360258 362157 364441 367065 369661 372279 375789 380984 387587 394780 402311 410349
62793 410349 418574 426414 434187 443052 453592 465191 477072 489252 502220 516339 531917 549302
62781 549302 568556 589490 612346 637968 666996 699322 734604 772843 814170 858564 906080
$$ packed form
62886D47542l151l112l022k872k467k092k275k845k968k352j680j562j630j226
62872D14288n02k02n08q07o38l75o44j406k022k028j517q49l81m33j140k103k651
62855C96082k587k365k332k197j656j087j110j707k318k680k977l204l061k480
62841C64321j782j232q88q65j228j548j164q9Q74J079O36J6m15l48L12R60O38
62824C59277p11j848j613l21P24P65J56m52q46j109j182q12P3J052J473J172P44
62807C56542Q09J266J641J899K284K624K596K618L510N195O603P193P531Q038
62793D10349Q225P840P773Q865J0540J1599J1881J2180J2968J4119J5578J7385
62781E49302J9254K0934K2856K5622K9028L2326L5282L8239M1327M4394M7516
$$ plain form
62770 906080 956802 1010177 1064899 1119862 1174720 1229028 1281384 1330050 1374014 1412662 1444634
62759 1444634 1467835 1480683 1482857 1474856 1457312 1430834 1396087 1353921 1305678 1253350 1199027 1144027
62747 1144027 1088746 1033361 978524 925370 875022 827958 783747 741617 701564 664753 632501
62736 632501 604969 581121 559725 539995 521438 503729 486978 471724 458402 446956 437036 428340
62724 428340 420723 414185 408855 404835 401960 399887 398458 397823 398112 399157 400613 402277 404314 407265 411815
62709 411815 418326 426519 435829 446081 457671 471013 486049 502531 520633 541050 564502 591326
62697 591326 621566 655152 691813 730981 772273 816217 864179 917153 974639 1034997 1096853
62686 1096853 1159776 1223465 1286765 1347856 1405145 1457456 1503412 1541151 1568857 1585302 1589753
$$ packed form
62770I06080N0722N3375N4722N4963N4858N4308N2356M8666M3964L8648L1972
62759A444634K3201J2848K174q001j7544k6478l4747m2166m8243n2328n4323n5000
62747A144027n5281n5385n4837n3154n0348m7064m4211m2130m0053l6811l2252
62736F32501k7532k3848k1396j9730j8557j7709j6751j5254j3322j1446r920q696
62724D28340p617o538n330m020k875k073j429o35K89J045J456J664K037K951M550
62709D11815O511Q193R310J0252J1590J3342J5036J6482J8102K0417K3452K6824
62697E91326L0240L3586L6661L9168M1292M3944M7962N2974N7486O0358O1856
62686A096853O2923O3689O3300O1091N7289N2311M5956L7739K7706J6445M451
$$ plain form
62675 1589753 1581766 1561476 1529982 1489079 1440472 1385473 1325448 1262217 1197708 1133296 1069767
62664 1069767 1007919 948902 893832 843175 796646 753667 713859 677232 643998 614197 587424
62653 587424 563046 540683 520326 502006 485601 471058 458408 447263 436662 425851 415113
62642 415113 405359 396946 389336 381932 374775 368251 362486 357266 352325 347539 342956 338749 335027 331679
62628 331679 328559 325760 323470 321593 319819 318053 316460 315115 313906 312817 311915 311055 309990 308806 307838
62613 307838 307118 306371 305729 305905 307342 309571 311703 313283 314487 315856 318063 321570 326228 331526 337391
62598 337391 344380 352871 362584 373216 385033 398408 413211 429193 446582 465791 486842 509615
62586 509615 534276 560832 588603 616848 645708 675625 705855 734348 759289 780066 796550
$$ packed form
62675A589753p987k0290l1494m0903m8607n4999o0025o3231o4509o4412o3529
62664A069767o1848n9017n5070n0657m6529m2979l9808l6627l3234k9801k6773
62653E87424k4378k2363k0357j8320j6405j4543j2650j1145j0601j0811j0738
62642D15113r754q413p610p404p157o524n765n220m941m786m583m207l722l348
62628C31679l120k799k290j877j774j766j593j345j209j089r02q60j065j184r68
62613C07838p20p47o42J76J437K229K132J580J204J369K207L507M658N298N865
62598C37391O989Q491R713J0632J1817J3375J4803J5982J7389J9209K1051K2773
62586E09615K4661K6556K7771K8245K8860K9917L0230K8493K4941K0777J6484
$$ plain form
62575 796550 808172 814197 814395 808964 798157 782502 763210 741782 719085 695060 669489 642894
62563 642894 616576 591778 568852 547256 526297 505799 486165 467966 451518 436706 423162
62552 423162 410748 399767 390445 382281 374351 366343 358764 351940 345430 338835 332676 327826 324399 321819
62538 321819 319714 318112 316920 315962 315524 316146 317741 319555 321188 323119 325986 329818 334243 339015 344034
62523 344034 349164 354468 360423 367566 375979 385331 395360 406120 417787 430431 444113 459191 476389
62510 476389 496344 519077 544167 571478 601349 633882 668455 704242 740831 777808 814001
62499 814001 847737 877761 903368 923793 938106 945742 946600 940668 928095 909667 886507 859178
62487 859178 827730 792871 756450 720429 685885 653359 623474 596562 572046 548947 527017
$$ packed form
62575G96550J1622O025J98n431j0807j5655j9292k1428k2697k4025k5571k6595
62563F42894k6318k4798k2926k1596k0959k0498j9634j8199j6448j4812j3544
62552D23162j2414j0981r322q164p930q008p579o824o510o595o159m850l427k580
62538C21819k105j602j192r58m38O22J595J814J633J931K867L832M425M772N019
62523C44034N130N304N955P143Q413R352J0029J0760J1667J2644J3682J5078J7198
62510D76389J9955K2733K5090K7311K9871L2533L4573L5787L6589L6977L6193
62499H14001L3736L0024K5607K0425J4313P636Q58n932j2573j8428k3160k7329
62487H59178l1448l4859l6421l6021l4544l2526k9885k6912k4516k3099k1930
$$ plain form
62476 527017 506916 489281 473958 460233 447584 436097 426216 418122 411403 405409 399878 395065 391331
62463 391331 388866 387722 387770 388545 389442 390153 390737 391309 391987 393074 394797 396808 398449 399638 400974 402775
62447 402775 404538 405711 406538 407690 409327 410899 411699 411270 409449 406362 402340 397764 392999 388403 384048
62432 384048 379486 374239 368589 363375 358979 355142 351965 350207 350122 350746 351057 351339 352640 355289 358728
62417 358728 362537 366801 371572 376658 381917 387200 392118 396554 401240 407205 414656 423062 432143 441907
62403 441907 451674 460105 466601 471952 477201 482429 487142 491179 494639 497236 498355 497695 495543 492563
62389 492563 489504 486764 483964 480252 475384 470259 466106 463529 462654 463755 466978 471685 476883 482406
62375 482406 489114 497785 508406 520842 535615 553465 574423 597843 623329 651239 682220 716628
$$ packed form
62476E27017k0101j7635j5323j3725j2649j1487r881q094o719n994n531m813l734
62463C91331k465j144M8P75Q97P11N84N72O78J087J723K011J641J189J336J801
62447D02775J763J173Q27J152J637J572Q00m29j821l087m022m576m765m596m355
62432C84048m562n247n650n214m396l837l177j758q5O24L11K82J301K649L439
62417C58728L809M264M771N086N259N283M918M436M686N965P451Q406R081R764
62403D41907R767Q431O496N351N249N228M713M037L460K597J119o60k152k980
62389D92563l059k740k800l712m868n125m153k577q75J101L223M707N198N523
62375D82406O708Q671J0621J2436J4773J7850K0958K3420K5486K7910L0981L4408
$$ plain form
62363 716628 754436 795377 838967 884665 932312 982311 1035038 1089963 1145430 1199324 1249805
62352 1249805 1295480 1335103 1367347 1390875 1404645 1408371 1402833 1389607 1370252 1345702 1316459 1283224
62340 1283224 1247096 1209122 1169874 1129584 1088527 1047208 1006252 966352 928355 893271 861905
62329 861905 834391 810144 788404 768842 751510 736287 722635 710060 698638 688870 681108 675292
62317 675292 671155 668400 666640 665454 664634 664205 664027 663474 661739 658430 653756 648144 641886 635189 628285
62302 628285 621215 613621 605147 596135 587605 580282 573883 567679 561570 556173 551921 548592 545897 544079
62288 544079 543662 544925 547886 552478 558334 564614 570517 575940 581392 587373 594206 602290 612029 623417
62274 623417 636081 649753 664321 679447 694678 710138 726639 744813 764581 785851 809267
$$ packed form
62363G16628L7808M0941M3590M5698M7647M9999N2727N4925N5467N3894N0481
62352A249805M5675L9623L2244K3528J3770L726n538j3226j9355k4550k9243l3235
62340A283224l6128l7974l9248m0290m1057m1319m0956l9900l7997l5084l1366
62329H61905k7514k4247k1740j9562j7332j5223j3652j2575j1422r768p762n816
62317F75292m137k755j760j186q20m29j78n53j735l309m674n612o258o697o904
62302F28285p070p594q474r012q530p323o399o204o109n397m252l329k695j818
62288E44079m17J263K961M592N856O280N903N423N452N981O833Q084R739J1388
62274F23417J2664J3672J4568J5126J5231J5460J6501J8174J9768K1270K3416
$$ plain form
62263 809267 835708 865269 897404 932033 969925 1011793 1057490 1106273 1157469 1210553 1264722
62252 1264722 1318654 1370555 1418335 1459941 1493799 1518926 1534720 1540934 1538059 1527399 1510419 1488142
62240 1488142 1461354 1431081 1398411 1363979 1328164 1291787 1256116 1222119 1190176 1160705 1134510
62229 1134510 1112165 1093463 1077822 1064901 1054361 1045446 1037458 1030577 1025604 1022756 1021211 1019981 1018823
62216 1018823 1018079 1017979 1018384 1019070 1020026 1021493 1023752 1026743 1029909 1032654 1035004 1037627 1041171 1045813 1051507
62201 1051507 1058319 1066348 1075589 1086107 1098146 1111864 1127152 1143896 1162276 1182527 1204550 1227977
62189 1227977 1252575 1278303 1305009 1332358 1360118 1388355 1417186 1446441 1475689 1504542 1532757
62178 1532757 1559977 1585532 1608798 1629816 1649362 1668392 1687677 1708117 1730960 1757252 1787278
$$ packed form
62263H09267K6441K9561L2135L4629L7892M1868M5697M8783N1196N3084N4169
62252A264722N3932N1901M7780M1606L3858K5127J5794O214k875j0660j6980k2277
62240A488142k6788l0273l2670l4432l5815l6377l5671l3997l1943k9471k6195
62229A134510k2345j8702j5641j2921j0540q915p988o881m973k848j545j230j158
62216A018823p44j00M05O86R56J467K259K991L166K745K350K623L544M642N694
62201A051507O812Q029R241J0518J2039J3718J5288J6744J8380K0251K2023K3427
62189A227977K4598K5728K6706K7349K7760K8237K8831K9255K9248K8853K8215
62178A532757K7220K5555K3266K1018J9546J9030J9285K0440K2843K6292L0026
$$ plain form
62167 1787278 1820967 1858621 1900605 1946348 1994271 2042764 2090629 2136486 2178556 2215571 2247428
62156 2247428 2274559 2297115 2315157 2329070 2339214 2345590 2348503 2349113 2348544 2346701 2342759 2336754 2329902
62143 2329902 2323360 2317512 2312638 2309474 2308659 2310203 2313878 2319739 2327848 2337860 2349300 2361988 2375873
62130 2375873 2390674 2406032 2421845 2438171 2454981 2472319 2490512 2509820 2529974 2550419 2571082
62119 2571082 2592535 2615258 2638991 2663004 2686855 2710621 2734431 2758034 2780944 2802817 2823513
62108 2823513 2842944 2861179 2878641 2895844 2912764 2928815 2943647 2957683 2971593 2985499 2999082
62097 2999082 3012323 3025756 3040058 3055732 3073115 3092283 3112875 3134331 3156303 3178539 3200367
62086 3200367 3220677 3238574 3253903 3267197 3279475 3292037 3305964 3321534 3338217 3355183 3371523
$$ packed form
62167A787278L3689L7654M1984M5743M7923M8493M7865M5857M2070L7015L1857
62156B247428K7131K2556J8042J3913J0144O376K913O10n69j843l942o005o852
62143B329902o542n848m874l164q15J544L675N861Q109J0012J1440J2688J3885
62130B375873J4801J5358J5813J6326J6810J7338J8193J9308K0154K0445K0663
62119B571082K1453K2723K3733K4013K3851K3766K3810K3603K2910K1873K0696
62108B823513J9431J8235J7462J7203J6920J6051J4832J4036J3910J3906J3583
62097B999082J3241J3433J4302J5674J7383J9168K0592K1456K1972K2236K1828
62086C200367K0310J7897J5329J3294J2278J2562J3927J5570J6683J6966J6340
$$ plain form
62075 3371523 3386115 3397903 3406574 3412742 3417456 3421934 3427671 3435975 3446909 3459115 3471097 3482352
62063 3482352 3492965 3502633 3510536 3515765 3517288 3513828 3504479 3489336 3469069 3444032 3414369 3380795
62051 3380795 3344481 3306028 3265146 3221580 3175810 3128593 3080271 3030893 2980670 2929913 2878773
62040 2878773 2827505 2776966 2728465 2682933 2640329 2599986 2561445 2524852 2490531 2458356 2427761
62029 2427761 2398323 2370036 2342886 2316451 2290166 2263819 2237493 2211229 2185081 2159316 2134101
62018 2134101 2109037 2083500 2057563 2032132 2008062 1985544 1964540 1945291 1928033 1912518 1898288
62007 1898288 1885262 1873695 1863710 1855268 1848529 1843840 1841301 1840541 1840931 1841727 1841974 1840517 1836212 1828025
61993 1828025 1814998 1796453 1772385 1743491 1710702 1674834 1636794 1597871 1559536 1522934 1488605
$$ packed form
62075C371523J4592J1788Q671O168M714M478N737Q304J0934J2206J1982J1255
62063C482352J0613R668P903N229J523l460r349j5143k0267k5037k9663l3574
62051C380795l6314l8453m0882m3566m5770m7217m8322m9378n0223n0757n1140
62040B878773n1268n0539m8501m5532m2604m0343l8541l6593l4321l2175l0595
62029B427761k9438k8287k7150k6435k6285k6347k6326k6264k6148k5765k5215
62018B134101k5064k5537k5937k5431k4070k2518k1004j9249j7258j5515j4230
62007A898288j3026j1567r985q442o739m689k539p60L90P96K47j457m305q187
61993A828025j3027j8545k4068k8894l2789l5868l8040l8923l8335l6602l4329
$$ plain form
61982 1488605 1456550 1426358 1397499 1369894 1344312 1321865 1302889 1286447 1271123 1256176 1241751
61971 1241751 1228215 1215745 1204556 1195083 1187671 1182299 1178770 1176859 1176071 1175616 1175097 1175071 1176434 1179333
61957 1179333 1183188 1187847 1194077 1202658 1213408 1225576 1238936 1254148 1272183 1293701 1318844 1347324
61945 1347324 1378755 1413105 1450687 1491578 1535319 1581533 1630594 1683173 1739211 1797866 1858457
61934 1858457 1920966 1985509 2051870 2119838 2189550 2261117 2334179 2408217 2483189 2559620 2638355
61923 2638355 2720683 2808711 2905237 3013103 3134764 3272486 3428768 3606545 3809125 4040019
61913 4040019 4302762 4600785 4937341 5315472 5738073 6208150 6728971 7303724 7934610
61904 7934610 8621899 9363024 10151308 10974091 11810951 12632955 13403430 14080445 14620979
$$ packed form
61982A488605l2055l0192k8859k7605k5582k2447j8976j6442j5324j4947j4425
61971A241751j3536j2470j1189r473p412n372l529j911p88m55n19k6J363K899
61957A179333L855M659O230Q581J0750J2168J3360J5212J8035K1518K5143K8480
61945A347324L1431L4350L7582M0891M3741M6214M9061N2579N6038N8655O0591
61934A858457O2509O4543O6361O7968O9712P1567P3062P4038P4972P6431P8735
61923B638355Q2328Q8028R6526J07866J21661J37722J56282J77777K02580K30894
61913D040019K62743K98023L36556L78131M22601M70077N20821N74753O30886
61904G934610O87289P41125P88284Q22783Q36860Q22004P70475O77015N40534
$$ plain form
61895 14620979 14986293 15147461 15089987 14816547 14346808 13713794 12958116 12122611 11248611
61886 11248611 10372846 9524237 8721971 7976509 7292659 6672114 6114234 5616066 5172788
61877 5172788 4778628 4427874 4115687 3838304 3592483 3374892 3182212 3011606 2860634
61868 2860634 2726876 2608120 2502976 2410781 2330727 2261474 2201767 2151034 2109170 2076077 2051647
61857 2051647 2035832 2028371 2028637 2036035 2050360 2071463 2098600 2130417 2165578 2203187 2242488 2282207
61845 2282207 2320329 2354711 2383983 2407735 2425763 2437467 2442327 2440861 2434666 2425591 2415224 2405163
61833 2405163 2397197 2392950 2393594 2399884 2411913 2428612 2447916 2467784 2486806 2503705 2516795 2524458
61821 2524458 2525943 2521367 2511166 2495890 2476334 2453500 2428585 2403326 2380082 2361075 2347478 2339498
$$ packed form
61895A4620979L65314J61168n7474k73440m69739o33014p55678q35505q74000
61886A1248611q75765q48609q02266p45462o83850o20545n57880m98168m43278
61877E172788l94160l50754l12187k77383k45821k17591j92680j70606j50972
61868B860634j33758j18756j05144r2195q0054o9253n9707n0733m1864l3093k4430
61857B051647j5815p461K66P398J4325K1103K7137L1817L5161L7609L9301L9719
61845B282207L8122L4382K9272K3752J8028J1704M860j466o195r075j0367j0061
61833B405163p966m247O44O290J2029J6699J9304J9868J9022J6899J3090P663
61821B524458J485m576j0201j5276j9556k2834k4915k5259k3244j9007j3597p980
$$ plain form
61809 2339498 2337256 2341290 2352304 2370795 2396946 2430705 2471983 2520991 2578382 2644905 2720947 2806574
61797 2806574 2901929 3007489 3123993 3252323 3393468 3548745 3720261 3911119 4124757 4364032
61787 4364032 4631365 4929919 5264183 5639203 6059811 6530979 7058363 7647953 8305699
61778 8305699 9038195 9853435 10759939 11764935 12873263 14086716 15401948 16806909 18277792
61769 18277792 19777419 21254412 22643697 23870517 24858615 25540130 25864393 25804669 25362495
61760 25362495 24568202 23476498 22158207 20690590 19148284 17596160 16085205 14651784
61752 14651784 13319148 12099624 10996795 10007816 9125804 8341823 7646114 7028713 6479953
61743 6479953 5991168 5555264 5166450 4819261 4508066 4227818 3974999 3747322 3542603
$$ packed form
61809B339498k242M034J1014J8491K6151L3759M1278M9008N7391O6523P6042Q5627
61797B806574R5355J05560J16504J28330J41145J55277J71516J90858K13638K39275
61787D364032K67333K98554L34264L75020M20608M71168N27384N89590O57746
61778H305699P32496Q15240R06504J004996J108328J213453J315232J404961J470883
61769A8277792J499627J476993J389285J226820R88098O81515L24263n9724m42174
61760B5362495p94293j091704j318291j467617j542306j552124j510955j433421
61752A4651784j332636j219524j102829r88979q82012p83981o95709o17401n48760
61743F479953m88785m35904l88814l47189l11195k80248k52819k27677k04719
$$ plain form
61734 3542603 3358349 3192343 3042946 2908676 2787961 2679546 2582606 2496101 2418341 2347616
61724 2347616 2282985 2224006 2169810 2118792 2069255 2020101 1970928 1921725 1872649 1824050 1776515
61713 1776515 1730689 1686939 1645302 1605814 1568704 1534036 1501403 1470334 1440882 1413306 1387208
61702 1387208 1361539 1335681 1310122 1285767 1262904 1241087 1219773 1198753 1178173 1158479 1140246
61691 1140246 1123794 1108903 1094977 1081419 1067891 1054453 1041539 1029603 1018624 1008180 998049
61680 998049 988483 979678 971324 963034 955007 947852 941793 936382 931059 925681 920412 915317 910270 905208
61666 905208 900276 895661 891350 887075 882478 877293 871449 865167 858908 853030 847429 841759 836148 831413
61652 831413 828278 826555 825435 824470 823924 824233 825546 827755 830502 833003 834318 834099 832875 831385 829808
$$ packed form
61734C542603j84254j66006j49397j34270j20715j08415r6940q6505p7760p0725
61724B347616o4631n8979n4196n1018m9537m9154m9173m9203m9076m8599m7535
61713A776515m5826m3750m1637l9488l7110l4668l2633l1069k9452k7576k6098
61702A387208k5669k5858k5559k4355k2863k1817k1314k1020k0580j9694j8233
61691A140246j6452j4891j3926j3558j3528j3438j2914j1936j0979j0444j0131
61680I98049r566q805q354q290q027p155o059n411n323n378n269n095n047n062
61666I05208m932m615m311m275m597n185n844o282o259n878n601n670n611m735
61652H31413l135j723j120r65n46L09J313K209K747K501J315k19j224j490j577
$$ plain form
61637 829808 827825 825232 822224 819208 816631 815084 815290 817719 822091 827488 833252 839727 847658 856811
61623 856811 865584 872272 876251 877611 876118 871237 862860 851384 837290 821349 804987 789528 775056
61610 775056 760884 747168 735067 725080 716305 707894 700353 694598 690443 686872 683374 680173 677356
61597 677356 674570 671563 668439 665448 662950 661455 661243 662017 663331 665193 667883 671493 676212 682823 692129
61582 692129 703769 716292 728671 741388 755751 772492 791328 811671 833432 857096 883166
61571 883166 911669 942209 974438 1008257 1043501 1079651 1116086 1152560 1189217 1226149 1263087
61560 1263087 1299516 1334998 1369269 1402040 1432777 1460930 1486530 1510353 1533160 1554822 1574522
61549 1574522 1591747 1606654 1619510 1630211 1638432 1643785 1645758 1644011 1638863 1630946 1620263 1606291
$$ packed form
61637H29808j983k593l008l016k577j547K06K429M372N397N764O475P931R153
61623H56811Q773O688L979J360j493m881q377j1476j4094j5941j6362j5459j4472
61610G75056j4172j3716j2101r987q775q411p541n755m155l571l498l201k817
61597F77356k786l007l124k991k498j495k12P74J314J862K690L610M719O611R306
61582F92129J1640J2523J2379J2717J4363J6741J8836K0343K1761K3664K6070
61571H83166K8503L0540L2229L3819L5244L6150L6435L6474L6657L6932L6938
61560A263087L6429L5482L4271L2771L0737K8153K5600K3823K2807K1662J9700
61549A574522J7225J4907J2856J0701Q221N353J973j747n148p917j0683j3972
$$ plain form
61537 1606291 1589279 1570709 1551977 1533298 1514580 1496728 1481173 1468450 1458188 1450412 1445999 1445755
61525 1445755 1449783 1458008 1470754 1488507 1511504 1539868 1574012 1614676 1662594 1718102 1781146 1851879
61513 1851879 1931329 2021221 2122992 2237394 2365214 2507839 2666639 2842287 3035317 3246938
61503 3246938 3478361 3729288 3997563 4280081 4573032 4870825 5165185 5445622 5700674
61494 5700674 5919078 6090927 6208819 6268522 6269094 6212967 6106016 5956859 5775316 5570973
61484 5570973 5352567 5127911 4903887 4686353 4479935 4287722 4111269 3951172 3807827
61475 3807827 3681716 3573240 3482430 3408742 3351051 3308141 3279353 3264402 3262422 3271720 3290830
61464 3290830 3319287 3356810 3402125 3453290 3508852 3567938 3629362 3691452 3752758 3812366 3869537
$$ packed form
61537A606291j7012j8570j8732j8679j8718j7852j5555j2723j0262p776m413k44
61525A445755M028Q225J2746J7753K2997K8364L4144M0664M7918N5508O3044P0733
61513A851879P9450Q9892J01771J14402J27820J42625J58800J75648J93030K11621
61503C246938K31423K50927K68275K82518K92951K97793K94360K80437K55052
61494E700674K18404J71849J17892N9703N72n6127j06951j49157j81543k04343
61484E570973k18406k24656k24024k17534k06418j92213j76453j60097j43345
61475C807827j26111j08476r0810p3688n7691m2910k8788j4951j980R298J9110
61464C290830K8457L7523M5315N1165N5562N9086O1424O2090O1306N9608N7171
$$ plain form
61453 3869537 3923743 3975087 4024109 4071242 4117080 4163142 4211502 4263484 4319290 4378902 4442479
61442 4442479 4509554 4578655 4648147 4716868 4783541 4846220 4902864 4952076 4992839 5023992 5044511
61431 5044511 5054007 5052460 5039731 5015870 4981771 4939084 4889514 4834464 4775276 4713527 4651080 4590019
61419 4590019 4532341 4479459 4431966 4390038 4354013 4324557 4302344 4287528 4279371 4276393 4277137 4280757
61407 4280757 4286593 4293295 4298857 4301682 4301278 4297760 4291102 4281142 4268055 4252568 4236004 4220404 4208370
61394 4208370 4202513 4205066 4218085 4243748 4284244 4341498 4417127 4512451 4628479 4766125 4926634
61383 4926634 5111464 5321507 5556493 5815237 6096050 6396395 6712000 7036435 7361492
61374 7361492 7677833 7975255 8242719 8468855 8643488 8759662 8814746 8809902 8748788 8636698
$$ packed form
61453C869537N4206N1344M9022M7133M5838M6062M8360N1982N5806N9612O3577
61442D442479O7075O9101O9492O8721O6673O2679N6644M9212M0763L1153K0519
61431E044511R496j547j2729k3861l4099m2687m9570n5050n9188o1749o2447o1061
61419D590019n7678n2882m7493m1928l6025k9456k2213j4816q157k978P44L620
61407D280757N836O702N562K825m04l518o658r960j3087j5487j6564j5600j2034
61394D208370n857K553J3019K5663M0496N7254P5629R5324J16028J37646J60509
61383D926634J84830K10043K34986K58744K80813L00345L15605L24435L25057
61374G361492L16341K97422K67464K26136J74633J16174N5084m844o1114j12090
$$ plain form
61364 8636698 8480128 8286083 8061272 7811906 7543864 7262554 6972666 6678535 6384615
61355 6384615 6095097 5813154 5541193 5281759 5037356 4809218 4597092 4400688 4220668
61346 4220668 4057690 3911173 3779797 3662950 3560924 3473797 3400674 3340163 3291261 3253724
61336 3253724 3227845 3213877 3211428 3219372 3236352 3261272 3293336 3331902 3376409 3426067 3479302 3533749
61324 3533749 3587173 3638402 3687299 3734026 3778506 3820379 3859211 3894800 3927402 3957474 3985144
61313 3985144 4010141 4032380 4052269 4070139 4085565 4097396 4104193 4104486 4097121 4081959 4060173 4033364
61301 4033364 4002244 3966421 3925383 3879322 3828931 3774747 3716977 3655846 3591917 3526090 3459508
61290 3459508 3393525 3329637 3269195 3213106 3161956 3116505 3077800 3046563 3022526 3004621 2991787
$$ packed form
61364H636698j56570j94045k24811k49366k68042k81310k89888k94131k93920
61355F384615k89518k81943k71961k59434k44403k28138k12126j96404j80020
61346D220668j62978j46517j31376j16847j02026q7127p3123o0511m8902l7537
61336C253724k5879j3968k449P944J6980K4920L2064L8566M4507M9658N3235N4447
61324C533749N3424N1229M8897M6727M4480M1873L8832L5589L2602L0072K7670
61313C985144K4997K2239J9889J7870J5426J1831O797K93p365j5162k1786k6809
61301D033364l1120l5823m1038m6061n0391n4184n7770o1131o3929o5827o6582
61290C459508o5983o3888o0442n6089n1150m5451l8705l1237k4037j7905j2834
$$ plain form
61279 2991787 2983425 2979096 2977990 2978785 2979996 2980612 2980430 2979651 2978192 2975821 2973110 2971577 2972332 2974942 2978289
61264 2978289 2982160 2987214 2993589 3000565 3007837 3016438 3028261 3045414 3070272 3105340 3152481 3212512
61252 3212512 3285734 3372352 3472248 3584846 3709427 3844924 3988876 4136808 4282700 4419530
61242 4419530 4539312 4633623 4695129 4718775 4701695 4642943 4544121 4409926 4247376 4064367
61232 4064367 3868883 3668578 3469913 3277348 3093621 2920798 2760789 2615019 2483967
61223 2483967 2367119 2263274 2171039 2089245 2016907 1952947 1896200 1845662 1800488 1759899 1723552
61212 1723552 1691893 1665574 1644479 1627841 1615265 1606977 1603099 1603461 1608211 1617678 1631306 1647536
61200 1647536 1665017 1683008 1700247 1714518 1724145 1729153 1730281 1727686 1721482 1712736 1702822 1692171 1680459
$$ packed form
61279B991787q362m329j106P95J211O16j82p79j459k371k711j533P55K610L347
61264B978289L871N054O375O976P272Q601J1823J7153K4858L5068M7141O0031
61252C212512P3222Q6618R9896J12598J24581J35497J43952J47932J45892J36830
61242D419530J19782R4311O1506K3646j7080n8752r8822j34195j62550j83009
61232D064367j95484k00305j98665j92565j83727j72823j60009j45770j31052
61223B483967j16848j03845r2235q1794p2338o3960n6747n0538m5174m0589l6347
61212A723552l1659k6319k1095j6638j2576q288l878L62M750R467J3628J6230
61200A647536J7481J7991J7239J4271R627N008J128k595o204q746r914j0651j1712
$$ plain form
61187 1680459 1667562 1653476 1637726 1619857 1600172 1579201 1556836 1532941 1508424 1484626 1461797
61176 1461797 1439162 1416345 1393695 1371277 1348630 1325743 1303393 1282250 1262375 1243669 1226063
61165 1226063 1209034 1191709 1173814 1156038 1139222 1123680 1109495 1096965 1086431 1077868 1070738 1063929
61153 1063929 1055878 1045122 1030873 1013055 992167 969439 946641 925067 904840 885758 868423
61142 868423 853808 841997 832269 824336 818511 814576 811454 808364 805544 803500 802152 801122 800363 800054
61128 800054 800214 800661 801117 801317 801309 801621 802684 804141 805234 805860 806688 808290 810760 814158 818544 823378 827620
61111 827620 830744 832980 834321 833966 831138 825793 818031 807364 793320 776493 758429 740560 723543
61098 723543 707444 692143 677660 664356 652761 643000 634524 626549 618654 610886 603553 597057 591585
$$ packed form
61187A680459j2897j4086j5750j7869j9685k0971k2365k3895k4517k3798k2829
61176A461797k2635k2817k2650k2418k2647k2887k2350k1143j9875j8706j7606
61165A226063j7029j7325j7895j7776j6816j5542j4185j2530j0534q563p130o809
61153A063929q051j0756j4249j7818k0888k2728k2798k1574k0227j9082j7335
61142H68423j4615j1811r728p933n825l935l122l090k820k044j348j030p59l09
61128H00054J60M47M56K00qL12J063J457J093O26Q28J602K470L398M386M834M242
61111H27620L124K236J341l55k828n345p762j0667j4044j6827j8064j7869j7017
61098G23543j6099j5301j4483j3304j1595r761q476p975p895p768p333o496n472
$$ plain form
61085 591585 586696 581454 575348 569014 563714 560036 557351 554642 551753 549587 549106 550297 552340 554614
61071 554614 557272 560806 565387 570725 576280 581479 586080 590462 595176 600074 604343 607672 610762 614312
61057 614312 618065 621410 624433 627612 630888 633833 636548 639637 643427 647925 653344 659904 667158 674302
61043 674302 681212 688472 696364 704525 712645 720785 728829 736336 743188 749884 757013 764847 773458 782665
61029 782665 791761 799853 806667 812678 818464 824362 830667 837526 844605 851380 857853 864572 872012 880389
61015 880389 889936 900767 912663 925659 940711 958985 980527 1004376 1030033 1058069 1089317 1124281
61003 1124281 1163506 1207741 1257488 1312786 1373329 1438302 1506456 1577263 1651922 1732483 1820332
60992 1820332 1916543 2023373 2144022 2280947 2435621 2609868 2806073 3026153 3271994 3547310
$$ packed form
61085E91585m889n242o106o334n300l678k685k709k889k166m81J191K043K274
61071E54614K658L534M581N338N555N199M601M382M714M898M269L329L090L550
61057F14312L753L345L023L179L276K945K715L089L790M498N419O560P254P144
61043F74302O910P260P892Q161Q120Q140Q044P507O852O696P129P834Q611R207
61029G82665R096Q092O814O011N786N898O305O859P079O775O473O719P440Q377
61015H80389R547J0831J1896J2996J5052J8274K1542K3849K5657K8036L1248L4964
61003A124281L9225M4235M9747N5298O0543O4973O8154P0807P4659Q0561Q7849
60992A820332R6211J06830J20649J36925J54674J74247J96205K20080K45841K75316
$$ plain form
60982 3547310 3858017 4211315 4616657 5088100 5643984 6304626 7093407 8040937 9185412
60973 9185412 10568478 12233975 14226533 16570804 19224870 22040269 24774443 27160006
60965 27160006 28984343 30135370 30615890 30550623 30178207 29791591 29623415 29739078 30013352
60956 30013352 30200849 30039435 29325569 27953752 25940452 23429831 20657860 17877226
60948 17877226 15285239 12994373 11044039 9425498 8102262 7026496 6152408 5441898
60940 5441898 4862801 4386992 3991683 3659958 3378391 3135294 2921512 2730827 2558441
60931 2558441 2400210 2253950 2119859 1998571 1889569 1791987 1705610 1630042 1563627 1503963
60921 1503963 1448937 1396846 1346371 1297104 1249539 1204020 1160338 1118718 1080375 1046367 1016430
$$ packed form
60982C547310L10707L53298M05342M71443N55884O60642P88781R47530J144475
60973I185412J383066J665497J992558K344271K654066K815399K734174K385563
60965B7160006J824337J151027M80520o5267l72416l86616j68176J15663K74274
60956C0013352J87497j61414p13866j371817k013300k510621k771971k780634
60948A7877226k591987k290866j950334j618541j323236j075766q74088p10510
60940E441898n79097m75809l95309l31725k81567k43097k13782j90685j72386
60931B558441j58231j46260j34091j21288j09002r7582q6377p5568o6415n9664
60921A503963n5026n2091n0475m9267m7565m5519m3682m1620l8343l4008k9937
$$ plain form
60910 1016430 989498 964923 942579 922219 903306 885286 867646 849997 832439 815562 799774
60899 799774 784979 771084 758368 746963 736401 726121 716134 706822 698335 690636 683897 678402 674097
60886 674097 670583 667582 665184 663573 662651 662015 661376 660908 661016 661696 662420 662913 663749 665758 668985 672688
60870 672688 676293 679929 684018 688817 694366 700503 706874 713277 720065 727830 736684 746172 755801 765250
60856 765250 774190 782470 790523 798996 807788 816022 823113 829395 835459 841421 847226 853199 859780 866842
60842 866842 873653 879472 883998 887244 889107 889014 886107 879984 871221 860904 849704 837737 825300 813245
60828 813245 802392 792920 784561 777093 770372 764078 757853 751714 746161 741722 738428 735888 733979 733332
60814 733332 734754 738087 742123 745924 749907 755191 762161 770209 778666 787337 796159 804910 813474 822006
$$ packed form
60910A016430k6932k4575k2344k0360j8913j8020j7640j7649j7558j6877j5788
60899G99774j4795j3895j2716j1405j0562j0280r987r312q487p699o739n495m305
60886F74097l514l001k398j611r22o36o39m68J08O80P24M93Q36K009L227L703
60870F72688L605L636M089M799N549O137O371O403O788P765Q854R488R629R449
60856G65250Q940Q280Q053Q473Q792Q234P091O282O064N962N805N973O581P062
60842H66842O811N819M526L246J863r3k907o123q763j0317j1200j1967j2437j2055
60828H13245j0853r472q359p468o721o294o225o139n553m439l294k540j909o47
60814G33332J422L333M036L801L983N284O970Q048Q457Q671Q822Q751Q564Q532
$$ plain form
60800 822006 830676 839463 848176 856418 863641 869571 874471 878570 881504 882882 883260 883782 884789 885542 885458
60785 885458 884850 884102 882900 880897 878606 876946 876239 876240 876861 878204 879992 881631 882940 884310 885924 887291
60769 887291 887788 887367 886395 885023 883124 880771 878320 875875 873051 869549 865711 862146 858983 855912 852833
60754 852833 849969 847452 845345 844059 843967 844460 844238 843018 842191 843097 845246 847030 847596 847011 844953 840527
60738 840527 833592 825321 817057 809226 801589 794019 786717 780135 774848 771147 768614 766466 764414 762778
60724 762778 761821 761444 761561 762172 762937 763221 762753 761694 759870 756557 751375 744925 738082 730926 722767 713078
60708 713078 702045 690323 678460 666579 654547 642435 630695 619797 609902 601056 593435 586989
60696 586989 581145 575348 569759 564945 561082 558051 556133 555742 556449 557061 556919 556500 556499 556964 557587 558278 559105
$$ packed form
60800H22006Q670Q787Q713Q242P223N930M900M099K934J378L78N22J007P53q4
60785H85458o08p48j202k003k291j660p07JO21J343J788J639J309J370J614J367
60769H87291M97m21r72j372j899k353k451k445k824l502l838l565l163l071l079
60754H52833k864k517k107j286r2M93k22j220q27R06K149J784N66n85k058m426
60738H40527o935q271q264p831p637p570p302o582n287l701k533k148k052j636
60724G62778r57l77J17O11P65K84m68j059j824l313n182o450o843p156q159r689
60708G13078j1033j1722j1863j1881j2032j2112j1740j0898r895q846p621o446
60696E86989n844n797n589m814l863l031j918l91P07O12j42m19jM65O23O91Q27
$$ plain form
60679 559105 560165 561828 564692 569020 574624 581442 589745 599512 610183 621341 633151 645751 658694
60666 658694 671471 684229 697500 711444 725657 739569 752839 765626 778593 792276 806297
60655 806297 819615 831748 843234 854675 865908 876515 886575 896254 905028 911942 916536 919015
60643 919015 919620 918263 914667 908483 899331 887152 872580 856747 840657 824789 809124 793396 777447
60630 777447 761533 746182 731715 718128 705527 694341 684811 676474 668495 660531 653064 646818 641888
60617 641888 637509 632894 628299 624935 623570 623624 624150 625300 628054 632663 638332 644633 652339 662433 674997
60602 674997 689479 705453 722537 740118 757756 775519 793376 810533 825855 838747 849242
60591 849242 857470 863448 867224 868866 868415 866047 862069 856566 849357 840481 830400 819458 807541 794512
$$ packed form
60679E59105J060J663K864M328N604O818Q303R767J0671J1158J1810J2600J2943
60666F58694J2777J2758J3271J3944J4213J3912J3270J2787J2967J3683J4021
60655H06297J3318J2133J1486J1441J1233J0607J0060R679Q774O914M594K479
60643I19015O05j357l596o184r152j2179j4572j5833j6090j5868j5665j5728j5949
60630G77447j5914j5351j4467j3587j2601j1186r530q337p979p964p467o246m930
60617F41888m379m615m595l364j365N4N26J150K754M609N669O301P706J0094J2564
60602F74997J4482J5974J7084J7581J7638J7763J7857J7157J5322J2892J0495
60591H49242Q228N978L776J642m51k368l978n503p209q876j0081j0942j1917j3029
$$ plain form
60577 794512 780592 766008 750661 734536 718077 701857 686222 671628 658781 647895 638136 628409
60565 628409 618525 609107 600622 593090 586637 581655 578273 576097 574576 573355 572209 570916 569380 567892
60551 567892 567236 568314 571372 575553 579587 583018 586433 590516 595420 601196 608197 616594 625976 635885
60537 635885 646451 658232 671920 688579 709596 735740 766591 801423 840257 883330 929716
60526 929716 977038 1022377 1062913 1095997 1119466 1132183 1134096 1125986 1109539 1087319 1062003 1035549
60514 1035549 1009426 985243 964462 947588 934218 923798 915722 908940 902421 896257 891589 889181
60502 889181 888666 889506 892042 897150 905295 916472 930819 948736 970532 996385 1026685 1062053 1102920
60489 1102920 1149262 1200725 1256676 1315974 1376973 1438138 1498757 1558993 1619571 1681944 1748833
$$ packed form
60577G94512j3920j4584j5347j6125j6459j6220j5635j4594j2847j0886r759r727
60565F28409r884r418q485p532o453m982l382k176j521j221j146j293j536j488
60551E67892o56J078L058M181M034L431L415M083M904N776P001Q397R382R909
60537F35885J0566J1781J3688J6659K1017K6144L0851L4832L8834M3073M6386
60526I29716M7322M5339M0536L3084K3469J2717J913q110j6447k2220k5316k6454
60514A035549k6123k4183k0781j6874j3370j0420q076o782o519o164m668k408
60502H89181n15Q40K536N108Q145J1177J4347J7917K1796K5853L0300L5368M0867
60489A102920M6342N1463N5951N9298O0999O1165O0619O0236O0578O2373O6889
$$ plain form
60478 1748833 1824039 1911358 2014125 2136265 2283086 2459842 2669132 2909991 3178936 3470184
60468 3470184 3773802 4074215 4351534 4584808 4754866 4846419 4850247 4765045 4597525 4360866
60458 4360866 4072692 3752969 3421382 3094692 2785350 2501613 2248119 2026238 1834535
60449 1834535 1669844 1528630 1407881 1305165 1218108 1144105 1080662 1025851 978247 936596
60439 936596 899878 867528 839186 814217 791827 771546 753159 736357 720983 707411 695893
60428 695893 685608 675269 664763 655192 647071 639525 631718 624016 617108 610947 605420 601197 598889
60415 598889 597896 597061 596061 595285 594773 594214 593714 593674 594058 594560 595372 596957 599179 601365 603237 605186 607714
60398 607714 611030 615075 619444 623540 627308 631575 637131 643697 650213 655823 660144 663084 664954 666327
$$ packed form
60478A748833P5206Q7319J02767J22140J46821J76756K09290K40859K68945K91248
60468C470184L03618L00413K77319K33274J70058R1553L828q5202j67520k36659
60458D360866k88174l19723l31587l26690l09342k83737k53494k21881j91703
60449A834535j64691j41214j20749j02716q7057p4003o3443n4811m7604m1651
60439I36596l6718l2350k8342k4969k2390k0281j8387j6802j5374j3572j1518
60428F95893j0285j0339j0506r571q121p546p807p702o908o161n527m223k308
60415E98889r93q35j000p76n12n59n00m0L84N02Q12J585K222K186J872J949K528
60398F07714L316M045M369M096L768M267N556O566O516N610M321K940J870J373
$$ plain form
60384 666327 667221 666911 665152 662899 661085 659387 657181 654964 653624 652798 651356 649223 647399 646311 645520
60369 645520 645006 645335 646452 647609 648749 650665 653482 656247 658503 661057 664614 668714 672697 676723 681124
60354 681124 685557 689576 693472 697825 702689 707728 712719 717506 721913 726096 730500 735167 739587 743522
60340 743522 747345 751213 754565 756901 758451 759605 760217 760059 759440 758851 758353 757858 757671 758206 759435 761106
60324 761106 763303 766302 769965 773629 776575 778441 779227 779074 777978 775841 772927 770026 767763 765900 763902
60309 763902 762005 761017 760997 760948 760044 758521 757067 755974 755251 754976 755130 755506 756105 757263 759209 761962 765774
60292 765774 771108 777864 785159 792134 798509 804215 809161 813545 817747 821545 824184 825592 826809 828747
60278 828747 831236 833831 836788 840504 844646 848712 853033 858330 864574 871123 877882 885556 894737 905405
$$ packed form
60384F66327Q94l10j759k253j814j698k206k217j340q26j442k133j824j088p91
60369F45520n14L29J117J157J140J916K817K765K256K554L557M100L983M026M401
60354F81124M433M019L896M353M864N039M991M787M407M183M404M667M420L935
60340G43522L823L868L352K336J550J154O12j58o19n89m98m95j87N35J229J671
60324G61106K197K999L663L664K946J866P86j53j096k137k914k901k263j863j998
60309G63902j897r88k0m9r04j523j454j093p23k75J54L76N99J158J946K753L812
60292G65774N334O756P295O975O375N706M946M384M202L798K639J408J217J938
60278H28747K489K595K957L716M142M066M321N297O244O549O759P674R181J0668
$$ plain form
60264 905405 917366 930666 945462 961927 980321 1000838 1023362 1047679 1073936 1102699 1134586
60253 1134586 1170001 1209152 1252157 1299266 1351072 1408337 1471534 1540863 1616780 1700171 1791721
60242 1791721 1891430 1998955 2114092 2236641 2366039 2501331 2641173 2783616 2926253 3066834
60232 3066834 3203373 3333457 3453983 3562113 3656231 3735528 3799004 3845449 3874239 3885676
60222 3885676 3880621 3860205 3825877 3779408 3722967 3659522 3593003 3527581 3466503 3411663 3364230
60211 3364230 3325537 3297524 3282513 3282474 3298370 3330260 3378044 3441908 3521947 3617626 3727861 3851425
60199 3851425 3986992 4132797 4286272 4443935 4601548 4754571 4898610 5029558 5143652
60190 5143652 5237765 5309702 5357979 5381466 5379564 5352596 5301623 5228085 5134172 5023477 4900638
$$ packed form
60264I05405J1961J3300J4796J6465J8394K0517K2524K4317K6257K8763L1887
60253A134586L5415L9151M3005M7109N1806N7265O3197O9329P5917Q3391R1550
60242A791721R9709J07525J15137J22549J29398J35292J39842J42443J42637J40581
60232C066834J36539J30084J20526J08130R4118P9297O3476M6445K8790J1437
60222C885676n055k0416l4328m6469n6441o3445o6519o5422o1078n4840m7433
60211C364230l8693k8013j5011l9J5896L1890M7784O3864Q0039R5679J10235J23564
60199C851425J35567J45805J53475J57663J57613J53023J44039J30948J14094
60190E143652R4113P1937M8277K3487j902k6968n0973p3538r3913j10695j22839
$$ plain form
60179 4900638 4770249 4636608 4504292 4378052 4261781 4158214 4069714 3998545 3946119 3912825
60169 3912825 3899116 3906046 3934217 3982764 4049884 4133664 4231736 4340591 4455931 4573411 4688581
60158 4688581 4796641 4893077 4974432 5038159 5082230 5105632 5109040 5094421 5064157 5021073 4969056
60147 4969056 4912894 4857360 4806635 4764378 4733784 4717537 4717996 4737350 4777372 4839245 4923934 5032638
60135 5032638 5166772 5327804 5517361 5737201 5988686 6272430 6588493 6936486 7315120
60126 7315120 7721916 8153508 8605768 9073264 9548950 10024794 10492503 10943506 11368850
60117 11368850 11759734 12108125 12406806 12649342 12830394 12945873 12992761 12969391 12876174 12715457
60107 12715457 12490516 12205550 11867250 11485632 11072526 10639624 10198368 9760660 9338214
$$ packed form
60179D900638j30389j33641j32316j26240j16271j03567q8500p1169n2426l3294
60169C912825j3709O930K8171M8547O7120Q3780R8072J08855J15340J17480J15170
60158D688581J08060R6436Q1355O3727M4071K3402L408j4619l0264m3084n2017
60147D969056n6162n5534n0725m2257l0594j6247M59J9354M0022O1873Q4689J08704
60135E032638J34134J61032J89557K19840K51485K83744L16063L47993L78634
60126G315120M06796M31592M52260M67496M75686M75844M67709M51003M25344
60117A1368850L90884L48391K98681K42536J81052J15479M6888k3370r3217j60717
60107A2715457k24941k84966l38300l81618m13106m32902m41256m37708m22446
$$ plain form
60098 9338214 8940996 8576674 8251019 7967963 7729451 7536110 7388131 7285108 7225349 7206130
60088 7206130 7224566 7277720 7361911 7472324 7603119 7747466 7897760 8046394 8186361 8311000
60078 8311000 8413848 8489581 8535011 8548705 8530009 8479020 8397155 8286951 8151330 7993402
60068 7993402 7816592 7624223 7419175 7204483 6983989 6761759 6541134 6325027 6116920
60059 6116920 5920772 5739981 5576980 5433635 5311318 5210649 5131867 5075522 5042442 5033168
60049 5033168 5047804 5086158 5147518 5230591 5334134 5457211 5598145 5753465 5918463 6088326
60039 6088326 6258013 6421596 6572789 6706030 6816444 6899400 6951395 6971209 6959054 6914722
60029 6914722 6837769 6729501 6593536 6434268 6256001 6063752 5863559 5661235 5461624 5269436
$$ packed form
60098I338214l97218l64322l25655k83056k38512j93341j47979j03023n9759j9219
60088G206130J8436N3154Q4191J10413J30795J44347J50294J48634J39967J24639
60078H311000J02848P5733M5430J3694j8696n0989q1865j10204j35621j57928
60068G993402j76810j92369k05048k14692k20494k22230k20625k16107k08107
60059F116920j96148j80791j63001j43345j22317j00669p8782n6345l3080r274
60049E033168J4636L8354O1360Q3073J03543J23077J40934J55320J64998J69863
60039F088326J69687J63583J51193J33241J10414Q2956N1995J9814j2155m4332
60029F914722p6953j08268j35965j59268j78267j92249k00193k02324j99611j92188
$$ plain form
60019 5269436 5089710 4926641 4782571 4658774 4556587 4477189 4420848 4387230 4376371 4388894
60009 4388894 4425406 4486003 4570272 4677666 4807957 4961317 5137604 5335511 5552495 5785086
59999 5785086 6028619 6276811 6522384 6758219 6977507 7173164 7338337 7468015 7559644 7612103
59989 7612103 7624833 7598185 7533765 7433890 7301309 7139877 6955014 6753123 6541003 6325989
59979 6325989 6115745 5916991 5734517 5571715 5431631 5316974 5229382 5169228 5136097 5129052
59969 5129052 5146584 5186785 5247783 5327926 5425463 5538138 5663157 5797631 5939004 6084826
59959 6084826 6232077 6377028 6515985 6645810 6763579 6866328 6951822 7019379 7069491 7103026
59949 7103026 7121363 7126987 7123210 7113583 7102281 7094741 7096866 7113680 7149472 7209103 7298075 7421233
$$ packed form
60019E269436j79726j63069j44070j23797j02187p9398n6341l3618j0859J2523
60009D388894L6512O0597Q4269J07394J30291J53360J76287J97907K16984K32591
59999E785086K43533K48192K45573K35835K19288J95657J65173J29678R1629N2459
59989G612103J2730k6648o4420r9875j32581j61432j84863k01891k12120k15014
59979F325989k10244j98754j82474j62802j40084j14657q7592o0154l3131p045
59969E129052J7532M0201O0998Q0143R7537J12675J25019J34474J41373J45822
59959F084826J47251J44951J38957J29825J17769J02749Q5494O7557N0112L3535
59949G103026J8337N624l777r627j1302p540K125J6814L5792N9631Q8972J23158
$$ plain form
59937 7421233 7582296 7784604 8031182 8323811 8662965 9048824 9480999 9956558 10468881
59928 10468881 11008620 11564439 12122037 12663377 13168001 13615024 13984100 14256346 14416641
59919 14416641 14456117 14372996 14172187 13864913 13467914 13001383 12486639 11944843 11396116 10857909
59909 10857909 10343472 9862027 9420254 9023299 8674753 8376392 8128249 7928950 7776443
59900 7776443 7668992 7605551 7585179 7606329 7666904 7764563 7896676 8060223 8251894 8467797
59890 8467797 8702486 8948285 9195630 9433679 9650432 9832990 9968777 10047156 10060358 10003833
59880 10003833 9876640 9681772 9425856 9118302 8770390 8394360 8002474 7606242 7215894
59871 7215894 6839883 6484571 6154478 5852775 5581294 5340206 5128265 4943624 4784201
$$ packed form
59937G421233J61063K02308K46578K92629L39154L85859M32175M75559N12323
59928A0468881N39739N55819N57598N41340N04624M47023L69076K72246J60295
59919A4416641L9476q3121k00809l07274l96999m66531n14744n41796n48727n38207
59909A0857909n14437m81445m41773l96955l48546k98361k48143j99299j52507
59900G776443j07451o3441k0372K1150O0575R7659J32113J63547J91671K15903
59890H467797K34689K45799K47345K38049K16753J82558J35787P8379J3202n6525
59880A0003833j27193j94868k55916l07554l47912l76030l91886l96232l90348
59871G215894l76011l55312l30093l01703k71481k41088k11941j84641j59423
$$ plain form
59862 4784201 4647336 4529670 4427573 4337436 4255575 4178489 4103474 4028808 3953487 3877387 3801764
59851 3801764 3728871 3660789 3599035 3545253 3501350 3468300 3445216 3429908 3419906 3412644 3405250 3394792
59839 3394792 3378632 3354435 3320456 3276383 3223709 3165004 3102963 3040152 2979039 2921765 2870031
59828 2870031 2825288 2788657 2760537 2740851 2729904 2728469 2736806 2754230 2780004 2814119 2856722 2907246
59816 2907246 2964522 3027379 3094738 3165604 3239564 3317074 3398687 3483813 3570132 3653890 3730682
59805 3730682 3796537 3848781 3886102 3908216 3916049 3912119 3899995 3883194 3864986 3848903 3838399 3835862
59793 3835862 3842980 3862218 3896857 3949148 4019607 4108754 4218610 4351823 4510431 4696473 4913126
59782 4913126 5164336 5453849 5785199 6161506 6583621 7047836 7544834 8058957 8566784
$$ packed form
59862D784201j36865j17666j02097r0137q1861p7086p5015p4666p5321p6100p5623
59851C801764p2893o8082o1754n3782m3903l3050k3084j5308j0002p262p394j0458
59839C394792j6160k4197l3979m4073n2674n8705o2041o2811o1113n7274n1734
59828B870031m4743l6631k8120j9686j0947j435Q337J7424K5774L4115M2603N0524
59816B907246N7276O2857O7359P0866P3960P7510Q1613Q5126Q6319Q3758P6792
59805C730682O5855N2244L7321K2114P833l930j2124j6801j8208j6083j0504k537
59793C835862P118J9238L4639N2291P0459Q9147J09856J33213J58608J86042K16653
59782D913126K51210K89513L31350L76307M22115M64215M96998N14123N07827
$$ plain form
59773 8566784 9037257 9435705 9730106 9896193 9920882 9805103 9564651 9226793 8823891 8387850
59763 8387850 7946850 7523150 7131739 6780898 6474093 6211244 5989364 5804099 5651845
59754 5651845 5530401 5437896 5371957 5330045 5309960 5309950 5329002 5367106 5424685 5501674 5597637 5712691
59742 5712691 5847726 6003704 6181429 6382041 6607156 6858377 7137185 7445443 7785507
59733 7785507 8159706 8570072 9018685 9507976 10040606 10619042 11244735 11916936 12632006
59724 12632006 13383790 14164016 14961753 15762968 16551782 17312855 18033131 18702853 19316918
59715 19316918 19876346 20388463 20865703 21324107 21781677 22256011 22761968 23310691 23909492
59706 23909492 24560921 25261065 25998915 26757425 27515045 28247047 28927177 29529775 30031753
$$ packed form
59773H566784M70473L98448K94401J66087K4689j15779k40452l37858m02902m36041
59763H387850m41000m23700l91411l50841l06805k62849k21880j85265j52254
59754E651845j21444r2505o5939m1912k0085j0J9052L8104N7579P6989R5963J15054
59742E712691J35035J55978J77725K00612K25115K51221K78808L08258L40064
59733G785507L74199M10366M48613M89291N32630N78436O25693O72201P15070
59724A2632006P51784P80226P97737Q01215P88814P61073P20276O69722O14065
59715A9316918N59428N12117M77240M58404M57570M74334N05957N48723N98801
59706B3909492O51429P00144P37850P58510P57620P32002O80130O02598N01978
$$ plain form
59697 30031753 30414458 30665909 30782613 30769730 30639866 30411844 30109585 29760156 29391324
59688 29391324 29029962 28701241 28427543 28227316 28115171 28103002 28200523 28414984 28751483 29214096
59678 29214096 29806204 30529421 31382410 32360336 33453936 34647669 35917772 37231013 38543976
59669 38543976 39803189 40947290 41911518 42633571 43060009 43152839 42894923 42292285 41373043
59660 41373043 40184301 38787650 37252748 35649741 34042791 32485836 31019639 29669464
59652 29669464 28444238 27337506 26329171 25387862 24475450 23554268 22594562 21579258 20505391
59643 20505391 19383262 18233722 17083597 15960182 14886642 13879480 12948181 12096379
59635 12096379 11323516 10626165 9998953 9435625 8930206 8477582 8073221 7712724 7391763
$$ packed form
59697C0031753L82705K51451J16704j2883j29864k28022l02259l49429l68832
59688B9391324l61362l28721k73698k00227j12145j2169R7521K14461L36499M62613
59678B9214096N92108P23217Q52989R77926J093600J193733J270103J313241J312963
59669C8543976J259213J144101R64228P22053M26438R2830k57916o02638r19242
59660D1373043j188742j396651j534902j603007j606950j556955j466197j350175
59652B9669464j225226j106732j008335r41309r12412r21182r59706j015304j073867
59643B0505391j122129j149540j150125j123415j073540j007162r31299q51802
59635A2096379p72863o97351o27212n63328n05419m52624m04361l60497l20961
$$ plain form
59626 7391763 7106299 6852726 6627854 6428777 6252829 6097857 5962595 5846345 5747893 5664879
59616 5664879 5594468 5534351 5482642 5436974 5394182 5350800 5303543 5249518 5186574 5113536 5029891
59605 5029891 4935548 4831451 4720128 4604827 4488027 4371276 4256299 4145383 4040531 3942971
59595 3942971 3853732 3773982 3704433 3645018 3595541 3556179 3526960 3507187 3495829 3492183 3495836 3506179
59583 3506179 3522297 3543171 3567834 3595507 3625663 3657561 3689712 3720324 3748660 3775635 3802848
59572 3802848 3831472 3862398 3896900 3936430 3981954 4034245 4094881 4166299 4250476 4347961 4458647
59561 4458647 4583264 4723531 4880838 5055437 5247399 5457935 5689043 5941850 6215962
59552 6215962 6510468 6824694 7157452 7506164 7867365 8237551 8612697 8987229 9354482
$$ packed form
59626G391763k85464k53573k24872j99077j75948j54972j35262j16250r8452q3014
59616E664879p0411o0117n1709m5668m2792m3382m7257n4025o2944p3038q3645
59605E029891r4343j04097j11323j15301j16800j16751j14977j10916j04852r7560
59595C942971q9239p9750o9549n9415m9477l9362k9219j9773j1358l646L653J0343
59583C506179J6118K0874K4663K7673L0156L1898L2151L0612K8336K6975K7213
59572C802848K8624L0926L4502L9530M5524N2291O0636P1418Q4177R7485J10686
59561D458647J24617J40267J57307J74599J91962K10536K31108K52807K74112
59552F215962K94506L14226L32758L48712L61201L70186L75146L74532L67253
$$ plain form
59543 9354482 9708466 10044739 10359700 10649963 10912977 11147921 11355636 11537711 11695597
59534 11695597 11830190 11942051 12032183 12102768 12157389 12201087 12240754 12285140 12343491 12423356 12529117
59523 12529117 12661670 12818313 12992446 13173756 13349161 13503858 13622220 13689053 13691297 13619388
59513 13619388 13467783 13234997 12923650 12540505 12096149 11603946 11078192 10532367 9978691
59504 9978691 9428833 8893977 8383403 7903189 7456785 7046503 6673915 6339234 6041320
59495 6041320 5778589 5549498 5352169 5184177 5043027 4926649 4833469 4762262 4711947 4681398
59485 4681398 4669694 4676719 4703148 4749457 4815425 4901049 5007428 5136003 5287272 5460979 5657186
59474 5657186 5876268 6117958 6381167 6664489 6965824 7281349 7605516 7931839 8252643
$$ packed form
59543I354482L53984L36273L14961K90263K63014K34944K07715J82075J57886
59534A1695597J34593J11861R0132P0585N4621M3698L9667M4386N8351P9865J05761
59523A2529117J32553J56643J74133J81310J75405J54697J18362O6833K244p1909
59513A3619388j51605k32786l11347l83145m44356m92203n25754n45825n53676
59504I978691n49858n34856n10574m80214m46404m10282l72588l34681k97914
59495F041320k62731k29091j97329j67992j41150j16378r3180p1207n0315l0549
59485D681398j1704P025K6429M6309O5968Q5624J06379J28575J51269J73707J96207
59474E657186K19082K41690K63209K83322L01335L15525L24167L26323L20804
$$ plain form
59465 8252643 8558005 8836067 9075054 9264735 9396433 9463119 9460412 9387254 9245662 9040571
59455 9040571 8779963 8474064 8133700 7769559 7392519 7013102 6639631 6277438 5930263
59446 5930263 5601680 5294628 5010331 4748619 4509134 4291627 4095384 3918958 3760548
59437 3760548 3618503 3491627 3379251 3280885 3195666 3122231 3059077 3004914 2958869 2920693 2890584
59426 2890584 2868357 2853007 2843479 2839502 2841016 2847152 2856685 2869305 2885463 2904976 2926783 2950166
59414 2950166 2975349 3002885 3033468 3068320 3108443 3152992 3199371 3245310 3290081 3333712 3376687
59403 3376687 3421166 3471280 3531162 3603427 3690128 3793863 3916576 4057858 4215657 4388498
59393 4388498 4576471 4780827 5003831 5248944 5520529 5823570 6163937 6547970 6980575
$$ packed form
59465H252643L05362K78062K38987J89681J31698O6686k707p3158j41592k05091
59455I040571k60608l05899l40364l64141l77040l79417l73471l62193l47175
59446E930263l28583l07052k84297k61712k39485k17507j96243j76426j58410
59437C760548j42045j26876j12376r8366q5219p3435o3154n4163m6045l8176l0109
59426B890584k2227j5350r528l977J514O136R533J2620J6158J9513K1807K3383
59414B950166K5183K7536L0583L4852M0123M4549M6379M5939M4771M3631M2975
59403C376687M4479N0114N9882P2265Q6701J03735J22713J41282J57799J72841
59393D388498J87973K04356K23004K45113K71585L03041L40367L84033M32605
$$ plain form
59384 6980575 7463845 7998046 8583277 9218986 9901905 10625017 11378041 12147836 12918553
59375 12918553 13672934 14394634 15069931 15688338 16243155 16732058 17156623 17520688 17828894
59366 17828894 18086160 18297439 18466888 18596610 18685716 18730504 18725867 18666968 18549970 18372116
59356 18372116 18132647 17834560 17485315 17095463 16676678 16240667 15798261 15357797 14923784
59347 14923784 14497240 14076945 13660034 13242287 12819377 12388789 11950777 11507776 11063249
59338 11063249 10620954 10184735 9758530 9346156 8950677 8573923 8216795 7879887 7563305
59329 7563305 7266009 6986094 6722015 6472972 6238052 6015905 5805759 5608039 5423365
59320 5423365 5251441 5091381 4942530 4804356 4676145 4557564 4449147 4351445 4264008 4185930
$$ packed form
59384F980575M83270N34201N85231O35709O82919P23112P53024P69795P70717
59375A2918553P54381P21700O75297O18407N54817M88903M24565L64065L08206
59366A7828894K57266K11279J69449J29722Q9106M4788m637n8899j16998j77854
59356A8372116k39469k98087l49245l89852m18785m36011m42406m40464m34013
59347A4923784m26544m20295m16911m17747m22910m30588m38012m43001m44527
59338A1063249m42295m36219m26205m12374l95479l76754l57128l36908l16582
59329G563305k97296k79915k64079k49043k34920k22147k10146j97720j84674
59320E423365j71924j60060j48851j38174j28211j18581j08417r7702q7437p8078
$$ plain form
59310 4185930 4117149 4058473 4010361 3972256 3943149 3922355 3909790 3905780 3910513 3923410 3943329 3969762
59298 3969762 4003501 4045676 4096416 4155015 4221284 4296035 4380167 4473665 4575676 4685389 4802710
59287 4802710 4928159 5062138 5204372 5354110 5510594 5672875 5839367 6008212 6178196
59278 6178196 6348578 6517738 6682421 6838471 6981633 7107383 7210807 7287455 7334106 7348375
59268 7348375 7327996 7271050 7176734 7045678 6879929 6683116 6460574 6219014 5966038 5709604
59258 5709604 5457132 5214612 4986599 4776699 4587343 4419135 4271364 4143421 4035112
59249 4035112 3945619 3873332 3817169 3777217 3753666 3746066 3754246 3779104 3821833 3883058 3963301 4063628
59237 4063628 4185318 4329753 4499243 4697135 4926323 5188324 5484392 5816705 6187600
$$ packed form
59310D185930o8781n8676m8112l8105k9107k0794j2565m010M733J2897J9919K6433
59298C969762L3739M2175N0740N8599O6269P4751Q4132R3498J02011J09713J17321
59287D802710J25449J33979J42234J49738J56484J62281J66492J68845J69984
59278F178196J70382J69160J64683J56050J43162J25750J03424P6648M6651J4269
59268G348375k0379n6946r4316j31056j65749j96813k22542k41560k52976k56434
59258E709604k52472k42520k28013k09900j89356j68208j47771j27943j08309
59249D035112q9493p2287n6163l9952k3551p600Q180K4858M2729O1225Q0243J00327
59237D063628J21690J44435J69490J97892K29188K62001K96068L32313L70895
$$ plain form
59228 6187600 6598228 7048391 7536484 8058197 8605498 9167265 9729954 10276862 10788001
59219 10788001 11242547 11621715 11909344 12091612 12158550 12106233 11936851 11657441 11279834 10821098
59209 10821098 10301921 9743510 9165876 8587623 8025019 7490403 6992092 6535652 6124360
59200 6124360 5758610 5436247 5154224 4909719 4700015 4522158 4372914 4248656 4145606
59191 4145606 4060756 3992253 3938269 3896058 3862903 3837478 3819242 3806821 3798018 3791173 3785377 3779451
59179 3779451 3771802 3761371 3747814 3730593 3708567 3680539 3645713 3603882 3555801 3503070 3446931
59168 3446931 3387434 3324467 3259148 3193403 3128654 3065846 3006198 2950653 2898881 2850106 2804821
59157 2804821 2764587 2730198 2701188 2677125 2658281 2644916 2636942 2634405 2637392 2645424 2657830 2674692
$$ packed form
59228F187600M10628M50163M88093N21713N47301N61767N62689N46908N11139
59219A0788001M54546L79168K87629J82268O6938n2317j69382k79410l77607m58736
59209A0821098n19177n58411n77634n78253n62604n34616m98311m56440m11292
59200F124360l65750l22363k82023k44505k09704j77857j49244j24258j03050
59191D145606q4850o8503n3984m2211l3155k5425j8236j2421q803o845n796n926
59179C779451p649j0431j3557j7221k2026k8028l4826m1831m8081n2731n6139
59168C446931n9497o2967o5319o5745o4749o2808n9648n5545n1772m8775m5285
59157B804821m0234l4389k9010k4063j8844j3365p974k537K987Q032J2406J6862
$$ plain form
59145 2674692 2696548 2723213 2753805 2787870 2825512 2866548 2910586 2957907 3009132 3063909 3120950
59134 3120950 3179511 3239839 3302041 3365516 3429670 3494221 3558538 3621581 3682746 3742105 3799750
59123 3799750 3855662 3910319 3964622 4019246 4074793 4132454 4193613 4258975 4329108 4405728 4491203
59112 4491203 4586716 4692143 4808010 4936350 5079027 5235983 5405442 5584956 5771741 5962358
59102 5962358 6152114 6334142 6499152 6636951 6738512 6796429 6804389 6757992 6656559 6503330
59092 6503330 6303963 6065707 5797683 5510193 5212818 4913508 4619075 4335181 4065578
59083 4065578 3812439 3577641 3362762 3167782 2991035 2830808 2686089 2555780 2438393
59074 2438393 2332745 2237850 2152003 2073216 2000764 1935040 1875672 1821133 1770524 1724333 1682944
$$ packed form
59145B674692K1856K6665L0592L4065L7642M1036M4038M7321N1225N4777N7041
59134C120950N8561O0328O2202O3475O4154O4551O4317O3043O1165N9359N7645
59123C799750N5912N4657N4303N4624N5547N7661O1159O5362P0133P6620Q5475
59112D491203R5513J05427J15867J28340J42677J56956J69459J79514J86785J90617
59102E962358J89756J82028J65010J37799J01561N7917P960m6397j01433j53229
59092F503330j99367k38256k68024k87490k97375k99310k94433k83894k69603
59083D065578k53139k34798k14879j94980j76747j60227j44719j30309j17387
59074B438393j05648r4895q5847p8787p2452o5724n9368n4539n0609m6191m1389
$$ plain form
59063 1682944 1645763 1612411 1583429 1559068 1538477 1520783 1505906 1493648 1483031 1473226 1464221 1455970
59051 1455970 1447803 1439185 1430033 1419777 1407228 1392066 1375480 1358674 1341795 1324985 1309391 1296192
59039 1296192 1285334 1275936 1267200 1258424 1249174 1240187 1233279 1229605 1228749 1230049 1233840 1240722 1250522 1262769
59025 1262769 1277285 1293520 1310107 1325905 1340791 1354773 1367183 1377527 1386328 1394305 1401402 1407380
59013 1407380 1412690 1418064 1423876 1430485 1438413 1447528 1456865 1465916 1475265 1485259 1494977 1503313 1510082 1515101
58999 1515101 1517102 1514870 1508926 1501014 1492357 1483364 1474545 1466583 1459561 1452989 1446561 1440458 1435182 1431499
58985 1431499 1430173 1431339 1434548 1439680 1447159 1457016 1468611 1481754 1497121 1514970 1534367 1554491
58973 1554491 1575892 1599599 1625802 1654315 1685601 1720265 1757929 1797501 1838220 1879755 1921716
$$ packed form
59063A682944l7181l3352k8982k4361k0591j7694j4877j2258j0617r805r005q251
59051A455970q167q618r152j0256j2549j5162j6586j6806j6879j6810j5594j3199
59039A296192j0858r398q736q776r250q987o908l674q56J300L791O882R800J2247
59025A262769J4516J6235J6587J5798J4886J3982J2410J0344Q801P977P097N978
59013A407380N310N374N812O609P928R115R337R051R349R994R718Q336O769N019
58999A515101K001k232n944p912q657q993q819p962p022o572o428o103n276l683
58985A431499j326J166L209N132P479R857J1595J3143J5367J7849J9397K0124
58973A554491K1401K3707K6203K8513L1286L4664L7664L9572M0719M1535M1961
$$ plain form
58962 1921716 1963816 2006150 2048709 2090988 2132508 2173224 2212989 2251327 2288271 2324773 2361797
58951 2361797 2399779 2439433 2482174 2529039 2580045 2635341 2696175 2763941 2839099 2921833 3012903
58940 3012903 3112855 3221193 3337310 3461608 3594887 3737437 3889742 4053372 4230047 4420396
58930 4420396 4624793 4845035 5084246 5345468 5631158 5943544 6284613 6656133 7060395
58921 7060395 7500465 7979047 8497810 9058478 9663690 10315705 11014935 11760637 12552160
58912 12552160 13387924 14263162 15169155 16093736 17021149 17931639 18802294 19608364 20323645
58903 20323645 20921076 21375318 21666142 21780382 21712656 21466071 21052174 20489213 19800105
58894 19800105 19011374 18151577 17248192 16325216 15403306 14500325 13630206 12802091 12021990
$$ packed form
58962A921716M2100M2334M2559M2279M1520M0716L9765L8338L6944L6502L7024
58951B361797L7982L9654M2741M6865N1006N5296O0834O7766P5158Q2734R1070
58940C012903R9952J08338J16117J24298J33279J42550J52305J63630J76675J90349
58930D420396K04397K20242K39211K61222K85690L12386L41069L71520M04262
58921G060395M40070M78582N18763N60668O05212O52015O99230P45702P91523
58912A2552160Q35764Q75238R05993R24581R27413R10490Q70655Q06070P15281
58903B0323645N97431M54242K90824J14240o7726k46585m13897n62961o89108
58894A9800105p88731q59797r03385r22976r21910r02981q70119q28115p80101
$$ plain form
58885 12021990 11294609 10622489 10004457 9436879 8916231 8439339 8002002 7599390 7227703
58876 7227703 6884087 6565217 6267584 5989188 5729596 5488323 5264330 5056958 4865938
58867 4865938 4690361 4528700 4379917 4243628 4119298 4006268 3904308 3813080 3731267 3657358
58857 3657358 3591091 3533048 3483035 3440029 3403513 3373589 3349890 3331654 3318939 3312616 3313059 3319818
58845 3319818 3332671 3352043 3378289 3411428 3451639 3499293 3554657 3618266 3691269 3774516 3867567
58834 3867567 3969520 4080529 4201707 4333990 4478126 4635335 4806862 4993224 5195049
58825 5195049 5414377 5654016 5915958 6201556 6512820 6852267 7221900 7623765 8061290
58816 8061290 8538661 9058913 9623847 10235467 10895792 11605100 12361511 13162074 14002535
$$ packed form
58885A2021990p27381o72120o18032n67578n20648m76892m37337m02612l71687
58876G227703l43616l18870k97633k78396k59592k41273k23993k07372j91020
58867D865938j75577j61661j48783j36289j24330j13030j01960r1228q1813p3909
58857C657358o6267n8043n0013m3006l6516k9924k3699j8236j2715o323M43O759
58845C319818J2853J9372K6246L3139M0211M7654N5364O3609P3003Q3247R3051
58834C867567J01953J11009J21178J32283J44136J57209J71527J86362K01825
58825E195049K19328K39639K61942K85598L11264L39447L69633M01865M37525
58816H061290M77371N20252N64934O11620O60325P09308P56411Q00563Q40461
$$ plain form
58807 14002535 14875499 15769715 16670774 17560872 18417568 19214321 19923147 20516802 20969884
58798 20969884 21260955 21375750 21308810 21062942 20648611 20083699 19391746 18598925 17732219
58789 17732219 16818909 15884897 14951904 14036468 13151330 12306365 11507960 10759010 10060408
58780 10060408 9412086 8812749 8260005 7751449 7284957 6857817 6466510 6107551 5777800
58771 5777800 5474000 5192997 4932539 4691003 4466425 4256896 4061839 3881644 3715775
58762 3715775 3562220 3418960 3285120 3160669 3046023 2941912 2848496 2764446 2687826 2617812
58752 2617812 2554582 2497794 2446451 2400143 2359013 2322458 2289249 2259024 2232341 2209090 2188201
58741 2188201 2168976 2151208 2133699 2114232 2091480 2065685 2037109 2005262 1970193 1933157 1895334
$$ packed form
58807A4002535Q72964Q94216R01059Q90098Q56696P96753P08826N93655M53082
58798B0969884K91071J14795o6940k45868m14331n64912o91953p92821q66706
58789A7732219r13310r34012r32993r15436q85138q44965p98405p48950o98602
58780A0060408o48322n99337n52744n08556m66492m27140l91307l58959l29751
58771E777800l03800k81003k60458k41536k24578k09529j95057j80195j65869
58762C715775j53555j43260j33840j24451j14646j04111r3416q4050p6620p0014
58752B617812o3230n6788n1343m6308m1130l6555l3209l0225k6683k3251k0889
58741B188201j9225j7768j7509j9467k2752k5795k8576l1847l5069l7036l7823
$$ plain form
58730 1895334 1856977 1818360 1780293 1743001 1705505 1666894 1627432 1587863 1548415 1508999 1469790
58719 1469790 1431158 1393581 1357692 1323774 1291226 1259341 1228589 1200275 1175054 1152743 1133372
58708 1133372 1117213 1103803 1092113 1081618 1072063 1062498 1052063 1041615 1032876 1025792 1018333 1009070
58696 1009070 998333 986559 973311 958560 943347 928511 914062 900317 888189 877795 868170
58685 868170 858966 851101 845183 840646 836991 834450 832841 831246 829628 829417 831675 835836 840984 847111
58671 847111 854306 861890 869205 876313 883197 889332 894674 900085 906154 912550 919071 926146 933636 940151
58657 940151 944245 945522 944317 941278 937592 934402 931687 928874 926783 927474 931777 938416 946079 954828
58643 954828 964929 975989 988147 1002643 1020223 1040120 1061472 1084577 1110041 1137907 1168381
$$ packed form
58730A895334l8357l8617l8067l7292l7496l8611l9462l9569l9448l9416l9209
58719A469790l8632l7577l5889l3918l2548l1885l0752k8314k5221k2311j9371
58708A133372j6159j3410j1690j0495r555r565j0435j0448q739p084p459r263
58696A009070j0737j1774j3248j4751j5213j4836j4449j3745j2128j0394r625
58685H68170r204p865n918m537l655k541j609j595j618k11K258M161N148O127
58671H47111P195P584P315P108O884O135N342N411O069O396O521P075P490O515
58657I40151M094J277j205l039l686l190k715k813k091O91M303O639P663Q749
58643I54828J0101J1060J2158J4496J7580J9897K1352K3105K5464K7866L0474
$$ plain form
58632 1168381 1202291 1240198 1282194 1329090 1382470 1442973 1509875 1582966 1663468 1752549 1850540
58621 1850540 1958380 2078259 2211868 2359391 2520996 2697845 2890798 3099687 3324686
58612 3324686 3566704 3825113 4096238 4374842 4655356 4930443 5189838 5421972 5615904
58603 5615904 5761362 5849370 5874897 5838188 5742675 5593142 5397017 5165439 4910906 4644316
58593 4644316 4374838 4110580 3857325 3617650 3392923 3185279 2996390 2825609 2671118
58584 2671118 2532077 2408199 2298071 2199523 2111150 2032257 1961846 1898687 1841819 1790257 1743032
58573 1743032 1700099 1661972 1627896 1595911 1565640 1539321 1518862 1503420 1491116 1481306 1473487 1465581
58561 1465581 1455294 1442042 1425748 1404936 1377997 1345523 1309639 1271786 1232824 1194458 1158724
$$ packed form
58632A168381L3910L7907M1996M6896N3380O0503O6902P3091Q0502Q9081R7991
58621A850540J07840J19879J33609J47523J61605J76849J92953K08889K24999
58612C324686K42018K58409K71125K78604K80514K75087K59395K32134J93932
58603E615904J45458Q8008K5527l6709r5513j49533j96125k31578k54533k66590
58593D644316k69478k64258k53255k39675k24727k07644j88889j70781j54491
58584B671118j39041j23878j10128r8548q8373p8893p0411o3159n6868n1562m7225
58573A743032m2933l8127l4076l1985l0271k6319k0459j5442j2304r810p819p906
58561A465581j0287j3252j6294k0812k6939l2474l5884l7853l8962l8366l5734
$$ plain form
58550 1158724 1126471 1097743 1072973 1052476 1035395 1020501 1007373 995706 984341 972322 960111
58539 960111 948542 937371 925977 914519 903217 891496 878971 866239 853590 840258 826144
58528 826144 812828 801379 790526 778652 766276 754797 744037 732949 721699 711184 701405 692127
58516 692127 684268 678798 675016 671612 668641 666886 666145 665778 666032 667210 668492 669241 670462 673275 677022
58501 677022 680666 684942 691176 698968 707085 715733 725849 736968 747996 759482 772936 788202 803423
58488 803423 817220 829258 839169 846678 852424 857101 860218 861014 859815 857152 852508 845502 837280 829039
58474 829039 820196 809702 798077 786335 774066 760592 746898 734339 722364 709621 696386 683843
58462 683843 671958 660259 649707 641444 634531 627222 619799 613858 609538 605791 602728 601363 601478 601960
$$ packed form
58550A158724l2253k8728k4770k0497j7081j4894j3128j1667j1365j2019j2211
58539I60111j1569j1171j1394j1458j1302j1721j2525j2732j2649j3332j4114
58528H26144j3316j1449j0853j1874j2376j1479j0760j1088j1250j0515r779r278
58516F92127p859n470l782l404k971j755p41l67K54J178J282P49J221K813L747
58501F77022L644M276O234P792Q117Q648J0116J1119J1028J1486J3454J5266J5221
58488H03423J3797J2038R911P509N746M677L117P96j199k663m644p006q222q241
58474H29039q843j0494j1625j1742j2269j3474j3694j2559j1975j2743j3235j2543
58462F83843j1885j1699j0552q263o913p309p423n941m320l747l063j365J15M82
$$ plain form
58448 601960 602721 604328 606388 608350 611129 615873 621995 628547 636475 647130 659544 671781 684065
58435 684065 697840 712396 725145 734804 741690 745415 744898 740366 732992 723100 711017 698962 689483
58422 689483 682567 676713 672023 669639 669052 668946 670041 674072 680510 687293 694322 703166 713720 724374
58408 724374 735278 748255 763444 778981 793979 808882 822897 833996 841581 846439 848166 845431
58396 845431 838742 830219 820728 809935 798895 789699 782693 776797 772211 769927 769043 767689 766250 766445
58382 766445 767639 767482 766021 765613 766817 767904 768495 770156 773183 776253 779452 784223 790130 795246 800015
58367 800015 807122 817099 827511 836930 846270 855810 864435 872383 881320 891139 900049 908250 918081 930088
58353 930088 942413 954492 967744 982074 995267 1006338 1015967 1023252 1025835 1023913 1020444 1016830 1011993
$$ packed form
58448F01960P61J607K060J962K779M744O122O552P928J0655J2414J2237J2284
58435F84065J3775J4556J2749R659O886L725n17m532p374r892j2083j2055r479
58422F89483o916n854m690k384n87j06J095M031O438O783P029Q844J0554J0654
58408G24374J0904J2977J5189J5537J4998J4903J4015J1099P585M858J727k735
58396H45431o689q523r491j0793j1040r196p006n896m586k284q84j354j439J95
58382G66445J194j57j461m08J204J087N91J661L027L070L199M771N907N116M769
58367H00015P107R977J0412R419R340R540Q625P948Q937R819Q910Q201R831J2007
58353I30088J2325J2079J3252J4330J3193J1071R629P285K583j922l469l614m837
$$ plain form
58340 1011993 1006090 1001204 997724 993987 990167 988605 989704 991489 993861 999153 1007701 1017068 1026449 1037556
58326 1037556 1050321 1062187 1072723 1084596 1098760 1112976 1126284 1140605 1156667 1172690 1188393
58315 1188393 1206010 1226013 1245955 1264675 1283352 1301438 1316168 1327152 1336808 1345234 1349629 1349980
58303 1349980 1350188 1352197 1354181 1355867 1360094 1367384 1374555 1380751 1389408 1402164 1416307 1430382 1446685
58290 1446685 1465888 1484913 1502723 1522636 1546189 1570283 1593162 1617671 1645755 1675251 1704978
58279 1704978 1737449 1773688 1811016 1848802 1890554 1937302 1984890 2030824 2077628 2126114 2171724
58268 2171724 2211224 2246818 2280086 2308350 2331070 2353373 2378948 2405598 2431806 2461212 2496272
58257 2496272 2534085 2573008 2616880 2668050 2722762 2778113 2837032 2901756 2969194 3037545 3110578
$$ packed form
58340A011993n903m886l480l737l820j562J099J785K372N292Q548R367R381J1107
58326A037556J2765J1866J0536J1873J4164J4216J3308J4321J6062J6023J5703
58315A188393J7617K0003J9942J8720J8677J8086J4730J0984R656Q426M395L51
58303A349980K08K009J984J686M227P290P171O196Q657J2756J4143J4075J6303
58290A446685J9203J9025J7810J9913K3553K4094K2879K4509K8084K9496K9727
58279A704978L2471L6239L7328L7786M1752M6748M7588M5934M6804M8486M5610
58268B171724L9500L5594L3268K8264K2720K2303K5575K6650K6208K9406L5060
58257B496272L7813L8923M3872N1170N4712N5351N8919O4724O7438O8351P3033
$$ plain form
58246 3110578 3190459 3273402 3357259 3446084 3542247 3641784 3742711 3849921 3966528 4088755
58236 4088755 4214876 4350347 4498156 4653336 4813315 4984113 5169707 5365408 5568866
58227 5568866 5787103 6025002 6277867 6543547 6830381 7144271 7480024 7835366 8221210
58218 8221210 8647537 9111827 9612747 10162209 10771989 11442354 12177284 12997178 13923169
58209 13923169 14964286 16135899 17476904 19034945 20852352 22981974 25495342 28454523
58201 28454523 31896492 35867958 40456405 45769458 51917962 59056263 67420889 77312031
58193 77312031 89087456 103224123 120344079 141118889 166165792 196001135 230791399
58186 230791399 269676438 310069645 347731521 377827032 396259644 400516107 389990975
$$ packed form
58246C110578P9881Q2943Q3857Q8825R6163R9537J00927J07210J16607J22227
58236D088755J26121J35471J47809J55180J59979J70798J85594J95701K03458
58227E568866K18237K37899K52865K65680K86834L13890L35753L55342L85844
58218H221210M26327M64290N00920N49462O09780O70365P34930Q19894R25991
58209A3923169J041117J171613J341005J558041J817407K129622K513368K959181
58201B8454523L441969L971466M588447N313053O148504P138301Q364626R891142
58193G7312031J1775425J4136667J7119956K0774810K5046903K9835343L4790264
58186B30791399L8885039M0393207L7661876L0095511J8432612M256463j0525132
$$ plain form
58179 389990975 366120739 332248250 292869078 252400962 214174416 180130724 151054754
58172 151054754 126925836 107228701 91251569 78313523 67836228 59322524 52360803
58165 52360803 46650098 41975925 38158850 35047971 32545341 30595858 29152381 28177378
58157 28177378 27673995 27684145 28252874 29420623 31248106 33794966 37011866 40626217 44138976
58148 44138976 46953537 48546716 48586111 46978196 43882751 39696206 34963433 30218550
58140 30218550 25841621 22020271 18803786 16165389 14031275 12303487 10893269 9737739
58132 9737739 8787348 7994649 7323474 6755243 6275713 5864256 5502807 5184288 4903154
58123 4903154 4646443 4402435 4170029 3951293 3742218 3538791 3345117 3167155 3004182
$$ packed form
58179C89990975k3870236l3872489l9379172m0468116l8226546l4043692k9075970
58172A51054754k4128918j9697135j5977132j2938046j0477295q513704o961721
58165E2360803n710705m674173l817075l110879k502630j949483j443477r75003
58157B8177378n03383J0150N68729J167749J827483K546860L216900L614351L512759
58148D4138976K814561J593179L9395j607915l095445m186545m732773m744883
58140C0218550m376929l821350l216485k638397k134114j727788j410218j155530
58132I737739r50391p92699o71175n68231m79530m11457l61449l18519k81134
58123D903154k56711k44008k32406k18736k09075k03427j93674j77962j62973
$$ plain form
58114 3004182 2853669 2718604 2602478 2502238 2413053 2334926 2267980 2206392 2143805 2080184
58104 2080184 2017272 1952314 1882842 1813006 1748399 1688636 1631202 1578351 1533621 1495115 1458530
58093 1458530 1423568 1391510 1359794 1324970 1288162 1252134 1215904 1177558 1139309 1104343 1071433
58082 1071433 1037895 1005045 975544 948074 919850 891970 867270 845274 824003 804358 787967
58071 787967 773137 757567 742646 730462 719094 705669 691676 680390 671236 661527 651682 643850
58059 643850 637214 629443 621227 614762 609222 602041 593194 584127 574130 561932 549238 538542 529080
58046 529080 519024 509863 504292 501337 497841 493314 489233 485147 479861 474981 472872 472281 470281 467323
58032 467323 466048 466297 465704 464240 463694 463387 460835 456200 451973 448674 444886 441094 439377 439568 439595 439545
$$ packed form
58114C004182j50513j35065j16126j00240q9185p8127o6946o1588o2587o3621
58104B080184o2912o4958o9472o9836o4607n9763n7434n2851m4730l8506l6585
58093A458530l4962l2058l1716l4824l6808l6028l6230l8346l8249l4966l2910
58082A071433l3538l2850k9501k7470k8224k7880k4700k1996k1271j9645j6391
58071G87967j4830j5570j4921j2184j1368j3425j3993j1286r154r709r845p832
58059F43850o636p771q216o465n540p181q847r067r997j2198j2694j0696r462
58046E29080j0056r161n571k955l496m527m081m086n286m880k109n91k000k958
58032D67323j275K49n93j464n46l07k552m635m227l299l788l792j717J91K7n0
$$ plain form
58016 439545 441642 446355 452046 458370 466468 475910 484855 493213 502455 512483 521853 530799 540792 551319
58002 551319 560323 567647 574877 581962 587148 590015 591463 590920 586832 579780 571917 563415 552615 539627
57988 539627 526615 514486 502444 490864 481446 474318 467937 462050 457800 454818 451279 447109 444163
57975 444163 442879 441622 439710 438300 437876 437623 437653 439206 442249 445489 449012 454247 461021 467437 473138
57960 473138 479941 488741 498437 508487 519730 531913 543000 551980 560113 568599 577106 585276 593497
57947 593497 601485 608136 613517 618942 624471 628272 629049 627185 623022 616057 606425 595207 582642 567869
57933 567869 550940 533236 515472 497163 478458 460534 443706 427085 410588 395370 381805
57922 381805 368943 356515 345584 336676 329085 322544 317720 314580 312078 309989 309254 310071 311514 313479
$$ packed form
58016D39545K097M713N691O324Q098R442Q945Q358R242J0028R370Q946R993J0527
58002E51319R004P324P230P085N186K867J448n43m088p052p863q502j0800j2988
57988E39627j3012j2129j2042j1580r418p128o381n887m250k982l539m170k946
57975D44163j284j257j912j410m24k53L0J553L043L240L523N235O774O416N701
57960D73138O803Q800R696J0050J1243J2183J1087Q980Q133Q486Q507Q170Q221
57947E93497P988O651N381N425N529L801P77j864m163o965r632j1218j2565j4773
57933E67869j6929j7704j7764j8309j8705j7924j6828j6621j6497j5218j3565
57922C81805j2862j2428j0931q908p591o541m824l140k502k089p35Q17J443J965
$$ plain form
57908 313479 317138 322854 329536 336601 344758 354202 363838 372941 381883 390654 398373 404821 410779 416285
57894 416285 420346 422846 424974 427209 428733 429439 430625 432916 435286 436959 438578 440752 443166 445928
57880 445928 450075 455794 461755 467113 472687 479243 486113 492450 498502 504728 510888 516780 522640 528157
57866 528157 532370 535149 537436 539431 539931 538115 534541 529707 523142 514730 505523 496264 486344 475150
57852 475150 463451 452652 443552 436367 430976 426758 423166 420740 420471 422109 424481 427544 432516 439729
57838 439729 448022 456588 465612 474773 482981 490160 497287 503946 507771 507293 503620 498463 492229 484892
57824 484892 476830 467666 456074 442009 427549 414350 401840 389099 376847 366075 356249 346457
57812 346457 337140 329218 322592 316877 312541 309968 308355 306853 305836 305910 306622 307419 308974 312336 317630
$$ packed form
57908C13479L659N716O682P065Q157R444R636R103Q942Q771P719O448N958N506
57894D16285M061K500K128K235J524P06J186K291K370J673J619K174K414K762
57880D45928M147N719N961N358N574O556O870O337O052O226O160N892N860N517
57866E28157M213K779K287J995N00j816l574m834o565q412r207r259r920j1194
57852D75150j1699j0799r100p185n391m218l592k426k69J638K372L063M972P213
57838D39729Q293Q566R024R161Q208P179P127O659L825m78l673n157o234p337
57824D84892q062r164j1592j4065j4460j3199j2510j2741j2252j0772r826r792
57812C46457r317p922o626n715m336k573j613j502j017P4P12P97J555L362N294
$$ plain form
57797 317630 324671 333972 345988 360159 375668 392227 409143 424695 437615 448276 457297 463822
57785 463822 466422 464920 460244 453178 444287 434297 423485 411339 397722 383667 370221 357337 344708
57772 344708 332763 321927 311859 302374 294246 288192 283939 281071 279707 279449 278911 277456 276314 276809
57758 276809 278504 280271 282115 284533 287098 289142 291111 293862 297317 301003 305223 310443 316291 322321
57744 322321 328900 336105 342681 347513 351279 355196 359037 362054 365040 369509 375226 380427 384440 388459
57730 388459 393686 400148 407418 415199 423088 430823 438857 447789 457482 467681 479147 493021 509167
57717 509167 526311 543714 561721 580795 601026 622550 645578 670078 696144 724495 755781
57706 755781 789780 826140 865590 909465 958309 1011930 1070726 1136096 1209553 1292058 1384072
$$ packed form
57797C17630P041R301J2016J4171J5509J6559J6916J5552J2920J0661R021O525
57785D63822K600j502m676p066q891r990j0812j2146j3617j4055j3446j2884j2629
57772C44708j1945j0836j0068r485q128o054m253k868j364k58n38j455j142M95
57758B76809J695J767J844K418K565K044J969K751L455L686M220N220N848O030
57744C22321O579P205O576M832L766L917L841L017K986M469N717N201M013M019
57730C88459N227O462P270P781P889P735Q034Q932R693J0199J1466J3874J6146
57717E09167J7144J7403J8007J9074K0231K1524K3028K4500K6066K8351L1286
57706G55781L3999L6360L9450M3875M8844N3621N8796O5370P3457Q2505R2014
$$ plain form
57695 1384072 1485783 1597725 1721742 1860804 2017237 2191769 2384760 2597333 2830132
57686 2830132 3081762 3349426 3630165 3919869 4211466 4495249 4760576 4996335 5190987
57677 5190987 5334522 5421199 5450096 5424114 5350124 5239549 5106774 4966172 4830648 4710926
57667 4710926 4612812 4533742 4462960 4385647 4287032 4154815 3981811 3768908 3525370 3265705
57657 3265705 3005817 2760104 2538866 2346495 2182505 2044672 1930813 1838273 1763710 1704372
57647 1704372 1658853 1626211 1605100 1594051 1591827 1597297 1609760 1629633 1658162 1696312 1744563 1803597
57635 1803597 1874277 1956914 2051506 2158703 2279662 2415032 2565126 2731056 2914424 3115517
57625 3115517 3332550 3562525 3801433 4043214 4279683 4501924 4700941 4866898 4989406
$$ packed form
57695A384072J01711J11942J24017J39062J56433J74532J92991K12573K32799
57686B830132K51630K67664K80739K89704K91597K83783K65327K35759J94652
57677E190987J43535Q6677K8897k5982p3990j10575j32775j40602j35524j19722
57667D710926r8114p9070p0782p7313r8615j32217j73004k12903k43538k59665
57657C265705k59888k45713k21238j92371j63990j37833j13859r2540p4563n9338
57647A704372m5519l2642k1111j1049k224N470J2463J9873K8529L8150M8251N9034
57635A803597P0680Q2637R4592J07197J20959J35370J50094J65930J83368K01093
57625C115517K17033K29975K38908K41781K36469K22241J99017J65957J22508
$$ plain form
57616 4989406 5059900 5073555 5029083 4928162 4776048 4581828 4356665 4111397 3855565 3597511
57606 3597511 3344158 3100595 2870297 2655699 2458409 2279097 2117424 1972041 1840936
57597 1840936 1722337 1615385 1519576 1433720 1356003 1285057 1220371 1161633 1108295 1059846 1015926
57586 1015926 976042 939624 906358 876024 848161 822441 799206 778937 761276 745371 731069
57575 731069 718856 708540 698954 689373 680507 673612 669075 666200 664012 661938 660012 658690 658483 659810
57561 659810 663108 668609 675806 683732 692270 702565 715542 730660 747026 765140 786477 811708
57549 811708 840419 872358 907844 947072 990149 1037839 1091388 1151626 1219081 1294641 1379096
57538 1379096 1472365 1574369 1686499 1810891 1948324 2098122 2259961 2434202 2620094 2814948
$$ packed form
57616D989406P0494J3655m4472j00921j52114j94220k25163k45268k55832k58054
57606C597511k53353k43563k30298k14598j97290j79312j61673j45383j31105
57597A840936j18599j06952r5809q5856p7717p0946o4686n8738n3338m8449m3920
57586A015926l9884l6418l3266l0334k7863k5720k3235k0269j7661j5905j4302
57575G31069j2213j0316r586r581q866o895m537k875k188k074j926j322k07J327
57561F59810L298N501P197P926Q538J0295J2977J5118J6366J8114K1337K5231
57549H11708K8711L1939L5486L9228M3077M7690N3549O0238O7455P5560Q4455
57538A379096R3269J02004J12130J24392J37433J49798J61839J74241J85892J94854
$$ plain form
57528 2814948 3015130 3216217 3411660 3592684 3750287 3876603 3964453 4007593 4002705 3950523
57518 3950523 3854705 3720716 3556137 3370376 3172659 2970556 2770461 2578010 2397074 2229306
57508 2229306 2075523 1936760 1813376 1704156 1607222 1521205 1445066 1377711 1318491 1267228
57498 1267228 1223198 1184971 1151857 1124428 1102953 1086405 1073834 1065608 1062308 1063477 1068638 1078612
57486 1078612 1094577 1116504 1143728 1176452 1215580 1261666 1315211 1377450 1449561 1531530 1622953
57475 1622953 1724557 1837675 1962622 2098935 2246995 2407832 2580976 2763452 2950882
57466 2950882 3138234 3319042 3484898 3626526 3735253 3803727 3826529 3801147 3728534 3612726
57456 3612726 3460202 3279370 3079681 2870244 2658685 2450785 2250703 2061475 1885480
$$ packed form
57528B814948K00182K01087J95443J81024J57603J26316Q7850M3140m888n2182
57518C950523r5818j33989j64579j85761j97717k02103k00095j92451j80936j67768
57508B229306j53783j38763j23384j09220r6934q6017p6139o7355n9220n1263
57498A267228m4030l8227l3114k7429k1475j6548j2571q226l300J169N161R974
57486A078612J5965K1927K7224L2724L9128M6086N3545O2239P2111Q1969R1423
57475A622953J01604J13118J24947J36313J48060J60837J73144J82476J87430
57466B950882J87352J80808J65856J41628J08727O8474K2802k5382p2613j15808
57456C612726j52524j80832j99689k09437k11559k07900k00082j89228j75995
$$ plain form
57447 1885480 1724409 1578703 1447383 1328795 1221572 1124881 1038159 960896 892414 831626
57437 831626 777232 728253 683986 643404 605269 569230 536106 506526 479834 454934 431691
57426 431691 410696 391947 374555 357744 341557 326599 313486 302418 292827 283541 273749 263724
57414 263724 254349 246041 238500 231333 224539 218401 213155 208757 204909 201459 198641 196568 194623 191979
57400 191979 188737 185826 183579 181266 178391 175560 173457 171698 169421 166485 163412 160618 158347 156873
57386 156873 156092 155305 153950 152142 149987 147056 143238 139512 136954 135409 134049 132859 132608 133500 134780
57371 134780 135621 135680 134891 133435 131888 130800 130118 129513 129030 128930 129089 129182 129226 129396 129537 129400 129132 128946 128613
57352 128613 127891 127124 126793 126787 126759 126872 127469 128360 129210 130283 131911 133537 134226 133988 133647 133576 133509 133586 134506 136542
$$ packed form
57447A885480j61071j45706j31320j18588j07223r6691q6722p7263o8482o0788
57437H31626n4394m8979m4267m0582l8135l6039l3124k9580k6692k4900k3243
57426D31691k0995j8749j7392j6811j6187j4958j3113j1068r591r286r792j0025
57414B63724r375q308p541p167o794o138n246m398l848l450k818k073j945k644
57400A91979l242k911k247k313k875k831k103j759k277k936l073k794k271j474
57386A56873p81p87j355j808k155k931l818l726k558j545j360j190k51Q92J280
57371A34780Q41N9p89j456j547j088o82o05m83j00J59R3M4J70J41j37k68j86l33
57352A28613p22p67l31ok8J13N97Q91Q50J073J628J626O89k38l41p1o7P7R20K036
$$ plain form
57332 136542 139196 142003 144894 147659 149860 151493 153061 154887 156946 159430 162723 166666 170514 173866
57318 173866 177121 180925 185673 191562 198538 206136 213920 222040 230812 239868 248536 257073 266649 277887
57304 277887 290139 302489 314858 327873 342225 358431 376819 397388 419861 443841 468784
57293 468784 494152 520059 547452 577039 608379 640715 674182 709115 744407 777839 808167
57282 808167 835688 860549 881654 897584 907440 910260 904658 889881 866583 836089 799637 758819
57270 758819 715846 672466 629055 585457 542299 500930 462443 427273 395407 366543 340399
57259 340399 317249 297686 281560 267673 255006 243678 234175 226204 219018 212428 206710 201751 197080
57246 197080 192644 188866 185834 182990 179820 176521 173863 172552 172692 173626 174345 174219 173337 172109 170749
$$ packed form
57332A36542K654K807K891K765K201J633J568J826K059K484L293L943L848L352
57318A73866L255L804M748N889O976P598P784Q120Q772R056Q668Q537R576J1238
57304B77887J2252J2350J2369J3015J4352J6206J8388K0569K2473K3980K4943
57293D68784K5368K5907K7393K9587L1340L2336L3467L4933L5292L3432L0328
57282H08167K7521K4861K1105J5930R856K820n602j4777k3298l0494l6452m0818
57270G58819m2973m3380m3411m3598m3158m1369l8487l5170l1866k8864k6144
57259C40399k3150j9563j6126j3887j2667j1328r503p971p186o590n718m959m671
57246A97080m436l778l032k844l170l299k658j311J40R34P19j26q82j228j360
$$ plain form
57231 170749 169354 168220 167744 167945 168259 167934 166681 165032 164004 164274 165693 167734 170220 173303 176833
57216 176833 180277 183426 186750 190762 195195 199158 202112 204589 207806 212538 218422 224498 230274 235858
57202 235858 241205 245985 250449 255527 261435 266930 270817 273686 277112 281545 286158 290586 295476 301170
57188 301170 307103 312864 318795 325057 331093 336598 342230 348730 355955 363308 370544 377716 384914 392500
57174 392500 401000 410323 419638 428500 437521 447447 458156 469132 480390 492282 504821 517904 531920
57161 531920 547514 564810 583252 602083 620722 638949 657103 675998 696460 719010 743859
57150 743859 770719 798662 826840 855565 886078 918934 953233 987764 1022343 1057695 1094595
57139 1094595 1133491 1174421 1216875 1260232 1304619 1350792 1398980 1448569 1499370 1552291 1608168
$$ packed form
57231A70749j395j134m76K01L14l25j253j649j028K70J419K041K486L083L530
57216A76833L444L149L324M012M433L963K954K477L217M732N884O076N776N584
57202B35858N347M780M464N078N908N495L887K869L426M433M613M428M890N694
57188C01170N933N761N931O262O036N505N632O500P225P353P236P172P198P586
57174C92500Q500R323R315Q862R021R926J0709J0976J1258J1892J2539J3083J4016
57161E31920J5594J7296J8442J8831J8639J8227J8154J8895K0462K2550K4849
57150G43859K6860K7943K8178K8725L0513L2856L4299L4531L4579L5352L6900
57139A094595L8896M0930M2454M3357M4387M6173M8188M9589N0801N2921N5877
$$ plain form
57128 1608168 1666623 1726865 1788985 1853626 1920821 1990019 2061009 2134121 2209742 2288404 2371271
57117 2371271 2460028 2556242 2661137 2775841 2901683 3040544 3195085 3368293 3562855 3781791
57107 3781791 4030173 4315832 4648466 5039316 5502568 6056561 6723073 7525932 8490578
57098 8490578 9644053 11014871 12634087 14537780 16768534 19374345 22406389 25916469
57090 25916469 29952179 34549411 39725380 45473937 51761030 58519912 65648159 73001941
57082 73001941 80377453 87485555 93953240 99382513 103449613 105983016 106971177 106508632
57074 106508632 104729635 101768554 97752443 92811976 87097446 80790222 74102007 67259831
57066 67259831 60483001 53961455 47841512 42220545 37149649 32641809 28681951 25236193
$$ packed form
57128A608168N8455O0242O2120O4641O7195O9198P0990P3112P5621P8662Q2867
57117B371271Q8757R6214J04895J14704J25842J38861J54541J73208J94562K18936
57107C781791K48382K85659L32634L90850M63252N53993O66512Q02859R64646
57098H490578J153475J370818J619216J903693K230754K605811L032044L510080
57090B5916469M035710M597232N175969N748557O287093O758882P128247P353782
57082G3001941P375512P108102O467685N429273M067100K533403R88161m62545
57074A06508632j778997k961081m016111m940467n714530o307224o688215o842176
57066F7259831o776830o521546o119943n620967n070896m507840l959858l445758
$$ plain form
57058 25236193 22259435 19701359 17510688 15637709 14035915 12663480 11484286 10467676
57050 10467676 9586916 8817757 8138553 7531830 6985347 6491179 6043600 5637789 5269893
57041 5269893 4937193 4637426 4367926 4125482 3906789 3708818 3529007 3365397 3216554
57032 3216554 3081118 2957410 2843472 2737402 2637581 2542709 2451800 2364156 2279371 2197444
57022 2197444 2118865 2044393 1974600 1909707 1849845 1795255 1746083 1702032 1662487 1626999 1595453
57011 1595453 1567710 1543314 1521848 1503507 1489092 1479512 1475579 1478261 1488750 1508389 1539109 1584201
56999 1584201 1648132 1735415 1850069 1995404 2171153 2367630 2562606 2726367 2832000 2862678
56989 2862678 2812941 2688183 2504858 2288050 2064217 1853618 1667818 1511398 1383735 1280075
$$ packed form
57058B5236193k976758k558076k190671j872979j601794j372435j179194j016610
57050A0467676q80760p69159o79204o06723n46483m94168m47579m05811l67896
57041E269893l32700k99767k69500k42444k18693j97971j79811j63610j48843
57032C216554j35436j23708j13938j06070r9821r4872r0909q7644q4785q1927
57022B197444p8579p4472o9793o4893n9862n4590m9172m4051l9545l5488l1546
57011A595453k7743k4396k1466j8341j4415r580l933K682J0489J9639L0720M5092
56999A584201O3931Q7283J14654J45335J75749J96477J94976J63761J05633L0678
56989B862678m9737j24758j83325k16808k23833k10599j85800j56420j27663j03660
$$ plain form
56979 1280075 1193780 1119177 1052744 992580 937995 889432 847650 812712 784031 760983 742795
56968 742795 728275 716421 706976 699737 693876 688796 685208 684392 686780 692267 701429 715056 732403
56955 732403 750870 767478 779792 785510 782421 769422 747302 718512 686469 654583 625087 598712
56943 598712 575811 557195 543189 532623 524067 517852 515790 519057 527461 540604 558592 581573
56931 581573 609442 641733 676517 709355 734615 748177 748315 734652 708057 671742 630768 589575
56919 589575 550574 515112 484286 458317 436235 416940 399992 385235 372561 362225 354371 348041
56907 348041 341744 335249 329725 325808 322718 319587 316457 313583 311013 309396 309907 312692 316517 320611
56893 320611 325767 333031 342562 354569 370162 390212 414307 441657 471910 503921 534603 560201
$$ packed form
56979A280075q6295p4603o6433o0164n4585m8563m1782l4938k8681k3048j8188
56968G42795j4520j1854r445p239n861n080l588q16K388N487R162J3627J7347
56955G32403J8467J6608J2314N718l089j2999k2120k8790l2043l1886k9496k6375
56943E98712k2901j8616j4006j0566q556o215k062L267Q404J3143J7988K2981
56931E81573K7869L2291L4784L2838K5260J3562J38j3663k6595l6315m0974m1193
56919E89575l9001l5462l0826k5969k2082j9295j6948j4757j2674j0336p854o330
56907C48041o297o495n524l917l090l131l130k874k570j617N11K785L825M094
56893C20611N156P264R531J2007J5593K0050K4095K7350L0253L2011L0682K5598
$$ plain form
56881 560201 578237 587511 587282 577930 561959 543035 523965 506168 490627 478362 470114 466165 466373
56868 466373 470163 477123 488016 504567 527815 557507 593641 637561 690428 751093 816017 880260
56856 880260 937564 980437 1002162 999573 973999 930326 875634 817557 762163 712862 671442 639397
56844 639397 617608 605570 602123 606853 620231 642984 676103 720964 778682 849787 934814 1033674
56832 1033674 1142707 1252660 1350833 1425278 1466873 1469640 1432302 1360340 1264902 1158504 1051604
56821 1051604 951947 864731 792262 734436 690340 659208 640015 631379 632507 643658 665382 697939
56809 697939 741735 797569 865455 942788 1023328 1097700 1155385 1187614 1189747 1161865 1107872 1034350
56797 1034350 949504 861821 778588 704896 643273 593842 555233 525901 504789 491015 483763
$$ packed form
56881E60201J8036R274k29r352j5971j8924j9070j7797j5541j2265q248l949K08
56868D66373L790O960J0893J6551K3248K9692L6134M3920N2867O0665O4924O4243
56856H80260N7304M2873K1725k589k5574m3673n4692n8077n5394m9301m1420l2045
56844F39397k1789j2038l447M730J3378K2753L3119M4861N7718P1105Q5027R8860
56832A033674J09033J09953R8173P4445M1595K767l7338p1962r5438j06398j06900
56821A051604r9657q7216p2469n7826m4096l1132j9193q636J128J1151K1724L2557
56809F97939M3796N5834O7886P7333Q0540P4372N7685L2229K133k7882n3993p3522
56797A034350q4846q7683q3233p3692o1623m9431l8609k9332k1112j3774p252
$$ plain form
56786 483763 482854 488854 502140 522360 549202 582814 622503 665193 705721 738416 758279 761715
56774 761715 747523 717365 674917 624666 571414 519718 472632 431163 395408 365615 341677
56763 341677 322497 306876 294445 284916 277172 270128 263873 258911 254869 251090 247877 245841 244432
56750 244432 242498 240017 237989 236826 236093 235639 235626 235548 234530 232616 230573 228444 225599 222219 219399 217530
56734 217530 215852 213831 211812 210007 208020 205776 203866 202523 201194 199563 198107 197238 196690 196114 195550
56719 195550 194982 194157 193175 192561 192449 192338 191883 191321 190913 190577 190196 189741 189034 188005 187134 186953 187180 187132 186881
56700 186881 187048 187522 187433 186594 185894 185926 186106 185568 184258 182812 181895 181813 182218 182194 181277 180289 180415 181591 182740
56681 182740 183497 184582 186393 188335 189798 190767 191212 190886 190035 189391 189163 188879 188463 188480 189003 189287 189004 188851
$$ packed form
56786D83763r09O000J3286K0220K6842L3612L9689M2690M0528L2695J9863L436
56774G61715j4192l0158m2448n0251n3252n1696m7086m1469l5755k9793k3938
56763C41677j9180j5621j2431r529p744p044o255m962m042l779l213k036j409
56750B44432j934k481k028j163p33m54j3p8j018j914k043k129k845l380k820j869
56734B17530j678k021k019j805j987k244j910j343j329j631j456q69n48n76n64
56719A95550n68q25r82o14j12j11m55n62m08l36l81m55p07j029q71j81K27m8k51
56700A86881J67M74q9q39p00L2J80n38j310j446r17q2M05k4r17r88J26J176J149
56681A82740P57J085J811J942J463R69M45l26q51o44k28k84m16J7N23K84k83j53
$$ plain form
56663 188851 189361 189912 189463 187752 185388 183267 182068 181746 181484 180684 179848 179710 179843 179305 178469 178731 180298
56646 180298 181845 182741 184048 186611 189628 191984 193766 195440 196608 196716 196224 196032 196232 196286 195947 195295
56630 195295 194264 192744 190765 188237 185031 181608 178841 176914 175217 173659 173086 173848 174896 175052 174375
56615 174375 173574 172818 171942 171204 170970 171057 171034 170827 170563 170295 170306 171133 172837 174725 176226 177492 178818 180083
56597 180083 181193 182381 183657 184528 184763 184815 185123 185524 185709 185715 185660 185617 185879 186673 187493 187567 187133 187290 188432
56578 188432 189850 191104 192541 194135 195153 195575 196567 198771 201320 203331 205206 207550 209927 211735 213375
56563 213375 215503 217943 220297 222853 225897 228926 231500 234170 237566 241256 244443 247140 249768 252243
56549 252243 254352 256358 258324 259469 259164 257966 256792 255669 254164 252426 250863 249390 247910 246954 246897
$$ packed form
56663A88851N10N51m49j711k364k121j199l22k62q00q36j38J33n38q36K62J567
56646A80298J547Q96J307K563L017K356J782J674J168J08m92j92K00N4l39o52
56630A95295j031j520j979k528l206l423k767j927j697j558n73P62J048J56o77
56615A74375q01p56q76p38k34Q7k3k07k64k68J1Q27J704J888J501J266J326J265
56597A80083J110J188J276Q71K35N2L08M01J85On5m3K62P94Q20P4m34J57J142
56578A88432J418J254J437J594J018M22R92K204K549K011J875K344K377J808J640
56563B13375K128K440K354K556L044L029K574K670L396L690L187K697K628K475
56549B52243K109K006J966J145l05j198j174j123j505j738j563j473j480r56n7
$$ plain form
56534 246897 247045 246438 245113 243725 242449 241122 240008 239542 239651 240061 240792 241702 242073 241319 239599 237135
56518 237135 233684 229370 225254 222217 219910 217588 215313 213508 211994 210309 208335 205922 202674 198867
56504 198867 195724 193927 192699 191181 189749 188968 188324 187189 186123 185915 186109 185841 185346 185281 185252 184542 183787
56487 183787 184350 186265 188180 189220 189797 190700 192448 195322 199081 202863 206098 209124 212278 215094 217240
56472 217240 219359 221929 224175 225337 226219 228094 230769 233123 234910 236601 237965 238382 238156 238116 238175 237638
56456 237638 236609 235783 235170 234298 233364 232944 232887 232723 232770 233613 234915 235921 236709 237680 238396 238252 237787 237936
56438 237936 238517 238839 239184 240145 241104 241072 240516 240604 241020 240417 238661 236817 235143 233031 230762 229369 228744
56421 228744 227753 226345 225666 225957 226187 225988 226082 226451 225914 224083 222107 220931 220283 219852 220017 220814 221464 221489
$$ packed form
56534B46897J48o07j325j388j276j327j114m66J09M10P31R10L71p54j720k464
56518B37135l451m314m116l037k307k322k275j805j514j685j974k413l248l807
56504A98867l143j797j228j518j432p81o44j135j066k08J94k68m95o5k9p10p55
56487A83787N63J915J915J040N77R03J748K874L759L782L235L026L154K816K146
56472B17240K119K570K246J162Q82J875K675K354J787J691J364M17k26m0N9n37
56456B37638j029q26o13q72r34m20n7j64M7Q43J302J006P88R71P16j44m65J49
56438B37936N81L22L45R61R59l2n56Q8M16o03j756j844j674k112k269j393o25
56421B28744r91j408o79K91K30j99R4L69n37j831j976j176o48m31J65P97O50K5
$$ plain form
56403 221489 221266 221146 221153 221696 223400 225970 228346 230123 231670 232880 233160 232780 232896 234021 235614 237202
56387 237202 238684 239621 239673 239735 241226 244135 247193 249872 252738 255854 258574 260960 263688 266337 267557
56372 267557 267209 266624 266445 265995 265179 265073 265947 266444 265635 264432 264151 264927 266213 267573 268414 268164 267305 267131
56354 267131 268080 269508 271231 273776 276739 278540 278469 277588 277092 277188 278029 280113 282979 285034 285646 286229 288449
56337 288449 292410 297244 302377 307529 312513 317681 323753 330801 338207 345718 353420 360692 366609 371510
56323 371510 376697 382368 387417 391470 395409 399510 402834 405040 407079 409390 411008 411197 410486 409386 407596
56308 407596 405155 402897 401000 398534 395146 391806 389206 386912 384764 383600 383797 384509 385152 386282 388321
56293 388321 390744 393189 395962 398859 401033 402665 405280 409671 415029 420680 427045 434204 441320 448410
$$ packed form
56403B21489k23j20PN43J704K570K376J777J547J210K80l80J16J125J593J588
56387B37202J482R37N2O2J491K909L058K679K866L116K720K386K728K649J220
56372B67557l48n85j79m50q16j06Q74M97q09j203k81P76J286J360Q41k50q59j74
56354B67131R49J428J723K545K963J801p1q81m96R6Q41K084K866K055O12N83K220
56337B88449L961M834N133N152M984N168O072P048P406P511P702P272N917M901
56323C71510N187N671N049M053L939M101L324K206K039K311J618J89p11j100j790
56308D07596k441k258j897k466l388l340k600k294k148j164J97P12O43J130K039
56293C88321K423K445K773K897K174J632K615M391N358N651O365P159P116P090
$$ plain form
56279 448410 456940 467671 479538 491707 505098 520793 538487 557650 578751 602164 627227 653509
56267 653509 681799 712874 746653 783484 824802 871452 922680 977752 1037223 1101625 1170297
56256 1170297 1242539 1318533 1398116 1479980 1563036 1647176 1731694 1814343 1892974 1966843 2035425
56245 2035425 2097374 2151647 2198393 2237925 2270266 2296442 2318517 2337375 2351945 2361511 2367110 2369691
56233 2369691 2368575 2362752 2352026 2335784 2312344 2280637 2240992 2193354 2136648 2071019 1998835 1922218
56221 1922218 1841373 1756549 1669746 1583091 1497386 1413642 1334127 1260272 1191241 1126140 1065965
56210 1065965 1011865 963172 918731 878599 842938 810845 781763 756417 734895 715510 697023
56199 697023 680276 666159 653816 642454 633036 626417 621572 617417 614579 613583 613052 611689 610430 610795
$$ packed form
56279D48410Q530J0731J1867J2169J3391J5695J7694J9163K1101K3413K5063K6282
56267F53509K8290L1075L3779L6831M1318M6650N1228N5072N9471O4402O8672
56256A170297P2242P5994P9583Q1864Q3056Q4140Q4518Q2649P8631P3869O8582
56245B035425O1949N4273M6746L9532L2341K6176K2075J8858J4570R566N599K581
56233B369691j116n823j0726j6242k3440l1707l9645m7638n6706o5629p2184p6617
56221A922218q0845q4824q6803q6655q5705q3744p9515p3855o9031o5101o0175
56210A065965n4100m8693m4441m0132l5661l2093k9082k5346k1522j9385j8487
56199F97023j6747j4117j2343j1362r418o619m845m155k838r96n31j363j259L65
$$ plain form
56185 610795 612641 615353 619554 625819 633217 640934 649671 659717 669415 677468 685107 694005 703695 712891
56171 712891 721646 730278 737870 743807 749200 754910 759912 763462 766997 771957 777648 783297 790209 799648
56157 799648 810601 821946 834929 851159 870118 891164 916048 946816 982948 1023211 1068675
56146 1068675 1121351 1181653 1249957 1329180 1423136 1533810 1662677 1812871 1987076 2184328
56136 2184328 2400965 2632774 2873471 3112861 3339796 3546465 3728472 3883420 4012454
56127 4012454 4121248 4215999 4299055 4369909 4427698 4469709 4490087 4484261 4453967 4405333 4343451
56116 4343451 4270978 4189136 4095959 3984975 3849283 3686525 3498298 3287672 3060890 2829221
56106 2829221 2604756 2394974 2203698 2034758 1890745 1769846 1667806 1581981 1510613 1450189
$$ packed form
56185F10795J846K712M201O265P398P717Q737J0046R698Q053P639Q898R690R196
56171G12891Q755Q632P592N937N393N710N002L550L535M960N691N649O912R439
56157G99648J0953J1345J2983J6230J8959K1046K4884L0768L6132M0263M5464
56146A068675N2676O0302O8304P9223R3956J10674J28867J50194J74205J97252
56136B184328K16637K31809K40697K39390K26935K06669J82007J54948J29034
56127D012454J08794R4751Q3056P0854N7789M2011K0378n826l0294m8634o1882
56116D343451p2473q1842r3177j10984j35692j62758j88227k10626k26782k31669
56106B829221k24465k09782j91276j68940j44013j20899j02040q5825p1368o0424
$$ plain form
56096 1450189 1397138 1350529 1309904 1272572 1236498 1203538 1175917 1151680 1127616 1104424 1084748
56085 1084748 1068229 1052964 1039820 1030652 1023977 1017040 1010597 1007138 1006033 1004958 1004482 1006617 1010419
56072 1010419 1013684 1017407 1023855 1031828 1038570 1044796 1053021 1062602 1071266 1079822 1090394 1101667 1110991
56059 1110991 1119579 1130521 1143379 1155827 1168669 1183945 1200065 1214405 1228661 1245948 1264698
56048 1264698 1281439 1297421 1316176 1336583 1355004 1372383 1392418 1414402 1434831 1454520 1477063
56037 1477063 1501808 1525539 1549566 1577771 1609078 1639411 1669782 1704691 1743696 1782336 1820242
56026 1820242 1860455 1902007 1941309 1979751 2021667 2065979 2108315 2150060 2196405 2246638 2295552
56015 2295552 2343499 2395629 2452129 2508790 2566357 2629415 2696844 2763569 2831006 2905386 2986424
$$ packed form
56096A450189n3051m6609m0625l7332l6074l2960k7621k4237k4064k3192j9676
56085A084748j6519j5265j3144r168o675o937o443l459j105j075m76K135L802
56072A010419L265L723O448P973O742O226Q225R581Q664Q556J0572J1273R324
56059A110991Q588J0942J2858J2448J2842J5276J6120J4340J4256J7287J8750
56048A264698J6741J5982J8755K0407J8421J7379K0035K1984K0429J9689K2543
56037A477063K4745K3731K4027K8205L1307L0333L0371L4909L9005L8640L7906
56026A820242M0213M1552L9302L8442M1916M4312M2336M1745M6345N0233M8914
56015B295552M7947N2130N6500N6661N7567O3058O7429O6725O7437P4380Q1038
$$ plain form
56004 2986424 3068419 3151843 3242740 3341244 3442132 3546172 3659128 3780190 3903743 4032007
55994 4032007 4173094 4327019 4486935 4653556 4834159 5027833 5226857 5432785 5655588
55985 5655588 5896571 6148399 6412521 6699603 7011876 7342745 7695082 8081658 8506269
55976 8506269 8963714 9459966 10012275 10627990 11304785 12053581 12898715 13854229 14925548
55967 14925548 16138306 17541259 19179964 21095762 23350905 26020742 29157364 32796650
55959 32796650 37006922 41896084 47573865 54160140 61845313 70903817 81657561 94500946
55951 94500946 109976707 128751500 151493229 178814324 211191459 248485889 289089028
55944 289089028 329467942 364810034 390423714 402891687 400541446 383621249 354431612
$$ packed form
56004B986424Q1995Q3424R0897R8504J00888J04040J12956J21062J23553J28264
55994D032007J41087J53925J59916J66621J80603J93674J99024K05928K22803
55985E655588K40983K51828K64122K87082L12273L30869L52337L86576M24611
55976H506269M57445M96252N52309O15715O76795P48796Q45134R55514J071319
55967A4925548J212758J402953J638705J915798K255143K669837L136622L639286
55959C2796650M210272M889162N677781O586275P685173R058504J0753744J2843385
55951I4500946J5475761J8774793K2741729K7321095L2377135L7294430M0603139
55944B89089028M0378914L5342092K5613680J2467973k350241j6920197k9189637
$$ plain form
55937 354431612 317012236 276082237 235738245 198715074 166399166 139173075 116747297
55930 116747297 98468929 83612824 71538690 61694782 53602826 46889044 41287194
55923 41287194 36585432 32596066 29177698 26240317 23707397 21497956 19551467 17837167
55915 17837167 16325804 14977115 13762990 12676597 11708325 10834993 10040642 9325737 8687141
55906 8687141 8108861 7580198 7103679 6677316 6286972 5923719 5591822 5292517 5015966
55897 5015966 4756075 4517741 4302515 4101588 3909594 3731582 3569935 3417486 3269845
55888 3269845 3132048 3006964 2889002 2774958 2669527 2574442 2483316 2392754 2307930 2231913
55878 2231913 2159840 2088770 2023105 1965048 1909431 1853093 1800128 1753071 1708039 1663235 1623115
$$ packed form
55937C54431612l7419376m0929999m0343992l7023171l2315908k7226091k2425778
55930A16747297j8278368j4856105j2074134r843908q091956o713782n601850
55923D1287194m701762l989366l418368k937381k532920k209441j946489j714300
55915A7837167j511363j348689j214125j086393r68272q73332p94351p14905o38596
55906H687141n78280n28663m76519m26363l90344l63253l31897k99305k76551
55897E015966k59891k38334k15226k00927j91994j78012j61647j52449j47641
55888C269845j37797j25084j17962j14044j05431r5085r1126r0562q4824p6017
55878B231913p2073p1070o5665n8057n5617n6338n2965m7057m5032m4804m0120
$$ plain form
55867 1623115 1589364 1556535 1521301 1487457 1457216 1426259 1392213 1359713 1332212 1306774 1281764
55856 1281764 1261719 1249626 1241880 1235739 1234280 1238895 1243952 1243997 1239618 1231477 1215523 1189475 1157908
55843 1157908 1125792 1092740 1058162 1025974 999043 974400 948824 924028 901820 879448 854477
55832 854477 829392 806806 784846 761650 739823 721979 706209 690168 675413 663623 652670
55821 652670 640438 628523 618370 607794 595078 582588 572646 563748 554453 547095 543893 543075 542379
55808 542379 542858 545859 549833 553424 558109 564492 569640 571326 571395 571792 570886 566902 561332 555665 548286
55793 548286 537881 526457 515739 504046 489994 475882 464106 453433 442038 431045 421907 413514
55781 413514 404986 398229 394684 392686 390854 390687 392743 393780 390954 385615 379782 372321 362030 351090
$$ packed form
55867A623115l3751l2829l5234l3844l0241l0957l4046l2500k7501k5438k5010
55856A281764k0045j2093p746o141j459M615N057M5m379q141j5954k6048l1567
55843A157908l2116l3052l4578l2188k6931k4643k5576k4796k2208k2372k4971
55832H54477k5085k2586k1960k3196k1827j7844j5770j6041j4755j1790j0953
55821F52670j2232j1915j0153j0576j2716j2490r942q898r295p358l202q18o96
55808E42379M79L001L974L591M685O383N148J686O9L97r06l984n570n667p379
55793E48286j0405j1424j0718j1693j4052j4112j1776j0673j1395j0993r138q393
55781D13514q528o757l545j998j832j67K056J037k826n339n833p461j0291j0940
$$ plain form
55767 351090 341812 333108 323845 316658 314568 316440 319359 322769 326657 328439 325640 319486 312232 303174
55753 303174 290845 276869 263984 252172 240208 229072 220423 213524 206937 201473 198297 196042 192916
55740 192916 189830 188345 187395 185273 183025 182702 183887 185019 186540 189684 193634 196763 199156 201251 201677
55725 201677 199191 195088 191058 186444 180275 174032 169532 165951 161935 158745 158187 159114 159149 158419 158541 159356
55709 159356 159745 160442 163172 168083 174479 182751 193067 203625 212676 220771 228716 235196 238959 241367
55695 241367 243932 245297 243666 240345 237797 235906 233323 230700 229177 227309 223020 217407 213223 210750
55681 210750 208442 206447 206087 206843 207233 207855 210366 214209 217353 219463 221454 222959 223221 223450 225132 227024
55665 227024 227006 225905 226140 227538 228010 227603 228238 229879 230579 230188 230574 232121 233192 233139 232826 232127 229854
$$ packed form
55767C51090r278q704r263p187k090J872K919L410L888J782k799o154p254r058
55753C03174j2329j3976j2885j1812j1964j1136q649o899o587n464l176k255l126
55740A92916l086j485r50k122k248l23J185J132J521L144L950L129K393K095M26
55725B01677k486m103m030m614o169o243m500l581m016l190n58R27L5p30J22Q15
55709A59356L89O97K730M911O396Q272J0316J0558R051Q095P945O480L763K408
55695B41367K565J365j631l321k548j891k583k623j523j868m289n613m184k473
55681B10750k308j995l60P56L90O22K511L843L144K110J991J505K62K29J682J892
55665B27024j8j101K35J398M72m07O35J641P00l91L86J547J071n3l13o99k273
$$ plain form
55648 229854 226328 223214 220638 216977 211514 204890 197172 188066 178843 171411 165590 159757 153791 148757
55634 148757 144162 138466 132130 127181 123772 120064 115583 111730 108838 105592 101753 98645 96542 94226
55620 94226 91558 89820 89065 87736 85495 83859 83350 82529 80653 78974 78437 78223 77490 76711 76342 75840 74835
55603 74835 73871 73342 72936 72515 72328 72229 71898 71779 72417 73053 72498 71147 70470 70611 70263 68805 66882 64945
55585 64945 62928 61283 60617 60419 59712 58738 58402 58481 58155 57792 58272 58982 58570 57285 56488 56212 55369 54062
55567 54062 53427 53425 53076 52667 53380 54909 55809 56102 57091 58686 59450 59361 59905 61249 61933 61694 62019 63393 64494
55548 64494 64695 64979 65754 66069 65718 65950 67386 69224 71098 73634 76655 78932 80299 81971 84293 86258
55532 86258 87730 89898 92936 95422 96784 98071 99631 100324 99879 99773 100700 101264 100214 98067 95507 92131
$$ packed form
55648B29854l526l114k576l661n463o624p718r106r223p432n821n833n966n034
55634A48757m595n696o336m949l409l708m481l853k892l246l839l108k103k316
55620I4226k668j738p55j329k241j636n09q21j876j679n37k14p33p79l69n02j005
55603G4835r64n29m06m21j87r9l31j19O38O36n55j351o77J41l48j458j923j937
55585F4945k017j645o66j98p07r74l36P9l26l63M80P10m12j285p97k76q43j307
55567E4062o35kl49m09P13J529R00K93R89J595P64q9N44J344O84k39L25J374J101
55548F4494K01K84P75L15l51K32J436J838J874K536L021K277J367J672K322J965
55532H6258J472K168L038K486J362J287J560O93m45j06R27N64j050k147k560l376
$$ plain form
55516 92131 87786 83282 78815 73523 67538 62589 59574 57388 55121 53472 52838 51965 49909 47620 46243
55501 46243 45357 44191 43043 42219 40948 38675 36187 34331 32800 31197 29986 29341 28378 26714 25554
55486 25554 26078 27757 29271 30093 30267 29745 28901 28721 29598 30771 31539 31977 32013 31127 29593 28684 28843 28967
55468 28967 28241 27376 27237 27525 27679 27896 28419 28894 29156 29576 30025 29726 28726 28236 28864 29781 30255 30583 30924
55449 30924 30667 29777 29319 29820 30425 30460 30450 30803 30953 30634 30637 31410 32254 32715 33392 34515 35210 35117 35198 35949 36257
55428 36257 35221 33684 32814 32421 31888 31550 31996 33007 34250 35941 37926 39257 39576 39752 40313 40611 40340
55411 40340 40412 41327 42146 42153 42071 42520 42847 42699 43177 44960 46761 47129 46486 45872 45089 43736 42708 42806 42964
55392 42964 41710 39474 37649 36187 34025 31291 29316 28777 29265 30221 31058 30929 29732 28786 29228 30345
$$ packed form
55516I2131m345m504m467n292n985m949l015k186k267j649o34q73k056k289j377
55501D6243q86j166j148q24j271k273k488j856j531j603j211o45r63j664j160
55486B5554N24J679J514Q22J74n22q44j80Q77J173P68M38L6q86j534r09J59J24
55468B8967p26q65j39K88J54K17N23M75K62M20M49k99j000m90O28R17M74L28L41
55449C0924k57q90m58N01O05L5j0L53J50l19LP73Q44M61O77J123O95r3Q1P51L08
55428C6257j036j537q70l93n33l38M46J011J243J691J985J331L19J76N61K98k71
55411D0340P2R15Q19Pq2M49L27j48M78J783J801L68o43o14p83j353j028R8J58
55392D2964j254k236j825j462k162k734j975n39M88R56Q37j29j197r46M42J117
$$ plain form
55376 30345 30673 29928 28580 26449 23348 20436 19226 19593 20245 20729 21531 22573 23056 22608 21349 19168
55360 19168 16128 13259 11705 11387 11561 12219 13734 15622 17021 18057 19409 20807 21290 20802 20306 20389
55344 20389 20856 21558 22614 23859 24959 25957 26908 27303 26691 25565 24760 24359 24066 24165 25079 26293 26714 25956
55326 25956 24481 22799 21331 20661 21065 22104 23331 24861 26565 27447 26837 25543 24781 24574 24260 23914
55310 23914 24039 24370 24326 24270 25045 26463 27451 27528 27056 26274 25190 24248 23988 24116 23908 23450 23535 24417 25538
55291 25538 26404 26909 26969 26591 26119 25753 25122 24062 23298 23535 24358 24963 25508 26650 28140 29023 29029 28714 28409
55272 28409 28046 27857 28183 28624 28369 27380 26473 26272 26750 27682 28805 29673 29998 29995 29918 29588 28888 28214 27776 27123
55252 27123 26158 25901 27197 29235 30456 30520 30273 30128 29673 28711 27628 26756 26163 25880 25564 24408 22242
$$ packed form
55376C0345L28p45j348k131l101k912j210L67O52M84Q02J042M83m48j259k181
55360A9168l040k869j554l18J74O58J515J888J399J036J352J398M83m88m96Q3
55344B0389M67P02J056J245J100R98R51L95o12j126q05m01k93R9R14J214M21p58
55326B5956j475j682j468o70M04J039J227J530J704Q82o10j294p62k07l14l46
55310B3914J25L31m4n6P75J418R88P7m72p82j084r42k60J28k08m58Q5Q82J121
55291B5538Q66N05O0l78m72l66o31j060p64K37Q23O05N45J142J490Q83Ol15l05
55272B8409l63j89L26M41k55r89r07k01M78R32J123Q68L25lp7l30p00o74m38o53
55252B7123r65k57J296K038J221O4k47j45m55r62j083q72n93k83l16j156k166
$$ plain form
55235 22242 20310 19941 20861 21793 22283 22787 23328 23403 23150 23385 24395 25644 26680 27523 28167 28528 28754 28943
55217 28943 28810 28326 28283 29337 30899 31861 32014 31839 31367 30373 29342 29105 29734 30804 32339 34373 35978
55200 35978 36020 34720 33278 32180 31104 30270 30428 31420 32140 32176 32378 33482 35105 36359 36699 36057 34850
55183 34850 33912 33753 33995 34140 34406 35012 35171 34034 32279 31433 31736 31930 31211 30118 29421 29262 29585 30352
55165 30352 31093 31131 30446 29580 28761 27915 27354 27526 28158 28575 28779 29296 30131 30844 31457 32265 33006 33325 33833
55146 33833 35434 37697 39187 39437 39372 39756 40415 41125 42014 42928 43482 43960 45107 46920 48653 50032 51362
55129 51362 52405 52414 51434 50467 50059 49760 49135 48335 47507 46601 45843 45479 45101 44213 43291 43148 43429 43065 42098
55110 42098 41608 41858 42037 41988 42580 43973 45042 45039 44544 44335 44539 45246 46631 48065 48406 47631 46915 46749 46383
$$ packed form
55235B2242j932l69R20R32M90N04N41P5k53K35J010J249J036Q43O44L61K26J89
55217B8943j33m84m3J054J562R62J53j75m72r94j031k37O29J070J535K034J605
55200C5978M2j300j442j098j076q34J58R92P20L6K02J104J623J254L40o42j207
55183C4850r38j59K42J45K66O06J59j137j755q46L03J94p19j093o97j59L23P67
55165C0352P41L8o85q66q19q46n61J72O32M17K04N17Q35P13O13Q08P41L19N08
55146C3833J601K263J490K50o5L84O59P10Q89R14N54M78J147J813J733J379J330
55129E1362J043Rr80r67m08k99o25q00q28r06p58l64l78q88r22j43K81l64r67
55110D2098m90K50J79m9N92J393J069lm95k09K04P07J385J434L41p75p16j66l66
$$ plain form
55091 46383 45498 44915 45033 45128 44915 45300 46700 48039 48437 48609 49487 50590 50963 50809 50991 51624 52181 52458
55073 52458 52530 52347 52095 52324 53076 53597 53559 53769 54911 56347 57004 56826 56550 56747 57714 59691 62317 64457
55055 64457 65342 65420 65510 65688 65650 65522 65520 65351 64727 64099 64152 64897 65772 66306 66206 65261 63702 62323 61750 61887
55035 61887 62306 62709 62794 62275 61416 60975 61232 61618 61607 61395 61330 61286 60978 60383 59560 58630 58118 58566 59626 60339
55015 60339 60538 61002 61955 62503 62144 61730 62165 63045 63437 63250 62931 62405 61245 59516 57752 56376 55699 56094
54997 56094 57592 59601 61368 62462 62621 61769 60417 59405 58934 58471 57812 57437 57577 57877 58348 59701 62196
54980 62196 65083 67725 70309 72851 74507 74744 74362 74522 75498 77086 79453 82657 86067 89166 92326
54965 92326 95970 99601 102567 105181 108134 111302 114151 116951 120649 125729 132018 139383 147912 157547
$$ packed form
55091D6383q85n83J18R5k13L85J400J339L98J72Q78J103L73j54J82O33N57K77
55073E2458P2j83k52K29P52N21l8K10J142J436O57j78k76J97R67J977K626K140
55055F4457Q85P8R0J78l8j28kj69o24o28N3P45Q75N34j00r45j559j379n73J37
55035F1887M19M03Q5n19q59m41K57L86j1k12o5m4l08n95q23r30n12M48J060P13
55015F0339J99M64R53N48l59m14M35Q80L92j87l19n26j160j729j764j376o77L95
54997E6094J498K009J767J094J59q52j352j012m71m63o59l75J40L00M71J353K495
54980F2196K887K642K584K542J656K37l82J60R76J588K367L204L410L099L160
54965I2326L644L631K966K614K953L168K849K800L698N080O289P365Q529R635
$$ plain form
54951 157547 168146 179758 192376 205616 218945 231813 243167 251417 255403 255065 250807 242780 231254
54938 231254 217154 201729 186138 171594 159075 148415 138443 128643 119929 113187 107887 102970 98370
54925 98370 94766 92372 90853 89992 89670 89606 89807 90888 93280 96537 99992 103653 107936 113072 119277 126888
54909 126888 135818 145586 156396 169240 184182 199417 212917 224171 233338 239576 241530 238953 232661
54896 232661 223207 210771 196103 180562 165307 151135 138752 128416 119658 112088 106017 101553
54884 101553 97716 93440 89013 85557 83406 81910 80495 78983 77251 75507 74565 74892 75680 75752 75090 74479
54868 74479 73959 72675 70196 67057 64060 61738 60399 59953 59822 59561 59321 59244 58939 58177 57481 57241 56926
54851 56926 56083 55425 55801 56652 56752 56091 55717 56020 56415 56604 56925 57462 57886 58174 58552 58846 58780 58694 59011 59296
$$ packed form
54951A57547J0599J1612J2618J3240J3329J2868J1354Q250L986l38m258q027j1526
54938B31254j4100j5425j5591j4544j2519j0660r972r800q714o742n300m917m600
54925I8370l604k394j519q61l22o4K01J081K392L257L455L661M283N136O205P611
54909A26888Q930R768J0810J2844J4942J5235J3500J1254R167O238J954k577o292
54896B32661r454j2436j4668j5541j5255j4172j2383j0336q758p570o071m464
54884A01553l837m276m427l456k151j496j415j512j732j744r42L27P88P2o62o11
54868G4479n20j284k479l139k997k322j339m46j31k61k40p7l05p62o96k40l15
54851E6926q43o58L76Q51J00o61l74L03L95J89L21N37M24K88L78K94o6q6L17K85
$$ plain form
54831 59296 58946 58565 59353 61227 62779 63154 62806 62366 61929 61634 61780 62110 61961 61425 61470 62632 64358 65875
54813 65875 67000 67981 69183 70953 73191 75206 76697 78586 82025 86863 92113 97621 104099 111742 120199
54798 120199 129871 141783 155921 170947 185855 200628 214928 227504 237436 244823 249580 250709
54786 250709 247523 240754 231713 221067 209082 196370 183719 171626 160495 150830 142801 136123 130647
54773 130647 126537 123639 121393 119706 119185 120027 121342 122133 122479 123244 125023 127776 131163 134822 138605
54758 138605 142780 147850 154047 161276 169502 178725 188703 199253 210717 223299 235826 245990 252176
54745 252176 254411 253323 248959 241105 230152 217071 202919 188704 175338 163241 152167 141749
54733 141749 132016 123291 115844 109779 105004 101179 97858 94720 91550 88248 85110 82767 81382 80267
$$ packed form
54831E9296l50l81P88J874J552L75l48m40m37k95J46L30j49n36M5J162J726J517
54813F5875J125R81J202J770K238K015J491J889L439M838N250N508O478P643Q457
54798A20199R672J1912J4138J5026J4908J4773J4300J2576R932P387M757J129
54786B50709l186o769r041j0646j1985j2712j2651j2093j1131r665q029o678n476
54773A30647m110k898k246j687n21Q42J315P91L46P65J779K753L387L659L783
54758A38605M175N070O197P229Q226R223R978J0550J1464J2582J2527J0164O186
54745B52176K235j088m364p854j0953j3081j4152j4215j3366j2097j1074j0418
54733A41749r733q725p447o065m775l825l321l138l170l302l138k343j385j115
$$ plain form
54719 80267 78842 77561 77193 77555 77895 78225 79154 80447 80948 80252 79386 79386 80048 80546 80586 80418 80239 80007 79515
54700 79515 78473 76891 75443 74883 75061 75163 74948 75033 75788 76706 77117 76876 76119 75037 74125 73997 74653 75477
54682 75477 76114 76703 77196 77302 77371 78439 80906 83871 86311 88284 90455 92931 95211 96945 98280 99581
54666 99581 101082 102658 103835 104301 104426 104928 106061 107533 109129 110823 112358 113407 114281 115805 118322
54651 118322 121296 123951 125777 126455 125945 124727 123313 121545 118990 115895 112967 110306 107501 104729 102613
54636 102613 100884 98319 94473 90490 87727 86408 86005 86078 86261 86176 85868 85799 86079 86384 86749 87653 89051
54619 89051 90230 90913 91568 92286 92329 91286 89799 88644 87858 87232 86827 86555 86064 85452 85260 85421 85186 84417
54601 84417 83792 83313 81938 79390 76975 75651 74587 72798 71030 70559 71056 71162 70563 69972 69469 68457
$$ packed form
54719H0267j425j281l68L62L40L30R29J293N01o96q66%O62M98M0j68j79k32m92
54700G9515j042j582j448n60J78J02k15Q5P55R18M11k41p57j082r12j28O56Q24
54682G5477O37N89M93J06O9J068K467K965K440J973K171K476K280J734J335J301
54666I9581J501J576J177M66J25N02J133J472J596J694J535J049Q74J524K517
54651A18322K974K655J826O78n10j218j414j768k555l095k928k661k805k772k116
54636A02613j729k565l846l983k763j319m03P3J83q5l08o9K80L05L65R04J398
54619H9051J179O83O55P18M3j043j487j155p86o26m05k72m91o12j92J61k35p69
54601H4417o25m79j375k548k415j324j064j789j768m71M97J06n99n91n03j012
$$ plain form
54585 68457 67168 66765 67705 69094 69892 69936 69588 69139 68806 68816 69259 70079 71055 71623 71171 69982 69392 70432
54567 70432 72615 74610 75727 76172 76311 76422 76883 77842 78867 79520 80043 80889 81871 82413 82446 82406 82465 82387 82083
54548 82083 81797 81804 82241 83084 84100 85149 86674 89271 92457 94639 94940 94366 94418 95159 95514 94971 93971 92960
54530 92960 92034 91367 91077 90697 89574 87764 85912 84413 83297 82691 82602 82384 81304 79656 78581 78704 79571
54513 79571 80434 80992 81287 81462 81754 82329 82997 83417 83535 83564 83756 84443 85975 88160 90117 91220 91887 92866
54495 92866 94112 95059 95712 96672 98163 99750 100978 101641 101519 100584 99484 99135 99663 100322 100541 100529 100710 101058
54477 101058 101252 101167 101043 101250 101857 102391 102278 101703 101626 102630 104160 105338 106092 106882 107667 107893 107396 106654
54459 106654 106119 105754 105238 104283 102860 101442 100730 100818 100948 100469 99589 98733 97703 96220 94768 94055 93906
$$ packed form
54585F8457j289m03R40J389P98M4l48m49l33J0M43Q20R76N68m52j189n90J040
54567G0432K183J995J117M45J39J11M61R59J025O53N23Q46R82N42L3m0N9p8l04
54548H2083k86PM37Q43J016J049J525K597L186K182L01n74N2P41L55n43j000j011
54530I2960r26o67k90l80j123j810j852j499j116o06q9k18j080j648j075J23Q67
54513G9571Q63N58K95J75K92N75O68M20J18K9J92O87J532K185J957J103O67R79
54495I2866J246R47O53R60J491J587J228O63j22r35j100l49N28O59K19j2J81L48
54477A01058J94q5j24K07O07N34j13n75p7J004J530J178P54P90P85K26m97p42
54459A06654n35l65n16r55j423j418p12Q8J30m79q80q56j030j483j452p13j49
$$ plain form
54442 93906 93594 92999 92566 92294 91733 90997 90814 91470 92496 93440 94167 94344 93598 92418 92022 92920 94318 95309
54424 95309 95947 96653 97215 97070 96264 95477 95148 95062 94833 94511 94528 95160 96214 97360 98599 100131 101793 103133
54406 103133 104169 105608 107931 110692 113157 115282 117468 119681 121446 122626 123568 124545 125451 126065 126250
54391 126250 125993 125540 125284 125172 124491 122663 119980 117208 114787 112811 111393 110432 109426 108121 107016 106570
54375 106570 106255 105160 103275 101471 100372 99949 100018 100376 100630 100571 100541 100824 100972 100544 100119 100638 102030 103475
54357 103475 104793 106424 108102 108874 108590 108279 108766 109975 111774 114392 117493 119951 121109 121515 121885 122150
54341 122150 122056 121894 121952 121884 121262 120305 119437 118514 117035 114814 112043 108982 105929 103236 101055 99311 98014
54324 98014 97216 96578 95510 93959 92522 91567 90717 89438 87652 85525 83190 80956 79273 78200 77334 76497
$$ packed form
54442I3906l12n95m33k72n61p36j83O56J026R44P27J77p46j180l96Q98J398R91
54424I5309O38P06N62j45q06p87l29q6k29l22J7O32J054J146J239J532J662J340
54406A03133J036J439K323K761K465K125K186K213J765J180R42R77R06O14J85
54391A26250k57m53k56j12o81j828k683k772k421j976j418r61j006j305j105m46
54375A06570l15j095j885j804j099m23O9L58K54n9l0K83J48m28m25N19J392J445
54357A03475J318J631J678P72k84l11M87J209J799K618L101K458J158M06L70K65
54341A22150r4j62N8o8o22r57q68r23j479k221k771l061l053k693k181j744j297
54324I8014p98o38j068j551j437r55q50j279j786k127k335k234j683j073q66q37
$$ plain form
54308 76497 75928 75564 74840 73667 72992 73733 75520 77068 77519 76940 75777 74417 73218 72446 72006 71487 70554
54291 70554 69305 68229 67789 67896 67868 67183 66170 65646 65895 66436 66812 67119 67658 68475 69395 70223 70796 71132
54273 71132 71504 72040 72332 71875 70842 69929 69488 69380 69612 70408 71528 72277 72374 72184 71955 71563 71278 71860 73322
54254 73322 74326 73577 71474 69739 69596 70809 72288 73112 73010 72256 71230 70108 69018 68349 68517 69439
54238 69439 70620 71778 72928 73811 73855 72891 71426 70026 68882 68106 67882 68047 68060 67713 67369 67274 67151 66854
54220 66854 66864 67670 69023 70154 70434 69633 68003 66381 65697 66003 66454 66565 66886 67980 69319 69902 69581
54203 69581 69093 69034 69348 69725 69934 69871 69725 70005 71015 72406 73613 74577 75600 76527 76518 74801 71508 67701
54185 67701 64593 62678 61514 60417 59306 58680 58845 59499 60118 60440 60495 60500 60776 61469 62301 62956 63625 64706
$$ packed form
54308G6497n69l64p24j173o75P41J787J548M51n79j163j360j199p72m40n19r33
54291G0554j249j076m40J07k8o85j013n24K49N41L76L07N39Q17R20Q28N73L36
54273G1132L72N36K92m57j033r13m41j08K32P96J120P49R7j90k29l92k85N82J462
54254G3322J004p49k103j735j43J213J479Q24j02p54j026j122j090o69J68R22
54238F9439J181J158J150Q83M4r64j465j400j144p76k24J65J3l47l44r5j23k97
54220F6854J0Q06J353J131K80q01j630j622o84L06M51J11L21J094J339N83l21
54203F9581m88n9L14L77K09o3j46K80J010J391J207R64J023R27rj717l293l807
54185F7701l108j915j164j097j111o26J65O54O19L22N5NK76O93Q32O55O69J081
$$ plain form
54167 64706 65976 66705 66725 66720 67198 67805 67985 67756 67416 66991 66416 65867 65516 65327 65441 66286 67917 69643 70720
54148 70720 71064 70934 70389 69540 68856 68702 68830 68814 68696 68756 68931 68971 68918 68968 69090 69172 69287 69402 69169 68505 68044
54127 68044 68388 69121 69258 68633 68157 68546 69357 69594 68897 67770 66782 65945 65063 64425 64700 65980 67403 68153
54109 68153 68532 69418 70875 72043 72402 72332 72251 72073 71859 72160 73145 74052 74143 73692 73462 73674 74062 74496 74874
54090 74874 74789 73957 72745 71737 71029 70461 70244 70756 71881 73088 74026 74673 75155 75776 76898 78345 79324
54073 79324 79419 79262 79642 80335 80529 80085 79592 79334 78978 78288 77484 76817 76360 76244 76624 77319 77905 78160 78165 78074
54053 78074 78158 78878 80469 82538 84447 85966 87198 88120 88645 88967 89323 89619 89780 90258 91654 93965 96738
54036 96738 99796 103235 106833 110181 113350 116856 120911 125327 130174 135843 142228 148412 153571 157890
$$ packed form
54167F4706J270P29K0nM78O07J80k29l40m25n75n49l51j89J14Q45J631J726J077
54148G0720L44j30n45q49o84j54J28j6j18O0J75M0n3N0J22Q2J15J15k33o64m61
54127F8044L44P33J37o25m76L89Q11K37o97j127r88q37q82o38K75J280J423P50
54109F8153L79Q86J457J168L59p0q1j78k14L01R85R07R1m51k30K12L88M34L78
54090G4874q5q32j212j008p08n68k17N12J125J207R38O47M82O21J122J447R79
54073G9324R5j57L80O93J94m44m93k58l56o90q04o67m57j16L80O95N86K55Nr1
54053G8074Q4P20J591K069J909J519J232R22N25L22L56K96J61M78J396K311K773
54036I6738L058L439L598L348L169L506M055M416M847N669O385O184N159M319
$$ plain form
54022 157890 162283 167357 172770 177513 180846 183055 185211 187999 191057 193646 195608 197214 198352 198527
54008 198527 197584 195914 193914 191704 189367 187013 184540 181674 178262 174315 169880 165264 161204 158256
53994 158256 156071 153724 150729 147311 143781 140181 136598 133343 130671 128662 127362 126659 126062 125005 123430
53979 123430 121714 120067 118415 116771 115230 113658 111935 110475 109911 110151 110408 110304 110376 111138 112227 112915
53963 112915 113086 113231 113634 114022 114066 113966 114373 115742 117763 119607 120864 122030 123828 126258 128680 130758
53947 130758 132808 135198 137946 141058 144824 149411 154393 159005 162830 166046 169033 171853 174097 175233
53933 175233 175040 173672 171372 168351 165081 162322 160579 159643 158931 158138 157400 156980 157082 157772 158863 160095
53917 160095 161745 164697 169497 175508 181530 187110 192745 198856 205178 211294 217274 223521 230252 237342
$$ packed form
54022A57890M393N074N413M743L333K209K156K788L058K589J962J606J138J75
54008A98527r43j670k000k210k337k354k473k866l412l947m435m616m060k948
53994A58256k185k347k995l418l530l600l583l255k672k009j300p03n97j057j575
53979A23430j716j647j652j644j541j572j723j460n64K40K57j04P2P62J089O88
53963A12915J71J45M03L88M4j00M07J369K021J844J257J166J798K430K422K078
53947A30758K050K390K748L112L766M587M982M612L825L216K987K820K244J136
53933A75233j93j368k300l021l270k759j743r36p12p93p38m20J02O90J091J232
53917A60095J650K952M800O011O022N580N635O111O322O116N980O247O731P090
$$ plain form
53903 237342 244501 251489 258182 264412 269714 273494 275613 276568 276853 276403 274979 272790 270307 267670 264739
53888 264739 261628 258643 255794 252781 249368 245406 240637 234971 228841 222759 216632 210052 203185 196776
53874 196776 191208 186123 181039 175846 170596 165384 160631 156974 154561 152692 150366 147009 142740 138260
53860 138260 134486 131903 130101 128242 125938 123401 120897 118520 116501 115154 114356 113544 112440 111434 111058
53845 111058 111314 111668 111468 110405 108803 107456 106891 106856 106820 106771 107025 107386 107173 106148 104894 104124 104077 104725
53827 104725 105954 107362 108398 108989 109630 110572 111397 111726 112003 113127 115489 118639 121759 124200 125702 126412
53811 126412 126753 127201 128062 129346 130743 131905 132899 134176 135886 137505 138529 139306 140634 142705 145049
53796 145049 147522 150633 154726 159398 164073 168698 173461 178144 182172 185259 187718 190106 192666 195223
$$ packed form
53903B37342P159O988O693O230N302L780K119R55K85m50j424k189k483k637k931
53888B64739l111k985k849l013l413l962m769n666o130o082o127o580o867o409
53874A96776n568n085n084n193n250n212m753l657k413j869k326l357m269m480
53860A38260l774k583j802j859k304k537k504k377k019j347p98q12j104j006l76
53845A11058K56L54k00j063j602j347n65l5l6m9K54L61k13j025j254p70m7O48
53827A04725J229J408J036N91O41R42Q25L29K77J124K362L150L120K441J502P10
53811A26412L41M48Q61J284J397J162R94J277J710J619J024P77J328K071K344
53796A45049K473L111M093M672M675M625M763M683M028L087K459K388K560K557
$$ plain form
53782 195223 197570 199852 202319 204728 206369 206835 206383 205337 203602 201156 198483 196015 193586 191007 188685
53767 188685 186912 185006 182144 178738 175929 173851 171557 168666 165901 163774 161851 159767 157917 156567
53753 156567 155211 153442 151668 150307 149026 147544 146504 146620 147370 147460 146430 145037 144087 143558 142927 141841
53737 141841 140282 138410 136417 134495 132873 131809 131336 131038 130349 129144 127773 126535 125503 124873 124951 125595
53721 125595 126154 126191 125904 125598 125238 124819 124755 125495 126963 128707 130395 131905 133200 134372 135649 137168 138889
53704 138889 140791 142905 145041 146775 147848 148379 148657 149013 149872 151515 153753 156140 158540 161107 163873
53689 163873 166846 170365 174666 179089 182532 184830 186922 189446 192059 194443 197119 200630 204701 208780
53675 208780 212790 216644 219645 221205 221868 222852 224736 227163 229566 231590 232954 233526 233585 233557 233554 233434 233180
$$ packed form
53782A95223K347K282K467K409J641M66m52j046j735k446k673k468k429k579k322
53767A88685j773j906k862l406k809k078k294k891k765k127j923k084j850j350
53753A56567j356j769j774j361j281j482j040J16P50R0j030j393r50n29o31j086
53737A41841j559j872j993j922j622j064m73k98o89j205j371j238j032o30P8O44
53721A25595N59L7k87l06l60m19o4P40J468J744J688J510J295J172J277J519J721
53704A38889J902K114K136J734J073N31K78L56Q59J643K238K387K400K567K766
53689A63873K973L519M301M423L443K298K092K524K613K384K676L511M071M079
53675B08780M010L854L001J560O63R84J884K427K403K024J364N72N9k8lj20k54
$$ plain form
53658 233180 232838 232260 231273 230086 229201 228965 229375 230224 231229 232131 232763 232991 232712 232127 231883 232437 233313 233577
53640 233577 233114 232802 233246 233975 234176 233638 232645 231532 230709 230527 230759 230803 230755 231517 233363 235194 236009 236406
53622 236406 237696 240006 242275 243917 245521 247846 250941 254335 257516 260145 262287 264468 267120 269984
53608 269984 272519 274839 277763 281835 286664 291355 295350 298856 302590 307136 312444 318071 323854 329994
53594 329994 336393 342364 347329 351484 355474 359677 364016 368182 371901 375287 379043 383807 389147 393808
53580 393808 397246 400252 403687 407318 410442 413014 415397 417528 419095 420226 421298 422271 422828 422904 422620
53565 422620 421974 421102 420401 419896 418952 417253 415571 414829 414828 414725 414332 414028 413706 412852 411530 410299 409173 407645
53547 407645 405812 404577 404513 405268 406246 407213 408076 408723 409330 410289 411658 413183 414849 416811 418738 419955
$$ packed form
53658B33180l42n78r87j187q85k36M10Q49J005R02O32K28k79n85k44N54Q76K64
53640B33577m63l12M44P29K01n38r93j113q23j82K32M4m8P62J846J831Q15L97
53622B36406J290K310K269J642J604K325L095L394L181K629K142K181K652K864
53608B69984K535K320K924M072M829M691L995L506L734M546N308N627N783O140
53594C29994O399N971M965M155L990M203M339M166L719L386L756M764N340M661
53580C93808L438L006L435L631L124K572K383K131J567J131J072R73N57P6k84
53565D22620o46q72p01n05r44j699j682p42jj03l93l04l22q54j322j231j126j528
53547D07645j833j235o4P55R78R67Q63O47O07R59J369J525J666J962J927J217
$$ plain form
53531 419955 420509 421480 423874 427641 432033 436526 441074 445794 450790 456180 462026 468208 474405 480256 485765
53516 485765 491553 498392 506275 514385 522279 530671 540578 552145 564852 578429 592815 607516 621931
53503 621931 636310 651618 668356 686130 704402 723024 742016 761432 781597 802905 825291
53492 825291 848369 872086 896699 922066 947525 972587 997222 1021426 1045094 1068465 1092170
53481 1092170 1116625 1141776 1167504 1193864 1220852 1248353 1276384 1304950 1333633 1361727 1388828
53470 1388828 1414872 1439627 1462614 1483581 1502658 1520087 1536215 1551604 1566615 1580898 1593915
53459 1593915 1605919 1617869 1630345 1643107 1655596 1667185 1676952 1683961 1687923 1688978 1686864 1681186
53447 1681186 1672549 1662418 1651450 1638802 1623502 1605705 1586071 1564804 1542098 1518833 1495822
$$ packed form
53531D19955N54R71K394L767M392M493M548M720M996N390N846O182O197N851N509
53516D85765N788O839P883Q110P894Q392R907J1567J2707J3577J4386J4701J4415
53503F21931J4379J5308J6738J7774J8272J8622J8992J9416K0165K1308K2386
53492H25291K3078K3717K4613K5367K5459K5062K4635K4204K3668K3371K3705
53481A092170K4455K5151K5728K6360K6988K7501K8031K8566K8683K8094K7101
53470A388828K6044K4755K2987K0967J9077J7429J6128J5389J5011J4283J3017
53459A593915J2004J1950J2476J2762J2489J1589R767P009L962J055k114n678
53447A681186q637j0131j0968j2648j5300j7797j9634k1267k2706k3265k3011
$$ plain form
53436 1495822 1472609 1447960 1421482 1394041 1366566 1339151 1311521 1283797 1256421 1229636 1203406
53425 1203406 1177745 1152853 1128952 1106212 1084911 1065346 1047434 1030613 1014510 999650 987108
53414 987108 977436 970338 965464 962965 963060 965614 970492 977812 987377 998446 1010622 1024512 1040806 1059136
53400 1059136 1078657 1099481 1122602 1148442 1176237 1204900 1233900 1263370 1293990 1326730 1362128
53389 1362128 1399857 1439469 1481209 1525465 1571868 1619913 1670243 1724146 1781760 1841828 1903350
53378 1903350 1966432 2031251 2097231 2163644 2230169 2296532 2362436 2428165 2494343 2560665 2625671
53367 2625671 2688206 2748265 2805941 2860414 2910669 2956544 2998509 3037045 3072821 3106812 3139497
53356 3139497 3170339 3198510 3223719 3245863 3264427 3278762 3288441 3292825 3290721 3281038 3263357 3237472
$$ packed form
53436A495822k3213k4649k6478k7441k7475k7415k7630k7724k7376k6785k6230
53425A203406k5661k4892k3901k2740k1301j9565j7912j6821j6103j4860j2542
53414I87108r672p098m874k499R5K554M878P320R565J1069J2176J3890J6294J8330
53400A059136J9521K0824K3121K5840K7795K8663K9000K9470L0620L2740L5398
53389A362128L7729L9612M1740M4256M6403M8045N0330N3903N7614O0068O1522
53378A903350O3082O4819O5980O6413O6525O6363O5904O5729O6178O6322O5006
53367B625671O2535O0059N7676N4473N0255M5875M1965L8536L5776L3991L2685
53356C139497L0842K8171K5209K2144J8564J4335R679M384k104r683j7681k5885
$$ plain form
53344 3237472 3202914 3159517 3108018 3049564 2985195 2916347 2845300 2774263 2704199 2635113 2567131
53333 2567131 2500611 2435446 2371050 2307037 2243503 2180746 2119069 2058576 1998709 1938333 1876942
53322 1876942 1815625 1756298 1700068 1646822 1596280 1548771 1504908 1464996 1428960 1396495 1367126
53311 1367126 1340318 1315705 1293207 1272929 1254901 1238798 1223991 1210161 1197814 1187793 1180181
53300 1180181 1174129 1168935 1164759 1162076 1160954 1161275 1163171 1166700 1171440 1176877 1183016 1190132 1198174 1206936
53286 1206936 1216680 1228138 1241829 1257718 1275552 1295321 1317385 1342190 1369751 1399336 1429918
53275 1429918 1461006 1492786 1525300 1557832 1589275 1618900 1646683 1673200 1699283 1725400 1751165
53264 1751165 1775772 1798944 1821054 1842255 1862116 1880303 1896986 1912271 1925783 1937218 1946767
$$ packed form
53344C237472l4558m3397n1499n8454o4369o8848p1047p1037p0064o9086o7982
53333B567131o6520o5165o4396o4013o3534o2757o1677o0493n9867o0376o1391
53322A876942o1317n9327n6230n3246n0542m7509m3863l9912l6036l2465k9369
53311A367126k6808k4613k2498k0278j8028j6103j4807j3830j2347j0021p612
53300A180181o052n194m176k683j122L21J896L529M740N437O139P116Q042Q762
53286A206936R744J1458J3691J5889J7834J9769K2064K4805K7561K9585L0582
53275A429918L1088L1780L2514L2532L1443K9625K7783K6517K6083K6117K5765
53264A751165K4607K3172K2110K1201J9861J8187J6683J5285J3512J1435R549
$$ plain form
53253 1946767 1954472 1959606 1961158 1958583 1951719 1940376 1924515 1904487 1880622 1852859 1821184 1786138
53241 1786138 1748551 1709074 1668321 1626995 1585423 1543340 1500675 1458275 1417361 1378487 1341409
53230 1341409 1305678 1270971 1237105 1204131 1172114 1140499 1108091 1074146 1039127 1003963 968945
53219 968945 933838 898747 864330 831365 800566 772488 747124 723829 702081 682076 664167
53208 664167 648154 633573 620252 608000 596094 583797 571127 558522 545963 533031 519639
53197 519639 506182 493104 480780 469514 459132 448918 438512 428545 419701 411519 402911 393640
53185 393640 384409 375591 366761 357532 348116 338910 330150 322034 314578 307272 299480 291322 283669 277144
53171 277144 271561 266363 261195 256074 251428 247903 245595 243551 240634 236898 233522 231261 229550 227271
$$ packed form
53253A946767P705N134J552k575o864j1343j5861k0028k3865k7763l1675l5046
53241A786138l7587l9477m0753m1326m1572m2083m2665m2400m0914l8874l7078
53230A341409l5731l4707l3866l2974l2017l1615l2408l3945l5019l5164l5018
53219I68945l5107l5091l4417l2965l0799k8078k5364k3295k1748k0005j7909
53208F64167j6013j4581j3321j2252j1906j2297j2670j2605j2559j2932j3392
53197E19639j3457j3078j2324j1266j0382j0214j0406r967q844q182q608r271
53185C93640r231q818q830r229r416r206q760q116p456p306p792q158p653o525
53171B77144n583n198n168n121m646l525k308k044k917l736l376k261j711k279
$$ plain form
53157 227271 223924 219877 215938 212894 211114 210404 210352 210736 211308 211423 210437 208439 206134 203935 201657 199212
53141 199212 197122 196158 196696 198395 200252 201094 200445 198932 197539 196653 196131 195985 196354 196936 197193 197109 197149 197440
53123 197440 197692 198029 199092 201051 203131 204580 205542 206541 207524 207951 207594 206767 205867 205063 204384 203790 203106
53106 203106 202090 200683 199011 197132 194859 192026 188866 185954 183601 181467 179045 176337 173737 171300
53092 171300 168639 165635 162723 160258 158077 155939 153948 152278 150905 149885 149385 149143 148478 147207 145923
53077 145923 144890 143397 140909 138222 136588 136150 136096 135972 135922 135931 135764 135514 135365 135036 134295 133770 134249 135365
53059 135365 136072 136267 136797 137821 138436 138212 137896 138096 138274 137694 136516 135308 134089 132530 130659 128834
53043 128834 127324 126281 125757 125465 124840 123661 122353 121549 121613 122533 123838 124623 124228 122917 121444 120074
$$ packed form
53157B27271l347m047l939l044j780p10n2L84N72J15r86j998k305k199k278k445
53141A99212k090r64N38J699J857Q42o49j513j393q86n22j46L69N82K57q4M0K91
53123A97440K52L37J063J959K080J449R62R99R83M27l57q27r00q04o79n94o84
53106B03106j016j407j672j879k273k833l160k912k353k134k422k708k600k437
53092A71300k661l004k912k465k181k138j991j670j373j020n00k42o65j271j284
53077A45923j033j493k488k687j634m38n4j24n0Rj67k50j49l29p41n25M79J116
53059A35365P07J95N30J024O15k24l16K00J78n80j178j208j219j559j871j825
53043A28834j510j043n24k92o25j179j308q04O4R20J305P85l95j311j473j370
$$ plain form
53027 120074 118709 117759 117889 118780 119151 118438 117552 117488 117945 117934 117094 115808 114509 113447 112795 112497 112219 111733
53009 111733 111086 110330 109517 109049 109363 110145 110570 110570 111041 112405 113746 114038 113515 113192 113512 114136 114704 115145 115503
52990 115503 115932 116659 117654 118629 119516 120442 121094 120871 120055 119958 121311 123287 124856 126355 128762 132050 135323
52973 135323 138184 140854 143175 144660 145592 147014 149345 151763 153270 153783 153966 154505 155637 156911 157272
52958 157272 155876 153076 150235 148440 147725 147581 147707 148081 148666 149354 149998 150379 150286 149717 148856 147845 146782
52941 146782 145907 145528 145678 146050 146308 146325 146173 146015 146000 146059 145871 145232 144482 144333 145232 146946 148750 149967 150455
52922 150455 150714 151437 152815 154404 155720 156699 157436 157780 157618 157377 157743 158821 159996 160730 161187 161859 162820
52905 162820 163653 164029 164064 164057 164099 164176 164517 165470 166902 168033 168238 167846 167774 168425 169367 170161 170988 172191 173556
$$ packed form
53027A20074j365r50J30Q91L71p13q86o4M57j1q40j286j299j062o52k98k78m86
53009A11733o47p56q13m68L14P82M25%M71J364J341K92n23l23L20O24N68M41L58
52990A15503M29P27R95R75Q87R26O52k23q16r7J353J976J569J499K407L288L273
52973A35323K861K670K321J485R32J422K331K418J507N13J83N39J132J274L61
52958A57272j396k800k841j795p15j44J26L74N85O88O44L81r3n69q61j011j063
52941A46782q75l79J50L72K58J7j52j58j5N9j88o39p50j49Q99J714J804J217M88
52922A50455K59P23J378J589J316R79P37L44j62k41L66J078J175P34M57O72R61
52905A62820Q33L76L5pM2P7L41R53J432J131K05l92p2O51R42P94Q27J203J365
$$ plain form
52886 173556 174458 174623 174439 174489 174987 175715 176422 177184 178240 179498 180451 180713 180411 179795 178801 177408 176188 175878
52868 175878 176489 177492 178805 180809 183268 185134 185883 186315 187369 188740 189457 189438 189714 191166 193697 196662
52852 196662 199561 202244 204854 207698 210849 213810 215861 216804 217123 217322 217318 216644 215093 212970 210694 208313
52836 208313 205587 202549 199732 197634 196168 194877 193517 192047 190170 187450 183952 180378 177401 175172
52822 175172 173488 172053 170582 169078 168017 167760 167767 167048 165462 163871 162787 161718 160294 159156 159000 159310
52806 159310 158939 157617 156106 155049 154392 153807 153056 151943 150496 149182 148442 148060 147375 146082 144399 142547
52790 142547 140562 138593 136893 135474 134175 133068 132392 132029 131459 130352 128868 127251 125468 123396 121179
52775 121179 119247 118060 117772 118013 118051 117435 116479 115906 116014 116345 116206 115389 114314 113552 113168 112560 111060 108765
$$ packed form
52886A73556R02J65j84N0M98P28P07P62J056J258R53K62l02o16r94j393j220l10
52868A75878O11J003J313K004K459J866P49M32J054J371P17j9K76J452K531K965
52852A96662K899K683K610K844L151K961K051R43L19J99mo74j551k123k276k381
52836B08313k726l038k817k098j466j291j360j470j877k720l498l574k977k229
52822A75172j684j435j471j504j061k57Pp19j586j591j084j069j424j138j56L10
52806A59310l71j322j511j057o57n85p51j113j447j314p40l82o85j293j683j852
52790A42547j985j969j700j419j299j107o76l63n70j107j484j617j783k072k217
52775A21179j932j187k88K41L8o16r56n73J08L31j39q17j075p62l84o08j500k295
$$ plain form
52757 108765 106584 105360 105122 105303 105387 105104 104243 102687 100689 98826 97583 96990 96696 96311 95717 95067 94482
52740 94482 93887 93269 92943 93266 94106 94950 95551 96104 96723 97104 96889 96096 95116 94509 94768 95823 96775 96627 95425
52721 95425 94206 93681 93528 93164 92596 92076 91535 90907 90599 91029 91902 92402 92077 91231 90601 90817 91955 93468
52703 93468 94744 95787 97006 98363 99349 99928 100735 102037 103227 103812 104202 104897 105527 105435 104732 104086 103794
52686 103794 103773 104071 104674 105051 104553 103136 101180 98902 96503 94571 93657 93648 94075 94718 95454 95913 95919 95917 96270
52667 96270 96584 96446 96324 96804 97287 96609 94812 93224 92686 92748 92772 92830 93141 93477 93612 93746 94103 94620 95340
52648 95340 96594 98447 100382 101894 103154 104793 107189 110098 112829 114777 115966 117092 118938 121838
52634 121838 125786 130633 135884 140669 144381 147033 148613 148549 146440 142908 138996 135059 131001 127287 124799
$$ packed form
52757A08765k181j224k38J81Q4k83q61j556j998j863j243n93k94l85n94o50n85
52740I4482n95o18l26L23Q40Q44O01N53O19L81k15p93r80o07K59J055R52j48j202
52721I5425j219n25j53l64n68n20n41o28l08M30Q73N00l25q46o30K16J138J513
52703I3468J276J043J219J357R86N79Q07J302J190N85L90O95O30r2p03o46k92
52686A03794k1K98O03L77m98j417j956k278k399j932r14rM27O43P36M59OkL53
52667I6270L14j38j22M80M83o78j797j588n38O2K4N8L11L36J35J34L57N17P20
52648I5340J254J853J935J512J260J639K396K909K731J948J189J126J846K900
52634A21838L948M847N251M785L712K652J580o4k109l532l912l937m058l714k488
$$ plain form
52619 124799 123741 123502 123523 123583 123439 123065 123106 124132 125483 125888 125318 125124 126108 127502 128259 128358 128307 128232 128130
52600 128130 128413 129466 131031 132452 133261 133336 132919 132734 133523 135193 136820 137715 137965 137807 137133 135983 134874
52583 134874 134240 134002 134052 134647 135907 137337 138238 138336 137812 137168 137193 138501 140762 142890 144321 145602 147399
52566 147399 149439 150885 151337 151023 150396 149931 150010 150582 151165 151418 151462 151477 151408 151307 151486 151989 152397 152499 152797
52547 152797 153847 155433 156822 157652 158224 159058 160390 161969 163215 163785 164053 164673 165631 166213 166058 165743 166048
52530 166048 167094 168459 169712 170559 170883 170982 171419 172414 173755 175348 177232 178803 178813 176766 173785 171514
52514 171514 170554 170449 170723 171220 171673 171663 170974 169627 167718 165657 164200 163736 163716 163274 162295 161353 160690 159832
52496 159832 158275 156107 153850 151987 150720 149974 149491 148987 148306 147449 146610 146142 146269 146779 147158 147066 146458
$$ packed form
52619A24799j058k39K1O0j44l74M1J026J351M05n70j94R84J394P57R9n1p5j02
52600A28130K83J053J565J421Q09P5m17j85P89J670J627Q95K50j58o74j150j109
52583A34874o34k38N0N95J260J430R01R8n24o44K5J308K261K128J431J281J797
52566A47399K040J446M52l14o27m65P9N72N83K53M4J5o9j01J79N03M08J02K98
52547A52797J050J586J389Q30N72Q34J332J579J246N70K68O20R58N82j55l15L05
52530A66048J046J365J253Q47L24R9M37R95J341J593J884J571J0k047k981k271
52514A71514r60j05K74M97M53j0o89j347j909k061j457m64k0m42r79r42o63q58
52496A59832j557k168k257j863j267p46m83n04o81q57q39m68J27N10L79r2o08
$$ plain form
52479 146458 145408 144197 143532 144069 145519 146764 147066 146729 146392 146288 146510 147357 148852 150318 151004 150895 150455
52462 150455 149924 149322 148843 148639 148404 147738 146860 146488 147018 148169 149455 150644 151745 152826 153990 155352
52446 155352 156990 158843 160605 161805 162279 162501 163145 164320 165656 167071 168866 170962 172709 173857 175076
52431 175076 177079 179682 182234 184486 186465 187839 188151 187616 187132 187446 188633 190314 192057 193545 194588
52416 194588 195020 194655 193613 192655 192693 193775 194979 195528 195529 195401 195216 195042 195350 196422 197796 198894 199834 201030
52398 201030 202338 203295 203879 204334 204505 204131 203732 204330 206115 208059 209054 208935 208206 207331 206601 206342 206818 208012
52380 208012 209669 211506 213335 215046 216573 217854 218875 219736 220598 221537 222593 223914 225540 227038 227730
52365 227730 227447 226788 226538 227074 228391 230215 231903 232722 232611 232368 232810 234002 235507 236983 238322 239577
$$ packed form
52479A46458j050j211o65N37J450J245L02l37l37j04K22Q47J495J466O86j09m40
52462A50455n31o02m79k04k35o66q78l72N30J151J286J189J101J081J164J362
52446A55352J638J853J762J200M74K22O44J175J336J415J795K096J747J148J219
52431A75076K003K603K552K252J979J374L12n35m84L14J187J681J743J488J043
52416A94588M32l65j042r58L8J082J204N49Jj28j85j74L08J072J374J098R40J196
52398B01030J308R57N84M55J71l74l99N98J785J944R95j19p29q75p30k59M76J194
52380B08012J657J837J829J711J527J281J021Q61Q62R39J056J321J626J498O92
52365B27730k83o59k50N36J317J824J688Q19j11k43M42J192J505J476J339J255
$$ plain form
52349 239577 241000 242796 244605 245744 246162 246594 247459 248306 248732 249147 249985 250812 251000 250789 250819 251037 250955 250766
52331 250766 251199 252287 253161 253238 252960 253117 253934 255033 255939 256451 256708 256961 257257 257502 257892 258882 260565 262497
52313 262497 264420 266618 269212 271709 273791 276009 279044 282754 286646 290855 295822 301358 306904 312530
52299 312530 318838 325944 333314 340529 347520 354218 360673 367507 375489 384629 394254 403896 413540 423178
52285 423178 432851 442990 454029 465734 477580 489601 502091 514621 526275 536801 546653 555901
52273 555901 564098 571370 578689 586710 595085 603177 610710 617430 622938 627295 631232 635344 639546 643535
52259 643535 647227 650410 652515 653192 652824 652237 652144 652962 654678 656720 658328 659251 659793 660223 660583 661015 661736
52242 661736 662703 663856 665710 669079 674087 680040 686363 693124 700542 708562 717022 725678 734057 741972
$$ packed form
52349B39577J423J796J809J139M18M32Q65Q47M26M15Q38Q27J88k11L0K18q2j89
52331B50766M33J088Q74P7k78J57Q17J099R06N12K57K53K96K45L90R90J683J932
52313B62497J923K198K594K497K082K218L035L710L892M209M967N536N546N626
52299C12530O308P106P370P215O991O698O455O834P982R140R625R642R644R638
52285D23178R673J0139J1039J1705J1846J2021J2490J2530J1654J0526R852R248
52273E55901Q197P272P319Q021Q375Q092P533O720N508M357L937M112M202L989
52259F43535L692L183K105O77l68n87r3Q18J716K042J608R23N42M30L60M32P21
52242F61736R67J153J854L369N008N953O323O761P418Q020Q460Q656Q379P915
$$ plain form
52228 741972 750174 759729 770613 781728 792404 802982 813662 823821 832985 841627 850319 858789 866449
52215 866449 873313 879717 885623 890850 895514 899652 902837 904786 906001 907028 907386 905995 902619 898228
52201 898228 893802 889361 884390 878862 873521 869163 865841 862886 859718 856367 853047 849556 845558 841330
52187 841330 837630 834862 832919 831813 831745 832362 832630 831813 830111 828110 826078 824167 822684 821710 820780 819393
52171 819393 817582 815717 814024 812541 811220 809817 808047 806089 804551 803717 803163 802365 801240 799827 797900
52156 797900 795312 792327 789237 785975 782503 779283 776874 775198 773514 771069 767621 763534 759548 756268
52142 756268 753695 751284 748407 744600 739612 733755 728038 723342 719412 715276 710651 706220 702507 699349
52128 699349 696624 694499 692554 689664 685371 680557 676060 671461 666019 660136 654854 650384 646079 641643
$$ packed form
52228G41972Q202R555J0884J1115J0676J0578J0680J0159R164Q642Q692Q470P660
52215H66449O864O404N906N227M664M138L185J949J215J027L58j391l376m391
52201H98228m426m441m971n528n341m358l322k955l168l351l320l491l998m228
52187H41330l700k768j943j106o8O17K68q17j702k001k032j911j483r74r30j387
52171H19393j811j865j693j483j321j403j770j958j538q34n54p98j125j413j927
52156G97900k588k985l090l262l472l220k409j676j684k445l448m087l986l280
52142G56268k573k411k877l807m988n857n717m696l930m136m625m431l713l158
52128F99349k725k125j945k890m293m814m497m599n442n883n282m470m305m436
$$ plain form
52114 641643 637529 634297 632242 631447 631566 631771 631611 631725 633051 635520 638219 640706 643425 646838 650881
52099 650881 655442 660760 667118 674440 682341 690492 699001 708565 719993 733329 747785 762780 778598
52086 778598 795573 813066 829899 845527 860236 874503 888771 903563 918950 934005 947538
52075 947538 959399 970421 981089 990937 999383 1006474 1012579 1017838 1022194 1025596 1028003 1029413 1029962 1029747
52061 1029747 1028618 1026468 1023609 1020445 1016852 1012400 1007151 1001721 996475 991229 985925 981044 977003 973498
52047 973498 969776 965369 960406 955445 951206 948239 946540 945561 944743 944034 943787 944266 945370 946870 948763
52032 948763 951253 954371 957805 961262 964829 968703 972693 976366 979645 982803 985865 988513 990697 992700
52018 992700 994399 995124 994656 993719 992943 991960 990190 987934 985863 983802 980913 976854 971792 965431 957042
$$ packed form
52114F41643m114l232k055p95J19K05j60J14J326K469K699K487K719L413M043
52099F50881M561N318O358P322P901Q151Q509R564J1428J3336J4456J4995J5818
52086G78598J6975J7493J6833J5628J4709J4267J4268J4792J5387J5055J3533
52075I47538J1861J1022J0668R848Q446P091O105N259M356L402K407J410N49k15
52061A029747j129k150k859l164l593m452n249n430n246n246n304m881m041l505
52047I73498l722m407m963m961m239k967j699r79q18p09k47M79J104J500J893
52032I48763K490L118L434L457L567L874L990L673L279L158L062K648K184K003
52018I92700J699P25m68r37p76r83j770k256k071k061k889m059n062o361q389
$$ plain form
52003 957042 946576 934866 922468 909085 894447 879051 863561 847975 831829 814916 797474
$$ packed form
52003I57042j0466j1710j2398j3383j4638j5396j5490j5586j6146j6913j7442
$$ [...]
##END NTUPLES=NMR SPECTRUM
##END=
