
##TITLE=AC1334_VIERS11074_6524662_oITXw8HV29
##JCAMPDX= 6.0         $$ Bruker NMR JCAMP-DX V2.0
##DATA TYPE= NMR SPECTRUM
##DATA CLASS= NTUPLES
##ORIGIN= BRUKER
##OWNER= Administrator
$$ 1.72 TOPSPIN		Version 2.1
$$ 2012-07-14 22:51:15.781 -0500  Administrator@TOPSPIN
$$ Compression mode = diff/dup
##.OBSERVE FREQUENCY= 400.02188249412
##.OBSERVE NUCLEUS= ^1H
##.ACQUISITION MODE= SIMULTANEOUS (DQD)
##.ACQUISITION SCHEME= undefined
##.AVERAGES= 8
##.DIGITISER RES= 22
##SPECTROMETER/DATA SYSTEM= spect
##.PULSE SEQUENCE= zg30
##.SOLVENT NAME= COFFEE_meoh
##.SHIFT REFERENCE= INTERNAL, COFFEE_meoh, 1, 14.98509
##AUDIT TRAIL= $$ (NUMBER, WHEN, WHO, WHERE, PROCESS, VERSION, WHAT)
$$ ##TITLE= Audit trail, TOPSPIN		Version 2.1
$$ ##JCAMPDX= 5.01
$$ ##ORIGIN= Bruker BioSpin GmbH
$$ ##OWNER= Administrator
$$ $$ C:\Bruker\TOPSPIN/data/COFFEE/nmr/AC1334_VIERS11074_6524662_oITXw8HV29/10/pdata/1/auditp.txt
$$ ##AUDIT TRAIL=  $$ (NUMBER, WHEN, WHO, WHERE, PROCESS, VERSION, WHAT)
(   1,<2012-07-14 22:51:09.062 -0500>,<Administrator>,<TOPSPIN>,<go>,<TOPSPIN 2.1>,
      <created by zg
	started at 2012-07-14 22:50:02.609 -0500,
	POWCHK enabled, PULCHK disabled,
       configuration hash MD5:
       6B 1B 68 BB D9 2E 58 E2 7F 35 AD 54 07 DF 0E 41
       data hash MD5: 64K
       60 81 70 35 C5 A3 92 9B A4 34 44 9F 92 4E E1 11>)
(   2,<2012-07-14 22:51:11.687 -0500>,<Administrator>,<TOPSPIN>,<proc1d>,<TOPSPIN 2.1>,
      <Start of raw data processing
       efp LB = 0 FT_mod = 6 PKNL = 1 PHC0 = 0 PHC1 = 0 SI = 32K 
       data hash MD5: 32K
       7B AD 5E D8 CB C8 64 A0 BD 24 B7 B4 78 6C 46 18>)
(   3,<2012-07-14 22:51:12.046 -0500>,<Administrator>,<TOPSPIN>,<proc1d>,<TOPSPIN 2.1>,
      <pk PHC0 = 177.2754 PHC1 = 0 
       data hash MD5: 32K
       8D 86 BD E8 E9 A6 26 70 65 97 54 76 DE ED 25 09>)
(   4,<2012-07-14 22:51:12.140 -0500>,<Administrator>,<TOPSPIN>,<proc1d>,<TOPSPIN 2.1>,
      <abs ABSG = 1 
       data hash MD5: 32K
       8C 96 60 B6 EE A9 0F A4 09 C4 0B 6C F1 B7 34 48>)
(   5,<2012-07-14 22:51:12.218 -0500>,<Administrator>,<TOPSPIN>,<proc1d>,<TOPSPIN 2.1>,
      <abs ABSG = 2 
       data hash MD5: 32K
       7B 6B EE 9E BA 99 EA 98 EB 51 49 0A 25 3D CB ED>)
(   6,<2012-07-14 22:51:12.250 -0500>,<Administrator>,<TOPSPIN>,<proc1d>,<TOPSPIN 2.1>,
      <abs ABSG = 3 
       data hash MD5: 32K
       90 8B 97 2E 4F AB F5 59 C1 4F 76 84 3E E9 D6 EB>)
(   7,<2012-07-14 22:51:12.281 -0500>,<Administrator>,<TOPSPIN>,<proc1d>,<TOPSPIN 2.1>,
      <abs ABSG = 4 
       data hash MD5: 32K
       C6 23 1C 7F 0B A2 DB 9C 5C EA D0 28 3C 6B 81 00>)
(   8,<2012-07-14 22:51:12.312 -0500>,<Administrator>,<TOPSPIN>,<proc1d>,<TOPSPIN 2.1>,
      <abs ABSG = 5 
       data hash MD5: 32K
       94 11 F5 CA 75 8E 8E 4B C7 4D BA DE 67 98 49 7D>)
$$ ##END=
$$ 
$$ $$ hash MD5
$$ $$ BE 94 95 DF 4B DC 0A F9 7C E1 3B 9C 2C 77 A9 EB
##$RELAX= 
##$RELAX= 
##$RELAX= 
##$RELAX= 
##$RELAX= 
##$RELAX= 
##$RELAX= 
$$ Bruker specific parameters
$$ --------------------------
$$ [...]
150 150 150 150 150 150 150 150
##$TP07= 0
##$TPNAME0= <>
##$TPNAME1= <>
##$TPNAME2= <>
##$TPNAME3= <>
##$TPNAME4= <>
##$TPNAME5= <>
##$TPNAME6= <>
##$TPNAME7= <>
##$TPOAL= (0..7)
0.5 0.5 0.5 0.5 0.5 0.5 0.5 0.5
##$TPOFFS= (0..7)
0 0 0 0 0 0 0 0
##$TUNHIN= 0
##$TUNHOUT= 0
##$TUNXOUT= 0
##$USERA1= <user>
##$USERA2= <user>
##$USERA3= <user>
##$USERA4= <user>
##$USERA5= <user>
##$V9= 5
##$VALIST= <valist>
##$VCLIST= <CCCCCCCCCCCCCCC>
##$VD= 0
##$VDLIST= <DDDDDDDDDDDDDDD>
##$VPLIST= <PPPPPPPPPPPPPPP>
##$VTLIST= <TTTTTTTTTTTTTTT>
##$WBST= 2048
##$WBSW= 25
##$XGAIN= (0..3)
0 0 0 0
##$XL= 0
##$YL= 0
##$YMAX_a= 480412
##$YMIN_a= -607023
##$ZGOPTNS= <>
##$ZL1= 120
##$ZL2= 120
##$ZL3= 120
##$ZL4= 120
##$ABSF1= 14.98509
##$ABSF2= -5.573092
##$ABSG= 5
##$ABSL= 3
##$ALPHA= 0
##$AQORDER= 0
##$ASSFAC= 0
##$ASSFACI= 0
##$ASSFACX= 0
##$ASSWID= 0
##$AUNMP= <proc_prof1d_extract_pilot.lims>
##$AXLEFT= 0
##$AXNAME= <>
##$AXNUC= <1H>
##$AXRIGHT= 0
##$AXTYPE= 0
##$AXUNIT= <>
##$AZFE= 0.1
##$AZFW= 0.1
##$BCFW= 0
##$BC_mod= 0
##$BYTORDP= 0
##$COROFFS= 0
##$CY= 15
##$DATMOD= 1
##$DC= 0
##$DFILT= <>
##$DTYPP= 0
##$F1P= 0
##$F2P= 0
##$FCOR= 0.5
##$FTSIZE= 32768
##$FT_mod= 6
##$GAMMA= 0
##$GB= 0
##$INTBC= 1
##$INTSCL= 1
##$ISEN= 128
##$LB= 0
##$LEV0= 0
##$LPBIN= 0
##$MAXI= 10000
##$MC2= 0
##$MEAN= 0
##$ME_mod= 0
##$MI= 0
##$NCOEF= 0
##$NC_proc= -8
##$NLEV= 6
##$NOISF1= 0
##$NOISF2= 0
##$NSP= 0
##$NTH_PI= 0
##$NZP= 0
##$OFFSET= 14.98509
##$PC= 1
##$PHC0= 177.2754
##$PHC1= 0
##$PH_mod= 1
##$PKNL= yes
##$PPARMOD= 0
##$PPDIAG= 0
##$PPIPTYP= 0
##$PPMPNUM= 2147483647
##$PPRESOL= 1
##$PSCAL= 4
##$PSIGN= 0
##$PYNMP= <proc.py>
##$REVERSE= no
##$SF= 400.02
##$SI= 32768
##$SIGF1= 0
##$SIGF2= 0
##$SINO= 400
##$SIOLD= 32768
##$SPECTYP= <>
##$SREGLST= <1H.CDCl3>
##$SSB= 0
##$STSI= 32768
##$STSR= 0
##$SW_p= 8223.68421052631
##$SYMM= 0
##$S_DEV= 0
##$TDeff= 65536
##$TDoff= 0
##$TI= <>
##$TILT= no
##$TM1= 0
##$TM2= 0
##$TOPLEV= 0
##$USERP1= <user>
##$USERP2= <user>
##$USERP3= <user>
##$USERP4= <user>
##$USERP5= <user>
##$WDW= 1
##$XDIM= 32768
##$YMAX_p= 474768521
##$YMIN_p= -791446
##$CURPLOT= <Network HP LaserJet P1505>
##$CURPRIN= <$Network HP LaserJet P1505>
##$DFORMAT= <normdp>
##$LAYOUT= <+/1D_H.xwp>
##$LFORMAT= <normlp>
##$PFORMAT= <normpl>
##$SURQMSG= 1
$$ End of Bruker specific parameters
$$ ---------------------------------
##NTUPLES= NMR SPECTRUM
##VAR_NAME=  FREQUENCY,     SPECTRUM/REAL,   SPECTRUM/IMAG
##SYMBOL=    X,             R,               I
##VAR_TYPE=  INDEPENDENT,   DEPENDENT,       DEPENDENT
##VAR_FORM=  AFFN,          ASDF,            ASDF
##VAR_DIM=   32768,         32768,           32768
##UNITS=     HZ,            ARBITRARY UNITS, ARBITRARY UNITS
##FACTOR=    0.250966925370066, 1,           1
##FIRST=     8223.43324360094, -34322,       -146969
##LAST=      0,             2016,            -176318
##MIN=       0,             -791446,         0
##MAX=       8223.43324360094, 474768521,    0
$$ Real data points
##PAGE= N=1
##DATA TABLE= (X++(R..R)), XYDATA
$$ [...]
19560a16278H8788b1264B6758C100i1969E790L3251a96911N8131e8103q7158A433
$$ -116278 88788 -21264 26758 3100 -91969 5790 39041 -196911 -138780 -58103 -145261 1433
19547b17199k58333h407p0062L2328J6505n6866A63084P5888m5585k7337p5665
$$ -217199 -475532 -8407 -78469 -46141 -29636 -86502 163084 238972 193387 166050 90385
19536I0385c59923n4315A86055b38417J08188l02352C06946i3351A88142b14803
$$ 90385 -359923 -414238 186055 -238417 -130229 -432581 306946 -93351 188142 -214803
19525g4820B59735b19428A25293L8205i4570C1178a69158A9031d16317J01437
$$ -74820 259735 -219428 125293 163498 -94570 31178 -169158 19031 -416317 -314880
19515c14880B36086b68778B53343b37166N6422O2089K3426G1076a36494A57263
$$ -314880 236086 -268778 253343 -237166 -180744 -118655 -95229 71076 -136494 157263
19504G917J13969C3856N9213f9524B6859a94864B4544J59205a14729k8289j37985
$$ 7917 121886 33856 93069 -69524 26859 -194864 24544 183749 -114729 -143018 -281003
19493b81003i7941k5601q5310j28937g2167l6482A6079a78725l21705a48498n7209
$$ -281003 -97941 -123542 -208852 -337789 -72167 -108649 16079 -178725 -500430 -148498 -205707
19482b05707E7244c2534G2204c26432a2511A34434e5000l8119j08736C0334J37853
$$ -205707 57244 -32534 72204 -326432 -12511 134434 -55000 -93119 -201855 30334 168187
19471A68187a34073j22577j4410F8813Q708L82427B9136K03675D9979J59421b36687
$$ 168187 -134073 -256650 -271060 68813 77521 459948 29136 232811 49979 209400 -236687
19459c0804j0984k03910J14082f626l1317D78969A81872h8200j47909J06425j29449
$$ -30804 -41788 -245698 -131616 -6626 -37943 478969 181872 -88200 -236109 -129684 -259133
19448b59133j26602f0866p0411j4323A10845b23574A71676G1440a39624a4531
$$ -259133 -385735 -60866 -131277 -145600 110845 -223574 171676 71440 -139624 -14531
19437a341C69536h0563E917b14673a9071B10301L7819a93356A03335h0827A5111
$$ -1341 369536 -80563 5917 -214673 -19071 210301 248120 -193356 103335 -80827 15111
19425a13158c7018j76149I7111J46335a50524j86554a46157G1526d7617k02375
$$ -113158 -37018 -213167 97111 243446 -150524 -337078 -146157 71526 -47617 -249992
19415b49992A88493a89773j4965D5004e4788j86030A21684a41408k77743J06066
$$ -249992 188493 -189773 -204738 45004 -54788 -240818 121684 -141408 -419151 -313085
19405c13085c4159E1817h3512m15618a48950J7404A28816D684d11950H751Q6337
$$ -313085 -34159 51817 -83512 -499130 -148950 -131546 128816 4684 -411950 8751 95088
19394I5088c51191J37199A0862K96779a07572e0408E2552B5295a53266j8746A03346
$$ 95088 -351191 -213992 10862 307641 -107572 -50408 52552 25295 -153266 -172012 103346
19382a26526N032J433C7944R6887a0337j29396A35825d10649C75718A77374K8225
$$ -126526 -121494 -120061 37944 134831 -10337 -139733 135825 -410649 375718 177374 205599
19371B05599a08333A16664L2800L8944a66641k21225G4208k4438a20870E3981
$$ 205599 -108333 116664 149464 188408 -166641 -387866 74208 49770 -120870 53981
19360c2706j24061r2746J24157m3466E7343J43854A9619K6573a09960k61064a45800
$$ -32706 -156767 -249513 -125356 -168822 57343 201197 19619 46192 -109960 -371024 -145800
19348a67726F5465J38532a11576o501A742a09476A3292c48509B13334a29092G8123
$$ -167726 65465 203997 -111576 -118077 1742 -109476 13292 -348509 213334 -129092 78123
19336A23999J28525a80086J4333m776B1943M2604b25533a01514E6332J30491a91115
$$ 123999 252524 -180086 -165753 -170529 21943 64547 -225533 -101514 56332 186823 -191115
19324h8112j94560L9608L4990A91190A800c7569a2237A34598J70545a73274p8815
$$ -88112 -282672 -243064 -208074 191190 1800 -37569 -12237 134598 305143 -173274 -252089
19313b52089d9134A8166F922L1884f6165j58203a10478A89590a0859A63733b90653
$$ -252089 -49134 18166 6922 38806 -66165 -224368 -110478 189590 -10859 163733 -290653
19301b51045J0916E7789a90556I3262C6171d18564a25681k88835a62233j93625
$$ -251045 -240129 57789 -190556 93262 36171 -418564 -125681 -414516 -162233 -355858
19291c55858L1240E6097K3854B9547J25520F894d6652o8024q0331A18649a15081
$$ -355858 -324618 56097 79951 29547 155067 6894 -46652 -114676 -195007 118649 -115081
19279b53752G0841d5378P774F3643B6601c36261A6873b52945A29429k6244j7619
$$ -253752 70841 -45378 -37604 63643 26601 -336261 16873 -252945 129429 103185 85566
19268H5566a53023N3741j87180a04424C77953G1015c62602a63456q8270B6423
$$ 85566 -153023 -99282 -286462 -104424 377953 71015 -362602 -163456 -251726 26423
19257A05903a40894l616B07467c2083j0828D6301h1404b1412k6739B09794a7627
$$ 105903 -140894 -144510 207467 -32083 -42911 46301 -81404 -21412 -48151 209794 -17627
19245h0132H7281b32050C930O9914N6501o1095a69240H1704c64315A57342f5150
$$ -80132 87281 -232050 3930 73844 130345 69250 -169240 81704 -364315 157342 -65150
19233C17771j13916e8220B4816J52493g5733k24793A87491a1066A6506i5500j17066
$$ 317771 203855 -58220 24816 177309 -75733 -300526 187491 -11066 16506 -95500 -212566
19222b12566R153o2129j81445J6197b9677A16844N2975a44492D0868c75454A1062
$$ -212566 -203413 -265542 -446987 -430790 -29677 116844 169819 -144492 40868 -375454 11062
19210b27193l2259A51895A6083b33663D2550b07855e5256E4126g8660b0386B55730
$$ -227193 -259452 151895 16083 -233663 42550 -207855 -55256 54126 -78660 -20386 255730
19198a38858N9254l77032a90373H670b5337r0568d7491H1558e2844E315J05466
$$ -138858 -79604 -456636 -190373 8670 -25337 -115905 -47491 81558 -52844 5315 110781
19187A10781b578p8947C21405C2476a49782L7882e2221D0180e20571A02042d9496
$$ 110781 -2578 -81525 321405 32476 -149782 -111900 -52221 40180 -520571 102042 -49496
19175b25832a04426F6961K5270b47674E5345a9498k52199J588f9359A90443b80569
$$ -225832 -104426 66961 92231 -247674 55345 -19498 -271697 -270109 -69359 190443 -280569
19163d3954C22670a78228m0024F833K298a88762M254I0270A0461b8053r2615I9015
$$ -43954 322670 -178228 -218252 6833 9131 -188762 -184508 90270 10461 -28053 -120668 99015
19150c22190A18325b26269N3298A38344b21727i3235F7766d3857k43388A50290
$$ -322190 118325 -226269 -172971 138344 -221727 -93235 67766 -43857 -287245 150290
19139c78926C38343A02300l0117g1685B8132b85375a02286B68960c14468i2208
$$ -378926 338343 102300 72183 -71685 28132 -285375 -102286 268960 -314468 -92208
19128g8470A55768g268j84219h9511j83570A0667c42985A72700k9483L9732b99321
$$ -78470 155768 -7268 -191487 -89511 -273081 10667 -342985 172700 143217 182949 -299321
19116a34196B9081b60719A54365m9731c89506a14636j17806A73608R881L6947
$$ -134196 29081 -260719 154365 104634 -389506 -114636 -232442 173608 183489 220436
19106B20436e8586l7678C09307j17100o5328C7350a27745A33166d47025e2175
$$ 220436 -58586 -96264 309307 192207 126879 37350 -127745 133166 -447025 -52175
19095B00466H6243f7117A03267b6412A3817a09834K7505B41236a47605l9202A87397
$$ 200466 86243 -67117 103267 -26412 13817 -109834 -82329 241236 -147605 -186807 187397
19083H1077K22183b47402M5302j14007j10293J83019B47971f3372C7401d95488
$$ 81077 303260 -247402 -202100 -316107 -426400 -243381 247971 -63372 37401 -495488
19072I8785b4716l10484b5207C63073C3609J48a38828j4262k46027a08496b4343
$$ 98785 -24716 -335200 -25207 363073 33609 33757 -138828 -153090 -399117 -108496 -24343
19060a34164C0133e1697C73486a22120k12419D01894a02708A5678J49558B9717
$$ -134164 30133 -51697 373486 -122120 -334539 401894 -102708 15678 165236 29717
19049b42787a07254B51332a75588O6054B64614E9502L8843c92958a86134N7096
$$ -242787 -107254 251332 -175588 -109534 264614 59502 98345 -392958 -186134 -129038
19039a29038L2889B42036q7699b66356B85411a17938b9613j82113P6263A11640
$$ -129038 -96149 242036 154337 -266356 285411 -117938 -29613 -211726 -135463 111640
19028c80731h7190j78500a25182C6222b7158A07370a87981A7418b31894C00039
$$ -380731 -87190 -265690 -125182 36222 -27158 107370 -187981 17418 -231894 300039
19017a48339f2480B9223K28044d6019A86956E9607d765n7354j85303B01988o6029
$$ -148339 -62480 29223 257267 -46019 186956 59607 -4765 -62119 -247422 201988 135959
19006A35959J9718a55023b019F8822O7362A987b06909f6889j99807E0271g392
$$ 135959 155677 -155023 -2019 68822 136184 1987 -206909 -66889 -266696 50271 -7392
18994d919l11910A77326Q5146a38654J7753q9698A03749J46973k154e1950A02116
$$ -4919 -316829 177326 262472 -138654 -120901 -210599 103749 250722 248568 -51950 102116
18982E7035g0542A76432D9689a40080j46605A50700b01853Q7354o0099I3711h7604
$$ 57035 -70542 176432 49689 -140080 -286685 150700 -201853 -114499 -174598 93711 -87604
18970e8200G8380c25017P3239B13489o7704h4969G300b88761R3302q8527B41214
$$ -58200 78380 -325017 -251778 213489 145785 -84969 7300 -288761 -195459 -283986 241214
18958b85181C9461a72775A05111b27109M9568A59254G6678b26601N7251L0404
$$ -285181 39461 -172775 105111 -227109 -177541 159254 76678 -226601 -169350 -138946
18948a38946B59369h230A66500b31839Q1387F4888a1053B1745g3395m3134J0154
$$ -138946 259369 -8230 166500 -231839 -150452 64888 -11053 21745 -73395 -116529 -106375
18937a06375M5848o0215D9315a47232c2333i156l24490a06133B22079F3244J49478
$$ -106375 -60527 -120742 49315 -147232 -32333 -9156 -333646 -106133 222079 63244 212722
18926B12722G2112J7096a36036B65444H8679b91397B4529A1798b0135A18583J9943
$$ 212722 72112 89208 -136036 265444 88679 -291397 24529 11798 -20135 118583 138526
18915A38526J10412b70360g4218A08291J05375a18947B74098e8905j85045J04336
$$ 138526 248938 -270360 -74218 108291 213666 -118947 274098 -58905 -243950 -139614
18905a39614B06771b2074q5208j06809f2683q9465d6805L604j87753j33835C7098
$$ -139614 206771 -22074 -107282 -214091 -62683 -152148 -46805 -43201 -230954 -364789 37098
18893a08333m591A26122j4794a0792j00189B18494c47693e8367C21153b28294
$$ -108333 -112924 126122 111328 -10792 -110981 218494 -347693 -58367 321153 -228294
18882a52310C8145J24152N6062i2871k0389k84652a20902j02260j5031B3992K93133
$$ -152310 38145 162297 218359 -92871 -113260 -397912 -120902 -223162 -238193 23992 317125
18871C17125c40123F7956b10257A30043b434A5478b51566K2250r999O7432J3275
$$ 317125 -340123 67956 -210257 130043 -2434 15478 -251566 -229316 -239315 -171883 -158608
18860a58608K4057j35706e1843j66873a8141B69743a24647j0078d515j40966j44755
$$ -158608 -134551 -270257 -51843 -218716 -18141 269743 -124647 -134725 -4515 -145481 -290236
18849b90236a40880h278C08076j05479c0840l5452K8901m4812A43595i0678j55296
$$ -290236 -140880 -8278 308076 202597 -30840 -66292 -37391 -82203 143595 -90678 -245974
18838b45974D4253J63763b99420j22752A13671a83313p2798A12199f9829k53313
$$ -245974 44253 208016 -299420 -422172 113671 -183313 -256111 112199 -69829 -323142
18828c23142A81508c8413p1694j3359A19527c6996j3503A33489f3497B0931d3503
$$ -323142 181508 -38413 -110107 -123466 119527 -36996 -50499 133489 -63497 20931 -43503
18816A28920a83955K0560A36444b99058d5750h077I010b39227g4832j06619J6640
$$ 128920 -183955 -163395 136444 -299058 -45750 -8077 9010 -239227 -74832 -181451 -164811
18805a64811r6843A95281i6474j91516k9943J28619G2140R3840f2055E9036a50260
$$ -164811 -261654 195281 -96474 -287990 -317933 -189314 72140 165980 -62055 59036 -150260
18793B59902d4437B15722H1929b21117R5540F0556a05166D3822K8974n767J28683
$$ 259902 -44437 215722 81929 -221117 -125577 60556 -105166 43822 72796 67029 195712
18782A95712H3901g2090k31170d5332k81145B8914a49959F6690O7300m999N1452
$$ 195712 83901 -72090 -303260 -45332 -326477 28914 -149959 66690 133990 128991 180443
18771A80443q3724b44773J874G0054b8412H8006m3576g0022E6650a04694A06702
$$ 180443 96719 -244773 -242899 70054 -28412 88006 44430 -70022 56650 -104694 106702
18759d24857a94230l4488E0757J1044a11193l20937h9775l78880A872J17155N6223
$$ -424857 -194230 -228718 50757 61801 -111193 -432130 -89775 -468655 1872 119027 175250
18748A75250a53952j03367E1591M09341a61630j68449j7873i1018k61738F5613
$$ 175250 -153952 -257319 51591 460932 -161630 -330079 -347952 -91018 -352756 65613
18737a66661C4612a42965A9370b32324g6621A08951i2038B44776G8885B311b6477
$$ -166661 34612 -142965 19370 -232324 -76621 108951 -92038 244776 78885 2311 -26477
18725A02114b79395i081j31554j54782c6069J807m0485n4192A22357c73676i9709
$$ 102114 -279395 -9081 -140635 -295417 -36069 -34262 -74747 -128939 122357 -373676 -99709
18713i2076J7415l6468A12760J6635a08762m7672n1726e4370A64125b30430c6894
$$ -92076 -74661 -111129 112760 129395 -108762 -156434 -208160 -54370 164125 -230430 -36894
18701D1564c5540f579j55598I5696a3673F9069J2740B2008f6271j96730f8974
$$ 41564 -35540 -6579 -162177 95696 -13673 69069 81809 22008 -66271 -263001 -68974
18689b8554B08335E7564b91955A32615R856f1400a2793D8292I966i4491k9505
$$ -28554 208335 57564 -291955 132615 142471 -61400 -12793 48292 9966 -94491 -123996
18678a23996r6092F4871c0795j68086A29948c3466A07036c48868g9747K0339C0400
$$ -123996 -220088 64871 -30795 -198881 129948 -33466 107036 -348868 -79747 -59408 30400
18666a30370H041b73377A41393a2667A76775o4864b18964P1815J0173a6647I586
$$ -130370 8041 -273377 141393 -12667 176775 111911 -218964 -147149 -136976 -16647 9586
18654c24586j48896R0778J54754D7443L28976r9233j18138K8139a41691B35211
$$ -324586 -473482 -382704 -227950 47443 376419 277186 159048 187187 -141691 235211
18643G4918j8308q241J2504a05645A70602b18889c3932k52059K1166E4211b95196
$$ 74918 56610 48369 60873 -105645 170602 -218889 -33932 -285991 -264825 54211 -295196
18631b65228f3563o7337k43382J33434P6458R215C2177b45000F0194a28707j54748
$$ -265228 -63563 -130900 -374282 -240848 -164390 -155175 32177 -245000 60194 -128707 -283455
18620b83455f0159H5814J46885r1874a1190j82535q4961A08204M6921O5811L070
$$ -283455 -60159 85814 232699 140825 -11190 -193725 -278686 108204 155125 220936 224006
18609B24006a88999M3583m3840c1763k08549e7824G6676b16868I3326B8402g4234
$$ 224006 -188999 -145416 -189256 -31763 -240312 -57824 76676 -216868 93326 28402 -74234
18597A6659a23338o7875A6041K63807a34216c1865A20375E6001J16845d3232B80089
$$ 16659 -123338 -191213 16041 279848 -134216 -31865 120375 56001 172846 -43232 280089
18585a77462j01096B12676e2295q4671A66972h2382A20474B3868a12725G4777
$$ -177462 -278558 212676 -52295 -136966 166972 -82382 120474 23868 -112725 74777
18574i1257j41174a00741A59978L2881b68800r3283F8438B1297b24187J179c2559
$$ -91257 -232431 -100741 159978 192859 -268800 -362083 68438 21297 -224187 -223008 -32559
18562A00376a1282j61796A28756e048B1040M6212J90241b56788h131j30120e5816
$$ 100376 -11282 -173078 128756 -5048 21040 67252 257493 -256788 -8131 -138251 -55816
18550C10453d81264a49060A43263a08053A79079c0394G9555a26843B43704a17059
$$ 310453 -481264 -149060 143263 -108053 179079 -30394 79555 -126843 243704 -117059
18539a33235B83690a05198a8303E0643b1483B31345a14453A03032a21731j09479
$$ -133235 283690 -105198 -18303 50643 -21483 231345 -114453 103032 -121731 -231210
18529b31210E9965L2286c41196A90785Q3156i645E2015g3090n2045I4399b69960
$$ -231210 59965 92251 -341196 190785 273941 -9645 52015 -73090 -125135 94399 -269960
18517A4045h9009B2799e6712c026A47100a00274k0809p5455k60952b10027J02150
$$ 14045 -89009 22799 -56712 -3026 147100 -100274 -121083 -196538 -457490 -210027 -107877
18506a07877H4680a88137m9574d7243b0977r0068c6441j09697N4738m8677A74030
$$ -107877 84680 -188137 -237711 -47243 -20977 -111045 -36441 -146138 -91400 -140077 174030
18494A48383b1826A69099B4536K9811b23350I4289C7980a04345l9575f4429j23775
$$ 148383 -21826 169099 24536 54347 -223350 94289 37980 -104345 -143920 -64429 -188204
18483a88204B1i3125k36072A0216L4740a34040r587G7055P8281a98332A6515f8847
$$ -188204 21 -93125 -329197 10216 44956 -134040 -143627 77055 155336 -198332 16515 -68847
18470i1809L6559A31774c82523a59928A06106b23360B6268c98573D84658A07604
$$ -91809 -55250 131774 -382523 -159928 106106 -223360 26268 -398573 484658 107604
18459A31066b39272D9967J54513N7036c83185f7498F776b45343G3560d02561a03322
$$ 131066 -239272 49967 204480 261516 -383185 -67498 6776 -245343 73560 -402561 -103322
18447I4446A6067J59236a7735l88686c6809l203L365l82959K01869l8974F5784
$$ 94446 16067 175303 -17735 -406421 -36809 -40012 -36647 -419606 -217737 -256711 65784
18435A38457J82014A15588O8189c42781A99352a95340j8011E2851g9157p5007
$$ 138457 320471 115588 183777 -342781 199352 -195340 -213351 52851 -79157 -154164
18425a54164D8324b8129a2980A25247J2264b9735B5986J04217a29415J4788C53266
$$ -154164 48324 -28129 -12980 125247 137511 -29735 25986 130203 -129415 -114627 353266
18413B1423g1146K7481j19360n1305E6084J42276a44450j90326J39057k877b9519
$$ 21423 -71146 -43665 -163025 -214330 56084 198360 -144450 -334776 -195719 -198596 -29519
18401A32289i2674F4945J53324a35789c8402k80691f0261C39118f2889A77443
$$ 132289 -92674 64945 218269 -135789 -38402 -319093 -60261 339118 -62889 177443
18390C4381J62423d1100A87481a52938l00108g8805n3176e2302j37759H278Q4066
$$ 34381 196804 -41100 187481 -152938 -453046 -78805 -131981 -52302 -190061 8278 92344
18379I2344g5482k67647A57832m5026L0221c79994O1748l1595a09411E2323a1284
$$ 92344 -75482 -343129 157832 112806 143027 -379994 -318246 -349841 -109411 52323 -11284
18367C07449b38767c0694A28766a28484k5232J902A77200a16239I6831a25508
$$ 307449 -238767 -30694 128766 -128484 -153716 -151814 177200 -116239 96831 -125508
18356a124j03958j12690A77021C7209O294a16004b6535j57013a6150l06497G2524
$$ -1124 -105082 -217772 177021 37209 43503 -116004 -26535 -183548 -16150 -322647 72524
18344a13963D9601b4379B6766R404c3497n1960l01829A69186a98720H1463a87772
$$ -113963 49601 -24379 26766 36170 -33497 -85457 -387286 169186 -198720 81463 -187772
18332E3072J1851h0504j53971a66k51902d5442m25518A45288A039a82258f5170
$$ 53072 64923 -80504 -234475 -166 -252068 -45442 -470960 145288 1039 -182258 -65170
18320g8417j41357A06331d6002j21286E4460a02352F3073K33521b38520L3221
$$ -78417 -219774 106331 -46002 -167288 54460 -102352 63073 296594 -238520 -205299
18310b05299P9789j42276P1992m1309P0042D3419a82932C62364A66969b72129
$$ -205299 -125510 -267786 -195794 -237103 -167061 43419 -182932 362364 166969 -272129
18299b78208e4539A37215m542b42076N8429j67447P2416J08264A26275b61631
$$ -278208 -54539 137215 132673 -242076 -183647 -351094 -278678 -170414 126275 -261631
18288a20239B65073I7878a46719n6931D7908f0937H8927A4654b49568A26297a1042
$$ -120239 265073 97878 -146719 -203650 47908 -60937 88927 14654 -249568 126297 -11042
18276C17225c26552a47988j24909A3620d55465G2993b35081P6421P8241A18502
$$ 317225 -326552 -147988 -272897 13620 -455465 72993 -235081 -158660 -80419 118502
18265A76697a20131b9429l19836N807G3420C761O7423b00291a8075k37448l5C3021
$$ 176697 -120131 -29429 -349265 -343458 73420 3761 71184 -200291 -18075 -255523 -255558 33021
18252i1500C41828c32912A8430J53012b58767A17255i1006A23444M3881f7445
$$ -91500 341828 -332912 18430 171442 -258767 117255 -91006 123444 167325 -67445
18241A38553a54917H0788h4878A05676a29679A44088D4402e1035j17015P3849
$$ 138553 -154917 80788 -84878 105676 -129679 144088 44402 -51035 -168050 -94201
18231i4201C12880C5063M10309A66266d7415k5313F7261B7623A026a9063k23844
$$ -94201 312880 35063 445372 166266 -47415 -72728 67261 27623 1026 -19063 -242907
18220b42907B230a58198j00700D8916a99206j43211g3062k1847D5677b05433g8203
$$ -242907 2230 -158198 -258898 48916 -199206 -342417 -73062 -94909 45677 -205433 -78203
18208b3835o8472k9539J5546E5923J83130J65462c03155D9914R1167a93053h1731
$$ -23835 -92307 -121846 -106300 55923 239053 404515 -303155 49914 141081 -193053 -81731
18196a9864l40225J50781J5112L8953A35988a03241m15253C6241N5919L0419J77516
$$ -19864 -360089 -209308 -194196 -155243 135988 -103241 -518494 36241 92160 122579 300095
18185C00095H3901b92533D8494O2988N1359B7001d1572r7618f4747k18883a7743
$$ 300095 83901 -292533 48494 111482 162841 27001 -41572 -139190 -64747 -283630 -17743
18173F5419J7020A22L6387a33596j1126A23731a42504p2893B64309m0373a90371
$$ 65419 82439 122 36509 -133596 -144722 123731 -142504 -215397 264309 223936 -190371
18161g8584E8427f8318J5084k52354J50316c2864A27790R078a07287C4198K06652
$$ -78584 58427 -68318 -53234 -305588 -155272 -32864 127790 136868 -107287 34198 240850
18150B40850l2114M252b36227E8882j2850Q4888n9898b0010r9896j56535J09280
$$ 240850 208736 212988 -236227 58882 46032 130920 71022 -20010 -119906 -276441 -167161
18139a67161b4647E8006a94210j41958a14267J1339m21155A84931a11021A77595
$$ -167161 -24647 58006 -194210 -336168 -114267 -102928 -524083 184931 -111021 177595
18128A13261A4001b79026j08972g8255r3651A02621N4434F4154b43733m545G4186
$$ 113261 14001 -279026 -387998 -78255 -171906 102621 157055 64154 -243733 -248278 74186
18116f1373r6945g8905B08499K29129c7177m17303K798K06478A15083b61987C05837
$$ -61373 -158318 -78905 208499 437628 -37177 -454480 -451682 -245204 115083 -261987 305837
18104e8525A21635a68990I918b50590D1603a0810o2422A32653a58353A01290j2166
$$ -58525 121635 -168990 9918 -250590 41603 -10810 -73232 132653 -158353 101290 89124
18093H9124J4693N8670a98228A69017c68375a09513H4087b94994A42362a84886
$$ 89124 103817 162487 -198228 169017 -368375 -109513 84087 -294994 142362 -184886
18082A75554a6017A87672f7340j23319h3526C08229d1288E8082O6892J85003a71974
$$ 175554 -16017 187672 -67340 -190659 -83526 308229 -41288 58082 124974 309977 -171974
18070A9645J16640F3616a46686D21278f1629K9982n43533i8444A22361b33923
$$ 19645 136285 63616 -146686 421278 -61629 -31647 -575180 -98444 122361 -233923
18059c9073B27146c65987a32803J5710B42145g3294j59049B18541J54704a90192
$$ -39073 227146 -365987 -132803 -117093 242145 -73294 -232343 218541 373245 -190192
18048a90866A36757h56D6153a68230c3299H752c87639i5849q6031L2085j40095
$$ -190866 136757 -856 46153 -168230 -33299 8752 -387639 -95849 -181880 -149795 -289890
18037b89890B07588a59773B77980g908p0755C35356A4752a48899A31116F4883
$$ -289890 207588 -159773 277980 -7908 -78663 335356 14752 -148899 131116 64883
18026e9729j48750N2569K4563B72191d15368a46919j18828d0447J4224j64075
$$ -59729 -208479 -155910 -131347 272191 -415368 -146919 -265747 -40447 -26223 -190298
18016a90298f4071o6062A3844R6049a46139l8940K2903a2934A65939m4592K86028
$$ -190298 -64071 -130133 13844 109893 -146139 -185079 -162176 -12934 165939 121347 407375
18005D07375D746K65544a0097j69920E8996J6940Q9291m4259b51304B53043b81301
$$ 407375 4746 270290 -10097 -180017 58996 75936 165227 120968 -251304 253043 -281301
17993A12073O2713h9557H6398b86871k0663a8329F4514h6328b2341B75023a17570
$$ 112073 174786 -89557 86398 -286871 -307534 -18329 64514 -86328 -22341 275023 -117570
17981e4132A2419a98401I121b4678j18202f6566l9001C8056K86081i510k74698
$$ -54132 12419 -198401 9121 -24678 -142880 -66566 -105567 38056 324137 -9510 -284208
17970b84208J13927L7217a4689m7059F1342O2889K43545d6488k9891L6663J264
$$ -284208 -170281 -133064 -14689 -61748 61342 124231 367776 -46488 -76379 -39716 -38452
17959c8452B04885A1186J56604a31354a6533n1342B10910Q1598D0640K4171J19584
$$ -38452 204885 11186 167790 -131354 -16533 -67875 210910 292508 40640 64811 184395
17948A84395f1902B9001M7730d4453m4523F5921J66988b1690A56290c30965A77456
$$ 184395 -61902 29001 76731 -44453 -88976 65921 232909 -21690 156290 -330965 177456
17936C0778P3363d39996A05219f7996A04436c33710h3677P225j21574o8739C22270
$$ 30778 104141 -439996 105219 -67996 104436 -333710 -83677 -76452 -198026 -266765 322270
17924A74239H94b72144A46816G1690K65334A50083a40524c5406A26783J18606
$$ 174239 894 -272144 146816 71690 337024 150083 -140524 -35406 126783 245389
17914B45389c30939e1589K5586D9358J13585g1281b8035Q465j39595j42124J11379
$$ 245389 -330939 -51589 -26003 49358 162943 -71281 -28035 -19570 -159165 -301289 -189910
17903a89910C29036b37952B6726g3505k81387r7781A28644f6822j69088I643c3349
$$ -189910 329036 -237952 26726 -73505 -354892 -452673 128644 -66822 -235910 9643 -33349
17891A60343e5098O553l4971A52218q440M6578g3910I7385d50209G4345E651d59013
$$ 160343 -55098 -48545 -83516 152218 143778 190356 -73910 97385 -450209 74345 5651 -459013
17878i605A2341K69041j05862B9733e2343m28036J41028B3258K03948B4513J26576
$$ -9605 12341 281382 175520 29733 -52343 -480379 -339351 23258 227206 24513 151089
17867A51089B2724d1207q2649B99203A19355J09317J3567h613B49080e7864B88660
$$ 151089 22724 -41207 -123856 299203 119355 228672 242239 -8613 249080 -57864 288660
17855B56539f460I8541g9269B51312a1891o6103D5914c6137A96771A5821L16114
$$ 256539 -6460 98541 -79269 251312 -11891 -77994 45914 -36137 196771 15821 331935
17844C31935a14541B00064c5145l74390d4764j51134I458a04388F7995O2002L4533
$$ 331935 -114541 200064 -35145 -409535 -44764 -195898 9458 -104388 67995 129997 164530
17833A64530b35150F2640J55487c02624a0579H0916b04237B31262b02564h688
$$ 164530 -235150 62640 218127 -302624 -10579 80916 -204237 231262 -202564 -8688
17822h4516K7919G557c55140B8119e6311b1379q1873d796n0957m05B52808a9451
$$ -84516 -56597 7557 -355140 28119 -56311 -21379 -103252 -4796 -55753 -56158 252808 -19451
17809a58008A9082b9324f405G1422a00020j42503Q4627C55516a51510j82783A93936
$$ -158008 19082 -29324 -6405 71422 -100020 -242523 -157896 355516 -151510 -334293 193936
17797A45522O4237I947c7369B0602J22166g5298F8667a98462A73225g19j08903
$$ 145522 209759 9947 -37369 20602 142768 -75298 68667 -198462 173225 -719 -109622
17786a09622A41118d22605g4817q3717D40240a8516p6573P267B79066d9505J6565
$$ -109622 141118 -422605 -74817 -158534 440240 -18516 -95089 -87822 279066 -49505 -32940
17775c2940I7967m2679f7424k34755J33184A5872K18877h1333A11452k802e480
$$ -32940 97967 55288 -67424 -302179 -168995 15872 234749 -81333 111452 108650 -5480
17763c66820A32046o3947b28268A3064K56958A13633K88538b32076c2031j04090
$$ -366820 132046 68099 -228268 13064 270022 113633 402171 -232076 -32031 -136121
17753a36121n9163B9292d5888C25787c0177B88049b59253d5637k48964Q1867k31104
$$ -136121 -195284 29292 -45888 325787 -30177 288049 -259253 -45637 -294601 -212734 -443838
17742d43838A2919E280a60247P9232B98998H8607B621J56353i6849j92064f7173
$$ -443838 12919 5280 -160247 -81015 298998 88607 2621 158974 -96849 -288913 -67173
17730D7282g5606F1264R2561Q5688f9909a9662r4885j3988A49978M0040d1521
$$ 47282 -75606 61264 153825 239513 -69909 -19662 -114547 -128535 149978 190018 -41521
17718D7711C22e6813j20334B30813H2787a12020M7989q4989M1793b537k49208
$$ 47711 322 -56813 -177147 230813 82787 -112020 -64031 -149020 -107227 -2537 -251745
17707b51745a20743D5519J78768a26689G9050J93066a34418B22309b37146i1608
$$ -251745 -120743 45519 224287 -126689 79050 272116 -134418 222309 -237146 -91608
17696a04856j62323A64664n1420q365J77246F6166f32l42618A55046c1631k27644
$$ -104856 -267179 164664 113244 104879 282125 66166 -632 -343250 155046 -31631 -259275
17685b59275A00429d0193j40742C56536b26756d903A31583f3381G2528K29982
$$ -259275 100429 -40193 -180935 356536 -226756 -4903 131583 -63381 72528 302510
17675C02510J19479B2690b843j97436B8732i2768A00567a88536p2340B36086a51494
$$ 302510 421989 22690 -2843 -200279 28732 -92768 100567 -188536 -260876 236086 -151494
17663A04354N0884c0777q7491A82463l3608F4622A7961f394I365b29054A82468
$$ 104354 155238 -30777 -118268 182463 148855 64622 17961 -6394 9365 -229054 182468
17651H214J28188n52c9562D27179e5998A6045h8597j41263h1246N420I7694j1624
$$ 8214 136402 135850 -39562 427179 -55998 16045 -88597 -229860 -81246 -75826 97694 86070
17639H6070a08884B55881n2570H4569a96085g9801a0034j46535A19703b41593
$$ 86070 -108884 255881 203311 84569 -196085 -79801 -10034 -156569 119703 -241593
17628B09372a20214p5534H0578b35084A93153m0490C523a05805o589c3916A30811
$$ 209372 -120214 -195748 80578 -235084 193153 152663 3523 -105805 -112394 -33916 130811
17616a50479A56185c06032A19101a138m21896A99801a47761q1244d124B74330
$$ -150479 156185 -306032 119101 -1138 -423034 199801 -147761 -229005 -4124 274330
17605A18331f0383A76702K1806a63276k3680M8472q2271Q5214I1691l2187a1609
$$ 118331 -60383 176702 198508 -163276 -186956 -138484 -220755 -135541 91691 59504 -11609
17593a27698A6087f7212j64059A19120c4361G4615P0988A6036K23204h6509k72256
$$ -127698 16087 -67212 -231271 119120 -34361 74615 145603 16036 239240 -86509 -358765
17582c58765d9586q7094A61458k6494o3858J481a89175B89601A8602a0547j6D58370
$$ -358765 -49586 -136680 161458 134964 71106 72587 -189175 289601 18602 -10547 -10563 458370
17569B6326a28254F9828g6177j32695L6174A83877b10782A19990b8231F6854N3351
$$ 26326 -128254 69828 -76177 -208872 -172698 183877 -210782 119990 -28231 66854 120205
17558A20205A2660d4526A70690h3502A45938A2297f3410D06459A57930a95039
$$ 120205 12660 -44526 170690 -83502 145938 12297 -63410 406459 157930 -195039
17547B5791J7596O980g9992k3684A21121m9288E884J386a50563k3199C30074A55242
$$ 25791 43387 50367 -79992 -103676 121121 71833 5884 7270 -150563 -173762 330074 155242
17534e20369B24769a46656C31413K11178a71458D65558A58556b3740A00257l4029
$$ -520369 224769 -146656 331413 542591 -171458 465558 158556 -23740 100257 66228
17524F6228j835J88202H7997A2213P8692a04027b3899j07332n0344B07758a48792
$$ 66228 64393 252595 87997 12213 90905 -104027 -23899 -131231 -181575 207758 -148792
17512a24591e1480A95256F3275j0655J76983A06315c85135a35699c3250B10052
$$ -124591 -51480 195256 63275 52620 229603 106315 -385135 -135699 -33250 210052
17501b19619C9309N2605K43762A09612c9235j73811i693F6220K9403K3997a41528
$$ -219619 39309 91914 335676 109612 -39235 -213046 -9693 66220 95623 119620 -141528
17489C42232j9272Q1035A67157M9251n3696a253j00446B05392g732B99797g0557
$$ 342232 322960 403995 167157 216408 162712 -1253 -101699 205392 -7732 299797 -70557
17477B66898A03048B4834L87582A42767A9659a32845d3222A79516N7045D6402
$$ 266898 103048 24834 412416 142767 19659 -132845 -43222 179516 236561 46402
17466H3796J25148n5837c15558j10185A93860o7387J91711a532B02497F3400a62709
$$ 83796 208944 153107 -315558 -425743 193860 126473 318184 -1532 202497 63400 -162709
17454A11248J77394d08043f4972D55826j20613R6070I9798K73628A17853Q6613
$$ 111248 288642 -408043 -64972 455826 335213 431283 99798 373426 117853 204466
17444B04466P6978N7040C4756K55576J0513a72580A00437e5408Q858C42726j59840
$$ 204466 281444 338484 34756 290332 300845 -172580 100437 -55408 -46550 342726 182886
17433A82886i2503k33662B56006B8311Q423M80176a79284B56462R6595h1845G4558
$$ 182886 -92503 -326165 256006 28311 36734 516910 -179284 256462 353057 -81845 74558
17421B87548o3306q9617K03478k6044n8649K29104A08715M01375j45141A44977
$$ 287548 224242 134625 338103 312059 253410 482514 108715 510090 364949 144977
17410C20513j12237G4489J0597J42870A01241J20289j08306n2778i3390B39298
$$ 320513 208276 74489 85086 227956 101241 221530 113224 60446 -93390 239298
17399B11257B0532J82487h802B76329C2313N6685J69061I5595J66092B9212R5402
$$ 211257 20532 203019 -8802 276329 32313 88998 258059 95595 261687 29212 124614
17388A24614L56533C6982Q6725D0123l978L20958j61015a21948E26272F6411J55035
$$ 124614 481147 36982 123707 40123 36145 357103 196088 -121948 526272 66411 221446
17377B21446r2005K36803i6480D5182J72259b04060G964K39419A12196J84642
$$ 221446 129441 366244 -96480 45182 217441 -204060 7964 247383 112196 296838
17367B96838A3214L72283d950n728B81935B4458H879N8778g6842G0233g8477C38506
$$ 296838 13214 385497 -4950 -10678 281935 24458 8879 67657 -76842 70233 -78477 338506
17354C05731A49463j3601o6641O3628o5718a01884C42331p4523p0539J50414A57842
$$ 305731 149463 135862 69221 132849 67131 -101884 342331 267808 197269 347683 157842
17342A21745e0178A27865O2244p5685N28930l15668R211o5677l6099p5953f5257
$$ 121745 -50178 127865 190109 114424 643354 327686 336897 271220 235121 159168 -65257
17330A72681Q4396D6590n014R5206o4294a73729B9135K47240J5068d8614l98156
$$ 172681 257077 46590 41576 136782 72488 -173729 29135 276375 291443 -48614 -446770
17319d46770B30035j6384a176j35190A62310N7007E9651J25376C9945D286K95718
$$ -446770 230035 213651 -1176 -136366 162310 219317 59651 185027 39945 4286 300004
17308C00004G1480O6904N0653C9144Q8688J23337a34761G6608K76214B7329K52143
$$ 300004 71480 138384 189037 39144 127832 251169 -134761 76608 352822 27329 279472
17297B79472I8511a12387C87284f5136C44262p4711b7524A99710D584J66755J9147
$$ 279472 98511 -112387 387284 -65136 344262 269551 -27524 199710 4584 171339 190486
17286A90486n6537b1062A15146K436J42693I5571D0865a2398a204A46822F8838
$$ 190486 133949 -21062 115146 117582 260275 95571 40865 -12398 -1204 146822 68838
17274A52961J12154G1621R5122a61491c1409I4132K56109j26138C6334O3667A1616
$$ 152961 265115 71621 166743 -161491 -31409 94132 350241 224103 36334 100001 11616
17262C01670j28251m3217a07634I829J49956b0398B87261I5201J08677L2893J023
$$ 301670 173419 130202 -107634 9829 159785 -20398 287261 95201 203878 236771 237794
17251B37794J63465a62459F0688J72351c6378B91909h0406B43329L113f7794A97449
$$ 237794 401259 -162459 60688 233039 -36378 291909 -80406 243329 246442 -67794 197449
17239A8499M39937m817m5127a13177G8119K82214o0339G3981K8600K12463j8402
$$ 18499 458436 453619 408492 -113177 78119 360333 299994 73981 102581 315044 296642
17228B96642A10279a15042L8978G6034c9741q2006b1318A39218N6407d3276A83760
$$ 296642 110279 -115042 -76064 76034 -39741 -121747 -21318 139218 195625 -43276 183760
17216c6234C15689K6717d6527A34910N57787A44658k4377J67810l978c3896B28197
$$ -36234 315689 342406 -46527 134910 692697 144658 120281 288091 284113 -33896 228197
17204B24173J9066R2975j20817j7300n1187o0650J93488j02039j2645o9043P9041
$$ 224173 243239 336214 215397 198097 146910 86260 279748 177709 165064 96021 175062
17193A75062k4125f3742j91801d8745C04548Q8187P8389I4454k5936K97331A19239
$$ 175062 150937 -63742 -255543 -48745 304548 392735 471124 94454 68518 365849 119239
17181D13543j82185g7668D2634J81831a23903A52274p1082J45641j0991p1780
$$ 413543 231358 -77668 42634 224465 -123903 152274 81192 226833 215842 144062
17171A44062K47315A51457J38003p9843P097c0759C33723m2472j0258A12043K27835
$$ 144062 391377 151457 289460 209617 216714 -30759 333723 291251 280993 112043 339878
17160C39878K54393k26696O2261j4878p4015J34051j98578A29722K06866j31981
$$ 339878 594271 367575 429836 414958 340943 474994 276416 129722 336588 204607
17150B04607M6877H3533Q4767K27633j45308K39547k2052A11554K16591j13315
$$ 204607 251484 83533 168300 395933 250625 490172 468120 111554 328145 214830
17140B14830O6971L9399A32120J12886J29267c1242A70941K20852q3895j8891
$$ 214830 281801 321200 132120 245006 374273 -31242 170941 391793 307898 289007
17130B89007g2537C31935j31400J67039J13990K90419B36164J95438J30411r9994
$$ 289007 -72537 331935 200535 367574 481564 771983 236164 431602 562013 462019
17120D62019E3743K44029o4470b53176E20035q7364A74717K66831A17299K76385
$$ 462019 53743 297772 233302 -253176 520035 432671 174717 441548 117299 393684
17110C93684l549j08362K85267A67204m184L72298B0319O83221k86919l0592K2787
$$ 393684 390135 281773 567040 167204 163020 535318 20319 703540 416621 386029 408816
17099D08816J14666B08086q6462M38400j19424A19951j7445C4168L66894R3753
$$ 408816 523482 208086 121624 560024 440600 119951 102506 34168 401062 494815
17089D94815E3966K88281I5384a44050D31878p7987Q0038g822B27380l7291m5164
$$ 494815 53966 342247 95384 -144050 431878 353891 433929 -7822 227380 190089 144925
17078A44925J84171M2353j13175k9472L84097k05100j4661q3455A34099M61895
$$ 144925 329096 371449 258274 228802 612899 407799 393138 309683 134099 595994
17068E95994r4194j66039R8500E3221L44303J57298k18041j8994J01649P21A74658
$$ 595994 501800 335761 434261 53221 397524 554822 336781 317787 419436 420157 174658
17056A33607L62601j9352k37238R9340n3431q9625O7435J49567L21624k75865
$$ 133607 496208 476856 239618 338958 285527 195902 263337 412904 734528 458663
17046D58663j56810M62194B13515J2962j4120L74632j2747j56265j42536M5048
$$ 458663 301853 764047 213515 226477 212357 586989 574242 417977 275441 320489
17036C20489Q0562A61459K25076M9343K4761K4464A74855J26119J24715L05945
$$ 320489 401051 161459 386535 435878 460639 485103 174855 300974 425689 731634
17026G31634A99163J29692L48239j52681O3074J59447j46693k54423J77042K71259
$$ 731634 199163 328855 677094 524413 587487 746934 600241 345818 522860 794119
17016G94119C34464R7484K13985k39050B03207N94741l77658n9840J52191k20462
$$ 794119 334464 431948 645933 406883 203207 797948 420290 360450 512641 292179
17006B92179N24184j65128B59722K76359J15136J97040l53000Q060L24770l19029
$$ 292179 816363 651235 259722 536081 651217 848257 495257 503317 828087 509058
16996E09058K021P3771k66882M19116j93568M5346M15737l98445j85885L56719
$$ 509058 511079 584850 317968 737084 543516 588862 1004599 606154 420269 776988
16986G76988C39427M35729j60199L68937k07659J53463k37172j95801J63052o8363
$$ 776988 339427 775156 614957 983894 776235 929698 692526 496725 659777 591414
16976E91414K13423J45904k44137R7093j05752j43363J68259R0096L3781j44244
$$ 591414 804837 950741 706604 803697 697945 554582 722841 812937 846718 702474
16966G02474p7412L45745l18235J01464J43261k97900N1940K45176j82499j76535
$$ 702474 625062 970807 652572 754036 897297 599397 651337 896513 714014 537479
16956E37479M39920J10595j89140n7984j91196K78780q5222j74618L0330L12200
$$ 537479 977399 1087994 898854 840870 649674 928454 843232 668614 698944 1011144
16946A011144k06789J11579r2449o2835J63264J24432n0435j27575J19378m2674
$$ 1011144 804355 915934 823485 760650 923914 1048346 997911 870336 989714 947040
16936I47040j13725L17588j41625O3683P3289k19996J24460J93274n50133N34146
$$ 947040 833315 1150903 1009278 1072961 1146250 926254 1050714 1243988 693855 1228001
16926A228001l91943M86592r515k73150O3317J24219k89840j14094K83583K79198
$$ 1228001 836058 1322650 1313135 1039985 1103302 1227521 937681 823587 1107170 1386368
16916A386368l13304m8152Q2985J50945m1148j0453M9639k12491L02764m64191
$$ 1386368 1073064 1024912 1107897 1258842 1217694 1207241 1256880 1044389 1347153 882962
16906H82962L11423N1604L46803k4576p0877J09802l81075J83406J43105P5791
$$ 882962 1194385 1245989 1592792 1568216 1497339 1607141 1226066 1409472 1552577 1628368
16896A628368n1670J25811k55237J3049o8624k6329M19715l14987q2271j25996
$$ 1628368 1576698 1702509 1447272 1460321 1391697 1365368 1785083 1470096 1387825 1261829
16886A261829L89061J21355j8915k24217P5883K00429j82281J15650J83722l51853
$$ 1261829 1650890 1772245 1753330 1529113 1604996 1805425 1623144 1738794 1922516 1570663
16876A570663J20047J34158J15370j61860J27256O5675Q3704k08494L74591l23945
$$ 1570663 1690710 1824868 1940238 1778378 1905634 1971309 2055013 1846519 2221110 1897165
16866A897165n2039L52933p7590K05807m67252L64879l41142J70841Q756K34391
$$ 1897165 1845126 2198059 2120469 2326276 1859024 2223903 1882761 2053602 2062358 2296749
16856B296749K78377j87181L5940K43754o087j42779K70056j80753K76432j10160
$$ 2296749 2575126 2387945 2423885 2667639 2661552 2518773 2788829 2608076 2884508 2774348
16846B774348J30113j59994k2753Q4053p6941L31607j10484J90900J06617P1512
$$ 2774348 2904461 2744467 2721714 2805767 2728826 3060433 2949949 3140849 3247466 3318978
16836C318978j21430J2771J48000j07657K50995O9865j09642K54246l3216l10785
$$ 3318978 3197548 3210319 3358319 3250662 3501657 3571522 3461880 3716126 3682910 3372125
16826C372125K29799K29706K86333R1302K74593l97880m5863K75860K65129l49825
$$ 3372125 3601924 3831630 4117963 4209265 4483858 4085978 4040115 4315975 4581104 4231279
16816D231279M10692J5836K02114N84507p40289L84649O6851Q1477L19649l8909
$$ 4231279 4641971 4657807 4859921 5444428 4704139 5088788 5155639 5237116 5556765 5517856
16806E517856J92253J59536j06253O8047L42439K16598J27329l29753M63997l3948
$$ 5517856 5710109 5869645 5763392 5831439 6173878 6390476 6517805 6188052 6652049 6618101
16796F618101L78325O4521L88472J15093l3375L78590K02428J8281M30058n5684
$$ 6618101 6996426 7060947 7449419 7564512 7531137 7909727 8112155 8130436 8560494 8504810
16786H504810N12767L97291K9963L05902J66982J93172M34577Q40090n8839K85243
$$ 8504810 9017577 9414868 9444831 9750733 9917715 10110887 10545464 11385554 11326715 11611958
16776A1611958k2432M47657O20136M23024L49281K40564O46318Q56767K90914
$$ 11611958 11589526 12037183 12657319 13080343 13429624 13670188 14316506 15173273 15464187
16767A5464187J38005Q71555N43815O61986N73301O50398Q80957M49961J014294
$$ 15464187 15602192 16473747 17017562 17679548 18252849 18903247 19784204 20234165 21248459
16758B1248459Q70177R55383J095841R17269J338789R11523J322860J236125J509075
$$ 21248459 22118636 23074019 24169860 25087129 26425918 27337441 28660301 29896426 31405501
16749C1405501J829600J470324J838092K041427J957969J876457K419304K434584
$$ 31405501 33235101 34705425 36543517 38584944 40542913 42419370 44838674 47273258
16741D7273258L275644K656273L212818L128233L680441M029672M349224M502166
$$ 47273258 50548902 53205175 56417993 59546226 63226667 67256339 71605563 76107729
16733G6107729N008815N354887O120780O323022O743868P257094P430598Q259395
$$ 76107729 81116544 86471431 92592211 98915233 105659101 112916195 120346793 128606188
16725A28606188Q501638Q825578Q738251R092541Q951393Q548790P441013P054106
$$ 128606188 137107826 145933404 154671655 163764196 172715589 181264379 188705392 195759498
16717A95759498N815092M546629K539100J217654n03592k436449l704969n593691
$$ 195759498 201574590 206121219 208660319 209877973 209374381 206937932 203232963 197639272
16709A97639272o373074p483517q442236q599385q611377r340904r134038q365563
$$ 197639272 191266198 183782681 175340445 166741060 158129683 148788779 139654741 131289178
16701A31289178q335976q042395p532321o812068o826250n840121n543526n676167
$$ 131289178 122953202 114910807 107378486 100566418 93740168 87900047 82356521 76680354
16693G6680354m781449m541546m063924l559954l718244l339122k702256k936069
$$ 76680354 71898905 67357359 63293435 59733481 56015237 52676115 49973859 47037790
16685D7037790k369715k660312k178471k137744j842962k023124j471589j767155
$$ 47037790 44668075 42007763 39829292 37691548 35848586 33825462 32353873 30586718
16677C0586718j098404j551756j404009j229676q97641j513541n49346q91087
$$ 30586718 29488314 27936558 26532549 25302873 24405232 22891691 22342345 21451258
16669B1451258p33246r83005q49336o60184q33443n46263o13360n84859n18077
$$ 21451258 20718012 19735007 18885671 18225487 17392044 16845781 16232421 15647562 15129485
16660A5129485k26237m71369j029768m36850k55755l63456n43555k34871n20759
$$ 15129485 14903248 14431879 13402111 12965261 12709506 12346050 11802495 11567624 11046865
16651A1046865m74761j65578m08401L8694q35321j49926j98475l18149J06794
$$ 11046865 10572104 10406526 9998125 10036819 9201498 9051572 8853097 8534948 8641742
16642H641742k08102l95308n9193j57337n95241Q1134p8604l53160m85415L8551
$$ 8641742 8433640 8038332 7979139 7821802 7226561 7307695 7229091 6875931 6390516 6429067
16632F429067J73709l41700j78511k864m81057J21695m25059K03868l34329L1195
$$ 6429067 6602776 6261076 6082565 6079701 5598644 5720339 5295280 5499148 5164819 5196014
16622E196014j02820l60547J55103k17815O5026l91361L85764j58243k45907M6837
$$ 5196014 5093194 4732647 4887750 4669935 4734961 4343600 4729364 4571121 4325214 4372051
16612D372051K7241m09097J1962Q310l62163K13394k79052p7837k89282J51237
$$ 4372051 4399292 3990195 4002157 4010467 3648304 3861698 3582646 3504809 3215527 3366764
16602C366764j16272l0666J82375Q5596j66970k98918j44760l02090K06342K45181
$$ 3366764 3250492 3219826 3402201 3487797 3320827 3021909 2877149 2575059 2781401 3026582
16592C026582n42116M59075j62639l2623j5151k65924j123k0695r8918j23096
$$ 3026582 2484466 2943541 2780902 2748279 2733128 2467204 2466081 2445386 2346468 2223372
16582B223372q9615J70110K09896J55265n34899j06106J01566j27765l9284M00217
$$ 2223372 2133757 2303867 2513763 2669028 2134129 2028023 2129589 2001824 1962540 2362757
16572B362757k50270n3158n47923M48441j83432J08648o3397J71982J42854k81021
$$ 2362757 2112487 2059329 1511406 1959847 1776415 1885063 1821666 1993648 2136502 1855481
16562A855481p5639l951j65807L1327p1985J2293Q2290Q4240k49494J41333j53537
$$ 1855481 1779842 1775891 1610084 1641411 1569426 1581719 1664009 1748249 1498755 1640088 1486551
16551A486551P6537k84874L41483l84392P1597K21471K0140o73590M03911O7357
$$ 1486551 1563088 1278214 1619697 1235305 1306902 1528373 1548513 874923 1278834 1346191
16541A346191j91648J87107K24j29304l565j7440K12966l48846o1687M7342p6852
$$ 1346191 1154543 1341650 1341874 1212570 1209005 1191565 1404531 1055685 993998 1041340 964488
16530I64488K0904O3881J12335j37808K49370q2219p0836K48377r5782k99496
$$ 964488 985392 1049273 1161608 1023800 1273170 1190951 1120115 1368492 1272710 973214
16520I73214J99846j88859J02801j15525N7222p5016J7013J14175l5414j17578
$$ 973214 1173060 984201 1087002 971477 1028699 953683 970696 1084871 1049457 931879
16510I31879J24708j76513K91235k34360m61630M38561j16073J18323k44396K83931
$$ 931879 1056587 880074 1171309 936949 475319 913880 797807 916130 671734 955665
16500I55665m8412p1741l80680K88216N1583j67860K23346L3101k40205K93709
$$ 955665 907253 835512 454832 743048 794631 626771 850117 883218 643013 936722
16490I36722k78411K53060k25947j9727m8042J4467J4608m2055O8668k2958J89454
$$ 936722 658311 911371 685424 665697 617655 632122 646730 604675 673343 650385 839839
16479H39839K84134E47208L84329k28699K86463j28772l30k86831J64055k27875
$$ 839839 1123973 547208 931537 702838 989301 860529 860199 573368 737423 509548
16469E09548q6J02334j36346K14858j67330A41104Q86129C83675M01458k20191
$$ 509548 509462 611796 475450 690308 522978 141104 1027233 383675 785133 564942
16459E64942J09955B62122K16836r8696R2243j19859J07153m0556J75708J15538
$$ 564942 674897 262122 478958 380262 472505 352646 459799 419243 594951 710489
16449G10489j0409j35020j26445J13539j05612A56481K06158J89393B43213Q8636
$$ 710489 700080 565060 438615 552154 446542 156481 362639 552032 243213 331849
16439C31849J9570j58474K06907J06181L09479C28632J07946A35547L97917k40038
$$ 331849 351419 192945 399852 506033 815512 328632 436578 135547 533464 293426
16429B93426L71943j53056k51386L31191G3571L37858J94298j75515J05201j67829
$$ 293426 665369 512313 260927 592118 73571 411429 605727 430212 535413 367584
16419C67584M27680l53761B16408K36007k6594o2929L66661A70581J13440K28601
$$ 367584 795264 441503 216408 452415 425821 362892 729553 170581 284021 512622
16409E12622Q3314r6337j84211R4718j74894J44529A31136R3258M9858o5403N25302
$$ 512622 595936 499599 315388 410106 235212 379741 131136 224394 274252 208849 734151
16398G34151A86774Q2608J07828j6960M3955j90552J454l0974j0466M2547K2513
$$ 734151 186774 269382 377210 360250 404205 213653 215107 184133 173667 216214 238727
16387B38727J83228A86811L42942k18767J52090j70580A4319J97923K00638p7429
$$ 238727 421955 186811 529753 310986 463076 292496 14319 212242 412880 335451
16377C35451j26070J69119j74052I640a76310C93533O0195j89017G7608M28118
$$ 335451 209381 378500 204448 9640 -176310 393533 453728 264711 77608 505726
16367E05726j82965n9052n2494P6231R7275J69250k42251m651H328J84323K88731
$$ 505726 322761 263709 211215 287446 384721 553971 311720 307069 8328 192651 481382
16356D81382j71679N6604a51776m9529B19866Q6681M6847A18032M7269B9479i3730
$$ 481382 309703 366307 -151776 -201305 219866 306547 353394 118032 165301 29479 -93730
16344A78374l926P7154J34715J6378G4388K24493r1709G433a63668C49121M4424
$$ 178374 174448 251602 386317 402695 74388 298881 207172 7433 -163668 349121 393545
16333C93545P5455M480b2142C55292Q5901j2204E1743j4925L04291P3547q7782
$$ 393545 469000 473480 -22142 355292 441193 428989 51743 36818 341109 414656 326874
16322C26874r1561j12136J06727J29665A37536K7996L80759B38382D5363J72478
$$ 326874 235313 123177 229904 359569 137536 165532 546291 238382 45363 217841
16312B17841p537J9304j01238J19906J90007A85502H1937J63027P8002E6741J17230
$$ 217841 210304 229608 128370 248276 438283 185502 81937 244964 322966 56741 173971
16301A73971O1252A17473J57321j87J34801A90885J3922P8064h2197A14173l7188
$$ 173971 235223 117473 274794 274607 409408 190885 204807 282871 -82197 114173 76985
16290G6985c928C41094E6148j58j3963M81032G3037A4605L3873J95356H7779O7661
$$ 76985 -3928 341094 56148 55990 42027 523059 73037 14605 48478 243834 87779 155440
16278A55440m9336a86914A32924a8283B63941L7760j13651A9133J75628A8260
$$ 155440 106104 -186914 132924 -18283 263941 301701 188050 19133 194761 18260
16267A4063c92406B81968a78725D68029A47924L44505a06387C35737r0833b8017
$$ 14063 -392406 281968 -178725 468029 147924 492429 -106387 335737 244904 -28017
16256b7828r6002N5616E4489J58336N9460A12139M48665A41714J08130f2924C4681
$$ -27828 -123830 -68214 54489 212825 272285 112139 560804 141714 249844 -62924 34681
16244E6663M83532B44353L0690a46650B76065b01023H9419d7157A0289a15116
$$ 56663 540195 244353 275043 -146650 276065 -201023 89419 -47157 10289 -115116
16233D4557G275h7845j90619I3070L41367b24219A28320d5987A73477J16666b66377
$$ 44557 7275 -87845 -278464 93070 434437 -224219 128320 -45987 173477 290143 -266377
16221A71260c2855m2875i677A03434g9655A80492l8982o8660e5177A01707M7153
$$ 171260 -32855 -75730 -9677 103434 -79655 180492 141510 72850 -55177 101707 148860
16210A48860G1677J95265g5604C13813a4838o8123j12679A81047o9363e9680A30965
$$ 148860 71677 266942 -75604 313813 -14838 -82961 -195640 181047 111684 -59680 130965
16198C42439f2178B13218k3813G0146b97361B06688J6236f275j23047A45190d1235
$$ 342439 -62178 213218 189405 70146 -297361 206688 222924 -6275 -129322 145190 -41235
16186d8675q2346a7506B58989a61148M2278j57551J06110B63707j21019K6300
$$ -48675 -131021 -17506 258989 -161148 -118870 -276421 -170311 263707 142688 168988
16176A68988a83922M3258d0324j38990C1359K53268B5663I703K52911f6316j84180
$$ 168988 -183922 -140664 -40324 -179314 31359 284627 25663 9703 262614 -66316 -250496
16165b50496B64467C4060a16178C70420A23203k546l5761K32652H0433g1134B35220
$$ -250496 264467 34060 -116178 370420 123203 120657 84896 317548 80433 -71134 235220
16153A23324D9741a30563J4760j80245J9450B54694Q6841b8662J1283A42342b48427
$$ 123324 49741 -130563 -115803 -296048 -276598 254694 341535 -28662 -17379 142342 -248427
16141B67702I5167A3747J73951A7251M5361J90289F5648L82405a24365F8493g5657
$$ 267702 95167 13747 187698 17251 62612 252901 65648 448053 -124365 68493 -75657
16129A525c54708I9397a23234A48276a51685L2870K2455A27584P4942I154a07187
$$ 1525 -354708 99397 -123234 148276 -151685 -118815 -96360 127584 202526 9154 -107187
16117C48480b9784j92306A61163F043d2676o0081A45210c7566j2910A58559g2759
$$ 348480 -29784 -222090 161163 6043 -42676 -102757 145210 -37566 -50476 158559 -72759
16105a42122c9205A06162K8427a9574A58612K05009H9844g9394a3922A1769d0100
$$ -142122 -39205 106162 134589 -19574 158612 363621 89844 -79394 -13922 11769 -40100
16093h4495k06943F5885K61609b48380j17875f7055K7746A01446G705h8251A90022
$$ -84495 -291438 65885 327494 -248380 -366255 -67055 -39309 101446 7705 -88251 190022
16081c25882C69983b44209k62222B73265j4329A18087D1879l140J11899n0484
$$ -325882 369983 -244209 -506431 273265 258936 118087 41879 38739 150638 100154
16071A00154b00255B128J88313a01075r9142C8917J93995a36328o8758N7297d4931
$$ 100154 -200255 2128 190441 -101075 -200217 38917 232912 -136328 -205086 -147789 -44931
16059B35437I2698b23413A36525d7147A22416J15936j4901a3418C07760a86931
$$ 235437 92698 -223413 136525 -47147 122416 238352 223451 -13418 307760 -186931
16048b6707J1770C56445j29151a37648e4950F2222J32966a13201j64458A46384
$$ -26707 -14937 356445 227294 -137648 -54950 62222 195188 -113201 -277659 146384
16037b3652m9974C6046g4495r0377d1483j55357A95112c59142a21572d430C154
$$ -23652 -73626 36046 -74495 -164872 -41483 -196840 195112 -359142 -121572 -4430 3154
16025a54143o6358A18184f1321A26342d6607A62861O5163a23202a2436m3164j50907
$$ -154143 -220501 118184 -61321 126342 -46607 162861 228024 -123202 -12436 -55600 -206507
16014b06507n6604C2584c9721m4844F7389a26885N6759l9820d6233l2731j51087
$$ -206507 -263111 32584 -39721 -84565 67389 -126885 -70126 -109946 -46233 -78964 -230051
16003b30051B46482B6374i160G7748M2180j5206b02223i0045b0522o6354n6188
$$ -230051 246482 26374 -9160 77748 119928 104722 -202223 -90045 -20522 -86876 -143064
15992a43064B27876f3634j34925A72154l5011d30324J86231e5197h916D9186P1399
$$ -143064 227876 -63634 -198559 172154 137143 -430324 -244093 -55197 -8916 49186 120585
15981A20585a56301C39483A43024n6654h3430j6282b4152j14236B19681b5277
$$ 120585 -156301 339483 143024 86370 -83430 -99712 -24152 -138388 219681 -25277
15970b54034J12697k2002h0908n6842p9327d6695o4166e4120J6631B69903A17530
$$ -254034 -141337 -163339 -80908 -137750 -217077 -46695 -110861 -54120 -37489 269903 117530
15958c4685q2235C4367a73998a3094E2037k1847a80367j75628J01281f6582E261
$$ -34685 -116920 34367 -173998 -13094 52037 30190 -180367 -355995 -254714 -66582 5261
15946A2993c0604p4783k8282a0294j06818F8410H918i1541p8174j6655H6892i3742
$$ 12993 -30604 -105387 -133669 -10294 -117112 68410 8918 -91541 -169715 -186370 86892 -93742
15933i398j78136k14456a56413n0560B25603B9703B558b243l53137r3077H1958
$$ -9398 -187534 -401990 -156413 -206973 225603 29703 2558 -2243 -355380 -448457 81958
15921e7087q957r2023I3505f0879k59560k2372c4631m29040a76781j17482f7818
$$ -57087 -66044 -158067 93505 -60879 -320439 -342811 -34631 -463671 -176781 -294263 -67818
15909b81975D3430e5585k44969A05557a05166K7543B27555b15095a07169j49881
$$ -281975 43430 -55585 -300554 105557 -105166 -77623 227555 -215095 -107169 -257050
15899b57050C6747K74298F2511d6416r035H6752a17770H3858R3101e3096B9256
$$ -257050 36747 311045 62511 -46416 -55451 86752 -117770 83858 176959 -53096 29256
15887b34678A10033f9861q1096b071k71148A77606d7220j86394a01287A16009
$$ -234678 110033 -69861 -150957 -2071 -273219 177606 -47220 -233614 -101287 116009
15876f60k80328G603h3328J0555b0495B3940b90766D4554J54818c713j32132M6097
$$ -660 -280988 7603 -83328 -72773 -20495 23940 -290766 44554 199372 -3713 -135845 -89748
15864h9748I766a85784C47837a2706F056a45231q4511d9924I8004I213c82432
$$ -89748 9766 -185784 347837 -12706 6056 -145231 -229742 -49924 98004 9213 -382432
15852a24266l29132B30921a40124D8374i580k93024C072b35279b9261j63365B41079
$$ -124266 -453398 230921 -140124 48374 -9580 -302604 3072 -235279 -29261 -192626 241079
15840b81946g7229M226l0005c1468B02402b27499A87997G5030P4745E3929J4529
$$ -281946 -77229 -73003 -103008 -31468 202402 -227499 187997 75030 149775 53929 68458
15829F8458f4224B56662J5242e24351A04302a60143M5570j9817j03537j73286
$$ 68458 -64224 256662 271904 -524351 104302 -160143 -114573 -134390 -237927 -411213
15819d11213a37160L0413A43d2503B17076b13124r091A55783H248a82675K6102
$$ -411213 -137160 -106747 143 -42503 217076 -213124 -222215 155783 8248 -182675 -156573
15808a56573F6945a47829J5732M9776I8596h0634k03347a16905C16530b10760
$$ -156573 66945 -147829 -132097 -82321 98596 -80634 -283981 -116905 316530 -210760
15797g2960l5919n70737h6824L3877q1717P638q6613i2870D99379b91268D6726
$$ -72960 -108879 -679616 -86824 -52947 -134664 -127026 -213639 -92870 499379 -291268 46726
15785A41930a92192f8981A38573f2965j53275B23647J664b25780c6015H7267P1182
$$ 141930 -192192 -68981 138573 -62965 -216240 223647 225311 -225780 -36015 87267 158449
15774A58449j6881b91681A27455d9956A94741h1998A39255e215l6314k3131B94694
$$ 158449 141568 -291681 127455 -49956 194741 -81998 139255 -5215 -41529 -64660 294694
15762G7925K9054K09291H2058d89823A43107e8592r4709O5585b7405j07969O3880
$$ 77925 106979 316270 82058 -489823 143107 -58592 -153301 -87716 -27405 -135374 -71494
15751g1494C13561j45990B802L4879M1239M3535J17285g5885k51004J52966P6284
$$ -71494 313561 167571 2802 37681 78920 122455 239740 -75885 -326889 -173923 -97639
15740i7639A80537q7492g4023a3570C4803a26552j99904a2802C06822o2032F6636
$$ -97639 180537 93045 -74023 -13570 34803 -126552 -326456 -12802 306822 244790 66636
15728f2259E13188a01824A00597d51518A07167P6897a15990b4395q0236B4468
$$ -62259 513188 -101824 100597 -451518 107167 184064 -115990 -24395 -104631 24468
15717a84545A75630A1043a13386A89286a14438j8165n8271G0846k9393K1167e146
$$ -184545 175630 11043 -113386 189286 -114438 -132603 -190874 70846 41453 62620 -5146
15705a74454g2528j7745j90589A25167a0458A6774J04503i369p7138A71405f3212
$$ -174454 -72528 -90273 -280862 125167 -10458 16774 121277 -9369 -86507 171405 -63212
15693c01751e6970o9819b5078H7442j1012c8191n7184J2326A20101A8099i9906
$$ -301751 -56970 -126789 -25078 87442 76430 -38191 -95375 -83049 120101 18099 -99906
15681G168L1807c5554p3555j45398j06958O5024a4024j50950a6020A11441k4166
$$ 7168 38975 -35554 -109109 -254507 -361465 -296441 -14024 -164974 -16020 111441 87275
15670H7275P3083b80016A5588a03321a0270B57237a2221A2700J25881o2305N3453
$$ 87275 160358 -280016 15588 -103321 -10270 257237 -12221 12700 138581 76276 129729
15659A29729b53330a15682o3384j7481I605a90415A73790h2171p0176N6253l15845
$$ 129729 -253330 -115682 -179066 -196547 9605 -190415 173790 -82171 -152347 -96094 -411939
15648d11939a06361B240g23266b00640B8205h939p9058B51233a88558k8373B03796
$$ -411939 -106361 2240 -723266 -200640 28205 -8939 -87997 251233 -188558 -216931 203796
15636d768k57195i7728k56440e513F9914J23480r3576a11684k13603o387a9049
$$ -4768 -261963 -97728 -354168 -5513 69914 193394 99818 -111684 -325287 -331674 -19049
15624a59449n5598k52916a44843o751B28794a69913A27543f7203f700n7199n3514
$$ -159449 -215047 -467963 -144843 -151594 228794 -169913 127543 -67203 -6700 -63899 -117413
15613a17413j1945A46489g7348j46346H4417M1207a27920D0776b14910i3843k02596
$$ -117413 -129358 146489 -77348 -223694 84417 125624 -127920 40776 -214910 -93843 -296439
15602b96439l63C617b73093n4584J00177D1440g2876A9864h9470C38544A21633
$$ -296439 -296802 3617 -273093 -327677 -227500 41440 -72876 19864 -89470 338544 121633
15590b16166c8452j5173A45899a70026C74398c7549A27338j5412a81226I535h843
$$ -216166 -38452 -53625 145899 -170026 374398 -37549 127338 111926 -181226 9535 -8843
15578g230m1427A64747p5785J96156m1267a08445L6412a6517B14045A4698c71776
$$ -7230 -48657 164747 88962 285118 243851 -108445 -72033 -16517 214045 14698 -371776
15566b64921A10870f3170K245k40990A01886m1547g722p1979K4413K864k5122
$$ -264921 110870 -63170 -60925 -301915 101886 60339 -7722 -79701 -55288 -52424 -77546
15555g7546o0030E6907a58860n052B08146c15966b1941q0008A51289a85473A15741
$$ -77546 -137576 56907 -158860 -163912 208146 -315966 -21941 -101949 151289 -185473 115741
15543a76822I549a35964C88218j42316a4494k30545k6594H4672a16091k52646
$$ -176822 9549 -135964 388218 245902 -14494 -245039 -271633 84672 -116091 -368737
15533c68737h350A06230m8302f353k94862J30298B68455E016O4167J37613a95901
$$ -368737 -8350 106230 57928 -6353 -301215 -170917 268455 5016 69183 206796 -195901
15521c14077o5938G2591g822A91454a1782j31932A28820o084A9218L20065b7798
$$ -314077 -380015 72591 -7822 191454 -11782 -143714 128820 122736 19218 339283 -27798
15509A14327b3230J197A78622C9472d6381j44090D5164N7606a06218F3299a74566
$$ 114327 -23230 -22033 178622 39472 -46381 -190471 45164 102770 -106218 63299 -174566
15497B7435J7120a71743G0769a36112C3702h5071A02269C6405J23489j2836J0204
$$ 27435 44555 -171743 70769 -136112 33702 -85071 102269 36405 159894 147058 157262
15486A57262E9138d4680I9672e2344m0886A85772e4557B14091i6249j44010H4526
$$ 157262 59138 -44680 99672 -52344 -93230 185772 -54557 214091 -96249 -240259 84526
15474B8425N0784N6842c0372E9448c2525l57804D05538b32676H5934C9075c08824
$$ 28425 79209 136051 -30372 59448 -32525 -390329 405538 -232676 85934 39075 -308824
15462a1254j24740l5339B5686J27513b3711D70810a7046k23945H206b52487J21241
$$ -11254 -135994 -171333 25686 153199 -23711 470810 -17046 -240991 8206 -252487 -131246
15451a31246d394q2553J220G9921a49339k55735M3755j44581D0409O142b8040
$$ -131246 -4394 -86947 -85727 79921 -149339 -405074 -361319 -505900 40409 46551 -28040
15439a97184e8874q6464n7981f4881A19184n020f4532j71932a646j917j65487
$$ -197184 -58874 -145338 -203319 -64881 119184 114164 -64532 -236464 -1646 -3563 -169050
15428a69050a4020p9141m3043B40467A6185a24706A61468R1401C4138P9775d8556
$$ -169050 -14020 -93161 -136204 240467 16185 -124706 161468 252869 34138 113913 -48556
15416A84067b53143g8698k26723A23971L13750a54426C2945Q5343g0064c0282
$$ 184067 -253143 -78698 -305421 123971 437721 -154426 32945 118288 -70064 -30282
15405A6005Q3559i3674A20148C8695b41821K3018c0090n1491a7113m4722K0669
$$ 16005 99564 -93674 120148 38695 -241821 -218803 -30090 -81581 -17113 -61835 -41166
15394d1166l07779N5789d636k46698A83320q6105A9980L1960K50170j35391a43518
$$ -41166 -348945 -293156 -4636 -251334 183320 97215 19980 51940 302110 166719 -143518
15382A57713Q671L9335i0570r682j99634a46415B9887R6792b37210R7922F7488
$$ 157713 166384 205719 -90570 -100252 -299886 -146415 29887 126679 -237210 -139288 67488
15370A56380c9148B5658L613M5045b99957A89393J994f2212b1479j795k29781
$$ 156380 -39148 25658 29271 74316 -299957 189393 191387 -62212 -21479 -23274 -253055
15359b53055A54750b01726J6343A49323N650K7979q1999K1449a37189A19921L0802
$$ -253055 154750 -201726 -185383 149323 154973 182952 100953 122402 -137189 119921 150723
15348A50723B2782d4360A31714L27745b36379e7153j65069e8446m6688A90181
$$ 150723 22782 -44360 131714 459459 -236379 -57153 -222222 -58446 -105134 190181
15337b89102c3484B5646b05880G1545b07018D1056J6563J54268O5359H8244Q9550
$$ -289102 -33484 25646 -205880 71545 -207018 41056 57619 211887 277246 88244 177794
15326A77794b8004j9114o386B88817A1637f0700j32355Q5325B23628C181e8427
$$ 177794 -28004 -47118 -53504 288817 11637 -60700 -193055 -107730 223628 3181 -58427
15314B80663p6310H532a61056C0492R7684o159J03241a87929H302K72418a09218
$$ 280663 204353 8532 -161056 30492 128176 122017 225258 -187929 8302 280720 -109218
15302a33128F7261J66377b72458E8462a74052Q2956B27329k8916E2782L6601M9925
$$ -133128 67261 233638 -272458 58462 -174052 -91096 227329 198413 52782 89383 139308
15291A39308J18565A20661K2361o5769a59408B34689P8799k2671j23174b68296
$$ 139308 257873 120661 143022 77253 -159408 234689 313488 290817 167643 -268296
15280A03820c33092a61324A18927d7327p9376r342A47721M7279c28359I5791D2960
$$ 103820 -333092 -161324 118927 -47327 -126703 -136045 147721 195000 -328359 95791 42960
15268C2745K00355b69178P1537j47584O9165A81081B7612K85484j33759D0869
$$ 32745 233100 -269178 -197641 -345225 -276060 181081 27612 313096 179337 40869
15257a00464A32756O8372i152C77525a09367C04034A26692q597K01705m2337M14404
$$ -100464 132756 201128 -9152 377525 -109367 304034 126692 118095 319800 277463 691867
15246F91867M42627J003027Q72645r00943P30038j371077G05229l30781q9318
$$ 691867 1134494 2137521 3010166 2109223 2839261 1468184 705229 374448 285130
15237B85130b6801A25843A67d2550j14398f5472A49874O8113L04816C3094a46287
$$ 285130 -26801 125843 167 -42550 -156948 -65472 149874 217987 522803 33094 -146287
15225F1885J87239G1583L0469i1623j48073A87054B674J32091b41559g9791H0183
$$ 61885 249124 71583 102052 -91623 -239696 187054 2674 134765 -241559 -79791 80183
15213a30843D9566J89963j15678L1330a79422C26061a3881A88458D9309J77967
$$ -130843 49566 239529 123851 155181 -179422 326061 -13881 188458 49309 227276
15203B27276r7178a13342H653L2280K8375J70390D0521L17841a17285D6014C94
$$ 227276 130098 -113342 8653 40933 69308 239698 40521 358362 -117285 46014 394
15191B1365J65238o3333a7397A21644N7209n6878a17265A59378c0598A38721j6546
$$ 21365 186603 123270 -17397 121644 178853 121975 -117265 159378 -30598 138721 122175
15180A22175a59633j34231e0249B96134i36n44997E0671a7613H5185M4867i5260
$$ 122175 -159633 -293864 -50249 296134 -936 -545933 50671 -17613 85185 130052 -95260
15168C19037A21654k0937C8226O5692b00960k5972B61867a6283k430F7706j0741
$$ 319037 121654 100717 38226 103918 -200960 -226932 261867 -16283 -18713 67706 56965
15157E6965J42142a00016B14092J42209d04637g0898B29860l9157J28915j55065
$$ 56965 199107 -100016 214092 356301 -404637 -70898 229860 190703 319618 164553
15147A64553E0679b29531A0573g1082K447B09424E2525Q2798i6319o6761B29379
$$ 164553 50679 -229531 10573 -71082 -68635 209424 52525 135323 -96319 -163080 229379
15135C97003a94914A63047J21260j9229C9822a95528a9922A91245P137E6474K63586
$$ 397003 -194914 163047 284307 265078 39822 -195528 -19922 191245 198382 56474 320060
15124C20060b99311A66919E4783P7282B3930L88509A55064J44904c77905F69929
$$ 320060 -299311 166919 54783 132065 23930 412439 155064 299968 -377905 669929
15113C9839a53270I8222l692a50966f5732D92033F9736Q3876B109f5782b7554
$$ 39839 -153270 98222 94530 -150966 -65732 492033 69736 153612 2109 -65782 -27554
15101B74509r4309q8028j017K04248a12181l8134C57143D1030J94258r8923e882
$$ 274509 180200 92172 91155 295403 -112181 -150315 357143 41030 235288 136365 -5882
15089g0430B05240p6630C2830K81205d1642l4627A41507K61812j82612e3352p7935
$$ -70430 205240 128610 32830 314035 -41642 -76269 141507 403319 220707 -53352 -131287
15078a31287E14961A16341P9179K35907j41819A36745a09253k47208C19553m4250
$$ -131287 514961 116341 195520 431427 289608 136745 -109253 -356461 319553 275303
15068B75303r859j08422b6816B49877K43327D2089a40622C1824P1102N4261B130
$$ 275303 265444 157022 -26816 249877 493204 42089 -140622 31824 102926 157187 2130
15056D1748K39729r4972a79404A0883J32619F4172J56543g6050I8702N7006G2244
$$ 41748 281477 186505 -179404 10883 143502 64172 220715 -76050 98702 155708 72244
15044A83752N3625r4516e1213B00445b00004K0563A0617J77414a84249A14811
$$ 183752 237377 142861 -51213 200445 -200004 -179441 10617 188031 -184249 114811
15033B30358n5196J80787p9952P2162G2958K75784A23554J9517J17054k4749K09449
$$ 230358 175162 355949 275997 348159 72958 348742 123554 143071 260125 235376 444825
15022D44825j25497G6704J14661I1583J80988k3490g5097J3034A77432P6196N9285
$$ 444825 319328 76704 191365 91583 272571 249081 -75097 -62063 177432 253628 312913
15011C12913A22490m1824L31501B3223M57406a2701r5854B44767k0217p1156M35882
$$ 312913 122490 80666 412167 23223 480629 -12701 -108555 244767 224550 153394 589276
15000E89276k06100a59746f4848E08579j28605M2784E885K08582K71843A29844
$$ 589276 383176 -159746 -64848 508579 379974 422758 5885 214467 486310 129844
14989B36694p1236a27614A01884D0026J36638K9200H3070a87505C37338j40722
$$ 236694 165458 -127614 101884 40026 176664 205864 83070 -187505 337338 196616
14979A96616k6698n1221b8831k7083A47234J67107J17355j26263a0357D80224
$$ 196616 169918 118697 -28831 -55914 147234 314341 431696 305433 -10357 480224
14968c6518B98226G1146J79023B1804a8342A04274b4524B97985o4977b6000D41217
$$ -36518 298226 71146 250169 21804 -18342 104274 -24524 297985 233008 -26000 441217
14956B50493j02141J11668b4657A21165J6890E9445O391J25956I5077K65904C4371
$$ 250493 148352 260020 -24657 121165 138055 59445 65836 191792 95077 360981 34371
14944B96192j47720N36296B42069A01795L69145i9989a4419p0315B20006C1278
$$ 296192 148472 684768 242069 101795 470940 -99989 -14419 -84734 220006 31278
14933B45522g3008E39006j60284J24246B05555N54799B50522I4196R5713m5296
$$ 245522 -73008 539006 378722 502968 205555 760354 250522 94196 189909 144613
14923A44613K64699j83086L79042j27582j14541A44609K49754A82861N39641G9170
$$ 144613 409312 226226 605268 477686 363145 144609 394363 182861 722502 79170
14912C64693j45112C9488L22560j34870J61087L0425j66507M0097A43491h9759
$$ 364693 219581 39488 362048 227178 388265 418690 252183 292280 143491 -89759
14901d9623B70625k9604K7742F9890L72798j09595M4771p0493n9634M9461J45024
$$ -49623 270625 241021 268763 69890 442688 333093 377864 307371 247737 297198 442222
14890D42222j15695g6474A00390M43622k66469N2693o4594A00667K78178N8965
$$ 442222 326527 -76474 100390 544012 277543 330236 265642 100667 378845 437810
14880D37810n5253j71537j00763J95283J36020o1648A44617k4246B7145P9684
$$ 437810 382557 211020 110257 305540 441560 379912 144617 120371 27145 106829
14870A06829K87643m477p36j93124K92778k31776J98929j30730N5267A68849J37319
$$ 106829 394472 389995 389259 196135 488913 257137 456066 325336 380603 168849 306168
14859C06168Q1617q1345D7023L10938J93994A99049K06171J4172E9484M85909
$$ 306168 387785 306440 47023 357961 551955 199049 405220 419392 59484 545393
14849E45393k55919L28415A87049J27085A00199L8707O03981C52669J55316O7083
$$ 545393 289474 617889 187049 314134 100199 138906 742887 352669 507985 575068
14839E75068o7847K2589j70830r8966J3649J54896r4786J86282B04006K41312
$$ 575068 507221 529810 358980 260014 273663 428559 333773 520055 204006 445318
14829D45318J2543j98917M62575B25738J60118J25180r0838A00463J30856J84457
$$ 445318 457861 258944 721519 225738 385856 511036 420198 100463 231319 415776
14819D15776L6281j09583P308N39763j55014l44186L6426J77740J93814l85244
$$ 415776 452057 342474 349782 889545 734531 390345 426771 604511 798325 413081
14809D13081M1661O5625J50885B09397n4515J27977J7437N7491A64446L14443
$$ 413081 454742 520367 671252 209397 154882 282859 300296 357787 164446 478889
14799D78889j65327J86036A71527K36748j79689K08041P0686J81195k32173j06518
$$ 478889 313562 499598 171527 408275 228586 436627 507313 688508 456335 349817
14789C49817n9590P5594j30873M41661p7508M37405C30034m9357L02349j12373
$$ 349817 290227 365821 234948 676609 599101 1036506 330034 280677 583026 470653
14779D70653l440o9043l6490K94569k56663P3429j627J85596k57047L19143K44638
$$ 470653 467213 398170 361680 656249 399586 473015 471388 656984 399937 719080 963718
14768I63718l61567J83130q4646J3911k69004B20165K49388j48583K62947J31826
$$ 963718 602151 785281 700635 714546 445542 220165 469553 320970 583917 715743
14758G15743k43381J85492k26816j63081J26265K81814J59541j05976j64880L0603
$$ 715743 472362 657854 431038 267957 394222 676036 835577 729601 564721 595324
14748E95324m5724Q2112j74866K81669j3599j0127J12677J65089m09358J33922
$$ 595324 549600 631712 456846 738515 724916 714789 827466 992555 583197 717119
14738G17119p8290k98579M31024k48766K22907N687k80279L50086C95278J29361
$$ 717119 638829 340250 771274 522508 745415 751102 470823 820909 395278 524639
14728E24639J95733l16911L49700k35709N8592K08947M39k64827R2006L43256
$$ 524639 720372 403461 753161 517452 576044 784991 785430 520603 612609 955865
14718I55865C83125J32595O64158n37393q6007n3443k36804N05562k73901M8798
$$ 955865 383125 515720 1179878 642485 556478 503035 266231 771793 497892 546690
14708E46690L94866q2183m0178k30384M29579j72238R7634j52417j28193L11199
$$ 546690 941556 859373 819195 588811 1018390 846152 943786 791369 663176 974375
14698I74375o5060j6586l27680L77815J91273m51691J80426L2409k66463M27005
$$ 974375 909315 892729 565049 942864 1134137 682446 862872 895281 628818 1055823
14688A055823n06931L39578n9913j39285R7759P1095l40266J83587L07870m24528
$$ 1055823 548892 888470 828557 689272 787031 858126 517860 701447 1009317 584789
14678E84789N55583J43154l21901q1742J27423k52141J74021K9777m3703k43637
$$ 584789 1140372 1283526 961625 879883 1007306 755165 929186 958963 915260 671623
14668F71623K21986j3912o383L03332n39105K39005j26591J06605J7646K35530
$$ 671623 893609 879697 873314 1176646 637541 876546 749955 856560 874206 1109736
14658A109736J96372l18549M9038j60993m8966O8464o3890M5369K09043N55L0964
$$ 1109736 1306108 987559 1036597 875604 826638 895102 831212 876581 1085624 1086179 1117143
14647A117143k14280M4147J30632k11119K6293J13316J61636N8801l68571K45793
$$ 1117143 902863 947010 1077642 866523 892816 1006132 1167768 1226569 857998 1103791
14637A103791j02102J8887L84179k31314K45161j71555j22380j70657N65009m17392
$$ 1103791 1001689 1020576 1404755 1173441 1418602 1247047 1124667 954010 1519019 1101627
14627A101627J05512k6847Q9959j48945J36943R1262j43115P3135N2978l6887
$$ 1101627 1207139 1180292 1270251 1121306 1258249 1349511 1206396 1279531 1332509 1295622
14617A295622J33446l86032L03367J39780q3629o7973L26291j89685k71218K48239
$$ 1295622 1429068 1043036 1346403 1486183 1402554 1334581 1660872 1471187 1199969 1448208
14607A448208j68492J61728j48360K90825Q996j61778J45388j91332J8858J30230
$$ 1448208 1279716 1441444 1293084 1583909 1592905 1431127 1576515 1385183 1404041 1534271
14597A534271l5404J00390J02048l97486N01481j7089j90729k966J60241J3646
$$ 1534271 1498867 1599257 1701305 1303819 1805300 1788211 1597482 1594516 1754757 1768403
14587A768403P9101q6259N3820l96430M84981j75495N7734k35896O1287J16226
$$ 1768403 1847504 1761245 1815065 1418635 1903616 1728121 1785855 1549959 1611246 1727472
14577A727472K41826J1464P8343j13629n3768P0865j18218j42297N74753m77721
$$ 1727472 1969298 1980762 2059105 1945476 1891708 1962573 1844355 1702058 2276811 1799090
14567A799090Q8105R1648K62620j85127p8711M57905l11479J5342O37225k13262
$$ 1799090 1887195 1978843 2241463 2056336 1977625 2435530 2124051 2139393 2776618 2563356
14557B563356q0477J79410M32082L26306K29949J93638j80095J458878J844723
$$ 2563356 2482879 2662289 3094371 3420677 3650626 3844264 3664169 5123047 6967770
14548F967770M192364R258346J3173952J0101035k0453199I127513l790229J48263
$$ 6967770 11160134 20418480 33592432 43693467 23240268 9127513 5337284 5485547
14540E485547J518776q22485l078658j112189j2524K3990k70293J95649M771l6706
$$ 5485547 7004323 6181838 3103180 1990991 1978467 2002457 1732164 1927813 1932584 1895878
14530A895878j0913K60788r6014j05141O9481N8457O74045n66853k26080J64878
$$ 1895878 1884965 2145753 2049739 1944598 2014079 2072536 2746581 2179728 1953648 2118526
14520B118526N02777m59543R8048j38150K27614K53887k21561J09579k58280L74998
$$ 2118526 2621303 2161760 2259808 2121658 2349272 2603159 2381598 2491177 2232897 2607895
14510B607895k91137J96480J75184j23225J51940k70194K14961O4245k67202M79192
$$ 2607895 2316758 2513238 2688422 2565197 2717137 2446943 2661904 2726149 2458947 2938139
14500B938139q0787j28317J10417q6140L24459k53204j47010K40515m5547J84981
$$ 2938139 2857352 2729035 2839452 2753312 3077771 2824567 2677557 2918072 2872525 3057506
14490C057506J97766p1002J00202m1694J66097J9036k3577O6932J0994k59877
$$ 3057506 3255272 3184270 3284472 3242778 3408875 3427911 3404334 3471266 3482260 3222383
14480C222383j9954K06994j3956K91852j07524J64961p0669L43678m0272l53878
$$ 3222383 3202429 3409423 3395467 3687319 3579795 3744756 3674087 4017765 3977493 3623615
14470C623615J43879J30195j60086Q7543j76135R75307k62560J41350l35879J2753
$$ 3623615 3767494 3897689 3737603 3825146 3649011 4624318 4361758 4503108 4167229 4179982
14460D179982p1840J56833k0699K38194J13525K04204L9578k13258L65193O1716
$$ 4179982 4108142 4264975 4244276 4482470 4595995 4800199 4839777 4626519 4991712 5053428
14450E053428m04372K17668L15009O4272j88449J5017K10987r5627N54879l08251
$$ 5053428 4649056 4866724 5181733 5246005 5057556 5072573 5283560 5187933 5742812 5434561
14440E434561M47267j97926J40216Q6116j67855K05548L50933j95854j85213M34815
$$ 5434561 5881828 5683902 5824118 5910234 5742379 5947927 6298860 6103006 5917793 6352608
14430F352608l1455N15269k30442j23143R2911n489M07740m8499M48441l08399
$$ 6352608 6321153 6836422 6605980 6482837 6575748 6570259 6977999 6929500 7377941 7069542
14420G069542R6237M00271j53042J58987O7422L98102R7742j69800K18523R9721
$$ 7069542 7165779 7566050 7413008 7571995 7639417 8037519 8135261 7965461 8183984 8283705
14410H283705j56022L59381P2268O6223L40917k10515J38485K88694J85520K16658
$$ 8283705 8127683 8487064 8559332 8625555 8966472 8755957 8894442 9183136 9368656 9585314
14400I585314J74877L13859J15868j31911L43679M72046o84832Q46787P6661K30395
$$ 9585314 9760191 10074050 10189918 10058007 10401686 10873732 10188900 11035687 11112348 11342743
14390A1342743N132J60990L17841M83599K04832R8027M5457K85124J90049N03606
$$ 11342743 11347875 11508865 11826706 12310305 12515137 12613164 12658621 12943745 13133794 13637400
14380A3637400m23653Q21522K33907J83986K28091P76527K2935K33583P2636O12781
$$ 13637400 13213747 14035269 14269176 14453162 14681253 15457780 15480715 15714298 15786934 16399715
14370A6399715L37499M60051J80267J20349N58462L32127K56912L84174O66689
$$ 16399715 16737214 17197265 17377532 17497881 18056343 18388470 18645382 19029556 19696245
14361A9696245K84704N27365M72198O14024J88628O86918L19644O13107P61200
$$ 19696245 19980949 20508314 20980512 21594536 21783164 22470082 22789726 23402833 24164033
14352B4164033M08154Q01432N06224N67196O17254Q01617N03078Q16875R20562
$$ 24164033 24572187 25373619 25879843 26447039 27064293 27865910 28368988 29185863 30106425
14343C0106425O70856R41349N22984J197664Q68847J036738Q08086J085552J556432
$$ 30106425 30777281 31718630 32241614 33439278 34308125 35344863 36152949 37238501 38794933
14334C8794933O23037J304422J458643R35142J456566J411761J201881J632705
$$ 38794933 39417970 40722392 42181035 43116177 44572743 45984504 47186385 48819090
14326D8819090J620802J652806K186889J408179K300710K030101K071617K782658
$$ 48819090 50439892 52092698 54279587 55687766 57988476 60018577 62090194 64872852
14318F4872852J829327K741496K580608K907712K774094L137501L820571L206784
$$ 64872852 66702179 69443675 72024283 74931995 77706089 80843590 84664161 87870945
14310H7870945L992622L706889M166927M204974M815757M681268N639331N735467
$$ 87870945 91863567 95570456 99737383 103942357 108758114 113439382 119078713 124814180
14302A24814180O188417O238349O965536P285133P495066P855926R074183R174875
$$ 124814180 131002597 137240946 144206482 151491615 158986681 166842607 175916790 185091665
14294A85091665R334651J0857158J1059322J1890000J2168428J2724261J3721935
$$ 185091665 194426316 205283474 216342796 228232796 240401224 253125485 266847420
14287B66847420J4091387J5120239J5478261J5799614J6382539J6382420J6681482
$$ 266847420 280938807 296059046 311537307 327336921 343719460 360101880 376783362
14280C76783362J6292554J5774466J5321705J4195032J2891930J0397629Q363982
$$ 376783362 393075916 408850382 424172087 438367119 451259049 461656678 470020660
14273D70020660M747861n89944l314338k677556J115159j898055o651771r862884
$$ 470020660 474768521 474178577 470864239 468186683 469301842 467403787 460752016 450889132
14265D50889132j1245251j2635616j3371605j4542187j5401066j6453453j6480913
$$ 450889132 439643881 427008265 413636660 399094473 383693407 367239954 350759041
14258C50759041j6996521j6130770j6114573j5629410j4613265j4393022j3640367
$$ 350759041 333762520 317631750 301517177 285887767 271274502 256881480 243241113
14251B43241113j1973538r849889j1761893j1299026j0185918r829613q394855
$$ 243241113 231267575 221417686 209655793 198356767 188170849 178341236 169946381
14244A69946381q291357p769569p557739o988674o900474n588185n693180n192021
$$ 169946381 161655024 153885455 146327716 139339042 132438568 126850383 121157203 115965182
14236A15965182m888679n554234m098787l991223m309245l621917l373452l772095
$$ 115965182 111076503 105522269 101423482 97432259 93123014 89501097 86127645 82355550
14228H2355550l208907l006567k724082l118507k303627k526128k182286k301394
$$ 82355550 79146643 76140076 73415994 70297487 67993860 65467732 63285446 60984052
14220F0984052j763251k386813j611536k092241j624002j478320j624818j318763
$$ 60984052 59220801 56833988 55222452 53130211 51506209 50027889 48403071 47084308
14212D7084308j955629j112021j119979j121749j332709r96436p47385j221670
$$ 47084308 45128679 44016658 42896679 41774930 40442221 39445785 38698400 37476730
14204C7476730j464448r26324j015408m21786q38823j015773j007762p71330q50938
$$ 37476730 36012282 35085958 34070550 33648764 32809941 31794168 30786406 30015076 29164138
14195B9164138o79088m70613r91918o58403o67719o19186l42283q97855k43021
$$ 29164138 28485050 28014437 27022519 26364116 25696397 25077211 24734928 23837073 23594052
14186B3594052n57650m41401o38499l53056o34900m79680l16547k48403q67767
$$ 23594052 23036402 22595001 21956502 21603446 20968546 20488866 20172319 19923916 19056149
14177A9056149j84281m13377j41302o48613k40273l61740m72223j57746q7074
$$ 19056149 18871868 18458491 18317189 17668576 17428303 17066563 16594340 16436594 16349520
14168A6349520p50826j7495m6139m81511j84145n00304k28311m33501J64226l82293
$$ 16349520 15598694 15581199 15535060 15053549 14869404 14369100 14140789 13707288 13871514 13489221
14158A3489221l55004q6203n27411n9492m31850R9298m69870M9084l94890K68536
$$ 13489221 13134217 13048014 12520603 12461111 12029261 12128559 11658689 11707773 11312883 11581419
14148A1581419p90750M47849o64817L53524l16254n86359K78601m39457K70502
$$ 11581419 10790669 11238518 10573701 10927225 10610971 10024612 10303213 9863756 10134258
14139A0134258k83872l26267l17877o3850J95717k53701k39836n8880j83930N0129
$$ 10134258 9850386 9524119 9206242 9142392 9338109 9084408 8844572 8785692 8601762 8651891
14129H651891J55660l27472l90018P4545k25979k39190k20603K37338j25799j07951
$$ 8651891 8807551 8480079 8090061 8164606 7938627 7699437 7478834 7716172 7590373 7482422
14119G482422L0897j30696l50499J63941m41177K65419n391l90267L40558n03227
$$ 7482422 7513319 7382623 7032124 7196065 6754888 7020307 7014916 6624649 6965207 6461980
14109F461980j22987k0592l3612j47700L34976l54762l63397K19373p5814m81327
$$ 6461980 6338993 6318401 6284789 6137089 6472065 6117303 5753906 5973279 5897465 5416138
14099E416138L17584o8808J85974l98361L22097o93386L98158K23918l99304J12763
$$ 5416138 5733722 5664914 5850888 5452527 5774624 5081238 5479396 5703314 5304010 5416773
14089E416773o01881k11031L0636M89564k01326j19322j00443J69784n24735L05235
$$ 5416773 4814892 4603861 4634497 5124061 4922735 4803413 4702970 4872754 4348019 4653254
14079D653254J289k51602K68473p16867K7427M32318q7327k63598J26260j23882
$$ 4653254 4654543 4402941 4671414 3954547 3981974 4414292 4326965 4063367 4189627 4065745
14069D065745L33913j12549m53281K00709j68174J98704Q6636m4240o32990K84124
$$ 4065745 4399658 4287109 3833828 4034537 3866363 4065067 4151703 4107463 3474473 3758597
14059C758597J26609Q812j49498r6241k9960j92171p4557K14168J9432l42488
$$ 3758597 3885206 3894018 3744520 3648279 3618319 3426148 3351591 3565759 3585191 3242703
14049C242703J35542j61775J69106J99247l70442Q633K70084m38180J99352j2231
$$ 3242703 3378245 3216470 3385576 3584823 3214381 3223014 3493098 3054918 3254270 3242039
14039C242039O7604j82872m84q3168J73169j17924j63847q6007j45954L61468
$$ 3242039 3309643 3126771 3126287 3043119 3216288 3098364 2934517 2848510 2702556 3064024
14029C064024j30741R1835j41381N6746k81231J84701J07378m96421L09250r7630
$$ 3064024 2933283 3025118 2883737 2940483 2659252 2843953 2951331 2454910 2764160 2666530
14019B666530r2530J90081r066j31458k68225m0735Q2114K0024Q5472m33325L32506
$$ 2666530 2574000 2764081 2755015 2623557 2355332 2314597 2396711 2416735 2502207 2068882 2401388
14008B401388j30446j9619K30754p9194n03140L93197k18115q152J12152p0059
$$ 2401388 2270942 2251323 2482077 2402883 1899743 2292940 2074825 2066673 2178825 2108766
13998B108766J08078n80600O91660j80204q0351k03650J70431P4013M54720J113563
$$ 2108766 2216844 1636244 2327904 2147700 2067349 1863699 2034130 2108143 2562863 3676426
13988C676426L111795P749374J3722522J4965500j4218995A3468757n274104k241390
$$ 3676426 6788221 14537595 28260117 43225617 29006622 13468757 8194653 5953263
13980E953263r19365o99711m83302m88332m51574l5996J86783l79602l1910j98483
$$ 5953263 5033898 4334187 3850885 3362553 2910979 2874983 3061766 2682164 2650254 2451771
13970B451771k13582J04518n9335K40945j26883L23467n73406L4363l8760k11116
$$ 2451771 2238189 2342707 2283372 2524317 2397434 2720901 2147495 2181858 2143098 1931982
13960A931982K09410k63814J00710O6046l85170J26279J26861L44218l34581O4393
$$ 1931982 2141392 1877578 1978288 2044334 1659164 1785443 1912304 2256522 1921941 1986334
13950A986334k83750J35151j88549K64713j35703o7545j15491K90541j84697j88340
$$ 1986334 1702584 1837735 1649186 1913899 1778196 1710651 1595160 1885701 1701004 1512664
13940A512664J6686M1935J17191j8119L7391j68054L08613l75199O7515m1871
$$ 1512664 1529350 1571285 1688476 1670357 1707748 1539694 1848307 1473108 1540623 1498752
13930A498752K64300l37591J33829k6352r2475J486P4858N9357k15960J59324
$$ 1498752 1763052 1425461 1559290 1532938 1440463 1441949 1516807 1576164 1360204 1519528
13920A519528m6030l5832k7472O3608J42236j52791l5160k12275M2514L75733
$$ 1519528 1473498 1437666 1410194 1473802 1616038 1463247 1428087 1215812 1258326 1634059
13910A634059l50295N65q1670L52923o2778j0464Q5354m76425J03286l7925j41855
$$ 1634059 1283764 1284329 1202659 1555582 1492804 1482340 1567694 1091269 1194555 1156630 1014775
13899A014775K29899j49815N77270m04147J23592j1776l4694j82143J64830M2130
$$ 1014775 1244674 1094859 1672129 1267982 1391574 1379798 1345104 1162961 1327791 1369921
13889A369921k19772J29017n0742J34408l40415O5212J55702Q3855r6747k43350
$$ 1369921 1150149 1279166 1228424 1362832 1022417 1087629 1243331 1327186 1230439 987089
13879I87089R0972J06023K01378l2571k50914J80659m3073j20795l689R2380n2638
$$ 987089 1078061 1184084 1385462 1352891 1101977 1282636 1239563 1118768 1115079 1207459 1154821
13868A154821J6708k43453l95086M70015J95036n35984O90100m22082p4659L44948
$$ 1154821 1171529 928076 532990 1003005 1198041 662057 1352157 930075 855416 1200364
13858A200364m38436K48190j88464K65679j16201k35947L47703r1976J66787k87786
$$ 1200364 761928 1010118 821654 1087333 971132 735185 1082888 990912 1157699 869913
13848H69913M94490l82175Q8574O7630l46282O79866l29888j68035L76791n14109
$$ 869913 1364403 982228 1070802 1138432 792150 1472016 1142128 974093 1350884 836775
13838H36775j20937J30790K65847M5715j21942N9909K1984k43001j28626J72730
$$ 836775 715838 846628 1112475 1158190 1036248 1096157 1118141 875140 746514 919244
13828I19244J83229M8769E53499J39367J62839j34006L33829l1059l74494M40208
$$ 919244 1102473 1151242 553499 692866 855705 721699 1055528 1024469 649975 1090183
13818A090183l29343K33574p8989J16614q1157J60801l43817O7296P6528l1738
$$ 1090183 760840 994414 915425 1032039 950882 1111683 767866 835162 911690 879952
13808H79952R111j67409K44325k00957p1802j51482K96004J32904l93431l6951
$$ 879952 889063 721654 965979 765022 693220 541738 837742 970646 577215 540264
13798E40264R9512J38730M2366o582j30148J08011j01431q2101L16971j15153
$$ 540264 639776 778506 820872 814290 684142 792153 690722 608621 925592 810439
13788H10439r8365k09570M26277m29739L7422N10614k46232q8598J32170k61669
$$ 810439 712074 502504 928781 499042 536464 1047078 800846 712248 844418 582749
13778E82749j62255J1322K36502N2502l1835p0673L33671k71336J13061n6112
$$ 582749 420494 431816 668318 720820 688985 618312 951983 680647 793708 737596
13768G37596L133l65903K69106M66328m43348j2531q0196L71044k66973J78684
$$ 737596 740729 374826 643932 1110260 666912 654381 574185 945229 678256 856940
13758H56940l11890J26053k4299K22473l48703J44999k19212K94212n1356r1213
$$ 856940 545050 671103 646804 869277 520574 665573 446361 740573 689217 598004
13748E98004l6318K15606j0709Q5442l91514K33539j57791P9389j58216J66655
$$ 598004 561686 777292 766583 852025 460511 694050 536259 615648 457432 624087
13738F24087Q9393B22273L36392K11082k7495k8036k8636L344p5897Q7444J03699
$$ 624087 713480 222273 558665 769747 742252 714216 685580 688924 613027 700471 804170
13727H04170P11C38140M71422k43793r9094J00338j70072N00942B47797J52465
$$ 804170 804881 338140 809562 565769 466675 567013 396941 897883 247797 400262
13717D00262K03942B87642K24398P3846K89704B66876K06310J47742o0612k15134
$$ 400262 604204 287642 512040 585886 875590 266876 473186 620928 560316 345182
13707C45182J45417J62454j53591N0339J86601j43773r3648p4505m3818q9655
$$ 345182 490599 653053 499462 549801 736402 592629 498981 424476 380658 291003
13697B91003K55008l1477B1887R28228l83137k20180L23227k67312J23349j45574
$$ 291003 546011 514534 21887 950115 566978 346798 670025 402713 526062 380488
13687C80488L35841k05343j34204l4027j29077K33620r8524J98609D9846K42315
$$ 380488 716329 510986 376782 342755 213678 447298 348774 547383 49846 292161
13677B92161K64740j68086j88027N25612k73855j10088K74190q7872j08542j89407
$$ 292161 556901 388815 200788 726400 452545 342457 616647 528775 420233 230826
13667B30826n8634K71916M09784l37656B28160K19244r266R5675j08942J84360
$$ 230826 172192 444108 853892 516236 228160 447404 438138 533813 424871 609231
13657F09231j10133j01877n0313L39077C06550j45374N22202J081k28829j18233
$$ 609231 499098 397221 346908 685985 306550 161176 683378 684459 455630 337397
13647C37397K42055a13786B49549R8257A44020L75048I6245L93669j39218n9430
$$ 337397 579452 -113786 249549 347806 144020 519068 96245 489914 350696 291266
13637B91266L16405k55158K7262L2927l5769K72896B63957J45252r6689K96057
$$ 291266 607671 352513 379775 412702 376933 649829 263957 409209 312520 608577
13627F08577B27837M18621B87659J80646l7653m55J5669O6620r2046q9364J14824
$$ 608577 227837 646458 287659 468305 430652 430197 445866 512486 420440 331076 445900
13616D45900j48224N2102K98450o5673k43759A66606K29904j20746K35267j02637
$$ 445900 297676 349778 648228 582555 338796 166606 396510 275764 511031 408394
13606D08394K16003B32009J02091K64543J4365k70029c0404E00537B33498P1507
$$ 408394 624397 232009 334100 598643 613008 342979 -30404 500537 233498 305005
13596C05005K54740a63744C83153A28281Q6546P8851E3173K68738Q0297e2664
$$ 305005 559745 -163744 383153 128281 214827 293678 53173 321911 402208 -52664
13585B95985M4054J20017J6855J52101k80666j01335P0225j02743K54127B12685
$$ 295985 340039 460056 476911 629012 348346 247011 317236 214493 468620 212685
13574A53144J94898L79452k54187r4020A41920m7115M65962j56429A69141I732
$$ 153144 348042 727494 473307 379287 141920 94805 560767 404338 169141 9732
13563E55503A41459N06771A75655K53448J61313G7678K77736J02928L2760n3787
$$ 555503 141459 648230 175655 429103 590416 77678 355414 458342 491102 437315
13553D37315m0668q0322J42061B12697r6116L52311l8760K52380A8911N09189
$$ 437315 396647 316325 458386 212697 116581 468892 430132 682512 18911 528100
13543E28100j63557m4333A47058L41893B25004I9615l4817M51760j35028A08060
$$ 528100 364543 320210 147058 488951 225004 99615 64798 516558 381530 108060
13532A00353a30316C91667j27627j27045K52112j29453M5811j35899G0971J73951
$$ 100353 -130316 391667 264040 136995 389107 259654 305465 169566 70971 244922
13522B44922K9751L8136J89285j34532n8381j36131a38755C23652A58317J28576
$$ 244922 274673 312809 502094 367562 309181 173050 -138755 323652 158317 286893
13512B86893E6873J79687P4616l3416a25761A50087Q882K53132A69522K84698
$$ 286893 56873 236560 311176 277760 -125761 150087 158969 412101 169522 454220
13502D54220K3766q4227j95349K294J27925J38865j90987A21621K73529a11159
$$ 454220 477986 393759 198410 200704 328629 467494 276507 121621 395150 -111159
13491B89097M2180r9293I2586K07436m6516J24263j63759K39814B26647E5292
$$ 289097 331277 231984 92586 300022 253506 377769 214010 453824 226647 55292
13480E38090A73230b8506C2823L6299k2656N3597J70121m8339P4775A36246m9307
$$ 538090 173230 -28506 32823 69122 46466 100063 270184 221845 296620 136246 86939
13469H6939J57715J27342L02242C11886J73311m2824A8674K2141R9520D9053J01385
$$ 86939 244654 371996 674238 311886 485197 442373 18674 40815 140335 49053 150438
13458A50438a70923D40041p7768K32292k13076A01900k9871K88872o1045q7988
$$ 150438 -170923 440041 362273 594565 381489 101900 72029 360901 299856 211868
13448B11868K26940j16461j58965K03923A53924i7747B36689J297p0662J11824
$$ 211868 438808 322347 163382 367305 153924 -97747 236689 237986 167324 279148
13438B79148a53307A30830J56373J27480j87253J52872b4013B79356J38190B6706
$$ 279148 -153307 130830 287203 414683 227430 380302 -24013 279356 417546 26706
13427A72106J57563j59642j8968K93273A61430M7699q1777J46742p4258a25295
$$ 172106 329669 170027 151059 444332 161430 209129 127352 274094 199836 -125295
13416A44434a6517A13467P8408E0011J20615F6672L2254K21275j1384O055j952
$$ 144434 -16517 113467 191875 50011 170626 66672 98926 320201 308817 314872 312920
13405C12920k7241p3786G0473J29780D2746K1493J41920n506P8390E8357a72145
$$ 312920 285679 211893 70473 200253 42746 64239 206159 200653 279043 58357 -172145
13393F0224K88639K3184E3744J29859k5781c3405D60720p679P7532K110b4387
$$ 60224 348863 372047 53744 183603 157822 -33405 460720 453041 530573 532683 -24387
13381c1821A89218p7673L68899A35423J89160j07128f0207E624N3008L17920A01790
$$ -31821 189218 111545 480444 135423 324583 217455 -60207 5624 58632 376552 101790
13369C41142K3691a18340B63579K26478b17178C55215n9344a8797A38554R7300
$$ 341142 364833 -118340 263579 490057 -217178 355215 295871 -18797 138554 235854
13359B35854j03517R5906J41802A68043g0191K3214A36490l385P6113P9812j0109
$$ 235854 132337 228243 370045 168043 -70191 -46977 136490 133105 209218 289030 278921
13348B78921K10745k12336L59172J52640l75022J04412E9419J5147L86440j51817
$$ 278921 489666 277330 636502 789142 414120 518532 59419 74566 461006 309189
13338C09189o8022J07921A73974L3348L0990m3984C8554O43132G8771K35299A04099
$$ 309189 241167 349088 173974 207322 238312 194328 38554 681686 78771 314070 104099
13326E25972b21757C88064Q9217j20224A78509H1232O7146C3163P6327J84208
$$ 525972 -221757 388064 477281 357057 178509 81232 148378 33163 109490 293698
13316B93698Q3314A54173F7206J89908K2669K5987N094d3936B2394b4626E1158
$$ 293698 377012 154173 67206 257114 279783 305770 310864 -43936 22394 -24626 51158
13304D45317H3812J04207a6260B02132i4252p5234E3882K10161K6219A00767f1673
$$ 445317 83812 188019 -16260 202132 -94252 -169486 53882 264043 290262 100767 -61673
13292A28659a48885B17062J71588D2419a69464B37152E581a18488C5880R3256
$$ 128659 -148885 217062 388650 42419 -169464 237152 5581 -118488 35880 129136
13282A29136L168g4731E2816K45354c1821j44527H1706e704A82038G4646K17445
$$ 129136 132304 -74731 52816 298170 -31821 -176348 81706 -5704 182038 74646 292091
13271B92091j27449K76344a7110B07232J66062I874J2883J04013L26202j69065
$$ 292091 164642 440986 -17110 207232 373294 9874 22757 126770 452972 283907
13261B83907G5741Q214J11696A3039J63342L88B751K24547A8709K05088H7962
$$ 283907 75741 83955 195651 13039 176381 176769 2751 227298 18709 223797 87962
13249C22110a53042B22293B2345K20341K9896O271E8049R5931C2396J84483E7138
$$ 322110 -153042 222293 22345 242686 272582 278853 58049 153980 32396 216879 57138
13237A15673M4765E1541d2201n3332C09760N6236A44803a89014M2851B47289B7377
$$ 115673 160438 51541 -42201 -95533 309760 365996 144803 -189014 -146163 247289 27377
13225C7613J82344q2921R095a0075j87560B45446M6749C6467J20059D4296L3527
$$ 37613 219957 137036 146131 -10075 -197635 245446 292195 36467 156526 44296 77823
13214G7823L64236i5808A21436E90K12518R7030a25901c8290A92688e6472j30582
$$ 77823 442059 -95808 121436 590 213108 310138 -125901 -38290 192688 -56472 -187054
13203a87054C21548q7966d3511B87081n4114K8801i4884A39030E2785L4033L13651
$$ -187054 321548 233582 -43511 287081 232967 261768 -94884 139030 52785 86818 400469
13192D00469A3448b50652I1042K7680D4874K2909K3002K17753E7631N8966J75254
$$ 400469 13448 -250652 91042 118722 44874 67783 90785 308538 57631 116597 291851
13181B91851D3184j5102J5264B0062N0397B4375J97526E3329D487K07967c8258
$$ 291851 43184 28082 43346 20062 70459 24375 221901 53329 4487 212454 -38258
13169b05516B26771n9818J2220K61586F0297a4828A64596a37176A07917L01415
$$ -205516 226771 166953 179173 440759 60297 -14828 164596 -137176 107917 409332
13159D09332b47949L9112L9072a4186F3141k0951d5273A54887E0780J06391k6152
$$ 409332 -247949 -208837 -169765 -14186 63141 42190 -45273 154887 50780 157171 131019
13148A31019J69017E9135L9946i6321B18566b36502C21586F9074Q1428N3955L7132
$$ 131019 300036 59135 99081 -96321 218566 -236502 321586 69074 150502 204457 241589
13137B41589k5542G4695K14007c20431G7561g3337A01104D1424J30917K8562p3798
$$ 241589 216047 74695 288702 -320431 77561 -73337 101104 41424 172341 200903 127105
13126A27105a19153D69925a26099n4561g7486A06344m9473j5069P75d6073C79385
$$ 127105 -119153 469925 -126099 -180660 -77486 106344 56871 41802 42577 -46073 379385
13114A00182J1028K4122a07322A22425D4470M32274b02286C93630C2315K67189
$$ 100182 111210 135332 -107322 122425 44470 476744 -202286 393630 32315 299504
13104B99504A28638O8372l3807K64562A7862K0033M2027K66859E1617A8965b52037
$$ 299504 128638 197010 163203 427765 17862 37895 79922 346781 51617 18965 -252037
13092h6181k33278A08929J7454A5518c89361A88883M8047A7970a53824A02411
$$ -86181 -319459 108929 126383 15518 -389361 188883 236930 17970 -153824 102411
13081b8954n853C52902d3365A35078o6871J88158J2659C603L24884A35721E3435
$$ -28954 -34807 352902 -43365 135078 68207 256365 269024 3603 328487 135721 53435
13069D89090A6293g0920j40485B92236A06633b42781m6405B52447g355C28519
$$ 489090 16293 -70920 -211405 292236 106633 -242781 -289186 252447 -7355 328519
13058g328H0215C3187J79652r1536C7258J47144l0751c57554B69879a43393G8020
$$ -7328 80215 33187 212839 121303 37258 184402 153651 -357554 269879 -143393 78020
13046B90907a2765B62885b21969d085C29175j18634B0403J59369k0904b839j02375
$$ 290907 -12765 262885 -221969 -4085 329175 210541 20403 179772 158868 -2839 -105214
13035a05214A88153G6084a13877A30171E7639a04092A20612l602L68173j99643
$$ -105214 188153 76084 -113877 130171 57639 -104092 120612 117010 485183 285540
13025B85540I6100b46489A5282K76468A02411k0372K9403M1694L07931a28293
$$ 285540 96100 -246489 15282 291750 102411 82039 111442 153136 461067 -128293
13014C69522j76681F9106k6882N0618J7609A897b2343R412A54691a77001M1335
$$ 369522 192841 69106 42224 92842 110451 1897 -22343 -12931 154691 -177001 -135666
13003a35666D43648a20558e9969B54565K96347A36450C0440a57103A4221R147
$$ -135666 443648 -120558 -59969 254565 550912 136450 30440 -157103 14221 23368
12993B3368K9798i204j11741i943B97717g241C39685a88456A00541E665g0611
$$ 23368 53166 -9204 -120945 -9943 297717 -7241 339685 -188456 100541 5665 -70611
12981a24287j3952A12207a30766a3923j73846A39262Q114d8299I8773J61783B5502
$$ -124287 -138239 112207 -130766 -13923 -187769 139262 147376 -48299 98773 260556 25502
12969B7074e4173j74808F1104Q3243C9994Q5212b8203I063J54357Q3149b45033
$$ 27074 -54173 -228981 61104 144347 39994 125206 -28203 9063 163420 246569 -245033
12957C31193a2318k1024C30963A03928J54017A26967h5221l6550A14910g1731
$$ 331193 -12318 -33342 330963 103928 257945 126967 -85221 -121771 114910 -71731
12946B74683a00070B08618B9249R5574P9145J74754I6028j2631g5852K5710k57704
$$ 274683 -100070 208618 29249 124823 203968 378722 96028 83397 -75852 -50142 -307846
12935c07846a9320A76537a73536N9636H7197a69779B34071r8783Q6864r8017D6329
$$ -307846 -19320 176537 -173536 -113900 87197 -169779 234071 135288 222152 124135 46329
12923A14516a77462F3241k084a48738f5549j97536J17867C47208j41787b18362
$$ 114516 -177462 63241 61157 -148738 -65549 -263085 -145218 347208 205421 -218362
12912A4756O4994J08321G1890a40841c3576B734K7083L8671b02971C72044A78494
$$ 14756 79750 188071 71890 -140841 -33576 2734 29817 68488 -202971 372044 178494
12900b02463A63534A6849J16223d0046B27283p0574J6888b0836l06034E43887
$$ -202463 163534 16849 133072 -40046 227283 156709 173597 -20836 -326870 543887
12889A20695n6601b26292A77548n1147b09848C846i2491b2261B5697j2785J89907
$$ 120695 64094 -226292 177548 126401 -209848 3846 -92491 -22261 25697 12912 202819
12878B02819b0840E3349a0380B4553o890J1449J31920J76849a3190A53934M7850
$$ 202819 -20840 53349 -10380 24553 17663 29112 161032 337881 -13190 153934 201784
12867B01784j6606o2274K09282h5323l7224B68970I6864h5503F7934c2446A29075
$$ 201784 185178 122904 332186 -85323 -122547 268970 96864 -85503 67934 -32446 129075
12855F3535j9176J73624m1941C1352a05835A47735D3730f7952A86885a15575H8936
$$ 63535 44359 217983 176042 31352 -105835 147735 43730 -67952 186885 -115575 88936
12843A15387a7920o7641c9773A49708c9049A17647b95475C23613M0156j16714
$$ 115387 -17920 -85561 -39773 149708 -39049 117647 -295475 323613 363769 247055
12833B47055q8889K87037A18756a85768A72677J4068K67900E535a61041G5374
$$ 247055 158166 445203 118756 -185768 172677 186745 454645 5535 -161041 75374
12822A01352a38998A82148a28135C58915e4535o3309A5650h0148a6037k85959
$$ 101352 -138998 182148 -128135 358915 -54535 -117844 15650 -80148 -16037 -301996
12812c01996A63749c22730j78489B5494b12696A10014m5228L9961c59659E4271
$$ -301996 163749 -322730 -501219 25494 -212696 110014 64786 104747 -359659 54271
12801B61861G5498J39838m6248g444j63109k46958N5689i8750A0884a05275j5086
$$ 261861 75498 215336 169088 -7444 -170553 -417511 -361822 -98750 10884 -105275 -120361
12790a20361F1292i8555D0307a9827A06242l7510a60124B03773p467o3926a00586
$$ -120361 61292 -98555 40307 -19827 106242 68732 -160124 203773 196306 132380 -100586
12778B00886p6324M9314A3600J6962J50186m4120a26738N4172D2432M27798A20214
$$ 200886 124562 173876 13600 30562 180748 136628 -126738 -72566 42432 470230 120214
12766c00568E7580J45849H0669c0323j75586b7717B60434a65437C24573b14374
$$ -300568 57580 203429 80669 -30323 -205909 -27717 260434 -165437 324573 -214374
12755a82090g0100j14196a0215j96751f79j59798B6966b2917j75459d795j70157
$$ -182090 -70100 -184296 -10215 -206966 -679 -160477 26966 -22917 -198376 -4795 -174952
12744a74952B02133a78228O6181A92642O7414a15859D8812a60462p876d1080A7701
$$ -174952 202133 -178228 -112047 192642 260056 -115859 48812 -160462 -168338 -41080 17701
12732b94279g3123A62030R9919m9206e4801j27888c8363B20542A7611L9017J87473
$$ -294279 -73123 162030 261949 212743 -54801 -182689 -38363 220542 17611 56628 244101
12721B44101c9013H9307d7506e357m9503A04854D1647c44956a48844H1414C6535
$$ 244101 -39013 89307 -47506 -5357 -54860 104854 41647 -344956 -148844 81414 36535
12709a58726d7979C02017p8717n5318e4398m6350A94040k2647l4982e5231C75780
$$ -158726 -47979 302017 223300 167982 -54398 -100748 194040 171393 136411 -55231 375780
12697D74650b77836a1277l6397A55517h798C3081b44925A72815J35782R5081b2173
$$ 474650 -277836 -11277 -47674 155517 -8798 33081 -244925 172815 308597 403678 -22173
12685i2797p4634B14382J331l1047K5043D7523a2699F9917J4917N5964i7104K4020
$$ -92797 -167431 214382 215713 184666 209709 47523 -12699 69917 84834 140798 -97104 -73084
12673g3084L1281h85j91985D3930B0931I808K52219E4936O3408E1147L65235a21035
$$ -73084 -41803 -885 -192870 43930 20931 9808 262027 54936 118344 51147 416382 -121035
12660B46066a70652A00267L69089a36650A92042a13875A05417R2976b4865D5019
$$ 246066 -170652 100267 469356 -136650 192042 -113875 105417 198393 -24865 45019
12649E4261J72950J00231a84661B41962F9078b44361C29312b8158B4069c9827
$$ 54261 227211 327442 -184661 241962 69078 -244361 329312 -28158 24069 -39827
12638i3401b8946C20799A36984f3039D8764R6771J82266M2576G3984J71961j09011
$$ -93401 -28946 320799 136984 -63039 48764 145535 327801 370377 73984 245945 136934
12627A36934J66828K01144j30825g7744C90654A088K82878I9555m2597o246K1718
$$ 136934 303762 504906 374081 -77744 390654 1088 283966 99555 56958 50712 72430
12616G2430K3576b17405D14119b38518h6817p2920c8075r3320J6195b5369A77912
$$ 72430 96006 -217405 414119 -238518 -86817 -159737 -38075 -131395 -115200 -25369 177912
12604a07231B71013q9462k0969d7372B94508o9242K43319A25352e8359o29F3820
$$ -107231 271013 181551 160582 -47372 294508 225266 468585 125352 -58359 -58988 63820
12592B73890b06512C01232K861a85838B67674P695f5618o703B87671A14628b49538
$$ 273890 -206512 301232 304093 -185838 267674 275369 -65618 -72321 287671 114628 -249538
12580C50372b5662G1911A7779a40313D2581P4498C0223a12474A33508b3416A01521
$$ 350372 -25662 71911 17779 -140313 42581 117079 30223 -112474 133508 -23416 101521
12568C4296b62823a12451B41704K71482j85485c13824D8617K74855i6047K4067
$$ 34296 -262823 -112451 241704 513186 327701 -313824 48617 323472 -96047 -71980
12558g1980k37464d9667l0399A50670b5000j8939J6721I1154J17764b38180M7318
$$ -71980 -309444 -49667 -80066 150670 -25000 -43939 -27218 91154 208918 -238180 -190862
12547a90862f7093I3305e3917D055L72373a7632A77742m364K4933J4716a7634
$$ -190862 -67093 93305 -53917 4055 376428 -17632 177742 173378 198311 213027 -17634
12535A99779G3052K196O4862e0664b5036B73594b73838F8107r341a56080I2026
$$ 199779 73052 75248 140110 -50664 -25036 273594 -273838 68107 58766 -156080 92026
12523a75167P7538C21452F8341Q6959o6974c6249j8156A70475d2008n0114L6653
$$ -175167 -97629 321452 68341 155300 88326 -36249 -54405 170475 -42008 -92122 -55469
12512e5469b1704B85558p7976J25829c28172B97686o4514q2857O646J2413a8059
$$ -55469 -21704 285558 207582 333411 -328172 297686 233172 150315 156961 169374 -18059
12500E08193B43204A18145C4269c79584A80235a31274r5654R2170B33607D0061
$$ 508193 243204 118145 34269 -379584 180235 -131274 -226928 -134758 233607 40061
12489a89597A88241B2587J7152M62438F2382L4568J6999a08280A17946J35532
$$ -189597 188241 22587 39739 502177 62382 96950 113949 -108280 117946 253478
12479B53478H9168a17138F9473a54791c4313n2207G3925b11479e6397a6021G6453
$$ 253478 89168 -117138 69473 -154791 -34313 -86520 73925 -211479 -56397 -16021 76453
12467a52596a4841j97236P8955e3361l3736B03978I1378J39035F5403L3793j9719
$$ -152596 -14841 -212077 -133122 -53361 -87097 203978 91378 230413 65403 99196 79477
12456G9477j7713O6479L3179h522k10198A15826L551e135A5499K05459I4998d8915
$$ 79477 61764 128243 161422 -8522 -218720 115826 119377 -5135 15499 220958 94998 -48915
12443d3802A8739b50997E9689a3449E2524R544P3889O0383L15414j14542b14119
$$ -43802 18739 -250997 59689 -13449 52524 62068 135957 196340 511754 397212 -214119
12431A44640e620j18182J9151I372J80894p512l4653h2391A90792F1404d103j31716
$$ 144640 -5620 -123802 -104651 9372 190266 182754 148101 -82391 190792 61404 -4103 -135819
12419a35819D1340D658e0390I9982a20922G5819l0202b07171j2378i6867j99145
$$ -135819 41340 4658 -50390 99982 -120922 75819 45617 -207171 -219549 -96867 -296012
12408b96012i0446j22137m3247B24831b23337A07344e4926A94639b5581j41554
$$ -296012 -90446 -212583 -255830 224831 -223337 107344 -54926 194639 -25581 -167135
12398a67135A16154b47977A77854j4370l3436b29030B50288H5158c80268c0153
$$ -167135 116154 -247977 177854 163484 130048 -229030 250288 85158 -380268 -30153
12387b43034A49834J05428D4242j7720a37720A05270b10665g0013E4040b51392
$$ -243034 149834 255262 44242 26522 -137720 105270 -210665 -70013 54040 -251392
12376B96134K7480a33264A90764I3546c31165J58761E8606M2427a26318M6623
$$ 296134 323614 -133264 190764 93546 -331165 -172404 58606 101033 -126318 -79695
12366g9695B02589a0756j65877j19987a6939k63255F8665e0608q2622F9860b63391
$$ -79695 202589 -10756 -176633 -296620 -16939 -280194 68665 -50608 -133230 69860 -263391
12354H0499E355K96842A25305D6368e6437i945A0080b419j85455k9480I6419i0749
$$ 80499 5355 302197 125305 46368 -56437 -9945 10080 -2419 -187874 -217354 96419 -90749
12341A32548O9409b7956I1410a33112G2417a51058A26677K47074q78j85063H745
$$ 132548 201957 -27956 91410 -133112 72417 -151058 126677 373751 372873 187810 8745
12329B48560e0913B10215a63360k638A68416F1827n972A0444d6510A81956K65295
$$ 248560 -50913 210215 -163360 -165998 168416 61827 55855 10444 -46510 181956 447251
12318D47251A60567K80279b48470B57728a5493A18537m7129L5287b633A82712
$$ 447251 160567 440846 -248470 257728 -15493 118537 71408 106695 -2633 182712
12307C52058j15854d6840m0960B5028M3936b83621B8431K23139G8573e3964m2420
$$ 352058 236204 -46840 -87800 25028 68964 -283621 28431 251570 78573 -53964 -96384
12296i6384B73114a25178k4500P011e6659G8061O3814N445E1538a62851E9584
$$ -96384 273114 -125178 -149678 -142667 -56659 78061 141875 147320 51538 -162851 59584
12284b53428A33729D5842M455k3970h1844c0192A1907h6042B36203D028J07899
$$ -253428 133729 45842 50297 26327 -81844 -30192 11907 -86042 236203 4028 111927
12273A11927a06661k24590g2614A41670D0171a86671A88112K47865c550j25657
$$ 111927 -106661 -331251 -72614 141670 40171 -186671 188112 435977 -3550 -129207
12263a29207A69089E3944J19703m794O7011G6251b57854I638J05644Q2136r1916
$$ -129207 169089 53944 173647 168853 235864 76251 -257854 9638 115282 197418 105502
12252A05502a73711A65855m1467K05771A43643P7246A541J10981f4804E0598L54995
$$ 105502 -173711 165855 124388 330159 143643 220889 1541 112522 -64804 50598 405593
12241D05593C7864Q7149D4826K5677c2028a408l71842B96646Q1259A43210J83998
$$ 405593 37864 125013 44826 70503 -32028 -1408 -373250 296646 377905 143210 327208
12230C27208j2101A51151J45598A00508K22596g3836A06366k9349P9327d269A1030
$$ 327208 315107 151151 296749 100508 323104 -73836 106366 77017 156344 -4269 11030
12218B88087c057G8562K57294J30407A04284c31451I1463J02079o0150a85874
$$ 288087 -3057 78562 335856 466263 104284 -331451 91463 193542 133392 -185874
12207B23917J94507a20711A21216M5840L05238j10317b3236B11761C2885L22747
$$ 223917 418424 -120711 121216 167056 472294 361977 -23236 211761 32885 355632
12197C55632o0717A7395f7496D10901A28180l5728J94095c5638B96513J0762b45788
$$ 355632 294915 17395 -67496 410901 128180 92452 286547 -35638 296513 307275 -245788
12185g3325E28488B47800L52751b87290H5751a02490H9139K2138L20668D810N8928
$$ -73325 528488 247800 600551 -287290 85751 -102490 89139 111277 431945 4810 63738
12174F3738h1112I3257N7007c20353C04732A25966K20591j41178J77890r2925
$$ 63738 -81112 93257 150264 -320353 304732 125966 346557 205379 383269 290344
12164B90344G8465P7628o9221J24698a18634B68161H0471R600J40645F2155J65153
$$ 290344 78465 156093 86872 211570 -118634 268161 80471 90071 230716 62155 227308
12153B27308P0104k228j19886i9104c2016a3976C30170j2614i5095P389F0079
$$ 227308 297412 295184 175298 -99104 -32016 -13976 330170 317556 -95095 -87706 60079
12141g6653A8098b63597g220A64972n8046f1526c0110D6215a6156B20130d8777
$$ -76653 18098 -263597 -7220 164972 106926 -61526 -30110 46215 -16156 220130 -48777
12129B20790p5225a49875A46256C8227Q5479K37981i0464B8271a29296J3373m1073
$$ 220790 145565 -149875 146256 38227 123706 361687 -90464 28271 -129296 -115923 -156996
12118a56996d7769B35671a80151b8151G3416J30006d7479j46027A85145J14727
$$ -156996 -47769 235671 -180151 -28151 73416 203422 -47479 -193506 185145 299872
12108B99872l8017q7988N396d2365K847B13516a81951d0718l1008J4800o8573
$$ 299872 261855 173867 179263 -42365 -39518 213516 -181951 -40718 -71726 -56926 -125499
12097a25499B60036F1666c2910F263M9133a42494m0127b3128q8525D4803g5051
$$ -125499 260036 61666 -32910 6263 55396 -142494 -182621 -23128 -111653 44803 -75051
12085A74851K0040E6201K13977L03G7805O4395h1033c0173L208B07512h1454C59672
$$ 174851 194891 56201 270178 270481 77805 142200 -81033 -30173 -26965 207512 -81454 359672
12072a79647C06654G7788B2528L12445b62318A3319N6661a51147B16377b21030
$$ -179647 306654 77788 22528 334973 -262318 13319 69980 -151147 216377 -221030
12061F1388p845a78948B24174G1371K0954K37646N64036M14808D63816A38130
$$ 61388 53543 -178948 224174 71371 92325 329971 894007 1308815 463816 138130
12050A26147n3960K35979j33002m5434h9495K9734K181k9185K9834k45641R0472
$$ 126147 72187 308166 175164 129730 -89495 -59761 -57580 -86765 -56931 -302572 -212100
12039b12100R2694B29980E4870a99464G3747i7675A15603g2354A02664K39936
$$ -212100 -119406 229980 54870 -199464 73747 -97675 115603 -72354 102664 342600
12029C42600a88229k56174A54108L4038l6525d5807C48743e7661F9444L3575N7681
$$ 342600 -188229 -444403 154108 188146 151621 -45807 348743 -57661 69444 103019 160700
12018A60700a96747j20371A69901a97793A95141c31312a65135A89841b9519J3665
$$ 160700 -196747 -317118 169901 -197793 195141 -331312 -165135 189841 -29519 -15854
12008a5854l06187B49304a64293A1545i1705O936L8047k055p3435J1321M4d392
$$ -15854 -322041 249304 -164293 11545 -91705 -84769 -46722 -48777 -122212 -110891 -110847 -4392
11995a0984I2728a64743c7360A05866l017e1999j05628k53048e9129A31694e8839
$$ -10984 92728 -164743 -37360 105866 102849 -51999 -157627 -410675 -59129 131694 -58839
11983g4005A9386a56572A22764c9739H1440O7548b37139G5194l53j3691c34836
$$ -74005 19386 -156572 122764 -39739 81440 148988 -237139 75194 74841 61150 -334836
11971B26649A09207f2578I060g3493E5631f6913F6315P8998O8191n2192a90235
$$ 226649 109207 -62578 9060 -73493 55631 -66913 66315 145313 213504 161312 -190235
11959h4915J8021A28131l6459a26454k46165i1881j45377B50855l7601I2263K73752
$$ -84915 -66894 128131 91672 -126454 -372619 -91881 -237258 250855 213254 92263 366015
11948C66015G8585l3473g4198m4607k0589O0192E3286a30478A80796D8391a38913
$$ 366015 78585 45112 -74198 -118805 -139394 -79202 53286 -130478 180796 48391 -138913
11936A14758b3371j58258Q2547k4711d2142B53720a62654o6751A17679e8890k99006
$$ 114758 -23371 -181629 -99082 -123793 -42142 253720 -162654 -229405 117679 -58890 -357896
11925c57896J14696E3780j2879b09635a01385j7339M8576A554e3920B83856b63251
$$ -357896 -243200 53780 40901 -209635 -101385 -118724 -70148 1554 -53920 283856 -263251
11913g9099j5473c2986p4922k97295f6778r3957c5317j45209l6775i5420C478
$$ -79099 -94572 -32986 -107908 -405203 -66778 -160735 -35317 -180526 -217301 -95420 3478
11901F6662J72165q5607p3708d5135k02237B30718a60997g8955j1184k05813A5150
$$ 66662 238827 153220 79512 -45135 -247372 230718 -160997 -78955 -90139 -295952 15150
11889B80964j36778a0738j3774A72256C8974j4801J68554I3527f6005B61135I3894
$$ 280964 144186 -10738 -24512 172256 38974 24173 192727 93527 -66005 261135 93894
11877a29538j55347a104F0618J07393a24329d4395C0682a86688g0975H2744h9211
$$ -129538 -284885 -1104 60618 168011 -124329 -44395 30682 -186688 -70975 82744 -89211
11865a64301A6389J3972c21998A6321Q4578a92612j3298D0286a83405e0986A54899
$$ -164301 16389 30361 -321998 16321 100899 -192612 -205910 40286 -183405 -50986 154899
11853c14195A66668n087a12340H3230g8745b5877A47796d13446g7465B9219c91769
$$ -314195 166668 161581 -112340 83230 -78745 -25877 147796 -413446 -77465 29219 -391769
11841a61688K0639l5486F7868a1391B19213b34790C5772R5270a94842A95755f7954
$$ -161688 -141049 -176535 67868 -11391 219213 -234790 35772 131042 -194842 195755 -67954
11829a05983A01325m1140R76a17881j6375I532a14477a7566j18825B66512J6036
$$ -105983 101325 60185 61161 -117881 -134256 9532 -114477 -17566 -136391 266512 282548
11818B82548j35066J04703b71545a08968d3666m7598a1643m1578B8843a67395
$$ 282548 147482 252185 -271545 -108968 -43666 -91264 -11643 -53221 28843 -167395
11807B94679B3149f8674I5875b73900d4806j37952r9617J32755j06424J05565
$$ 294679 23149 -68674 95875 -273900 -44806 -182758 -282375 -149620 -256044 -150479
11797a50479E3217a2898A64976p2346B0363J44519M248j5882P4543c776E9807
$$ -150479 53217 -12898 164976 92630 20363 164882 169130 153248 227791 -3776 59807
11785e9350P242k03551B00795c05502e6306l1343k26469j07086a91482p9188B1322
$$ -59350 -52108 -255659 200795 -305502 -56306 -87649 -314118 -421204 -191482 -270670 21322
11773a11506p5341A69496a74771B9524P267j3238J68271A0455K20981h8229G1970
$$ -111506 -186847 169496 -174771 29524 36791 23553 191824 10455 231436 -88229 71970
11761d24320A86233a5254k2239j06744j65167f3724l5158H6619J44909h1328A79697
$$ -424320 186233 -15254 -37493 -144237 -309404 -63724 -98882 86619 231528 -81328 179697
11749a15314l1910d4639I8937C0594a5693A23034e9247d387A45114m6158C2095
$$ -115314 -147224 -44639 98937 30594 -15693 123034 -59247 -4387 145114 98956 32095
11737A51435B84d3768j21412j32022A16261A5797a52335O2378F5601e1155A14777
$$ 151435 284 -43768 -165180 -297202 116261 15797 -152335 -89957 65601 -51155 114777
11725A11575J9722b07394J3210j60232J46190K2380A79301q4703a82342j5941
$$ 111575 131297 -207394 -194184 -354416 -208226 -185846 179301 94598 -182342 -198283
11715a98283A14109J40276C5467a68829B30299a15841l51755H2315A9837L1195
$$ -198283 114109 254385 35467 -168829 230299 -115841 -467596 82315 19837 51032
11705E1032a74878H0012B2437L6116c1593E1390L040c2163j31307B92568a46985
$$ 51032 -174878 80012 22437 58553 -31593 51390 54430 -32163 -163470 292568 -146985
11693C04397G1612R1850C1958b09863A47221d9008A83203c08135E679g2868G3097
$$ 304397 71612 163462 31958 -209863 147221 -49008 183203 -308135 5679 -72868 73097
11681B83716A32928M4083A6037a36889A86587a7811A2514O1934J85448b25242
$$ 283716 132928 177011 16037 -136889 186587 -17811 12514 74448 259896 -225242
11670a57260k1810D0878A3140M2436a17208C01208E576J66425f5864l7514n5726
$$ -157260 -179070 40878 13140 55576 -117208 301208 5576 172001 -65864 -103378 -159104
11659a59104A8996N3322b17253h5211n3994j08522f9078A61458b37437A21462
$$ -159104 18996 72318 -217253 -85211 -139205 -247727 -69078 161458 -237437 121462
11648g3953A12568d0806a0684A41072L4545i8465B81680j32882d986k18064A51344
$$ -73953 112568 -40806 -10684 141072 175617 -98465 281680 148798 -4986 -223050 151344
11636G4514b11534B04820a27097n555c4782A1315N2817d2589A19536A1424M5467
$$ 74514 -211534 204820 -127097 -132652 -34782 11315 64132 -42589 119536 11424 56891
11625E6891b7422A39369C5501M749N8659a58002K4476D6352b04999L3054h0171
$$ 56891 -27422 139369 35501 40250 98909 -158002 -133526 46352 -204999 -171945 -80171
11613A40885P6956B146b7156D44731b42985m2796a36652A11586e0622j20334N9468
$$ 140885 217841 2146 -27156 444731 -242985 -285781 -136652 111586 -50622 -170956 -111488
11602a11488G6069b50790j3621E952b96675O4064J8115a4436D5802J149a34107
$$ -111488 76069 -250790 -264411 5952 -296675 -232611 -214496 -14436 45802 46951 -134107
11590a13163k152M2866j48815M9281I543a4730A80918c6461j60766a5854D71061
$$ -113163 -115315 -72449 -221264 -171983 9543 -14730 180918 -36461 -197227 -15854 471061
11578i106k73487A11044b21733A55102J22047e8363C1007c140D00557A59141J25504
$$ -9106 -282593 111044 -221733 155102 277149 -58363 31007 -3140 400557 159141 284645
11567B84645I5798b8646D15764d5146I0312a43476D5753b17377B3005h9365l6555
$$ 284645 95798 -28646 415764 -45146 90312 -143476 45753 -217377 23005 -89365 -125920
11556a25920M8146n1065b7100k59292J26746O4965d3770r8378A73730a349B10689
$$ -125920 -77774 -128839 -27100 -286392 -159646 -94681 -43770 -142148 173730 -1349 210689
11544G7762a22766C98545h1012f206I2490M0060a03931B17593m1176l5767K0319
$$ 77762 -122766 398545 -81012 -6206 92490 132550 -103931 217593 176417 140650 160969
11533A60969l4989f7672G5127b17607A28620e5345n2476m7701A25688c40696D3280
$$ 160969 125980 -67672 75127 -217607 128620 -55345 -107821 -155522 125688 -340696 43280
11521D4010O8899Q5769a1194B95964A40689b2434j1182R331B23199q3096J09939
$$ 44010 112909 198678 -11194 295964 140689 -22434 -33616 -24285 223199 140103 250042
11510B50042J11415N9209A08695R286b57468p6782G9490j0134P539a64652C20655
$$ 250042 361457 420666 108695 117981 -257468 -334250 79490 69356 76895 -164652 320655
11498A59101G4680R5301b41612F2388J84101H8250q68j2348L25313I6337P1273
$$ 159101 74680 169981 -241612 62388 246489 88250 87382 75034 400347 96337 167610
11487A67610l3156I838b34612C92120A91358G6185K77113j17582L5016j04783
$$ 167610 134454 9838 -234612 392120 191358 76185 353298 235716 270732 165949
11477A65949G9859O4355o3474O7441a87179A05171J36708H8006K6745P026Q0755
$$ 165949 79859 144214 80740 148181 -187179 105171 241879 88006 114751 121777 202532
11466B02532e2699G7260J17295F8174K76473j51318m7048K37936A33536m7138
$$ 202532 -52699 77260 194555 68174 344647 193329 146281 384217 133536 86398
11456H6398L7509Q8251a9545A37093K02951h565C35275f2005L694A54700K67674
$$ 86398 123907 212158 -19545 137093 340044 -8565 335275 -62005 -58311 154700 422374
11445D22374c0155G4951K04037a7990j928B92409B4082a16234C17292b4970j38230
$$ 422374 -30155 74951 278988 -17990 -19918 292409 24082 -116234 317292 -24970 -163200
11434a63200d3794l0553p2283g163k92196A05853L223R8632o7952k1127J89674
$$ -163200 -43794 -74347 -146630 -7163 -299359 105853 109076 207708 139756 118629 308303
11423C08303G6371b9792E7236K27326G3835O7115b11194E88097d6995C09172G4894
$$ 308303 76371 -29792 57236 284562 73835 140950 -211194 588097 -46995 309172 74894
11411A0784b44011H1084a3748A59900J23339n3799j12902a9022D4188J92080a40443
$$ 10784 -244011 81084 -13748 159900 283239 229440 116538 -19022 44188 236268 -140443
11399I0015a60053A54706c49484A23651J30192F897J65431M3826a66227j86308
$$ 90015 -160053 154706 -349484 123651 253843 6897 172328 216154 -166227 -352535
11389c52535a24406d0125r5593l0756F7434N4393d6574H8241c1800l1831l25433
$$ -352535 -124406 -40125 -135718 -166474 67434 121827 -46574 88241 -31800 -63631 -389064
11378c89064i1338G6406R8387O3229A02859P500N9143k4391k5124d047j06451
$$ -389064 -91338 76406 174793 238022 102859 110359 169502 145111 119987 -4047 -110498
11367a10498K3434B046J66590B0842I027f3950q6134j11999n7953N6150J1404
$$ -110498 -87064 2046 168636 20842 9027 -63950 -150084 -262083 -320036 -263886 -252482
11356b52482a10684l67075b27408A9156c46787C95086d87242a27288p6198f6021
$$ -252482 -110684 -477759 -227408 19156 -346787 395086 -487242 -127288 -203486 -66021
11345b68915F4597L5671D3778d76409C83434A23934b36511b5331A12967g0657
$$ -268915 64597 100268 43778 -476409 383434 123934 -236511 -25331 112967 -70657
11334F821P3417L7262d3793B54244a70857I8124J20128h7294A40959b74066D26614
$$ 6821 80238 117500 -43793 254244 -170857 98124 218252 -87294 140959 -274066 426614
11322B6414N1878L21352i9795B69934a99117H9706c6315r7532b2485A73625e4278
$$ 26414 78292 399644 -99795 269934 -199117 89706 -36315 -133847 -22485 173625 -54278
11310i1155K8402j58941a1977C7774c8190k11865A31886b98917A04072j711D3816
$$ -91155 -62753 -221694 -11977 37774 -38190 -250055 131886 -298917 104072 102361 43816
11298A4175J08856b09945j60030B8597O8814J38106e8887A4989J66004D1655a5702
$$ 14175 123031 -209945 -369975 28597 97411 235517 -58887 14989 180993 41655 -15702
11286E1640a89678C19770G5865e4474k51889G8301j825h9406A2812P0450Q590
$$ 51640 -189678 319770 75865 -54474 -306363 78301 76476 -89406 12812 83262 91852
11275I1852L0373P1187b9502E7856e2826p7319b9199A53295M964a27160b5784
$$ 91852 122225 193412 -29502 57856 -52826 -130145 -29199 153295 158259 -127160 -25784
11263b21778h0015j81075A10003b52864L5092b3975j91042O4209p5069B71481
$$ -221778 -80015 -261090 110003 -252864 -217772 -23975 -215017 -150808 -225877 271481
11252c85167a83198b8822r0898c8690j73588A78265a65030P4760o3416A11344
$$ -385167 -183198 -28822 -119720 -38690 -212278 178265 -165030 -90270 -153686 111344
11241g01135b39100k6419B00727p9246b67903P3397n9170A64052i5629q7177A10102
$$ -701135 -239100 -265519 200727 121481 -267903 -194506 -253676 164052 -95629 -182806 110102
11229A41098m9123L8864b26091B19788b26823e8762A51317K53274d7865A32717
$$ 141098 91975 130839 -226091 219788 -226823 -58762 151317 404591 -47865 132717
11218B64168g4469k83188A53736a66484N4232m5526j67032h3637B21768q4342
$$ 264168 -74469 -357657 153736 -166484 -112252 -157778 -324810 -83637 221768 137426
11208A37426a00877E1670b02161k37949B46458c9562I3799J13490a8628k3238
$$ 137426 -100877 51670 -202161 -440110 246458 -39562 93799 207289 -18628 -41866
11198d1866A80215K62540b49077k51292A27187a82653J8041K7049B932a37223
$$ -41866 180215 442755 -249077 -500369 127187 -182653 -164612 -137563 2932 -137223
11187C38599A2663K80403a12224M9455r5019n2396p3213h6918D70796h2768B68832
$$ 338599 12663 293066 -112224 -62769 -157788 -210184 -283397 -86918 470796 -82768 268832
11175B1807L31645j07415b19025i750C5094N1556l5929L0913a8794b323A17399
$$ 21807 353452 246037 -219025 -9750 35094 86650 50721 81634 -18794 -2323 117399
11163a42607J8488j038M0024C8615a24628m8846A07852h0017C4769i7485B62373
$$ -142607 -124119 -125157 -85133 38615 -124628 -173474 107852 -80017 34769 -97485 262373
11151a64681a1139N368A18707a26534p8375e2136A34026b71059h4596A92169b88237
$$ -164681 -11139 -5771 118707 -126534 -204909 -52136 134026 -271059 -84596 192169 -288237
11139e9383l3595b4638m509I9155a3998A9575a13412B7492c9408k13731A85983
$$ -59383 -92978 -24638 -29147 99155 -13998 19575 -113412 27492 -39408 -253139 185983
11127A73059a5063A23035J66163H1451J34486F297O9060d3169A70095D3860O7300
$$ 173059 -15063 123035 289198 81451 215937 6297 75357 -43169 170095 43860 111160
11116A11160J30501q04H7575d3444D33229A15026Q543K4538f1922A69725E3603
$$ 111160 241661 240857 87575 -43444 433229 115026 123569 148107 -61922 169725 53603
11104a56750A90250K0071Q4650c6266D29250n4933h2508C37043n3475j37073l607
$$ -156750 190250 210321 294971 -36266 429250 374317 -82508 337043 283568 146495 142888
11093A42888a4174D63921A89706N4555A6187c8244D88783A17296l167L42144d095
$$ 142888 -14174 463921 189706 244261 16187 -38244 488783 117296 114129 456273 -4095
11081E97638A86428K21259K0326q2469d3622D87131j12917o0014J14513A95151
$$ 597638 186428 407687 428013 345544 -43622 487131 374214 314200 428713 195151
11070B78922K92198A06923K24599P7440j85184M93906k10379J78150k29447J38053
$$ 278922 571120 106923 331522 408962 223778 717684 507305 685455 456008 594061
11060E94061q5657k1169K03264j92702J07115k8194L6358k72862L38664J30193
$$ 594061 508404 487235 690499 497797 604912 576718 613076 340214 678878 809071
11050H09071q6989J32801k79963K92407O2758j85190p6678J1636n3444K07178
$$ 809071 722082 854883 574920 867327 930085 744895 668217 679853 626409 833587
11040H33587l6782J8967K10714r6231j71822L6150J66052m57005M64158k18664
$$ 833587 796805 815772 1026486 930255 758433 794583 960635 503630 967788 749124
11030G49124m4332J92768D08645L59438q5604j89983M74074m04142K23892l07778
$$ 749124 704792 897560 408645 768083 682479 492496 966570 562428 786320 478542
11020D78542K07838B68652K86279k2389k5077J34681B38575K38934K25334j54299
$$ 478542 686380 268652 554931 532542 507465 642146 238575 477509 702843 548544
11010E48544M3640R0227n9501m1406M78601l63166J50809M30246F24832Q6051
$$ 548544 592184 682411 622910 581504 1060105 696939 847748 1277994 624832 710883
11000G10883K00429k52679L20455D81779J22960o6148j04667K24210o5457M15460
$$ 710883 911312 658633 979088 481779 604739 538591 433924 658134 592677 1008137
10990A008137k33693j92312K90714J46953m92190K75467N02310j41374Q5258K44934
$$ 1008137 774444 582132 872846 1019799 527609 803076 1305386 1164012 1249270 1494204
10980A494204j91016o4402N38761j69571P63740l4738K41390J06713P29907p1761
$$ 1494204 1303188 1238786 1777547 1607976 2371716 2336978 2578368 2685081 3414988 3343227
10970C343227N1789j04347j47467l45788q08129j37878k37931l77671p8175o2820
$$ 3343227 3395016 3290669 3143202 2797414 1989285 1851407 1613476 1235805 1157630 1094810
10960A094810o386k87266J75583O2853k06567M8144j89526j76128Q9550l1275
$$ 1094810 1088424 801158 976741 1039594 833027 881171 691645 515517 605067 573792
10950E73792A20396O3858b79904B64670D0096J59763D6102K96848G1773a34035
$$ 573792 120396 184254 -279904 264670 40096 199859 46102 342950 71773 -134035
10939C71056A52045g2089B10228b4186H3198R9614o7596f8219a8052q8763j55141
$$ 371056 152045 -72089 210228 -24186 83198 182812 115216 -68219 -18052 -106815 -261956
10928b61956a0747B00393E1370A8179M63060b60936A28688c83807a04227C49462
$$ -261956 -10747 200393 51370 18179 481239 -260936 128688 -383807 -104227 349462
10917G7366j6906a33446A01118C1187A2398e8304k69607B6020K32062c0012Q463
$$ 77366 60460 -133446 101118 31187 12398 -58304 -327911 26020 258082 -30012 -21549
10906b1549j42990o9069C02826a71569Q0957j60811B55747p0692G0315a30189
$$ -21549 -164539 -233608 302826 -171569 -90612 -251423 255747 185055 70315 -130189
10895E7927c6542M404A1251e6015j7405A39391J64870h8657A41056b4064j94208
$$ 57927 -36542 -32138 11251 -56015 -73420 139391 304261 -88657 141056 -24064 -218272
10884b18272A51022f8046C0972K20438c6562n7072H8583j8386d7502j70293A64646
$$ -218272 151022 -68046 30972 251410 -36562 -93634 88583 70197 -47502 -217795 164646
10872a54840N3244B55898j15567c92651a49284A02270i359o333n23396b49947
$$ -154840 -101596 255898 140331 -392651 -149284 102270 -9359 -15692 -539088 -249947
10861F1016j1699R3627i8847a4663Q66k3917A69786e9336B81702a66959D7827
$$ 61016 49317 142944 -98847 -14663 -13797 -37714 169786 -59336 281702 -166959 47827
10849a04930A54448b96918N2206A25379B1211J90320h8628n5294j72031A7676
$$ -104930 154448 -296918 -244712 125379 21211 211531 -88628 -143922 -315953 17676
10838a97856j5576g0476B64112j24444d56917g0581B24144a85635j4374a7205
$$ -197856 -213432 -70476 264112 139668 -456917 -70581 224144 -185635 -200009 -17205
10827b62804h3612B203J91876G3977Q6509I267d99j07736q4530B26926E3570a18256
$$ -262804 -83612 2203 194079 73977 160486 9267 -499 -108235 -192765 226926 53570 -118256
10814C818N9196B2291a54036B35185h2912F2109a91094A1752c406j18057o6464
$$ 3818 63014 22291 -154036 235185 -82912 62109 -191094 11752 -3406 -121463 -187927
10803a87927A02593a69475C2530c64897Q6180C9841i7864A8062J1160M5449b23574
$$ -187927 102593 -169475 32530 -364897 -278717 39841 -97864 18062 29222 74671 -223574
10791h5928I5758K8678e7322D81611a34207a0813j42304j86606N7347i8389c6299
$$ -85928 95758 124436 -57322 481611 -134207 -10813 -153117 -339723 -282376 -98389 -36299
10779H3026c59656J56062i098B17503b07578B73142c25520D3684a79683e299l99495
$$ 83026 -359656 -203594 -9098 217503 -207578 273142 -325520 43684 -179683 -5299 -404794
10768d04794b1193a007G9005a71433b6239k05453c0860C05782A39943E2108J24365
$$ -404794 -21193 -1007 79005 -171433 -26239 -231692 -30860 305782 139943 52108 176473
10757A76473b16042I9280a78148c0168B39000j2023h4339p7550C87392e0543o104
$$ 176473 -216042 99280 -178148 -30168 239000 226977 -84339 -161889 387392 -50543 -56647
10746e6647B25822q0492a93635o7605A56796A490a3998k30537B03659a60461A12921
$$ -56647 225822 145330 -193635 -261240 156796 1490 -13998 -244535 203659 -160461 112921
10734G9921a18579G5181k4829a11257a0591l1167H8867a21778e0800E5472a06712
$$ 79921 -118579 75181 50352 -111257 -10591 -41758 88867 -121778 -50800 55472 -106712
10722a92046j24482B05072h7666B48277h1708B03322b91696a7204k01002A5096
$$ -192046 -316528 205072 -87666 248277 -81708 203322 -291696 -17204 -218206 15096
10711a79442B24384b82348N494J34224j25359B3387a22283C1636h9212o8592B27244
$$ -179442 224384 -282348 -276854 -142630 -267989 23387 -122283 31636 -89212 -157804 227244
10699G9415c5865k8986K9855k05349P4592A62013K88109a23772E7970J64715A5013
$$ 79415 -35865 -64851 -34996 -240345 -165753 162013 450122 -123772 57970 222685 15013
10687C6195J8195P2686a0369k08768F4429d1964l54447D5477b13874j2144C2977
$$ 36195 54390 127076 -10369 -219137 64429 -41964 -396411 45477 -213874 -226018 32977
10675b16724e7181P83j2410C79243c94470c1853p3784C2937g5697E8261A7562
$$ -216724 -57181 -56398 -68808 379243 -394470 -31853 -105637 32937 -75697 58261 17562
10663a09446d5755A21602a83716L2278L98G1603N293a74697A69659e8067j13345
$$ -109446 -45755 121602 -183716 -151438 -151040 71603 76896 -174697 169659 -58067 -171412
10652a71412F1126a46188A03246n0865A2386L080b94895C1269C900a07119F1673
$$ -171412 61126 -146188 103246 52381 12386 15466 -294895 31269 3900 -107119 61673
10640A18085a89329O3967A00786b96546I7962a56341A92318g3379R199j8314B46732
$$ 118085 -189329 -125362 100786 -296546 97962 -156341 192318 -73379 -64180 -82494 246732
10628A53934j6626a86413e4842l88097E7075e10831h0939B87009a72481F6064
$$ 153934 137308 -186413 -54842 -442939 57075 -510831 -80939 287009 -172481 66064
10617G0475a93439m546n835A25190B0392a3716E5462R6717a68160O3965o9357
$$ 70475 -193439 -197985 -203820 125190 20392 -13716 55462 152179 -168160 -104195 -173552
10606a73552c367B80978a49460A76571q1934c05753J51561K1343A59518b94811
$$ -173552 -3367 280978 -149460 176571 94637 -305753 -154192 -132849 159518 -294811
10595a10100f349j03643B33974K20462B3940A9a17934j04675Q6803a5216A62188
$$ -110100 -6349 -109992 233974 454436 23940 19 -117934 -222609 -135806 -15216 162188
10583a7076B11094A05546c25730e4735I2715m3946b44786B39843J93178b16003
$$ -17076 211094 105546 -325730 -54735 92715 48769 -244786 239843 433021 -216003
10572a59777O5585L0813B59813a12594A10521k1578d18495A09022L32237b7523
$$ -159777 -94192 -63379 259813 -112594 110521 88943 -418495 109022 441259 -27523
10561a34891j60440i0350k90015g3826b0760I887a01747F9531a06989k66G3542
$$ -134891 -295331 -90350 -380365 -73826 -20760 9887 -101747 69531 -106989 -107255 73542
10549G1857K5949J11379a57470G4102j0601P0552a31344A19570b47451J02746
$$ 71857 97806 209185 -157470 74102 63501 134053 -131344 119570 -247451 -144705
10539a44705A2224a24438K9832d2659D5085b74282J06077j17636e2667A1612K62342
$$ -144705 12224 -124438 -94606 -42659 45085 -274282 -168205 -285841 -52667 11612 273954
10528B73954j27438L5257n1016g2636A59558A458i5408a3843A70736b30035G6012
$$ 273954 146516 181773 130757 -72636 159558 1458 -95408 -13843 170736 -230035 76012
10516f8043A36683A0394J64830c3021C47806F1767a27594B03400F1260b39913
$$ -68043 136683 10394 175224 -33021 347806 61767 -127594 203400 61260 -239913
10505a37380N9463C5471a29721A52477e6880j07156K5276p7663J6525G9757a18940
$$ -137380 -77917 35471 -129721 152477 -56880 -164036 -138760 -216423 -199898 79757 -118940
10493C1567f6254k31283A56435b72826G4133C0187b01371P2378b5616k8835B04384
$$ 31567 -66254 -297537 156435 -272826 74133 30187 -201371 -128993 -25616 -54451 204384
10481c4740j21339g1115E3434O3456h3699k45350f0114H5690C3202L5108J2108
$$ -34740 -156079 -71115 53434 116890 -83699 -329049 -60114 85690 33202 68310 80418
10470H0418C9842m966i8069I3785a62011E2487L6919a28268D2574J82301a94056
$$ 80418 39842 34876 -98069 93785 -162011 52487 89406 -128268 42574 224875 -194056
10458a69891D8556j6226J07407h4568n0830j75050A9712j662a87028P6064A749
$$ -169891 48556 32330 139737 -84568 -135398 -310448 19712 18050 -187028 -110964 1749
10446A87718O7277a29470H0866e6830B47822b37580J12420A31016b71014E2065
$$ 187718 254995 -129470 80866 -56830 247822 -237580 -125160 131016 -271014 52065
10435b68351A07711Q075b77451e5888C1101c8284A85735a28302A34727b56488
$$ -268351 107711 115786 -277451 -55888 31101 -38284 185735 -128302 134727 -256488
10424C61712H3494C6102K2423A6416J0477J11812b32908A1158g4684J1667B06951
$$ 361712 83494 36102 58525 16416 26893 138705 -232908 11158 -74684 -63017 206951
10412i6561j07793k22070K09588B32235F2179c0847F9605b17555B18887N2254
$$ -96561 -204354 -426424 -216836 232235 62179 -30847 69605 -217555 218887 271141
10402B71141A34449b79144C33835D7335J57626A1350Q7989C8915a19171a9460
$$ 271141 134449 -279144 333835 47335 204961 11350 99339 38915 -119171 -19460
10391A46635C5517L5756N5470D799M47580A02316J2427k6124m2719m755J49120
$$ 146635 35517 71273 126743 4799 452379 102316 114743 88619 45900 41145 190265
10380A90265F8363A1897L22719q2119p0845H3502j9454L81579D9606K50712A28612
$$ 190265 68363 11897 334616 252497 181652 83502 64048 445627 49606 300318 128612
10368C43179K59305o6931N2554B38291K27536M1745n3744J3284j92871c0888B56841
$$ 343179 602484 535553 588107 238291 465827 507572 453828 467112 274241 -30888 256841
10356g2055C3754K86196b899C45924O8541Q9105N12600m35023r491k43738N1698
$$ -72055 33754 319950 -2899 345924 414465 503570 1016170 581147 571656 327918 379616
10345C79616A41236b6630n568F41963A17072J17377b3182E2805J14144d163C44531
$$ 379616 141236 -26630 -32198 641963 117072 234449 -23182 52805 166949 -4163 344531
10333A52212J31746a18424A42345f143A67784B4358J98214G3300h0738A74816
$$ 152212 283958 -118424 142345 -6143 167784 24358 222572 73300 -80738 174816
10322e7905I1639C7180K1339K4481j6356a50291D74793f2363D0023a28422D07493
$$ -57905 91639 37180 58519 83000 66644 -150291 474793 -62363 40023 -128422 407493
10310A29033F2214j1812J60822b02374f3051l164j46095I146R7927K6061a2277
$$ 129033 62214 50402 211224 -202374 -63051 -66215 -212310 9146 107073 133134 -12277
10298E6079a65463A37334f8706J2703Q165m9042A02411C0275a61963f5285k47607
$$ 56079 -165463 137334 -68706 -56003 -47838 -96880 102411 30275 -161963 -65285 -312892
10287c12892F2923J107N2191A7604J71999a01159o0609A3152a5564r79A67692
$$ -312892 62923 64030 116221 17604 189603 -101159 -161768 13152 -15564 -16543 167692
10275A635O0856d4368n7736j5355I4072h9773L4174C0693N9259b27848a05702
$$ 1635 62491 -44368 -102104 -117459 94072 -89773 -55599 30693 89952 -227848 -105702
10263i4722b6964r1829b662q0735n4460B91165c19251A90752b2530A33282J01192
$$ -94722 -26964 -118793 -2662 -83397 -137857 291165 -319251 190752 -22530 133282 234474
10252B34474D5548Q5908a74308c9787I4842a30632C1885g2223k40389a03505B34877
$$ 234474 45548 131456 -174308 -39787 94842 -130632 31885 -72223 -312612 -103505 234877
10240A90731i0162j35969N4446h3675A67754a55692A13821a92843a8858j74766
$$ 190731 -90162 -226131 -171685 -83675 167754 -155692 113821 -192843 -18858 -193624
10230a93624Q6705A5876R620K39906C2015e5362l4085j04828N5190C10292b81313
$$ -193624 -106919 15876 25496 265402 32015 -55362 -89447 -194275 -139085 310292 -281313
10218e9095l5851D17698b4725H9185c03587J23981g4184n0689F6636c4044H2558
$$ -59095 -94946 417698 -24725 89185 -303587 -179606 -74184 -124873 66636 -34044 82558
10206B91000c5576j14687m6202k5077A8096J1045J33387B8043b27220B49904a82255
$$ 291000 -35576 -150263 -196465 -221542 18096 29141 162528 28043 -227220 249904 -182255
10194a04939j07658m8095A02711a59907P2166j54110B41535a38176n2694o3478
$$ -104939 -212597 -260692 102711 -159907 -87741 -241851 241535 -138176 -190870 -254348
10184b54348M3363k96959a7713C3579c61986b1044k38844g3293a4534H0676l8762
$$ -254348 -210985 -507944 -17713 33579 -361986 -21044 -259888 -73293 -14534 80676 41914
10173D1914K25502b5574j43175P016m0938E847a58501n0974p7581N1031a7624
$$ 41914 267416 -25574 -168749 -161733 -202671 5847 -158501 -209475 -287056 -236025 -17624
10161A05764f9404q54F6477l1283b5131A16553a34281q8621j28963h7926m0806
$$ 105764 -69404 -70258 66477 35194 -25131 116553 -134281 -222902 -351865 -87926 -128732
10150a28732m0657C45070a16708j19750d0687l0453B4671J72747a6021B10971
$$ -128732 -169389 345070 -116708 -236458 -40687 -71140 24671 197418 -16021 210971
10139a22801A62505a6083j70099j86778D10148a00044A69799G2640Q6463K307
$$ -122801 162505 -16083 -186182 -372960 410148 -100044 169799 72640 159103 161410
10129A61410d8700l342a59k91731m3761A28923d4440B89309b24624Q5463B34576
$$ 161410 -48700 -52042 -159 -291890 -335651 128923 -44440 289309 -224624 -139161 234576
10117a44422n746d0001j48922A45235a29629a6639k31409f5539q2572k49592a92778
$$ -144422 -150168 -40001 -188923 145235 -129629 -16639 -248048 -65539 -148111 -397703 -192778
10105b56150a3206f375j13227B31734F1092K46780b56559C4728c07457N674j4890
$$ -256150 -13206 -6375 -119602 231734 61092 307872 -256559 34728 -307457 -301783 -316673
10094c16673A17063L23426j45204a42624q2523q849F5058o193Q2807h5977r242
$$ -316673 117063 440489 295285 -142624 -225147 -233996 65058 58865 141672 -85977 -95219
10083i5219J1661L6097J097q7056c0379k32210d7803K001J8323k79115A7049J25562
$$ -95219 -83558 -47461 -46364 -133420 -30379 -262589 -47803 -45802 -27479 -306594 17049 142611
10071A42611a73914e652H3135M3060B2697g9041j88959H4793i8545j15830l8210
$$ 142611 -173914 -5652 83135 126195 22697 -79041 -268000 84793 -98545 -214375 -252585
10060b52585a5693C03666A48847a65797P7567J4760G7263B0261K7948k0850b67609
$$ -252585 -15693 303666 148847 -165797 -88230 -73470 77263 20261 48209 27359 -267609
10048c32213B14495H5612a24827l21128c1716j08597J9478B23167b84931R2827
$$ -332213 214495 85612 -124827 -445955 -31716 -140313 -120835 223167 -284931 -192104
10038a92104o9448Q5685A03961Q6915E0987a65775A20197h2682n1168a529l0658
$$ -192104 -261552 -175867 103961 190876 50987 -165775 120197 -82682 -133850 -1529 -32187
10027c2187j61128p8778D0215Q6595a13819B09567g1350A30891J14397D1800F007
$$ -32187 -193315 -272093 40215 126810 -113819 209567 -71350 130891 245288 41800 6007
10015c34287A06506A3698d66364G5414a81153C5775J21641d6747j55344j46939
$$ -334287 106506 13698 -466364 75414 -181153 35775 157416 -46747 -202091 -349030
10005c49030k7196C20826g3735A53363a22561K5805j74776J11649C1745i0046
$$ -349030 -376226 320826 -73735 153363 -122561 -96756 -271532 -159883 31745 -90046
9994b20634j44455F1730d1434A65403J00255B4906a62864A16064K603a04288A84158
$$ -220634 -365089 61730 -41434 165403 265658 24906 -162864 116064 118667 -104288 184158
9982d47134b3181A22015D603Q167j218e1229j63829A24249a88276B1116h676C28103
$$ -447134 -23181 122015 4603 12770 11552 -51229 -215058 124249 -188276 21116 -8676 328103
9969C13593A12223J34096b14575j3290a08143I6744M289c4795A3503b05044O5503
$$ 313593 112223 246319 -214575 -227865 -108143 96744 101033 -34795 13503 -205044 -139541
9958a39541D47470d5554n8694k6304F9703e25935a35717i49j50844g1585B36393
$$ -139541 447470 -45554 -104248 -130552 69703 -525935 -135717 -949 -151793 -71585 236393
9946G1670M50A2642R5866i6236j61942D1094K8728a81131D36422B7411b3233l46778
$$ 71670 72120 12642 108508 -96236 -258178 41094 69822 -181131 436422 27411 -23233 -370011
9934c70011a29521j525l6351p0656J16443e9161k6318m6098H1166e779q005B36268
$$ -370011 -129521 -131046 -167397 -238053 -121610 -59161 -85479 -131577 81166 -5779 -13784 236268
9921c15510m2179J40379d1438k15895a00410n9930m061j53860a24230A94881c4935
$$ -315510 -357689 -217310 -41438 -257333 -100410 -160340 -164401 -318261 -124230 194881 -34935
9909f0084R48E3283a73139B4419h4077K6521l16250A92208F3441e1703j70513
$$ -60084 -59136 53283 -173139 24419 -84077 -57556 -373806 192208 63441 -51703 -222216
9898b22216F7880a28108B90752c83351B09029a37466o8178C9779i8945j10673
$$ -222216 67880 -128108 290752 -383351 209029 -137466 -205644 39779 -98945 -209618
9888b09618N1424P2817r1387A57155D531a59997H5527a68080f798D7456c00029
$$ -209618 -158194 -85377 -176764 157155 4531 -159997 85527 -168080 -6798 47456 -300029
9876b21910e6563q8354A51990g3634m1383j15860G3220f9922j7714A76753c6613
$$ -221910 -56563 -144917 151990 -73634 -115017 -230877 73220 -69922 -87636 176753 -36613
9864f1475j24783b7991D38290i7888k94916Q4832N5969a01178A17492a23453A61521
$$ -61475 -186258 -27991 438290 -97888 -392804 -307972 -252003 -101178 117492 -123453 161521
9852b43186e9708B52434b46092a12229K3950A40901a86466h6136E3504K7465A1745
$$ -243186 -59708 252434 -246092 -112229 -88279 140901 -186466 -86136 53504 80969 11745
9840E7237k3902a77596M2193a4407C42898g7028m8526A4175c9525I4721O7952
$$ 57237 33335 -177596 -135403 -14407 342898 -77028 -125554 14175 -39525 94721 162673
9829A62673d28400A76906a18133e3162A78320n7135c6137j88419f3724B02350
$$ 162673 -428400 176906 -118133 -53162 178320 121185 -36137 -224556 -63724 202350
9818c63546O3858A49350a71878h4584D25191a52558F3307j6953b73762a35377
$$ -363546 -299688 149350 -171878 -84584 425191 -152558 63307 46354 -273762 -135377
9807B85179j32851a45681c8935l85131a1414j63960m8601k3193n031P1312B02645
$$ 285179 152328 -145681 -38935 -424066 -11414 -175374 -223975 -247168 -252199 -180887 202645
9795a52281r5693g4269A37094c18026H0834M9751e1316j5081A29533c23280P6184
$$ -152281 -247974 -74269 137094 -318026 80834 130585 -51316 -66397 129533 -323280 -247096
9784b47096F7781b0405k87985G0708a01656a0946K669B01540H247N0127k0877
$$ -247096 67781 -20405 -308390 70708 -101656 -10946 -8277 201540 8247 58374 37497
9773C7497N4294K0947L5515g6948k78428C1119b5486l20623B87584H1414C7030
$$ 37497 91791 112738 148253 -76948 -355376 31119 -25486 -346109 287584 81414 37030
9761c99045B57894a74938O7717A66615b96748O9912C75173i1893j73800d9547
$$ -399045 257894 -174938 -107221 166615 -296748 -226836 375173 -91893 -265693 -49547
9750A28429e9879o0580A15207m0319a2467r1867j82628f1999j53874J3118E7061
$$ 128429 -59879 -120459 115207 74888 -12467 -104334 -286962 -61999 -215873 -202755 57061
9738b53096a11182C9609a26480A1146b00609A00202O5248m9860g8429k50521L956
$$ -253096 -111182 39609 -126480 11146 -200609 100202 165450 115590 -78429 -328950 -324994
9727c24994a51903N8012A46661h7501A40168h1456l90867J48565A18696c34713
$$ -324994 -151903 -93891 146661 -87501 140168 -81456 -472323 -323758 118696 -334713
9716B14160m831k5478C9237a56491j01827J22290k06094J03651a06854D0813a33484
$$ 214160 209329 183851 39237 -156491 -258318 -136028 -342122 -238471 -106854 40813 -133484
9704e0816k55937C87095r4281i231j98761N3170c1246k09912h3376A15733a48815
$$ -50816 -306753 387095 292814 -9231 -207992 -154822 -31246 -241158 -83376 115733 -148815
9692E7848c34044l5392h1536A83470A813a32224o3394E099R9810J6418k3739a77954
$$ 57848 -334044 -369436 -81536 183470 1813 -132224 -195618 5099 104909 121327 97588 -177954
9679H5591b43726H6497a45256L7663K018D2336a2982r5602A90549c3316j77816
$$ 85591 -243726 86497 -145256 -107593 -105575 42336 -12982 -108584 190549 -33316 -211132
9668b11132g4812o7391k12072b0434l68178g0012B46392d2696J5988l33630a254
$$ -211132 -74812 -142203 -354275 -20434 -388612 -70012 246392 -42696 -26708 -360338 -1254
9656a26429j05739f180B66647A5940a53108A18235g418A50994b1097p3638N897
$$ -126429 -232168 -6180 266647 15940 -153108 118235 -7418 150994 -21097 -94735 -88838
9645h8838n9951B28790a1165A79396f1847A2718i885n20008f8165o4991a1230
$$ -88838 -148789 228790 -11165 179396 -61847 12718 -9885 -529893 -68165 -133156 -11230
9633a65899c3108q4636a1454C65414r9215a37819C3547c1367k29810a15791p8802
$$ -165899 -33108 -117744 -11454 365414 266199 -137819 33547 -31367 -261177 -115791 -194593
9622a94593B27147c05109A34290b25808A83911K2010a14949N6130A36734c64415
$$ -194593 227147 -305109 134290 -225808 183911 205921 -114949 -58819 136734 -364415
9611d54772G0200a91666c5103H6503i9644j1549M8159j44709K3766B25174a63312
$$ -454772 70200 -191666 -35103 86503 -99644 -111193 -63034 -207743 -183977 225174 -163312
9599H4029d8489B4736L78370A36131g6662j73226d9064B49440a98725A15214C0017
$$ 84029 -48489 24736 403106 136131 -76662 -249888 -49064 249440 -198725 115214 30017
9587b20107C41607F5136J0218b45186J2774B2644L18375f0105l6262K6297k62391
$$ -220107 341607 65136 75354 -245186 -232412 22644 341019 -60105 -96367 -70070 -332461
9576c32461C3953e5031k71345A80295c13743J01410f2622b827o1836B075P3425
$$ -332461 33953 -55031 -326376 180295 -313743 -212333 -62622 -2827 -64663 2075 75500
9565G5500b7342a2722j39341M6845B76791A11625a11846F9276b03981B01796i6021
$$ 75500 -27342 -12722 -152063 -105218 276791 111625 -111846 69276 -203981 201796 -96021
9553a54155B87382a72172A17744b47124n916I5278i3339C67864a82807B8374a93789
$$ -154155 287382 -172172 117744 -247124 -253040 95278 -93339 367864 -182807 28374 -193789
9541g4005A24262a03347A35339D7768K54680A24944J1531d9772n2011j60213N9099
$$ -74005 124262 -103347 135339 47768 302448 124944 136475 -49772 -101783 -261996 -202897
9530b02897o4931f0443a609l42513A24112a65093D5705e7257p3252c5894E8911
$$ -202897 -267828 -60443 -1609 -344122 124112 -165093 45705 -57257 -130509 -35894 58911
9518a83912e1485k05667N9890A36143a1586k81485A82736J0175a41162j02017
$$ -183912 -51485 -257152 -197262 136143 -11586 -293071 182736 192911 -141162 -243179
9508b43179l159a3131E1866b00683P1224k11902a61519K9161G3197L39684b8257
$$ -243179 -246338 -13131 51866 -200683 -129459 -341361 -161519 -132358 73197 412881 -28257
9496a39403f4323A45484a48331B5085J04555A798K9895a03730A43900o8560d47917
$$ -139403 -64323 145484 -148331 25085 129640 1798 31693 -103730 143900 75340 -447917
9484B58359L4286a44054A10248m8721a43502q93J6235A65980c30466J54642D9193
$$ 258359 292645 -144054 110248 61527 -143502 -144395 -128160 165980 -330466 -175824 49193
9472a9331D5985f0051j9514c9281B82994E1846c4976B8247K775b03766k4519a00425
$$ -19331 45985 -60051 -79565 -39281 282994 51846 -34976 28247 31022 -203766 -228285 -100425
9459d2587A42010A9054i2589A76134g0906j28816l9403N715O2133h2955I311a17779
$$ -42587 142010 19054 -92589 176134 -70906 -199722 -239125 -233410 -171277 -82955 9311 -117779
9446a07259q4734g8299A94530c0575k41084G5518c0164I785a53991c141j39629
$$ -107259 -191993 -78299 194530 -30575 -271659 75518 -30164 9785 -153991 -3141 -142770
9435a42770A2745M424J84851G8172A9407b41452L7758k3929G3971Q6417b46361
$$ -142770 12745 17169 202020 78172 19407 -241452 -203694 -227623 73971 160388 -246361
9423B18062b2374K01k02691F9272q64f0888B29172j07656n4576k6296a21367j15352
$$ 218062 -22374 -22173 -224864 69272 68408 -60888 229172 121516 66940 40644 -121367 -236719
9411b36719C62641a06328E3545c24066J59639G7122e4602G3268c77749Q9449a0556
$$ -236719 362641 -106328 53545 -324066 -164427 77122 -54602 73268 -377749 -288300 -10556
9399B8051b6630o2769a093k1375o916j6533k46479B04206f4095J1j54190C55769
$$ 28051 -26630 -89399 -1093 -22468 -29384 -45917 -292396 204206 -64095 -64084 -218274 355769
9386A51765a95194B78652a19376k30985A58226b94708a02430j45227M3121A03973
$$ 151765 -195194 278652 -119376 -350361 158226 -294708 -102430 -247657 -204536 103973
9375a76624j43201g9143r8344A21639i9084j61403C56886a90595f9401p356L5825
$$ -176624 -319825 -79143 -177487 121639 -99084 -260487 356886 -190595 -69401 -76757 -40932
9364d0932o9936D04682b7671A22146n4012Q3287c36308l8510a39151G2169P9026
$$ -40932 -110868 404682 -27671 122146 68134 151421 -336308 -374818 -139151 72169 151195
9353A51195c3745A87303B3296L37420d2036k4740K3503B51749b80074N7639h7448
$$ 151195 -33745 187303 23296 360716 -42036 -66776 -43273 251749 -280074 -222435 -87448
9341d02649J70078J934A91958M5378D7211a05542E4471K26028b07851B26234a83756
$$ -402649 -232571 -230637 191958 237336 47211 -105542 54471 280499 -207851 226234 -183756
9329c25327R125c563j76424j8524F3265b00482j43427G4397L9104a11210K5261
$$ -325327 -316202 -3563 -179987 -198511 63265 -200482 -343909 74397 113501 -111210 -85949
9318h5949B00471a30276m9463B24246g1130k63080A17039k8532b64338a26482
$$ -85949 200471 -130276 -179739 224246 -71130 -334210 117039 88507 -264338 -126482
9307D3702J58c07950R9400A19667g9842k6031j54454H9691e864m8343l8287E8842
$$ 43702 43860 -307950 -208550 119667 -79842 -105873 -260327 89691 -5864 -54207 -92494 58842
9294A30398C5404a75812k85165J39036I0339J3417a56187I768a30064H2780J990
$$ 130398 35404 -175812 -460977 -321941 90339 103756 -156187 9768 -130064 82780 84770
9283H4770c01591g0396D17396a16774B3230J01300j5512d8924H1598l4591d50783
$$ 84770 -301591 -70396 417396 -116774 23230 124530 109018 -48924 81598 47007 -450783
9271A80308n3715d6832I8341e3530D2015a4232G0014i2178K5216n1417N7389A6887
$$ 180308 126593 -46832 98341 -53530 42015 -14232 70014 -92178 -66962 -118379 -60990 16887
9258A34208l9023E261J35765c53346f4660j12162H9442a23802r2733b6157j15896
$$ 134208 95185 5261 141026 -353346 -64660 -176822 89442 -123802 -216535 -26157 -142053
9247a42053A01228a99771K3904J5196l3435C4903a61424c2124C30197i9719n7832
$$ -142053 101228 -199771 -175867 -160671 -194106 34903 -161424 -32124 330197 -99719 -157551
9236a57551I9246J59849J19517H254b69153l5034A09110N8750a62125f6293A19634
$$ -157551 99246 259095 378612 8254 -269153 -304187 109110 167860 -162125 -66293 119634
9224a21597K7031B3847b555n46385d3973A52569K20254e4378j3965j26882o398
$$ -121597 -94566 23847 -2555 -548940 -43973 152569 372823 -54378 -68343 -195225 -201623
9213b01623A1906g4074H9320b4155B94893P6277a59463G7862a98406D3561D322
$$ -201623 11906 -74074 89320 -24155 294893 371170 -159463 77862 -198406 43561 4322
9201A03103e02510F2574a67772C214a3535C20239A58636a35595e7282J3118C8468
$$ 103103 -502510 62574 -167772 3214 -13535 320239 158636 -135595 -57282 -44164 38468
9189a39826b0295I4720a9073j03139J6754k53198A16574e225j2628D6434N3604
$$ -139826 -20295 94720 -19073 -122212 -105458 -358656 116574 -5225 -17853 46434 100038
9178A00038b2286G0557j9873J23821c43641J2417P1107f2065d406l27901j35575
$$ 100038 -22286 70557 50684 174505 -343641 -331224 -260117 -62065 -4406 -332307 -467882
9167d67882A90273c8925D2861e1422j28591B76905d3824A98391a94166c6080k05140
$$ -467882 190273 -38925 42861 -51422 -180013 276905 -43824 198391 -194166 -36080 -241220
9156b41220P0558A2301a10332G657O8693a92303c6638j44797O5035A16931K32503
$$ -241220 -170662 12301 -110332 7657 76350 -192303 -36638 -181435 -116400 116931 349434
9145C49434a06865d8608k8143a5067k09583H279a75246c0325o0315j0470m9067
$$ 349434 -106865 -48608 -76751 -15067 -224650 8279 -175246 -30325 -90640 -101110 -150177
9134a50177b9209l87607F2863b69671A73644i9904l9225A29126a9677m3247H1530
$$ -150177 -29209 -416816 62863 -269671 173644 -99904 -139129 129126 -19677 -62924 81530
9122B86696a25049k65998G4609b78949H1025a81516g0915j28196h3443Q172A5205
$$ 286696 -125049 -391047 74609 -278949 81025 -181516 -70915 -199111 -83443 -75271 15205
9110A22865h8753A90106c63268A52495b45273J9325B10982N4275b40276P9781
$$ 122865 -88753 190106 -363268 152495 -245273 -225948 210982 265257 -240276 -160495
9100a60495C7680a10096I1576b89434B0307O2237a42809a4740A43196a33764j33573
$$ -160495 37680 -110096 91576 -289434 20307 82544 -142809 -14740 143196 -133764 -267337
9089b67337A10014J32206C0708G660b48880C12291a85182c1831k7822l34112D7413
$$ -267337 110014 242220 30708 7660 -248880 312291 -185182 -31831 -59653 -393765 47413
9077b4081l7612b6265m16775P2317c4091L665m71994H7493O0547C1031a22392
$$ -24081 -61693 -26265 -443040 -370723 -34091 -30426 -502420 87493 148040 31031 -122392
9065a20940A17590e0359j72235N8165j26788A71944M6209q6879c75478F9901K7402
$$ -120940 117590 -50359 -222594 -164429 -291217 171944 218153 131274 -375478 69901 97303
9054I7303d12660A99258n7909g6944q6486h093n8833A65377h1762p323C98672
$$ 97303 -412660 199258 141349 -76944 -163430 -8093 -66926 165377 -81762 -89085 398672
9042G3864b98896N6725k1000a24976B8005O6408a07558k05357i4096q8230I3874
$$ 73864 -298896 -242171 -263171 -124976 28005 94413 -107558 -312915 -94096 -182326 93874
9030E1215a91435H5058A4844Q1968b35943A75372h9006c8576B6790J82769r3030
$$ 51215 -191435 85058 14844 96812 -235943 175372 -89006 -38576 26790 209559 116529
9019A16529a7742l70746a48947O5505a8650j39653L2732A33311a93982C9763a42169
$$ 116529 -17742 -388488 -148947 -83442 -18650 -158303 -125571 133311 -193982 39763 -142169
9007B39017e5664k08240A76706b54256N7492F1740a09691p9578j4728d4217F2631
$$ 239017 -55664 -263904 176706 -254256 -196764 61740 -109691 -189269 -203997 -44217 62631
8995c3998r9593B86153a60388c0755B59472H1768l6455g3937C18818c0211j01839
$$ -33998 -133591 286153 -160388 -30755 259472 81768 45313 -73937 318818 -30211 -132050
8984a32050J1577m6777B93827A31056a79365B5231b65124m21410A02216a89363
$$ -132050 -120473 -167250 293827 131056 -179365 25231 -265124 -686534 102216 -189363
8973b62121a11191A13675d2868F8727J04490A560a15264M7797m5007o2512m8977
$$ -262121 -111191 113675 -42868 68727 173217 1560 -115264 -67467 -112474 -174986 -223963
8962b23963B82509A3258a56713B48437f9397j38152j81437a51612K7725r6680
$$ -223963 282509 13258 -156713 248437 -69397 -207549 -388986 -151612 -123887 -220567
8952b20567F7483f5293F3468Q5962f8214p9855m5689e351C25046a34773j14972
$$ -220567 67483 -65293 63468 149430 -68214 -148069 -193758 -5351 325046 -134773 -249745
8941b49745J23977N615n4803P7200k11280a47147I587J39510a17241j3509A12352
$$ -249745 -125768 -120153 -174956 -97756 -309036 -147147 9587 149097 -117241 -130750 112352
8929A1446b7661j55617O5068I5900K22339O68575K283897M389076L940353B591274
$$ 11446 -27661 -183278 -118210 95900 318239 986814 3270711 7659787 11600140 2591274
8918F48865j23905j95758j38686k5331e0591C88242A28948C723J49982K40593
$$ 648865 524960 329202 190516 165185 -50591 388242 128948 3723 153705 394298
8908C94298J46405j72309A15506b11151A4210c50227A68960A8062P8672c7740
$$ 394298 540703 368394 115506 -211151 14210 -350227 168960 18062 96734 -37740
8897a95681A33172M610i5165B3056b3699C05194A10440B9490M775J25705F2103
$$ -195681 133172 137782 -95165 23056 -23699 305194 110440 29490 34265 159970 62103
8885I9975D6128d9365j19414I6676L1383k3716l3127J10499b14804b7285G4438
$$ 99975 46128 -49365 -168779 96676 128059 104343 71216 181715 -214804 -27285 74438
$$ [...]
##END NTUPLES=NMR SPECTRUM
##END=
