
##TITLE=AC1334_VIERS11074_6524662_oITXw8HV29
##JCAMPDX= 6.0         $$ Bruker NMR JCAMP-DX V2.0
##DATA TYPE= NMR SPECTRUM
##DATA CLASS= NTUPLES
##ORIGIN= BRUKER
##OWNER= Administrator
$$ 1.72 TOPSPIN		Version 2.1
$$ 2012-07-14 23:04:20.078 -0500  Administrator@TOPSPIN
$$ Compression mode = diff/dup
##.OBSERVE FREQUENCY= 400.02188249412
##.OBSERVE NUCLEUS= ^1H
##.ACQUISITION MODE= SIMULTANEOUS (DQD)
##.ACQUISITION SCHEME= undefined
##.AVERAGES= 64
##.DIGITISER RES= 22
##SPECTROMETER/DATA SYSTEM= spect
##.PULSE SEQUENCE= noesygpps1d.comp
##.SOLVENT NAME= COFFEE_meoh
##.SHIFT REFERENCE= INTERNAL, COFFEE_meoh, 1, 14.9611
##AUDIT TRAIL= $$ (NUMBER, WHEN, WHO, WHERE, PROCESS, VERSION, WHAT)
$$ ##TITLE= Audit trail, TOPSPIN		Version 2.1
$$ ##JCAMPDX= 5.01
$$ ##ORIGIN= Bruker BioSpin GmbH
$$ ##OWNER= Administrator
$$ $$ C:\Bruker\TOPSPIN/data/COFFEE/nmr/AC1334_VIERS11074_6524662_oITXw8HV29/12/pdata/1/auditp.txt
$$ ##AUDIT TRAIL=  $$ (NUMBER, WHEN, WHO, WHERE, PROCESS, VERSION, WHAT)
(   1,<2012-07-14 23:04:15.390 -0500>,<Administrator>,<TOPSPIN>,<go>,<TOPSPIN 2.1>,
      <created by zg
	started at 2012-07-14 22:52:45.109 -0500,
	POWCHK enabled, PULCHK disabled,
       configuration hash MD5:
       6B 1B 68 BB D9 2E 58 E2 7F 35 AD 54 07 DF 0E 41
       data hash MD5: 64K
       53 95 E4 DB 38 CD DE 8B C6 73 19 3F 09 DC E4 0C>)
(   2,<2012-07-14 23:04:18.218 -0500>,<Administrator>,<TOPSPIN>,<proc1d>,<TOPSPIN 2.1>,
      <Start of raw data processing
       efp LB = 0.3 FT_mod = 6 PKNL = 1 PHC0 = 0 PHC1 = 0 SI = 128K 
       data hash MD5: 128K
       AB 94 0A CB 3B 22 47 19 87 47 69 4F 28 DC 03 6D>)
(   3,<2012-07-14 23:04:19.312 -0500>,<Administrator>,<TOPSPIN>,<proc1d>,<TOPSPIN 2.1>,
      <pk PHC0 = -0.9887695 PHC1 = 0 
       data hash MD5: 128K
       69 B6 F5 5A D6 DB EC 30 FD 77 A0 10 BD 4A 9C D7>)
(   4,<2012-07-14 23:04:19.546 -0500>,<Administrator>,<TOPSPIN>,<proc1d>,<TOPSPIN 2.1>,
      <abs ABSG = 1 
       data hash MD5: 128K
       78 82 33 A8 EC F2 AF 95 9F 14 00 2B C3 6E EB E4>)
(   5,<2012-07-14 23:04:19.625 -0500>,<Administrator>,<TOPSPIN>,<proc1d>,<TOPSPIN 2.1>,
      <abs ABSG = 2 
       data hash MD5: 128K
       BF BB 61 CA 97 55 41 E8 27 4C 3E 64 93 0D CB CB>)
(   6,<2012-07-14 23:04:19.875 -0500>,<Administrator>,<TOPSPIN>,<proc1d>,<TOPSPIN 2.1>,
      <abs ABSG = 3 
       data hash MD5: 128K
       96 26 B3 08 95 8C D9 EE 3C 28 1E 59 6F 13 22 AF>)
(   7,<2012-07-14 23:04:19.937 -0500>,<Administrator>,<TOPSPIN>,<proc1d>,<TOPSPIN 2.1>,
      <abs ABSG = 4 
       data hash MD5: 128K
       EE 64 1F 0E 9D 70 DE B3 F9 20 31 3B 89 99 13 11>)
(   8,<2012-07-14 23:04:20.000 -0500>,<Administrator>,<TOPSPIN>,<proc1d>,<TOPSPIN 2.1>,
      <abs ABSG = 5 
       data hash MD5: 128K
       D0 15 01 9A 59 3E 24 BE 06 01 EE 49 36 0C F2 4F>)
$$ ##END=
$$ 
$$ $$ hash MD5
$$ $$ AE A3 06 E6 A0 2E 9A 13 25 96 1B 12 F0 44 74 8F
##$RELAX= 
##$RELAX= 
##$RELAX= 
##$RELAX= 
##$RELAX= 
##$RELAX= 
##$RELAX= 
##$RELAX= 
$$ Bruker specific parameters
$$ [...]
##$TP07= 0
##$TPNAME0= <>
##$TPNAME1= <>
##$TPNAME2= <>
##$TPNAME3= <>
##$TPNAME4= <>
##$TPNAME5= <>
##$TPNAME6= <>
##$TPNAME7= <>
##$TPOAL= (0..7)
0.5 0.5 0.5 0.5 0.5 0.5 0.5 0.5
##$TPOFFS= (0..7)
0 0 0 0 0 0 0 0
##$TUNHIN= 0
##$TUNHOUT= 0
##$TUNXOUT= 0
##$USERA1= <user>
##$USERA2= <user>
##$USERA3= <user>
##$USERA4= <user>
##$USERA5= <user>
##$V9= 5
##$VALIST= <valist>
##$VCLIST= <CCCCCCCCCCCCCCC>
##$VD= 0
##$VDLIST= <DDDDDDDDDDDDDDD>
##$VPLIST= <PPPPPPPPPPPPPPP>
##$VTLIST= <TTTTTTTTTTTTTTT>
##$WBST= 2048
##$WBSW= 25
##$XGAIN= (0..3)
0 0 0 0
##$XL= 0
##$YL= 0
##$YMAX_a= 10685304
##$YMIN_a= -8220879
##$ZGOPTNS= <>
##$ZL1= 120
##$ZL2= 120
##$ZL3= 120
##$ZL4= 120
##$ABSF1= 14.9611
##$ABSF2= -5.597082
##$ABSG= 5
##$ABSL= 3
##$ALPHA= 0
##$AQORDER= 0
##$ASSFAC= 0
##$ASSFACI= 0
##$ASSFACX= 0
##$ASSWID= 0
##$AUNMP= <proc_prof1d_extract.lims>
##$AXLEFT= 0
##$AXNAME= <>
##$AXNUC= <1H>
##$AXRIGHT= 0
##$AXTYPE= 0
##$AXUNIT= <>
##$AZFE= 0.1
##$AZFW= 0.1
##$BCFW= 0
##$BC_mod= 0
##$BYTORDP= 0
##$COROFFS= 0
##$CY= 15
##$DATMOD= 1
##$DC= 0
##$DFILT= <>
##$DTYPP= 0
##$F1P= 0
##$F2P= 0
##$FCOR= 0.5
##$FTSIZE= 131072
##$FT_mod= 6
##$GAMMA= 0
##$GB= 0
##$INTBC= 1
##$INTSCL= 1
##$ISEN= 128
##$LB= 0.3
##$LEV0= 0
##$LPBIN= 0
##$MAXI= 10000
##$MC2= 0
##$MEAN= 0
##$ME_mod= 0
##$MI= 0
##$NCOEF= 0
##$NC_proc= -2
##$NLEV= 6
##$NOISF1= 0
##$NOISF2= 0
##$NSP= 0
##$NTH_PI= 0
##$NZP= 0
##$OFFSET= 14.9611
##$PC= 1
##$PHC0= -0.9887695
##$PHC1= 0
##$PH_mod= 1
##$PKNL= yes
##$PPARMOD= 0
##$PPDIAG= 0
##$PPIPTYP= 0
##$PPMPNUM= 2147483647
##$PPRESOL= 1
##$PSCAL= 4
##$PSIGN= 0
##$PYNMP= <proc.py>
##$REVERSE= no
##$SF= 400.020009598501
##$SI= 131072
##$SIGF1= 0
##$SIGF2= 0
##$SINO= 400
##$SIOLD= 131072
##$SPECTYP= <>
##$SREGLST= <1H.CDCl3>
##$SSB= 0
##$STSI= 131072
##$STSR= 0
##$SW_p= 8223.68421052631
##$SYMM= 0
##$S_DEV= 0
##$TDeff= 65536
##$TDoff= 0
##$TI= <>
##$TILT= no
##$TM1= 0
##$TM2= 0
##$TOPLEV= 0
##$USERP1= <user>
##$USERP2= <user>
##$USERP3= <user>
##$USERP4= <user>
##$USERP5= <user>
##$WDW= 1
##$XDIM= 131072
##$YMAX_p= 334463003
##$YMIN_p= -13291
##$CURPLOT= <Network HP LaserJet P1505>
##$CURPRIN= <$Network HP LaserJet P1505>
##$DFORMAT= <normdp>
##$LAYOUT= <+/1D_H.xwp>
##$LFORMAT= <normlp>
##$PFORMAT= <normpl>
##$SURQMSG= 1
$$ End of Bruker specific parameters
$$ ---------------------------------
##NTUPLES= NMR SPECTRUM
##VAR_NAME=  FREQUENCY,     SPECTRUM/REAL,   SPECTRUM/IMAG
##SYMBOL=    X,             R,               I
##VAR_TYPE=  INDEPENDENT,   DEPENDENT,       DEPENDENT
##VAR_FORM=  AFFN,          ASDF,            ASDF
##VAR_DIM=   131072,        131072,          131072
##UNITS=     HZ,            ARBITRARY UNITS, ARBITRARY UNITS
##FACTOR=    0.0627417313425164, 1,          1
##FIRST=     8223.62146879497, 3349,         -51989
##LAST=      0,             3756,            -51438
##MIN=       0,             -13291,          0
##MAX=       8223.62146879497, 334463003,    0
$$ Real data points
##PAGE= N=1
##DATA TABLE= (X++(R..R)), XYDATA
$$ [...]
63873C50627l156k287j147M07K087L278L750M100N130O793Q270R202J0272J2170
63859D09496J4551J6582J8121J9597K0964K1756K2137K2937K4337K5391K5348
63848F41217K4696K4279K3973K2987K1160J9042J6926J4551J1893R481P561N475
63836H43241K317j918o267r788j2444j4901j7617k0339k2513k4035k5267k6422
63824F64047k7237k7386k6855k5703k3891k1679j9832j8846j8209j6997j5173
63813D22239j3657j3022j2825j2412j1798j1321j0947j0465r979r649r210q310
63801B88644p220o525o160n447m208l209l099l442l331k606j933j836k166k543
63787B34919k813k945k846k476j994j630j507j640j943k217k278k152j991j797
$$ y = [350627, 347471, 345184, 344037, 344444, 346531, 349809, 353559, 357659, 362789, 369582, 377852, 387054, 397326, 409496, 424047, 440629, 458750, 478347, 499311, 521067, 543204, 566141, 590478, 615869, 641217, 665913, 690192, 714165, 737152, 758312, 777354, 794280, 808831, 820724, 830205, 837766, 843241, 845558, 843640, 837373, 827585, 815141, 800240, 782623, 762284, 739771, 715736, 690469, 664047, 636810, 609424, 582569, 556866, 532975, 511296, 491464, 472618, 454409, 437412, 422239, 408582, 395560, 382735, 370323, 358525, 347204, 336257, 325792, 315813, 306164, 296954, 288644, 281424, 274899, 268739, 263292, 259084, 255875, 252776, 249334, 246003, 243397, 241464, 239628, 237462, 234919, 232106, 229161, 226315, 223839, 221845, 220215, 218708, 217068, 215125, 212908, 210630, 208478, 206487, 204690]
63773B04690j414q05j82K70N28N70K80l15q75j019o76j37K08J57j11j10M06R77
63755B02442P98k77j412j662r57N8Q02J142J209J222J329J342Q73Km84L3J146
63738B07606J891J890J499J077Q16J142K375L912M590M139L537L560L803L658
63724B45495L532M179N325N874N384M622M539N246O141O599O443N970N570N173
63710C20092M227K409J65j697k781l257l522m026n026o112o317n175l420k105
63696B83455j459j191j385k063k273r18J432K798K254R78L99M55M48M82R50J412
63680B85774J195O93Q53J598J870J279O58Q43J705K631L231L391L253L337M097
63665C16408N221N877N756N340M980M415L402K158R20l44j462k007k139k802m503
$$ y = [204690, 203276, 202471, 202289, 202559, 203087, 203657, 203937, 203622, 202747, 201728, 201052, 200915, 201123, 201280, 201169, 201059, 201465, 202442, 203240, 202963, 201551, 199889, 198932, 198990, 199792, 200934, 202143, 203365, 204694, 206036, 206909, 206911, 206427, 206460, 207606, 209497, 211387, 212886, 213963, 214779, 215921, 218296, 222208, 226798, 230937, 234474, 238034, 241837, 245495, 249027, 253206, 258531, 264405, 269789, 274411, 278950, 284196, 290337, 296936, 303379, 309349, 314919, 320092, 324319, 326728, 326893, 325196, 322415, 319158, 315636, 311610, 306584, 300472, 294155, 288980, 285560, 283455, 281996, 280805, 279420, 277357, 275084, 274166, 275598, 278396, 280650, 281628, 282027, 282482, 282930, 283412, 284362, 285774, 286969, 287662, 288515, 290113, 291983, 293262, 293920, 294763, 296468, 299099, 302330, 305721, 308974, 312311, 316408, 321629, 327506, 333262, 338602, 343582, 347997, 351399, 353557, 354477, 354133, 352671, 350664, 348525, 345723, 341220]
63650C41220o416p376p284o852o398n691m733l820k937j828p29k05j49L06J557
63635B88665K879L423L242K949K808K750K958L694M677N262N343N547O263O990
63621C47450P058O699O863Q008R558J0753J1567J2475J3683J5074J6740J8930
63609D84858K1427K3537K4958K6235K7952K9837L1070L1284L0825L0138K9253
63598G91374K7891K5731K2586J8507J3689Q266K386l367q084j1369j3713j5592
63586H58305j6638j6362j5362j4923j5529j6613j7811j9386k1151k1898k0717
63575F61915j8186j5650j3708j2046j0314q489o627m879l618k901k030k08K365
63562E65624M599N766O077O063N945N823N997O751Q006R443J0796J2037J3381
$$ y = [341220, 334804, 327428, 320144, 313292, 306894, 301203, 296470, 292650, 289713, 287885, 287156, 286951, 286802, 287108, 288665, 291544, 294967, 298209, 301158, 303966, 306716, 309674, 313368, 318045, 323307, 328650, 334197, 340460, 347450, 354508, 361207, 368070, 376078, 385636, 396389, 407956, 420431, 434114, 449188, 465928, 484858, 506285, 529822, 554780, 581015, 608967, 638804, 669874, 701158, 731983, 762121, 791374, 819265, 844996, 867582, 886089, 899778, 908044, 910430, 907063, 898979, 887610, 873897, 858305, 841667, 825305, 809943, 795020, 779491, 762878, 745067, 725681, 704530, 682632, 661915, 643729, 628079, 614371, 602325, 592011, 583522, 576895, 572016, 568398, 565497, 563467, 563259, 565624, 570223, 575989, 582066, 588129, 594074, 599897, 605894, 612645, 620651, 630094, 640890, 652927, 666308]
63549F66308J5179J7610K0466K3323K5940K8382L0827L3421L6161L8667M0206
63538I76490M0295L9157L7153L3763K7700J8336O846m330j3032j8446k0990k1530
63526A101412k0758j9218j7691j7174j8131j9902k1332k2139k3271k5684k8997
63515H67115l1723l2723l2139l0813k9178k7054k4426k1870j9882j8116j5854
63504E83337j3210j1186j0355j0088r506q628p949p375o419n286m829n297n909
63491D77300n920n443m934m445l789l036k362j703r84l95j17P4O04J591K794L886
63475D53121M634M883M627M053L442L043K973K990K500J139o69k133l126m269
63461D77208n871p386q192q362q207p609o356m842l807l506l566l515l061k060
$$ y = [666308, 681487, 699097, 719563, 742886, 768826, 797208, 828035, 861456, 897617, 936284, 976490, 1016785, 1055942, 1093095, 1126858, 1154558, 1172894, 1179740, 1175410, 1162378, 1143932, 1122942, 1101412, 1080654, 1061436, 1043745, 1026571, 1008440, 988538, 967206, 945067, 921796, 896112, 867115, 835392, 802669, 770530, 739717, 710539, 683485, 659059, 637189, 617307, 599191, 583337, 570127, 558941, 548586, 538498, 528992, 520364, 512415, 505040, 498621, 493335, 488506, 483209, 477300, 471380, 465937, 461003, 456558, 452769, 449733, 447371, 445668, 444684, 444289, 444172, 444246, 444850, 446441, 449235, 453121, 457755, 462638, 467265, 471318, 474760, 477803, 480776, 483766, 486266, 487405, 486736, 484603, 481477, 477208, 471337, 463951, 455759, 447397, 439190, 431581, 425225, 420383, 416576, 413070, 409504, 405989, 402928, 400868]
63447D00868o67N55J111J149J215J616K333L432N096P256R493J1391J2772J3777
63433D71397J4912J6797J9530K2477K5023K7283K9684L2055L3684L4012L2749
63422G59603K9509K4174J7687J1815P869O100O353Q579J2400J6827K0950K4601
63410I46467K7898L0427L1334L0198K7440K3883J9944J5242R069J470o222j2305
63398A144845j6247j8847k0832k1951k1834k1180k1262k2500k4190k5697k7197
63387I03108k8927l0300l0352k8912k6778k4633k2293j9334j6136j3648j2147
63376F49648j0749q507n554k822q56O04K053L662N278O621P520Q198R263J1079
63362F75438J3326J5511J7716K0267K2844K4697K5765K6927K8833L1103L2969
$$ y = [400868, 400201, 400756, 401867, 403016, 404231, 405847, 408180, 411612, 416708, 423964, 433457, 444848, 457620, 471397, 486309, 503106, 522636, 545113, 570136, 597419, 627103, 659158, 692842, 726854, 759603, 789112, 813286, 830973, 842788, 850657, 856757, 863110, 871689, 884089, 900916, 921866, 946467, 974365, 1004792, 1036126, 1066324, 1093764, 1117647, 1137591, 1152833, 1161902, 1163372, 1157150, 1144845, 1128598, 1109751, 1088919, 1066968, 1045134, 1023954, 1002692, 980192, 956002, 930305, 903108, 874181, 843881, 813529, 784617, 757839, 733206, 710913, 691579, 675443, 661795, 649648, 638899, 630392, 624838, 622016, 621160, 621764, 623817, 627479, 632757, 639378, 646898, 655096, 664359, 675438, 688764, 704275, 721991, 742258, 765102, 789799, 815564, 842491, 871324, 902427, 935396]
63351I35396L4129L4671L4672L4208L3322L1622K8399K3531J7763J1783N496j239
63339A223753p740j3071j7062k0043k1951k2536k2286k2264k2984k4178k5608
63328A004030k7333k9046l0018l0055k9744k9382k8267k5675k2006j8389j5335
63317G18780j2488r568o927m963l455j937o11o07l082q031j4027j9219k2469k3574
63303E87822k2750k0362j7181j4317j2549j1786j1370j0805j0037r173q276p478
63291D31738p049p099p281o968n916m700m222m729n446n421m538l491k837k498
63277C59543k229k160k604l460m143m123l385k382j606j216j053r59j055j552
63263C27616k289k645k140j133o15j161k195k626k133j429j146r45k04P91J091
$$ y = [935396, 969525, 1004196, 1038868, 1073076, 1106398, 1138020, 1166419, 1189950, 1207713, 1219496, 1224992, 1223753, 1216013, 1202942, 1185880, 1165837, 1143886, 1121350, 1099064, 1076800, 1053816, 1029638, 1004030, 976697, 947651, 917633, 887578, 857834, 828452, 800185, 774510, 752504, 734115, 718780, 706292, 696724, 689797, 684834, 681379, 679442, 678831, 678224, 675142, 667111, 653084, 633865, 611396, 587822, 565072, 544710, 527529, 513212, 500663, 488877, 477507, 466702, 456665, 447492, 439216, 431738, 424689, 417590, 410309, 403341, 397425, 392725, 388503, 383774, 378328, 372907, 368369, 364878, 362041, 359543, 357314, 355154, 352550, 349090, 344947, 340824, 337439, 335057, 333451, 332235, 331182, 330223, 329168, 327616, 325327, 322682, 320542, 319409, 318794, 317633, 315438, 312812, 310679, 309250, 308104, 307159, 306955, 307746, 308837]
63248C08837M56k79m53m06o56r02n65J18L55k3m49n99p30r77j013o77k97j79j97
63229C01364j53j27j48J3M60R22J107J015P40L31N2K88R56J418J365J252J502
63212C12357J757J485R13P77J279J940K346K481K461K430K661L209L590L283K528
63197C45497K003J872J812J930K766M216N290N502N641O598P972Q643Q378Q071
63183D16191Q527R706J1096J2202J2626J2341J2021J2500J3666J4410J3963J2788
63171E62037J1790J1140J0367R221P880O382M574K587R04k02r58j740k765m174
63157F17043n966p787r252j0604j2507j4918j6721j6985j6085j5018j4061j2823
63145D64316j1423j0585j0474j0262r184p450n787m581l825l462l319l064k534
$$ y = [308837, 309293, 309014, 308561, 308155, 307499, 306597, 306032, 306150, 306505, 306482, 306033, 305434, 304704, 303727, 302714, 302037, 301740, 301561, 301364, 301211, 301084, 300936, 300949, 301409, 302331, 303438, 304453, 305193, 305524, 305576, 305864, 306820, 308238, 309603, 310855, 312357, 314114, 315599, 316512, 317289, 318568, 320508, 322854, 325335, 327796, 330226, 332887, 336096, 339686, 342969, 345497, 347500, 349372, 351184, 353114, 355880, 360096, 365386, 370888, 376529, 383127, 391099, 399742, 408120, 416191, 424718, 434424, 445520, 457722, 470348, 482689, 494710, 507210, 520876, 535286, 549249, 562037, 573827, 584967, 595334, 604555, 612435, 618817, 623391, 625978, 626882, 626680, 625722, 623982, 621217, 617043, 611077, 603290, 594038, 583434, 570927, 556009, 539288, 522303, 506218, 491200, 477139, 464316, 452893, 442308, 431834, 421572, 412388, 404938, 399151, 394570, 390745, 387283, 383964, 380900, 378366]
63132C78366j873j160l04N41J010J222J811K776L116K354J720K745M984O428O124
63117D09860N223N140N790O192N944N436N105N104N364N560N333M840M707N126
63103D84724N542N504N288N231N098M712M629N360O382O767O540O504O928P358
63089E66567P681Q304R101R141P935O178M733L492J756o94l424n856p525q208
63075E99181q292q661r708j0711j0711r816r021q890q980q651p863p055o567o335
63061D77920n964n025l513j981r96m80J53J211K403L334M026M753N591O300O574
63046D94306O392O126O233O721P108P108P177P929R101R615Q831P326O196N904
63032E96073O012N860N187M208L283K518J679O06l99r23j122j612k587l471l720
$$ y = [378366, 376493, 375333, 375029, 375570, 376580, 377802, 379613, 382389, 385505, 387859, 389579, 392324, 397308, 403736, 409860, 415083, 420223, 426013, 432205, 438149, 443585, 448690, 453794, 459158, 464718, 470051, 474891, 479598, 484724, 490266, 495770, 501058, 506289, 511387, 516099, 520728, 526088, 532470, 539237, 545777, 552281, 559209, 566567, 574248, 582552, 591653, 600794, 608729, 614907, 619640, 623132, 624888, 624194, 620770, 614914, 607389, 599181, 590889, 582228, 572520, 561809, 551098, 541282, 532261, 523371, 514391, 505740, 497877, 490822, 484255, 477920, 471956, 466931, 463418, 461437, 460441, 459961, 460114, 461325, 463728, 467062, 471088, 475841, 481432, 487732, 494306, 500698, 506824, 513057, 519778, 526886, 533994, 541171, 549100, 558201, 567816, 576647, 583973, 590169, 596073, 602085, 607945, 613132, 617340, 620623, 623141, 624820, 625426, 625027, 624104, 622982, 621370, 618783, 615312, 611592]
63017F11592l516l369l391l387l298l166k860k303j687j036J73K388N167P612
63003E98919R460J1129J2787J4131J5185J6462J8053J9305J9787J9907K0066J9818
62991G95009J8622J6959J5952J5972J6296J6063J5064J3574J2008J0724R712Q364
62979I64319O030K842m22l355o317r647j3020j5905j8255k0402k2449k4188k5408
62966H13823k6048k6103k5697k5070k4290k3074k1189j8884j6709j4929j3500
62955E78330j2466j1950j1765j1472j0990j0686j0648j0343r473q764r227j0727
62943D49819j1919j1755j0503r085p965p098o476o153n920n489m875m203l340
62930C55038k257j538j856k878l458l097k464k209j999j381q29j082j753j632
$$ y = [611592, 608076, 604707, 601316, 597929, 594631, 591465, 588605, 586302, 584615, 583579, 583752, 586140, 591307, 598919, 608379, 619508, 632295, 646426, 661611, 678073, 696126, 715431, 735218, 755125, 775191, 795009, 813631, 830590, 846542, 862514, 878810, 894873, 909937, 923511, 935519, 946243, 955955, 964319, 970349, 973191, 972769, 969414, 963097, 953450, 940430, 924525, 906270, 885868, 863419, 839231, 813823, 787775, 761672, 735975, 710905, 686615, 663541, 642352, 623468, 606759, 591830, 578330, 565864, 553914, 542149, 530677, 519687, 509001, 498353, 488010, 478537, 469773, 460546, 449819, 437900, 426145, 415642, 406557, 398592, 391494, 385018, 378865, 372945, 367456, 362581, 358378, 355038, 352781, 351243, 349387, 346509, 343051, 339954, 337490, 335281, 333282, 331901, 331072, 329990, 328237, 326605]
62916C26605l77R29J109J75r38j424j098k91M30O36M16K24L31O66J196J993K801
62899C33383K998K366J577J608K745M414N798O427O376O123O124O362O487O392
62885C99180O320O278N802M634L231K245J727J278P02K1q85k096l249l944m445
62870D16799n337o482p051o750o235o064n932n450n043n323o007o156n372m137
62856C35460l033k282j997k215k527k269j377n29j84PM91R85R33M74K67M91O48
62839C23343M08J2k59m38m46P0J009J441O76n81q23M12J999K654K290J630J038
62822C34435L60l46n86j24N64Q02N08K17K86L81j11j224k216k381j890j568j897
62805C25210k469k556j931j030m90o13j098j180l56R32J527Q43l46p47m7P93P59
$$ y = [326605, 326228, 327157, 328266, 328441, 327503, 326079, 324981, 324690, 325120, 325756, 326172, 326396, 326727, 327393, 328589, 330582, 333383, 336381, 338747, 340324, 341932, 344677, 349091, 354889, 361316, 367692, 373815, 379939, 386301, 392788, 399180, 405500, 411778, 417580, 422214, 425445, 427690, 429417, 430695, 431397, 431418, 430533, 428437, 425188, 421244, 416799, 411462, 404980, 397929, 391179, 384944, 378880, 372948, 367498, 362455, 357132, 351125, 344969, 339597, 335460, 332427, 330145, 328148, 325933, 323406, 321137, 319760, 319231, 319047, 319054, 319545, 320530, 321463, 321937, 322204, 322695, 323343, 323751, 323763, 323504, 323066, 322620, 322690, 323699, 325140, 325816, 325235, 324412, 324824, 326823, 329477, 331767, 333397, 334435, 334795, 334449, 333863, 333739, 334303, 335105, 335613, 335830, 336116, 336497, 336386, 335162, 332946, 330565, 328675, 327107, 325210, 322741, 320185, 318254, 317224, 316734, 316121, 315023, 313843, 313487, 314419, 315946, 316789, 316443, 315696, 315649, 316442, 317201]
62788C17201j58j138j467j039k25N04R10J166J691K698L847M449M163L473L365
62773C39440M286N503N793M853L710L531M299M995M765L546J789J30p78o80j54
62758C85028j51r16j820k310k566k959l363l465l434l737m397m847m585l717k828
62743C39933k492k824l391l642l493l299l181k713j601l42K10j44p91j078r03
62728C10249n49l46n00q81r23j05J343K517K842K607K368K197J905J720K138L117
62712C29699L949M193M365N311P049Q696R575J0012J0844J2373J4215J5975J7669
62699D53925J9374K0907K2082K3130K4501K6338K8318L0003L1184L1883L2198
62688G43843L2171L1762L0920K9613K7723K5008K1342J6936J2065O607L15o378
$$ y = [317201, 317043, 315905, 314438, 313399, 313174, 313678, 314588, 315754, 317445, 320143, 323990, 328439, 332602, 336075, 339440, 343726, 349229, 355022, 359875, 363585, 367116, 371415, 376410, 381175, 384721, 386510, 386640, 385862, 385182, 385028, 384877, 383961, 382141, 379831, 377265, 374306, 370943, 367478, 364044, 360307, 355910, 351063, 346478, 342761, 339933, 337441, 334617, 331226, 327584, 324091, 320792, 317611, 314898, 313297, 312955, 313165, 313021, 312230, 311152, 310249, 309700, 309354, 308854, 307973, 307050, 306945, 308288, 310805, 313647, 316254, 318622, 320819, 322724, 324444, 326582, 329699, 333648, 337841, 342206, 347517, 354566, 363262, 372837, 382849, 393693, 406066, 420281, 436256, 453925, 473299, 494206, 516288, 539418, 563919, 590257, 618575, 648578, 679762, 711645, 743843, 776014, 807776, 838696, 868309, 896032, 921040, 942382, 959318, 971383, 977990, 978305, 971927]
62676I71927j2354j6993k0941k5136k9380l2528l3991l4369l4487l4463l3955
62665F63330l2791l0996k8625k5977k3711k2198k0942j9060j6373j3707j1961
62654D16989j1156j0518r384p842o449n500m808m150l658l560l754l899l833l578
62640C34900l074k300j557j225j180r36m00l1m1J5N44J202J345Q55J25n80j286
62623C26376j978k522k911l231l385l115k356j399o73m47o42q80p98m48j66k1
62607C01404K72P60R96O53R0r1K40P96J290J421Q71j62p46k76N95Q04M41N44J406
62588C11308K138K132J890K002K164J872J372J174J177R54N85M32L59j63j222
62573C28174k275k737k392j417l96j18q15j761k086j831j701j934k045j634q87
$$ y = [971927, 959573, 942580, 921639, 896503, 867123, 834595, 800604, 766235, 731748, 697285, 663330, 630539, 599543, 570918, 544941, 521230, 499032, 478090, 459030, 442657, 428950, 416989, 405833, 395315, 385931, 378089, 371640, 366140, 361332, 357182, 353524, 349964, 346210, 342311, 338478, 334900, 331826, 329526, 327969, 326744, 325564, 324628, 324228, 324197, 324156, 324171, 324715, 325917, 327262, 328117, 328242, 327662, 326376, 324398, 321876, 318965, 315734, 312349, 309234, 306878, 305479, 304806, 304359, 303717, 302837, 302039, 301591, 301425, 301404, 301676, 302436, 303432, 304085, 304175, 304084, 304324, 305120, 306410, 307831, 308702, 308540, 307794, 307518, 308113, 308917, 309358, 309902, 311308, 313446, 315578, 317468, 319470, 321634, 323506, 324878, 326052, 327229, 328183, 328768, 329200, 329559, 329396, 328174, 325899, 323162, 320770, 319353, 318957, 318839, 318024, 316263, 314177, 312346, 310645, 308711, 306666, 305032, 304145]
62558C04145j96K12J99j93n38m30j59m71j426k104j728o22L23P13P44O39M83N28
62540C00119J061J934K540K417J747J186J236J832K443K623K370J974J614J289
62526C26385J036R93J252J863K903M293N613O492P137Q052R257J0276J0948J1681
62512D08181J2717J3756J4638J5772J7443J9151K0204K0575K0632K0406J9776
62501F03251J8981J8263J7184J5087J2161R304O940M715K346P8j899l653m923
62488F97835n032l808j981k66J434L548O077Q765J1546J4337J6744J8519J9921
62475G87639K1262K2269K2461K1767K0328J7906J4083Q955L116k864q588j3632
62463I14702j7808k1512k5292k9063l2161l4105l4947l4988l4561l3972l3196
$$ y = [304145, 303949, 304161, 304360, 304167, 303629, 303199, 303040, 302569, 301143, 299039, 297311, 296689, 297012, 297725, 298469, 299108, 299591, 300119, 301180, 303114, 305654, 308071, 309818, 311004, 312240, 314072, 316515, 319138, 321508, 323482, 325096, 326385, 327421, 328414, 329666, 331529, 334432, 338725, 344338, 350830, 357967, 366019, 375276, 385552, 396500, 408181, 420898, 434654, 449292, 465064, 482507, 501658, 521862, 542437, 563069, 583475, 603251, 622232, 640495, 657679, 672766, 684927, 694231, 701171, 705886, 708232, 708310, 706411, 702758, 697835, 692803, 688995, 687014, 686748, 688182, 691730, 697807, 706572, 718118, 732455, 749199, 767718, 787639, 808901, 831170, 853631, 875398, 895726, 913632, 927715, 936670, 939786, 936922, 928334, 914702, 896894, 875382, 850090, 821027, 788866, 754761, 719814, 684826, 650265, 616293, 583097]
62452E83097l1744k9353k6541k3954k1378j8205j4695j1906j0263r084p758o448
62440C71768n344m133k740j760j566j644j436j200j389j780j997k244k699k791
62426C39045k019j101j097j724j727p99Q4K99K98L75N3p89j218n75L61M17l62
62409C29521r81r52n87j54L99R13J034P72N59O46R31J365K022K649K698K006J187
62392C44028J062J898L209M216M413L906L242K927L130L845M989O209O928O973
62378D00975O934P471Q440R206R629J0212J1222J2303J3112J3835J4759J5829
62366E33927J6899J8154J9910K2222K4956K8028L1267L4252L6735L9130M2239
62355H47719M6384N0995N5137N8244O0312O1473O1525N9961N6494N1426M5222
$$ y = [583097, 551353, 522000, 495459, 471505, 450127, 431922, 417227, 405321, 395058, 385974, 378216, 371768, 366424, 362291, 359551, 357791, 356225, 354581, 353145, 351945, 350556, 348776, 346779, 344535, 341836, 339045, 337026, 335925, 334828, 333104, 331377, 330578, 330662, 330961, 331259, 331634, 331687, 330898, 329680, 329105, 329466, 329883, 329521, 328540, 327588, 327001, 326847, 327246, 328159, 329193, 329965, 330524, 331170, 332101, 333466, 335488, 338137, 340835, 342841, 344028, 345090, 346988, 350197, 354413, 358826, 362732, 365974, 368901, 372031, 375876, 380865, 387074, 394002, 400975, 407909, 415380, 423820, 433026, 442655, 452867, 464089, 476392, 489504, 503339, 518098, 533927, 550826, 568980, 588890, 611112, 636068, 664096, 695363, 729615, 766350, 805480, 847719, 894103, 945098, 1000235, 1058479, 1118791, 1180264, 1241789, 1301750, 1358244, 1409670, 1454892]
62344A454892L7805K8635J7721O206m436j3582k1523k8524l4405l9115m3090m6639
62332A313945m9351n0620n0563m9870m8779m6804m3749m0383l7609l5348l2894
62321H27975l0210k8062k6718k5367k3385k1455k0693k0939k0885j9743j8029
62310E72489j6495j5183j3877j2756j2020j1334j0241q878p695o739n754m798
62298D46719m119l508k434r26L15Q72J099J379J476J115P82J213K229K834K604
62283D51650K328K903M051M732M611M455M972N890O518O753O995P340P548P754
62269E28500Q531J0023J1645J2950J4365J6557J9479K2584K5667K8892L2151L5138
62257G66482L8027M1408M5351M9216N2603N5828N9020O1379O1951O0792N8611
$$ y = [1454892, 1492697, 1521332, 1539053, 1545259, 1540823, 1527241, 1505718, 1477194, 1442789, 1403674, 1360584, 1313945, 1264594, 1213974, 1163411, 1113541, 1064762, 1017958, 974209, 933826, 896217, 860869, 827975, 797765, 769703, 742985, 717618, 694233, 672778, 652085, 631146, 610261, 590518, 572489, 555994, 540811, 526934, 514178, 502158, 490824, 480583, 471705, 464010, 457271, 451517, 446719, 442600, 439092, 436658, 435732, 436047, 436919, 438018, 439397, 440873, 441988, 442770, 443983, 446212, 449046, 451650, 453978, 456881, 460932, 465664, 470275, 474730, 479702, 485592, 492110, 498863, 505858, 513198, 520746, 528500, 537031, 547054, 558699, 571649, 586014, 602571, 622050, 644634, 670301, 699193, 731344, 766482, 804509, 845917, 891268, 940484, 993087, 1048915, 1107935, 1169314, 1231265, 1292057, 1350668]
62246A350668N5394N0150M2176L2003K0754R113k678j4062k4078l2222l9013m5354
62234A402851n1367n6126n8701n9216n8706n7931n6690n4338n0734m6456m2176
62223H10410l8177l4388l0696k7052k3483k0161j7420j5524j4368j3460j2276
62212E63405j0663q924p510o649o204n849n329m617l853l168k628k289k208k212
62198D91302j776m58J421K931L569L908M865O593Q439R843J0737J1162J1162J1154
62184E74852J1754J2913J3769J3733J3233J2947J2749J2123J1245J0884J1186
62173G11388J1356J0807J0085J0296J1889J4354J6966J9582K2594K6226L0082
62162H95625L3526L6467L9301M1967M3563M3407M1929L9815L6536L0712K2097
$$ y = [1350668, 1406062, 1456212, 1498388, 1530391, 1551145, 1560258, 1557580, 1543518, 1519440, 1487218, 1448205, 1402851, 1351484, 1295358, 1236657, 1177441, 1118735, 1060804, 1004114, 949776, 899042, 852586, 810410, 772233, 737845, 707149, 680097, 656614, 636453, 619033, 603509, 589141, 575681, 563405, 552742, 543818, 536308, 529659, 523455, 517606, 512277, 507660, 503807, 500639, 498011, 495722, 493514, 491302, 489526, 489068, 490489, 493420, 496989, 500897, 505762, 512355, 520794, 530637, 541374, 552536, 563698, 574852, 586606, 599519, 613288, 627021, 640254, 653201, 665950, 678073, 689318, 700202, 711388, 722744, 733551, 743636, 753932, 765821, 780175, 797141, 816723, 839317, 865543, 895625, 929151, 965618, 1004919, 1046886, 1090449, 1133856, 1175785, 1215600, 1252136, 1282848, 1304945]
62151A304945J2240K841n733j3817k1091k6727l0534l3182l5401l7500l9529m1274
62139A035238m2142m1620l9917l7732l5334l2379k8718k4867k1391j8318j5462
62128F97358j2994j1183r773q152o178m426l361k539j044J349L787N341O107O923
62114F61215Q177R395J0121J0710J1811J3386J4729J5372J5554J5723J5953J5903
62102H18049J5164J3563J1201Q286M870R55l001n981p201o907n979m899l606k343
62088H32171j952k897m480n453n169l789j569J557N589J0007J3917J6734J8709
62075H73375K0633K2969K5400K7435K9111L0742L2096L2593L2308L2030L2033
62064A190725L1579L0214K8831K8588K9226K9429K8659K7652K6998K6130K3971
$$ y = [1304945, 1317185, 1320026, 1314293, 1300476, 1279385, 1252658, 1222124, 1188942, 1153541, 1116041, 1076512, 1035238, 993096, 951476, 911559, 873827, 838493, 806114, 777396, 752529, 731138, 712820, 697358, 684364, 673181, 663408, 655256, 649078, 644652, 641291, 638752, 637708, 639057, 642844, 648185, 654292, 661215, 669392, 678787, 688908, 699618, 711429, 724815, 739544, 754916, 770470, 786193, 802146, 818049, 833213, 846776, 857977, 866263, 871133, 872088, 869087, 863106, 855905, 848998, 843019, 838120, 834514, 832171, 830219, 827322, 822842, 817389, 812220, 808431, 806862, 808419, 814008, 824015, 837932, 854666, 873375, 894008, 916977, 942377, 969812, 998923, 1029665, 1061761, 1094354, 1126662, 1158692, 1190725, 1222304, 1252518, 1281349, 1309937, 1339163, 1368592, 1397251, 1424903, 1451901, 1478031, 1502002]
62053A502002J9932J4015O617j399q952j5548k1451k6882l1506l5062l7899m0457
62041A323410m2581m3894m4485m4721m4615m3894m2494m0483l7767l4400l0999
62030H73077k8252k6103k3938k1499j9047j6765j4643j2891j1769j0957r810q393
62018F69010p533p657q231q619q811q921q755q365q303q740q921q218p097o231
62004E54608n207l147k95K132L562M523N465O176O520O724O666N879M592L829
61990F02027L843L429J442j623m382o233p553q716r827j1052j2362j3144j2870
61977E22979j1993j1460j1435j1164j0116q478o641m850l391k484j950j552j553
61964D35912k255l084l036k044j028m36K73J425K446K910L334M236N236N850O487
$$ y = [1502002, 1521934, 1535949, 1542566, 1541167, 1532215, 1516667, 1495216, 1468334, 1436828, 1401766, 1363867, 1323410, 1280829, 1236935, 1192450, 1147729, 1103114, 1059220, 1016726, 976243, 938476, 904076, 873077, 844825, 818722, 794784, 773285, 754238, 737473, 722830, 709939, 698170, 687213, 677403, 669010, 661477, 653820, 645589, 636970, 628159, 619238, 610483, 602118, 593815, 585075, 576154, 567936, 560839, 554608, 549401, 546254, 545959, 548091, 551653, 556176, 561641, 567817, 574337, 581061, 587727, 593606, 598198, 602027, 605870, 609299, 610741, 609118, 604736, 598503, 590950, 582234, 572407, 561355, 548993, 535849, 522979, 510986, 499526, 488091, 476927, 466811, 458333, 451692, 446842, 443451, 440967, 439017, 437465, 435912, 433657, 430573, 427537, 425493, 424465, 424029, 424302, 425727, 428173, 431083, 434417, 438653, 443889, 449739, 456226]
61949D56226P714R163J0098J0673J1606J2958J4281J5832J8468K2231K6026K8996
61937F44272L1286L3217L4569L5237L5805L6794L7778L7841L6707L4858L2786
61926A031150L0573K8128K5357K2069J8031J3245Q098L185j051m636p955j1153
61914A155041j3724j5014j5017j4219j2619r532m685R88O176J0468J4365J8134
61902A120362K1250K2985K3165K2166K0328J7425J2799O197j503q755j4700j9746
61890A221973k4522k8761l1682l3160l3836l4160l3998l3233l2127l0887k9413
61879H76194k7671k5923k4368k2963k1790k1106k0766k0072j8554j6604j4854
61868F41523j3282j1405r089o602l967r38K389N484Q104J0604J3367J6324J9279
$$ y = [456226, 463940, 473103, 483201, 493874, 505480, 518438, 532719, 548551, 567019, 589250, 615276, 644272, 675558, 708775, 743344, 778581, 814386, 851180, 888958, 926799, 963506, 998364, 1031150, 1061723, 1089851, 1115208, 1137277, 1155308, 1168553, 1176651, 1179836, 1178785, 1174149, 1166194, 1155041, 1141317, 1126303, 1111286, 1097067, 1084448, 1074916, 1070231, 1071219, 1077395, 1087863, 1102228, 1120362, 1141612, 1164597, 1187762, 1209928, 1230256, 1247681, 1260480, 1266677, 1265174, 1256419, 1241719, 1221973, 1197451, 1168690, 1137008, 1103848, 1070012, 1035852, 1001854, 968621, 936494, 905607, 876194, 848523, 822600, 798232, 775269, 753479, 732373, 711607, 691535, 672981, 656377, 641523, 628241, 616836, 607747, 601145, 597178, 596240, 598629, 604113, 612217, 622821, 636188, 652512, 671791]
61855F71791K2323K5607K9070L2726L6930M1881M6992N1284N4392N6788N8935
61844A128719O0645O1419O0989N9265N6009N1078M4835L7941L0639K2617J3714
61833A627870M543l868j0912j6600k0931k3346k3139k0320j5827j0757n549l8
61821A481126N800J1410J5894J8432J8504J6019J1463N632j074q938j8200k8182
61809A527886l7580m5602n2331n7829o1378o2157o0377n7261n3911n0570m7027
61798I41863m3296l9646l6244l2981k9633k6118k2715j9996j8307j7306j6263
61787F39358j4869j3420j2119j0705r115p980p826q067p620o466n784o227o899
61774E22261o578n376m403m120l867k993j673m60M01R07J034R21R38J201J315
$$ y = [671791, 694114, 719721, 748791, 781517, 818447, 860328, 907320, 958604, 1012996, 1069784, 1128719, 1189364, 1250783, 1311772, 1371037, 1427046, 1478124, 1522959, 1560900, 1591539, 1614156, 1627870, 1632413, 1628545, 1617633, 1601033, 1580102, 1556756, 1533617, 1513297, 1497470, 1486713, 1481164, 1481126, 1486926, 1498336, 1514230, 1532662, 1551166, 1567185, 1578648, 1584280, 1583206, 1574268, 1556068, 1527886, 1490306, 1444704, 1392373, 1334544, 1273166, 1211009, 1150632, 1093371, 1039460, 988890, 941863, 898567, 858921, 822677, 789696, 760063, 733945, 711230, 691234, 672927, 655621, 639358, 624489, 611069, 598950, 588245, 579130, 571150, 563324, 555257, 547637, 541171, 535387, 529160, 522261, 515683, 510307, 505904, 501784, 497917, 494924, 493251, 492791, 493192, 494099, 495133, 496054, 496992, 498193, 499508]
61759D99508R57M90N50J147J641J622J412J506J860J997J682J235J102J321J487
61744E19517J234O06p5n84q88r61p41l10J56O59J380K181K424J625J93q08p24
61727E24884J45J072J737K313K983L620L998M115M191M365M539M525M238L702
61713E70427L041K553K575K937K827J611k16j436j574j403j765k531l107l470
61699E70469m012m745n281n458n337m815l907l219l398m074m181l440k755k896
61685E12951l527l920l946l908l947m036m184m201l695k634j516o37K03R33Q84
61670D74820j18j063r89l74l42q59r01k35K10q9m64k15L55O35O71Q10J007J087
61652D73946J275J784K273K261J913J864K407L359M535N774O591O428N474M697
$$ y = [499508, 500465, 500955, 501505, 502652, 504293, 505915, 507327, 508833, 510693, 512690, 514372, 515607, 516709, 518030, 519517, 520751, 521357, 521282, 520698, 519810, 518849, 518108, 517798, 517954, 518613, 519993, 522174, 524598, 526223, 526416, 525608, 524884, 525029, 526101, 527838, 530151, 533134, 536754, 540752, 544867, 549058, 553423, 557962, 562487, 566725, 570427, 573468, 576021, 578596, 581533, 584360, 585971, 585755, 584319, 582745, 581342, 579577, 577046, 573939, 570469, 566457, 561712, 556431, 550973, 545636, 540821, 536914, 533695, 530297, 526223, 522042, 518602, 515847, 512951, 509424, 505504, 501558, 497650, 493703, 489667, 485483, 481282, 477587, 474953, 473437, 472800, 473003, 473936, 474820, 474702, 473639, 472650, 472276, 471934, 471075, 470174, 469939, 470149, 470060, 469596, 469381, 469736, 470371, 471042, 471852, 472859, 473946, 475221, 477005, 479278, 481539, 483452, 485316, 487723, 491082, 495617, 501391, 507982, 514410, 519884, 524581]
61638E24581M788N353N469M732L542K466J724J194N52o58k701n107o698o601n248
61623E27388l992l667l914l964l646l302l093k857k467j955j399j030j250k159
61609D88693l255m002m518n206n889o028n748n844o633p474p692p314o540n279
61595D07271l760k965l620n076n901n491m424l434k736k388k568l183l713l741
61581C54271l399l041k801k683k849l394l958l899k983j783j140j283j611j455
61567C17992q72n45q79j520j830j584j063n93k74q6o7k88o79r56q06k80J43P2
61549C05885k48k20L14Q68R92Q01P26J018J643K368K720K336J520J162J709K522
61533C26116K620J853R68O84J069J691K059J983J685J514J379Q16k47j235j708
$$ y = [524581, 529369, 534722, 540191, 544923, 548465, 550931, 552655, 553849, 554401, 553743, 551042, 545935, 539237, 532636, 527388, 523396, 519729, 515815, 511851, 508205, 504903, 501810, 498953, 496486, 494531, 493132, 492102, 490852, 488693, 485438, 481436, 476918, 471712, 465823, 459795, 454047, 448203, 441570, 434096, 426404, 419090, 412550, 407271, 403511, 400546, 396926, 391850, 385949, 380458, 376034, 372600, 369864, 367476, 364908, 361725, 358012, 354271, 350872, 347831, 345030, 342347, 339498, 336104, 332146, 328247, 325264, 323481, 322341, 321058, 319447, 317992, 317120, 316575, 315696, 314176, 312346, 310762, 309699, 309106, 308832, 308746, 308679, 308391, 307712, 306756, 305950, 305670, 305813, 305885, 305637, 305417, 305731, 306599, 307591, 308392, 309118, 310136, 311779, 314147, 316867, 319203, 320723, 321885, 323594, 326116, 328736, 330589, 331557, 332241, 333310, 335001, 337060, 339043, 340728, 342242, 343621, 344437, 344190, 342955, 341247]
61518C41247k000k585l242l454l281l150k958k225j046k16j68m30k85L90J128
61503C17725J309O61l99r73o92k53m95j170j379j032q49r98q19k04q3q99j617
61486C07833j082K59R69N40k36n44l73l4L71P53P92K24p35j350r17M56J679J675
61468C10280O59q4J78P84P47J18l18j60L56Q68J055N54n61j501j544r62n52m14
61450C09503P3J104J990K045J344M60r2j3O91J611K229K445K514K588K645K813
61434C33950L261L738L797L484L318L504L670L564L412L422L401L169K864K610
61420C81164K301J997K070K561K856K459J764J542J947K516K959L300L262K267
61406D14965K98j687k675k729k801l535m586n221n180m716m033l228k666k875
$$ y = [341247, 339247, 336662, 333420, 329966, 326685, 323535, 320577, 318352, 317306, 317090, 316922, 316492, 316207, 316597, 317725, 319034, 319695, 319296, 318323, 317631, 317378, 316883, 315713, 314334, 313302, 312453, 311455, 310636, 310432, 310349, 309450, 307833, 306751, 307010, 307979, 308519, 308283, 307739, 307366, 307332, 307703, 308456, 309248, 309472, 308737, 307387, 306470, 306926, 308605, 310280, 310939, 310855, 311033, 311817, 312564, 312682, 312364, 312204, 312560, 313428, 314483, 315037, 314476, 312975, 311431, 310469, 309917, 309503, 309576, 310680, 312670, 314715, 316059, 316519, 316427, 316414, 317105, 318716, 320945, 323390, 325904, 328492, 331137, 333950, 337211, 340949, 344746, 348230, 351548, 355052, 358722, 362286, 365698, 369120, 372521, 375690, 378554, 381164, 383465, 385462, 387532, 390093, 392949, 395408, 397172, 398714, 400661, 403177, 406136, 409436, 412698, 414965, 415263, 413576, 410901, 408172, 405371, 401836, 397250, 392029, 386849, 382133, 378100, 374872, 372206, 369331]
61392C69331l747m338l848k519j234m83j48n3m7K22R56J652J551P11jq7J13K26
61374C58257L87O40O30L54N02J409K255K117J335R41J089J022N22L46R73J808
61358C74587K093K014K317L158L954M281M479N178O480P773Q445Q630R037J0056
61344D52482J1291J2204J2860J3658J4518J4913J4699J4341J4082J3396J1626
61333F00070Q968O344M436L169K133J163K79p24k194m090n803o770p153p553q071
61318E84204q102p283o227n877o283o493n714m197k821k123j915j707j280q09
61304E23373n50n01m01k1O86J670K771L574L687L329L286L873M293L550J761j05
61288E54275j617l196m935o040n963n311n005m985m566l688k893k197r06J167
$$ y = [369331, 365584, 361246, 357398, 354879, 353645, 353162, 353014, 352961, 352914, 353136, 354092, 355744, 357295, 358006, 358005, 357918, 358031, 358257, 358644, 359284, 359914, 360268, 360770, 362179, 364434, 366551, 367886, 368827, 369916, 370938, 371460, 371806, 372779, 374587, 376680, 378694, 381011, 384169, 388123, 392404, 396883, 402061, 408541, 416314, 424759, 433389, 442426, 452482, 463773, 475977, 488837, 502495, 517013, 531926, 546625, 560966, 575048, 588444, 600070, 609038, 615382, 619818, 622987, 625120, 626283, 626562, 625838, 623644, 619554, 613751, 606981, 599828, 592275, 584204, 576102, 568819, 562592, 556715, 550432, 543939, 538225, 534028, 531207, 529084, 527169, 525462, 524182, 523373, 522823, 522322, 521921, 521900, 522586, 524256, 527027, 530601, 534288, 537617, 540903, 544776, 549069, 552619, 554380, 554275, 552658, 549462, 544527, 538487, 532524, 527213, 522208, 517223, 512657, 508969, 506076, 503879, 502973, 504140]
61274E04140L147M168M443M776N409O005O498P294Q581R972J1006J1587J1825
61261E98851J1745J1455J1320J1636J2221J2643J2827J3246J4365J6037J7504
61250G43850J8071J7744J7174J6835J6357J4787J1630P389L016r90m761q468j1806
61237H40828j4149j5156j5237j5341j6002j6568j5784j3315j0322q230p273o688
61225F86763n924n022m067l107k527k703l158k862j601k93L65O98J093J067P7
61210F58799j376k348k746l149l620l661l237k950k991k726j643j60Q65J121J097
61195F31275J508K662M234N640O746Q040R960J2309J4671J7041J9533K1733K3000
61182G78352K3308K3104K2455K0973J8708J6317J4190J2085R951Q438Q110Q576
$$ y = [504140, 507287, 511455, 515898, 520674, 526083, 532088, 538586, 545880, 554461, 564433, 575439, 587026, 598851, 610596, 622051, 633371, 645007, 657228, 669871, 682698, 695944, 710309, 726346, 743850, 761921, 779665, 796839, 813674, 830031, 844818, 856448, 863837, 866853, 865863, 861102, 852634, 840828, 826679, 811523, 796286, 780945, 764943, 748375, 732591, 719276, 708954, 700724, 693451, 686763, 680839, 675817, 671750, 668643, 666116, 663413, 660255, 657393, 655792, 655499, 655864, 656562, 657655, 658722, 658799, 657423, 655075, 652329, 649180, 645560, 641899, 638662, 635712, 632721, 629995, 628352, 628192, 629057, 630178, 631275, 632783, 635445, 639679, 645319, 652065, 660105, 670065, 682374, 697045, 714086, 733619, 755352, 778352, 801660, 824764, 847219, 868192, 886900, 903217, 917407, 929492, 939443, 947881, 955991, 964567]
61170I64567Q844Q271O847M881K754P72j047k938n028p180r235j1109j2648j3720
61156I34031j4559j5563j6675j7395j7480j7161j6564j5500j4069j2798j1806
61145G64461j0415q130n568l800l096k870k575k082j383o01l39j417l981p073
61131G11131r258r660q519o840n489m599l813k912j827k44K222N309Q162J0275
61117F83938J1907J3399J4714J5918J7452J9482K1440K2773K3586K4187K4543
61106H93339K4712K5137K5868K6089K5213K3953K3348K3185K2346K0426J7976
61095A151592J5351J2374R115N946K701j177n550r532j2832j6159j9916k3358
61083A108555k5572k6530k6691k6204k5124k3864k2842k2013k1142k0218j9242
$$ y = [964567, 973411, 981682, 988529, 993410, 996164, 996936, 995889, 992951, 987923, 980743, 971508, 960399, 947751, 934031, 919472, 903909, 887234, 869839, 852359, 835198, 818634, 803134, 789065, 776267, 764461, 754046, 745916, 740348, 736548, 733452, 730582, 728007, 725925, 724542, 723941, 723602, 722185, 718204, 711131, 701873, 692213, 683694, 676854, 671365, 666766, 662953, 660041, 658214, 657970, 660192, 665501, 673663, 683938, 695845, 709244, 723958, 739876, 757328, 776810, 798250, 821023, 844609, 868796, 893339, 918051, 943188, 969056, 995145, 1020358, 1044311, 1067659, 1090844, 1113190, 1133616, 1151592, 1166943, 1179317, 1188432, 1194378, 1197079, 1195902, 1190352, 1180820, 1167988, 1151829, 1131913, 1108555, 1082983, 1056453, 1029762, 1003558, 978434, 954570, 931728, 909715, 888573, 868355, 849113]
61072H49113j7981j6375j4846j3759j2917j1883j0525q900o999n009l545l016
61060G23358k972k510j270L09J618K416K824L155L787M927O414P835Q901R678
61046G68470J0449J1434J2615J3868J5237J6937J8931K0761K2074K3137K4448
61035I58361K6028K7547K9023L0743L2541L3846L4616L5488L6734L7772L8166
61024A320865L8475L9494M1167M2930M4771M7077M9669N1790N3284N5047N8047
61013A842616O2350O7388P2739P8198Q3486Q8643R4742J03624J16520J33337J53829
61002B897472J79185K11683K52767L02096L58812M23167M97025N84138O90660
60993F397005Q23859R87460J176796J379348J582012J779778J977662K181711
$$ y = [849113, 831132, 814757, 799911, 786152, 773235, 761352, 750827, 741927, 734928, 729919, 726374, 723358, 720386, 717876, 716606, 716915, 718533, 720949, 723773, 726928, 730715, 735642, 742056, 749891, 758792, 768470, 778919, 790353, 802968, 816836, 832073, 849010, 867941, 888702, 910776, 933913, 958361, 984389, 1011936, 1040959, 1071702, 1104243, 1138089, 1172705, 1208193, 1244927, 1282699, 1320865, 1359340, 1398834, 1440001, 1482931, 1527702, 1574779, 1624448, 1676238, 1729522, 1784569, 1842616, 1904966, 1972354, 2045093, 2123291, 2206777, 2295420, 2390162, 2493786, 2610306, 2743643, 2897472, 3076657, 3288340, 3541107, 3843203, 4202015, 4625182, 5122207, 5706345, 6397005, 7220864, 8208324, 9385120, 10764468, 12346480, 14126258, 16103920, 18285631]
60985A8285631K385465K567674K709680K813843K888882K900221K741842K291598
60977C9584836J528305O00139k41029p92482j003212r50420p52772n28801m15687
60968C7028877n65251j063888j839537k665576l282694l540481l447811l117665
60960A7505974k679779k229876j822833j481903j207646r88438q11924o70103
60952E613472n56911m65933l92085l33131k87739k53259k26328k04371j85643
60943B708072j68742j53061j38934j26580j15363j04554r4228q4959p7284p1789
60933A572578o8997o8509o8761o8138o6025o2584n8055n2733m7170m1951l7470
60922I32185l4030l1660k9770k7537k4837k2255k0006j7673j5210j3395j2762
$$ y = [18285631, 20671096, 23238770, 25948450, 28762293, 31651175, 34551396, 37293238, 39584836, 41113141, 41713280, 41472251, 40679769, 39676557, 38726137, 37973365, 37444564, 37028877, 36463626, 35399738, 33560201, 30894625, 27611931, 24071450, 20623639, 17505974, 14826195, 12596319, 10773486, 9291583, 8083937, 7095499, 6283575, 5613472, 5056561, 4590628, 4198543, 3865412, 3577673, 3324414, 3098086, 2893715, 2708072, 2539330, 2386269, 2247335, 2120755, 2005392, 1900838, 1806610, 1721651, 1644367, 1572578, 1503581, 1435072, 1366311, 1298173, 1232148, 1169564, 1111509, 1058776, 1011606, 969655, 932185, 898155, 866495, 836725, 809188, 784351, 762096, 742090, 724417, 709207, 695812, 683050]
60911F83050j2714j2268j1125r586p899o277n034m209l460k663k120j855j367
60898F02473n28m6l74q25n81k9j93j175k099k438k510k735l161l786m632n497
60882E71864o169o814p678q480q671q252p759p511p435p546p954q369q273p648
60868D63305o944o306n426m294l403k978k585j839r39j74N76J503K382K987L623
60853D39488M730O103P025P193P098P366P992Q479Q493Q122P480O451N045L747
60839E34812L116L025K815K263J851J765J193p06l475n639o273n717m836m198
60825E19996l972m012l873l242k524k493l306m337n127n801o417o583o221o026
60811D56062o573p399p649p240o728o268n553m697m364m779n226m850l633k285
$$ y = [683050, 670336, 658068, 646943, 637357, 629458, 623181, 618147, 613938, 610478, 607815, 605695, 603840, 602473, 601945, 601899, 601525, 600700, 600119, 600090, 599897, 598722, 596623, 594185, 591675, 588940, 585779, 581993, 577361, 571864, 565695, 558881, 551203, 542723, 534052, 525800, 518041, 510530, 503095, 495549, 487595, 479226, 470953, 463305, 456361, 450055, 444629, 440335, 436932, 433954, 431369, 429530, 428591, 428417, 428993, 430496, 432878, 435865, 439488, 444218, 450321, 457346, 464539, 471637, 479003, 486995, 495474, 503967, 512089, 519569, 526020, 531065, 534812, 537928, 540953, 543768, 546031, 547882, 549647, 550840, 550134, 546659, 541020, 534747, 529030, 524194, 519996, 516024, 512012, 508139, 504897, 502373, 499880, 496574, 492237, 487110, 481309, 474892, 468309, 462088, 456062, 449489, 442090, 434441, 427201, 420473, 414205, 408652, 403955, 399591, 394812, 389586, 384736, 381103, 378818]
60797C78818j499j492k012k545k652k254j539o67J93O35L79j13J26J383K793L361
60781C72915L091K609K215J948K247L516N055N421M297L137L375M631N430N260
60767D25147M956N284O033O653P020P231P192O748N957M982L990L207K786K481
60753D99667J892J111P00Q43R69N21l16r92j306j380j330j345j799k774l744m207
60737D86510m403m870n525n824n706n656n809n691n033m262l829l556k971k006
60723D21369r87k06L35Q56J655K856M147N013N337N537O037O880P973R330J0827
60708D86959J2046J2697J2989J3371J4025J4888J5912J7011J7883J8226J8079
60697F54086J7692J7229J6792J6526J6371J5863J4675J3182J2045J1185R758P284
$$ y = [378818, 377319, 375827, 373815, 371270, 368618, 366364, 364825, 364158, 364351, 364986, 365365, 365252, 365378, 366761, 369554, 372915, 376006, 378615, 380830, 382778, 385025, 388541, 393596, 399017, 403314, 406451, 409826, 414457, 419887, 425147, 430103, 435387, 441420, 448073, 455093, 462324, 469516, 476264, 482221, 487203, 491193, 494400, 497186, 499667, 501559, 502670, 503370, 504213, 505182, 505703, 505387, 504395, 503089, 501709, 500379, 499034, 497235, 494461, 490717, 486510, 482107, 477237, 471712, 465888, 460182, 454526, 448717, 443026, 437993, 433731, 429902, 426346, 423375, 421369, 420382, 420176, 420511, 421367, 423022, 425878, 430025, 435038, 440375, 445912, 451949, 458829, 466802, 476132, 486959, 499005, 511702, 524691, 538062, 552087, 566975, 582887, 599898, 617781, 636007, 654086, 671778, 689007, 705799, 722325, 738696, 754559, 769234, 782416, 794461, 805646, 815404, 822688]
60685H22688M255J380j325m205p163r717j1706j3391j4901j6067j6849j7405j7670
60672F97924j7402j6813j6664j7271j7878j7537j6326j5128j4296j3268j1600
60661E23741r770q590q242q254q197p997p719p319o659n617m284l007k121j507
60647D34458p16L26J082J156R70J237J940K376K170J689J312Q19k3p01l83Q91
60631D48603J963J845R59O70J611K936L411K918K375K403K627K392J633P40l0
60616D77056o20r29r99j280k248l707m849n060m456l631l111l085l304l218k465
60601D34094j329n26m29p37r78j103j329j608j605j190p01n28o24o66o29q83j548
60584D17681k038j656n16N34R38R40R78J072J137J470K444L907N262O097O461
$$ y = [822688, 826943, 828323, 826998, 822793, 815630, 805913, 794207, 780816, 765915, 749848, 732999, 715594, 697924, 680522, 663709, 647045, 629774, 611896, 594359, 578033, 562905, 548609, 535341, 523741, 513971, 505381, 497139, 488885, 480688, 472691, 464972, 457653, 450994, 445377, 441093, 438086, 435965, 434458, 433742, 434068, 435150, 436306, 437276, 438513, 440453, 442829, 444999, 446688, 448000, 448819, 448796, 448095, 447712, 448603, 450566, 452411, 453370, 454040, 455651, 458587, 461998, 464916, 467291, 469694, 472321, 474713, 476346, 477086, 477056, 476436, 475507, 474508, 473228, 470980, 467273, 462424, 457364, 452908, 449277, 446166, 443081, 439777, 436559, 434094, 432765, 432239, 431810, 431073, 430095, 428992, 427663, 426055, 424450, 423260, 422559, 422031, 421407, 420741, 420112, 419229, 417681, 415643, 413987, 413471, 414005, 414943, 415883, 416861, 417933, 419070, 420540, 422984, 426891, 432153, 438250, 444711]
60569D44711O707P320Q687J0708J2801J4572J6241J8047J9585K0321K0527K0986
60557F21213K1867K2446K2007K0338J7315J2707O768M86n158r823j3492j5897
60545G00777j6625j5566j2990r374n300j250K757P030J1649J6204K0231K3594
60533G21137K6304K8333K9766L0792L1287L0763K8911K5870K1757J6408R867K862
60521A004057l739r537j4318j7514j8571j7816j6256j4538j2503j0008p619o175
60509H55463n876o075n867m677k364Q97M652Q279J1343J3966J6755K0255K4560
60496I31311K9514L5032M1049M7382N3914O0793O8047P5052Q0791Q4683Q6779
60485A594347Q6994Q4645P9002P0082N8566M5119L0136J4102k074j7286l0850
$$ y = [444711, 451418, 458738, 467425, 478133, 490934, 505506, 521747, 539794, 559379, 579700, 600227, 621213, 643080, 665526, 687533, 707871, 725186, 737893, 744661, 745147, 739989, 730166, 716674, 700777, 684152, 668586, 655596, 646222, 640922, 639672, 642429, 649459, 661108, 677312, 697543, 721137, 747441, 775774, 805540, 836332, 867619, 898382, 927293, 953163, 974920, 991328, 1001195, 1004057, 1000318, 990781, 976463, 958949, 940378, 922562, 906306, 891768, 879265, 869257, 861638, 855463, 849587, 843512, 837645, 832968, 830604, 831501, 836153, 844432, 855775, 869741, 886496, 906751, 931311, 960825, 995857, 1036906, 1084288, 1138202, 1198995, 1267042, 1342094, 1422885, 1507568, 1594347, 1681341, 1765986, 1844988, 1915070, 1973636, 2018755, 2048891, 2062993, 2060919, 2043633, 2012783]
60474B012783m2873n3868o3970p2816q0229q6545r1806r5060r5139r2017q6765
60463A151695q0294p2861o4831n6997m9894m3490l7816l3175k9384k5604k1496
60452F35853j7869j5582j4355j3258j1931j0620r471q400p437o644n900n265n107
60439E04014n437n488m662l390k440j779r23m7K65J25K00M97K78o95j774k492
60423D76252l179m124m926n142m964m787m544l915k910j864j116q77j089j260
60409D31555q02K21J094J328J152Q87L72m43r02k55J147K044J773J007P49J018
60393D41945J111Q73J052K080L150L103J985J041J167K006K727L028L026K783
60379D71077K409K111J731P69o33j334n48R39J783J840J955K394K628K606K959
$$ y = [2012783, 1969910, 1916042, 1852072, 1779256, 1699027, 1612482, 1520676, 1425616, 1330477, 1238460, 1151695, 1071401, 998540, 933709, 876712, 826818, 783328, 745512, 712337, 682953, 657349, 635853, 617984, 602402, 588047, 574789, 562858, 552238, 542767, 534367, 526930, 520286, 514386, 509121, 504014, 498577, 493089, 488427, 485037, 482597, 480818, 479895, 479848, 480113, 480238, 480438, 480935, 481213, 480518, 478744, 476252, 473073, 468949, 464023, 458881, 453917, 449130, 444586, 440671, 437761, 435897, 434781, 433904, 432815, 431555, 430753, 430974, 432068, 433396, 434548, 435435, 435807, 435364, 434462, 434207, 435354, 437398, 439171, 440178, 440927, 441945, 443056, 443929, 444981, 447061, 450211, 453314, 455299, 456340, 457507, 459513, 462240, 465268, 468294, 471077, 473486, 475597, 477328, 478097, 477464, 476130, 475582, 476521, 478304, 480144, 482099, 484493, 487121, 489727, 492686]
60364D92686L767M265M142M082M569N139N325N482N936O112N315L863K619J872
60350E55174J353J065J286J964K753L579M591N676O591P581R261J1716J4122J5468
60336F42180J5490J4811J4161J3484J1916Q834M801J058j941m912q406j1732j3724
60323F86020j4198j3946j3512j2674j1120r095p136n555m354l418k600j703n10
60310E86199J095L004M882O549Q315J0715J3695J6421J8179J9289K0760K3050
60298G32153K5518K7227K8044K8622K9142K8420K4725J7644Q693k38q633j7015
60286I24302k5158l1493l4343l3226k8937k3032j7323j3016r978p356n129m347
60274F90964n597q081j0663j3028j5229j6806j7239j6731j5752j4188j1811r268
$$ y = [492686, 496453, 500718, 504860, 508942, 513511, 518650, 523975, 529457, 535393, 541505, 546820, 550683, 553302, 555174, 556527, 557592, 558878, 560842, 563595, 567174, 571765, 577441, 584032, 591613, 600874, 612590, 626712, 642180, 657670, 672481, 686642, 700126, 712042, 720876, 725677, 726735, 724794, 719882, 711476, 699744, 686020, 671822, 657876, 644364, 631690, 620570, 611475, 604339, 598784, 594430, 591012, 588412, 586709, 586199, 587294, 590298, 595180, 601729, 610044, 620759, 634454, 650875, 669054, 688343, 709103, 732153, 757671, 784898, 812942, 841564, 870706, 899126, 923851, 941495, 950188, 949950, 941317, 924302, 899144, 867651, 833308, 800082, 771145, 748113, 730790, 717774, 707796, 700440, 695311, 690964, 685367, 677286, 666623, 653595, 638366, 621560, 604321, 587590, 571838, 557650, 545839, 536571]
60262E36571p644p148o972o411n478m440l456k722k367k168j803j357j119j060
60248D82426r80j019j385j754j588j056q72j239j540j300p37k91m9J34L85Q46
60232D69981J550K258K729L096L563L928L980M123M835N592N233L625K092J866
60218E18451K751L639L718K875J560O22P13J476J916J712J514J590J227K6j025
60203E42765p79M17J264J328J293J586J772J420P28J67K9M81J468K395K500J682
60187E60516O17n2k67k50j42l3J9J45M52O41K91m12p89o60o44j152j663j493q37
60168E54287m72o18p06j68R46K110K719K467J767J670K819M490N297M879M294
60153E85781M412M661L892K063L06m88m40j23J22J19k21o09l86P48K271L457M247
$$ y = [536571, 528927, 521779, 514807, 508396, 502918, 498478, 495022, 492300, 489933, 487765, 485962, 484605, 483486, 482426, 481446, 480427, 479042, 477288, 475700, 474644, 473772, 472533, 470993, 469693, 468956, 468665, 468616, 468750, 469135, 469981, 471531, 473789, 476518, 479614, 483177, 487105, 491085, 495208, 500043, 505635, 510868, 514493, 516585, 518451, 521202, 524841, 528559, 531434, 532994, 533616, 534329, 535805, 537721, 539433, 540947, 542537, 543764, 543790, 542765, 541986, 542403, 543667, 544995, 546288, 547874, 549646, 551066, 551794, 551961, 551990, 552471, 553939, 556334, 558834, 560516, 561133, 561081, 560814, 560564, 560422, 560389, 560408, 560553, 561005, 561646, 561937, 561525, 560736, 560076, 559432, 558280, 556617, 555124, 554287, 553815, 553197, 552491, 552323, 553269, 555379, 558098, 560565, 562332, 564002, 566821, 571311, 576608, 581487, 585781, 590193, 594854, 598746, 600809, 601115, 600627, 600187, 600064, 600186, 600305, 600084, 599475, 599089, 599837, 602108, 605565, 609812]
60136F09812N124O277P286P645P340O795O440O352O193N382L577J081j278k801
60122F75225l587m450o015p869q847q302o789n288m109l001k063j715j716j114
60108F10360M31J974K502K297K377K983L451L445L488M087M981N557N690N788
60094F59411O216O794O913O172M860L630K693J648L03q43j278j181r80o25M8O64
60078F94445P14L81J35k84j580l556n085n551n557n878o550p294q079q813r137
60063F28311r022q936q973q450o928n123m100l986m127m211m471m918n044m473
60049E45549l605l385m410o136p070o119l782j631n29n3M05P75R93J532K576L357
60033E18467L202K663K659K973K674J726J053J056J023L19p59j545j822j842k044
$$ y = [609812, 614936, 621213, 628499, 636144, 643484, 650279, 656719, 663071, 669264, 674646, 678223, 679304, 678026, 675225, 671638, 667188, 661173, 653304, 644457, 636155, 629366, 624078, 619969, 616968, 614905, 613190, 611474, 610360, 610791, 612765, 615267, 617564, 619941, 622924, 626375, 629820, 633308, 637395, 642376, 647933, 653623, 659411, 665627, 672421, 679334, 685506, 690366, 693996, 696689, 698337, 698640, 697797, 696519, 695338, 694358, 693733, 693781, 694445, 695159, 695540, 695675, 695391, 693811, 690255, 685170, 679619, 674062, 668184, 661634, 654340, 646261, 637448, 628311, 619289, 610353, 601380, 592930, 586002, 580879, 576779, 572793, 568666, 564455, 559984, 555066, 550022, 545549, 541944, 538559, 534149, 528013, 520943, 514824, 511042, 509411, 508882, 508829, 509234, 510009, 511002, 512534, 515110, 518467, 521669, 524332, 526991, 529964, 532638, 534364, 535417, 536473, 537496, 537815, 537056, 535511, 533689, 531847, 529803]
60018E29803k847m148n104m995m300m112m486m310l099j841j496j569r93K04J046
60003D87753J108Q40N69K1q81j446q74P70K522L431L388L147L485M348M915M564
59987E17660L530K514J849J392R91O70L95M7l05m35l84n47j092j605j581j186
59971E21913j154j902l026l773l767l147k213j205l77O1J42J34K56N11Q33J201
59955E04487J524J623J414J034P11N55M64J63n63j425j592n72Q83J321L01r54
59939E09374j064j38N56K42o92j481j786j661j351j233j541k018k208k097k072
59924D90830k199k065j390l97N99J518K243K471K069J311N66L2j13L13J107J680
59908D98575J739J618J692J808J663J380J238J080N43k05n07l4Q36J539J873J936
$$ y = [529803, 526956, 522808, 517704, 512709, 508409, 504297, 499811, 495501, 492402, 490561, 489065, 487496, 486503, 486707, 487753, 488861, 489701, 490270, 490291, 489410, 487964, 487090, 487860, 490382, 493813, 497201, 500348, 503833, 508181, 513096, 517660, 521190, 523704, 525553, 526945, 527936, 528606, 529001, 529048, 528743, 528308, 527924, 527377, 526285, 524680, 523099, 521913, 520759, 518857, 515831, 512058, 508291, 505144, 502931, 501726, 501349, 501410, 501552, 501686, 501942, 502453, 503286, 504487, 506011, 507634, 509048, 510082, 510793, 511348, 511812, 511975, 511412, 509987, 508395, 507823, 508706, 510027, 510328, 509374, 508310, 508172, 508728, 508970, 508278, 506797, 505011, 503350, 501999, 500766, 499225, 497207, 494999, 492902, 490830, 488631, 486566, 485176, 484779, 485378, 486896, 489139, 491610, 493679, 494990, 495556, 495588, 495475, 495788, 496895, 498575, 500314, 501932, 503624, 505432, 507095, 508475, 509713, 510793, 511336, 511131, 510624, 510590, 511426, 512965, 514838, 516774]
59892E16774J841J717J858K558L799N130N911N812N109M477M354M574M676M459
59878E73049M132L963L933L745L082J930P00J8K25J069J875J999J147m97k340
59863E98030l683m193m097l897l910m044l930l225k016j025j114k333l624l784
59849E53155k689j318n45k98N5Q24J806K795L909N297O786P987Q800R558J0651
59834F06773J2010J3133J3666J3757J3689J3191J1457Q007L544l09k344k715k517
59821G01342k537k830l490n271q907j3921j8597k1336k1767k0529j8396j5862
59809E47899j3380j1490j0471j0005r303p750n456l187j649r61q54j158j825k557
59795D67853k880k708k486k597k875k901k589k219k052k074k086j882j417r13
$$ y = [516774, 518615, 520332, 522190, 524748, 528547, 533677, 539588, 545400, 550509, 554986, 559340, 563914, 568590, 573049, 577181, 581144, 585077, 588822, 591904, 593834, 594534, 594552, 594777, 595846, 597721, 599720, 600867, 600370, 598030, 594347, 590154, 586057, 582160, 578250, 574206, 570276, 567051, 565035, 564010, 562896, 560563, 556939, 553155, 550466, 549148, 548603, 548305, 548360, 549184, 550990, 553785, 557694, 562991, 569777, 577764, 586564, 596122, 606773, 618783, 631916, 645582, 659339, 673028, 686219, 697676, 705683, 709227, 708918, 706574, 703859, 701342, 698805, 695975, 692485, 687214, 678307, 664386, 645789, 624453, 602686, 582157, 563761, 547899, 534519, 523029, 512558, 502553, 493250, 485500, 480044, 476857, 475208, 474247, 473393, 472235, 470410, 467853, 464973, 462265, 459779, 457182, 454307, 451406, 448817, 446598, 444546, 442472, 440386, 438504, 437087, 436174]
59781D36174o83p70q91q20o46n42n01m42m48o53j021j415j801k169k418k456k323
59764D16175k025j392l57P31J354J413J331J554K031K292J980J375J195J781K548
59749D31986K674K314K533L694M643M058K238P51M87Q53R62P28N11M01L05K62
59733D59400K23j37r00j556j526r29l99k83l73l23k7L63N19J61n41r45o60j19
59715D51948l8m46o99m25J31P77J740L066M170M464M114L721L431K972K421K332
59699D83679K920L673M011L959L832L594K999K215J805K035K485K502J888J026
59685E22623M42K26j25j205k852l997l674k140o35m1j47l24m11o54j113j560j837
59668E02576j982k079k157k222k180j949j777k157l135l910l581k169n19O66J268
$$ y = [436174, 435491, 434721, 433830, 433010, 432364, 431822, 431321, 430879, 430431, 429778, 428757, 427342, 425541, 423372, 420954, 418498, 416175, 414150, 412758, 412401, 413132, 414486, 415899, 417230, 418784, 420815, 423107, 425087, 426462, 427657, 429438, 431986, 434660, 436974, 439507, 443201, 447844, 451902, 454140, 454891, 455378, 456231, 457193, 457921, 458432, 458833, 459138, 459400, 459623, 459486, 458586, 457030, 455504, 454575, 454176, 453893, 453520, 453197, 453170, 453533, 454052, 454213, 453672, 452727, 452067, 451948, 451910, 451464, 450765, 450340, 450471, 451248, 452988, 456054, 460224, 464688, 468802, 472523, 475954, 478926, 481347, 483679, 486599, 490272, 494283, 498242, 502074, 505668, 508667, 510882, 512687, 514722, 517207, 519709, 521597, 522623, 523065, 523291, 523166, 521961, 519109, 515112, 511438, 509298, 508663, 508622, 508475, 508151, 507740, 507086, 505973, 504413, 502576, 500594, 498515, 496358, 494136, 491956, 490007, 488230, 486073, 482938, 479028, 475447, 473278, 472759, 473425, 474693]
59653D74693J362J037O85R00J773K673L013K886K692K501K084J347M07n66j420
59638D96067k054k576l146l558l393k785k506k850k904j724J33J127P36M8J09
59623D70724N57M76r8k92K25P77O61Kn11m91j76o7l76p97q71n93n50j212k179
59604D65209k450j540l9J058J403J453J741K238K463J972O98r93k410k870k211
59589D65722j030k44k97q79j429j671j638j388j021p80q21r55r13q43j152j850
59573D48811k489k901l405m072m309l648k538j744j264o04J13J57n42j003m29
59558D20133P66J646J907J826J585J213R84J209J740K124K218K166J957J465R38
59543D43877R09J619K868M502O498Q534J0002J0708J1135J1759J2422J2694J2617
$$ y = [474693, 476055, 477092, 477777, 478677, 480450, 483123, 486136, 489022, 491714, 494215, 496299, 497646, 498053, 497487, 496067, 494013, 491437, 488291, 484733, 481340, 478555, 476049, 473199, 470295, 468571, 468704, 469831, 470567, 470615, 470724, 471281, 471757, 471659, 471367, 471592, 472369, 473030, 473032, 472521, 472030, 471854, 471787, 471411, 470614, 469743, 469150, 468600, 467388, 465209, 462759, 461219, 461180, 462238, 463641, 465094, 466835, 469073, 471536, 473508, 474206, 473213, 470803, 467933, 465722, 464692, 464448, 464151, 463272, 461843, 460172, 458534, 457146, 456125, 455345, 454524, 453569, 452656, 451813, 450661, 448811, 446322, 443421, 440016, 435944, 431635, 427987, 425449, 423705, 422441, 421837, 421950, 422107, 421565, 420562, 420133, 420899, 422545, 424452, 426278, 427863, 429076, 430060, 431269, 433009, 435133, 437351, 439517, 441474, 442939, 443877, 444786, 446405, 449273, 453775, 460273, 468807, 478809, 489517, 500652, 512411, 524833, 537527, 550144]
59530E50144J2738J3391J3978J3024R249L099k908n983n518l307j268L70K289
59517E99298M398N858O408O602O698O140M439J972m63k431l969n298o721q519
59503F14412j0560j2228j2928j2572j1427r797q121p038o899p244p203o442n402
59490D96551m572l905l086k121j291p26k81J85O36J048J492K013K583L283M298
59475D96107N596O700P050O590N801N226N056N123N016M265K706Q03o15j078q39
59460E53507m30k0O52J895L743N909P968R664J1117J2628J4205J5551J6530J7367
59446F70286J8204J8726J8498J7463J5823J3626J0760P139K641k907r184j5001
59434G66074j9012k0865k1259k0946k0124j8804j7158j5273j3034j0553q288o450
$$ y = [550144, 562882, 576273, 590251, 603275, 612524, 615623, 612715, 606732, 601214, 597907, 596639, 597009, 599298, 603696, 609554, 615962, 622564, 629262, 635402, 639841, 641813, 641350, 638919, 634950, 629652, 622931, 614412, 603852, 591624, 578696, 566124, 554697, 544900, 536779, 529741, 522842, 515598, 508395, 501953, 496551, 491979, 488074, 484988, 482867, 481576, 480850, 480569, 480754, 481390, 482438, 483930, 485943, 488526, 491809, 496107, 501703, 508403, 515453, 522043, 527844, 533070, 538126, 543249, 548265, 552530, 555236, 556039, 555424, 554346, 553507, 553077, 553057, 553709, 555604, 559347, 565256, 573224, 582888, 594005, 606633, 620838, 636389, 652919, 670286, 688490, 707216, 725714, 743177, 759000, 772626, 783386, 790525, 793166, 790259, 781075, 766074, 747062, 726197, 704938, 683992, 663868, 645064, 627906, 612633, 599599, 589046, 580758, 574308]
59422E74308m649k451N4K535M981P545J0173J2763J5429J8121K0216K1171K1405
59409G01601K1776K2117K1264J8818J6016J3970J1708P036o15r119j5641j8877
59397G90054j9175j7391j4431j1310q687o421m445l989o942j3555k1432k7286
59385F34990k9401k8145k4772k0439j6062j2244r152o738n042m027l288k372j282
59372D72026l38M03J098J596J540J045P48J004J503J814J867J776J588J556K155
59357D91381L443M738N325N328N522O425P875R366J0451J0976J1273J2054J3762
59344E97919J5977J7705J8331J8131J7889J8211J9122K0114K0470J9727J7928
59333H01524J5476J2764R968P097M125J121j777m511p204r954j2479j4221j4878
$$ y = [574308, 569659, 567208, 567262, 569797, 574778, 582323, 592496, 605259, 620688, 638809, 659025, 680196, 701601, 723377, 745494, 766758, 785576, 801592, 815562, 827270, 834306, 833691, 824572, 808931, 790054, 770879, 753488, 739057, 727747, 719060, 712639, 708194, 704205, 697263, 683708, 662276, 634990, 605589, 577444, 552672, 532233, 516171, 503927, 494775, 488037, 482995, 478968, 475680, 473308, 472026, 471688, 472091, 473189, 474785, 476325, 477370, 478118, 479122, 480625, 482439, 484306, 486082, 487670, 489226, 491381, 494824, 499562, 504887, 510215, 515737, 522162, 530037, 539403, 549854, 560830, 572103, 584157, 597919, 613896, 631601, 649932, 668063, 685952, 704163, 723285, 743399, 763869, 783596, 801524, 817000, 829764, 839732, 846829, 850954, 852075, 850298, 845787, 838583, 828629, 816150, 801929, 787051]
59320G87051j4784j4556j4514j4469j4036j3041j1751j0744j0396j0399j0002
59309F48359q799p192n965n518n563n492m961m159l436k736j658k60O94Q26J081
59294E95221K693N330P344Q055Q627J0159J2006J2954J3203J3962J5576J7201
59282G22331J8173J8652J8920J9085J9302J9308J7727J3042N540k635r553j4577
59270H45315j7228j6577j2747p935m479k479l65K443M708N100L754J798R5j254
59256H00149k691m758p565j0577j3160j5240j7045j8336j8497j7402j5686j3976
59244F45216j2387j0885r645q635p326n303k988j253l63L28J562L298M785N414
59230F01818N323N147N256N389N030M046K811J762R71J70r67k491m114n511o703
$$ y = [787051, 772267, 757711, 743197, 728728, 714692, 701651, 689900, 679156, 668760, 658361, 648359, 639560, 632368, 626403, 620885, 615322, 609830, 604869, 600710, 597274, 594538, 592880, 592620, 593314, 594140, 595221, 597914, 603244, 610588, 618643, 627270, 637429, 649435, 662389, 675592, 689554, 705130, 722331, 740504, 759156, 778076, 797161, 816463, 835771, 853498, 866540, 872080, 869445, 859892, 845315, 828087, 811510, 798763, 790828, 786349, 783870, 783505, 785948, 790656, 795756, 799510, 801308, 801403, 800149, 797458, 792700, 785135, 774558, 761398, 746158, 729113, 710777, 692280, 674878, 659192, 645216, 632829, 621944, 612299, 603664, 596338, 591035, 588047, 586794, 586431, 586759, 588321, 591619, 596404, 601818, 607141, 612288, 617544, 622933, 627963, 632009, 634820, 636582, 637553, 637723, 636756, 634265, 630151, 624640, 617937]
59215F17937q024r506j0509j0276q828p008n717n245n321n442n147m345l465k971
59201E26133k685k014r39k34m01q89q31j38O61J310J890K300K347K419L227M718
59185E36874N948O278O120O118O183N912N481N462N936O405O506O302N924N452
59171F20901N101N093N291N375N437N917O894P817Q193Q134Q055Q161Q398Q600
59157G17367Q450P612O123M441K951J656M63o33j856l670o118q457r906j0485
59143G07938j0689j0650j0194r484q907q320p125n270l622k973l042k824j734
59130F23104j33J134J527J275J203K035L733N548O775P361P858Q852J0441J2102
59116F92815J3138J3398J3447J3784J4203J4154J3652J3198J2904J2289J1143
$$ y = [617937, 609913, 600407, 589898, 579622, 570794, 563786, 558069, 552824, 547503, 542061, 536914, 532569, 529104, 526133, 523448, 521434, 520495, 520261, 519860, 518971, 518140, 518002, 518663, 519973, 521863, 524163, 526510, 528929, 532156, 536874, 542822, 549100, 555220, 561338, 567521, 573433, 578914, 584376, 590312, 596717, 603223, 609525, 615449, 620901, 626002, 631095, 636386, 641761, 647198, 653115, 660009, 667826, 676019, 684153, 692208, 700369, 708767, 717367, 725817, 733429, 739552, 743993, 746944, 748600, 749063, 748430, 746574, 742904, 736786, 728329, 718423, 707938, 697249, 686599, 676405, 666921, 658014, 649694, 642569, 637299, 633677, 630704, 627662, 624838, 623104, 622971, 624105, 625632, 626907, 628110, 630145, 633878, 639426, 646201, 653562, 661420, 670272, 680713, 692815, 705953, 719351, 732798, 746582, 760785, 774939, 788591, 801789, 814693, 826982, 838125]
59105H38125J0006R422R175Q677P786O776N743M567L363K501K052J558N43r59
59091I09335k501l754m779n763o543o645n955n183n261o308p589q590r619j1129
59077H19716j2882j4301j5303j6212j7024j7325j6960j6270j5489j4395j2816
59066F50739j1144r970r320q629p461o049n004m567m352l828k864j736q07l97
59052E74611q10k034l381l933l516k910k819k992k694j752o60K25J024J878K550
59037E52787K741K504K237K377L149M407N684O528O939P344Q157R350J0540J1377
59023F36121J1903J2500J3445J4522J5247J5448J5320J4934J4067J2769J1590
59012G87866J0881J0192Q872P007N220L699K027J0j859k864k666j405M02K099
$$ y = [838125, 848131, 857553, 866728, 875405, 883191, 889967, 895710, 900277, 903640, 906141, 908193, 909751, 910294, 909335, 906834, 903080, 898301, 892538, 885995, 879350, 873395, 868212, 862951, 856643, 849054, 840464, 830845, 819716, 806834, 792533, 777230, 761018, 743994, 726669, 709709, 693439, 677950, 663555, 650739, 639595, 629625, 620305, 611676, 604215, 598166, 593162, 588595, 584243, 580415, 577551, 575815, 575008, 574611, 573801, 571767, 568386, 564453, 560937, 558027, 555208, 552216, 549522, 547770, 547110, 547335, 548359, 550237, 552787, 555528, 558032, 560269, 562646, 565795, 570202, 575886, 582414, 589353, 596697, 604854, 614204, 624744, 636121, 648024, 660524, 673969, 688491, 703738, 719186, 734506, 749440, 763507, 776276, 787866, 798747, 808939, 817811, 824818, 830038, 833737, 835764, 835774, 833915, 831051, 828385, 826980, 827382, 829481]
58998H29481L356M395N409N953N478M337L480L073K226L33k009l933n469p206
58984H48904r177j0770j1567j1817j2127j2989j4393j5605j5577j3927j1360q883
58972G00712o872n194l789k544r87J242L689N435O171O421O738P236P898Q690
58958G34846R194Q728P174N241L598K103K40k074m529p014r557j1831j3280j3848
58944G08991j4073j4227j3800j2258j0020q137p026o083m686l057j845j241j018
58931F11520j138j742k693l642m550n562o360o307n457m706m576m475l715k750
58917E53847k579l181l380k303l70J325K133K162J928J910K289K920L623M446
58903E64770N555O940Q371R621J0588J1373J2304J3660J5145J6059J6248J6413
$$ y = [829481, 832837, 837232, 842641, 848594, 854072, 858409, 861889, 864962, 867188, 867521, 865512, 861579, 856110, 848904, 839727, 828957, 817390, 805573, 793446, 780457, 766064, 750459, 734882, 720955, 709595, 700712, 693840, 688646, 684857, 682313, 681326, 682568, 686257, 691692, 697863, 704284, 711022, 718258, 726156, 734846, 744040, 752768, 759942, 765183, 768781, 770884, 771124, 769050, 764521, 757507, 747950, 736119, 722839, 708991, 694918, 680691, 666891, 654633, 644613, 636476, 629450, 623367, 618681, 615624, 613779, 612538, 611520, 610382, 608640, 605947, 602305, 597755, 592193, 585833, 579526, 574069, 569363, 564787, 560312, 556597, 553847, 551268, 548087, 544707, 542404, 542034, 543359, 545492, 547654, 549582, 551492, 553781, 556701, 560324, 564770, 570325, 577265, 585636, 595257, 605845, 617218, 629522, 643182, 658327, 674386, 690634, 707047]
58891G07047J7076J7685J7398J6445J5849J6073J6774J7771J9258K0927K1914
58880I04217K1869K1229K0106J7844J4117R641N173N96m322r041j2901j6066j8996
58867I53466k1474k3036k3891k4467k4382k2934k0548j8653j7985j7878j7374
58856G20844j6311j5089j4084j3502j3309j3135j2667j2124j1815j1352j0103
58845E77353q337p049o549o124n350m645m174l316j908r92j419k505l025k869
58831E19091k656k286j257m2J94o05j175p76j47j82o45q48p73q26r35p03j46L49
58813E05632O30Q96J274J664J946K049J918J636J471J572J723J641J299Q34K65
58798E26450m13j050j415j434j209r23p65p74p02l54pj04l84L8J434K886L505
$$ y = [707047, 724123, 741808, 759206, 775651, 791500, 807573, 824347, 842118, 861376, 882303, 904217, 926086, 947315, 967421, 985265, 999382, 1009023, 1014196, 1014792, 1010470, 1001429, 988528, 972462, 953466, 931992, 908956, 885065, 860598, 836216, 813282, 792734, 774081, 756096, 738218, 720844, 704533, 689444, 675360, 661858, 648549, 635414, 622747, 610623, 598808, 587456, 577353, 569016, 561967, 555418, 549294, 543944, 539299, 535125, 531809, 529901, 528909, 527490, 524985, 521960, 519091, 516435, 514149, 512892, 512850, 513044, 512439, 511264, 510488, 510341, 510159, 509514, 508666, 507893, 507067, 506132, 505429, 505283, 505632, 506262, 507158, 508432, 510096, 512042, 514091, 516009, 517645, 519116, 520688, 522411, 524052, 525351, 526185, 526450, 526037, 524987, 523572, 522138, 520929, 520006, 519241, 518467, 517765, 517411, 517404, 517300, 516916, 516954, 518388, 521274, 524779]
58781E24779L656M287N433O253O340O086N739N022L923L047K742K443J394l59
58767E80785k151l503m380m872n016m842m346l564k791k466k664k886k582j683
58753E33039n22N06J152J494K019L186M757N957O404O406O258N880N460N704O862
58738E94562Q113Q605Q568Q634Q653Q126P444P484Q179Q536Q196P801P711P440
58724G08052O788O412O650O731N896M640M005M194M579M653M319L662L132L487
58710G77200M764N721N140L387J790P54n00k420m534o504q683j1127j3045j3884
58696G38059j4272j5161j6514j7531j7817j7645j7243j6464j5201j3622j1952
58685E64637j0358r043q161p570o965o253n504m641l524k380j761j889k283k257
$$ y = [524779, 528435, 532722, 538155, 544408, 550748, 556834, 562573, 567595, 571518, 574565, 577307, 579750, 581144, 580785, 578634, 575131, 570751, 565879, 560863, 556021, 551675, 548111, 545320, 542854, 540190, 537304, 534722, 533039, 532517, 533023, 534175, 535669, 537688, 540874, 545631, 551588, 557992, 564398, 570656, 576536, 581996, 587700, 594562, 602675, 611280, 619848, 628482, 637135, 645261, 652705, 660189, 668368, 676904, 685100, 692901, 700612, 708052, 714840, 721252, 727902, 734633, 740529, 745169, 749174, 753368, 757947, 762600, 766919, 770581, 773713, 777200, 781964, 787685, 792825, 796212, 798002, 798756, 798256, 795836, 791302, 784798, 776115, 764988, 751943, 738059, 723787, 708626, 692112, 674581, 656764, 639119, 621876, 605412, 590211, 576589, 564637, 554279, 545236, 537075, 529505, 522540, 516287, 510783, 506142, 502618, 500238, 498477, 496588, 494305, 492048]
58671D92048j648q20j08N29J301K307L528M980O624Q133Q961Q806P972P147O776
58656E56536O750O621N979M654K734N38j507l041l897m108l884l550l275k930
58642E57620k433k143k552l457l916l358k397k020k175j851n66Q46J373J204J417
58627E35592K485L696M106L510K410J374Q02R05J521K067K090J858K047K911M090
58612E71464N257O509P894Q993R315Q900Q134P171N861M191K319K81j977m153
58598F40159n603o046n978o128o557o592n636l894k227j284r02m04N65J751K835
58583E94059L927N234O610P798Q861R876J0400R906Q706P813P689P804P553P014
58569G03250O512O127O054O834Q616J0689J2313J3594J4903J5951J6275J6274
$$ y = [492048, 490400, 489580, 489472, 490001, 491302, 493609, 497137, 502117, 508741, 516874, 525835, 534641, 542613, 549760, 556536, 563286, 569907, 575886, 580540, 583274, 583812, 582305, 579264, 575367, 571259, 567375, 563825, 560550, 557620, 555187, 553044, 550492, 547035, 543119, 539761, 537364, 535344, 533169, 531318, 530752, 531598, 532971, 534175, 535592, 538077, 541773, 545879, 549389, 551799, 553173, 553975, 554880, 556401, 558468, 560558, 562416, 564463, 567374, 571464, 576721, 583230, 591124, 600117, 609432, 618332, 626466, 633637, 639498, 643689, 646008, 646289, 644312, 640159, 634556, 628510, 622532, 616404, 609847, 603255, 597619, 593725, 591498, 590214, 589312, 588908, 589473, 591224, 594059, 597986, 603220, 609830, 617628, 626489, 636365, 646765, 656671, 665377, 673190, 680879, 688683, 696236, 703250, 709762, 715889, 721943, 728777, 737393, 748082, 760395, 773989, 788892, 804843, 821118, 837392]
58557H37392J6745J7497J7413J5991J3915J1844R536O656L639J161q09k847n244
58544I42889p817j0280j2399j3877j4483j4288j3622j2909j2576j2876j3668j4531
58532G89563j5189j5516j5203j3937j2061j0458r495q553p024n215l781k668j229
58519F69234P63K797M184M591M091L132K337K003J898J747J674J830J991J914
58505G04186J814J995K230K085J622J212Q10M4j076k129k875l323l369l020k825
58490F97381l314m011l800k426q46Q6N17R85J638K447L432M365M859N162O048
58475G12523P546Q509Q134P223P056P550P467O186M342K690J160p59l214n799
58461G70614p857q897q893q152o860m984k744q22K55O63R52J466K309L456M519
$$ y = [837392, 854137, 871634, 889047, 905038, 918953, 930797, 940333, 946989, 950628, 951789, 950980, 948133, 942889, 935072, 924792, 912393, 898516, 884033, 869745, 856123, 843214, 830638, 817762, 804094, 789563, 774374, 758858, 743655, 729718, 717657, 707199, 697704, 689151, 682127, 676912, 673131, 670463, 669234, 669997, 672794, 676978, 681569, 685660, 688792, 691129, 693132, 695030, 696777, 698451, 700281, 702272, 704186, 706000, 707995, 710225, 712310, 713932, 715144, 715954, 715998, 714922, 712793, 709918, 706595, 703226, 700206, 697381, 694067, 690056, 686256, 683830, 682984, 683070, 683587, 684572, 686210, 688657, 692089, 696454, 701313, 706475, 712523, 720069, 728578, 736712, 743935, 750991, 758541, 766008, 772194, 776536, 779226, 780386, 779627, 776413, 770614, 762757, 753860, 744967, 736815, 729955, 724971, 722227, 721405, 721660, 722323, 723275, 724741, 727050, 730506, 735025]
58446G35025M826M170L101K102R89l95j502j865j999k616l291k948j435L73J900
58431G36435L222M194M403M177M512N646O693P176P852R484J1570J3060J3687
58418H32111J3929J4162J4433J4625J4372J3273J1709J0779J0905J1065J0172
58407I71535Q618P543O880N171J324m291j0475j6097k0173k1866k0990j8319j5017
58394H73843j1896r228o996n086l366j857q47p51j619k772l148k301r78l21n40
58379H22137q25n53j3L00M71Q80J526K132K628L148L765M537N516O494P090P392
58363H66625Q075R464J0942J1753J2012J2297J2685J2824J2676J2426J1858J0570
58351A004207Q803P320O431N744M946M175L585L056K614K635L385M701O237P699
$$ y = [735025, 739851, 744021, 747122, 749224, 750213, 749818, 748316, 746451, 744452, 741836, 738545, 735597, 734162, 734535, 736435, 739657, 743851, 748254, 752431, 756943, 762589, 769282, 776458, 784310, 793794, 805364, 818424, 832111, 846040, 860202, 874635, 889260, 903632, 916905, 928614, 939393, 950298, 961363, 971535, 980153, 987696, 994576, 999747, 1001071, 996780, 986305, 970208, 950035, 928169, 907179, 888860, 873843, 861947, 852719, 845723, 840637, 837271, 835414, 834567, 833816, 832197, 829425, 826277, 823976, 822998, 822677, 822137, 821312, 820759, 820746, 821046, 821517, 822397, 823923, 826055, 828683, 831831, 835596, 840133, 845649, 852143, 859233, 866625, 874700, 884164, 895106, 906859, 918871, 931168, 943853, 956677, 969353, 981779, 993637, 1004207, 1013010, 1020330, 1026761, 1032505, 1037451, 1041626, 1045211, 1048267, 1050881, 1053516, 1056901, 1061602, 1067839, 1075538]
58337A075538Q838R506R871J0316J1079J2111J3092J3485J2897J1743J1192J1843
58325A211511J2822J2786J1583J0168R201Q586Q318Q630R162Q954P776O651O599
58312A332747P457Q445R236R972J0666J1276J2005J3083J4364J5526J6463J7240
58300A478480J7875J8463J9181J9942K0295J9970J9323J8919J8906J9031J9061
58289A689446J9019J9105J9596K0610K1888K3042K4035K5142K6349K7228K7621
58278A943081K8056K9137L0813L2488L3750L4642L5401L6194L7127L8345M0036
58267B319070M2258M4696M6867M8665N0541N2890N5503N7986O0458O3276O6221
58256B908431O8594P0166P1464P3030P4837P6494P7638P8158P8539P9877Q2996
$$ y = [1075538, 1084376, 1093882, 1103753, 1114069, 1125148, 1137259, 1150351, 1163836, 1176733, 1188476, 1199668, 1211511, 1224333, 1237119, 1248702, 1258870, 1268071, 1276657, 1284975, 1293605, 1302767, 1311721, 1319497, 1326148, 1332747, 1340204, 1348649, 1357885, 1367857, 1378523, 1389799, 1401804, 1414887, 1429251, 1444777, 1461240, 1478480, 1496355, 1514818, 1533999, 1553941, 1574236, 1594206, 1613529, 1632448, 1651354, 1670385, 1689446, 1708465, 1727570, 1747166, 1767776, 1789664, 1812706, 1836741, 1861883, 1888232, 1915460, 1943081, 1971137, 2000274, 2031087, 2063575, 2097325, 2131967, 2167368, 2203562, 2240689, 2279034, 2319070, 2361328, 2406024, 2452891, 2501556, 2552097, 2604987, 2660490, 2718476, 2778934, 2842210, 2908431, 2977025, 3047191, 3118655, 3191685, 3266522, 3343016, 3420654, 3498812, 3577351, 3657228, 3740224]
58245C740224Q7461R2046R6241J00706J06316J13266J21237J29732J38221J46437
58235D871887J54755J63835J73950J85071J97401K11128K25840K40946K56679
58226F681492K73992K93490L15105L38688L64214L91772M22086M56726M96871
58217A0034436N42309N92711O49307P14119P88133Q71951R67954J080180J212493
58208A7453593J368845J555462J781470K058327K400928K828017L356792L994865
58200C6798299M739921N590648O560732P684856R008972J0560980J2311824J4159439
58192A07415671J5965962J7631190J9134116K0487978K1638846K2411442K2577259
58185B47262464K1988048K0607258J8341297J4822631R470894J970411p159348
$$ y = [3740224, 3827685, 3919731, 4015972, 4116678, 4222994, 4336260, 4457497, 4587229, 4725450, 4871887, 5026642, 5190477, 5364427, 5549498, 5746899, 5958027, 6183867, 6424813, 6681492, 6955484, 7248974, 7564079, 7902767, 8266981, 8658753, 9080839, 9537565, 10034436, 10576745, 11169456, 11818763, 12532882, 13321015, 14192966, 15160920, 16241100, 17453593, 18822438, 20377900, 22159370, 24217697, 26618625, 29446642, 32803434, 36798299, 41538220, 47128868, 53689600, 61374456, 70383428, 80944408, 93256232, 107415671, 123381633, 141012823, 160146939, 180634917, 202273763, 224685205, 247262464, 269250512, 289857770, 308199067, 323021698, 332492592, 334463003, 327303655]
58178C27303655j6461362k4124756k8846856l0326780k9128818k6194940k2427454
58171A49792689j8506407j4859430j1684885r008899o771620m909532l398409
58164H0653507k240731j413098q38821m56433l43285p27410j790037l411205n133340
58155F4299147o415647o949959o768743o116249n260118m390919l612592k963699
58147B1821221k441033k024050j692296j428821j217976j046783r06622p90932
58139A0272708o93551o11042n43716m91812m52060m19501l91065l65965l43848
58130E960148l23819l04475k84173k61950k38572k15903j95126j76342j59616
58121C800172j45275j33211j23138j15673j11980j12051j14149j16033j16021
$$ y = [327303655, 310842293, 286717537, 257870681, 227543901, 198415083, 172220143, 149792689, 131286282, 116426852, 104741967, 95733068, 88961448, 84051916, 80653507, 78412776, 76999678, 76160857, 75704424, 75361139, 74633729, 72843692, 69432487, 64299147, 57883500, 50933541, 44164798, 38048549, 32788431, 28397512, 24784920, 21821221, 19380188, 17356138, 15663842, 14235021, 13017045, 11970262, 11063640, 10272708, 9579157, 8968115, 8424399, 7932587, 7480527, 7061026, 6669961, 6303996, 5960148, 5636329, 5331854, 5047681, 4785731, 4547159, 4331256, 4136130, 3959788, 3800172, 3654897, 3521686, 3398548, 3282875, 3170895, 3058844, 2944695, 2828662, 2712641]
58112B712641j13100j07152r9268r1039q3388p6591p1065o7139o4268o1421n8288
58101A819922n5275n2529m9873m7515m5804m4262m1970l8957l6302l4623l3383
58090A339429l1837k9864k7652k5343k3218k1582k0271j8880j7549j6862j6860
58079A089511j6875j6550j6267j6436j6983j7819j9076k0556k1563k1650k1057
58068H84679k0116j8763j7049j5528j4603j3924j2939j1722j0781j0207r663r060
58056G20324q745q883r086q934q589q592r104r594r375q375p194o449o216o146
58042F05042o003n894o053o443o747o726o576o644o818o551n736n181n703p002
58028E16965q032q399q637r073r306r058q745q653q258p093n730n170n509n914
$$ y = [2712641, 2599541, 2492389, 2393121, 2302082, 2218694, 2142103, 2071038, 2003899, 1939631, 1878210, 1819922, 1764647, 1712118, 1662245, 1614730, 1568926, 1524664, 1482694, 1443737, 1407435, 1372812, 1339429, 1307592, 1277728, 1250076, 1224733, 1201515, 1179933, 1159662, 1140782, 1123233, 1106371, 1089511, 1072636, 1056086, 1039819, 1023383, 1006400, 988581, 969505, 948949, 927386, 905736, 884679, 864563, 845800, 828751, 813223, 798620, 784696, 771757, 760035, 749254, 739047, 729384, 720324, 711579, 702696, 693610, 684676, 676087, 667495, 658391, 648797, 639422, 631047, 623853, 617404, 611188, 605042, 599039, 593145, 587092, 580649, 573902, 567176, 560600, 553956, 547138, 540587, 534851, 529670, 523967, 516965, 508933, 500534, 491897, 482824, 473518, 464460, 455715, 447062, 438804, 431711, 425981, 420811, 415302, 409388]
58014D09388n717m947l954l156k962l356l629l127k139j490j363j184o54j31J54
57999C71733N78J419K214K286J692J202J454K314L121L357L071K673K398K168
57985D01680J934J916K262K690K727K246J491O82j91j184k167k832k860k207j211
57970D04976l05L17N33L0j301k741l174k416j517j424j944k409k729l131l445
57955C79320l353l057l017l261l546l895m375m636m385l990l880l667k700j330
57941C30228o39q97j151n33Q15K276L544M582N384O077O896P846Q736R437R775
57926C92376R370Q114O651N700N087M115K758J614P95j85j452k642l779n252o757
57911D16513p436p380p797r173j0416j0516r941r543r133q286p692q264r413r547
$$ y = [409388, 403671, 398724, 394770, 391614, 388652, 385296, 381667, 378540, 376401, 374911, 373548, 372364, 371710, 371579, 371733, 372311, 373730, 375944, 378230, 379922, 381124, 382578, 384892, 388013, 391370, 394441, 397114, 399512, 401680, 403614, 405530, 407792, 410482, 413209, 415455, 416946, 417628, 417437, 416253, 414086, 411254, 408394, 406187, 404976, 404671, 404988, 405521, 405551, 404250, 401509, 398335, 395919, 394402, 392978, 391034, 388625, 385896, 382765, 379320, 375967, 372910, 369893, 366632, 363086, 359191, 354816, 350180, 345795, 341805, 337925, 334258, 331558, 330228, 329589, 328692, 327541, 327008, 327823, 330099, 333643, 338225, 343609, 349686, 356582, 364428, 373164, 382601, 392376, 401746, 409860, 416511, 422211, 427298, 431413, 434171, 435785, 436580, 436395, 434943, 432301, 428522, 423270, 416513, 409077, 401697, 393900, 384727, 374311, 363795, 353854, 344311, 335178, 326892, 319200, 310936, 301523, 291976]
57897B91976q242o733o132o163n934n131m104l286k848k602k160j435q76q48r04
57882B34578k78R80J958K101J953K369L382M189M076L107J939J139P35M31J15
57867B62774k9J5j26p77j725k436k664k513k036j081L63J947L209L989M536N172
57851B68618N911O457O637O665O787O873O655O235N918N599M828L564K327J403
57837C44477M98o40j751k566l246l984m620n009n334n665n715n422n251n404n321
57822B85047m536l539k956k442j284J68Q04M32J73R67K516L883M469M205L433
57807B91340K829K874L186K923J984J191J022Q76N0j162j923k082k372l514n436
57792B91786p354q429q418p853p465p357p040o244n307m630m111l429k602j917
$$ y = [291976, 283734, 277001, 270869, 264706, 258772, 253641, 249537, 246251, 243403, 240801, 238641, 237206, 236330, 235482, 234578, 234300, 235280, 237238, 239339, 241292, 243661, 247043, 251232, 255308, 258415, 260354, 261493, 262228, 262659, 262774, 262745, 262760, 262634, 261857, 260132, 257696, 255032, 252519, 250483, 249402, 249765, 251712, 254921, 258910, 263446, 268618, 274529, 280986, 287623, 294288, 301075, 307948, 314603, 320838, 326756, 332355, 337183, 340747, 343074, 344477, 344975, 344335, 342584, 340018, 336772, 332788, 328168, 323159, 317825, 312160, 306445, 301023, 295772, 290368, 285047, 280511, 276972, 274016, 271574, 270290, 270458, 271262, 271694, 271867, 272834, 275350, 279233, 283702, 287907, 291340, 294169, 297043, 300229, 303152, 305136, 306327, 307349, 308225, 308275, 307113, 305190, 303108, 300736, 297222, 291786, 284432, 276003, 267585, 259732, 252267, 244910, 237870, 231626, 226319, 221689, 217578, 214149, 211547, 209630]
57778B09630j476j075m87K48Q41J063J126J627K855M258M980M864M512M364M259
57763B41589L976L563K931J721O4j119j195q58j424l208n202o313o399n967n423
57748B16736m902m507m348m365m227l560k319r89l13o58j625k357k270j517q31
57733A77948q56j492j976j690q08O7P07J267J605J278L58l74l92j05j44m15m48
57716A74530j98L9K15M09L82k1k22M69J595J839Q15k31KJ243K154K022J342J010
57698A87394J479K585L741M357M383M365M689M977M610L629K650J914R83n07k177
57683B29072l248l287k411r92O17K219L911O065R005J2790J7297K2365K7642L2422
57669C53467L5992L8264L9860M1417M2814M3308M2259L9396L4102K4875J0234
$$ y = [209630, 208154, 207079, 206592, 206840, 207681, 208744, 209870, 211497, 214352, 218610, 223590, 228454, 232966, 237330, 241589, 245565, 249128, 252059, 253780, 253844, 252725, 251530, 250672, 249248, 246040, 240838, 234525, 228126, 222159, 216736, 211834, 207327, 202979, 198614, 194387, 190827, 188508, 187519, 187206, 186548, 184923, 182566, 180296, 178779, 177948, 177092, 175600, 173624, 171934, 171126, 171193, 171900, 173167, 174772, 176050, 176408, 176034, 175642, 175537, 175393, 174978, 174530, 174332, 174371, 174586, 174995, 175377, 175356, 175134, 175603, 177198, 179037, 179852, 179621, 179623, 180866, 183020, 185042, 186384, 187394, 188873, 191458, 195199, 199556, 203939, 208304, 212993, 217970, 222580, 226209, 228859, 230773, 231756, 231249, 229072, 225824, 222537, 220126, 219134, 219751, 221970, 225881, 231946, 240951, 253741, 271038, 293403, 321045, 353467, 389459, 427723, 467583, 509000, 551814, 595122, 637381, 676777, 710879, 735754, 745988]
57658G45988r348l0564m8696o0184o4050o1484n4674m6054l7762l1017k5816k1508
57646B54831j7689j4437j1834r611p525n737m552l852l121k161j475j637k413
57633A68787k862k387j341m67n7P4N7j29l22k20J53L81K03k14o60j174j735k008
57615A56079j726j175r37j272j949k551k731k321j513q13n37m49j86P4k15j110
57599A36668j890j793q44J42L47l28j167j373r46o84j151j964k341k110j652j218
57583A17696q15o65j050j665j822j450j237j566j942j839j458j239j146r76q88
57568I7938j079j294j214j011r61q21k19N06O04J8m23j02O32R80O18l8l08J21
57550I3947Q41J113O94J29PK30L21J42j24m51q34r17l33N99J178J249J251J307
$$ y = [745988, 736640, 706076, 657380, 597196, 533146, 471662, 416988, 370934, 333172, 302155, 276339, 254831, 237142, 222705, 210871, 201260, 193735, 187998, 183446, 179594, 176473, 174312, 172837, 171200, 168787, 165925, 163538, 162197, 161730, 161673, 161747, 161804, 161675, 161353, 161133, 161286, 161667, 161870, 161656, 160996, 159822, 158087, 156079, 154353, 153178, 152241, 150969, 149020, 146469, 143738, 141417, 139904, 139091, 138554, 138105, 137919, 137993, 137778, 136668, 134778, 132985, 132141, 132283, 132630, 132302, 131135, 129762, 128816, 128132, 126981, 125017, 122676, 120566, 118914, 117696, 116881, 116216, 115166, 113501, 111679, 110229, 108992, 107426, 105484, 103645, 102187, 100948, 99802, 98826, 97938, 96859, 95565, 94351, 93340, 92379, 91558, 91339, 91845, 92449, 92467, 92044, 91942, 92574, 93554, 94172, 94134, 93826, 93947, 94788, 95901, 96595, 96724, 96731, 96961, 97282, 97424, 97300, 96849, 96015, 95098, 94765, 95364, 96542, 97791, 99042, 100349]
57532A00349R73P3q62j261j132q13o00q08j597k433k278p96R82J699J039j93j077
57515I1265j226p16J16Q62J273J338J077M94k05p03r97j360j691j510q08l37n61
57498H6311q92o76k93n05j025q58M2N56Q1n72m42K18N11K05j95l60m14m27k60
57479H1005N0K36J87O0lM5K78O02N01m77j852k429j674m57M4k65o04n95n57o32
57459G3463m81o9jo06j281j250n92R4O58J286J712J448P89P07J474K126J702M78
57441H1657n77r73q70m28K72Q70Q69L09k25k63P1L61L67J01k90o06o55m25j57
57422G9408j67m85o89k80N79R51J65j152j652r43j36l35j231j669j186l11L71
57405G1238P68R39Q12M26k1m60q80r81m03N86J098O17l70r80q74l46K64R19J689
$$ y = [100349, 101322, 101395, 100533, 99272, 98140, 97327, 96727, 95919, 94322, 91889, 89611, 88815, 89797, 91496, 92535, 92342, 91265, 90039, 89323, 89439, 90301, 91574, 92912, 93989, 94483, 94278, 93575, 92578, 91218, 89527, 88017, 87209, 86872, 86311, 85419, 84743, 84450, 83945, 82920, 82062, 82104, 82660, 82741, 82169, 81727, 81945, 82456, 82661, 82466, 82106, 81692, 81265, 81005, 81055, 81291, 81478, 81538, 81535, 81580, 81858, 82460, 82961, 82484, 80632, 78203, 76529, 76072, 76116, 75851, 75247, 74652, 74095, 73463, 72982, 72913, 72912, 72306, 71025, 69775, 69183, 69277, 69935, 71221, 72933, 74381, 75170, 75877, 77351, 79477, 81179, 81657, 81080, 80107, 79237, 78809, 79081, 79951, 80820, 81129, 80904, 80641, 80712, 81073, 81440, 81541, 81251, 80645, 79990, 79565, 79408, 79241, 78756, 78067, 77787, 78366, 79317, 79482, 78330, 76678, 75735, 75599, 75264, 74033, 72364, 71178, 70867, 71238, 72006, 72945, 73757, 74183, 74162, 73702, 72822, 71841, 71438, 72024, 73122, 73739, 73369, 72389, 71515, 71169, 71433, 72352, 74041]
57386G4041K461K905K762K141J517J259J287J321J364J620J953J841J014j18q80
57371I6488r60o25m29p51j427j820j536r85q96j241j251o41j94p00j741k173j540
57354G7578m88K22N00O69R21J229J512J662J631J528J522J513J186M87j77l48
57338I1147m7L40N60O79Q32R46Q15M08J9mL02M49J0q09j339j219p73n21n34n09
57318I0752k66J40P16J478K052J791O21n71q55l33R9kj78M4M07L65j45p83j295
57299I4037j505j115o8R72J154N15l2J16O05R21J151J499J528O99o02j280q81
57282I7714p2M28O95J039J141M72o60j281j005n16m85o28k26P40J579J888J944
57265A02767K075K142J912J496J110O88J29k57j8P83J547J836J774J676J569J327
$$ y = [74041, 76502, 79407, 82169, 84310, 85827, 87086, 88373, 89694, 91058, 92678, 94631, 96472, 97486, 97368, 96488, 95528, 94903, 94474, 93723, 92296, 90476, 88940, 87955, 87059, 85818, 84567, 83926, 83732, 83032, 81291, 79118, 77578, 77090, 77312, 77812, 78481, 79402, 80631, 82143, 83805, 85436, 86964, 88486, 89999, 91185, 91672, 91495, 91147, 91100, 91440, 92000, 92679, 93511, 94457, 95272, 95680, 95699, 95695, 95997, 96446, 96456, 95647, 94308, 93089, 92316, 91795, 91261, 90752, 90486, 90626, 91342, 92820, 94872, 96663, 97284, 96713, 95858, 95525, 95624, 95622, 95444, 95488, 95895, 96260, 96115, 95332, 94037, 92532, 91417, 91349, 92321, 93475, 93990, 93958, 94074, 94679, 95600, 96751, 98250, 99778, 100477, 99875, 98595, 97714, 97642, 98070, 98765, 99804, 100945, 101417, 100757, 99476, 98471, 97955, 97470, 96842, 96616, 97356, 98935, 100823, 102767, 104842, 106984, 108896, 110392, 111502, 112190, 112319, 112062, 112044, 112827, 114374, 116210, 117984, 119660, 121229, 122556]
57249A22556J047J037J412J864J888J270L77r4K25R95J575J716J703J821J960
57234A41352J832J395R40Q92J519K670L651L704K767J605J004R92J058R68R79
57219A67328J324J871K361K727K962K984K731K365K161K209K380K529K669K908
57205B01509L306L792M182M359M390M514M852N263N566N914O785Q416J0389J1938
57191B85175J2691J2963J3291J3865J4561J5300J6102J6834J7179J7047J6748
57180D51756J6680J6884J7144J7382J7676J7924J7769J7102J6329J5860J5366
57169F37872J4061J1826R656Q632Q733R095R279R582J0135J0404J0059R695J0073
57156G69102J0906J1200J0718J0400J1081J2385J3286J3449J3464J3978J4912
$$ y = [122556, 123603, 124640, 126052, 127916, 129804, 131074, 131451, 131357, 131582, 132577, 134152, 135868, 137571, 139392, 141352, 143184, 144579, 145519, 146411, 147930, 150600, 154251, 157955, 160722, 162327, 163331, 164323, 165381, 166349, 167328, 168652, 170523, 172884, 175611, 178573, 181557, 184288, 186653, 188814, 191023, 193403, 195932, 198601, 201509, 204815, 208607, 212789, 217148, 221538, 226052, 230904, 236167, 241733, 247647, 254432, 262848, 273237, 285175, 297866, 310829, 324120, 337985, 352546, 367846, 383948, 400782, 417961, 435008, 451756, 468436, 485320, 502464, 519846, 537522, 555446, 573215, 590317, 606646, 622506, 637872, 651933, 663759, 673415, 682047, 690780, 699875, 709154, 718736, 728871, 739275, 749334, 759029, 769102, 780008, 791208, 801926, 812326, 823407, 835792, 849078, 862527, 875991, 889969, 904881]
57145I04881J5664J5804J5499J5285J5498J6025J6608J7284J8235J9354K0193
57134A090330K0463K0305K0119K0314K1245K3005K5189K7205K8945L0800L2930
57123A360850L5015L7001L9559M3236M7507N1292N4331N7518O1898O7876P5421
57112A931504Q4427R4657J05733J17542J30412J44683J60406J77837J98083K23016
57102C368300K54442K93651L41881M01056M73592N61154O63721P80298R10357
57093H048452J053883J209539J373086J537604J694636J835087J950539K035161
57085B0737987K085725K099207K073133K013196J941520J891119J882883J901501
57077C6626271J892256J783285J517667J076220M82969k04292r12012j569974
$$ y = [904881, 920545, 936349, 951848, 967133, 982631, 998656, 1015264, 1032548, 1050783, 1070137, 1090330, 1110793, 1131098, 1151217, 1171531, 1192776, 1215781, 1240970, 1268175, 1297120, 1327920, 1360850, 1395865, 1432866, 1472425, 1515661, 1563168, 1614460, 1668791, 1726309, 1788207, 1856083, 1931504, 2015931, 2110588, 2216321, 2333863, 2464275, 2608958, 2769364, 2947201, 3145284, 3368300, 3622742, 3916393, 4258274, 4659330, 5132922, 5694076, 6357797, 7138095, 8048452, 9102335, 10311874, 11684960, 13222564, 14917200, 16752287, 18702826, 20737987, 22823712, 24922919, 26996052, 29009248, 30950768, 32841887, 34724770, 36626271, 38518527, 40301812, 41819479, 42895699, 43378668, 43174376, 42262364, 40692390]
57069D0692390k124348k542083k809882k931755k925765k818843k640729k419368
57061A9479617k178275j935084j701388j484283j288329j116057r67507q40675
57053G968019p33124o43040n68824n08355m58837m17127l80255l46282l14788
57044C597387k86168k60346k36550k14228j93474j74351j56473j39598j24055
57035A812144j10154r7691q6477p6820o8867o1934n5189m8663m2897l7854l2937
57024A092661k7976k3237j8457j2697n377L301J3246K4991L8848N4125O9760Q5296
57012A294484J00813J16247J31084J44278J54094J58646J56782J47115J25318
57003B528861Q4112J9393o2219j43242k04551k35690k37738k18951j89176j56724
$$ y = [40692390, 38568042, 36025959, 33216077, 30284322, 27358557, 24539714, 21898985, 19479617, 17301342, 15366258, 13664870, 12180587, 10892258, 9776201, 8808694, 7968019, 7234895, 6591855, 6023031, 5514676, 5055839, 4638712, 4258457, 3912175, 3597387, 3311219, 3050873, 2814323, 2600095, 2406621, 2232270, 2075797, 1936199, 1812144, 1701990, 1604299, 1517822, 1441002, 1372135, 1310201, 1255012, 1206349, 1163452, 1125598, 1092661, 1064685, 1041448, 1022991, 1010294, 1004917, 1008218, 1021464, 1046455, 1085303, 1139428, 1209188, 1294484, 1395297, 1511544, 1642628, 1786906, 1941000, 2099646, 2256428, 2403543, 2528861, 2612973, 2632366, 2570147, 2426905, 2222354, 1986664, 1748926, 1529975, 1340799, 1184075]
56993A184075j26987j02048q1739o5457n2894m3383l5639k8711k2642j7848j4241
56982E92486j1402r273q192q380r796j2339j5783j9460k2342k3652k3304k1709
56970D06854j9259j6138j2605r255o745n142l761j843P01L378N758P655Q847R203
56956C67648R164R503J0213J0040P628K977k636p946j2446j5912j7881j7935j6258
56943C26159j3615j0744p922n058k119O94L211N573Q005J0364J2260J3636J4837
56930C55281J5909J6251J5261J2917R393M514j787q752j5154k0297k4053k6052
56918C33431k5672k3051j9490j6441j4396j2937j1430r466p042m666l107k705
56906A83028l080l554l666l280k533j769j188m98P37K403L936N131O258P366Q164
$$ y = [1184075, 1057088, 955040, 873301, 807844, 754950, 711567, 675928, 647217, 624575, 606727, 592486, 581084, 571811, 563619, 555239, 545443, 533104, 517321, 497861, 475519, 451867, 428563, 406854, 387595, 371457, 358852, 349597, 342852, 337710, 333949, 332106, 332807, 336185, 341943, 349598, 358445, 367648, 376812, 386315, 396528, 406568, 414196, 417173, 414537, 406591, 394145, 378233, 360352, 342417, 326159, 312544, 301800, 293878, 288820, 286701, 287395, 290606, 296179, 304184, 314548, 326808, 340444, 355281, 371190, 387441, 402702, 415619, 425012, 429526, 427739, 418987, 403833, 383536, 359483, 333431, 307759, 284708, 265218, 248777, 234381, 221444, 210014, 200548, 193506, 188840, 185733, 183028, 179948, 176394, 172728, 169448, 166915, 165146, 163958, 163460, 164197, 166600, 170536, 175667, 181925, 189291, 197455]
56891A97455Q869J0286J2542J4538J5276J5135J5030J4927J4084J2392J0356P924
56879C48814M425j36m722q366j0854j1996j1162q122l882J03L295O255R616J3399
56865C26667J7244K0926K4405K7585L0232L2194L3492L4032L3316L0693K5904
56854F36690J9022R965j294j3612k4443l1363l3633l1959k7253k0358j2503m850
56842D64409K473J0064J7929K5280L1723L7702M3485M8480N1919N3543N3260N0840
56830H91107M6275L9589K9902J5596l578k4984m4369n8445o5902o6792o2146n3952
56818F42301m4423l4758k5005j5044n245L815J1748J8420K3955K8607L2375L4770
56806F71516L5353L4310L2019K8110K1482J1286k304j8089l3933m7029n4851n6515
$$ y = [197455, 206324, 216610, 229152, 243690, 258966, 274101, 289131, 304058, 318142, 330534, 340890, 348814, 353239, 353103, 348381, 340015, 329161, 317165, 306003, 297881, 293999, 294102, 297397, 303652, 313268, 326667, 343911, 364837, 389242, 416827, 447059, 479253, 512745, 546777, 580093, 610786, 636690, 655712, 665677, 664383, 650771, 626328, 594965, 561332, 529373, 502120, 481762, 469259, 464409, 466882, 476946, 494875, 520155, 551878, 589580, 633065, 681545, 733464, 787007, 840267, 891107, 937382, 976971, 1006873, 1022469, 1018891, 993907, 949538, 891093, 825191, 758399, 696253, 642301, 597878, 563120, 538115, 523071, 517826, 521641, 533389, 551809, 575764, 604371, 636746, 671516, 706869, 741179, 773198, 801308, 822790, 834076, 831772, 813683, 779750, 732721, 677870, 621355]
56794F21355n3156m6872l9435l1838k4543j7746j1546o008j106L314P379J0947
56782D10745J3684J5364J5993J5715J4650J2709R383M015l473j2170k0702k7943
56770D47970l3056l5344l4679l1950k8517k5124k1769j8463j5569j3253j1278
56759A78968r555q354p694p020n908m745m200m226m080l321k338j783j787j974
56745A11983k047k079k210k246j810r10j30q4p65j575j912j647j060n31k79k18
56729I2480m3L60P18O92L67J38J86L69O47J202J961K333J804O60k23l66j72l02
56711A02811p90j063p34j05K87L80N17Q51J096R63M85j18o27p79m39O7J32l23
56693A02611o24k50L68M40q2n34n01j91J01L66O19P76Q65J021J100P80J22l43
$$ y = [621355, 568199, 521327, 481892, 450054, 425511, 407765, 396219, 390211, 389105, 392419, 399798, 410745, 424429, 439793, 455786, 471501, 486151, 498860, 508243, 512258, 508785, 496615, 475913, 447970, 414914, 379570, 344891, 312941, 284424, 259300, 237531, 219068, 203499, 190246, 178968, 169413, 161059, 153365, 146345, 140437, 135692, 131492, 127266, 123186, 119865, 117527, 115744, 113957, 111983, 109936, 107857, 105647, 103401, 101591, 100681, 100551, 100467, 99702, 98127, 96215, 94568, 93508, 92977, 92698, 92480, 92437, 92797, 93515, 94207, 94574, 94712, 94898, 95267, 95914, 97116, 99077, 101410, 103214, 103874, 103651, 103285, 103113, 102811, 102021, 100958, 100224, 100119, 100406, 100786, 101303, 102154, 103250, 104213, 104698, 104580, 103953, 103174, 102735, 102802, 102934, 102611, 101987, 101737, 102105, 102545, 102463, 101929, 101428, 101237, 101338, 101704, 102323, 103099, 103964, 104985, 106085, 106865, 106987, 106644]
56675A06644k48K00N87P49O79L17k51o84p23m90k52l3K53N10N12K96K15N52J139
56656A09972J469J217O31K99N07R57J180J079Q86P88P86Q35P85M38j35m61k12
56639A21021K32J90m57j155j345q64J47J208J573R34M9q6M11N24M2oR54J894J511
56620A26777L5j171j398j041o07j97J5k73q56j014m38L09N61L70K09K37K33J07
56602A21858R0L77Q47J185J229J016O32J38l03m10j11K66L43J49L0J19K61M06
56584A28122O39P99M99k24p44o27j72J39L41O70R58R02P39J044J818K377K260
56567A39540J852J980L060M758O324P234P612P966Q512R029R506J0403J1858J2968
56553B42602J2594J0690Q298O257M572L069J939J351J144J173J538K082K093R96
$$ y = [106644, 106396, 106596, 107183, 107932, 108611, 108928, 108677, 107993, 107270, 106780, 106528, 106495, 106748, 107258, 107770, 108066, 108281, 108833, 109972, 111441, 112658, 113289, 113588, 114095, 115052, 116232, 117311, 118197, 118985, 119771, 120606, 121391, 121829, 121694, 121233, 121021, 121253, 121443, 120986, 119831, 118486, 117622, 117769, 118977, 120550, 121484, 121533, 121447, 121858, 122382, 122424, 122418, 123372, 125266, 126777, 126812, 125641, 124243, 123202, 122595, 122398, 122413, 122140, 121284, 120270, 119832, 120141, 120702, 121072, 121281, 121518, 121751, 121858, 121948, 122325, 123172, 124357, 125586, 126602, 127234, 127372, 127069, 126659, 126548, 126814, 127157, 127306, 127336, 127455, 127716, 128122, 128761, 129560, 130059, 129835, 129091, 128464, 128292, 128431, 128772, 129442, 130400, 131302, 132041, 133085, 134903, 137280, 139540, 141392, 143372, 146432, 151190, 157514, 164748, 172360, 180326, 188838, 197867, 207373, 217776, 229634, 242602, 255196, 265886, 274184, 280441, 285013, 288082, 290021, 291372, 292516, 293689, 295227, 297309, 299402, 300398]
56539C00398q80k571l465l742l988m580n396n992o101n953n997o306o561o599
56525B32267o617o695o539n919m997m016l043k289k237k976l809m025l838l892
56511A71375m124l822k829j875j503j299o61K13N73J03p59j377j390q56k15k3
56495A51531l95q69j036j102j459j872j622m72R47J856K050J737J126L88j45j91
56479A50472J28M32N11M74M62L96J26k46l71p3L59M67K78L13Q06J233R93L07o8
56460A56999J25M29N84R00J565K128K123J716J364J158R67Q64R49J001P35K90
56444A73897Nm2L9K55N57O46L59N1O5J75K8j78r5L3k31o10n19j07j2r7M05J444
56422A76068J945J410O30L07J0q02j610j632j072o90n38r0O80J198J200R92Q59
$$ y = [300398, 299518, 296947, 293482, 289740, 285752, 281172, 275776, 269784, 263683, 257730, 251733, 245427, 238866, 232267, 225650, 218955, 212416, 206497, 201500, 197484, 194441, 192152, 189915, 186939, 183130, 179105, 175267, 171375, 167251, 163429, 160600, 158725, 157222, 155923, 155262, 155475, 156048, 156151, 155392, 154015, 152625, 151769, 151554, 151531, 151136, 150267, 149231, 148129, 146670, 144798, 143176, 142704, 143651, 145507, 147557, 149294, 150420, 150808, 150663, 150472, 150600, 151032, 151543, 152017, 152479, 152875, 153001, 152755, 152384, 152311, 152670, 153137, 153415, 153728, 154534, 155767, 156760, 157067, 156999, 157124, 157553, 158137, 159037, 160602, 162730, 164853, 166569, 167933, 169091, 170058, 170922, 171871, 172872, 173607, 173897, 173902, 173860, 173899, 174154, 174711, 175357, 175716, 175767, 175832, 176007, 176035, 175857, 175762, 175795, 175564, 174954, 174435, 174328, 174316, 174219, 174624, 176068, 178013, 179423, 180053, 180360, 180370, 179568, 177958, 176326, 175254, 174564, 174026, 173936, 174616, 175814, 177014, 178006, 178865]
56405A78865P32M85J24k40l44J19J003J554J224L85q8K03R66J626J671R40j8k94
56387A88913K10M71k40j182j114L2J310K192K802K967K238R78L28P97J638J997
56371B04337J858J568J144N10j61p10j092j045k49Q76J239M05p57j253j171j169
56355B04330j285j035m08L1nj86j07K39N62N17k7o85o61L69J631J989J304N29
56337B07102L89N84N30L73O83J482K122K162J878J819K186K757L178L159K713
56322B33117K328K602L407L763K911J323J65j23j21m02q07r38p93n95m44l98n19
56305B44476n76j19P98J441J329R14Q84J188J326J286J498K002K278J950J146
56290B61821K30m66p00m49P1O88J354J745J321K07n28j70O07P43M31P01J678K385
$$ y = [178865, 179597, 180082, 180206, 179966, 179622, 179741, 180744, 182298, 183522, 183907, 183819, 184022, 184988, 186614, 188285, 189225, 189207, 188913, 189123, 189594, 189354, 188172, 187058, 187090, 188400, 190592, 193394, 196361, 198599, 199577, 199905, 200702, 202340, 204337, 206195, 207763, 208907, 209417, 209256, 208546, 207454, 206409, 206160, 207036, 208275, 208680, 207923, 206670, 205499, 204330, 203045, 202010, 201602, 201633, 201628, 201442, 201335, 201574, 202136, 202653, 202626, 201941, 201280, 201649, 203280, 205269, 206573, 207102, 207491, 208075, 208605, 208978, 209661, 211143, 213265, 215427, 217305, 219124, 221310, 224067, 227245, 230404, 233117, 235445, 238047, 241454, 245217, 248128, 249451, 249616, 249493, 249372, 248970, 248163, 247225, 246432, 245837, 245393, 244995, 244476, 243900, 243781, 244579, 246020, 247349, 248263, 249147, 250335, 251661, 252947, 254445, 256447, 258725, 260675, 261821, 262051, 261585, 260885, 260436, 260507, 261195, 262549, 264294, 265615, 265822, 265294, 265124, 265731, 266474, 266905, 267606, 269284, 271669]
56272B71669K282J900J779J863K146K893L792L919L122K551L170M435N096M753
56258C15370M020L612L877M815N990O768P040P368Q076Q816R396J0349J2007J3641
56244D21145J4389J4556J5092J6020J6366J5667J4601J3985J3806J3568J2950
56233E82145J1871J0253Q127N742L409J303n60k305m214o474q860j0797j1856
56220E77784j2079j1861j1637j1593j1603j1378j0779r928q985p997p044o363
56208D56537o090n990n623m829l900l275l038k779k004p33L88P26K56n23j144
56193D17979j391j142m07N87J586K446K873K337Q82l23j0J576K852K798J963J341
56177D35947J081P93M52M18Q78J690K501K828K426J813J878K729L506L562L202
$$ y = [271669, 273951, 275851, 277630, 279493, 281639, 284532, 288324, 292243, 295365, 297916, 301086, 305521, 310617, 315370, 319390, 323002, 326879, 331694, 337684, 344452, 351492, 358860, 366936, 375752, 385148, 395497, 407504, 421145, 435534, 450090, 465182, 481202, 497568, 513235, 527836, 541821, 555627, 569195, 582145, 594016, 604269, 612396, 618138, 621547, 622850, 622290, 619985, 615771, 609297, 600437, 589640, 577784, 565705, 553844, 542207, 530614, 519011, 507633, 496854, 486926, 477941, 469944, 462900, 456537, 450447, 444457, 438834, 434005, 430105, 426830, 423792, 421013, 419009, 418276, 418664, 419390, 419646, 419123, 417979, 416588, 415446, 415039, 415626, 417212, 419658, 422531, 424868, 425750, 425427, 425417, 426993, 429845, 432643, 434606, 435947, 437028, 437821, 438273, 438691, 439569, 441259, 443760, 446588, 449014, 450827, 452705, 455434, 458940, 462502, 465704]
56162D65704K902K612K361K747L994N239N635N683O471P903Q784Q630Q383R134
56148E46182J0905J2968J4731J6027J7004J8030J9543K1805K4885K8741L3160
56137G63981L7792M2538M7682N3434N9636O6232P3628Q2010R0614R8208J04096
56126A519851J08123J09895J08730J04269R6527Q5537P1743N6873M3570L3638
56116B338756K6934K2007J7284J1561M020n489j6231k6900l6235m3500m8813n3248
56104B190146n8437o5590p4799q4991r4447j01358j04307j02648r6701q7602p6733
56093A242533o5139n3465m2445l3075k5891k0373j5597j1457q543o851n451l716
56081I50530k010p44M89K122L651M278M148M065M344M691N081N859O969P821Q152
$$ y = [465704, 468606, 471218, 473579, 476326, 480320, 485559, 491194, 496877, 503348, 511251, 520035, 528665, 537048, 546182, 557087, 570055, 584786, 600813, 617817, 635847, 655390, 677195, 702080, 730821, 763981, 801773, 844311, 891993, 945427, 1005063, 1071295, 1144923, 1226933, 1317547, 1415755, 1519851, 1627974, 1737869, 1846599, 1950868, 2047395, 2132932, 2204675, 2261548, 2305118, 2338756, 2365690, 2387697, 2404981, 2416542, 2420562, 2415073, 2398842, 2371942, 2335707, 2292207, 2243394, 2190146, 2131709, 2066119, 1991320, 1906329, 1811882, 1710524, 1606217, 1503569, 1406868, 1319266, 1242533, 1177394, 1123929, 1081484, 1048409, 1022518, 1002145, 986548, 975091, 966548, 959697, 954246, 950530, 948520, 947776, 948265, 950387, 954038, 958316, 962464, 966529, 970873, 975564, 980645, 986504, 993473, 1001294, 1009446]
56066A009446Q457R345J0803J2291J3398J4259J5356J6824J8147J8729J8731J8725
56054A184511J8682J8030J6935J6462J7047J7687J7410J6736J6782J7584J8302
56043A376168J8639J8973J9444J9889K0573K2047K4257K6556K8466K9878L0661
56032A635551L0856L1033L1841L3331L5211L7410L9710M1341M1866M2091M3142
56021B043383M4971M6689M8184N0231N3019N5698N7602N9156O1197O3996O7124
56010B651250O9992P2502P5382P9552Q4862R0015R4173R7991J02482J07605J12827
55999C638633J18309J24506J31241J38183J45835J54905J65142J75816J86960
55990D979530J99114K12319K26279K41000K56500K72523K89435L08542L30662
$$ y = [1009446, 1017903, 1027248, 1038051, 1050342, 1063740, 1077999, 1093355, 1110179, 1128326, 1147055, 1165786, 1184511, 1203193, 1221223, 1238158, 1254620, 1271667, 1289354, 1306764, 1323500, 1340282, 1357866, 1376168, 1394807, 1413780, 1433224, 1453113, 1473686, 1495733, 1519990, 1546546, 1575012, 1604890, 1635551, 1666407, 1697440, 1729281, 1762612, 1797823, 1835233, 1874943, 1916284, 1958150, 2000241, 2043383, 2088354, 2135043, 2183227, 2233458, 2286477, 2342175, 2399777, 2458933, 2520130, 2584126, 2651250, 2721242, 2793744, 2869126, 2948678, 3033540, 3123555, 3217728, 3315719, 3418201, 3525806, 3638633, 3756942, 3881448, 4012689, 4150872, 4296707, 4451612, 4616754, 4792570, 4979530, 5178644, 5390963, 5617242, 5858242, 6114742, 6387265, 6676700, 6985242, 7315904]
55981G315904L55397L82835M14618M52078M94757N42334N96466O58929P29656
55972A1942974Q08919R00054J007621J134446J283378J460778J675736J938055
55964B2151961K260916K663730L166438L779247M501138N330490O278327P375181
55956E7507428Q665601J0182899J1908520J3748403J5562622J7238557J8742691
55949A53556721K0090891K1250826K2068963K2313082K1808744K0511107J8369628
55942B99969962J5083455J0082531K950899n964661j5342820k3382988k8672179
55935B54724199l0762870l0122431k7669695k4322394k0770950j7437239j4516839
55928H9121781j2054254j0020536q361740p015468n919655n023723m290789l689857
$$ y = [7315904, 7671301, 8054136, 8468754, 8920832, 9415589, 9957923, 10554389, 11213318, 11942974, 12751893, 13651947, 14659568, 15794014, 17077392, 18538170, 20213906, 22151961, 24412877, 27076607, 30243045, 34022292, 38523430, 43853920, 50132247, 57507428, 66173029, 76355928, 88264448, 102012851, 117575473, 134814030, 153556721, 173647612, 194898438, 216967401, 239280483, 261089227, 281600334, 299969962, 315053417, 325135948, 328086847, 322122186, 306779366, 283396378, 254724199, 223961329, 193838898, 166169203, 141846809, 121075859, 103638620, 89121781, 77067527, 67046991, 58685251, 51669783, 45750128, 40726405, 36435616, 32745759]
55920C2745759l192271k776246k427993k136042j888450j676027j493519j336156
55912A5819055j198344j076234r68279q72602p86664p09585o41817n82307n28690
55903H454533m80376m38603m03178l71836l43133l17475k94832k73842k53711
55894E277547k34999k17988k02011j86752j72501j58923j45189j31469j18758
55885C708957j07087r5380q3100p0576n7866m4823l2150k0811j0529m87Q779J5830
55873C210757K0457K3326K3539J8668P618q277k7300m8539p0470r0251j05471
55862B954057j15677j21669j24484j25400j25529j24623j21244j14601j05418
55853A875412r4890q3933p3627o5046n8147n1976m6290m1836l8727l5938l2973
$$ y = [32745759, 29553488, 26777242, 24349249, 22213207, 20324757, 18648730, 17155211, 15819055, 14620711, 13544477, 12576198, 11703596, 10916932, 10207347, 9565530, 8983223, 8454533, 7974157, 7535554, 7132376, 6760540, 6417407, 6099932, 5805100, 5531258, 5277547, 5042548, 4824560, 4622549, 4435797, 4263296, 4104373, 3959184, 3827715, 3708957, 3601870, 3506490, 3423390, 3352814, 3294948, 3250125, 3217975, 3197164, 3186635, 3186148, 3194927, 3210757, 3231214, 3254540, 3278079, 3296747, 3304365, 3296088, 3268788, 3220249, 3149779, 3059528, 2954057, 2838380, 2716711, 2592227, 2466827, 2341298, 2216675, 2095431, 1980830, 1875412, 1780522, 1696589, 1622962, 1557916, 1499769, 1447793, 1401503, 1359667, 1320940, 1285002, 1252029]
55842A252029l0710k9783k9282k7922k5675k3441k1779k0691j9995j9268j7929
55831I85554j6006j4332j3577j3556j3777j4062j4257j3962j3083j2152j1747
55820H35043j1917j2364j2784j2909j2709j2518j2451j1905j0378q592p741p639
55808G01136o866m956l159k480k303j642o42P5O62J591K600L111L178L189K956
55793F96450K053P70j11m26p64j575k703l854m989o128p074p539p481p301p487
55778F41841p982q153p797p832r216j1403j2747j2569j1784j1208j0297q294n673
55765E16886l561k218j002L80J375J189n37l452o502q386q633q018p708q139q898
55750D52776r397r309q742q230q228q391p896o707n857o019o468o145n129m250
$$ y = [1252029, 1221319, 1191536, 1162254, 1134332, 1108657, 1085216, 1063437, 1042746, 1022751, 1003483, 985554, 969548, 955216, 941639, 928083, 914306, 900244, 885987, 872025, 858942, 846790, 835043, 823126, 810762, 797978, 785069, 772360, 759842, 747391, 735486, 725108, 716516, 708775, 701136, 694270, 689314, 686155, 683675, 681372, 679730, 679088, 679163, 679825, 681416, 684016, 687127, 690305, 693494, 696450, 698503, 699273, 699162, 698736, 697972, 696397, 693694, 689840, 684851, 678723, 671649, 664110, 656629, 649328, 641841, 633859, 625706, 617909, 610077, 600861, 589458, 576711, 564142, 552358, 541150, 530853, 522559, 516886, 513325, 511107, 510105, 510485, 511860, 513049, 512512, 509060, 502558, 494172, 485539, 477521, 469813, 461674, 452776, 443379, 434070, 425328, 417098, 408870, 400479, 392583, 385876, 380019, 374000, 367532, 361387, 356258, 352008]
55736C52008l675k851j694q92r18j431j801j771j486j254j361j826k375k852l510
55721C22311m544n527n735n031m056l526l581l737l333k162p41K46P91J472K434
55706B85281L031K852K392K223K030J225Rr45j598k533l975n539o835p603p473
55691B62542o361n023m383m365m146l468k797k224j297j30M22J04j90K23Q37R87
55675B30731R97J377J581O50j241k876l548l609l540l270k638j880j306r77q46
55660B09605q91r35o82o8O20J112J379J547J746K081K445K443J921J453J798K802
55644B28376L398K915J873J159R10O34K0q77j986l209m250m921n429n847n603
55629B07163m230k507j976l049m357m392l184j866j150q70o85m73j21M76J089
$$ y = [352008, 348333, 345482, 343788, 342896, 341978, 340547, 338746, 336975, 335489, 334235, 332874, 331048, 328673, 325821, 322311, 317767, 312240, 306505, 301474, 297418, 293892, 290311, 286574, 283241, 281079, 280338, 280584, 281375, 282847, 285281, 288312, 291164, 293556, 295779, 297809, 299034, 299043, 298098, 296500, 293967, 289992, 284453, 277618, 270015, 262542, 256181, 251158, 246775, 242410, 238264, 234796, 231999, 229775, 228478, 228348, 228770, 228874, 228684, 228907, 229744, 230731, 231728, 233105, 234686, 235336, 234095, 231219, 227671, 224062, 220522, 217252, 214614, 212734, 211428, 210451, 209605, 208714, 207779, 207097, 207029, 207649, 208761, 210140, 211687, 213433, 215514, 217959, 220402, 222323, 223776, 225574, 228376, 231774, 234689, 236562, 237721, 238631, 239265, 239285, 238408, 236422, 233213, 228963, 224042, 218613, 212766, 207163, 202933, 200426, 198450, 195401, 191044, 186652, 183468, 181602, 180452, 179582, 178897, 178424, 178303, 178779, 179868]
55614A79868J275R64O05O02Q56R41O03rn65r43j408k212l090l408k912j999j104
55597A68064k74L94M21m62j656k213j840r97k44J17j1l75m18L5M37L67L91J226
55579A62962K478L099L008L127L826M390M321M130M444N263O414P856R081R253
55565B33652Q501Q080Q543Q699P211M426J629p27k985n087o685q089r884j1693
55551B35591j2401j1599r980q309o870n833n253m709l741k746k569l207l713l494
55537A51167k915k455k137j904j833j742j307p93q02j184j030j51M32m2r00j053
55521A31351n18j71m00p86q93o85l72k15m50r60j272j153r90j229j671j703j084
55504A16799j34O84J088J059Q68Q15P95L54n61j322j357q63m09j44J35M48O44
$$ y = [179868, 181143, 182107, 182712, 183314, 184170, 185111, 185714, 185705, 185140, 184197, 182789, 180577, 177487, 174079, 171167, 169168, 168064, 167790, 168184, 168605, 168143, 166487, 164274, 162434, 161437, 161193, 161310, 161299, 160924, 160506, 160541, 160978, 161345, 161736, 162962, 165440, 168539, 171547, 174674, 178500, 182890, 187211, 191341, 195785, 201048, 207462, 215318, 224399, 233652, 242153, 250233, 258776, 267475, 274686, 279112, 280741, 280014, 277029, 271942, 265257, 257168, 247284, 235591, 223190, 211591, 201611, 193302, 186432, 180599, 175346, 170637, 166896, 164150, 161581, 158374, 154661, 151167, 148252, 145797, 143660, 141756, 139923, 138181, 136874, 136081, 135279, 134095, 133065, 132914, 133346, 133304, 132404, 131351, 130833, 130662, 130262, 129476, 128583, 127898, 127526, 127311, 126861, 125901, 124629, 123476, 122486, 121257, 119586, 117883, 116799, 116665, 117349, 118437, 119496, 120364, 121179, 121974, 122328, 121767, 120445, 119088, 118225, 117816, 117672, 117807, 118255, 118899]
55487A18899P45Q34P34K28m80q89p86l82J9K10J32J5K72R01J290R89M34L35N80
55468A24080M20l44j069j185q36m18q3J19P9j11j34J01L48N32R21J498J659R01
55450A26478m46j546j919j711j313j070j177j459j367n58N70J168Q41L4m84l21
55434A15720L31R58J089O10j75q08j019q13l31K52P52J011R92P54M09J10J3J41
55416A19996L64O48J124J749K046J577O35J08M63J174J380Q83J45n14j240k092
55400A28446k640k430j614p98l70k84m34q01j167j113o00k31n36j179j341q14
55384A12094j98J2J3J43K27k2l23j33M59P41L23m15r44j196j311j219q60n09m12
55365A06470l05L01J316K051J991J297M74j30m37n15n79q72j306j443r38P6J172
$$ y = [118899, 119644, 120478, 121212, 121440, 120960, 120071, 119285, 118903, 118922, 119132, 119264, 119279, 119551, 120452, 121742, 122731, 123165, 123500, 124080, 124500, 124156, 123087, 121902, 121066, 120648, 120565, 120684, 120763, 120652, 120518, 120619, 120967, 121499, 122420, 123918, 125577, 126478, 126032, 124486, 122567, 120856, 119543, 118473, 117296, 115837, 114470, 113912, 114482, 115650, 116491, 116525, 116041, 115720, 116051, 117009, 118098, 118708, 118533, 117725, 116706, 115893, 115562, 115814, 116566, 117577, 118569, 119323, 119732, 119842, 119855, 119996, 120360, 121008, 122132, 123881, 125927, 127504, 128139, 128247, 128710, 129884, 131264, 132147, 132292, 131778, 130538, 128446, 125806, 123376, 121762, 120964, 120594, 120310, 119876, 119075, 117908, 116795, 116195, 115964, 115428, 114249, 112908, 112094, 111896, 111908, 111921, 112064, 112291, 112269, 111946, 111813, 112272, 113013, 113336, 112921, 111977, 110781, 109470, 108251, 107391, 106882, 106470, 106165, 106466, 107782, 109833, 111824, 113121, 113595, 113465, 113028, 112513, 111934, 111062, 109756, 108313, 107375, 107451, 108623]
55348A08623J957K109J394jj301j688j104k35K25J73p6k09p3L27Q19J106J015
55331A13061O52L13J71J04j35n45p85n79j66p0l61n32k69Rj94o03n44j5K72l9
55311A09745m60m59j12L25R15J576J707R09j66m54J07M95N5o83q72m87j45j00
55293A11896K8N28J063J026K48q10j589j941k030j841j167j14P45J044J175J698
55277A09959K346K226J070k78q57o12j14K63M87N25L81K89L80L10l08j141j399
55260A13527q59j72K1k23n10o96p95o86l20J9M3j23j55o3r4k46k18R7M34N59N20
55239A10060M35L05J26J6M3R2L0o9j7K36N28O20M32J10j39l45p49j334j569r28
55219A07883L27J228J091J81o65q32l20L86O72L15k41l06K58R23J227J184Q56
$$ y = [108623, 110580, 112689, 114083, 114082, 112781, 111093, 109989, 109754, 109979, 110152, 110076, 109867, 109794, 110121, 110940, 112046, 113061, 113713, 114026, 114197, 114301, 114166, 113621, 112836, 112257, 112091, 112021, 111660, 111128, 110859, 110868, 110674, 110071, 109527, 109512, 109784, 109745, 109285, 108826, 108714, 109039, 109954, 111530, 113237, 114146, 113980, 113526, 113633, 114128, 114183, 113500, 112628, 112141, 111996, 111896, 111924, 112452, 113515, 114541, 114789, 113979, 112390, 110449, 108419, 106578, 105411, 105297, 106042, 107086, 108261, 109959, 112305, 114531, 115601, 115323, 114466, 113854, 113740, 114003, 114490, 115015, 115396, 115685, 116065, 116375, 116067, 114926, 113527, 112668, 112496, 112517, 112294, 111784, 111088, 110293, 109607, 109287, 109306, 109349, 109226, 109071, 109008, 108914, 108668, 108450, 108547, 108981, 109540, 110060, 110495, 110800, 110926, 110942, 110985, 111077, 111107, 111038, 111021, 111257, 111785, 112405, 112837, 112947, 112808, 112463, 111714, 110380, 108811, 107883, 108210, 109438, 110529, 110710, 110045, 109213, 108893, 109279, 109951, 110266, 110025, 109719, 109977, 110900, 112127, 113311, 114167]
55202A14167P3r80j403n08J079J948J519N10k21o19r87j272j271j188j357j590
55186A07900j285k62Q73J378J187Q71Q67R79P77L09N8K61O16Q11Q89Q41L37o42
55168A16765j309r26Q4O58N61M87P05O88L33L85J079J365M58p50q82j54N2o25
55150A18974j088o20J34L27M6k14l55m15j73L71O74M11O7J49L15l6o47o40J77
55131A17457R68R39J95o39j183j447j494j235n79K60P04K76p37j378j052k23K38
55114A11070J68R6L28O25Q03J045J398J492J087N06J98J38M5j01j12K2J72L99
55096A19379Q02J064O81k50q59m50O34J381J259O40J25k22p14j364j674j262m36
55079A18734M5j49n68n75j70R0k9m2N20J242J172Q6j073j271n93M4J28K6J95N07
$$ y = [114167, 114240, 113260, 111857, 111349, 112428, 114376, 115895, 116405, 116184, 115565, 114578, 113306, 112035, 110847, 109490, 107900, 106615, 106353, 107226, 108604, 109791, 110662, 111529, 112508, 113285, 113594, 113652, 113913, 114529, 115340, 116229, 117070, 117407, 116765, 115456, 114530, 114614, 115272, 115833, 116320, 117025, 117713, 118046, 118431, 119510, 120875, 121333, 120583, 119701, 119547, 119599, 118974, 117886, 117266, 117400, 117727, 117773, 117559, 117204, 116789, 116616, 116987, 117661, 118072, 118139, 118288, 118603, 118567, 117920, 117280, 117457, 118425, 119364, 119559, 118920, 117737, 116290, 114796, 113561, 112982, 113242, 113946, 114222, 113485, 112107, 111055, 110832, 111070, 111238, 111334, 111662, 112287, 113090, 114135, 115533, 117025, 118112, 118618, 118816, 118954, 118999, 118898, 118786, 118808, 118980, 119379, 120181, 121245, 121926, 121676, 120817, 120367, 121001, 122382, 123641, 124281, 124406, 124184, 123470, 122106, 120432, 119170, 118734, 118779, 118630, 118062, 117487, 117317, 117407, 117378, 117336, 117856, 119098, 120270, 120356, 119283, 118012, 117419, 117463, 117591, 117617, 117812, 118319]
55059A18319N36J24n68j254j550j147k54M11M73L74O14Q50M16m58p56n8R26J395
55041A18393J351J111O15k20r39j003n41r0J35K51K16n2j60M27J474K018J533
55024A24519N39j47l52m18n40o68q95j438k214k607j979l74J301K029J669J020
55008A19445P89Q01N28O7j7K98L63p1l41J76J103J546J229N82o5p71j471j763
54990A22428j385n85J78O56Q57P96M51o6l81j24O41J326J429J100Q82Q49N13k33
54972A29332o76j88P43J078O01Q6R5K81J46j36o1L60O08L58j53m51j94O56J763
54953A34248K448K101Q00o16j204p10L50J233J504J114K53p35j444j590j158l42
54937A36252N30J013P74K8m74k39L29N23L38M11R73J564J887K192K549K506J986
$$ y = [118319, 118855, 118979, 118411, 117157, 115607, 114460, 114206, 114617, 115090, 115464, 116078, 116928, 117344, 116886, 116130, 116072, 116998, 118393, 119744, 120855, 121470, 121250, 120311, 119308, 118767, 118677, 118812, 119063, 119279, 119227, 119067, 119494, 120968, 122986, 124519, 125058, 124911, 124559, 124141, 123601, 122933, 122038, 120600, 118386, 115779, 113800, 113426, 114727, 116756, 118425, 119445, 120234, 121035, 121563, 121630, 121613, 121911, 122274, 122203, 121862, 122038, 123141, 124687, 125916, 126498, 126433, 125662, 124191, 122428, 121043, 120458, 120636, 121292, 122149, 122945, 123396, 123330, 122949, 122825, 123466, 124792, 126221, 127321, 128203, 129052, 129565, 129332, 128656, 128468, 129211, 130289, 130890, 130976, 131071, 131352, 131498, 131362, 131301, 131661, 132269, 132627, 132474, 132023, 131829, 132485, 134248, 136696, 138797, 139597, 138981, 137777, 137067, 137417, 138650, 140154, 141268, 141521, 140786, 139342, 137752, 136594, 136252, 136782, 137795, 138569, 138597, 138123, 137884, 138213, 138736, 139074, 139485, 140458, 142022, 143909, 146101, 148650, 151156, 153142]
54920A53142J807K568L636M074M120M725N896O594O311N626N010M161K873J556
54906B12099L36j420l930o056o580n911n575o107o480n668m019k732k497k965
54892A52495l289k882j851p97k10k6J61N40R88J361J643J819J853J848K070K686
54876A58409L583M387M733M640M651N324O455P047O336M649K954J759Q04k58j381
54861B14092k375l245m077m870n609o343o966p101o458n244m106l513l271k735
54847A48179j669p17p62j742k550k350j643j496j990k100j210l3L84L4k23M6M14
54830A30572M04J35o7j83l53n02n19n19n42k44N93J398J330N02L4N71J412J501
54812A35523P79jl62l61m0N91J163J216Q05K76l68j192j577p71P42J436P03l59
$$ y = [153142, 154949, 157517, 161153, 165227, 169347, 174072, 179968, 186562, 192873, 198499, 203509, 207670, 210543, 212099, 212435, 211015, 207085, 201029, 194449, 188538, 182963, 176856, 170376, 164708, 160689, 157957, 155460, 152495, 149206, 146324, 144473, 143676, 143466, 143440, 143601, 144141, 145129, 146490, 148133, 149952, 151805, 153653, 155723, 158409, 161992, 166379, 171112, 175752, 180403, 185727, 192182, 199229, 205565, 210214, 213168, 214927, 215731, 215473, 214092, 211717, 208472, 204395, 199525, 193916, 187573, 180607, 173506, 167048, 161804, 157698, 154185, 150914, 148179, 146510, 145793, 145031, 143289, 140739, 138389, 136746, 135250, 133260, 131160, 129950, 129917, 130301, 130335, 130112, 130158, 130572, 130976, 131111, 131044, 130861, 130508, 130006, 129487, 128968, 128426, 128182, 128775, 130173, 131503, 132005, 132039, 132610, 134022, 135523, 136302, 136301, 135939, 135578, 135538, 136129, 137292, 138508, 139313, 139589, 139221, 138029, 136452, 135681, 136423, 137859, 138562, 138203]
54794A38203n87k53k39n56o19m23m04m77j53M43O20J46m92q84j040r01k13R04
54776A33075J851K220K164J914J505J128J300K292L627M543M834N112O066P566
54762A79197Q595Q292P019O012N895O097N920N461M928L769J421j470l600m693
54748B32843n703p193q534q911q288p080n584m156l325l205l238k877k145j312
54734A61292m92J14J60k97o09l33J71L50L37P18J675K793L581L889L811L523L177
54717A83860K885K776L041L705M400M636M220L179J449q50k951l969m028m239
54703A98114n264o493o928o332n239m247l663l403k998k114j220j143j791k048
54689A45231j295k77P4j10j43K4n6n08j105j664j860j164L18J456J400P81P30
$$ y = [138203, 137616, 137363, 137124, 136568, 135949, 135526, 135122, 134645, 134492, 134935, 135555, 135701, 135209, 134325, 133285, 132384, 132171, 133075, 134926, 137146, 139310, 141224, 142729, 143857, 145157, 147449, 151076, 155619, 160453, 165565, 171631, 179197, 187792, 196084, 203103, 209115, 215010, 221107, 227027, 232488, 237416, 241185, 242606, 241136, 237536, 232843, 227140, 219947, 211413, 202502, 194214, 187134, 181550, 177394, 174069, 170864, 167626, 164749, 162604, 161292, 160800, 160914, 161074, 160777, 160168, 159835, 160006, 160356, 160693, 161411, 163086, 165879, 169460, 173349, 177160, 180683, 183860, 186745, 189521, 192562, 196267, 200667, 205303, 209523, 212702, 214151, 213301, 210350, 206381, 202353, 198114, 192850, 186357, 179429, 173097, 167858, 163611, 159948, 156545, 153547, 151433, 150213, 149070, 147279, 145231, 143936, 143659, 143733, 143623, 143480, 143504, 143448, 142940, 141835, 140171, 138311, 137147, 137465, 138921, 140321, 141102, 141832]
54672A41832J131R38j2p94r40r76j165r18O0R55R13K19k36k54l85q99j339j144
54654A36986l96K26K09k20l87o3K29J1m18m63r8K94O79J247J650J234J84m11N1
54635A40544Q81J132Q39P26J012J152O21m72j458j619p32O32J504J391P16K63
54619A47132L00M33K18k90n75k44M87R46P49K27o2pJ15K17M33O92O90M26K89N12
54599A52688Q51R75Q57O12K57j59m36l83m2L48N22L48Ro4L14P27O42J56j28N7
54579A58151M06O62R29J223J242R29P65J127J616J535Q81M27P34J448J723J246
54563A75044N70L66N61N72K66J51M33N15o9p19n42K63O62L39J25O95J590J931
54545A82753J529R24P07J037J499J383M12p50j130n12N74J666K559K866K343J640
$$ y = [141832, 142963, 143901, 143889, 143095, 142155, 141179, 140014, 139096, 139156, 140111, 141024, 141243, 141007, 140753, 140368, 139469, 138130, 136986, 136590, 136816, 137025, 136805, 136418, 136355, 136584, 136595, 136177, 135714, 135616, 135910, 136589, 137836, 139486, 140720, 140904, 140493, 140544, 141425, 142557, 143396, 144122, 145134, 146286, 146907, 146435, 144977, 143358, 142626, 143258, 144762, 146153, 146869, 147132, 147432, 147865, 148083, 147793, 147218, 146974, 147461, 148407, 149156, 149383, 149321, 149314, 149429, 149646, 150079, 150771, 151461, 151887, 152176, 152688, 153539, 154514, 155371, 155983, 156240, 156081, 155645, 155262, 155220, 155568, 156090, 156438, 156447, 156383, 156697, 157424, 158066, 158222, 158094, 158151, 158557, 159219, 160148, 161371, 162613, 163542, 164307, 165434, 167050, 168585, 169466, 169893, 170627, 172075, 173798, 175044, 175614, 175980, 176541, 177113, 177379, 177530, 177963, 178478, 178409, 177690, 177148, 177411, 178073, 178412, 178537, 179232, 180822, 182753, 184282, 185206, 185913, 186950, 188449, 189832, 190244, 189494, 188364, 187852, 188426, 190092, 192651, 195517, 197860, 199500]
54529A99500J679K194J943P16j53J97Q07M71m17o41m2N28N75K52l45j052j236
54512B04976m95M01K83q31j847k081j802j371q62n01n87q85q05k84K20N69J033
54495A95131J504J490R35L28p3m09n77k34M26P45O75Q84J580K040J758J224J126
54478B08553J437J836K371L106L619L458K768K001J336Q44Q20J402K144K452K315
54463B40462K171K207K200J943J554J275J217J146O40l40j130j038l70j23n44
54448B51270p12M2J014J081K11p36j316j767k164k176j736j238r22o15k76l08
54432B39652j007k094l011l442l376k888k129j337p04k43J25M50P20Q43O21p2
54416B22108r99j610j508q33p3L94N38M89L36J26o0j65k41l56l98j81K51N71O08
$$ y = [199500, 201179, 203373, 205316, 206032, 205879, 206076, 206883, 207354, 206937, 206296, 206254, 206782, 207357, 207609, 207264, 206212, 204976, 204481, 204882, 205165, 204334, 202487, 200406, 198604, 197233, 196371, 195870, 195283, 194398, 193593, 193309, 193529, 194098, 195131, 196635, 198125, 199060, 199388, 199315, 198906, 198329, 198095, 198521, 199266, 199941, 200825, 202405, 204445, 206203, 207427, 208553, 209990, 211826, 214197, 217303, 220922, 224380, 227148, 229149, 230485, 231329, 232149, 233551, 235695, 238147, 240462, 242633, 244840, 247040, 248983, 250537, 251812, 253029, 254175, 254815, 254475, 253345, 252307, 251937, 251814, 251270, 250558, 250600, 251614, 252695, 252906, 252170, 250854, 249087, 246923, 244747, 243011, 241773, 240851, 240236, 239960, 239652, 238645, 236551, 233540, 230098, 226722, 223834, 221705, 220368, 219664, 219421, 219546, 219996, 220716, 221559, 222180, 222108, 221109, 219499, 217991, 217158, 217085, 217479, 218017, 218506, 218842, 218968, 218908, 218743, 218502, 218146, 217748, 217567, 217818, 218389, 218997]
54397B18997N47N34L79l4k68K04J128J604J185L98j7R9M51P67Q81O61K54M6J23
54378B27939O2m67j199j706j996k239k234j654o43L33J040J449J326N64j89mJ068
54361B21450J827J386K56m53m78m78q66j257j207r29r78j432j792j652j135o27
54345B11635l44l91r20j869k646k608j882j316j474k023k329k204j784j125l47
54330A88373J59J82O3J91L26M7m26n32l84o37j269j398o36K28L86J77L71Q66R14
54311A87001M02qK4N0l04p15p46n25m01k56L36J374K265K428J851J016M59L67
54293A94618M40J18q30j937k472k229j712j430j372j359j552k143k698k478j445
54278A71519m89l02n39m78j42j57o18q35l27M20N09l19j428j931j444l67M04K97
$$ y = [218997, 219544, 220078, 220457, 220423, 220155, 220359, 221487, 223091, 224276, 224674, 224657, 224756, 225207, 225974, 226855, 227516, 227770, 227816, 227939, 228001, 227534, 226335, 224629, 222633, 220394, 218160, 216506, 215863, 216196, 217236, 218685, 220011, 220575, 220386, 220382, 221450, 223277, 224663, 224919, 224466, 223988, 223510, 222644, 221387, 220180, 219251, 218273, 216841, 215049, 213397, 212262, 211635, 211291, 210900, 209980, 208111, 205465, 202857, 200975, 199659, 198185, 196162, 193833, 191629, 189845, 188720, 188373, 188532, 188714, 188777, 188968, 189294, 189341, 188915, 188383, 187999, 187362, 186093, 184695, 184059, 184287, 184673, 184850, 185221, 186087, 187001, 187403, 187395, 187419, 187469, 187165, 186450, 185704, 185179, 184778, 184522, 184858, 186232, 188497, 190925, 192776, 193792, 194251, 194618, 195058, 195176, 194346, 192409, 189937, 187708, 185996, 184566, 183194, 181835, 180283, 178140, 175442, 172964, 171519, 171030, 170728, 170189, 169711, 169569, 169412, 168794, 167959, 167632, 168052, 168561, 168242, 166814, 164883, 163439, 163072, 163476, 163773]
54260A63773l12m45L47J410J730J046l4p64q04j81P98J549J524P87M1j46L4n0
54242A70303n54r67q37m28l52o50o81m7P03P21K1n10k87K31L05r7n03p67j092
54223A64512j352j069k23N18O05K54m2k29n15q10q07m52j2K50J62l78j097j290
54205A58025n70M35O82m2j008j662k071k192j593l16P34R10P49R98J338J006L11
54188A55734L06J031J252K73j002j392r73n51l32KL58K91j08k38L5J19l75j075
54170A53355j427j340j042o74l55l02n81q63p53k72K29N18O32P02P85Q87R64R08
54152A51371O75L94K26J57N4o7pL60Q75J266J440J490J453J226P59K17k02n00
54134A61187q03j095j151q44l73j01k04m87m88J88J438K472K382J093l14o86m6
$$ y = [163773, 163461, 163016, 163363, 164773, 166503, 167549, 167515, 166751, 165947, 165766, 166564, 168113, 169637, 170424, 170465, 170319, 170353, 170303, 169749, 168782, 167945, 167517, 167165, 166515, 165834, 165787, 166490, 167211, 167232, 166722, 166435, 166666, 166971, 166874, 166371, 165604, 164512, 163160, 162091, 161868, 162386, 162991, 163245, 163203, 162974, 162459, 161649, 160842, 160390, 160378, 160628, 160790, 160412, 159315, 158025, 157455, 157890, 158572, 158530, 157522, 155860, 153789, 151597, 150004, 149688, 150422, 151332, 152081, 153079, 154417, 155423, 155734, 156040, 157071, 158323, 158596, 157594, 156202, 155229, 154678, 154346, 154348, 154706, 154997, 154889, 154651, 154686, 154805, 154430, 153355, 151928, 150588, 149546, 148872, 148517, 148215, 147634, 146771, 146018, 145746, 145975, 146493, 147125, 147827, 148612, 149499, 150463, 151371, 152046, 152440, 152666, 152823, 152877, 152810, 152803, 153163, 154038, 155304, 156744, 158234, 159687, 160913, 161672, 161889, 161687, 161187, 160384, 159289, 158138, 157294, 156921, 156820, 156616, 156129, 155641, 155829, 157267, 159739, 162121, 163214, 162900, 162214, 162168]
54117A62168N61M32p3l75o21j270j996j828m82J082J718J320N91M6k53k22K55
54100A61053Q54R23L21l65n95m81k96P7P34J219R43L3q13j191j271j264j129q46
54082A57906n60l49j92j33j93j66J18M20M58N10J045J797J981J579J513K209K767
54065A70710K167P10m06n76j92J30J09k32o34p25m75l19m91o30m29k60n41q79
54047A67037n51L45J044J208J204J321J443J531J739J961J919J780K042K730L282
54032A90035L373L227L076K903K891L380M172M514M098L491L263L244L008K539
54018B37214K079J757J672J916K225K091J503J040R01N15m92j558j990j957k047
54003B44869k261k163j734j405j443j892k834m083m866m487l249k111j473r64
$$ y = [162168, 162729, 163161, 163088, 162713, 162092, 160822, 158826, 156998, 156516, 157598, 159316, 160636, 161227, 161273, 161020, 160798, 161053, 161907, 162830, 163151, 162786, 162191, 161710, 161414, 161491, 162225, 163444, 164387, 164420, 163607, 162416, 161145, 159881, 158752, 157906, 157346, 156997, 156805, 156672, 156479, 156313, 156431, 156851, 157309, 157819, 158864, 160661, 162642, 164221, 165734, 167943, 170710, 172877, 173587, 173181, 172605, 172413, 172543, 172652, 172420, 171786, 171061, 170586, 170267, 169776, 169146, 168717, 168457, 167916, 167037, 166486, 166831, 167875, 169083, 170287, 171608, 173051, 174582, 176321, 178282, 180201, 181981, 184023, 186753, 190035, 193408, 196635, 199711, 202614, 205505, 208885, 213057, 217571, 221669, 225160, 228423, 231667, 234675, 237214, 239293, 241050, 242722, 244638, 246863, 248954, 250457, 251497, 252398, 252913, 252421, 250863, 248873, 246916, 244869, 242608, 240445, 238711, 237306, 235863, 233971, 231137, 227054, 222188, 217701, 214452, 212341, 210868, 209904]
53989B09904l40Q7N4k02l78n10p81j109j199q86l40Nj28m70m76o9K42K40M41J215
53969B05300J921J676O71k1J70Q88J803L057M624N938O549O674O780P037P436
53954B60503P953Q401Q452Q025P270O122M284J745j101l962o670q608q879p479
53940B76056n650m532l956l107j821n48N97J812K844L078K515J925J761J583Q26
53925B73383k85j035j100p32l19r0j85n39p35k66Q37J916K421K570L037L978M716
53908B87572M561L673K877K681K839K909K953L421M373N078M644L006J165J67
53894C31919K1j10p15j429j842k200k799l184k744j916j914l099m377m611l982
53879B97018l534l720m112m285m427m826n212m878l560k019j450k130k986k816
$$ y = [209904, 209564, 209651, 209705, 209503, 209125, 208615, 207834, 206725, 205526, 204640, 204300, 204305, 204177, 203707, 203231, 203162, 203404, 203644, 204085, 205300, 207221, 208897, 209568, 209547, 209717, 210605, 212408, 215465, 220089, 226027, 232576, 239250, 246030, 253067, 260503, 268456, 276857, 285309, 293334, 300604, 306726, 311010, 312755, 311654, 307692, 301022, 292414, 283535, 276056, 270406, 265874, 261918, 258811, 256990, 256442, 257039, 258851, 261695, 264773, 267288, 269213, 270974, 272557, 273383, 273098, 272063, 270963, 270231, 269912, 269822, 269637, 269098, 268363, 268097, 268934, 270850, 273271, 275841, 278878, 282856, 287572, 292133, 295806, 298683, 301364, 304203, 307112, 310065, 313486, 317859, 322937, 327581, 330587, 331752, 331919, 331940, 331830, 331115, 329686, 327844, 325644, 322845, 319661, 316917, 315001, 313087, 309988, 305611, 301000, 297018, 293484, 289764, 285652, 281367, 276940, 272114, 266902, 262024, 258464, 256445, 254995, 252865, 249879, 247063]
53865B47063j766r89j024j276j275j477k342l292l388k630j836j456j218r19q24
53850B21351j117j518j565j065k04N39O59P9p21j270j606j899j932j468r43j056
53834B06264j674j828r24N50J674J931J288M1j137j527j089m89j93K6M46P84P52
53817B04895O64R72J440J364N45m43q91n60K56R36R56M55K05O66J341J539J493
53800B15833K024L198M071M006L477L287L514L725L821M066M525M982N351N802
53786B71682O449P225P992Q545Q599Q141P664P758Q377Q935R048Q873Q574P893
53772C85755O459M134Q29l532q479j2718j5017j5339j4590j3370j1604r443p721
53759B85364p030o924o554n797n096m493l608k509j886k088k597k781k603k298
$$ y = [247063, 245297, 244308, 243284, 242008, 240733, 239256, 236914, 233622, 230234, 227604, 225768, 224312, 223094, 222175, 221351, 220234, 218716, 217151, 216086, 215882, 216421, 217080, 217159, 216438, 215168, 213562, 211663, 209731, 208263, 207320, 206264, 204590, 202762, 201838, 202388, 204062, 205993, 207281, 207322, 206185, 204658, 203569, 203080, 202887, 202913, 203359, 204143, 204895, 205559, 206531, 207971, 209335, 209880, 209437, 208546, 207986, 208242, 209178, 210134, 210589, 210794, 211460, 212801, 214340, 215833, 217857, 221055, 225126, 229132, 232609, 235896, 239410, 243135, 246956, 251022, 255547, 260529, 265880, 271682, 278131, 285356, 293348, 301893, 310492, 318633, 326297, 334055, 342432, 351367, 360415, 369288, 377862, 385755, 392214, 396348, 397177, 393645, 385166, 372448, 357431, 342092, 327502, 314132, 302528, 293085, 285364, 278334, 271410, 264856, 259059, 253963, 249470, 245862, 243353, 241467, 239379, 236782, 234001, 231398, 229100]
53745B29100j812j123p02r67j500j441o29K64P23Q79Q88N29k12p37n64j4L40N83
53727B23605J115J625J270J8r94q91j85J3m31o40J0J183K221K841L073K998K815
53710B39646K822L066L288L421L743M287M554M237L845L977M191L424J519l98
53696B85622j324j469j566j702j421o31K49Q91J235J197P16N9l62m97n66n58l24
53679B79549j41n60j445j856j232k30Q8m06q96p71k44J38J73P3J07K65K33k32
53661B72613r12j289j204j030j031r24m31P3J6m89q61r40j065j241j056n30l52
53644B59347q34j330j152n67k41j03L96J148J339O86k8l6L69L25l40r02p41o0
53626B57276N39Q83J268J864K383K476K233K023J946J700J108N47P05J828L363
$$ y = [229100, 227288, 226165, 225463, 224496, 222996, 221555, 220926, 221190, 221913, 222792, 223680, 224209, 223997, 223260, 222696, 222682, 223022, 223605, 224720, 226345, 227615, 227633, 226639, 225748, 225563, 225576, 225145, 224505, 224515, 225698, 227919, 230760, 233833, 236831, 239646, 242468, 245534, 248822, 252243, 255986, 260273, 264827, 269064, 272909, 276886, 281077, 284501, 286020, 285622, 284298, 282829, 281263, 279561, 278140, 277509, 277758, 278649, 279884, 281081, 281797, 281856, 281494, 280997, 280431, 279873, 279549, 279408, 278848, 277403, 275547, 274315, 274085, 274173, 273767, 272871, 272100, 271856, 271994, 272167, 272240, 272347, 272612, 272845, 272613, 271701, 270412, 269208, 268178, 267147, 266223, 265792, 265865, 265881, 265392, 264531, 263591, 262526, 261285, 260229, 259699, 259347, 258513, 257183, 256031, 255464, 255223, 255120, 255516, 256664, 258003, 258689, 258661, 258625, 258994, 259319, 258979, 258077, 257336, 257276, 257815, 258698, 259966, 261830, 264213, 266689, 268922, 270945, 272891, 274591, 275699, 276246, 276951, 278779, 282142]
53611B82142M417M576M221L938L813L520L053K827K907K626J552M17L54J329K096
53596C23788J829J052O91Q68J083R96N48k74j204j626j248o01l30l04l6L46K07
53579C25785n81j429j783j571r63k47M4m26j214j520j228r87j162j385j309j168
53563C08856j271j433j315q62j95O48J496J972J941J700J559J491J435J488J597
53548C19107J464J076R20J387K202K800K933K763K658L039M005M949N160N022
53534C59485N847Q041J0178J0670R715Q731Q396Q354Q569R626J1530J3234J3910
53521D86286J3896J4020J4592J5486J6657J8105J9646K1093K2392K3323K3518
53510F89014K3092K2935K3896K5826K7720K8706K8615K7793K6768K5995K5589
$$ y = [282142, 286559, 291135, 295356, 299294, 303107, 306627, 309680, 312507, 315414, 318040, 319592, 320009, 320363, 321692, 323788, 325617, 326669, 327360, 328228, 329311, 330307, 330855, 330581, 329377, 327751, 326503, 325902, 325572, 325268, 325232, 325578, 325785, 325204, 323775, 321992, 320421, 319458, 319211, 319255, 318829, 317615, 316095, 314867, 313880, 312718, 311333, 310024, 308856, 307585, 306152, 304837, 303975, 303780, 304428, 305924, 307896, 309837, 311537, 313096, 314587, 316022, 317510, 319107, 320571, 321647, 322567, 323954, 326156, 328956, 331889, 334652, 337310, 340349, 344354, 349303, 354463, 359485, 365332, 373373, 383551, 394221, 403936, 412667, 421063, 429417, 437986, 447612, 459142, 472376, 486286, 500182, 514202, 528794, 544280, 560937, 579042, 598688, 619781, 642173, 665496, 689014, 712106, 735041, 758937, 784763, 812483, 841189, 869804, 897597, 924365, 950360, 975949]
53499I75949K5257K4706K4028K3556K3371K3230K3000K2860K2980K3188K3087
53488A235212K2464K1397K0133J8952J8145J7761J7429J6650J5448J4467J4183
53477A432241J4248J3927J2997J1714J0125Q046N707L636J719q67m300p427r176
53464A492590j0065j1526j4020j6679j8689k0119k1331k2387k3289k4235k5313
53453A284937k6332k7088k7486k7404k6806k6015k5402k4824k3876k2700k1903
53442A005101k1629k1264k0323j9022j7755j6534j5142j3408j1105q189n284l303
53430H32143k286j210O95L103N409P663J0103J2455J4384J6151J8064J9802K1014
53417I57490K2202K4075K6308K7911K8702K9511L0882L2480L3988L5691L7865
$$ y = [975949, 1001206, 1025912, 1049940, 1073496, 1096867, 1120097, 1143097, 1165957, 1188937, 1212125, 1235212, 1257676, 1279073, 1299206, 1318158, 1336303, 1354064, 1371493, 1388143, 1403591, 1418058, 1432241, 1446489, 1460416, 1473413, 1485127, 1495252, 1503298, 1509005, 1512641, 1514360, 1513493, 1509193, 1501766, 1492590, 1482525, 1470999, 1456979, 1440300, 1421611, 1401492, 1380161, 1357774, 1334485, 1310250, 1284937, 1258605, 1231517, 1204031, 1176627, 1149821, 1123806, 1098404, 1073580, 1049704, 1027004, 1005101, 983472, 962208, 941885, 922863, 905108, 888574, 873432, 860024, 848919, 840730, 835446, 832143, 829857, 828647, 829342, 832445, 837854, 845517, 855620, 868075, 882459, 898610, 916674, 936476, 957490, 979692, 1003767, 1030075, 1057986, 1086688, 1116199, 1147081, 1179561, 1213549, 1249240, 1287105]
53406A287105M0279M2670M5143M7720M9982N1626N3024N4796N7049N9288O0991
53395A849673O2042O2750O3492O4197O4237O3188O1643O0713O0654O0574N9725
53384B532888N8318N6625N4030M9859M4753M0211L6760L3457K9362K4705K0227
53373B981195J6085J1971P826L797l74n229j0903j6994k3222k9755l6788m4110
53361B853499n1293n7975o3817o8431p1626p3560p4519p4650p4044p2873p1233
53350B099478o9170o7023o5447o4741o4368o3528o2054o0342n8602n6745n4902
53339A412556n3347n1826m9620m6576m3505m1134l9086l6424l2913k9269k6211
53328I62645k3741k1358j8675j5811j3268j1390r864p951n371k701o95N76J642
$$ y = [1287105, 1327384, 1370054, 1415197, 1462917, 1512899, 1564525, 1617549, 1672345, 1729394, 1788682, 1849673, 1911715, 1974465, 2037957, 2102154, 2166391, 2229579, 2291222, 2351935, 2412589, 2473163, 2532888, 2591206, 2647831, 2701861, 2751720, 2796473, 2836684, 2873444, 2906901, 2936263, 2960968, 2981195, 2997280, 3009251, 3017077, 3020874, 3020500, 3015271, 3004368, 2987374, 2964152, 2934397, 2897609, 2853499, 2802206, 2744231, 2680414, 2611983, 2540357, 2466797, 2392278, 2317628, 2243584, 2170711, 2099478, 2030308, 1963285, 1897838, 1833097, 1768729, 1705201, 1643147, 1582805, 1524203, 1467458, 1412556, 1359209, 1307383, 1257763, 1211187, 1167682, 1126548, 1087462, 1051038, 1018125, 988856, 962645, 938904, 917546, 898871, 883060, 869792, 858402, 848538, 840587, 835216, 832515, 831820, 832396, 834038]
53315H34038K896M320N763P132Q330R280J0149J1286J2872J4695J6299J7331J7904
53302I72295J8657K0201K2466K4722K6423K7691K8916L0156L1195L1951L2478
53291A267151L2814L3032L3157L2882L1721K9774K7901K6680K5589K3804K1425
53280A585930J9219J7316J5027J1989Q771O087M051K340O23j469m296p825j1550
53267A646213j5023j8156k0880k2929k4286k5574k7593l0551l3857l6671l8557
53256A352136l9709m0586m1274m1365m0579l9395l8670l8668l8730l7978l6136
53245I19046l3725l1709l0823l0986l1379l1259l0616k9820k8973k7993k7011
53234E84752k6149k5095k3496k1633k0017j8482j6413j3859j1544r756q046o341
$$ y = [834038, 836934, 841254, 847017, 854149, 862479, 871759, 881908, 893194, 906066, 920761, 937060, 954391, 972295, 990952, 1011153, 1033619, 1058341, 1084764, 1112455, 1141371, 1171527, 1202722, 1234673, 1267151, 1299965, 1332997, 1366154, 1399036, 1430757, 1460531, 1488432, 1515112, 1540701, 1564505, 1585930, 1605149, 1622465, 1637492, 1649481, 1658252, 1664339, 1668390, 1670730, 1671353, 1669884, 1665588, 1657763, 1646213, 1631190, 1613034, 1592154, 1569225, 1544939, 1519365, 1491772, 1461221, 1427364, 1390693, 1352136, 1312427, 1271841, 1230567, 1189202, 1148623, 1109228, 1070558, 1031890, 993160, 955182, 919046, 885321, 853612, 822789, 791803, 760424, 729165, 698549, 668729, 639756, 611763, 584752, 558603, 533508, 510012, 488379, 468362, 449880, 433467, 419608, 408064, 398308, 390262, 383921]
53222C83921n418n791o819p459p387o956o487o121n914n764n503n285n354n347
53208B98316m555l137k242k412k726k193j272j036j539j963k033k266k901l509
53194B64532l628l169k200j000j78j15l63k93j53p29j956k610j734J67J585J420
53178B49576o9j534j760r02j81k86o03m56l25q89j528r95N73J653J397O12L43
53161B44626N91Q50R92J040P64J08n07p63q29q46o15j01K90L61M70Q38J034O72
53143B48975O5k90m02n16n78n07n30p53q14n55n49j242j949j517Q7J569J796R01
53125B43191j51o86p97r84j464j816j454m65L43M03J5k91n82j161j815k010j707
53108B28569j338j044n33K83R59J023M32n10j385j835j742j325q66m59j86k66
$$ y = [383921, 378503, 372712, 365893, 358434, 351047, 344091, 337604, 331483, 325569, 319805, 314302, 309017, 303663, 298316, 293761, 290624, 288382, 285970, 283244, 281051, 279779, 278743, 277204, 275241, 273208, 270942, 268041, 264532, 260904, 257735, 255535, 254535, 254357, 254242, 253879, 253586, 253433, 252704, 250748, 248138, 246404, 246571, 248156, 249576, 249507, 247973, 246213, 245311, 245130, 244844, 244241, 243785, 243460, 242571, 241043, 240048, 240621, 242274, 243671, 244283, 244626, 245217, 246067, 247059, 248099, 248863, 248971, 248464, 247701, 246872, 246026, 245411, 245310, 245600, 245961, 246431, 247269, 248303, 248975, 249040, 248750, 248348, 247832, 247254, 246747, 246217, 245464, 244650, 244095, 243546, 242304, 240355, 238838, 238925, 240494, 242290, 243191, 243040, 242354, 241557, 240573, 239109, 237293, 235839, 235374, 235717, 236120, 236135, 235844, 235262, 234101, 232286, 230276, 228569, 227231, 226187, 225654, 225937, 226896, 227919, 228351, 227841, 226456, 224621, 222879, 221554, 220688, 220229, 220043, 219777]
53092B19777p30j173j258j231j474j720j370m40L56N45L22K4l04o44q57r56j155
53075B07712j431j464j086m92J05N94P37L14l90p46n81k95r3L03R13J197R21O50
53057B06868Q12Q64R9j141j869j799j470j183p40k01q6m96p99n31j7K97N57J019
53039B00184J293P66l74j147r06k0O70P11K27l86p24n60j36r5q09j796k123j531
53021A93244p53m84m18K17J340J957J522O64J81j01p55j540j622r81o07j043j564
53004A89257j308m93J12L60N81N99k5q96q97K90J588J846J117K33l01m81l68j54
52986A91060k92r55j607j635j169o76r8P86J388Q24n93j366p93J34L55K95R11
52969A86569J954K296J726J207J362J720J707J480J397J305R20M03P7q7l05n13
$$ y = [219777, 219047, 217874, 216616, 215385, 213911, 212191, 210821, 210381, 210737, 211282, 211604, 211628, 211324, 210680, 209823, 208867, 207712, 206281, 204817, 203731, 203239, 203344, 203938, 204675, 204989, 204599, 203853, 203272, 202977, 202884, 203187, 204100, 205297, 206218, 206868, 207680, 208544, 208643, 207502, 205633, 203834, 202364, 201181, 200441, 200240, 200154, 199658, 198859, 198328, 198311, 198608, 199165, 200184, 201477, 202243, 201869, 200722, 199816, 199796, 200466, 201177, 201404, 201018, 200294, 199734, 199598, 199503, 198694, 196898, 194775, 193244, 192491, 192007, 191589, 191806, 193146, 195103, 196625, 197289, 197470, 197369, 196614, 195074, 193452, 192471, 191864, 190821, 189257, 187949, 187456, 187568, 187928, 188509, 189108, 189083, 188187, 187290, 187580, 189168, 191014, 192131, 192364, 192063, 191582, 191214, 191060, 190768, 189813, 188206, 186571, 185402, 184726, 184628, 185414, 186802, 187626, 187033, 185667, 184874, 185008, 185363, 185658, 186569, 188523, 190819, 192545, 193752, 195114, 196834, 198541, 200021, 201418, 202723, 203643, 204046, 204123, 204036, 203731, 203218]
52953B03218n79o78j045j446j423j043r19j303j618j197k96J26m68j560k268k267
52937A85234j877j403q76l29R1L84P18R91Q01J06m89m84k13l03p06q58o59n70
52919A79558p16o29j18K82J26k20j93O7L4l11m16K6P28J230J290R10L39P4M24
52900A82485R70Q77n7r86r60o3P19O99K02m5J23L08L25M86R50J277J038N71M99
52881A89418O51J92j051k062j910r53k65j79j11L19P01N16n8l65l2O72J168J139
52863A87790Q14O41P24P46N61N35J031J773K093J773J250J066J327J744J868J359
52847B07095L21o69j166j444k022k769k978k418j738j533j588j398j018q84j001
52832A84790r23n18j94k09k08K39Q86J028M57k10l15J6K02R6M8J02k07r99j516
$$ y = [203218, 202639, 201961, 200916, 199470, 198047, 197004, 196085, 194782, 193164, 191967, 191671, 191797, 191329, 189769, 187501, 185234, 183357, 181954, 181078, 180749, 180840, 181224, 181942, 182933, 183734, 183840, 183351, 182867, 182654, 182351, 181645, 180787, 180128, 179558, 178842, 178213, 178095, 178377, 178503, 178283, 178090, 178157, 178191, 177880, 177464, 177490, 178218, 179448, 180738, 181648, 181987, 182061, 182485, 183455, 184332, 184275, 183289, 182329, 182266, 182985, 183684, 183886, 183841, 183964, 184272, 184597, 185083, 186033, 187310, 188348, 188919, 189418, 190069, 190261, 189210, 187148, 185238, 184285, 184020, 183841, 183730, 184049, 184750, 185266, 185208, 184843, 184811, 185483, 186651, 187790, 188604, 189245, 189969, 190715, 191276, 191811, 192842, 194615, 196708, 198481, 199731, 200797, 202124, 203868, 205736, 207095, 207416, 206747, 205581, 204137, 202115, 199346, 196368, 193950, 192212, 190679, 189091, 187693, 186675, 185791, 184790, 183867, 183349, 183155, 182946, 182738, 182977, 183863, 184891, 185348, 185138, 184823, 184839, 185041, 185137, 185185, 185287, 185080, 184081, 182565]
52813A82565j048K1O70N98M82R25J732K312K304J711Q65L27L77N91M06KJ2K79
52795A95131j33j425k481k345j571j316j772k292k570k747k630j835o60O2J08
52780A71524L6J92K91J58Q8J03l65j484k322j777J2J814K658K584K148J707J297
52763A78664Q53L42k16o77p68k64P34J730K197K064J669J246O83L2k29J88O85
52746A88933L65o68j288p80K57Q11P00M39K95N8l31n71m83k77j63M5O18J380J726
52727A91066J301N14J24L20M76R8l45K4J163J986J686O27l78j134j860k372k202
52710A91094j467r13r81j263j122n04J05K81L1l18m34k41NL8p4m6J44J06m51j222
52690A82768j560j142k95L91O02M76L33L23L17J12k57m16K2R13J522J229L15j98
$$ y = [182565, 181517, 181538, 182208, 182806, 183288, 184213, 185945, 188257, 190561, 192272, 193137, 193464, 193841, 194432, 194838, 194840, 194852, 195131, 194998, 193573, 191092, 188747, 187176, 185860, 184088, 181796, 179226, 176479, 173849, 172014, 171354, 171416, 171524, 171560, 171752, 172043, 172201, 172289, 172392, 172027, 170543, 168221, 166444, 166456, 168270, 170928, 173512, 175660, 177367, 178664, 179517, 179859, 179643, 178966, 178198, 177934, 178668, 180398, 182595, 184659, 186328, 187574, 188257, 188289, 188060, 188248, 188933, 189298, 188630, 187342, 186562, 186819, 187630, 188330, 188769, 189064, 189122, 188791, 188220, 187737, 187460, 187297, 187342, 187960, 189340, 191066, 192367, 192881, 193005, 193325, 193801, 193899, 193554, 193578, 194741, 196727, 198413, 199040, 198662, 197528, 195668, 193296, 191094, 189627, 188714, 187733, 186470, 185348, 184844, 184949, 185230, 185261, 184943, 184509, 184268, 184273, 184311, 184237, 184191, 184335, 184441, 183990, 182768, 181208, 180066, 179771, 180162, 180764, 181240, 181573, 181896, 182213, 182325, 182068, 181652, 181674, 182587, 184109, 185338, 185653, 185455]
52672A85455L26J427K115J920J089K1r96j600j453o65K44R36J409J533J025J78
52656A92964p2P02J653J669P69j02l87k85K3O54J461J970K055K116K250J945R50
52639B10335j41o77q55j283j915k109j638j035q90j189j498j424q84j14M44N71
52623A95698O10J092J954K471K080J092L11Q7R7m5k60j65L49R10R61K76q28j706
52605B04984j958j799j745j911j784r12L00R03N32j14j69L26O48M65K14M04R11
52588A99295J292J369J257R68L66m87j212j386r23j16N66P63M99J66J89N69Q60
52571B04035O38pn03l66K94Q56Q18L24k0J72O14O88J40o28j041r66p63p58q70
52552B02657q00m56j0L72O22O77M93K52K28M02M24J60qK97Q31R69N10j58o24q54
$$ y = [185455, 185781, 187208, 189323, 191243, 192332, 192353, 191357, 189757, 188304, 187639, 187883, 188819, 190228, 191761, 192786, 192964, 192892, 193594, 195247, 196916, 197685, 197583, 197196, 196911, 196934, 197588, 199049, 201019, 203074, 205190, 207440, 209385, 210335, 210194, 209517, 208662, 207379, 205464, 203355, 201717, 200682, 199792, 198603, 197105, 195681, 194797, 194683, 195127, 195698, 196308, 197400, 199354, 201825, 203905, 204997, 205308, 205395, 205492, 205447, 205187, 205022, 205371, 206281, 207242, 207518, 206690, 204984, 203026, 201227, 199482, 197571, 195787, 194875, 195175, 196078, 196610, 196496, 196327, 196653, 197301, 197766, 197980, 198384, 199295, 200587, 201956, 203213, 204181, 204547, 204060, 202848, 201462, 200539, 200423, 200989, 201752, 202251, 202417, 202606, 203175, 204035, 204673, 204666, 204163, 203797, 204091, 204947, 205765, 206089, 206069, 206241, 206855, 207543, 207683, 207055, 206014, 205048, 204285, 203527, 202657, 201857, 201401, 201391, 201763, 202385, 203062, 203555, 203807, 204035, 204437, 204861, 205021, 205013, 205310, 206141, 207110, 207620, 207462, 206838, 205984]
52532B05984r33p81l31K21N98P10O47M82K67J00M3N6N7N1O0J05K75P14J405K003
52512B11733K097J639J047Q24J080J500J723J731J771J937K014J807J432J086
52498B33421P06J01o24j088j129j047j215j642k008j992j528q96n46o58q58o11
52482B18386J05P96J143J294J355J061L00l76k48O79J653K091K091K048K043J820
52466B36241J229N13J26K69O83R77J051J060J007P53L91K84M57M08j89r39j316
52449B43005j465j872k388k396j889j699k319l090l021k004p76N6M34M53Q9n45
52433B20573j078j190q80l58J68N11N71M79M95O55O54K69k69n14l78k12l08n59
52415B18629o67m64N0P58J391J621J424J210J351J720J968K110K506L222L858
$$ y = [205984, 205051, 204270, 203939, 204160, 204758, 205468, 206115, 206597, 206864, 206964, 207007, 207063, 207120, 207171, 207231, 207336, 207611, 208325, 209730, 211733, 213830, 215469, 216516, 217340, 218420, 219920, 221643, 223374, 225145, 227082, 229096, 230903, 232335, 233421, 234127, 234228, 233604, 232516, 231387, 230340, 229125, 227483, 225475, 223483, 221955, 221059, 220513, 219855, 218997, 218386, 218491, 219287, 220430, 221724, 223079, 224140, 224440, 224064, 223816, 224495, 226148, 228239, 230330, 232378, 234421, 236241, 237470, 237983, 238109, 238378, 239061, 240038, 241089, 242149, 243156, 243909, 244300, 244584, 245041, 245449, 245260, 244321, 243005, 241540, 239668, 237280, 234884, 232995, 231296, 228977, 225887, 222866, 220862, 220086, 220142, 220576, 221029, 221118, 220573, 219495, 218305, 217425, 217067, 217235, 217746, 218317, 218796, 219291, 219946, 220600, 220869, 220600, 220086, 219708, 219496, 219188, 218629, 217962, 217498, 217548, 218306, 219697, 221318, 222742, 223952, 225303, 227023, 228991, 231101, 233607, 236829, 240687]
52400B40687M122M270M735N490O045O013N491M879M338L480J689j081l928n678
52386B80552n930n227m291l481k922k647k401j775q01j6L34O51J196J451Q43k22
52370B55314p94n94j39K78R25J816K310J939J117N85M90M31J82j20l75p44j341
52353B61280j952k222k002j439p46k3O26R06N40k59p67m69L51R40R46P15P35J048
52335B58208J320J304J126J171J706K608L515M147M407M272L879L718M222N091
52321C00694N488N207N046N575O102N609M343L498L509L573K995K140J768K076
52307C57623K760L486L952L959L675L472L318K888K334K309K903L275K796J921
52293D00671J465J455J389J147R67Q40N43J22k40o31j123j259n19P54J545J382
$$ y = [240687, 244809, 249079, 253814, 259304, 265349, 271362, 276853, 281732, 286070, 289550, 291239, 290158, 286230, 280552, 274622, 269395, 265104, 261623, 258701, 256054, 253653, 251878, 251077, 251061, 251395, 252046, 253242, 254693, 255536, 255314, 254520, 253926, 253787, 254065, 254990, 256806, 259116, 261055, 262172, 262757, 263247, 263678, 263860, 263740, 263365, 262621, 261280, 259328, 257106, 255104, 253665, 252919, 252896, 253522, 254428, 254968, 254709, 253942, 253473, 253824, 254764, 255710, 256425, 257160, 258208, 259528, 260832, 261958, 263129, 264835, 267443, 270958, 275105, 279512, 283784, 287663, 291381, 295603, 300694, 306182, 311389, 316435, 322010, 328112, 333721, 338064, 341562, 345071, 348644, 351639, 353779, 355547, 357623, 360383, 363869, 367821, 371780, 375455, 378927, 382245, 385133, 387467, 389776, 392679, 395954, 398750, 400671, 402136, 403591, 404980, 406127, 407094, 407934, 408477, 408599, 408359, 407728, 406605, 405346, 404827, 405581, 407126, 408508]
52277D08508P81M15L66M16N91J089J849K517K850K944L067L283L342L066K731
52262D37815K777L166L402L278L149L283L421L378L546M259N021M995M118L074
52248D88682K337J890J772K205L000L510L361K795K158J525R84P73R46J250J563
52233E18751K051K692L059K927K715K997L755M442M691M650M675M930N257N374
52219E72966N173M847M642M563M512M567M880N282N318M842M290M193M577N005
52205F39657N144N147N467O245O983O931O012N038M827N254N576N395M926M369
52191G16971L668K879K302K083K106K340K827L256L109K369J649J352J213Q23
52177G48947J48p69k016l405m348m628m767n209n548n188m306l543l013k327j457
$$ y = [408508, 409289, 409704, 410070, 410486, 411077, 412166, 414015, 416532, 419382, 422326, 425393, 428676, 432018, 435084, 437815, 440592, 443758, 447160, 450438, 453587, 456870, 460291, 463669, 467215, 471474, 476495, 481490, 485608, 488682, 491019, 492909, 494681, 496886, 499886, 503396, 506757, 509552, 511710, 513235, 514219, 514992, 515938, 517188, 518751, 520802, 523494, 526553, 529480, 532195, 535192, 538947, 543389, 548080, 552730, 557405, 562335, 567592, 572966, 578139, 582986, 587628, 592191, 596703, 601270, 606150, 611432, 616750, 621592, 625882, 630075, 634652, 639657, 644801, 649948, 655415, 661660, 668643, 675574, 681586, 686624, 691451, 696705, 702281, 707676, 712602, 716971, 720639, 723518, 725820, 727903, 730009, 732349, 735176, 738432, 741541, 743910, 745559, 746911, 748124, 748947, 749095, 748326, 746310, 742905, 738557, 733929, 729162, 723953, 718405, 713217, 708911, 705368, 702355, 700028, 698571]
52162F98571q14n27k55K17P43J179J526J648J419J156J354J875J984J412Q59R87
52146G13334J425J283M72l9O11K102L251L288K626K164K033J451lj528k041j681
52130G28748j595k232k644j840j61J215J719J832K345L668N680P829R462J0337
52116G64363J0659J0431R171O863M718M106M743M857L394J205l58j220k201l401
52102H17330m020l656k884k322j866j115L5J534L379N239O330O228N553N253N363
52087H40381N110M071K679J378L3j582l169m265m842n151n162m626l568k337j158
52072H17792m9Q46J211R82N16K07J08J13K40N33Q85J161J419J674J568O60q47
52055H29019j998k059j372r15j079j365j343j362j903k671k922k544k160k174
$$ y = [698571, 697757, 697230, 696975, 697192, 697935, 699114, 700640, 702288, 703707, 704863, 706217, 708092, 710076, 711488, 712347, 713334, 714759, 716042, 716514, 716475, 717086, 719188, 722439, 725727, 728353, 730517, 732550, 734001, 733998, 732470, 730429, 728748, 727153, 724921, 722277, 720437, 720276, 721491, 723210, 725042, 727387, 731055, 736735, 744564, 754026, 764363, 775022, 785453, 794624, 801487, 806205, 810311, 815054, 819911, 823305, 824510, 824152, 822932, 820731, 817330, 813310, 809654, 806770, 804448, 802582, 801467, 801502, 803036, 806415, 811654, 817984, 824212, 829765, 835018, 840381, 845491, 849562, 852241, 853619, 853652, 852070, 848901, 844636, 839794, 834643, 829481, 824855, 821287, 818950, 817792, 817743, 818589, 819800, 820782, 821298, 821505, 821613, 821726, 821966, 822499, 823384, 824545, 825964, 827638, 829206, 829866, 829019, 827021, 824962, 823590, 822675, 821596, 820231, 818888, 817526, 815623, 812952, 810030, 807486, 805326, 803152]
52041H03152k340k481k919l742m258l803k768k079j814j162K09J514J998K004
52027G81511K358L092L453L087K591K772L724M814N338N123M605M472N049N993
52013H37982O674O838O698O392N749M736L785L275K920K146R04l60j626l535o411
51998H76167r524j1809j3068j3959j5015j6195j7379j8595j9554j9543j8232j6332
51986F86962j4969j4520j4343j3625j2176j0431q998q268q258q603q759q342p430
51973E48240o626o653p664q842q976p626n576l982l181k557j402L47K279M059
51959D91840N695P278Q623R291R072Q324P603O993O079M705L292K177J008p00
51945E71280k717m265m912m791m032k521l09K253M904P550R820J1049J1030J0407
$$ y = [803152, 800812, 798331, 795412, 791670, 787412, 783609, 780841, 778762, 776948, 775786, 775995, 777509, 779507, 781511, 783869, 786961, 790414, 793501, 796092, 798864, 802588, 807402, 812740, 817863, 822468, 826940, 831989, 837982, 844656, 851494, 858192, 864584, 870333, 875069, 878854, 882129, 885049, 887195, 888099, 887739, 886113, 882578, 876167, 866643, 854834, 841766, 827807, 812792, 796597, 779218, 760623, 741069, 721526, 703294, 686962, 671993, 657473, 643130, 629505, 617329, 606898, 597900, 589632, 581374, 572771, 564012, 555670, 548240, 541614, 534961, 527297, 518455, 509479, 501853, 496277, 492295, 489114, 486557, 485155, 485502, 487781, 491840, 497535, 504813, 513436, 522727, 531799, 540123, 547726, 554719, 560798, 565503, 568795, 570972, 571980, 571280, 568563, 564298, 559386, 554595, 550563, 548042, 547733, 549986, 554890, 562440, 572260, 583309, 594339, 604746]
51931F04746R957R761R319Q278O628M438J742j277m365p393j0278j2777j4657
$$ y = [604746, 614703, 624464, 633783, 642061, 648689, 653127, 654869, 653592, 649227, 641834, 631556, 618779, 604122]
$$ [...]
##END NTUPLES=NMR SPECTRUM
##END=
