
##TITLE=AC1334_VIERS11074_6666252_IYIlxgpck1
##JCAMPDX= 6.0         $$ Bruker NMR JCAMP-DX V2.0
##DATA TYPE= NMR SPECTRUM
##DATA CLASS= NTUPLES
##ORIGIN= BRUKER
##OWNER= Administrator
$$ 1.72 TOPSPIN		Version 2.1
$$ 2012-08-13 17:26:10.656 -0500  Administrator@TOPSPIN
$$ Compression mode = diff/dup
##.OBSERVE FREQUENCY= 400.02188249412
##.OBSERVE NUCLEUS= ^1H
##.ACQUISITION MODE= SIMULTANEOUS (DQD)
##.ACQUISITION SCHEME= undefined
##.AVERAGES= 8
##.DIGITISER RES= 22
##SPECTROMETER/DATA SYSTEM= spect
##.PULSE SEQUENCE= zg30
##.SOLVENT NAME= COFFEE_meoh
##.SHIFT REFERENCE= INTERNAL, COFFEE_meoh, 1, 14.98509
##AUDIT TRAIL= $$ (NUMBER, WHEN, WHO, WHERE, PROCESS, VERSION, WHAT)
$$ ##TITLE= Audit trail, TOPSPIN		Version 2.1
$$ ##JCAMPDX= 5.01
$$ ##ORIGIN= Bruker BioSpin GmbH
$$ ##OWNER= Administrator
$$ $$ C:\Bruker\TOPSPIN/data/COFFEE/nmr/AC1334_VIERS11074_6666252_IYIlxgpck1/10/pdata/1/auditp.txt
$$ ##AUDIT TRAIL=  $$ (NUMBER, WHEN, WHO, WHERE, PROCESS, VERSION, WHAT)
(   1,<2012-08-13 17:25:59.765 -0500>,<Administrator>,<TOPSPIN>,<go>,<TOPSPIN 2.1>,
      <created by zg
	started at 2012-08-13 17:24:51.421 -0500,
	POWCHK enabled, PULCHK disabled,
       configuration hash MD5:
       6B 1B 68 BB D9 2E 58 E2 7F 35 AD 54 07 DF 0E 41
       data hash MD5: 64K
       5B 9F BB 58 E1 10 39 26 1A 71 FA 60 43 45 EC CD>)
(   2,<2012-08-13 17:26:04.953 -0500>,<Administrator>,<TOPSPIN>,<proc1d>,<TOPSPIN 2.1>,
      <Start of raw data processing
       efp LB = 0 FT_mod = 6 PKNL = 1 PHC0 = 0 PHC1 = 0 SI = 32K 
       data hash MD5: 32K
       C4 2C FC 19 2B C6 2D 35 11 17 BB F2 55 5C E0 1C>)
(   3,<2012-08-13 17:26:05.375 -0500>,<Administrator>,<TOPSPIN>,<proc1d>,<TOPSPIN 2.1>,
      <pk PHC0 = 182.5378 PHC1 = 0 
       data hash MD5: 32K
       C0 24 13 49 10 31 E1 EA E0 C7 0F 92 9F 5B 76 60>)
(   4,<2012-08-13 17:26:05.500 -0500>,<Administrator>,<TOPSPIN>,<proc1d>,<TOPSPIN 2.1>,
      <abs ABSG = 1 
       data hash MD5: 32K
       6D 21 5B 63 63 95 89 D4 1C 52 3E BE E5 76 E5 A4>)
(   5,<2012-08-13 17:26:05.703 -0500>,<Administrator>,<TOPSPIN>,<proc1d>,<TOPSPIN 2.1>,
      <abs ABSG = 2 
       data hash MD5: 32K
       78 A4 1F 93 9F A3 56 9F A9 1E A9 20 EC 99 01 79>)
(   6,<2012-08-13 17:26:05.765 -0500>,<Administrator>,<TOPSPIN>,<proc1d>,<TOPSPIN 2.1>,
      <abs ABSG = 3 
       data hash MD5: 32K
       58 32 3D 53 83 C4 73 92 CB 58 4D 04 6C 30 63 5B>)
(   7,<2012-08-13 17:26:05.843 -0500>,<Administrator>,<TOPSPIN>,<proc1d>,<TOPSPIN 2.1>,
      <abs ABSG = 4 
       data hash MD5: 32K
       32 03 F7 7D B8 FD C9 1D 12 4E FD AF 5E 97 4A 07>)
(   8,<2012-08-13 17:26:05.890 -0500>,<Administrator>,<TOPSPIN>,<proc1d>,<TOPSPIN 2.1>,
      <abs ABSG = 5 
       data hash MD5: 32K
       ED 57 B2 63 7A 25 66 67 8B C1 C6 CB 67 D8 4F EA>)
$$ ##END=
$$ 
$$ $$ hash MD5
$$ $$ A0 9A 9D 4D BE 2D 26 94 07 10 93 52 23 77 56 07
##$RELAX= 
##$RELAX= 
##$RELAX= 
##$RELAX= 
##$RELAX= 
##$RELAX= 
##$RELAX= 
$$ Bruker specific parameters
$$ --------------------------
$$ [...]
##$TP= (0..7)
150 150 150 150 150 150 150 150
##$TP07= 0
##$TPNAME0= <>
##$TPNAME1= <>
##$TPNAME2= <>
##$TPNAME3= <>
##$TPNAME4= <>
##$TPNAME5= <>
##$TPNAME6= <>
##$TPNAME7= <>
##$TPOAL= (0..7)
0.5 0.5 0.5 0.5 0.5 0.5 0.5 0.5
##$TPOFFS= (0..7)
0 0 0 0 0 0 0 0
##$TUNHIN= 0
##$TUNHOUT= 0
##$TUNXOUT= 0
##$USERA1= <user>
##$USERA2= <user>
##$USERA3= <user>
##$USERA4= <user>
##$USERA5= <user>
##$V9= 5
##$VALIST= <valist>
##$VCLIST= <CCCCCCCCCCCCCCC>
##$VD= 0
##$VDLIST= <DDDDDDDDDDDDDDD>
##$VPLIST= <PPPPPPPPPPPPPPP>
##$VTLIST= <TTTTTTTTTTTTTTT>
##$WBST= 1024
##$WBSW= 4
##$XGAIN= (0..3)
0 0 0 0
##$XL= 0
##$YL= 0
##$YMAX_a= 480823
##$YMIN_a= -618488
##$ZGOPTNS= <>
##$ZL1= 120
##$ZL2= 120
##$ZL3= 120
##$ZL4= 120
##$ABSF1= 14.98509
##$ABSF2= -5.573092
##$ABSG= 5
##$ABSL= 3
##$ALPHA= 0
##$AQORDER= 0
##$ASSFAC= 0
##$ASSFACI= 0
##$ASSFACX= 0
##$ASSWID= 0
##$AUNMP= <proc_prof1d_extract_pilot.lims>
##$AXLEFT= 0
##$AXNAME= <>
##$AXNUC= <1H>
##$AXRIGHT= 0
##$AXTYPE= 0
##$AXUNIT= <>
##$AZFE= 0.1
##$AZFW= 0.1
##$BCFW= 0
##$BC_mod= 0
##$BYTORDP= 0
##$COROFFS= 0
##$CY= 15
##$DATMOD= 1
##$DC= 0
##$DFILT= <>
##$DTYPP= 0
##$F1P= 0
##$F2P= 0
##$FCOR= 0.5
##$FTSIZE= 32768
##$FT_mod= 6
##$GAMMA= 0
##$GB= 0
##$INTBC= 1
##$INTSCL= 1
##$ISEN= 128
##$LB= 0
##$LEV0= 0
##$LPBIN= 0
##$MAXI= 10000
##$MC2= 0
##$MEAN= 0
##$ME_mod= 0
##$MI= 0
##$NCOEF= 0
##$NC_proc= -8
##$NLEV= 6
##$NOISF1= 0
##$NOISF2= 0
##$NSP= 0
##$NTH_PI= 0
##$NZP= 0
##$OFFSET= 14.98509
##$PC= 1
##$PHC0= 182.5378
##$PHC1= 0
##$PH_mod= 1
##$PKNL= yes
##$PPARMOD= 0
##$PPDIAG= 0
##$PPIPTYP= 0
##$PPMPNUM= 2147483647
##$PPRESOL= 1
##$PSCAL= 4
##$PSIGN= 0
##$PYNMP= <proc.py>
##$REVERSE= no
##$SF= 400.02
##$SI= 32768
##$SIGF1= 0
##$SIGF2= 0
##$SINO= 400
##$SIOLD= 32768
##$SPECTYP= <>
##$SREGLST= <1H.CDCl3>
##$SSB= 0
##$STSI= 32768
##$STSR= 0
##$SW_p= 8223.68421052631
##$SYMM= 0
##$S_DEV= 0
##$TDeff= 65536
##$TDoff= 0
##$TI= <>
##$TILT= no
##$TM1= 0
##$TM2= 0
##$TOPLEV= 0
##$USERP1= <user>
##$USERP2= <user>
##$USERP3= <user>
##$USERP4= <user>
##$USERP5= <user>
##$WDW= 1
##$XDIM= 32768
##$YMAX_p= 475947708
##$YMIN_p= -682135
##$CURPLOT= <Network HP LaserJet P1505>
##$CURPRIN= <$Network HP LaserJet P1505>
##$DFORMAT= <normdp>
##$LAYOUT= <+/1D_H.xwp>
##$LFORMAT= <normlp>
##$PFORMAT= <normpl>
##$SURQMSG= 1
$$ End of Bruker specific parameters
$$ ---------------------------------
##NTUPLES= NMR SPECTRUM
##VAR_NAME=  FREQUENCY,     SPECTRUM/REAL,   SPECTRUM/IMAG
##SYMBOL=    X,             R,               I
##VAR_TYPE=  INDEPENDENT,   DEPENDENT,       DEPENDENT
##VAR_FORM=  AFFN,          ASDF,            ASDF
##VAR_DIM=   32768,         32768,           32768
##UNITS=     HZ,            ARBITRARY UNITS, ARBITRARY UNITS
##FACTOR=    0.250966925370066, 1,           1
##FIRST=     8223.43324360094, 63923,        82940
##LAST=      0,             72974,           -17438
##MIN=       0,             -682135,         0
##MAX=       8223.43324360094, 475947708,    0
$$ Real data points
##PAGE= N=1
##DATA TABLE= (X++(R..R)), XYDATA
$$ [...]
23786 100587 -200819 -171878 -127680 -78174 -67634 -120036 -197448 19472 152863 -106438 71289
23774 55486 203879 15636 182405 152538 225012 112593 66702 -53058 72590 -17168 -362166
23763 -362166 -234387 35969 6294 164606 -247098 397837 154391 85478 -235383 -93842
23752 47585 -18122 -8172 -156642 68953 -107638 118820 -150868 4854 26740 -96922 319214
23740 312368 130645 -302703 358715 -248076 116976 -261970 -197639 -241767 -115527 41051
23729 -99199 4402 155029 85546 -44182 28983 196468 104728 90565 -193512 258562 -301281
23717 1592 -340973 205753 -132385 -236143 -367488 25437 67379 127885 -31057 43281 203381
23706 203381 -359896 -167629 109364 -372910 26409 180871 -29617 -270731 -368237 -253269
23696 -253269 10530 58497 -53581 -66492 118766 162687 198478 -267825 -152902 -142913 -94605
23685 -94605 -203321 181600 -144666 -14320 30393 -209927 -65996 252245 172758 65968 181501
23674 181501 151913 -105888 199786 -4640 -370480 281844 195315 -34521 353359 202422
23664 202422 175937 32031 -237193 -313394 46498 76553 -5339 328190 155522 185419 -85184
23652 78497 90402 136482 214160 -31557 -80263 430416 -164690 -253476 -136034 59618 231491
23641 231491 51251 -220016 -251435 -71688 -83695 -219654 -42526 -180924 244550 365232
23631 365232 -54159 58262 96663 46262 -42730 180107 -124262 115471 90287 -144052 -148323
23620 -148323 52511 5514 10868 -89137 -264735 -102191 -240179 198671 84140 6442 -96211
23608 330523 320714 -227443 -248657 -86729 -377609 -100117 -254074 -36781 -242955 -61465 56137
23596 -9509 74039 95514 -47422 -271360 -142537 230393 277281 -51166 222254 -291443 133613
23584 16608 443585 297355 131665 -101107 -23589 -89301 -157832 355743 32554 29071 71076
23573 71076 148583 50356 355627 191995 -18474 -113201 76185 26764 132823 341613 -213115
23561 -167240 151492 35343 -25918 64863 -52648 -36034 2260 9268 -253967 -14190 -185271
23550 -185271 163420 -429020 10397 -42679 -106212 -76287 -157257 58648 65526 140192 106755
23539 106755 129436 -69976 -404738 -26681 -468777 29383 23005 50149 4360 78001 177800
23528 177800 132393 87904 -29043 32686 -139525 198325 72986 -122897 -141081 290731 -30597
23516 205219 2003 14740 -77152 -156871 -36552 -31630 61530 -468312 20744 -10232 141598
23504 175913 228996 -145721 -271892 -14773 221725 46067 65025 -319258 -47037 -74983 -178509
23493 -178509 -67684 -288087 -45940 -200908 76185 -138915 189167 120468 -269292 -71806
23482 -47958 157415 52838 -34091 -370751 -75467 250669 -18421 80832 -201902 45969 -103976
23470 -237422 -341913 5631 90229 -83995 121640 105910 -233557 -107156 -80795 -329152 109143
23458 21260 268978 48854 61879 86764 -492463 -151451 323766 -76462 -218078 -176664 125853
23446 -335974 -25784 -82337 -297824 -291839 -57957 24997 -213117 115808 -464192 267864 -100265
23434 -7611 -154813 86840 -173728 -143983 -78086 -298329 252628 -72072 577562 177057 -199755
23422 -234069 206326 33821 -197916 -92198 32312 -39951 173731 -93353 234387 -55684 -115143
23411 -115143 75265 -171059 114605 -375222 221632 175715 -73816 211073 -313346 92791
23400 -131020 322615 -51699 9002 70986 -68826 288757 -181028 112665 -103439 -253699
23390 -253699 199043 23478 -129695 55769 -242320 -10980 124547 52745 99742 -30853 132460
23378 141151 -96612 -304586 -229052 -238348 -244609 -91654 -22805 98056 129767 200487 -21297 12872
23365 100292 27314 121944 117172 -284533 -102583 -308306 -147872 -2023 161767 -51785 467410
23353 -128279 -156150 -73665 190477 -63733 -180723 -103395 -173441 120746 29200 209119 -163211
23341 -21900 -121771 -228293 -111208 84562 -84876 49035 -216731 78912 264999 -10865 162052
23329 98646 143561 15049 -136712 -26212 -121416 -29767 -88068 -55843 -83132 48969 -120836
23317 -183386 104008 -181869 4601 -225899 169208 -244120 127469 25098 139092 -34970
23306 -174998 -276888 -205251 -216890 -162974 -14561 -129063 118236 42378 -36150 -88423 84778
23294 -98597 56735 119683 200832 107847 32238 254904 13780 -7442 -148690 -138945 -64585 7557
23281 -135196 174390 74071 -253820 -61111 -1693 -167844 60351 115419 -193980 -244791 -27457
23269 -59563 269210 261460 -205995 -136622 279444 -87078 -289951 436463 -85628 -148251 323443
23257 203055 -101446 227829 -210930 143105 -368356 133877 23720 334125 327039 -78675
23246 -80127 90453 -437704 309921 207238 -199484 -373851 -55276 198288 -2420 -50904 -277810
23235 -277810 210334 -146320 -45800 156415 -87144 259913 62417 -58339 337257 -152231
23224 52607 -387772 -283795 137808 239597 137597 -113664 -68715 -409445 148995 -118808
23213 57111 73879 6090 -382152 52153 -50055 -11988 -46950 -67133 -36678 -158873 200285
23201 108090 -39187 -48164 287586 170982 -111267 213347 -127668 47787 13916 -27339 -122475
23190 -122475 -5097 -87186 63825 92874 -209091 -52534 7149 196221 -236190 -23038 -43501
23179 -43501 -65696 -59127 -31509 200637 207927 78224 218112 -93906 45305 387890 -202529
23167 27888 -128927 -79292 -113802 102743 -22459 -157557 -4981 7517 88770 -111013 -2598
23155 299046 -131828 -146650 341030 -94113 144995 -33869 55974 -193140 -155970 157398
23144 2775 -95472 -105712 -203114 -66078 -153002 -87609 126463 83578 169610 410 -178055 -45780
23131 61366 -32520 -92216 -299866 73620 -69873 104356 18616 -73351 -56705 -153523 48503
23119 187828 105546 -424951 141454 110983 116630 -199603 -118038 -65677 52621 -69189 122952
23107 -106077 -209071 -79474 -126363 32005 83436 -15030 -14543 116457 195010 198142 -169861
23095 287312 -209941 -335564 10451 42599 348873 314180 3310 -85622 -38203 -56027 -14765
23083 149585 -252883 -246135 163691 -124688 1897 -242542 -6846 36202 -60267 150055 -199775
23071 102 -168685 210327 75993 -171420 -356153 -8017 -222964 -51077 -164912 -141883 -149270
23060 -149270 874 131388 111833 305441 -210832 -147426 8461 -329458 -246652 -75328 303924
23048 -112913 -180820 -117512 46784 329465 -21124 -141391 -182502 -3941 -264777 -101306 -210331
23037 -210331 339028 -105264 11103 25431 242708 -7833 -19434 -128539 -49336 59622 356372
23026 356372 99695 261222 -190572 63219 377618 220433 322623 -91337 -145575 317007
23015 -99180 329172 119334 -112106 134409 -269754 -32731 -57602 -150449 -79246 67015 -31197
23003 17694 -517700 7584 37586 -89547 184080 -184497 -193770 -9553 -67841 -172222 -19643
22991 -75810 235719 -35632 -43533 253500 277640 103924 66757 105848 -212947 163566 151086
22980 151086 262810 -81638 62854 164582 27807 34814 -321527 -373109 -199463 -134325 -35196
22968 -59528 -259018 -48608 -350518 -48573 4810 -91987 -253270 -8802 -77798 -420798 -272442
22957 -272442 177577 -143832 -51715 -27253 -141482 -151742 -16768 -43856 -265997 -232994 -255766
22946 -255766 95027 -331564 -302181 80862 -225518 121662 -8403 53895 -25277 6769 2496
22934 -211854 -117166 77745 -232268 -242355 112744 -156767 -72548 -178402 46267 -125340
22923 36810 182822 -256715 -249040 -186948 -2502 -136167 97515 -3856 -188498 21408 -52004
22911 399866 -75963 -49753 -96869 193828 192018 168457 97083 274250 -462301 -89159 115330
22899 69718 -228202 116765 -190414 -154336 54728 -174054 29046 18456 102021 2796 -156698
22887 20531 90353 -128762 -203522 -6435 -168373 295615 -145476 9424 -89608 -28377 151054
22875 15261 -20637 117847 -104340 -30630 273706 -169450 153991 40449 -82861 -406384
22865 -406384 199639 8713 -268943 169772 -58025 132166 221295 219486 120656 -322593 128316
22853 -153455 -169828 -316019 88399 36039 -271320 -218598 -188237 -78907 -124592 37907 -218597
22841 79668 -54516 243615 -108861 -164518 396624 99846 223156 -298543 77342 -72524 85728
22829 267612 -217169 -3831 155937 -204996 -268438 -92953 274365 51371 -34815 37617 -177379
22817 240805 -255510 -200120 -82616 -79197 263102 -195740 -117399 44439 59362 271619 -151630
22805 62156 -63378 -208990 -72137 -159714 -309465 -20882 -212256 -106842 5878 -133349 164074
22793 -89487 -235693 -89248 42523 -207923 -2849 146409 -298624 306391 -321424 6150 464336
22782 464336 -7307 -251386 -141670 -177022 -184009 -76159 -162100 -33842 103168 -112551 -30357
22770 -15544 -30062 -3012 -90579 33170 76120 -135459 -42616 147202 -478445 -306359 -43299
22758 48162 -147175 228869 111131 -458286 -140913 7731 -50982 -22406 -18976 -89855 -317973
22747 -317973 246002 60959 178813 15252 53488 22630 -51929 2017 -41402 82948 68623
22736 68623 -132303 174602 258058 -58781 164142 -155275 61408 -241582 -363272 191851
22725 -11048 -96620 -254788 101266 249049 -121015 21814 -126555 51907 86578 -47448 -121626
22714 -121626 33227 -384906 81036 -38624 -43594 221203 98794 -23376 -6980 -33799 99542
22702 -75447 -64387 -133305 64728 -84872 181757 -85043 -242926 -43835 -224954 204137 -221910
22690 38841 -79481 47635 26844 -345011 -52072 -188439 -260492 -126300 -50818 -102244 180126
22678 269186 -179616 199048 181014 70209 40550 -324279 179401 206358 -139043 244872
22667 388347 -27752 26591 -40971 201943 -202860 -239794 51302 -125942 -323603 -315638 -122785
22655 -177395 82284 29791 216981 183342 165992 -27338 101601 127008 39611 375914 83563
22643 61771 -111547 -258228 -58986 -253407 -174131 -183970 -119681 334057 361369 100873 54273
22632 54273 -80602 -29099 -90753 -166779 171058 235929 92946 250343 -244935 -271904 194555
22620 -49637 32471 -111095 5867 -113924 -134577 -241900 239759 -173549 125302 -163765
22609 -159519 -234549 21818 54063 -17563 -102953 -191425 -312100 -162084 71461 68401 -166139
22597 11924 -8322 17206 335938 -74694 -291670 -85053 -315638 -215077 59630 21297 136555
22586 136555 -265654 229221 -247693 -9285 -258123 -274318 -258962 -10826 -254566 484054
22575 -211759 -206246 -22232 -228174 -104386 -326912 -74587 73622 -36922 -103071 363952 -122257
22563 4980 -345435 757 179458 75468 -174967 104935 210721 34699 95593 -46790 -275768
22552 -275768 -442296 -30622 -12217 -154511 -238587 -187108 173940 225628 55586 86942 76352
22541 76352 79212 -206186 -177266 3592 246774 57694 -374644 -32156 139188 -36786 -193576
22530 -193576 -243003 -26673 -35822 202737 -275115 28474 60052 -292566 -122889 34523 103899
22519 103899 -116151 5035 39029 443544 -80529 -96660 -23040 -133283 175644 -309642 97535
22507 -14643 -330563 -55999 -41868 -397392 -114460 218233 118052 87533 49415 -417376
22496 -256035 -277989 -204932 -186970 11409 -156681 70929 331674 208290 31759 307341 239472
22485 239472 -97046 100666 -129878 -151724 -115308 -191059 -88143 142724 303114 -64636 -238416
22474 -238416 293509 -75908 118641 61998 -285636 -287339 152653 -170234 -285758 -110035
22463 -3746 -54526 -110532 -296965 184512 -168642 -126927 -325106 -339002 -78516 -22548 13158
22451 -215968 17583 112114 -123922 -97581 205519 -1559 56916 -178018 -378256 -317353 351136
22439 -392879 233880 202392 -170580 228406 -29231 -193462 -37090 -114464 63645 -273925
22428 35211 -371161 -54905 -78423 104318 54065 -235066 -80096 -89237 106638 235464 -283612
22416 185167 -177432 -385281 150892 4805 4503 163300 -231950 -292170 -37129 25391 49849
22405 49849 247645 89398 -83503 -176341 62075 72231 -47782 282768 -294897 -120724 -40067
22393 -85496 144687 133474 139206 589901 -173044 -288787 -166833 -64464 476359 321188
22383 321188 -4970 -33427 -160295 -37744 355961 -325840 -506344 -329141 -388917 -55578 -27878
22372 -27878 61318 -125821 -393386 -20639 183972 63365 -481798 81707 -118414 -60752 -234391
22361 -234391 -184256 -32053 -451756 58720 -9681 -48930 36213 -50230 117461 -304376 -208217
22350 -208217 -193554 -105162 9594 -256879 -106437 -339081 -137059 139219 6426 104339 -357899
22338 159148 137220 -161590 -199203 -395699 72635 -118137 237923 151342 -323320 -138579
22327 106717 169326 -117898 195412 -123481 41459 115711 5754 130110 -58327 -22904 105128
22315 202362 -196824 -204580 -641 -1563 -8573 56457 -46699 -3674 47459 71374 -162732 -296984
22303 -296984 167407 -259315 -246324 35781 -395155 -120082 -47662 19916 22117 149594 -134426
22291 -78658 77855 -304537 -52257 -86504 -26877 -45359 -11065 -95506 -53113 320622 194937
22280 194937 -63329 260490 -33233 -29244 301708 10814 127882 -377049 -109131 -64024 -196066
22269 -196066 98844 -148661 -204291 86389 9234 414605 -34262 -283710 -370070 -21477 112911
22257 -413652 -3145 -428165 486952 63170 7080 152510 119825 172666 257642 -112657 140948
22245 224102 -269110 174581 83440 -176356 -117831 -182315 83 -66032 84767 -167248 -163445
22234 -163445 -326734 26792 71159 -8479 -116157 -386194 -281985 -206726 -122703 -45615 23461
22222 -81095 6318 -46241 -201333 140213 7905 -222193 -232284 43009 401068 -240531 21330
22210 959 278651 422667 313566 -322774 161465 -33515 -75127 54110 13441 -366475 -177758
22198 -165395 -256428 -24981 -129766 24773 -259418 72495 -213318 -49388 111839 -283783
22187 -227037 211237 -234958 -219669 -35854 -314071 49122 -250200 141732 -2386 47432 -82255
22175 -14099 169703 84198 -39141 -16636 -21273 -125555 103244 29381 -89467 70562 -2028
22163 -169514 -158246 -177552 -330600 -258857 -374221 -58178 133253 -23272 -276434 -344329 -253210
22152 -253210 -22854 -445154 329258 -39520 169521 144154 -333788 -126467 126976 170369
22142 170369 296335 -232239 -109061 374512 -130793 157137 86751 -15956 -274318 -14496
22131 24885 -123724 -61917 35056 -111528 9711 112174 217648 -80965 -39953 133491 128799
22120 128799 -247501 -204624 -91410 57639 -138438 32480 162436 -35432 -39122 -56301 6098
22108 -123834 -105247 -400598 -240453 384570 -48615 -151745 -258745 -101133 238814 16593
22097 -131870 127753 -25730 -211902 366226 -118127 80968 175309 100992 -166880 281760
22086 86539 -8599 -259856 -201256 19506 150625 -148786 128365 176208 -120510 70624 -37035
22074 -405082 -179400 -111777 116615 -204351 87555 -78265 25842 -154256 -105300 316154
22063 -238238 -96559 114477 95059 -196981 49168 376193 -441899 103181 -66167 -201247
22053 -201247 -314533 -137461 -76849 -176075 -527291 59635 -257481 338355 -369600 -140903
22042 60250 117694 -85889 -477972 -121922 151902 299000 -314137 -105216 202390 -361379
22031 116158 290303 -290968 -96756 108203 64924 -273523 -53573 88521 -379742 25341
22020 -134789 -171078 169849 -74276 31321 -184056 193924 12344 -118696 22541 -129799
22009 -257337 89604 -168196 -41154 -9506 246372 -123321 55892 -174981 -94096 74017 -138707
21997 -57260 -342031 133159 73119 15279 83698 51348 -126192 165944 -94977 124479 19234
21985 -164715 36380 -156249 143141 -257897 -5592 18956 -250280 -174897 -274054 -135291 -149770
21974 -149770 -162587 -50910 -97529 -52034 275789 -491317 292973 10480 -139344 -114705 -128327
21963 -128327 -278429 -47763 -314704 24732 -238242 -342642 -97430 -19010 8842 -258110 152795
21951 -21673 -20019 -59249 -282555 58768 -245970 -187149 -10312 -95475 -239585 -278218 164801
21939 157089 -43431 -64580 -550928 219609 -389305 -139945 -77448 303517 -220833 -444534
21929 -444534 157911 -287695 -215477 -3970 -10019 -281619 5184 8056 140971 -299578 -132361
21917 241475 -62815 49559 348135 -75072 53542 12961 75793 -10192 127393 179590 33504
21905 21179 -157846 -72444 112528 -149281 -164110 -267332 -19310 -317945 -64577 -64604 -219629
21894 -219629 112300 -358984 1690 -18459 286903 171850 100798 -95505 -119140 -128481 158322
21882 -91308 -42671 -131656 -69221 -162582 -249300 -53230 157851 -206135 -129303 -7356 171642
21870 415033 113389 55462 -70399 -144620 -289846 18747 -115258 -217302 -16962 2604 35720
21859 35720 -63060 330552 -100514 193980 -207421 490654 -461939 -169427 -93541 1739
21848 -155950 -28012 -155089 -38999 32640 -189700 213194 -336634 -32539 -151531 -129217
21838 -129217 156252 173471 -67260 -177130 -4049 28182 162258 193740 -50948 -187040 -163720
21827 -163720 -261344 -463046 -23127 174136 28327 -24503 73781 154224 7271 103227 -401750
21815 97284 106103 -270140 -46415 331753 219140 -10514 -38372 -64042 73611 -260262 -80323
21803 27817 -379138 -77499 269644 254911 -82785 128904 -121515 70188 -74272 -68428 -145698
21792 -145698 -123486 20017 49298 -132686 -43729 -83408 64397 60682 -185600 -86566 100087
21780 -50024 -280046 166564 271512 -111595 -69257 109738 235593 221675 -174086 -167115
21770 -167115 -61385 -94150 -26082 -169108 -147515 -160663 26602 -188736 -101331 -106994 -134394
21759 -134394 196840 -294659 -173594 15497 -15159 -138675 -154639 115791 -118281 509762
21748 156474 -351648 -24138 -143162 -367757 42695 20047 117283 -24511 301493 235883 188735
21737 188735 -322529 -103184 -151178 -327653 -100500 5750 -282075 -118661 175909 -67278
21726 -268298 -185285 -80090 300224 137448 411744 -37662 -18557 52425 -192325 186155
21715 44493 -63684 -138525 137027 304557 -88025 -186995 -19872 -397077 -61329 -57302 -31059
21704 -31059 -395606 -43653 280953 58736 -169355 -305457 -166046 -125351 -271431 197592
21693 174141 222921 352104 77177 91428 93537 -53823 -117225 29210 -307634 -271 39321 36611
21681 36611 -78435 -232304 47897 -290504 -40719 -207481 1974 -90052 -258628 -521368 -150950
21669 148193 -245637 -185123 25673 -2984 -185249 123935 -40342 157802 -41092 218968 -64044
21657 -232613 -113877 -49803 82075 -142741 -513901 -360766 -261947 -77111 -178641 -143302
21647 -143302 -23452 12512 242817 -51634 -220807 -199006 -157030 80395 -244534 54539 -95687
21635 236824 -100152 12593 -304538 -113556 -153450 308740 130661 5872 -219269 -103469
21624 221230 -153526 453396 -363143 -6046 191012 99289 61462 277632 -65321 32602 -167255
21612 58496 -174283 236412 45101 -321327 99853 173755 -133211 -135687 -85861 63162 98616
21601 98616 -286270 -35251 -64206 -83746 -107901 -9818 -41788 -180573 -87247 35571 -78506
21589 235549 -281924 -268334 -448151 173639 285436 -32618 142705 3388 -231585 43449
21578 -175802 -198084 -23767 50305 -287064 -135634 -241974 -227579 34197 70963 296526 -121433
21566 -367689 -50403 -231694 207547 143272 113207 -497555 176571 -87685 -87638 -128856 164509
21554 -80312 75918 182098 -25606 139283 -116064 -28279 122743 -16563 -190631 54679 88535
21543 88535 -62253 -134049 33541 -242911 -100001 -162550 56686 -166413 -350016 -13411 -269323
21532 -269323 19299 -265410 27776 -105316 130210 -80943 143289 -34640 -51673 209595
21521 -150266 -185702 -387032 184785 -45711 104592 -299761 -198936 -151159 -139578 43029
21510 209362 -42951 104855 -151418 -127115 238174 238897 -204112 297047 43481 -33823 -183989
21499 -183989 -188743 -445992 214092 201055 -222418 211941 -42641 14570 -333211 -112896
21488 210224 308313 39405 -57053 -290236 -401644 -214510 -213343 -20206 -204629 -104847 109922
21476 172574 106550 -103114 -262864 -49115 99942 -190599 164739 -42537 348128 -264674
21465 -19382 -294797 63292 192773 -13020 9159 -155156 180972 151364 171908 -140418 -242631
21454 -242631 66743 -53431 -193121 -351195 -59990 21630 265646 -67629 114134 -229864
21443 -155224 216070 -180962 103590 -42418 20941 222138 -107575 26024 -19671 162287
21432 18609 78398 114044 -6519 171478 357011 229149 904347 677493 575400 581498 593201
21421 593201 497734 327739 110689 123813 230998 299 -32619 -48650 21972 -340432 74709
21409 -33846 26212 -87081 -67236 67740 73211 103566 -115793 122592 -286653 -98724 233591
21397 -44390 89760 -12144 -339403 -248949 -321761 217688 -38676 -166165 -191738 99944 -360433
21385 -55436 -347990 354792 -75616 256786 14914 6671 122921 -124890 -134077 88215 107281
21374 107281 -83586 -172535 13173 -142324 121669 529708 -45247 78889 -188449 153847
21363 -49648 35818 126325 -265966 218030 -136521 -138617 -223652 213767 -297286 -104453 128460
21351 -113054 -34004 -680367 -518910 -139457 48710 208144 158655 -198853 -208243 -161676 85630
21339 19305 266689 -205732 -180853 -247621 -67726 -78375 -48136 -63176 169542 -108764 -12545
21327 -324717 100999 1427 -55068 18838 -91698 -114235 -59003 -335734 -77274 -72139 47701
21315 -152131 -196120 -47240 -31944 -396776 -428615 19913 48890 -79307 380265 -87975 -196704
21304 -196704 49853 -220600 146162 -5021 139311 335880 293351 -306060 -130626 60722
21293 -61885 -54950 -294103 -9448 -231976 173097 -81519 -14158 119255 112709 58578 -148374
21281 -194460 -148494 -62280 -369235 186138 42169 -209094 76169 -67409 33327 248058 -245401
21269 37202 68191 84938 256378 -180847 169120 477789 -70228 37730 127125 -208550 -148988
21258 -148988 -143251 139443 2398 -349176 77917 -11419 -33919 155112 -246544 -12478 -232872
21247 -232872 98997 158488 -3597 -124241 112197 162560 -27644 38963 -31856 285127 -105929
21235 251295 -59923 213454 96362 -184754 -74394 125473 82480 190118 -53004 -10224 263775
21223 -52242 -115428 -419078 -205457 208085 -323015 -90592 -344880 -145171 -59843 31949
21212 -166830 -418560 -378643 -47742 -245665 -233434 -30685 -45256 3040 -209347 76724 176169
21201 176169 -240018 -166953 56373 -288417 59943 -301710 123524 -337706 59883 62394 -29440
21189 15463 -133360 242341 -26485 -160722 -108566 116160 -514306 -286452 -291701 140938
21178 -278587 40726 -169142 50447 -295575 -4954 -98771 -127877 134320 -72360 -157453 -56531
21166 126515 -140656 -76759 -59842 -184269 -140637 -98785 -46342 36693 156640 124705 252712
21155 252712 57444 -396693 -216075 -199160 19758 -341751 -10975 -106614 -199425 -23581 135528
21143 -94968 -112362 -48207 59305 182361 -52795 89928 -114099 77746 -98450 20833 2934
21131 -254364 -101330 56560 -113014 -12470 97477 170185 -228461 17233 -191549 120682
21120 -178163 116202 64266 -224089 -1488 -286634 -187645 -28866 -127351 -407762 180825 -191421
21108 -202317 -108149 8287 -54072 28913 -189765 905 -12593 -67756 -483193 -297171 -197857
21097 -197857 119387 -182587 -40958 13846 -145837 -130146 79084 -52146 -220430 -29806 -235053
21086 -235053 225274 -241871 -157575 87636 -108854 234872 -79955 -32110 -42260 10682 142474
21075 142474 -155015 -96611 90435 120005 -55056 -76272 -6328 338997 -244320 -312020 -41541
21063 -32796 -36634 148357 168800 47455 -228438 -10622 -110073 -178850 108037 -57393 198450
21051 24642 -3546 -218230 -127497 -188789 62520 -124513 -38170 381812 -14169 -7212 247856
21039 134474 81121 178141 38613 19472 -56738 327966 240725 -153627 63795 53626 -91975
21027 20722 -1866 214859 -38241 16729 62879 9181 390637 447569 257647 -29958 -227290
21016 -227290 280659 -172035 16077 322050 58549 513966 -54588 -145876 -401760 -117825
21005 -134422 -51989 57953 283099 -237069 -20566 47684 -106531 152208 112932 73350 -339820
20993 124850 75668 559547 314557 558753 -131430 -420521 -107563 76376 127777 -94588
20982 -79869 141193 -40425 35043 -318859 74789 -275782 -120804 -139547 185557 -28709 -180079
20971 -180079 255794 -165969 -216447 -136312 110868 68593 -431402 -38436 -34668 25068 187079
20960 187079 58331 -388339 138167 129267 -89055 -172762 -187876 249187 -75090 -191634 47247
20948 -224365 -317863 -125239 -313402 285677 -309843 -25198 -120536 -197585 21321 -205576
20937 -29568 -415574 -53616 -119008 -135329 270842 -122615 466764 -71496 191615 -4358 -96346
20926 -96346 -259614 21528 -60692 -318458 -75491 -166094 75713 -1099 -1324 -176412 326990
20914 5961 228447 -51156 401465 192494 -199619 -7533 92990 -213302 -94489 -498629 93012
20902 300550 78266 -82459 -260992 -311012 -207015 -254481 -222876 -165054 -58361 147064 -48689
20890 75348 -372252 -101785 -41205 -118880 -16708 260523 45982 213227 -402295 37299 -69266
20878 -42086 -27755 -319319 18044 -70002 -214725 -120650 -183331 139228 -147517 -166765 -44831
20866 -212358 97243 138220 -118688 -168516 -85618 224902 -144469 -77086 -64798 -123730 76419
20854 41516 -79901 -179196 247669 -119216 85083 -38214 -118303 67737 143778 -440148 22493
20842 -26165 -123599 -223312 -119757 228344 -446881 202570 125508 -92405 -19822 -216648 -190957
20831 -190957 -229858 88288 320538 -35292 92359 -318403 -28677 -180657 23553 -159644 84863
20819 -145098 -261371 -201083 -82711 158617 252285 -229318 -22807 -357443 94886 52367 -43470
20807 -98215 -264975 -28199 -39936 -39081 58831 257823 -37201 -294266 -198598 94772 -143218
20795 -11422 -63747 332361 1205 52851 -471489 9662 -30104 192705 179596 -160320 -53939
20783 -222417 75899 -248107 -267608 7160 188394 -103902 -227611 302064 -215831 49590
20772 -106485 -269900 -28020 -203892 9943 37963 -99566 11934 -159195 -104143 -125919 43795
20760 -90079 17378 -179019 -16195 55700 110682 328638 -14046 3236 -5229 242747 229959
20749 229959 117940 39130 -59166 182078 -1670 134032 -46598 -308545 -123207 -343030
20739 -343030 227993 -79937 -77090 -217186 98058 151511 18727 22935 -267381 -70536 -152538
20728 -152538 -227132 -146426 310113 185008 -76169 47884 -240898 2411 -221726 -133232 -102429
20717 -102429 185337 -92458 -277060 -175745 -71174 -32670 -196181 -345911 -102877 -77028
20707 -77028 -156161 94315 182472 -346599 138173 -214862 -85578 -263279 55278 34223 488455
20696 488455 112602 -503256 -57274 -66649 35280 -42476 -115920 -153542 -156404 -154351 308062
20684 -120015 8032 -79609 137141 235735 -117320 -133922 -124114 120007 30507 -8110 -32724
20673 -32724 -284381 37483 -73962 -143901 -195891 -431052 -189891 -369671 -146819 -129789 -166101
20662 -166101 -99842 159820 -236241 6974 -314493 -148233 -56345 -14836 128862 20102 -54279
20650 3630 -93032 -179229 -226671 -35184 129062 46584 174782 157299 -147892 -177776 -242860
20639 -242860 -189603 -38457 -9198 65102 -63319 -128632 135065 -30370 -43797 173760 -195596
20627 255163 -239703 103417 -25355 -18018 -227897 8701 -40148 -60697 -369216 -259113 -235067
20616 -235067 80608 -53772 -105805 199843 -498305 293762 -326068 -250430 -117099 -495662
20606 -495662 -218348 281593 -115702 188234 -83351 302247 -126282 35612 74402 -139219
20595 -104925 -49870 156256 -6505 155107 112663 44415 221050 -130234 49167 -107894 -177281
20584 -177281 -260109 -237007 25966 160945 90363 227161 112229 -73803 69148 37452 -121197
20572 13558 -124801 1674 54440 -130509 -103708 -193553 -40509 134437 -187374 191792 142970
20561 142970 -16620 -288314 8546 64986 -347074 -155796 205665 -207291 -29778 27591 -290123
20549 106187 177277 -215955 179639 -49559 277971 171830 -116562 11298 14421 -455962
20538 -198168 -96570 -141976 10259 88835 -283205 68938 -323642 -323892 -253034 -183423 -59256
20526 -14711 -316406 144944 -94081 26184 27568 251868 -27326 -451470 27743 209294 -304408
20514 -72682 -94893 -7609 34771 118799 -178742 -68394 -241557 -231549 -36376 23145 142314
20503 142314 -124933 -178296 113697 146704 -178051 144397 -417467 -339587 272230 49216
20492 -163820 -43785 -40563 118845 180837 -119609 -48108 -224170 98333 -158699 175200 -19569
20480 171117 -66992 -55194 63937 -414505 -474311 -95909 115702 101681 113934 -188300 116942
20468 -130048 175562 130895 141001 75629 -74358 38489 -341742 105831 323647 -85538 65695
20456 -101254 211081 -92116 -37974 140569 111839 318750 -422678 -288545 143842 265141
20446 265141 -6196 -2613 -7488 -73028 -239221 -391335 -92342 -220332 -206615 67332 166192
20435 166192 -405068 -170504 44134 -147425 26949 -396841 -196547 -250011 -172619 -85009
20424 356751 -241630 -198289 51146 -96201 -135074 -225 -82874 137435 -244073 249483 -105950
20412 -159836 -477181 45967 -273489 -199964 -17919 -190720 -19883 -1905 39416 -104134 300271
20400 -114202 -203626 -7113 102296 -385937 153154 -236908 -221678 -43715 95568 29178 153861
20389 153861 -189055 103087 110637 -49667 44882 -328840 159099 162987 -234502 -253737 -281224
20378 -281224 -254457 437736 -62417 -210623 107669 -286352 110640 -323298 109177 -224345
20367 -47159 -55933 -136968 -72371 -272227 -23378 -85046 110622 42539 174223 -199017 -206000
20356 -206000 159417 -137676 -115346 59527 -387175 76983 -328602 129857 -103550 -206330
20346 -206330 248007 103531 81473 76044 -92749 -190408 -83877 114711 -134425 -237369 -76681
20334 140794 163088 58505 -167348 -120676 -346258 19005 14744 -34535 -148214 -4672 -29161
20323 -29161 60373 197161 -98121 80259 -91286 20052 72144 40297 31447 52044 -212079
20311 -355551 2324 -194904 200412 5858 -5587 2939 32602 56131 -256113 -130660 78823
20299 6723 91081 -198912 138087 -132990 55162 -120026 137312 178876 -142862 206016
20288 -286848 -163165 329458 226918 -310481 94986 180972 -430743 138608 -428403 142711
20277 153579 -288612 87365 -177752 -113127 39985 5650 -20211 -251040 -15205 80326 127981
20266 127981 -149714 -288387 -206003 -217723 -290585 117837 111538 -788 393508 180942 -222008
20254 35342 -157545 170451 73395 -140480 -49008 -486995 -2010 -113250 276227 -216702
20243 77677 -117046 29516 53883 159824 -110226 -282714 -128797 -327157 54475 -2795 -32780
20232 -32780 5773 -66175 -86347 -359852 80040 -117901 62169 -59414 145223 -202213 -215328
20221 -215328 88033 -303987 -27873 71067 -59802 -19352 -175910 330145 18884 -346236 -180679
20210 -180679 -7976 -174690 -233147 99369 -186751 -105287 -158362 -85289 71237 -140528 351241
20198 -1750 -257441 -70922 -188571 301794 -125418 346161 -78076 34000 156277 -180216
20187 173902 31554 -184989 -336448 75662 125917 -190819 -469444 -69172 78927 2808 8311
20176 8311 147358 5831 20518 -175026 7120 -96815 19125 -142143 89526 -29645 -33210 121464
20163 185846 295128 -194605 21112 68935 242949 -7865 -91743 -44459 -103521 210758 92066
20151 187085 -261948 148098 467640 46684 89754 47593 -328815 -215061 -211127 34779 -146176
20139 81410 11771 53153 157755 61470 -163700 -58511 194610 241250 413586 447911 141393
20127 -90183 123665 -65813 260481 302452 203761 425725 467098 176324 417287 29071 165415
20116 165415 -57926 -129696 -181775 -227936 -101921 -129009 -361662 -323426 215103 -191367 172302
20104 115417 96823 57358 -143655 -355892 -98958 206935 -671677 314500 222426 25651
20093 -86305 275936 -150047 -44494 177441 127151 -222742 -99463 180216 115724 -164850
20082 -80650 -362092 -367261 -271859 102541 -123122 -181179 101420 -34388 55559 -325267 -47690
20070 -19761 189127 -307246 152534 120890 -130691 207955 176290 126770 -137338 43815
20059 73947 -182725 -139434 -344028 137547 290533 -316938 -287470 31344 -145375 241674
20048 -134870 107319 -134042 16489 -275400 -105257 198587 -230879 -4999 -132509 273835
20037 52038 86591 272366 -182863 164712 -359789 14689 -219742 -15171 225671 129802
20027 129802 -30919 216253 92986 -316587 -101815 305089 266859 152549 -76845 -86905
20017 -86905 -9940 -82500 361699 -9535 -270668 -12003 288039 -375757 -19268 -321908 -101444
20005 165743 52985 -198354 -165339 45896 157772 251272 -38013 91279 -43929 -129335 -233294
19994 -233294 -21619 141138 284216 12638 -113402 5812 177721 2021 258923 -80982 -43427
19983 -43427 188692 -103873 46745 432249 -30544 -30221 -15769 -96014 229760 368239 75109
19971 235204 -62900 -112518 -51449 74869 -91711 -5453 205676 72415 -3614 229245 183474
19960 183474 30832 45139 -158748 87262 -40774 138226 -129288 34283 -118386 15225 -70641
19948 -48052 203459 250796 29148 541763 135013 -100499 169966 -2102 111359 -129064
19937 371914 455828 236149 -295798 -124156 -112371 181309 73619 247909 119851 -20575
19926 -65130 386234 171107 -48350 -312922 12964 371033 -294835 -8267 261736 -73969 185529
19914 -46326 -387294 108417 190865 -362570 -374164 -14381 -97528 -62889 -39921 -138547 -188464
19903 -188464 5757 49656 206334 -118252 -356493 -62907 330379 111074 -169640 296619
19892 -252992 -400417 122842 -6729 72429 1584 94891 -13976 -239792 29428 -105893 -74110
19881 -74110 126509 -370943 -66337 -175957 -320781 -27375 104544 1837 16115 -37852 138299
19869 -307633 19377 -40741 -119872 438029 343925 -277401 -314530 254085 238934 74382 -44154
19857 7156 30232 85751 -154015 -169262 164803 -200707 11365 74717 55268 -58020 -118660
19846 -118660 -189005 -239188 -212517 -181439 -57755 -108243 96138 -374618 -140303 -81285 -168947
19835 -168947 257695 -36611 -53598 -353018 51482 -61604 133878 -106317 -130525 -16019 92898
19823 -255848 -295768 -67465 -170519 13709 -19140 -363900 150668 177526 -76022 -129923 285674
19811 -230643 116960 34212 -204203 -376639 -17053 -108321 -490595 -97967 37652 -352619
19800 -236666 277931 177872 1592 -76541 19156 83927 -137428 -326584 -471873 -52098 85176
19788 -49221 -128699 21750 232523 -94647 58530 303185 -377 69475 -248003 -52666 156346
19776 -2652 319503 -222365 149274 11626 -24433 81470 294464 166977 44621 49319 58313
19765 58313 -32432 36717 51520 -186392 -346852 -154198 -233484 -454937 104860 -166719
19754 -43420 307372 -241236 -350062 82787 -321963 64129 50197 15553 -132648 99168 -121935
19742 -268644 97690 -462957 -314812 153133 -251056 101114 -311633 -97316 -45926 -64179
19732 -64179 -154466 207652 177328 -259393 384749 198116 93001 290068 131848 -200785
19721 119807 -144965 14131 303676 29414 291172 255742 645810 169408 -7024 124166
19710 41092 89357 191548 91669 -21399 82954 -319344 -46672 -224693 -241452 -268308 65561
19698 -9761 -10556 -25749 399253 -55570 107544 242695 23822 257510 129442 -160686 -232964
19687 -232964 -79098 -191215 74215 -81673 295101 451852 123752 -230551 -183844 412579
19676 51176 -75075 -101608 99231 -125755 40585 110049 -417813 -185509 13404 -309775 -153612
19664 124748 83931 53942 -104128 -75024 11564 -92044 -353253 -29683 156046 -253886 -181215
19653 -181215 -258687 -140577 -309402 -243681 264195 -152928 42059 112064 -345004 160241
19642 -184989 113467 -27292 -21326 -76244 304371 212511 218547 159394 -72604 38744 -338877
19630 131071 134708 -270743 -258644 -52256 -142681 299055 91315 171581 -215700 175660 -135819
19618 -248626 -3450 -144376 -143554 169968 166622 121669 -230973 -92792 -267363 135655 50277
19606 -226883 -138300 176299 348352 5106 33299 -202360 234723 -67897 42155 -271950 -393754
19595 -393754 244416 144094 116145 -84098 -75112 -22223 -195350 -56165 -47805 -362 -51305 -332579
19583 -332579 123399 -311649 -75773 -167049 -295087 -86764 59455 -257008 -81122 47522 -77824
19571 -155536 -97663 -135948 -224602 -152280 -252361 -272564 -56834 44438 135891 -33057 -248135
19560 -248135 77769 -257605 -158871 -354334 96614 23511 -41386 -18565 -128896 -108107 -116894
19549 -116894 -134274 131415 183109 94514 -189409 57118 -168669 -57031 413149 149239
19538 -144341 -59341 -384409 -302536 -42623 -42240 165339 -275677 -174448 49841 -109513 333156
19526 -137005 -111905 -20195 -219751 84569 77739 294379 -105468 -162746 -256876 123309 38868
19514 -17119 -175285 121729 -37432 -207214 -120117 -323368 -7504 61068 -257464 -76250 -155441
19503 -155441 -288586 -202441 -98981 -99041 -102307 -26809 -90713 178544 -239762 215563 -30137
19491 -65297 -176715 -208075 20287 -287523 108145 -133751 214175 -428035 -346174 -116098
19480 -190927 64236 -113986 170297 -58938 -189993 104381 -178238 105943 -240635 -164231
19470 -164231 208490 -77750 -360012 -92241 -113939 82470 -185798 -71743 110758 -140977
19459 -184149 11627 25056 202632 3576 15535 131750 -107061 164711 -13557 -281658 -43268
19447 -221027 -253791 -93267 -200696 -10915 203548 261297 -138274 83039 -12421 -297244 308749
19435 -34098 35466 167219 -167411 -51148 -143160 31993 -216134 104790 -3988 -182653 -83576
19423 -143904 -25085 -211773 31659 164387 -8125 -184596 171588 -284652 6489 -404075 -240853
19412 -240853 23196 -4918 -36945 -119060 -5955 41407 164137 66240 -49866 -14829 -28740 -23656
19400 -23656 -191844 -47970 -73046 -117893 -132842 -314765 90832 -87483 -294673 -266057 -133505
19389 -133505 138529 -42353 108748 18455 -222948 -83941 -177081 16423 -72475 -19948 139963
19377 -99944 -145072 -131555 -151757 -109022 -46213 8119 -209471 84777 -10390 -294937 21177
19365 -134101 -627034 -302650 13974 -95568 -255464 168940 -313316 -338538 -325927 42585
19354 94466 -65379 110699 -82707 63987 -131783 32094 42821 49363 93873 53558 -80984
19342 -217746 -204711 -171457 -212576 25368 -118976 -239876 -311579 108572 -247953 -413189
19332 -413189 202048 -203552 31194 -102700 -84129 -498 -80336 -133191 193987 -188350 -146772
19321 -146772 -65151 -18781 -142119 72391 82388 -153460 129672 -228861 -338543 -38439 27523
19309 -205947 -40164 -165446 -119349 58813 -139225 43768 147507 123384 -207536 -64388 815
19297 -331444 -173550 35004 -4047 13990 -26651 -266859 202406 -127127 -234380 -432384
19287 -432384 -258441 198972 395968 -298210 76067 156756 -68801 -27156 92029 232364
19277 232364 -219059 -222664 -142975 -329109 -320020 48008 -67567 -164140 56140 76795 -41449
19265 -72109 -244884 -193535 -20245 -119698 36584 -13709 -304369 -143432 308467 -127652 28873
19253 -49509 135384 16800 -126808 -294878 187222 -18889 -238421 -141188 -271369 49199
19242 -58618 156570 -106096 165298 -226636 -79149 -77945 -19605 -207380 -222490 -65781 -157678
19231 -157678 -348182 -163315 -109038 -20473 -410863 -193345 202011 -66386 71638 79505 -107584
19219 -51252 485208 138917 39643 83710 41370 338870 -271583 234236 30394 154053
19209 154053 -88254 305674 -128901 -268496 -373970 -52860 -160232 15013 -543095 194499
19198 -138126 -166321 109306 -122616 -155033 -59529 2881 316584 -65153 -260194 -56844 74278
19186 -91151 -111414 -242685 147884 -176517 44569 32919 -288697 -157432 -204492 -94284 34502
19174 -125210 -202359 -558014 -43907 -63002 -141427 -150738 -148598 -117020 -137058 -84662 -43167 161253
19161 -100245 -72578 -2215 -41315 49707 -217681 284340 72296 -189717 -96091 -29546 -395159
19150 -395159 -358045 -56988 113220 -346026 -247195 65415 101297 -246084 -116984 -152408 376001
19138 33485 -108594 -48038 -213235 81410 341063 131125 -139548 162898 300517 -36284
19127 -87371 164793 68057 94451 142141 185460 194963 67296 119069 551072 256775 254432
19116 254432 -61847 457513 180873 54379 36258 -141348 -380220 -147576 -7602 -140782
19106 -140782 -60848 320203 92072 229365 162177 8143 -183861 -155409 -334543 -338853 -205517
19095 -205517 -25451 -212381 -61070 -127528 231105 -3429 308301 -198131 -419824 -204692
19084 -47009 -48248 -99419 -15394 -129675 -160890 -191165 -77568 -108469 27906 -81301 104417
19072 -283438 -275911 -285999 -56550 89001 70426 -223969 44112 48151 214397 306013 77484
19060 -208072 -250596 -98901 159247 142448 46706 156675 -328232 58210 108354 29784 -61192
19048 -6163 256070 -126969 333846 103942 13345 221050 358851 -109574 -456 -297987 -273884
19037 -273884 -66566 81482 39076 2536 -230562 2256 80163 -10552 85414 15431 -320626
19025 72809 -190887 227156 -457745 -51278 -121538 9357 -263152 -265449 -63655 -288881 -427731
19014 -427731 -55601 -129872 -104916 -347578 -297140 -31239 39121 -105475 -30006 -32198 18137
19002 254811 -126267 -4889 70655 -101344 160197 171446 125741 -101274 -61593 -175895 65595
18990 139689 109570 190581 11812 279369 -54 -248567 -166739 -20067 -20095 72957 -235191 247917
18977 -162192 -45894 -140647 94357 46818 -237276 -150470 -107118 -284638 -1384 -151520 -239142
18966 -239142 -111839 -125709 83283 -160722 -217616 -45436 -83330 167887 149782 487124 573121
18955 573121 398817 -179499 -285372 72406 135213 -47413 -190955 -210354 -241335 106688
18944 -310069 -215854 -46599 257422 42707 -360012 -76477 41727 252485 285410 -165898 294529
18932 150199 23357 89686 183344 62267 -168863 -238083 71228 -531441 111805 258370 -42276
18920 -224991 77909 -27697 -39525 38809 -226626 -131617 67419 -62485 -13779 116154 -69286
18908 -110897 -14600 64619 -256481 73489 52459 168420 -313143 94367 -249880 109056
18897 -102323 205827 -87992 467576 500494 334261 348859 86428 42535 322783 26758 -396880
18885 -257707 -92598 -409757 -376595 -149629 -30841 -140145 -394922 275581 -237585 -116803
18874 -152487 -79700 78720 -224513 162111 27109 -226977 167585 -154710 -95880 -305864
18864 -305864 -64620 -186340 143864 -19372 -233907 -139210 -22779 -114302 35499 -32986 -59413
18853 -59413 272865 46133 -47081 -265515 117684 -50116 -212118 -42399 -172441 -285172
18843 -285172 33306 -314570 -100709 -177063 289478 143869 119823 125816 9296 -56970 -65416
18832 -65416 -49588 -277747 269103 -163692 -95965 -22949 -83153 -30179 63026 -49519 -288029
18821 -288029 -99300 -179476 -170138 -291480 39953 -203701 -84256 6800 48856 -51154 -248542
18810 -248542 -1721 41505 -45016 -206316 -118198 155955 18748 186927 -344692 -176407 42386
18798 -35479 -175299 -78803 -48307 231481 -28135 -4086 -16783 165205 74741 154260 -175571
18786 -248770 308161 -86599 126665 8608 -123282 120881 -106171 260315 -126806 20108
18775 103614 -249842 -410203 41123 86924 -46505 46271 24730 136922 -281717 207152
18764 -346572 71145 -23182 -27008 146750 -340791 -259459 -245460 193139 -374727 -296907 -103169
18752 -68829 365979 203908 -119172 163765 -69752 -215497 -201113 -95739 159918 -74490
18741 -392009 16141 -180632 -126830 -245117 -129118 -142603 -150327 48971 -183060 266579 60126
18729 111526 -307509 -242078 -13828 111760 -264015 115726 -99527 24950 -17215 117987
18718 137253 52352 -253922 -105724 -528001 -406374 -424799 94398 205190 194666 -57506
18707 68685 -348414 -44222 -26258 -2386 50479 -12029 -363656 -5842 -84273 -107580 -12386 321404
18694 332215 -71135 109434 -177993 -135815 -31056 -199007 -391779 83152 -150307 -447081
18684 -447081 -196334 -60510 360432 148288 -74162 -278144 100685 -371722 -133201 38647
18673 123689 -49284 -107305 -310883 163807 -161289 89449 -121108 36692 117219 145483 -75590
18661 -458911 -63873 -201860 66317 -197925 -165849 -146147 359257 89424 -48781 93377 -283487
18649 -312094 -176266 -512628 -246642 185056 -331062 -311375 110997 70546 -22717 71314
18638 -276992 161014 227635 352 -49534 66075 -20839 -13910 176452 -8603 -9928 -202894 -321149
18626 -321149 -22520 94346 129955 -80553 -342593 -84503 59953 253659 -137366 -92021 304764
18614 -274694 -237489 -358083 148760 -138748 -294653 -428842 10537 -244350 387433 116158
18603 -222405 -29315 -442522 250233 -131297 100789 -313478 -292464 -111289 -271204 -155210
18593 -155210 -6699 -46327 -26103 -459990 288298 -103001 -495472 -66317 -338436 -221201
18583 -221201 63476 -246403 82542 -63397 -117042 -20956 -308030 188267 -4113 105835 22623
18571 51166 -338038 -87953 -343992 344585 -24500 -269376 177889 -362446 -15009 139837
18560 170531 -262626 -182814 -137060 -71241 199882 88923 -367144 -56954 -9796 -128102 87848
18548 -131533 -203917 -61063 -202679 22549 -17123 -217134 232631 -104800 -229206 -245075
18538 -245075 -103505 -308886 -293055 -146004 41650 183056 -223283 -12559 -258781 110958
18527 -81859 147152 275865 -361598 205577 140754 169756 114565 -192349 -117668 -167975 -139873
18516 -139873 -141139 -82107 -28268 20788 -106942 -140359 -110693 56480 -172669 -75094 -88429
18505 -88429 143209 -180735 -152211 -220327 -136699 -353320 44434 111839 -97244 -68840 76510
18493 -109904 53316 58222 -105373 68037 -198021 -21411 -315302 -63289 138704 -136954 -223668
18482 -223668 57643 296929 48093 207299 -42346 138874 -41081 -11510 -219858 -62491 96627
18470 -38876 -146845 -210304 -221165 -126669 -259874 105389 -11332 -313489 96571 -46179 -228333
18459 -228333 -101318 -100292 -149061 -172964 -273702 -131998 -132587 -91641 -287762 -18956 -160468
18448 -160468 67207 -55325 -136688 -141903 1528 -112828 -129982 68288 9666 95346 59139 -254656
18435 -48269 136647 -12040 18451 62520 -21533 10635 -433306 -53476 -174779 54569 103937
18424 103937 -111563 -5166 -30472 12777 324626 -472406 101926 325480 -143339 -3130 241123
18412 -159389 277862 -56912 233266 -17907 123089 -74712 -243669 -21512 60663 -127787
18401 -79262 60021 -18145 -325368 -291997 -313962 -155979 -85839 -104869 -62965 -68287 -98721
18390 -98721 71136 -150069 122972 -273454 -127462 -236301 126799 20654 -148297 267880
18379 49484 75078 -180533 -84872 -305892 -266321 24797 284411 -273196 58385 -109956 148695
18367 48294 115024 43122 -173153 -205814 352096 -12325 5605 102785 -270754 232227 85914
18355 -117078 -66539 51880 -133167 233577 192268 62116 102176 -168817 -152128 -128712 60634
18343 59970 169870 62781 97457 -40211 -225117 -113452 -176792 -80584 254128 99763 -124808
18331 403249 -222984 -270630 200810 -46775 -4839 -133063 -182730 180160 74681 25299 78207
18320 78207 -191044 -227971 -108988 -246603 -180859 -191525 -226334 16676 -230151 268166 73731
18308 -360755 4598 209203 72164 -167298 296952 237233 -185184 -63332 -2536 380123 -299640
18296 41340 -69828 160420 118839 -482805 312271 -61192 -311029 -222020 -148031 11071 -56334
18284 -24457 87456 -461527 -46573 -109429 3979 -258667 34764 285575 -334073 -280101 -127366
18272 94568 -88535 -60402 -35585 -164114 -267173 -30161 -252524 10481 -365447 -234650 28428
18260 -58361 32799 -22198 -69446 29216 -85291 -97711 -47872 -67499 -444601 -148927 -387058
18249 -387058 14097 116721 -41176 137805 443247 255319 -104844 251903 242304 14957
18238 -275738 -381321 -317989 -126811 70937 -349326 38733 168203 -192493 -43922 -262097
18228 -262097 -186193 143796 -18277 -10691 -168286 -61586 55055 172694 46672 373341 -298562
18216 -53228 145524 7287 250547 -59921 -301631 -134636 -88017 -34768 3021 -53802 88694
18204 -400584 333854 62204 -243079 -16371 143173 -111899 35371 50648 260407 -125363
18193 15315 492267 -117677 -81668 -13418 364054 -287086 -99399 64653 -12651 -213547 -24088
18181 -175014 24820 39151 130630 116672 137038 -14527 -44904 3250 -246692 -159018 -56630
18169 -66745 -349641 -201359 -308643 99580 -196250 46589 -38274 71095 -95768 -25867 -145989
18158 -145989 -51311 -163939 -74854 28166 71125 -131510 1976 193932 -29043 203913 -203580
18146 -101466 185366 131079 -292258 331078 131103 -145466 308409 -50281 18262 -137982
18135 232400 -356441 -87109 117316 -353668 -124015 -108457 130232 -562267 -226606 120062
18124 -143821 -260075 252794 181877 386511 -45791 99510 -277731 208330 -74012 173544
18113 41062 -337536 -49071 -265630 -47707 -144458 303486 74041 -434749 -81593 -31720 -361191
18102 -361191 149796 -169286 231063 171430 264589 -159977 -173115 -111813 -268939 -138277
18092 -138277 108988 91970 36043 -75335 -145727 151579 -64126 -92901 154761 -120537 150480
18080 161684 -184721 -89623 150175 -112428 -382955 213673 -269840 -70562 -67714 -177215
18070 -177215 190341 236929 -377635 -89417 -261611 -116420 -63283 212442 -147115 164917
18059 113487 -423687 -318747 -342649 -203319 187520 142391 -57240 -45164 -83756 -39003 12909
18047 100178 -236616 -62856 78636 -2356 102587 -111554 -80794 2498 362060 -380035 36968
18035 230647 -72975 -335104 13922 -148283 48182 -180478 -37577 560455 -48868 -38405 26292
18023 -5017 264987 301980 -130211 -95206 95307 29520 -190206 168644 -69950 191680 72373
18011 -134500 79529 56913 94803 399129 -163510 144922 256947 -155911 -309548 35058
18000 216354 118719 203164 -52917 -123409 55483 -305417 30023 -124244 -229004 -174678 195151
17988 19526 -93191 -231366 10185 -275547 12172 -101400 -142400 -137887 119654 -132912 -108000
17977 -108000 -160638 -113858 -11414 114446 -180187 267962 -60130 76824 -330832 -179983
17967 -179983 143623 238866 21357 79624 110962 152639 60459 171505 201155 -100631 -36813
17955 77148 -1230 129029 166924 93465 -2772 -28738 -220251 -211967 -181182 -140901 256078 108970
17942 169077 -98290 -58031 60545 291436 -3434 42554 -145471 190367 85693 348837 -93106
17930 48 -233100 51271 89031 -284689 -124081 80728 87282 -301476 286415 49996 188778
17919 188778 144920 262333 -128400 92543 276331 -147760 77677 196372 -466528 -205151
17908 136092 271421 27588 -412027 -59124 -22868 6613 66509 -286823 -324642 -101267 261328
17896 150925 -68739 204793 -93423 -49192 -129071 -40946 92899 -15854 176978 87693 -53539
17884 123572 52314 534877 -164875 202856 -237676 -176515 226552 89533 39852 13687
17873 355744 -251525 -164045 36146 161846 -12386 280925 163012 269072 244057 -3307 108659
17861 -443695 -41943 -418885 -82056 51003 -184499 189846 120851 -509308 -113181 21349
17850 -65703 -312094 60235 -275418 -351540 43908 -275953 -123585 -41163 -371948 -227923
17840 -227923 -233366 -3280 -71990 -94472 -123418 211399 -93946 -98763 -23022 -3877 2424 33567
17828 33567 142446 -12166 196068 158718 8636 -170640 33472 -128553 -237535 95316 101531
17817 101531 -50252 -18320 65318 112482 -384218 -289507 885 320003 249166 91159 57950
17806 57950 -227553 -81013 91265 95620 -129277 296234 248162 2220 -212803 272018 67320
17794 -82132 308435 113184 -277697 34680 86511 308407 174220 65438 244364 -134168
17783 -62641 -58968 -116464 -106355 -38248 58477 2463 70968 -35004 192068 -210539 193493
17771 -13397 162520 -190898 -149921 246293 -132547 -141466 309626 -72261 185960 97480 -190738
17759 44835 133349 36646 154160 -4223 212365 -80281 171325 -73151 68566 2850 131279
17748 131279 154030 -190323 240008 -16482 68283 447839 88112 -115405 302115 381710
17738 381710 238052 -207350 -71771 132047 -102426 62339 37441 299869 352490 337966
17728 337966 52598 27839 -6130 -318542 75455 68232 174736 -37793 434461 -44603 -109606
17717 -109606 -322475 337667 -184669 190759 97072 -94802 -121420 -16276 -322160 -152384
17706 158700 126056 -92602 16275 175117 106942 251081 -137001 216207 55519 68285 -108679
17694 223009 -111639 234153 324363 44207 279367 170046 547513 363763 608700 -62810
17683 5145 60635 274082 -75117 -219189 167020 86186 63000 -171676 166353 63134 178816
17672 178816 -99979 554148 4742 54552 263969 -66522 151610 -138615 104694 -71995 -84442
17661 -84442 -187967 262932 10746 -89249 19017 258579 -123233 -138218 -64358 -321670 -37008
17649 -279673 66308 -33743 -145839 232714 166269 61973 23596 263381 53314 78935 -333113
17637 149692 77351 114907 -71921 104689 90630 83039 99658 -94983 -55552 -22688 -32790
17626 -32790 212064 -224713 5321 237603 -187532 8393 -63540 133750 11723 -45930 198921
17614 105549 414597 52649 67923 -23559 55421 254515 57805 71691 430411 -166034 156455
17602 118175 -98098 -13380 61855 -45867 94170 -115287 274552 -163923 353313 215401
17592 215401 92 -221549 203363 -59777 30670 378255 -182414 544353 230920 122348 238705
17581 238705 -12224 65055 393410 266744 234234 126088 -99338 73299 53894 165777 111439
17570 111439 -187520 154343 -392869 -120627 -61710 45668 -60547 308041 366521 14488
17559 377732 119029 -73956 122420 159656 -20411 302440 81281 119783 18504 70366 -2166
17547 65678 151191 -141901 -153075 151202 116921 -170459 211176 429654 194647 129060
17537 129060 390886 -222650 175803 246880 295124 316741 365967 134798 161311 138807 329850
17526 329850 530241 342512 345188 612300 334587 614026 319863 405564 196271 146141
17516 146141 94628 139896 289821 41404 252939 -101459 131220 108769 648526 459996
17506 459996 519999 677962 501978 495996 45468 275330 140111 245116 166638 304626
17496 304626 81771 48024 203351 476253 203098 79953 561033 292811 444761 119280
17485 293745 357701 37786 37553 -326451 71059 203366 16910 366235 236748 516633 191198
17473 228507 60265 140516 264368 268528 412508 255947 449768 -45706 282009 354194 89201
17461 -85867 88193 173476 18564 357413 107371 132601 -83913 229051 399989 239983 306569
17450 306569 180968 280641 331809 84349 212055 358509 267282 400262 7923 164380 539147
17439 539147 212477 662266 285781 97258 338795 561376 256961 314958 97234 501989
17429 501989 219709 33636 115072 47445 257117 86985 476547 244908 168188 125143 189033
17418 189033 320767 447253 15846 264907 171267 472796 603132 871117 367216 339540
17408 339540 301221 84887 -175851 -103582 158649 283191 35747 174956 123558 38746 -306527
17396 186611 203552 234508 -8137 271505 -73478 -16603 245987 468357 204786 -74940 309592
17384 266194 226649 303446 290314 485615 -75997 526662 -16184 263634 109559 228152
17374 228152 454930 159364 371930 72022 371846 173072 317256 433344 278679 258675
17364 258675 426864 43953 392841 162337 168191 75094 193093 290737 118932 -49658 255003
17352 474354 858 -84231 112756 288677 12181 456128 184083 320346 76916 286095 275843
17341 275843 171157 338524 489674 320878 127244 227922 32160 182148 489322 230970
17330 141607 158178 726130 -25316 71009 3595 419584 -148232 425761 54269 53889 257035
17319 257035 323333 293250 47523 66581 321928 169660 328992 -78570 -181028 162429
17308 268576 113514 105026 372854 275830 245166 205798 63210 483873 355980 384805 228680
17297 228680 301188 372296 4771 12466 128132 333695 49189 189648 4491 67992 270696
17286 270696 109910 131182 199652 157300 142225 187131 137542 11997 390968 452357 -124798
17274 322076 213061 59754 157837 169983 131001 52222 145899 278779 125751 432797 -21477
17262 381278 -25307 535444 330710 35492 510722 182395 -160496 344105 188823 229715
17252 229715 33244 279321 -83532 343102 420011 245775 471158 345353 -80007 88099
17241 315533 299968 615015 340099 238464 79094 644863 120211 -57310 467709 268020
17231 268020 -160616 333514 182766 505435 158740 193952 491605 413707 -38768 447469
17220 425364 200512 354300 338161 67868 185818 469149 375015 439687 19283 -17294 262244
17208 318178 354433 360350 603920 502740 47287 -21854 329676 594286 439102 184150
17197 -18625 393796 296534 193049 575370 507299 -27489 221909 437465 228304 383573
17187 383573 393212 -170386 438840 97682 630279 237526 221386 215448 337061 405339 180944
17175 666705 282559 601915 272742 400395 94914 476240 256847 412857 465416 126325
17164 503942 394596 231759 500030 403395 162453 336695 523589 396358 276443 259404
17154 259404 306806 476504 559482 407084 452085 381710 498855 159381 321838 167729
17144 167729 506526 165919 504756 547165 198392 294074 312097 143395 169285 290423
17134 290423 397870 392007 209303 442867 211030 449731 547706 392831 358531 647891
17124 647891 260665 912718 328336 256284 389227 395728 365412 611477 574583 474900 533744
17113 533744 289258 359971 550618 428019 538081 603722 634487 556415 371639 609500
17103 609500 715831 645362 345879 457633 316068 196189 210344 216472 661638 723645
17093 723645 404792 398993 346043 948151 78073 574065 542735 880287 767400 575597
17083 575597 595653 162460 551587 546529 534236 568925 507599 696129 770164 607594 545685
17072 545685 563827 903058 549235 1003905 754576 725622 272670 673473 280711 604623
17062 604623 528276 243339 515389 357168 502953 565094 752385 498634 817027 396474
17051 651197 382439 717806 925520 715983 473391 962789 617217 564703 412284 772850
17041 772850 835164 1007108 836073 916116 411797 807458 993037 699379 794964 548841
17031 548841 686853 721463 632720 887417 620246 720028 1136516 996611 919397 908879
17021 908879 1162589 531709 753159 1069136 891385 930891 880492 695760 946995 776620
17011 776620 629976 918086 1123585 1088856 729093 1152683 1115349 733277 1143501 841264
17001 841264 1071583 1133163 929158 795384 807353 1107333 1053039 756613 720959 963026
16991 963026 816607 1065805 1013287 916261 1370307 905469 1105809 1108842 982183 1133556
16981 1133556 1248495 1150944 891418 1188846 1554509 1125455 940893 1079021 1107992 1149705
16971 1149705 1356755 1111239 1169345 1202624 1112255 1539694 1251266 1353382 1379062 1198792
16961 1198792 1282612 1370286 1020301 1456192 1211065 1307922 1502033 1102722 1204050 1367862
16951 1367862 1349612 1402870 1306220 1459238 1285353 1287817 1618253 1775182 1684367 1333165
16941 1333165 1532300 1485687 1383120 1223258 1583892 1455805 1720080 1562491 1603280 1578839
16931 1578839 1451848 1782906 1334108 1494779 1629051 1810148 1869867 1693400 1951059 1831994
16921 1831994 1656313 1821200 1863389 1984079 1967114 1632823 1765940 2108939 1980122 2168976
16911 2168976 1938192 2238172 1994839 1703959 2038416 2143154 2036507 2256287 1846158
16902 1846158 2397274 2283311 2312201 2221611 2115853 2337116 2173245 2248177 2310465 2828045
16892 2828045 2493091 2185095 2288930 2685308 2819233 2693519 2957650 2691270 2954697
16883 2954697 2807697 2944680 2790324 2747255 3166989 2797201 3027397 2953595 2994086 3029489
16873 3029489 2879816 3130176 2927244 3125037 3544940 3508173 3510102 3331786 3502135 3692175
16863 3692175 3402349 3822732 3920992 3733591 3796402 3696010 4158200 4031921 3881353 4211078
16853 4211078 4254428 4304313 4269218 4421584 4308574 4598377 4421998 4529791 4748832 4640219
16843 4640219 4783402 4852408 4983825 5163299 5080113 5244397 5300286 5587233 5428346 5558751
16833 5558751 5878660 5676573 5877051 5625625 6124582 6228963 6342091 6499886 6393485
16824 6393485 6427432 6979343 7068320 6984722 7269883 7455064 7636214 7575825 7498770 7894779
16814 7894779 7872792 8257554 8310794 8504269 8756257 9004327 9260513 9443936 9182317 9545969
16804 9545969 9610911 9875843 10232808 10698822 11126585 11329148 11278113 11414906 11887225 12340041
16794 12340041 12557455 12880510 12998690 13390103 13656137 14404328 14154614 14762204 15147775
16785 15147775 15711219 16128667 16716956 17041846 17517065 17896425 18280409 19152632 19515860
16776 19515860 20066944 20861708 21933335 22292641 23337997 23780439 24640242 25065244 26425838
16767 26425838 27155716 28238666 29190188 30398546 30995785 32345099 33490542 34689918
16759 34689918 36225104 37316947 39085261 40460179 42088164 43866597 45400550 47634582
16751 47634582 49741989 51462690 53629727 55919817 58175833 60944515 63385279 66484182
16743 66484182 69075098 72212440 75440027 78521485 82029897 85017677 88629885 92605187
16735 92605187 96138022 99922637 103392282 107390028 110740114 114537090 117984537 121443579
16727 121443579 124052179 126633642 129494110 131446308 132966965 134359966 135151722 135894131
16719 135894131 135598915 134822795 133623720 132169214 130254727 127666061 125408541 122247806
16711 122247806 119248346 115575476 112323520 108340777 104806651 101103964 97028335 93504654
16703 93504654 90015277 86220719 82739009 79036406 76203902 73086420 69710327 66736147
16695 66736147 63928211 61361670 58670178 56160428 54049832 51500479 49764461 47888020
16687 47888020 45782801 43630215 42347994 40148654 39214034 37330848 35758570 34708764
16679 34708764 33518405 32186189 31250712 30018201 28754417 27645014 26743872 25908983
16671 25908983 25217300 24210318 23325544 22606864 22026833 21776105 20513745 20189502 19619851
16662 19619851 18977049 18502844 17631933 17373908 16907078 16378157 15962057 14938301 14925363
16653 14925363 14787524 13917139 13906974 13347835 13376657 12673776 12471642 12069386 11987375 11673105
16643 11673105 11391994 11039308 10917282 10574787 10524940 9630349 9859117 9819101 9391391 9218453
16633 9218453 8934848 8858902 8746249 8581628 8412669 8034198 7903820 7536888 7525699 7594465
16623 7594465 7399307 7023379 6710977 6670293 6664734 6997360 6387222 6353659 6120160 6361184
16613 6361184 6047334 6003762 6021095 5591532 5404035 5290915 4900268 5077041 5377748 4655859
16603 4655859 4891377 4842396 5089616 4824551 4669101 4911990 4428892 4455828 4292887 4299491
16593 4299491 4383014 4092734 4263963 4088404 4175235 4179543 3674177 3875238 3616483 3667884
16583 3667884 3723392 3515308 3498362 3430652 3631030 3582055 3395505 3243051 3181127 3010336
16573 3010336 3359965 3291075 3050372 2959952 3020644 3250046 3110862 2817541 2757013 2835863
16563 2835863 3109218 2612149 2518868 3015477 2642600 2683100 2726154 2793121 2673609 2461082
16553 2461082 2629412 2221133 2531332 2503209 2634048 2351811 2479217 2545893 2299204 2407223
16543 2407223 2450143 1921702 2305927 2035567 2178969 2138967 1735752 2122400 2288625 2100037
16533 2100037 1699119 1928128 1709999 1898150 1840460 1720128 1903028 1646708 2072509 2016742
16523 2016742 1920129 1594271 1780836 1786037 1960988 1738918 1449340 1635310 1817787 1756499
16513 1756499 1653579 1534507 1504242 1371603 1622478 1699265 1668420 1464230 1754695 1514776
16503 1514776 1220454 1267509 1433259 1454266 1077606 1587065 1397347 1218948 1354071 1366147
16493 1366147 1308926 1121658 1393336 1228178 1415654 1183261 1013645 1648639 1106862 1354834
16483 1354834 1121764 1220427 1189756 1231637 796997 1472344 1305596 1192895 1168933 1037969
16473 1037969 1345595 1102824 1388504 1083655 1108568 930491 1081565 1099406 1149813 1013089
16463 1013089 892907 882446 1178671 1093233 1098287 780139 1084589 1093154 670365 709424 427757
16452 427757 919001 1142714 569983 1210081 549941 926556 1302681 968936 845016 670326
16442 670326 1003820 851768 707709 817705 731984 727280 789499 509162 842598 821350
16432 821350 907332 692138 533480 1021320 789475 702019 798597 737308 1003071 609885
16422 609885 668126 523192 480737 267486 900853 240803 735743 791478 591109 995683
16412 995683 717620 659463 799888 652162 621008 499779 692243 830392 877129 675188
16402 675188 1081151 614000 760726 676450 810904 560470 639741 456589 719239 563359
16392 563359 753506 586458 426975 413329 492176 332127 617184 576207 660138 406589
16382 406589 449180 269907 609525 616463 775886 651032 851798 689191 420853 524093
16372 524093 4449 693644 528390 360910 606953 710391 380764 457599 296135 593945
16362 593945 130540 620820 46118 621890 640237 304951 970196 532434 411844 781177
16352 781177 941508 441556 463166 704234 407361 700914 504339 567107 335756 500537
16342 500537 451938 362036 548652 237920 497196 328922 371581 500098 262080 507498
16332 507498 444465 203274 500977 156066 227084 494463 238642 388955 278294 322486
16322 322486 391417 396531 607316 727604 149225 334346 162195 228724 311492 588632
16312 588632 210163 329911 456972 221423 388951 472117 105392 291227 601294 41167
16301 189605 535871 237837 368633 186606 450835 154874 133458 286076 451418 462384
16291 462384 298721 174283 821936 336109 215818 397111 122921 394480 282580 222176
16281 222176 -9667 356089 136094 -3111 16551 361466 378084 122602 676064 61498 263980
16270 263980 216298 221976 -27349 420794 479713 40015 555620 137714 291800 68534 191056
16259 191056 115851 -17194 97202 179163 405798 209059 194737 71062 19231 220336 277442
16248 277442 270984 113687 332685 -78864 376201 -31991 333576 281373 8745 -135672 203099
16236 89958 21382 406775 123837 279545 451521 27059 292326 147418 37182 330581
16226 330581 477024 -42554 240000 13006 249665 780513 172004 280903 158114 287175
16216 287175 194668 47973 95296 193362 258663 46149 127745 135969 424251 91072 -194370
16204 109137 -88625 18471 220656 82625 229066 356943 -179044 115757 178186 302865
16194 302865 226060 162923 185212 21960 279205 269910 151869 172507 -196456 506294 125558
16182 118739 108296 85436 157314 34742 93407 75892 394121 468624 31220 527168 -145155
16170 -103696 223221 227998 57600 95446 -84637 371138 149683 -41545 96382 333222 417683
16159 417683 316854 11247 293430 290809 169744 68170 203634 -22635 184655 293135
16149 293135 -235158 107271 217609 -73102 79332 481145 -50694 -18046 62673 -157184
16138 126793 67827 10444 257147 -38169 259289 -27527 399329 326300 -39832 -65602 186146
16126 157379 54219 229842 9644 84188 263056 453376 145491 84115 -19509 223064 -38079
16114 42733 37160 174830 56132 310392 238410 801 257024 -221816 30905 391310 171978
16102 -217694 -139458 32690 -344686 478705 119215 108912 26867 138757 -49087 75954 -210318
16090 -43218 221574 -79954 56024 28004 232762 -146165 221280 -3732 -61424 11828 -415517
16078 261127 202424 -316592 -299867 28288 246302 282861 201694 -11114 -114998 276355 -3413
16066 -234615 -210202 3797 172276 83687 201348 96798 323500 478639 -151819 -4496 -199228
16055 -199228 366003 115311 59749 149999 -136201 -105198 9298 -257011 33152 -182406 -151623
16044 -151623 97945 -156788 109557 -220476 135369 -267563 87666 228325 133374 150181
16034 150181 -55460 39345 332435 -13567 273025 -263670 122935 91129 -18300 -105093 58461
16022 -367030 -250023 211204 39141 -89364 149818 -103670 25373 52945 -44721 -16329 14622
16010 128751 -164191 -37497 -217274 -59329 -135823 -63720 93911 -396890 -293359 -73610 -112333
15999 -112333 -55194 -66873 -74507 9246 453937 -69437 -176879 -187455 94993 -51415 -134005
15988 -134005 98635 304024 -32884 165724 -153497 135426 211352 686029 385002 267951
15978 267951 472694 373318 393648 93382 200804 325040 45443 38273 -513043 4751 -126528
15966 13958 -38227 -2517 -193404 166889 -288662 129435 21280 45026 -299778 163618 -76768
15954 -163310 45219 -133607 -56660 123817 -211568 -10722 128406 -43272 16302 -83907 45075
15942 136258 215528 -47973 -307826 57651 132576 -72142 212727 -69090 -77718 -161148 150913
15930 -170888 176610 -461639 -213680 278746 -337545 -176192 198441 -219959 -229142 141468
15919 -153479 162534 -168135 -199221 361904 -23668 29841 207603 -89157 -118853 150420
15908 -25077 -214814 -6887 22176 -5365 -164563 205406 -47939 -294705 -161347 -91472 -104672
15897 -104672 84440 -87980 13202 -174819 -61606 110110 224249 37255 -22418 -16200 95026
15885 -49153 -182733 328601 -43537 -131735 193284 209025 189967 -188831 -124535 11598 71348
15874 71348 367373 106422 -57150 -203844 158544 -182431 297652 -43976 65088 109168
15864 109168 17721 -56794 -107353 -135816 -113742 194494 -108196 -304275 -237012 -104291 96304
15852 -7701 8304 -154355 -58706 -235418 105716 -283382 -84593 170852 360264 386857 229158
15841 229158 320488 -14312 320750 -161644 -212773 70843 86751 -454225 -37749 234380 2458
15829 -7047 -218483 -74446 -9087 -184193 141995 -113951 147113 -307005 -140939 -207814 -9263
15817 -373314 -112024 48256 -10805 390834 -347902 -130631 -132941 114180 -225828 -98736
15806 -4461 -252815 -63484 96689 72054 -149845 94590 -86584 -98127 179366 -50688 -153792
15795 -153792 40473 8633 -200659 -118757 65860 -391593 -224536 101683 -2918 -155899 -413133
15784 -413133 134563 44529 -175997 -121730 -110009 40224 31225 -298385 -117561 -307413 102198
15772 174756 -113200 -147788 191286 -31441 -217691 -52334 -181824 4033 246123 -27777 97433
15760 -223076 81751 -34460 -266053 -171806 64119 235356 106981 -127309 -137323 78384 -179529
15748 119128 139779 -18357 -351247 310517 -421151 -261168 -127047 138930 15652 -31144
15737 96195 183233 -361559 -261936 -335330 89281 -55677 409651 24131 120157 -86997 286419
15725 -27532 70338 -8848 134139 89889 -434468 -55102 -57123 -100028 -417091 -133357 -237882
15714 -237882 278569 194837 215714 14019 -278519 341000 20510 -116208 299463 -363321
15703 -95180 -299918 -33295 -188256 314767 -398223 153355 -74800 -168112 -359500 59959
15692 52767 190210 376042 -131390 -200923 -90397 6283 11676 101381 171097 225058 -380400
15680 216278 -387616 -215791 38320 -164719 -231429 -2508 73971 -322137 -146008 -158330 120849
15668 24649 109536 -167109 141215 164668 14165 -92232 56786 82274 175205 115772 37701
15656 -256173 340333 75326 283177 176593 -112414 18058 146815 60901 -191591 -255893
15646 -255893 -80082 -41892 136380 -96958 128996 -136939 283 117571 -256495 220632 13287
15634 -38585 -1068 5969 -118171 -84924 -55633 -286885 -223743 -119334 162206 17745 -218107
15622 -316660 287949 -5508 -211523 188507 -170993 93038 -18881 -50101 13469 63868 165499
15611 165499 128245 -121736 -230136 -289108 -223710 -31605 242223 -21765 113664 -142934
15600 -250705 -153171 -262683 -315458 -51345 188373 138105 44815 21705 -247661 218017 -38872
15588 -105468 -116966 191439 360820 312497 8341 -77889 228706 33096 -280082 -141507 -10866
15576 -148732 166322 217452 -19072 208783 -3786 -309698 -177176 -33745 28400 -248359 247715
15564 110856 -78512 355804 120058 205348 105138 -24645 14620 -66347 -210615 275121
15553 -109305 -272811 21703 253328 545385 -236680 -62208 -64565 313231 -71027 304175
15542 20767 138509 -270539 -90852 -39458 240842 -51299 176364 8060 15597 46269 170630
15531 170630 32699 561652 -55970 250996 -41635 -218481 135578 -366381 223022 -105086
15520 -195362 -107708 89306 192249 -108490 266415 141817 -213436 536923 -23340 -5328
15509 146533 -303922 147870 137111 203153 121193 -209448 102300 -64755 176069 49411
15498 307242 387694 22553 -246075 383489 -266372 -5629 -58626 -427022 -33631 88256 -122625
15486 -72001 -102016 214164 105070 127893 42090 7146 -251903 -77499 258323 351266 38632
15474 292633 209469 -16100 303318 -75141 312583 551622 26677 -68194 -176110 -135270 3229
15462 127305 423725 3314 217094 200427 -196779 -109448 266489 194974 80356 -32201 -210116
15451 -210116 48778 163058 197336 -385602 67487 153843 -114008 216031 427405 -66694
15440 444452 185359 538074 676404 209174 77555 40964 39037 204389 58969 -106754
15429 146483 -45470 94139 -50116 -199250 252126 133839 -19514 170418 106741 -318693
15418 296811 -190476 111613 -277719 -181112 215466 -183245 -30500 160293 -532188 135927
15407 -64459 -60774 74392 235952 153617 79177 53236 -211846 -144236 -304382 -51981 -458215
15396 -458215 142601 -123108 -32877 345910 -89026 216207 -125015 23018 145791 5330
15385 29561 13325 143612 254891 -164141 -141573 125896 169861 76581 220416 272904 254034
15374 254034 116555 105203 274557 -257816 75084 -393979 127612 145826 79355 68882
15364 68882 -60515 213408 662851 128807 91960 121642 -32400 330590 -124776 -363247
15354 -363247 -49847 -340293 -297506 -52403 196897 -39958 -79383 123094 54453 304822 244968
15343 244968 144016 285632 -34578 -6952 -98373 208187 151565 -34970 115992 226134 -241842
15331 -71748 -107272 109419 -142812 81124 227134 119481 270161 295829 -287366 93250
15320 224711 382817 -87927 -260695 35685 -16918 328519 182872 145818 -1313 163409 -174284
15308 183267 -158122 60103 -73423 66350 -61697 -17989 -229249 -86913 -200172 331386 298145
15297 298145 351236 79176 -104947 -321674 30847 266363 29813 -28085 298 -75896 -278337
15286 -278337 339050 -94636 364195 -200799 -84207 -64090 -36860 97151 -47332 -89355 60267
15274 -337594 82625 217478 15662 -114646 75880 97274 -277036 30188 -24329 145090 102994
15263 102994 -87891 -198235 262642 253128 53814 -116750 297338 -126814 -14318 -182591
15253 -182591 349087 -340410 155295 -131260 -876 281046 -63829 -52467 -333777 236435
15242 -74266 362136 236925 294813 175330 210756 912470 2080311 4104020 2825401 3361599
15232 3361599 2916602 999608 239253 234155 502963 -57768 176207 144095 66919 391413
15222 391413 141543 77359 136391 -451601 -90587 -255931 -200091 -381584 152363 -11914
15211 -193246 48239 -302776 269578 48054 378234 493225 164413 -319461 145709 166678
15201 166678 -70557 18412 120263 139904 67296 -136452 -52951 264927 68058 -139553 14992
15189 71707 -92232 39325 -59061 205256 203490 -98240 331644 215482 -416514 101789 60552
15178 60552 128964 86454 498693 194915 -18818 52872 420834 98688 -19544 101153 57185
15167 57185 370486 -67050 16903 -13260 360440 92723 -184164 82000 -61908 -216033 -74117
15155 328320 307821 220894 -61675 -15584 -328998 52791 -167330 174335 115073 249624 271707
15144 271707 21771 -80187 56497 -242198 -60284 71686 134029 11765 -266171 -138184 -553289
15133 -553289 -273931 -178573 3681 -387506 165010 515128 123264 15825 -68751 222620
15122 293325 94153 35681 -96074 107026 255348 414670 143845 397834 156338 127684
15112 127684 118345 285628 190086 300995 205600 516012 767521 613698 -165035 56793
15101 41754 93421 26893 89092 -153319 423313 367334 -197838 -15488 288010 55060 58959
15090 58959 245065 41519 -110423 255377 35523 512933 162296 234534 299812 393139 326501
15079 326501 192608 246157 340983 -50786 368998 268760 91005 211200 67541 -282100
15068 -113184 -93566 200477 136267 408646 -139403 -47967 152301 -174919 70953 223704
15058 223704 185114 63577 241476 381801 374901 63760 85237 406581 55376 125056 175682
15047 175682 75233 67419 -84372 157300 273381 120051 114454 363915 271659 382330 136560
15035 114826 83846 346603 127782 173949 320632 119546 235051 431179 301536 299809
15025 299809 121761 172758 262213 286918 377213 418368 223721 268657 120543 281109 102725
15013 366053 209564 109215 165722 266256 106065 299679 230480 188401 297606 110005
15002 113601 87658 106882 252488 1144 314815 494327 152959 44137 262431 386199
14992 386199 347449 -65050 269022 290270 209606 174190 291200 94172 646342 19167 414039
14981 414039 521070 546645 -38070 397634 519379 249223 221234 141393 305342 446459
14971 446459 328781 362398 336872 370610 161693 445647 250000 397831 174553 102572
14961 102572 262654 275415 328365 -44009 632129 329726 152466 502625 21938 439351
14951 439351 124021 -138641 430696 229049 22801 405670 423820 416368 -67575 287051
14940 304780 596522 558235 417881 189492 311579 21625 -91118 281416 80608 8574 125644
14929 125644 522724 316770 616559 893207 552801 540322 741441 468778 702217 1039197
14919 1039197 875197 786145 979695 560285 629324 938550 956546 739199 848363 659330
14909 659330 61985 706896 38005 91956 345493 683298 290872 391651 98474 190788
14899 190788 411550 375205 -149768 394594 250270 347688 329848 23249 190898 553487
14889 553487 324844 360694 147312 404510 252052 654830 178716 424421 655777 381008
14879 381008 496697 292736 348038 360084 713016 611947 467592 286877 322960 251619
14869 251619 372194 406125 286491 364137 141522 289856 357481 468582 751425 542978
14859 542978 154679 442497 305198 285023 599183 404166 434028 301583 564700 526791
14849 526791 585629 576926 423738 517312 434063 562324 422813 807710 448026 780242
14839 780242 394045 855634 501180 812638 460786 462534 626960 525379 323919 338015
14829 338015 749747 295833 729595 74329 113822 679476 579640 241861 391566 438728
14819 438728 361766 311666 721747 412970 567900 699773 559175 224441 767642 508414
14809 508414 546808 631898 589746 477001 308890 359556 542443 855101 741577 605286
14799 605286 751128 565696 617350 526631 596508 446506 288236 584186 379074 456603
14789 456603 425669 492179 626481 535840 401567 438391 479678 414326 857811 628230 469070
14778 469070 333343 223444 406166 688564 832603 588499 318673 423545 475349 392759
14768 392759 415556 549735 641565 773036 546512 344848 703662 431513 522616 588125
14758 588125 641613 697889 553604 686970 403422 334459 1009909 298733 358885 867280
14748 867280 372098 680633 768334 764813 182218 312558 929814 645381 371021 423858
14738 423858 448850 837585 565207 537345 664572 485687 600347 515124 475556 653235
14728 653235 830721 634159 598387 773307 895392 1118295 904584 822449 800110 876144
14718 876144 619997 1035984 795765 840064 815187 646340 634632 707450 892853 1016290
14708 1016290 733768 857763 825273 965492 632476 976242 833059 833556 813309 955157
14698 955157 966812 1091478 1085914 1055920 1314837 1221866 1079105 768311 753292 902484 736793
14687 736793 761160 432289 687941 748589 1028031 1045181 1053106 759699 957957 653345
14677 653345 990145 740301 665041 1067620 782614 1176979 962479 845293 840806 889925
14667 889925 814531 859777 684644 892955 1010047 703320 831706 950586 680965 789887
14657 789887 942760 1099860 838509 821224 1001077 979713 817351 1177854 752047 1258147
14647 1258147 1195812 839977 1381955 1059707 1228252 1329319 1140595 1004247 1067045 887651
14637 887651 1356358 825229 1518167 1147457 1015245 1335447 1296518 1024510 1333249 871321
14627 871321 1114899 771751 1364832 1218585 1215170 1440954 1438022 1366557 1449570 1648031 1120797
14616 1120797 1567243 1279237 1044672 1213998 1315356 582270 1381280 1585845 1404208
14607 1404208 1373922 1284959 1255785 1238906 1444026 1192537 1379177 1490819 1573332 1574677 1493758
14596 1493758 1476991 1544682 1470732 1418430 1175562 1455841 1638225 1933898 1767395 1594074
14586 1594074 1750710 1572436 1814717 1566922 1585869 1692648 1892046 1892683 1970783 1475247
14576 1475247 1805604 1967789 1860848 1790124 1961586 1605192 2119563 1597142 1948964 2147396
14566 2147396 1934911 1815163 2381002 2068635 2237062 2225917 2057956 2253015 2226287 2497247
14556 2497247 2386259 3125950 3266667 3432000 3730144 3910693 5900089 7488925 11203340
14547 11203340 19188131 36317773 43583886 19454693 7258107 3885978 2808341 2195870
14539 2195870 2042368 1832851 2230413 2453506 1972704 2230843 2576572 2973733 4672724
14530 4672724 8223194 6090521 3206674 2344329 1843662 1854949 2012781 2129656 2016539
14521 2016539 1978325 2370751 2274394 2172280 1948173 2543655 2079044 2181141 2304832 2141122
14511 2141122 2130205 2497242 2295890 2459836 2344148 2567859 2472293 2571664 2733950 2517470
14501 2517470 2547218 2755615 2876942 2869601 2845539 2596566 2776137 2981977 2966862 2959364 3014637
14490 3014637 3073711 3263731 3192800 3045133 3024484 3019134 3345867 3467701 3471217 3154573 3136176
14479 3136176 3464746 3370383 3212019 3474462 3513343 3384040 3612313 3393902 3860881 3566419
14469 3566419 3728067 3681847 3635911 3975124 3826263 3998532 3875205 4052972 3742901 4016872
14459 4016872 4083930 4417890 4373192 4486382 4740576 4486734 4465857 4883415 4485840 4956963
14449 4956963 4715722 4557337 4871657 5063833 4807993 5180258 5225731 5382940 5265389 5407245
14439 5407245 5238102 5149770 5529960 5806897 5931413 5425351 5753410 5943571 5793093 6226483
14429 6226483 6051758 6387967 6029271 6535435 6296282 6708487 6869884 7125919 6863993
14420 6863993 6788236 7312198 7132264 7427445 7616675 7739081 7940997 7915698 7963453 8025660
14410 8025660 8592300 8054095 8761260 8457197 8471279 8533421 9001196 9359063 8925275 9554674
14400 9554674 9633065 10024440 9759856 10003762 10496732 10391719 10337191 10924905 10807978 11131429
14390 11131429 11652340 11565574 11428131 12085059 11884574 12389343 12094862 12621929 12809862
14381 12809862 13069509 13375507 13704346 13705261 14312516 14388027 15088980 15182121 15160354 15105051
14371 15105051 15596209 15716072 16100366 16456245 16662206 17376869 17778561 17813022 18174171
14362 18174171 18521907 19246910 19605333 19957759 20426897 20662899 21265432 21891140 22247647
14353 22247647 22591177 23417011 24085774 24341968 24787921 25853565 26414849 26932772 27586252
14344 27586252 28229561 29150784 29817961 30423804 31414813 32595630 33242981 34010351 35473515
14335 35473515 35913199 37440464 38502095 39670927 40989937 42106889 43191558 45112759
14327 45112759 46258517 47621159 49511574 51057487 52782346 55060302 56735600 58685082
14319 58685082 60709289 63119313 65195222 67734231 70388483 73385753 76034171 79143953
14311 79143953 82422851 86274517 89946853 93671487 97862671 102250602 106780407 112074973
14303 112074973 117501429 122650781 128650308 135413424 141978147 149164539 157066538 165223440
14295 165223440 174126142 183713045 193486115 203942611 215099554 227108541 239935335
14288 239935335 252939191 267163341 281844615 297084824 312746094 329234221 346304338
14281 346304338 363456262 380171652 397584815 413852381 429448550 443918299 455825043
14274 455825043 462289375 466870691 469916985 472256924 474952229 475947708 473141804 469960458
14266 469960458 462488044 452281961 440012698 426965707 412101263 395707335 378448281
14259 378448281 361107477 343507816 326577895 309955369 293417746 278184449 263522833
14252 263522833 249584148 235969536 223499349 211485320 200205330 189612231 179845763
14245 179845763 170260588 162005451 153587874 146309593 143192116 135836075 128835021 122767648
14237 122767648 117266733 111307784 106496720 101548029 96951032 93148893 89571119 85852778
14229 85852778 82169534 79125891 76033395 72600588 70192238 67080535 64666444 62383497
14221 62383497 60379132 58678502 56361910 54234306 52653321 50914072 49064154 47738577
14213 47738577 46839421 45221156 43160892 41913559 40691058 39558753 39419658 38024220
14205 38024220 36563508 35552312 34319167 33662886 32815990 32609654 31087174 30397880 29502369
14196 29502369 28595120 27774999 27470355 26289376 25665930 25528921 24750350 24032049 23594605
14187 23594605 23024866 22565031 21607888 21319301 20853018 20137188 19827150 19638778 19053370
14178 19053370 18477908 18123158 17854292 17477103 17197604 16946534 16594754 15862653 16230999
14169 16230999 15468413 15107761 14714076 14234975 14496510 14123461 13925301 13762736 13004832
14160 13004832 13041042 12532468 12385848 12122844 12371944 11880323 11952600 11070589 11398573 10893546
14150 10893546 10866184 10812215 10551238 10512059 10252280 10076320 10055027 9519047 9531490 9375178
14140 9375178 9196038 9044526 9005886 8960305 8917872 8383561 8666943 8515216 8476431 8130515
14130 8130515 8091221 8165274 7730943 7632622 7784202 7577938 7219072 7239215 7175770 7019590
14120 7019590 7156753 7054424 6745810 6553589 6958353 6915634 6841859 6291834 6072417 6235763
14110 6235763 6053428 6174562 5965009 5978496 5956188 5767615 6268209 5629306 6030784 5616306
14100 5616306 5438709 5428063 5574568 5357223 5543496 5280467 5218571 5413308 5601298 5213610
14090 5213610 5065210 4944002 4613219 4641094 4838569 4464752 4372379 4597017 4648118 4618015
14080 4618015 4136501 4351808 4044433 4222872 4308237 3956367 4126221 3927894 4088841 3960922
14070 3960922 3975662 4030017 3624474 4018141 3635775 3646164 3944192 4112868 3935025 3371776
14060 3371776 3749597 3687828 3341050 3024959 3470473 3531197 3380452 3698868 3197549 3452185
14050 3452185 3275467 3249944 3529640 3663605 2905395 3038752 2905522 2851352 2958327 2997990
14040 2997990 3269274 3148188 3050679 2856991 2909594 3076468 2998529 2757577 2771722 2577439
14030 2577439 2696192 3075270 2951006 2946548 2716136 3064791 2468870 2468167 2750284 2220312
14020 2220312 2557964 2390926 2326313 2682026 2609939 2251071 2366443 2564270 2349059 2138871
14010 2138871 2487117 2356904 2074083 2011334 2266217 2121190 2301631 2033876 2206021 2004336
14000 2004336 2028543 1861127 1816369 1929307 1828700 1793961 1804008 1569664 2078654 2007560
13990 2007560 3011439 4177577 6725572 13369983 29183695 46576281 26352403 12503076
13981 7135213 5205052 4499636 4019113 3230221 3383921 2562745 2607431 2787385 2643842
13972 2643842 2199891 2371197 2179918 2411987 2244081 1938309 1850587 2112057 2406648 1957906
13962 1957906 1877697 1919499 1971283 2306399 2081652 1999983 1830872 1834102 1791456 1740307 1867399
13951 1867399 1667093 2005800 1858731 1929187 1759409 1585678 1772110 1495237 1453448 1637052
13941 1637052 1313859 1845924 1648901 1649359 1597734 1208213 1504413 1666594 1630530 1605939
13931 1605939 1723155 1545349 1811925 1447097 1115166 1701734 1484324 1771244 1683008 1338079
13921 1338079 1439085 1379983 1616075 1266101 1239488 1448881 1353011 1475449 1510000 1126722
13911 1126722 1358098 1607553 1253696 1559798 991119 1352028 1292763 964942 1146393 1026093
13901 1026093 1058793 1277937 1759500 1529539 967514 1433575 1357347 1235083 1523870 1345275
13891 1345275 1246295 1358842 1165340 1081857 1391907 1078490 1344436 1377987 1253559 1305258
13881 1305258 1015603 1375562 1647505 1202257 1183203 1001113 1385202 1041160 1036104 727398
13871 727398 790064 1099387 937120 875657 1066118 980566 845543 710965 877789 713032
13861 713032 1048866 1188852 827723 953800 870278 915203 782037 739117 902397 846999
13851 846999 869595 1118960 931862 961895 1084681 1121314 1070061 1024144 807317 1077456
13841 1077456 1061569 816788 696044 902310 987475 1000460 863287 817582 490266 467204
13831 467204 814873 656039 1053714 728007 591135 1019873 922885 983605 818767 813393
13821 813393 841536 633055 829662 852259 816246 739853 717146 508408 389079 1088678
13811 1088678 556408 854160 872025 704788 579939 845346 804364 768174 854101 854647 735997
13800 735997 834230 519247 849305 813913 751492 867037 843524 582760 817105 537789
13790 537789 812793 743498 489555 511657 792450 864006 522311 731244 598035 445162
13780 445162 574135 620713 267310 680137 626222 738330 408538 346771 494008 551302
13770 551302 742584 849819 494654 686893 519300 649446 448697 588692 986281 566560
13760 566560 592511 870632 713076 936995 631763 602960 773437 361425 385683 465916
13750 465916 653282 717101 779162 504137 564827 357715 444199 420677 586949 489113 759233
13739 759233 654833 540707 296650 751996 377483 542482 730716 480397 524510 417050
13729 417050 784222 519670 415206 550888 541480 660141 104037 383300 291929 948077
13719 948077 564045 710610 562080 575403 429288 735559 345236 248417 714620 413586
13709 413586 29189 462134 362215 707752 169212 390952 617639 397489 868675 272541
13698 613087 453348 336219 606748 641175 456220 283586 635577 492066 734314 421737
13688 421737 445639 764997 308936 392614 447057 702499 145191 603263 425455 400284
13678 400284 827729 202968 509646 543086 251534 -6414 495826 320975 574802 766596
13668 766596 432349 295692 631665 456787 529104 650232 445614 562122 276520 561442
13658 561442 598777 243416 203316 526849 458533 460746 430612 405000 731160 174668 230583
13647 230583 539445 54575 478630 85898 371945 532425 746114 359889 683076 315951
13636 594363 291152 254666 611971 424242 273028 281295 250653 619170 392122 195647
13625 255480 502473 177389 310866 99162 707853 294684 304506 39383 443423 45849
13614 268403 347701 398005 96666 227824 208464 483655 396651 204864 193270 268593 183089
13603 183089 293891 410662 727547 583430 15546 518469 608995 580668 326851 204371
13593 204371 95799 347754 311366 221212 298631 43889 450259 528226 511910 230234 277516
13582 277516 214653 126733 260635 175025 154782 129421 -32215 442102 400905 25045 262611
13571 262611 -43734 172601 321654 277569 -18876 73492 359969 277859 167964 404200
13561 404200 545204 180490 83615 517844 111595 540845 279481 352660 233592 147773
13551 147773 310056 165773 149904 315911 163067 250578 313272 130198 112189 172115
13541 172115 460463 493933 425290 427088 346174 -121131 373480 178281 416754 278334
13531 278334 292008 396861 493990 -120299 12860 444719 219592 690221 162634 1134
13520 57427 697627 141481 242146 278499 169608 224007 571 159174 394420 421989 -21364
13508 -45507 100211 349434 168573 315361 331101 460654 65603 68814 295365 216564 353682
13497 353682 357573 183836 168080 -170902 95015 -33216 422781 535602 231351 -759 -62702
13486 -62702 143612 28859 588118 307988 595984 310395 535051 319002 -23155 253095
13475 339947 208190 57403 169388 168105 75434 171393 156513 528771 478602 577423 181437
13463 -112553 111020 161522 188662 67888 293620 392981 118550 168347 172838 411824 77758
13451 513357 112801 -134589 -65594 95677 658165 192596 144035 6773 154850 -23089 364107
13439 188991 98534 429891 242740 441694 98393 506563 268745 249781 341585 -34275
13428 156308 213072 91820 457156 95451 298253 194543 180704 111891 5527 173239 187646
13417 187646 -51136 -182709 -90862 146985 499172 177150 300209 143779 275155 362721
13407 362721 218920 274198 355044 107516 178426 90841 174212 104549 168830 201238 395698
13396 395698 375873 197043 47754 226068 -25413 534488 374557 -41242 34719 96857 -36128
13384 93588 229331 132006 150509 -95834 9772 -118285 9635 205566 95246 80413 -148541
13372 452524 176178 -93331 322410 30419 286233 334449 227205 72817 452108 230411
13362 230411 10860 170701 366008 -76513 18582 66713 231588 96469 128335 278805 336611
13351 336611 142993 78200 36088 107934 234939 709142 19158 285364 200892 681263
13341 681263 274733 377680 -196363 404691 481058 542857 230655 443789 487657 -296613
13330 168357 586756 344460 133007 227356 64747 107827 445817 245197 449301 11047
13319 337897 148554 345914 74467 93305 356670 317993 322878 159212 68946 162412 179199
13308 179199 309515 152232 -117433 576671 63402 -31803 -52164 -52565 -176850 56797 39597
13297 39597 71216 457948 181943 -147290 -218170 39793 47234 245697 70995 104185 338417
13286 338417 194797 185046 -65475 158964 112178 183676 215555 99702 281980 212334 54909
13274 -124061 8247 -128002 -226788 209283 234844 -28973 108091 52065 265154 382521 138555
13262 -127672 313325 171212 -157490 208734 -57544 -161435 -38887 -19495 210836 145399
13252 145399 119360 192467 305182 28674 -8133 281871 304667 -121100 -162194 56400 394502
13241 394502 277391 131519 100060 3498 231182 45357 61044 -338255 275702 -200800
13230 -22894 115935 141910 -44340 49638 -7893 188825 427689 -13657 154739 -2207 -238135
13219 -238135 -105405 334671 -251757 194961 130639 80146 189476 293672 -51284 281473
13208 231331 38418 -41697 244925 28843 -204526 -115137 -38992 115285 243945 349779
13198 349779 210278 -111464 -169129 -251416 -205991 -209864 -109944 -188098 -345931 -20269 -27858
13187 -27858 -60272 204813 267177 435951 11951 247402 42338 159461 159494 241683 180157
13176 180157 104762 108545 263010 178290 76849 302186 191746 -85812 521 -140641 -132525
13165 -132525 319954 -142565 232463 -118155 74675 57697 -112689 149315 101851 299413
13155 299413 141475 6246 47441 293564 270819 383295 -63337 47502 146228 58322 -245075
13143 441913 49114 191872 -1571 67459 70861 316984 36188 14068 31433 -245937 -161956
13132 -161956 148974 -240604 405264 -56520 -254712 494228 327066 245880 208688 84672
13121 276210 288860 -167153 450558 180697 -37203 7533 2830 87334 -14628 100902 424913
13110 424913 84369 321957 174360 112008 -274384 32626 187339 -210333 -333887 -293969
13100 -293969 455409 -214146 224448 382277 -168392 210237 -172498 -262818 262586 -180873
13089 63107 -256579 223506 -196141 64761 216280 64715 -167063 121106 241791 42654
13078 6796 339101 92122 155656 63386 474437 -184173 99699 199201 55194 365213 -20853
13066 231959 -18376 -216364 165728 123690 -255161 232945 -173055 361746 -12463 98294
13055 -5060 -230490 322450 248504 43989 251228 -215824 177643 -32599 32638 -7231 168817
13043 29393 31070 167450 313361 1613 -182035 68513 123609 332002 321315 121888 -168275
13031 173179 32460 196018 310078 104642 47767 88747 194454 149426 -114220 135219
13020 -152292 161574 267155 100810 196878 -17866 -79556 122518 -282842 110214 305595
13010 305595 35400 -335226 -185512 111201 -23794 -99955 -238185 213561 -18525 13459
12999 115651 123091 173265 185547 -30956 -326389 59502 151014 48359 126250 -46808 104267
12987 -205178 -319000 -78882 -264351 -62898 441499 -170297 -3417 62242 -962 35013 -46729
12975 113963 44048 99324 -337733 66081 98794 384006 140488 -26982 -427 -279329 256232
12963 -111467 81887 -35940 -138783 -32940 85744 -1347 184841 70395 32670 -177809 125092
12951 -139170 -90667 -205983 -76415 -208716 -78214 -70485 129695 48463 -67961 -142675 155178
12939 -241701 84133 321990 -43199 173922 -71452 111061 6292 -258743 172953 -284231
12928 -197394 18737 -180338 -92115 112070 184422 133577 123133 289517 55814 119956 -319282
12916 268269 22313 30175 329866 -7530 27771 -115870 63942 38266 82639 -238827 -106468
12904 27453 149639 141618 -134781 -202680 93376 134567 -6739 -386406 -112165 -78910 -301194
12893 -301194 139455 -481936 -260321 5466 83333 -149979 125433 -2636 -168689 210918
12882 249922 -55607 -188084 153759 -133227 205648 77685 -128656 34127 -219918 378435
12871 -41804 -127010 142980 -299450 -152145 -35611 80374 58518 -124203 191126 69231 203288
12860 203288 -148050 110233 -72108 96578 -314243 52060 117298 -62229 357354 -151214
12849 110751 118248 -367693 114098 14837 -7474 39877 -61682 39889 327817 -271612 -142922
12838 -142922 589535 -58507 -166971 -36547 -251825 175021 257971 53502 -108358 256091
12827 -167014 -321625 30949 -60786 79938 -172555 227044 252797 -150838 -199743 -151307 277101
12815 248967 -106659 -291709 -55839 167271 329296 -131760 299656 320868 -244522 126456
12804 129593 -105014 36855 43367 -11964 268660 127071 195395 165183 184309 294038 72973
12792 314265 133945 34720 -98302 -107185 406456 -8835 68396 113698 34664 307611 -191025
12780 -56764 -158138 52259 18396 97250 49369 -119185 -307789 88748 -211475 -174146 29187
12768 -125710 -252740 83229 246719 95739 207881 68042 248497 -28433 273088 227141
12758 227141 -277372 -147930 -98227 112004 171407 -4548 -144912 -63230 40214 208507 189524
12747 189524 -194430 -355138 215045 -241631 -12267 -53113 -21267 -227834 -174680 -342821
12737 -342821 -227277 -223991 14554 -286876 -187451 -148908 -257293 28695 -221268 114587 320754
12726 320754 -40705 204001 -280552 -139020 -77967 81397 -86681 -43695 -11852 162579 70491
12714 178715 313080 253039 -206274 -118431 57192 174051 13899 175069 441993 311115
12704 311115 -166031 -23864 224469 -3346 171180 -231930 -118388 65180 77240 -134779
12693 207202 -87923 216360 -52979 -134061 -160882 440640 -217649 -115670 37783 197649
12683 197649 -137783 100677 -194238 -159884 -110342 72865 -60761 31377 148476 90154 -281623
12671 263306 70616 -253327 -919 -285418 201856 -254667 137060 -26669 74546 575980 402686
12660 402686 154767 -60104 274702 41715 356953 -33039 214846 -1244 -114003 196078
12649 189188 80419 293801 -55576 -2552 331659 211196 126384 179256 -112531 287817 -145071
12637 -34861 -165260 -25868 121799 -95947 72365 183499 200634 179121 266370 -29133 -83491
12626 -83491 89001 211896 260998 88367 221038 -214495 69852 -46612 -44119 86885 243092
12615 243092 272108 460200 95300 158645 -140358 309075 22259 -242971 140742 420273
12605 420273 243537 -198144 65826 -262662 196000 -40823 -303462 212204 113878 147257
12595 147257 173148 83598 -22069 265525 -2910 91356 -227378 -29869 85086 -4024 -9995 34949
12582 139772 -62991 -51241 91972 52545 173265 -259137 47208 79153 -182318 160135 -79902
12570 -414561 -96276 136545 -33865 -161138 -41375 22981 70967 337155 -116850 203222
12559 46622 88651 -68441 109412 107855 166184 -303104 -159547 -62904 -161919 -163468 -326163
12548 -326163 -426348 150397 7739 -173245 -88662 -47207 -86826 -308127 45194 319177 -79253
12536 -44398 11904 -301940 349488 -61811 422182 75038 196090 179406 -6466 43742 188430
12525 188430 159575 252239 79191 1142 234241 47942 -196601 81661 -244371 96572 334901
12514 334901 209580 -130142 211971 143306 324977 139056 63554 180187 275851 340069
12504 340069 426622 361475 -152055 154735 12583 -83610 154562 125461 -126056 -219989 9506
12492 18129 -112345 83774 -52347 173099 -350217 -75089 -206869 -176916 29148 39927 302428
12481 302428 151650 -164937 -84270 103697 -27869 3082 51387 178459 -10844 212741 31127
12469 133510 -199155 146186 242644 91903 -5959 808 30979 -123382 -116732 12740 58125 -142416
12456 -70382 -18293 136375 26469 -31084 108656 31976 105754 135287 259434 -87784 10052
12444 161683 66502 209065 178873 100201 345973 -76065 136801 -344459 -84452 325812
12433 -144619 10868 -195942 61995 65120 -90977 121412 -48142 131293 133911 117680 -9080
12421 224486 182150 7688 -226288 53766 -358596 29402 119853 58099 57420 -7949 -180500 -257152
12409 -257152 -358107 -2348 -78154 49196 109138 100169 -196749 218875 139669 199575 69665
12397 316048 101509 53288 224904 113689 284516 -91617 -30981 -100685 198682 79486
12386 130590 399062 278910 114566 -99512 139856 339640 83737 92908 144989 -190219
12375 27403 81414 -268164 -67564 -91033 -101414 -145818 -161625 -55083 3497 32464 232469
12364 232469 -161510 -299245 106906 -867 106861 -135187 79299 107260 -193646 184741
12353 -212873 46510 11031 -7513 -39252 177793 87861 106103 -28470 -108123 28598 -97990
12341 -110010 233473 145918 -53281 401127 117492 -392803 171628 206342 -152005 -66884
12330 163041 404116 -133045 337929 314727 -60893 -174875 -158029 -53459 242489 -14842
12319 264111 35597 12949 82161 -94597 106226 520133 287466 69234 152248 -34132 20779
12307 153737 196560 52383 129294 -271274 232577 106307 -240415 8513 -17019 38874 -31827
12295 183841 262335 -270439 -296259 -72529 -332010 157177 -162905 437343 22979 -214419
12284 -102508 219463 -93846 -51398 238959 109644 62003 -148454 -111190 160443 -71670
12273 -82884 133193 -91205 231955 -30634 -226979 -176763 300125 232441 230403 199627 -335697
12261 16516 -6203 154742 158779 277101 -251385 202413 -31189 -51527 84289 110850 204398
12250 204398 -72111 31671 104268 267726 469238 66773 205298 -169400 -159792 -119464 -74
12238 119080 -102627 29754 70916 77644 397477 144018 -65052 219901 249541 111994 24549
12226 177081 115629 193371 387572 -130041 355195 -22282 572362 -55095 -62065 181770 451313
12215 451313 163775 278126 224702 496455 63931 272876 76775 449281 327210 243121
12205 243121 124168 244579 22638 406174 221027 19503 268618 621841 -178039 433302
12194 500771 19311 -67767 600417 314966 584265 485349 213427 99841 534805 106021
12183 186405 230722 -102355 112364 297575 135372 45888 -108755 -33259 287741 58045
12172 -80099 224125 2406 428194 73853 294650 96967 56444 298373 169440 28217 129993
12161 129993 547969 294613 -29576 8427 210792 273735 102844 157234 -100140 -11871 703
12149 27695 407216 338894 253173 201400 207268 432909 46881 5007 120309 134963 -165443
12137 199809 -127498 499016 349398 159946 321626 37062 189909 73439 237177 309895
12127 309895 58252 222478 -135749 167914 -129682 340349 103202 -61107 303985 147328
12116 215610 -232276 -123197 326736 118309 -233355 284716 330482 311856 -66763 291028
12105 169874 91001 -167287 190694 -59904 -238537 -83507 -180175 440703 -214303 7309 171452
12094 171452 -400 86952 -198060 -468734 89613 -105445 209589 60663 -125136 373784 227001
12083 227001 261644 189473 225887 -513739 312587 133347 155941 342846 262926 -339265
12072 -202916 -160994 -133103 137274 -116390 8452 -261459 -92408 -120046 -107994 32126 126907
12061 126907 -55625 -6482 -6444 64286 374470 -135565 155844 235963 351631 57650 -35729
12049 -24030 -116812 -170318 -337919 -48220 222114 -126541 -295493 23884 -200365 330346
12038 309559 41336 -142452 99175 -10894 72924 177145 -43911 -44876 152509 71564 26519
12026 4990 114045 127771 156375 -34519 -257778 -56647 18418 -407711 18215 320524 80596
12014 77888 -355005 64814 -191908 -46084 32895 239727 -349934 -133257 173749 292585
12004 292585 148528 -202288 -58006 82164 -86014 -1591 -41840 -76607 -151900 -152243 116318
11992 80003 -161672 -351199 57438 -260406 -214088 81601 -20742 -359636 -19308 -76924 -85286
11981 -85286 -370333 -286025 202997 -213068 -171651 18192 51799 -52540 -249258 -24242 -167132
11970 -167132 -43303 -33611 -169529 -302036 18479 93050 -133236 318043 -348239 -156045
11959 -176107 -262649 17357 -108739 -103922 -178282 55911 179421 -54251 113745 -353037 -220060
11948 -220060 -35301 237620 -138451 87364 23565 173432 41201 -23463 -271675 -2356 100457
11936 -170734 -238869 -114166 488388 -99817 13556 114789 -166903 -426200 -21761 216502
11925 -11990 320970 16579 -84786 -121408 -85362 -48301 -47153 107208 395642 -25235 68834
11913 219653 -117392 47823 -239779 19377 -4695 350582 -210597 -122813 28738 -28242 -251056
11902 -251056 -406938 -126301 -96236 62836 274711 -242586 259904 -138594 -107487 275405
11891 -158896 -114935 -471011 187355 -192835 320196 -190953 19333 -373991 113958 -32050
11880 -73077 -395885 170924 46714 -47731 47413 436129 -143254 -287008 -62341 -93834 -109430
11869 -109430 -253383 -93112 -70376 26627 -124517 8533 -98734 -229636 -202436 -114679 431265
11857 -237419 -10495 -55382 99339 344756 -93634 -81901 167808 77770 178327 30220 -133314
11845 -87770 38785 -23668 -299091 -68461 -77083 -81954 -362353 -99409 229786 -222763 -65732
11833 195276 -219990 -91525 180047 -6971 -132766 -71190 -401626 41042 -177899 7182 101955
11822 101955 -122253 -259303 -70022 -123142 -285232 -14425 -240130 219535 -155828 -105660
11812 -105660 -71618 -33878 -213716 -203851 32651 -142858 326184 -83353 123364 -356669 89702
11800 -29398 19292 -73541 -346228 44597 -50596 -166531 115304 -86476 -66830 108751 -39567
11788 139512 -40398 60510 34907 -236366 100814 -42232 -304216 23108 -310763 175021
11777 19020 6937 160155 -316721 30586 278002 -122725 -196860 16066 25112 -222539 -116979
11766 -116979 -290601 15692 -183978 -57782 -52385 -139592 196903 121032 52198 -208773 -372156
11755 -372156 -375033 160624 -98052 -37690 -123052 109025 260873 -161850 -193598 -139869 180296
11743 -66263 -266539 -81690 -55360 56085 155773 -44689 76503 -31091 155503 -222712 57489
11731 -51916 -166796 41308 17062 177006 239135 122761 -227939 -19116 97848 -216318 1464
11719 -123825 -21803 -25015 -93919 208644 -144548 -420536 127373 -102587 -243497 27239
11708 33450 70198 -87409 -7291 -67128 17380 11885 40791 37192 -182205 115410 -13083 96983
11695 176527 298321 105468 13447 161868 -136956 -15805 106593 -190920 -112860 -228059
11685 -228059 140592 -319550 -192519 117065 250442 -268502 -22755 -349097 -207351 -325268
11675 -325268 -367490 255973 -66529 -166980 -98664 -74277 -218135 73194 -6455 161869 233153
11664 233153 -19416 -30054 19557 185919 -363684 292708 -73569 37542 187242 -48513 -173412
11653 -173412 -154030 -43513 -192421 -77154 184381 67774 130453 -54196 -95716 30633 -325038
11641 -226636 579 -353499 -90405 -24817 73972 -205994 123739 26532 32448 5202 -161174
11629 4224 -299577 -80092 -47498 -244049 -195164 22520 35906 158159 70724 -42803 18870
11617 331124 213099 200335 129692 18061 -283674 147401 247057 83167 -86132 43517 -369349
11605 -39885 -1104 120109 -24398 -164682 -48248 -11282 72803 -46707 -15328 33361 -108712
11593 -174689 -415525 -93896 -73020 -189502 -69870 195934 11158 103465 -45536 -148510 6468
11581 58628 12265 22091 -224286 -98321 133035 -152279 22236 63722 -72842 -114276 116095
11569 -302956 368391 139453 -291534 153605 326139 -440019 95718 -185161 -47686 -4590
11558 -88002 -164495 -105185 -135345 139934 162327 73628 245244 -8042 -247941 -76360 -296511
11547 -296511 -154023 42184 -89492 -87472 -131496 -286371 24358 -77801 -58094 -153552 400206
11535 32327 -277923 -92247 6018 276515 446965 22635 -288256 -79138 -45151 -233555 -15697
11523 -96174 212928 293625 -33297 232276 377110 179545 -65381 48575 39344 55284 153074
11512 153074 315783 206776 245719 46769 69529 -211581 161838 266351 100040 -234377
11501 -173039 259252 -57850 207567 315497 47198 -119153 203686 321853 641284 110471
11490 -57512 421187 -43229 79826 252415 461799 188532 72311 78437 202086 -89306 235485
11478 554183 85212 194355 214531 188099 97540 166527 202846 302536 82308 213767 146629
11467 146629 315030 401715 151825 228634 11298 288150 208552 260756 353756 37045 173738
11456 173738 -24704 53023 127475 -107575 112496 137911 -112531 298316 147583 199182
11446 199182 18302 -75291 85937 277316 199810 -127423 362920 65733 130526 -423432 45079
11434 -73221 -198004 -346998 -30803 106830 198192 233852 67410 170035 39431 -70420 -183339
11423 -183339 -59835 -69873 63861 225270 -121738 59191 -200337 -268417 -507691 -64736 -75150
11412 -75150 -3553 139731 70955 74205 -24740 -225943 136446 295175 62062 -102379 42041
11400 492262 -243172 -1701 244289 36190 -124396 35138 220172 -316637 91498 -9403 197231
11388 152972 -88297 -100042 -65345 58896 -125401 -93960 -173235 -87599 -243889 173843 -249794
11376 81852 -295330 -192602 223346 -305081 36863 -243260 7250 35058 174082 -102594
11365 -161127 -397982 122253 -148750 -314376 -90267 -93500 270868 -266369 -309270 -142119
11354 -58540 -140687 110630 -277897 -163025 -155784 141167 188893 65782 11387 92175 11421
11342 74602 -217109 154555 81698 359051 -91533 78527 -124401 147072 92622 -164660
11331 70858 -192803 217513 161244 -149561 -304685 -35067 -255030 1421 -181936 -139994 -156532
11320 -156532 -24285 -161324 140179 40396 122781 -121173 -14365 -180360 -267921 -243673 249903
11308 -99545 123175 137517 -250893 -135066 86078 -191378 107339 -526554 -226070 59513
11297 -85009 -45403 -260727 23418 16910 142745 -156074 -222902 40633 37566 228101 88564
11285 -5832 -33998 -38918 -65031 -1575 120210 76632 87210 -49185 -301492 336559 107633
11273 -77537 -7623 -91231 5413 126764 -90184 -85891 -31125 -118089 -198532 -218622 -187746 -207151
11261 -207151 86828 317918 135801 -233264 -25992 185017 -130722 -271683 -372547 -53671
11250 -320735 230107 -98514 134594 -117143 -74711 -76598 43426 -157711 141031 117198 -246768
11238 -10545 24835 -231099 -222680 -202535 69300 -772 71459 37151 -22880 80198 -166783 76840
11225 -155579 331004 36257 -13795 -151075 270096 83467 13450 4958 -46341 10352 -113442
11213 -21749 -125677 -40106 -41551 -66184 -428963 106422 17101 191782 -227051 11821 -130026
11201 -77135 -251420 -16879 -327836 -117419 -190224 -24502 -214171 130142 -321210 201361
11190 5154 251876 -103698 129081 -393121 -73361 -198711 -92141 -188726 248835 -44162 -112704
11179 -112704 -323175 376836 28012 -20934 -416292 -44339 -200129 143497 -29635 11819
11168 -39382 -296281 -52258 -53366 118332 -194328 -316518 -331369 -56261 -270901 429513 163983
11156 -68737 -144370 250502 -50988 -149725 -243360 -231329 -22386 180021 -11671 -83705 -124534
11145 -124534 -138879 -85641 62506 -70144 131571 -51442 201022 -336741 -101498 -215735
11135 -215735 -143845 -109514 -111617 213739 64244 -15450 491134 -296228 135915 162614 59528
11123 -104292 45228 -109402 -15164 8444 140838 -45841 21640 240728 -414516 268517 87982
11111 -45240 80048 108412 -184246 56617 -248904 176002 33389 379541 175934 -69353 48218
11099 134132 -35433 493766 397031 163555 179375 -172215 66759 264720 154876 369617
11089 369617 225769 94351 126216 -392923 -6432 174815 16797 484485 118079 366506
11079 366506 245336 344695 179607 402477 -223399 192929 217116 17936 354250 70990
11068 234073 408554 412382 54484 406406 409370 615481 319962 336590 244317 346823 620379
11057 620379 650251 529540 588240 467707 298396 234308 489656 871429 975661 897265
11047 897265 905354 1028935 767825 1256999 928515 1037685 1015492 957101 1112251 1045605
11037 1045605 1034037 747791 624310 956749 1079900 1208204 789434 624691 998570 1119276
11027 1119276 818740 769249 664285 588684 976006 943428 848904 742752 801513 766309
11017 766309 792859 545119 346523 514534 449328 1048338 1015201 388847 529187 560022
11007 560022 944763 727576 637695 782479 621551 705193 667381 462907 372489 238518
10997 238518 737435 751828 763440 562657 647840 568619 956009 817344 758011 702107 751334
10986 751334 700668 595298 800139 932505 1036312 1377576 906467 1442938 1096586 1179948
10976 1179948 1376154 1581246 1717307 1956009 2220247 2384474 2478239 3378450 3367234 3455527
10966 3455527 3490714 3886206 3557198 3388961 2822997 2372218 1677148 1514168 1231280 1305753
10956 1305753 737718 901518 864124 1170219 1043053 703326 975776 588150 263199 318452
10946 318452 440350 248746 223795 182420 329778 -90652 33229 253903 92691 -29546 -28477
10935 -28477 190518 22218 -24466 200050 66257 -53872 48673 66135 -11072 -144714 -109617
10924 -109617 -274727 -161941 -70621 -98498 396446 -106062 -110003 -115074 254740 -222065 -19711
10912 252147 -71505 -113784 -164307 23801 -172174 -94172 -101330 302829 -9022 -25998 -209283
10901 -209283 -13384 -32865 -205537 -6109 369937 196878 -172632 273714 78530 -134923
10890 9377 6284 -316516 1616 -244640 12575 -125044 -74214 -13955 -74922 -47837 9151 -190917
10877 -69000 51353 98353 259875 98927 3060 -3755 118620 8730 -212819 507903 -282393
10865 -304370 -177608 -102881 40557 -266089 -159491 -44296 -64020 78164 -81537 251177 -281578
10853 -34245 141529 62137 94347 -16380 -2860 -148332 328505 -436009 22671 -58873 -189202
10842 -189202 -33897 -393469 -49558 -224018 -4391 138857 -226878 -155916 9719 -245229 -38130
10830 -80062 30922 262263 201730 -294301 55534 301294 -376036 61606 -175132 7651 48685
10819 48685 173983 142595 167595 20504 92414 -125733 -55040 -100039 266980 -211228 -573488
10808 -573488 76031 -282425 -26567 -28229 129405 -162276 50942 -121564 -6081 27538 -149786
10796 -197891 -142612 -172133 199676 -35819 64282 -381676 -191517 -237865 -49460 -81715 2179
10784 176083 -39856 -71602 50906 -127158 -312166 63490 -106397 73384 -223749 94672 -121989
10772 -222718 190738 -117288 -57013 52675 148691 -180359 -217459 340479 -264457 -182357
10762 -182357 218984 -537335 -101088 -63364 303363 -177152 -154814 310019 -139154 -413412
10752 -413412 -30189 79859 121100 -62322 -337667 -344981 58980 -72617 124632 107164 -56062
10740 189642 -146554 19860 -38459 91301 -273907 -209623 -184646 -269372 39554 162326 -37738
10728 -329473 46467 -40689 -63784 -162408 108436 -104438 192300 69036 161336 -70001 -115014
10717 -115014 64695 -182692 -80319 22138 155528 20627 -240632 143947 300324 23440
10706 42709 -176613 -108975 -289467 -228294 346775 41439 -304842 115922 53793 -89640 216255
10694 -82157 -78129 67535 -62744 -184947 -149918 125611 -128450 106213 -288180 64361 -17626
10682 25298 -8118 -308004 104394 -444110 -147680 -52081 286051 -286169 -167172 -26508
10671 -266978 -66204 132365 -156325 -215202 -2842 -281025 -51273 -372207 380497 48254 -71223
10659 -101433 -155337 -342150 -220734 154818 -339569 -85534 -393513 87330 -64163 -170671
10649 -170671 296495 214533 439614 -193282 -62092 -100412 -190103 -108084 76051 184377 11620
10637 -309371 45677 39752 371560 196697 -47085 -168837 -223358 -129007 -20179 -32779 32311
10625 -223211 197457 107704 -307375 -411219 71677 279314 35220 -291044 -123625 63993
10614 39445 -11289 -282955 131562 78555 -133530 -135187 74736 397523 -317212 -193793 -59964
10602 -12580 252607 15276 85848 -26017 -53882 -20680 408686 116305 220886 -21 90586
10590 365539 -148304 -72530 20757 -162803 210439 -28997 -75794 -295230 -224241 -202822 -197408
10579 -197408 -76261 -189531 -158695 -150265 94263 39082 28496 -16480 -138878 -108237 42519
10567 -248531 -152929 -132439 -89769 -73748 296632 -105856 137915 8638 11278 -111321 -351104
10556 -351104 154818 -335433 26404 -20255 -27630 136929 -448088 -59989 185346 366995
10546 366995 142653 88921 4941 -50162 -153088 -174161 226597 47759 -215147 -421213 -180894
10534 52894 -100997 72727 -320610 3627 -150430 -311413 -96433 72143 -30972 -50496 -225819
10523 -225819 -266443 93360 -96343 -108606 208849 175180 -425049 -57389 -183991 -423577 -181003
10511 387 -248967 177385 -173221 -265212 -303800 104516 -83078 39795 -226521 -15236 267716
10499 353663 -248178 -294832 178860 -288986 -56936 215261 -340169 -203922 250739 -67370
10488 -123290 -181851 68678 29985 11336 -101454 -14462 -53634 -187835 75309 -243670 16424
10476 -412292 -17235 80092 2713 77780 82810 -130315 -185709 12287 -88469 1431 25672 -63025
10463 48212 157459 25917 97834 46541 -161246 -277287 -154160 5676 -111691 19711 -244080
10451 7179 75169 -171100 3031 -328159 -136293 -227540 268112 -313846 108326 -324606 -207818
10440 -207818 -70292 -170195 -98653 -226692 -144366 -127618 -472879 157422 209020 108240 -267470
10428 -29653 -106333 93311 -244351 -308305 -363697 -329591 -16157 -35615 -31380 -31767 -301033 -63096
10415 -615 -236282 -425887 16400 91576 52548 -301311 -232837 -103889 88209 -255780 -532056
10404 -532056 89146 -60521 -33514 -253052 -244388 79883 150487 161067 -33350 -26814 -213219
10393 -213219 166099 113778 -105656 183585 328163 375598 51438 176619 75268 165391
10383 165391 225020 495708 149203 -407153 105340 -67286 422336 218785 237671 184195
10373 184195 40181 268838 650253 329155 491322 492203 345010 406782 184895 407517
10363 407517 626052 1008958 449495 342832 93011 315697 476692 48922 234080 161629
10353 161629 -76579 790254 510519 473854 425929 556091 595174 398774 516186 445858
10343 445858 299133 58251 -63091 137170 281889 283982 -10400 409371 145696 354674
10333 354674 346055 44459 191361 329796 128048 355145 10881 184660 155916 181273 283201
10322 283201 139256 326778 281619 340402 251282 51048 -97597 432073 322645 55400 -126437
10310 24472 21387 -166349 -283418 -96275 -118089 164865 -466216 -331974 -511118 -82774 -174552
10299 -174552 -46562 97404 112798 -211150 -65378 -104819 85889 -21696 12330 -208186 -64944
10287 -84504 -73588 -222069 -306747 357294 -34843 -95914 -73629 -19181 -194033 135536 -163770
10275 -385432 137086 305079 342248 71536 -236869 133205 -90017 -72921 -97732 -286467
10265 -286467 -31346 -43188 99016 -91789 -157567 7332 -193225 -153494 38942 -26350 -409136
10254 -409136 206482 142438 223652 119679 43011 47271 334994 -138023 297589 -20083 -364394
10243 -364394 -53455 142802 -83980 -148884 -352276 -11895 139687 -154343 43733 -36951 143998
10231 164540 -219278 4277 -314719 -7830 244017 -282657 -35495 -144676 51022 31932 -49761
10219 -335223 -79699 -92943 -307962 193241 -50106 -94685 -11085 -21634 -31861 -1403 -74518
10208 -74518 -193087 -164725 196953 61913 -43403 -113357 -173610 -155299 -44437 -158901 296422
10196 -330157 -325295 -81577 -141456 -282745 24393 -27286 -119358 -164991 -99424 -19721 -48115
10185 -48115 -34985 -334359 -131252 -75167 -190949 101200 62180 -116367 -10588 -86546 -43633
10174 -43633 -131412 37860 26462 -262944 -18841 67537 -141208 193643 -377049 -71723 -74056
10163 -74056 -80941 -126597 -74826 108662 -112760 63246 -235600 -160835 -294393 129785 136684
10152 136684 157653 -307992 -510993 339844 5568 22688 -288197 -20538 -170550 -367165
10142 -367165 -123910 -38186 273952 55132 157776 -221125 98768 197377 -282462 23020
10131 -222518 -58617 -169568 -343439 -50518 -60623 221733 -255002 57410 -456710 -240833
10121 -240833 27962 -57538 -85168 -19324 -379787 -77098 -206644 -79727 76376 -37197 -78731
10110 -78731 -146565 203167 -123367 55307 9480 -169154 -132053 85846 242399 -47583 -177317
10099 -177317 127397 -335531 27755 -95225 104832 53621 53831 -282037 -162899 382944 402183
10088 402183 93984 85907 201377 -156657 -115530 -83814 -10689 133370 -112987 249310 195761
10077 195761 -31750 -187419 -312198 -233626 -276952 -139133 -305259 -214414 340715 367930
10067 367930 113734 42667 154582 14480 -370759 -230046 -413549 23995 6085 43039 -45306
10055 -345404 193013 307220 -191999 -146228 -10282 -10917 -74753 -78238 -127057 -134349 59868 -111265
10042 42979 -131673 156254 493973 -279704 20422 15640 -10910 26020 -181945 107704 -207911
10030 -1067 324538 -45402 -151241 252245 -101110 -254415 159356 -522494 -291390 -48983
10019 -16804 92959 -168530 230437 -75749 -63666 -217446 -148695 -112662 -599772 66882 140094
10008 140094 -185930 130441 -255071 -35306 -59258 -117436 240609 56354 -3482 -136387 -336046
9997 -336046 89987 -427889 41135 -37889 -26058 109818 -8819 129355 -222686 -15861 -46254
9986 -46254 -38160 -297348 180449 -49503 81616 -79330 -136693 125160 193384 -106917 127539
9974 291532 276804 -217236 33103 -257624 -468198 -282682 -379303 39986 53762 -296407 -179744
9963 -179744 46919 -139263 -193299 -127295 -180142 3728 -143017 -272465 -161423 -191238 -152721
9952 -152721 212709 -86119 -38239 71308 -8999 52679 129992 38444 -37622 249911 -143822
9940 117315 11995 -342376 -27702 -263251 -44710 -146480 -217207 -332060 -36485 -32528 -129098
9929 -129098 97464 -96660 112417 -71657 -139870 -161915 -125300 -14177 -44733 -245335 -84159
9917 -147880 -32270 -157797 -412044 58575 -173090 -342808 273954 -218298 201768 -335519
9906 -196713 262072 233899 150878 -131482 68265 75970 85540 -20811 158094 -57521 -254179
9895 -254179 141450 -12801 289912 -346349 -92212 -24485 -276393 105260 537696 -10921
9884 -211419 235161 52754 -53627 -111584 -159436 -171740 -169651 67781 -21271 81263 40936 90234
9872 90234 206544 -60247 -283645 -77178 -6826 -463131 11350 -65654 -68579 84526 36315 18197
9860 18197 -375497 39565 -84914 52327 -35370 -258420 -523765 -206454 -235318 -20808 -86257
9849 -86257 -31100 290140 -21165 151653 353486 -59343 -202017 166158 -173098 -266162 -77259
9837 -10629 -22562 -228569 174090 -16513 -181172 267383 122742 -154858 249794 -140188
9826 -10463 -164409 145458 148174 84958 -234380 125671 -197005 -190845 -62497 -144694 186013
9814 -272120 -122275 -290315 -263169 -426718 -10162 2382 72149 -114049 -165422 -334876 -9495
9802 -151458 -66244 -108930 -348792 -13523 -63300 -40590 -201745 -136412 -78621 -39800 22838
9790 -196580 -44598 30128 -178 -72051 -44307 -88842 101782 304908 407402 -98715 -38374
9778 -29281 -89348 -142019 3189 -348067 -31754 -160485 39392 16897 38283 -271526 236531
9766 -168548 -152231 -369123 -47099 -114617 -118691 -42457 48982 79336 -416797 -50867 -164237
9755 -164237 -208897 63721 23829 140013 81402 -56288 -253785 26737 -63470 -403885 -501766
9744 -501766 340956 -21475 -38306 -19200 -78538 19941 161760 -400787 10969 -256719 -213991
9733 -213991 -12740 -42581 -27631 141524 243604 -92316 12352 25647 -215731 -227299 -74251
9721 -418519 -48649 -262425 3235 -99708 56422 -181513 -292237 -42789 28862 -67075 -172146
9710 -172146 -156113 24050 39178 -58486 98386 225887 -92074 -192318 -163121 143377 -24598
9698 128947 -188085 -265993 38490 -172651 -360457 -45994 11250 -157618 44562 50093 37638
9687 37638 -207315 -176954 -187737 -292981 -209812 -189072 -256648 35876 215701 129103 -128449
9675 24266 109019 51561 141106 -218394 -86041 35792 -272159 -106062 227299 88596 60926
9664 60926 56032 -44785 -245113 -130775 -165894 -327452 -207532 327475 140071 -80917 139568
9652 -238261 163880 282130 -87371 219918 -189155 -185580 -167452 -17649 -14315 -117262 -62412
9641 -62412 -47030 -214308 80766 -46641 -37263 251015 387126 -180723 -175291 59427 -276090
9629 -339615 -68803 -294233 46735 -203552 81408 -42018 -342449 -294442 -19635 257134 1424
9617 -129198 -148335 163487 -149874 -161082 -35254 407920 -160767 -159146 -483875 -407211 -289710
9606 -289710 132618 245589 113173 335286 -93753 140812 -359154 90014 -32704 -1880 -244556
9595 -244556 -171938 33416 -183510 -194994 -224415 51676 25018 -49015 205740 111575 -325340
9583 -370445 -90837 85840 -76450 -245094 -52219 -292840 -315740 -103756 -295436 -101611 -376469
9572 -376469 156257 1460 161910 -318092 207275 145450 119070 -65148 -46774 -43368 -250120
9561 -250120 -216600 54570 -43488 -86814 -115493 -37422 6462 -45749 -162328 -32428 -245189
9550 -245189 29404 114898 231284 -363875 175154 106184 -341828 236679 -187439 -214493
9540 -214493 -22554 -253604 -155864 -64815 58451 -42765 -338884 -111322 -79784 328789 -220039
9528 119059 -115088 -21235 -337183 -181710 -75962 -486169 66623 -125454 -270460 8481 -142317
9516 -208261 52977 90795 98240 16946 -286247 -168633 -156926 192599 -285686 97417 -81467
9504 6864 -50132 353465 313267 266658 173304 -211475 -72847 62066 125381 -273377 -182631
9493 -182631 -105936 -292500 184491 138422 -83100 203744 -13005 -40981 -274099 -271231 -264466
9482 -264466 -341376 -260340 25578 -156562 -180546 -113235 -155512 -58375 32156 -47983 -221690
9471 -221690 -413379 -204482 52745 -562491 73855 334730 -379910 -61478 -7148 -23449 -291930
9460 -291930 -202884 212526 23633 63304 61517 -169609 67223 33847 -276476 -193318 23300
9448 207601 -6283 230850 111959 -217729 -37801 -162586 -28982 20312 -61990 124823 -206703
9436 -384009 44649 -2215 293172 115583 -323810 170763 -276320 142777 204409 -53052 -10136
9424 -63796 258115 47758 -100958 -251010 -83261 142646 -65469 -219799 -345767 27610 -58891
9412 99253 -181316 415583 -113256 108940 38125 -93086 -128732 121596 202107 -81290 -89178
9401 -89178 -3543 -145104 -104811 -281590 -224219 -70898 -2561 -78054 -8729 -267056 296965 103566
9388 -205908 -92008 42715 122950 -275091 119661 12001 3489 93449 354573 93815 60483
9377 60483 -96585 232120 -105920 -252697 123726 -257781 -37109 135851 -286233 -82801
9366 20356 141782 883 -118255 -170630 368012 -16968 -190528 -43645 -191419 -251779 147647
9354 15868 -247906 -232726 -305642 -63367 55839 24416 45928 -251015 -108729 80543 -60348
9342 285604 -60411 -189847 -293547 -261080 101222 -213812 -87528 130963 -133184 66931
9331 392745 -168087 86035 -119359 -44813 -161339 146956 41529 105556 -98023 -257583 -107271
9319 -114374 -31404 2231 30413 178818 -188602 -74027 91160 -144071 -139512 125538 57572
9307 -399728 -131992 -259567 -100205 -86407 -164648 -31408 -172131 11505 -569 236513 -93631
9295 -374693 -13208 -303837 213780 -5235 -145536 -83240 17458 -239486 240536 -235401 -110620
9283 -65537 -158656 -143979 -69222 -297511 -217685 4654 -503229 -52804 145944 362834 -208499
9271 -36413 -398719 -55667 23528 -38694 -159152 -243134 46575 -105461 -29897 19355 -230227
9259 580 181650 54793 -267853 -36648 -53863 -175310 226217 103833 -190968 126052 -209497
9247 -109342 331519 17636 -209316 -128958 50336 -106695 -98942 -197247 -137060 -239041 1676
9235 111624 209714 -28894 401357 -161143 14937 -304070 79902 -78906 207094 -428835 -28408
9223 89876 -21704 98163 40649 -170388 -205640 -64971 -139047 -84686 -143781 -108953 58794 -11512
9210 -454329 -298985 241683 -258253 -159507 56946 -16397 -365167 -44409 -217000 128592
9199 464516 200178 416841 -205559 5977 200928 -130739 84500 -195061 17018 327570
9189 327570 -92719 -53158 100097 -46500 -200007 -29498 111201 333 -270964 -125880 -166156
9178 -166156 87046 247656 97878 22287 -153035 141936 89772 -296599 32910 355001 99019
9166 237916 -13343 -361634 -185956 -134277 -179271 -110271 -72761 -294601 17034 -301158 -88910
9154 178860 -227952 184157 -257592 24215 -104208 -39690 -187194 62598 -342752 -159213
9143 214029 27603 -241720 -62007 115977 12268 -26201 152788 -214447 135537 219008 -463040
9131 -273729 -412551 227288 -295722 -32052 53093 247043 -552 -225233 125392 14843 -36996
9119 -266925 -274096 -88283 -142011 -63714 73010 83671 187920 217150 -267358 -69737 -276586
9108 -276586 -73426 177194 -23947 -265037 -23038 -91547 175526 15706 -18130 -117027 23052
9096 94074 -115549 151317 78809 266272 -269455 -290274 -207843 -101538 8646 -360141 -59749
9084 -300050 -86346 -332675 -181512 41963 -97560 5959 -68373 101216 228377 17461 82588
9073 82588 -57401 -17965 66108 178066 -75760 -395114 -198383 91304 -408714 -167558 228884
9061 -215310 17364 -301887 -8439 -301224 -54222 -144817 -463316 -28151 -120342 -15473 105475
9049 21480 7279 -28333 -45952 135411 200108 -89128 130294 94132 72895 24232 -212028
9037 72413 -149245 -122111 -66494 155556 48363 96550 -55190 -181404 -270032 -322118 -101716
9025 38241 -27204 -54021 -197905 116709 65516 -228535 -317824 -391128 -78384 -40664 26794
9013 252864 -24263 54681 -25716 -11893 86614 31087 92761 -180137 -204262 38657 -229792
9001 79773 -134876 -257305 86366 -162912 58710 83748 25747 -290594 -129582 -236773 -131222
8990 -131222 -282634 212364 28216 159625 -38875 -485328 150187 48317 3470 337258 -3973
8978 197986 -17753 -231168 -208420 -66402 -96916 -401468 -41357 -52646 -73733 -13383 -284243
8967 -284243 201931 -358881 -75483 -80913 -90718 -36472 389896 -120469 85604 -284449 305329
8955 -153716 -135440 87940 -189219 136963 119564 -488360 -141720 -182408 -42826 -154278 -109297
8944 -109297 -276468 235999 -223443 -20440 180405 -148094 -238238 -84003 190375 53249
8933 -112312 286614 277420 -243355 149436 66750 -134399 73411 168484 201569 92879 1054133
8922 1054133 1310196 2745563 7971232 15488217 4064452 904883 434150 322322 123713
8912 74525 -226249 164810 -153949 46550 130213 165039 376080 357607 616272 400909 -264206
8900 19153 -392838 81575 -110184 155423 -250245 -134621 126181 -167155 74848 139108
8890 139108 86826 6356 52363 7660 -114110 -10531 -156377 -354495 -193817 -365912 -34662
8878 47098 -192710 -93213 96849 15060 34463 -135454 -28857 -40478 -256834 50501 -475533
8866 -374369 -118458 99912 -318809 10590 -265430 -150572 -94244 35026 -84075 99193 -112534
8854 1106 -95369 -212008 13259 -144264 -20469 -216752 250096 -2784 179663 -472862 162778
8842 52807 -181395 250816 -57373 -298619 141229 -36072 -143620 262622 -182978 97194
8831 84207 -111395 -130328 -328037 234472 -127438 16776 -39887 -221759 -198120 248174 152243
8820 152243 -338481 -396519 -359153 216330 -70922 164099 113215 -89131 108270 147394 31291
8808 -122310 213614 -113253 115896 180517 -268833 -198315 -193383 -80112 1985 237377 -223366
8796 -140742 -32866 130412 -241537 138107 40587 -93052 -253064 -86542 93571 6737 21839
8785 21839 -163543 11108 -57924 -21706 -151475 100421 -50887 122962 38273 79538 -150256
8773 -34665 -63830 248840 -321560 -34823 88379 349999 -17788 -151406 425979 -136508 37751
8761 -53004 74472 -226461 39111 -209857 -98690 -158230 45029 338624 -219687 -137476 -368159
8750 -368159 -276192 -87613 -3454 -198946 -122089 13324 -295258 -122924 30154 -77875 194026
8738 98422 -415058 22800 260192 -118939 -13287 -6685 -119870 -365342 -133498 -43226 -342888
8727 -342888 -11710 -261328 -139955 -136265 -185309 247453 271456 339909 192302 5981 59452
8716 59452 -76824 79798 53362 -75381 -223192 -102114 -11117 87716 -130557 106550 143413
8705 143413 20940 -40332 -12860 59137 140730 35691 -26247 -28056 23013 -102391 -46540 41214
8692 -137091 -90221 -95361 -89617 -9071 -130074 -84727 -269366 -348854 -163871 10361 80762 239153
8680 239153 201293 -131455 -214061 -120973 -5946 -112569 -130797 -53133 -182732 36479 -11731
8668 -441660 -15210 -127210 -55698 -382752 139230 245009 -253777 185260 252377 -13252
8657 -142294 -222983 -33483 -168703 -361773 -48841 164917 -252480 -173906 -221155 149728 -145301
8645 -250783 -185434 125378 -109782 3125 -458815 84347 -182440 -10771 218318 -145628 -55634
8633 -138971 83577 93858 -218529 -126465 73332 -61057 -284642 -28581 66269 -362769 32710
8621 -284929 254057 -111561 -123258 -112755 -112060 -6571 -95490 -31507 -100709 103451 -177006
8609 -56413 -192196 -129671 -153056 151852 69311 318175 -138181 -7681 -126194 -201801 -23831
8597 -30197 -232330 -272273 233807 16752 -44171 -127093 38682 -333170 -402254 261453 183002
8586 183002 235569 30049 51921 -53053 47332 -35038 49018 185150 -454738 -406552 44078
8574 303025 -180937 -335821 5886 4242 274888 -347319 6874 95840 -86525 -98369 -386746
8563 -386746 -24548 -162838 -122696 43395 -14263 -165972 -91354 -87779 62322 -260513 -169836
8552 -169836 332729 -250063 35952 -155742 252772 -66546 -176382 -34002 147560 -29141
8541 -96944 -147633 299038 -144234 -76816 -153833 -59735 -107863 134420 55282 271412 39110
8529 -359623 141 126049 7625 104794 -126765 -335746 -429661 -104123 155773 126104 -135368
8517 -26316 -364481 -204638 -243821 -107566 -38701 -29048 -7036 -15484 112845 -308039 78726
8505 -59293 -53403 278520 -189035 -247536 52409 62785 -127239 -370672 -105139 -199686 -23297
8493 -201805 131601 -70023 -90289 -142031 -121143 313350 -273189 512036 197734 104176 30893
8481 374433 219396 -23250 -249115 164677 -269517 -136152 204631 92162 92303 -307599 111424
8469 -49644 -62285 -136601 -38532 237233 54758 -208124 -160486 246715 -71819 97783 32609
8457 -35152 36524 80488 227323 185162 155253 136783 139956 154851 2233 -240328 56920 107784
8445 107784 -289353 204835 55714 89645 116360 -41777 -199606 -24572 161826 -164243 -72286
8433 -39892 51637 -15858 51876 -124248 -201023 68966 183333 -44632 78406 -28628 -156136
8422 -156136 -304670 228097 -249927 -120686 -197349 95591 192861 79722 -207424 -11212 -280287
8411 -280287 -154790 6033 31349 182454 -72726 205219 -224864 30678 -240033 -199119 -312339
8400 -312339 -3190 422471 295926 21605 288985 253774 -255904 -173505 152765 -278351 -133217
8388 -73511 -257949 93532 80209 157730 -149497 -26632 -6749 -80819 77885 175566 -162188
8376 71777 166895 -130139 109393 -197356 -33599 -84284 -325040 -37438 223308 -288073 357788
8364 -73956 221422 74941 -80558 -357713 -228253 -99785 -265130 -76851 113709 7909 -121515
8352 -47730 -38184 -57577 16279 13567 -34044 125542 -152859 -85971 127904 -22788 -321738
8341 -321738 -57551 2877 43171 -342591 186683 5190 -116740 13600 -116325 -78446 3883
8329 -226982 -467933 -240450 -174814 -417894 205516 -123609 107361 -268152 96744 -101777
8318 116131 -350633 -194379 -233295 -102683 181382 169004 136230 -25211 47031 -34728 -137938
8307 -137938 28559 -288593 130523 -43693 -116218 -257915 58043 299360 -60509 279374 180605
8296 180605 -38050 -13749 -93195 -52888 -26511 -283402 -129680 -351648 13963 106571 131067
8285 131067 -318975 -2820 125130 -135237 -108986 115569 12068 33010 192994 -212969 -46225
8273 40882 -61900 -153348 -106895 231069 66176 -97977 122522 370350 -324571 -21334 109613
8261 314607 -33678 94908 -207489 -164405 -559 -277371 -124173 -113728 -264921 117969 -18279
8249 25580 -188519 1125 -344836 191533 98229 -224789 -179084 -178477 -8196 -334759 33813 -83520
8236 -152759 -186634 -132939 -156645 -182066 -84156 85122 212337 29224 110441 -17981 5675 269815
8224 269815 -187580 -106881 19773 10656 -119474 -10117 -261769 109953 189641 -41442 5289
8212 94549 -125969 203695 51193 269419 15448 -164114 -147714 78962 -322889 9264 5613
8201 5613 -286327 -18028 143229 -43390 -170128 1493 -199258 -159018 -1408 16527 -256821
8189 -132681 285693 68649 64871 -160236 -56687 -63534 -152299 -91511 -309238 -7473 -287276
8178 -287276 -58565 -278330 56765 -105197 75213 -81398 -28431 -221783 28222 -82893 40568
8166 -25286 -247142 197534 -202032 -153673 -116560 90992 -222288 -22418 -171388 -137397 29421
8154 -163544 137654 -236205 91358 -193257 -217874 -57107 44769 74121 44076 162531 -113754
8142 271180 -15976 45235 68602 -95762 -236767 -273148 -235838 -169985 -53869 70842 172880
8131 172880 -184968 -153938 123170 39103 201182 -221187 -184920 -218087 -309337 228746 65831
8119 -120729 -100932 78066 -25493 104016 -39092 39652 35809 -210038 53685 -246991 -42973
8107 -25255 -45042 -133113 -113092 -338919 48255 -12072 439356 211426 -61272 -41443 76199
8095 143118 -160302 154592 -117730 -134936 -239218 83497 -152365 -330673 -612 -186346 -250544
8084 -250544 228156 145852 -146 -195263 59195 -96703 -276995 299359 -36362 100078 -18033
8072 61672 -456989 355536 -31718 54290 -29040 282395 10429 -31981 39062 54542 -73056
8060 43356 83600 204871 183391 20159 -249167 -4167 -28621 -65797 -111223 -200272 30113 241340
8048 241340 -213266 -75024 -118285 446528 -52859 68191 -451511 -32995 41537 -251426 12390
8036 -254375 -50742 -246969 -94599 47581 -91141 -314447 158078 -26434 138949 -510085 9426
8024 -183265 253073 37373 91890 94663 34235 -36261 299477 98620 -368279 -157675 -262652
8013 -262652 -127742 -134107 143495 81168 -55001 -244526 -228492 37531 -120902 -280191 -53312
8001 22294 252504 -102354 165872 158193 230120 -12457 10948 -211883 -16961 -197120 76028
7989 94531 -166346 38441 -57564 61226 -175787 -95000 -170581 -92562 9770 -602 -75679 321349
7976 80834 -186061 -3973 10548 -95173 175950 57502 -86078 43655 -55142 -166657 44566
7964 -46394 131941 251309 -240597 -265562 94197 -435454 -389112 -134702 -52325 -186492 154366
7952 -166261 -90532 139311 -69045 235230 -42880 -237200 48746 -178139 -156442 436220 -23378
7940 114530 89217 122765 -119143 -146677 -7117 300847 45292 200513 23837 -160965 -151336
7929 -151336 -203600 132741 37204 -30394 -80936 -74278 148904 -1296 -126893 -62547 -50637
7918 -50637 -108713 240686 334167 14161 -190224 40408 -38853 -105812 148166 -40462 -30260
7907 -30260 150453 -49379 -137009 185354 -181690 -103355 -64378 -13046 146557 4220 196811
7896 196811 48036 -4845 249169 244087 -277631 -31861 77990 -222400 -283154 -281981 292130
7884 -249188 -248734 -194200 47428 9387 -114874 -402620 -73099 -430819 -288907 81682 69660
7873 69660 -86466 72448 -421987 -142000 -195247 -148734 -142063 -146523 66946 -82964 69451 24238
7860 32004 -88821 85327 -91502 -119845 -175978 -185699 114726 64050 17525 -83761 -488953 224732
7847 -155868 46361 97840 -56015 -223876 -103051 28684 -21919 556 268428 336041 226786
7836 226786 69994 127678 -3449 42191 -57194 -97746 210429 -49947 72490 -15398 -93416 -416808
7824 -416808 -291816 -149084 83055 69097 224955 -45149 63450 79909 -101001 207915 137
7812 110122 8881 -49239 22450 -323891 94609 -134937 135488 4649 218838 -113001 -264725
7801 -264725 128586 -31998 -131086 -507581 -369988 159102 -8288 -119736 -79818 169719 207527
7790 207527 -318241 116662 -73583 -133806 -118232 195958 -278521 -99586 43381 -74037 33797
7778 213240 -149944 -193121 -299257 -63989 182372 -239902 -207785 183286 -127099 -350967
7768 -350967 70512 151393 281736 -120939 -104935 2176 10544 -200505 -470486 83011 99018
7757 99018 -100415 202700 71670 -243773 189536 -119530 -323800 -110440 75323 -235011
7746 128030 101954 143032 14309 -163095 -7839 142852 119678 -151178 87403 -12058 201418
7734 13981 325001 -53431 -209619 236992 -130017 75369 211881 -321472 50177 15605 117550
7723 117550 14163 92389 367388 -194615 -63984 -36693 146797 -71393 190646 -205269 170195
7711 -16602 -238699 -29089 -377622 104200 -3592 -125230 261319 -37633 271369 -37804 73380
7699 -120573 122432 -122688 165800 17685 50575 -225040 -33626 -127264 -228281 -335585
7689 -335585 -219722 17738 -342152 71257 -121851 -49891 196305 473700 461185 -165609
7678 840 119219 -20292 -307568 4393 24306 138105 -152098 -32513 -238916 -19133 27143
7666 86668 40722 267122 133429 114745 -216944 -282361 149588 128496 -45750 -251970 -38592
7654 18010 126853 78889 -116026 -142857 -131131 70874 -229932 -289296 152864 78366 -158502
7642 159313 -116998 263718 -158866 -128334 145462 -247693 209266 63113 26197 -187944
7631 -46710 -70104 -282438 -205695 52232 -407986 -87036 19115 -185956 -127471 114860 12959
7619 -118926 -44258 66448 -176484 -278470 -139677 -214740 -90941 10164 -179669 239540 -125370
7607 57664 365811 -92117 266401 121113 -71574 -192023 107124 92742 -21352 -14281 -203277
7596 -203277 8067 9243 -577838 -190975 40977 228003 -102473 -317772 61069 55889 -165178
7584 -176587 -112701 59137 -75297 -14673 -21444 92181 -88554 60058 17171 -148514 37823 169381
7572 169381 -123309 309729 124168 444294 -107756 68743 86284 -333457 -95069 -285911
7562 -285911 -261669 126756 66954 54207 -108733 380140 140544 134680 14039 -156760 -114709
7551 -114709 121738 297008 -397113 149911 -327032 -239287 3718 170455 -172640 300455
7540 121432 -175724 -277833 29433 18670 230407 106765 -237233 -91644 -227371 3840 -60385
7528 -123930 4670 -127388 178334 -88175 -125360 -46335 298299 263611 19114 141341 -14990
7516 -203591 244123 116431 -164786 77245 -48656 80090 226350 433530 -31152 -16371 -63740
7505 -63740 -66154 -57358 174027 32262 170477 258298 -88140 -281697 209582 63464 -195364
7493 3944 -270367 -99016 -135440 55070 -282723 -98200 -143137 -88675 331082 217447 -174936
7481 -196194 -423333 141083 40259 87236 -89575 -78486 -188165 251480 233781 154956 -78230
7469 187516 -212273 169477 -8840 -103412 -8603 53304 -157817 109505 55125 -180492 -114228
7458 -114228 222175 -151275 227925 -182272 -124124 -49322 41427 -195698 45858 15101 -94281
7446 -109967 -392805 -33319 -122820 -183795 76214 -211634 167391 -281202 -149795 -156213 12869
7434 65905 261989 -14737 67200 134185 136914 -190110 284953 120168 -90612 -2315 52300
7422 221490 61946 79257 -6377 -249347 160953 -190409 -77610 -121724 -426504 -46927 -124121
7411 -124121 75413 -197864 146118 -119138 -141541 133712 -19765 -31444 138169 183335 -350458
7399 -98415 162891 299325 169233 62939 -132582 356388 -223479 63447 -186849 -172373
7389 -172373 207111 316158 -135318 211348 -323435 226933 -26239 180505 -212343 161696
7378 -65605 -88706 70977 -16688 139921 -100273 -313922 -71083 208591 9831 -311317 -440195
7367 -440195 136789 -41907 290120 -37534 6685 211456 -199486 2968 -191672 -225158 -31141
7355 230386 338350 -181116 344383 -76949 171158 -77954 -444505 109460 24699 74847
7345 74847 -6731 -18575 -295386 -10215 -385642 73282 -63813 -135064 -256968 -5610 87463 -183197
7332 -227589 -63312 -51760 -129208 7073 43541 226242 -77259 -157555 -16712 -323446 -417733
7321 -417733 215078 134893 -117778 18887 69749 -12448 -46525 17471 -180985 -279729 129411
7309 214175 30860 14366 -118383 -84851 103318 -47302 -117845 -129363 166437 -88175 125569
7297 -60368 -145345 -82480 -61064 344426 257875 28237 -243780 43079 58120 -57002 -97215
7286 -97215 -32090 -264879 -113582 -12413 -347818 -262297 80650 -33250 1225 -169060 -313864
7275 -313864 -41260 415174 88034 61848 110043 154521 -150597 -77721 -59594 -9767 168229
7263 -161305 135644 86880 -275200 -108263 -128756 -7760 -152543 -27951 2676 -268262 -50726
7251 93505 219984 23619 127040 -252193 -266336 103989 213588 5401 90225 17139 -16821
7239 -74566 -156851 91411 -23785 167204 108903 182827 181737 -188634 36836 -88341 140020
7227 -37390 36126 -191922 -222684 137288 273518 135127 69645 196739 34809 53452 61251
7216 61251 -92530 32755 -70480 -112633 -60495 -36059 -141008 206850 -327644 50159 -84706
7204 -283686 126735 -215285 -79755 24432 360905 256225 -296559 -185660 -103314 110136
7193 173996 210641 -461354 -255862 -101601 74315 27398 -174525 -270421 -82812 -242640 -27864
7181 253333 40212 8287 210148 -117118 -14253 -111409 -88073 -69722 126036 53141 191787
7170 191787 -116065 -121204 256848 -353967 -202142 -187608 -182221 -112017 34523 -131842 -402380
7159 -402380 -53831 45183 162962 98995 -89333 5186 -159577 -350894 129630 -162342 166528
7147 -234019 79325 -153356 -113214 95501 -4204 -34060 -77998 41675 91965 -55285 -258749
7136 -258749 -165403 -260874 -18073 -144893 49864 -203278 -203711 -21464 30917 452932 147966
7124 -52572 197174 162900 -138304 -122537 181989 -192977 147715 -260130 -34558 -182847
7114 -182847 48526 -37678 23642 -181953 40503 -201319 -124314 -168760 -6772 -108445 66001
7102 144559 97235 -42544 -244701 -474582 55886 -259339 -85024 -129408 78186 122651 278040
7091 278040 -151278 -161620 265983 123684 -24439 189568 -140767 19278 -63976 -127553 -56620
7079 110860 -198855 77587 180508 -242971 381529 -124559 -151419 -117023 -91078 -142028 67190
7067 353111 363277 -74245 100409 -3868 -327038 227014 -248720 -50472 -207256 -103973 -162127
7056 -162127 -259476 -37448 25350 -332818 104448 254752 96441 102927 -153191 173281 -13303
7044 -49233 226600 -31907 49978 60225 98319 -175276 -22390 2425 181318 271094 -490988
7032 -100668 -152686 -30387 -25509 -113513 4960 96992 -100932 234272 189234 -14095 -111075 -97250
7020 -97250 -57114 -1937 -78937 145082 291673 89596 13905 -186408 -210908 -11719 157374
7008 -118463 -217356 -135048 -295310 -89199 -99772 14523 315979 -142061 401764 -26800 97337
6996 6846 -373490 127542 -98721 160261 -438639 -342873 169821 108538 -28988 104319 41856
6984 168256 102937 -265315 -292532 294746 82085 -447323 124644 -82424 -64020 -116106 327378
6972 -37378 -216982 9229 -396410 18889 -393835 -84370 -136267 -148032 -11124 -39206 -107355
6961 -107355 299003 327018 184215 264160 -55828 179879 -136907 367080 -84126 99386 60594
6950 60594 170259 -278233 242509 -135811 86289 53951 -33607 145362 -50211 -58866 7409
6938 160926 -30746 -157003 -195464 -172828 -14919 176238 40331 -341228 108123 112478 298472
6927 298472 -79733 41063 18198 -11484 -481633 -129604 -286279 -425374 215530 -137706
6916 -47175 -70577 25889 122796 -475589 -141458 91031 -121950 -171625 184875 43660 -75459
6904 171804 -90289 130828 -107715 -214644 -136593 241636 22466 188224 2944 -201732 -62062
6892 -317066 -66900 260831 -43091 202049 -275143 29374 227303 92253 99036 -49008 106049
6880 -465145 -374509 83062 121153 -255586 -32635 -75832 -272830 -262253 403572 53800 160461
6869 160461 123593 340769 -44028 -239608 157569 61081 106412 36802 -136715 -282007 -206436
6858 -206436 97433 156540 66843 -295458 -12178 -148252 -143289 -14470 -80782 42722 44768 505254
6846 505254 -447859 144179 410657 -25597 -518703 397259 -96859 34406 362678 -10688
6835 -65208 -132756 47985 -2095 -142397 131435 279380 139698 65531 -243961 -80480 68669
6823 230711 -206073 -87356 -220563 252562 24435 -119168 24174 -198494 -125055 351840
6812 117418 -173082 262370 -138391 -98644 -9416 39446 83812 -244631 25703 -254867 -138114
6801 -138114 170959 -76095 103409 131547 -129336 113819 78986 -24671 10060 46780 106264
6790 106264 -126682 19778 -3513 163812 89469 -11005 245709 27679 11061 -170750 708
6778 -294501 -245175 -11889 -304423 415609 99526 347455 78570 -17138 -14733 190669 -223122
6766 173659 -430421 -54661 159843 54180 221208 -172688 173884 252137 -83434 10995 322757
6755 322757 -239206 -83322 276481 88841 -19646 -198329 250180 116336 73107 -175112
6744 139320 132424 -2489 -248166 69545 -97986 160411 -286437 194105 -54546 10269 -92052
6732 217697 -143751 -162651 -210180 159362 14265 342443 189152 429891 -154999 -58680
6721 10307 18087 49435 70069 -103680 115325 -120983 -498731 380592 70743 -210457 -244032
6710 -244032 291393 -5042 15001 -88893 15097 36777 89383 195440 159868 -214708 89722
6698 289134 76615 114127 -58223 -80346 -70498 -341147 -36422 90968 -126677 144679 -44807
6686 -133719 -7923 12939 -138846 -324879 -133160 187350 69602 -259158 -217359 57210 -195417
6674 117083 -314787 -599 -70897 96003 60739 232397 -106212 53025 -129918 114070 212096
6663 212096 154746 103763 -286145 87464 172597 116113 281270 -85319 208100 80347 -85236
6651 125320 107977 -374889 144882 -47518 -315804 33112 -60019 32249 -24668 157366 -21779
6639 -182531 230218 2426 115507 421347 294578 288905 207869 -48014 -79956 -62326 -51761
6628 -51761 -228900 -54454 124271 266473 112781 216474 -149136 253698 -11980 135280
6617 179543 -246764 170051 -121694 -117480 298883 -195968 57878 136580 62711 -152356 -71293
6605 41272 -108509 115194 211340 -365207 171937 -59264 161845 222606 -15956 136373 67871
6593 112085 -203242 104967 -61181 -241538 -151976 -9287 -282554 265189 -222404 -85327 229550
6581 191031 -140431 28439 80414 -124403 89099 309635 -188989 98694 -88687 45859 100818
6570 100818 -181959 -58853 81496 62696 169310 5163 -236847 -232415 59473 -112425 87873
6558 127549 -309535 246847 -208817 87425 -72487 -185795 76387 -304660 -181375 47072
6547 176153 216532 -276579 -358985 -159756 -3891 58093 37872 265544 35211 -123337 -24913
6535 -301605 -220395 122472 375769 -35618 -117493 -438839 148911 -65244 -104038 20248 -75379
6523 229635 373053 331574 51827 296794 216303 -53426 359113 -77503 408292 131491 65251
6511 -408431 -200202 -157506 242919 -36546 -4124 -130410 -158788 18708 -33387 -83698 -217846
6500 -217846 321610 33347 -35730 4331 -48562 102400 -41180 94177 -63109 -11414 588 -121306
6487 66284 30405 -31110 -9125 -60232 -253642 11154 -25888 -97732 -93742 122841 -254866 -15721
6474 -235922 -20351 -213052 -280894 154424 195697 -223383 115642 -109750 80862 -17234 81819
6462 53073 161371 68231 -294448 362894 56831 83130 -96259 -118518 -128323 213355 54840
6450 -34482 -138491 60728 28146 116933 74931 25580 -293017 61660 83398 -24917 50097
6438 52799 247927 108780 -103726 173011 -1289 -306759 149761 -215132 -340939 281284
6427 -92882 -13494 -122758 -183817 -534812 221656 -273272 -85366 228032 -206421 -144154 111705
6415 214850 -157853 140107 134798 -217171 127039 20021 -50857 129234 -109874 139016
6404 -170513 -11528 74231 -203337 160146 99633 98230 49000 236312 190255 -291879 68804
6392 -229548 -141910 -263500 248705 17606 -345149 -189815 429767 -277044 -85827 -12218
6381 -191552 212351 -72702 -201965 136416 -7312 224392 87429 -37078 -19628 -109999 100520
6369 -29956 196047 155874 54448 115479 229921 -61423 34097 -66115 -116801 29332 -261953
6357 -50689 81909 360223 -71256 120686 174796 58565 3551 -45931 184711 456247 -113059
6345 262595 74747 132400 -352862 -48869 -104745 -58310 117230 179698 174997 -3345 60291 -8674
6332 156970 -307629 241270 -219952 -100497 -153608 -158260 -23891 182599 95017 -60446 38796
6320 -72148 107587 -147729 -264180 -90628 108185 -415052 140908 -248430 202057 -96643
6309 -19605 -198176 -48938 -133850 9012 144577 30226 151055 -101668 -106918 91106 71043
6298 71043 -4301 -10391 124654 137218 25109 -235878 -264218 254321 258416 37393 154423 120673
6286 120673 63954 -185243 -11561 -307887 -17202 147706 -309753 -264212 -118863 148280
6275 54080 165639 -205616 -39167 287468 -56119 -129376 -80658 -19938 -23989 324187 -18544
6263 71760 -24142 -100595 10581 280228 -189126 -118703 -66561 -328854 -120883 -221406 -23704
6251 78423 299874 -253320 88267 124035 -108178 142691 -61161 100328 263863 -197952
6240 -100573 47799 -60769 -244259 -159100 18036 20677 65139 -40053 163554 204996 89637
6228 -256043 -72580 277723 -308809 -17574 -8778 -130107 -10735 -412342 -109340 -28242 -115035
6217 -115035 -282140 -7324 -199703 3000 118249 3013 -73216 139256 -19726 788 4993 58696
6205 58696 -208612 42627 53260 266329 -173195 84387 166622 -68479 221920 -411848 33750
6193 -121637 -211153 -149750 41867 -233407 -253901 -42296 -254131 236316 290733 236872 131885
6182 131885 -19908 -92342 138603 -33975 -452772 53641 -109129 95659 -272955 203754 126294
6171 126294 -68300 -16650 238172 -50852 -110999 182811 57893 234289 51668 283986 12780
6159 7181 37065 -48214 97121 250199 187126 157848 -183711 9022 -22541 29118 -121680 -98665
6147 -98665 133978 81392 -18757 394977 -270045 67611 -330771 933 -278816 432226 259166
6136 259166 -212592 35914 -10568 9672 5075 -84060 158132 214157 -168057 140958 116624
6125 116624 17064 -361693 -13655 304864 338953 68749 -305952 -111865 -147599 -300620 160601
6113 -217221 -152940 177750 -146880 -105448 107222 -142225 14765 129616 -199761 -252288
6103 -252288 -58655 235600 254845 -278168 -169210 -133891 -136397 -624 -210770 -211802 131275
6091 -196917 276874 -105369 29234 -15600 -247171 -261838 -47635 -33901 205691 -190867 20766
6079 157155 4582 -237209 -9048 23315 -131696 40793 -75343 96429 217395 -145756 -345201
6068 -345201 -100616 180588 189845 271172 -2861 -196856 159985 132817 264061 -341975 52619
6056 182562 -61638 143376 208652 223570 101593 186946 -18313 228586 -470051 253482 -254943
6044 -53388 278792 -70361 76946 25819 -47626 -109447 264076 235222 180597 178994 -80220 -227506
6032 -227506 -75489 33774 18386 -4357 140890 -277307 -155292 -127857 -152864 -402153 -42331
6020 221511 28604 22155 111608 115244 -5988 -32808 156298 -178302 60711 16118 251244 272413
6008 272413 -190961 92358 -236658 96120 110779 109586 -242278 -90321 70859 105061 147033
5997 147033 -49829 51262 79305 -47128 -23237 -279915 -71226 -84192 4052 -118709 22883
5985 -150592 83088 -299232 244694 243668 165875 118533 80965 -243586 -78076 -39716 -37249
5974 -37249 13569 183158 -126504 -27429 3404 -164974 -29820 -121051 -68746 36550 12074
5962 -324110 33376 -162204 89337 -30817 240062 -115409 -104573 2306 163235 -28971 -129324
5951 -129324 5706 -74770 432176 -84451 -171425 -349296 -61282 -124560 -196584 -82744 32036
5939 -153742 165026 158924 -235337 219829 -1637 -95895 136423 -41834 140003 -17687 -10287
5928 -10287 -141418 -78130 8978 310200 98922 294000 156564 -423084 48795 -228605 -55106
5916 323503 75461 135366 14501 30503 -29206 -129463 164782 -57846 349084 13062 130931
5905 130931 -58690 -136549 122988 -39681 -142257 121316 20877 -45291 -163804 106394 110791
5894 110791 -41068 -438015 175327 -233974 67816 82468 65794 220175 -87931 82383 136557
5883 136557 -152909 307256 135702 66084 -311374 -41833 106643 -234747 -85783 239585
5872 -406 111605 74285 67515 213013 -360526 -70993 238062 -106934 -83855 23577 165920
5861 165920 178875 34306 3941 13525 3340 86398 391249 -149220 -183889 204292 250630 -336761
5848 317564 -68032 102983 -188387 80498 679885 -58462 -330883 -163797 -150019 114882
5837 237152 260751 81129 -254713 231744 94842 -75104 108509 -89896 25113 -33837 -35583
5826 -35583 -35085 -186227 -263282 72992 -74756 182389 132148 12390 20665 160247 27024 -52177
5813 -148916 -53272 -9719 -209091 -239949 52158 -73089 -169215 384502 -130900 -33201 91051
5801 -133258 149601 -146505 -193291 65332 254112 -42041 -374845 -267082 10831 207523
5791 207523 28758 72627 -143100 -16022 14690 -177276 353131 135190 -21398 145480 114614
5780 114614 -51843 59381 -157312 -187681 59084 103118 -83938 116865 155850 214093 65219
5768 159204 75172 -350316 -236769 21710 55594 -348493 -88905 -150185 -71889 31417 -353997
5756 -26606 -97511 104190 -106337 148676 28732 -188113 -177230 -43631 -85705 175316 51475
5744 19909 225159 294075 -104262 -13951 -37027 -46303 -213739 87195 70495 295769 199214
5733 199214 -28237 -27990 -107935 431438 -168909 -249261 -132482 -220094 -16218 31427 137808
5722 137808 -69172 -23362 -167479 105632 -1201 95767 -275068 423631 -93640 28971 122788
5711 122788 84917 -220254 56306 -138712 225285 -11698 -72781 159290 -178262 133559
5700 -33323 213534 -36748 -124975 35792 4187 -13515 297935 210759 200667 -116846 315822
5688 -367746 -488572 33975 -37064 156817 -272335 -323785 171865 -303571 -195558 144681
5677 -113721 -181781 -298411 -32650 -7706 -40024 -37501 -45092 -84805 -106670 -13191 -209633 -111282
5665 -111282 -298533 -398834 137925 -226590 -278603 -218212 67986 -121889 -230562 178848
5654 -21724 167600 66606 124069 -209457 233585 -154530 -160044 38518 -5887 -84661 256168
5642 -40400 198940 -23711 -6782 167579 55687 149749 104330 -236089 -132786 67330 14302
5630 350752 -223857 203720 183344 -25466 124174 271302 149042 -19921 79412 -143042
5619 109935 317297 175815 182611 194300 171113 26414 265156 1362 216339 73425 317607
5608 317607 -188149 -39886 -214196 253984 94726 93945 60347 -251604 40221 79754 154833
5597 154833 99654 127430 156422 195608 -68880 37830 205986 63310 -210704 -170355 -62782
5585 -58997 105013 172653 25050 -279070 191350 -118026 -64485 -143240 95113 389470 253656
5574 253656 213166 66050 156610 214031 -166508 -88503 -198922 -12763 -21229 -109462 61218
5562 -36698 -191995 -102108 -39345 -34299 78548 386132 -275233 -21043 171922 137818 -32458
5550 -101087 153124 -175246 -180338 -147016 4070 118703 -144989 -64920 129166 63426 417877
5539 417877 -209265 -115545 26503 -118074 -92638 -50327 266475 -63403 -367798 -134583 -5528
5527 -294353 -76997 75573 -58467 -12013 118934 205144 11802 -581500 -135775 -214430 221800
5515 -111373 -45987 -110991 -34250 339549 -141291 -50060 339857 -40250 -80142 76164 169659
5504 169659 -31553 -81638 -242263 -63356 -285649 18485 -46450 81606 119223 -19522 206759
5492 198250 -57156 212401 87202 -234937 -70182 179889 -313006 131459 46337 -103605
5481 75040 -104140 218688 -150054 -157090 212450 -266702 -100767 -106858 39477 -145249 130346
5469 -26039 -139959 176230 178027 126564 33559 70244 195199 -106555 -50751 -316248 2036
5457 215358 -119166 196883 -49998 48565 84725 -18774 101219 -365061 -302196 -473983 292318
5445 7555 42129 -171979 -63455 26465 73897 99036 277715 -66392 -66260 -7311 96421 183456
5433 183456 -68873 -167381 -27464 62708 -5625 -27934 -297386 65973 -363476 269438 -126834
5421 -20604 47783 206124 134316 -97715 6105 185614 -213721 -45554 -25754 -59880 108509
5409 -305642 194977 87373 315319 -126154 -210238 27208 301048 -60672 -155043 -95042 196724
5397 -165562 125643 101195 -42770 205241 -115305 7960 151645 -326388 20521 127945 138391
5386 138391 235842 -64507 -10300 -288936 -109973 23932 -200487 -14653 -136609 118052 -73457
5374 -17563 -180633 -137016 322050 -17282 -221951 -215654 60244 132356 108114 100979 -69322 182174
5361 -137196 -102923 165658 -74260 63717 227879 88423 -207792 1453 254068 145344 116542
5350 116542 90500 -330401 215428 -59637 -7834 261021 129944 199362 66858 15993 -31832
5338 -133762 443842 -220022 212953 -22595 98584 -201484 162370 284314 743 9673 -244662
5326 -19056 166314 233138 -202510 -204736 15222 -205404 -70822 -357042 -166259 -154626 254390
5314 4643 107852 -45348 75118 -110185 -3830 -92253 431320 -327924 -76020 125154 138499
5303 138499 -11193 -5456 121544 71704 -18125 98169 234003 -64015 -71532 263428 -2870 -231052
5291 -231052 92432 -319058 -29913 8249 -248674 -115017 148268 33998 455832 199618 209112
5280 209112 192209 -68045 -24162 -34533 -39989 75141 -56552 -244332 -46879 31658 -185245
5268 293320 -183225 -269441 -135925 132196 25362 117128 -75712 -113481 -336080 136172 -35146
5256 70818 116134 -94365 107338 -13019 115903 -147269 205385 -114760 286987 155635
5246 155635 151549 191335 -179065 27510 176836 5260 3647 211408 -125044 -174713 149987
5234 -195537 -126241 61974 237797 43093 -284115 93303 -121871 -147033 -78357 -113800 -54761
5222 -5521 44007 -10522 -84645 15189 -35008 211631 100203 33047 -51116 -89869 -178454 91249
5209 317704 -249440 18700 -228534 98771 64377 -73725 596039 -159001 6599 80039 -296054
5197 120191 -210696 75344 -221410 -204525 -229293 -306332 -134356 78423 -120509 163266 -9711
5185 -155868 12090 108129 -97323 74933 45829 -72686 82993 -66086 -141379 -100167 -19350 -185256
5173 -185256 8831 235575 -112622 -229443 329834 30462 313210 -44244 297568 243714 148709
5162 148709 12158 -235692 -19192 73087 205263 -33238 86797 306759 -33520 -67208 88769
5150 -154548 173367 -41610 74484 -113424 196108 155650 -25419 -38801 -285984 -74834 -130834
5139 -130834 -81356 110865 -323562 30417 -107729 214438 172864 -29309 160180 -296267
5128 -135794 145817 280869 79684 56487 -240601 111603 342331 -193864 -67026 90156
5117 -9693 43241 34181 -11590 102122 61675 90093 7857 338512 -126322 7391 -406 -95091
5105 -95091 -81511 38628 23309 95708 -213366 124919 -59374 95369 -244640 7609 -32170
5093 202888 -156067 162993 -53624 -2796 -233810 47453 207272 -534020 111452 -142327
5082 -277965 -183232 -606829 2470 161873 -88071 -53026 66282 282545 -201757 34500 123638
5071 123638 10796 -113812 45810 31561 22122 -84229 135168 -43034 -43574 31440 145874 -263652
5058 126705 171146 11308 -345029 -262487 73358 219464 -155798 203238 188045 -191820 -160592
5047 -160592 -1046 180781 -27486 -221043 225936 -62273 151371 7019 -267300 2339 93545
5036 93545 -10991 -54671 -76899 107105 -54717 19200 76293 57371 32653 -102921 143100
5024 -116261 29428 136693 70011 -37652 232007 185342 202675 -270691 -50936 87106 -302673
5012 250145 -66425 -111503 -219106 -236301 -143172 -22063 162972 344946 -472431 -104187 48459
5000 179496 14050 306076 69717 61953 48777 -105961 56010 -139378 86414 145082 -127624
4988 -399102 317355 57099 113350 -18055 318053 -164747 70005 -107278 -88872 -24844 -150524
4977 -150524 -95735 -170883 213453 -40653 44687 -111162 -47859 547283 -40405 -20578 -463662
4966 -463662 3639 33800 -124273 130760 -17391 230199 202612 -246990 187753 -19242 106225
4954 234271 -45564 -86230 99800 20089 -261485 -2356 23214 -8491 -58866 68696 -68286 120887
4941 178111 -92145 137224 9969 149964 62110 -122502 54041 280083 48365 93079 57460
4930 57460 -68082 -65657 -58535 -117970 246988 -357520 -104305 32493 182646 71308 42064
4919 42064 190915 56313 -129004 33296 -121855 190549 211626 -327994 -198334 -97437 136396
4907 -104496 -309858 29412 -11144 102330 78975 -268289 -121612 -81053 -167884 -401896 182279
4895 316338 182522 -369024 115430 -146206 300724 -42415 123189 41181 55774 445561
4885 445561 11808 -35887 -268412 -217503 -83990 127595 -11763 342574 -129796 -301761 63036
4873 247842 75919 96805 -97358 41796 97102 -369640 219758 -132988 113696 -196510 -16409
4861 -189626 277625 -31563 107171 -166631 296683 -113420 208929 482275 -43060 -65094
4851 -65094 155178 179625 128608 262386 105934 -173544 -34855 -211813 246156 184668 -190139
4839 169956 119162 -116794 60861 12767 242312 -372001 174116 245964 35048 123813 -6138
4827 -150106 144370 -141411 -163358 -81173 -69286 -15486 -28576 344301 -2108 -119155 25820
4815 -292984 35787 161812 -93385 56643 -116243 15869 122875 -52118 307235 9375 43820
4804 43820 -216924 95951 65604 -179630 112648 312460 -327927 -16596 163921 -116617
4793 -174617 230365 84377 171934 59705 -40287 368211 -54800 81946 -100226 -257150 125768
4781 52449 25365 143739 -110291 -33086 11605 142138 -324762 118180 -70468 75585 -17028
4769 -66676 -113211 134364 66903 217589 77103 74394 198875 -12321 23690 35004 -154070
4757 -327740 264248 -50431 27655 19247 -68979 -190303 -141820 -73163 418983 75072 215268
4746 215268 -234043 -9904 -54170 -158059 -133906 -318466 -154058 155092 27469 -97781 102246
4734 76721 61406 -161195 9142 217449 125986 27315 35223 -80867 -19865 -234120 75410 158554
4722 158554 -181460 68321 -79910 327169 164885 -125381 -6871 -238254 42324 -99087 235075
4710 418420 -177952 279506 101865 -86993 -101123 -98653 67110 -100274 -109955 6028 11342 112858
4698 112858 -6384 -366416 -31608 -11850 224181 35870 366811 -73398 -118062 -190910 269204
4686 -69657 -200878 -227415 349894 258561 -173624 139531 55133 74076 109654 -110767 -252491
4675 -252491 -35553 -58154 103917 54671 -344571 257457 -216253 -183361 -176655 123112 -108221
4663 105178 -97826 53801 -150111 156550 -84030 -47423 138297 -84514 120813 -223309 151461
4651 124222 -168437 61999 -209354 93510 -277405 -40352 -105098 88559 276518 -104182 143692
4639 -232352 -169135 -99447 226499 -73410 -111346 -280443 -269898 -170269 242107 -137200 -96447
4628 -96447 134360 34024 -358558 176532 255075 -104776 154740 22155 471753 88119 -118790
4616 -66004 -18232 40007 296320 -126851 463479 -176247 -181307 91305 115460 -77476 164320
4604 329882 35659 346610 21474 117361 -43014 207280 172715 48947 -45281 104235 32117
4592 331593 134149 17297 147184 68833 -174963 4664 117978 -65801 -264565 69429 -179891
4580 -60147 -121098 -223025 129596 -6871 -128065 -48519 11074 -68279 -63527 207456 -81301
4568 254890 134957 91517 -128302 -275481 713 32145 -4440 -87377 3958 29627 -99449 -236003
4556 -236003 129548 -116079 48344 291976 -138120 -456262 137714 111271 77534 -10541
4545 -58454 44736 -155004 -149830 -116444 93704 -12564 -147673 -218601 -65380 -130888 359547
4533 114026 -189048 -162437 43488 158508 -5967 -143104 -40117 161026 -107176 -68632 -310214
4522 -310214 133392 -115318 -29795 67243 244256 -47947 248027 49631 114931 265672 340966
4511 340966 -38062 -25089 167393 147806 209987 174560 -72624 -222204 114671 -60477 229595
4499 103694 -22603 214519 193489 20218 -56179 192556 236485 5319 -88236 -205723 128222
$$ [...]
##END NTUPLES=NMR SPECTRUM
##END=
