
##TITLE=AC1336_BRAAS12065_6528570_Xrn0UfIXm1
##JCAMPDX= 6.0         $$ Bruker NMR JCAMP-DX V2.0
##DATA TYPE= NMR SPECTRUM
##DATA CLASS= NTUPLES
##ORIGIN= BRUKER
##OWNER= Administrator
$$ 1.72 TOPSPIN		Version 2.1
$$ 2012-07-15 15:39:47.015 -0500  Administrator@TOPSPIN
$$ Compression mode = diff/dup
##.OBSERVE FREQUENCY= 400.02188249412
##.OBSERVE NUCLEUS= ^1H
##.ACQUISITION MODE= SIMULTANEOUS (DQD)
##.ACQUISITION SCHEME= undefined
##.AVERAGES= 64
##.DIGITISER RES= 22
##SPECTROMETER/DATA SYSTEM= spect
##.PULSE SEQUENCE= noesygpps1d.comp
##.SOLVENT NAME= COFFEE_meoh
##.SHIFT REFERENCE= INTERNAL, COFFEE_meoh, 1, 14.96089
##AUDIT TRAIL= $$ (NUMBER, WHEN, WHO, WHERE, PROCESS, VERSION, WHAT)
$$ ##TITLE= Audit trail, TOPSPIN		Version 2.1
$$ ##JCAMPDX= 5.01
$$ ##ORIGIN= Bruker BioSpin GmbH
$$ ##OWNER= Administrator
$$ $$ C:\Bruker\TOPSPIN/data/COFFEE/nmr/AC1336_BRAAS12065_6528570_Xrn0UfIXm1/12/pdata/1/auditp.txt
$$ ##AUDIT TRAIL=  $$ (NUMBER, WHEN, WHO, WHERE, PROCESS, VERSION, WHAT)
(   1,<2012-07-15 15:39:41.953 -0500>,<Administrator>,<TOPSPIN>,<go>,<TOPSPIN 2.1>,
      <created by zg
	started at 2012-07-15 15:28:11.703 -0500,
	POWCHK enabled, PULCHK disabled,
       configuration hash MD5:
       6B 1B 68 BB D9 2E 58 E2 7F 35 AD 54 07 DF 0E 41
       data hash MD5: 64K
       79 9B 48 FC 41 01 9E 7F FD 38 8C 01 E5 9F A7 A8>)
(   2,<2012-07-15 15:39:44.984 -0500>,<Administrator>,<TOPSPIN>,<proc1d>,<TOPSPIN 2.1>,
      <Start of raw data processing
       efp LB = 0.3 FT_mod = 6 PKNL = 1 PHC0 = 0 PHC1 = 0 SI = 128K 
       data hash MD5: 128K
       DD 67 A3 1F 1B B7 C9 86 60 D6 52 7E 07 91 86 A5>)
(   3,<2012-07-15 15:39:46.062 -0500>,<Administrator>,<TOPSPIN>,<proc1d>,<TOPSPIN 2.1>,
      <pk PHC0 = -1.219482 PHC1 = 0 
       data hash MD5: 128K
       6E 0A F3 35 51 52 5C 67 F4 02 4D 7A 75 E6 2C 8E>)
(   4,<2012-07-15 15:39:46.671 -0500>,<Administrator>,<TOPSPIN>,<proc1d>,<TOPSPIN 2.1>,
      <abs ABSG = 1 
       data hash MD5: 128K
       EF B2 32 1C 86 45 3C 35 BD 84 66 7E 12 13 51 9F>)
(   5,<2012-07-15 15:39:46.750 -0500>,<Administrator>,<TOPSPIN>,<proc1d>,<TOPSPIN 2.1>,
      <abs ABSG = 2 
       data hash MD5: 128K
       7F 96 69 A6 83 94 10 36 3F 69 F1 F9 08 AB 0B 4D>)
(   6,<2012-07-15 15:39:46.796 -0500>,<Administrator>,<TOPSPIN>,<proc1d>,<TOPSPIN 2.1>,
      <abs ABSG = 3 
       data hash MD5: 128K
       A2 74 11 E1 1C 11 C6 3E 01 AA 2C BF F7 19 27 EC>)
(   7,<2012-07-15 15:39:46.859 -0500>,<Administrator>,<TOPSPIN>,<proc1d>,<TOPSPIN 2.1>,
      <abs ABSG = 4 
       data hash MD5: 128K
       13 19 2F 81 F5 E5 DA 1F F0 35 38 E0 28 07 B8 DE>)
(   8,<2012-07-15 15:39:46.921 -0500>,<Administrator>,<TOPSPIN>,<proc1d>,<TOPSPIN 2.1>,
      <abs ABSG = 5 
       data hash MD5: 128K
       12 10 54 E6 68 8D 4D 39 10 CA D0 50 4D 32 28 E1>)
$$ ##END=
$$ 
$$ $$ hash MD5
$$ $$ A8 A4 05 5A 3A 00 A6 69 16 BF A4 06 5E 23 66 5E
##$RELAX= 
##$RELAX= 
##$RELAX= 
##$RELAX= 
##$RELAX= 
##$RELAX= 
##$RELAX= 
##$RELAX= 
$$ Bruker specific parameters
$$ [...]
##$TP07= 0
##$TPNAME0= <>
##$TPNAME1= <>
##$TPNAME2= <>
##$TPNAME3= <>
##$TPNAME4= <>
##$TPNAME5= <>
##$TPNAME6= <>
##$TPNAME7= <>
##$TPOAL= (0..7)
0.5 0.5 0.5 0.5 0.5 0.5 0.5 0.5
##$TPOFFS= (0..7)
0 0 0 0 0 0 0 0
##$TUNHIN= 0
##$TUNHOUT= 0
##$TUNXOUT= 0
##$USERA1= <user>
##$USERA2= <user>
##$USERA3= <user>
##$USERA4= <user>
##$USERA5= <user>
##$V9= 5
##$VALIST= <valist>
##$VCLIST= <CCCCCCCCCCCCCCC>
##$VD= 0
##$VDLIST= <DDDDDDDDDDDDDDD>
##$VPLIST= <PPPPPPPPPPPPPPP>
##$VTLIST= <TTTTTTTTTTTTTTT>
##$WBST= 2048
##$WBSW= 25
##$XGAIN= (0..3)
0 0 0 0
##$XL= 0
##$YL= 0
##$YMAX_a= 11958049
##$YMIN_a= -9804359
##$ZGOPTNS= <>
##$ZL1= 120
##$ZL2= 120
##$ZL3= 120
##$ZL4= 120
##$ABSF1= 14.96089
##$ABSF2= -5.597292
##$ABSG= 5
##$ABSL= 3
##$ALPHA= 0
##$AQORDER= 0
##$ASSFAC= 0
##$ASSFACI= 0
##$ASSFACX= 0
##$ASSWID= 0
##$AUNMP= <proc_prof1d_extract.lims>
##$AXLEFT= 0
##$AXNAME= <>
##$AXNUC= <1H>
##$AXRIGHT= 0
##$AXTYPE= 0
##$AXUNIT= <>
##$AZFE= 0.1
##$AZFW= 0.1
##$BCFW= 0
##$BC_mod= 0
##$BYTORDP= 0
##$COROFFS= 0
##$CY= 15
##$DATMOD= 1
##$DC= 0
##$DFILT= <>
##$DTYPP= 0
##$F1P= 0
##$F2P= 0
##$FCOR= 0.5
##$FTSIZE= 131072
##$FT_mod= 6
##$GAMMA= 0
##$GB= 0
##$INTBC= 1
##$INTSCL= 1
##$ISEN= 128
##$LB= 0.3
##$LEV0= 0
##$LPBIN= 0
##$MAXI= 10000
##$MC2= 0
##$MEAN= 0
##$ME_mod= 0
##$MI= 0
##$NCOEF= 0
##$NC_proc= -2
##$NLEV= 6
##$NOISF1= 0
##$NOISF2= 0
##$NSP= 0
##$NTH_PI= 0
##$NZP= 0
##$OFFSET= 14.96089
##$PC= 1
##$PHC0= -1.219482
##$PHC1= 0
##$PH_mod= 1
##$PKNL= yes
##$PPARMOD= 0
##$PPDIAG= 0
##$PPIPTYP= 0
##$PPMPNUM= 2147483647
##$PPRESOL= 1
##$PSCAL= 4
##$PSIGN= 0
##$PYNMP= <proc.py>
##$REVERSE= no
##$SF= 400.02000968232
##$SI= 131072
##$SIGF1= 0
##$SIGF2= 0
##$SINO= 400
##$SIOLD= 131072
##$SPECTYP= <>
##$SREGLST= <1H.CDCl3>
##$SSB= 0
##$STSI= 131072
##$STSR= 0
##$SW_p= 8223.68421052631
##$SYMM= 0
##$S_DEV= 0
##$TDeff= 65536
##$TDoff= 0
##$TI= <>
##$TILT= no
##$TM1= 0
##$TM2= 0
##$TOPLEV= 0
##$USERP1= <user>
##$USERP2= <user>
##$USERP3= <user>
##$USERP4= <user>
##$USERP5= <user>
##$WDW= 1
##$XDIM= 131072
##$YMAX_p= 401191977
##$YMIN_p= -12109
##$CURPLOT= <Network HP LaserJet P1505>
##$CURPRIN= <$Network HP LaserJet P1505>
##$DFORMAT= <normdp>
##$LAYOUT= <+/1D_H.xwp>
##$LFORMAT= <normlp>
##$PFORMAT= <normpl>
##$SURQMSG= 1
$$ End of Bruker specific parameters
$$ ---------------------------------
##NTUPLES= NMR SPECTRUM
##VAR_NAME=  FREQUENCY,     SPECTRUM/REAL,   SPECTRUM/IMAG
##SYMBOL=    X,             R,               I
##VAR_TYPE=  INDEPENDENT,   DEPENDENT,       DEPENDENT
##VAR_FORM=  AFFN,          ASDF,            ASDF
##VAR_DIM=   131072,        131072,          131072
##UNITS=     HZ,            ARBITRARY UNITS, ARBITRARY UNITS
##FACTOR=    0.0627417313425164, 1,          1
##FIRST=     8223.62146879497, 3102,         -63686
##LAST=      0,             5371,            -63372
##MIN=       0,             -12109,          0
##MAX=       8223.62146879497, 401191977,    0
$$ Real data points
##PAGE= N=1
##DATA TABLE= (X++(R..R)), XYDATA
$$ [...]
63864A000556M8242M9858N1375N2441N2598N1891N0582M8625M5804M2150L7834
63853A531956L2855K7058K0447J3309O026j093p921j4592k1323k8036l4240l9400
63841A485046m3465m6831m9810n2313n4114n5195n5708n5652n4833n3124n0651
63830I13350m7683m4478m1259l8206l5407l2830l0355k7749k4740k1270j7761
63819E51612j4928j3257j2705j2843j3177j3388j3524j3926j4648j5038j4339
63808C99839j2769j1451j1014j0811r950q570p529p175p119p076p104p007o282
63795B85982m916l667l180l204l055k522j994j863k109k426k503k252j907j823
63781B48561k088k376k244j569o45L8J35l23r78j465j638j489j007l37R0p1o31
$$ plain form
63864 1000556 1048798 1098656 1150031 1202472 1255070 1306961 1357543 1406168 1451972 1494122 1531956
63853 1531956 1564811 1591869 1612316 1625625 1631651 1630558 1622637 1608045 1586722 1558686 1524446 1485046
63841 1485046 1441581 1394750 1344940 1292627 1238513 1183318 1127610 1071958 1017125 964001 913350
63830 913350 865667 821189 779930 741724 706317 673487 643132 615383 590643 569373 551612
63819 551612 536684 523427 510722 497879 484702 471314 457790 443864 429216 414178 399839
63808 399839 387070 375619 364605 353794 343844 335274 327745 320570 313451 306375 299271 292264 285982
63795 285982 281066 277399 274219 271015 267960 265438 263444 261581 259472 257046 254543 252291 250384 248561
63781 248561 246473 244097 241853 240284 239639 239677 239812 239489 238511 237046 235408 233919 232912 232575 232665 232594 231963
63764B31963j049j096j028j073j013n49J41M62N4p29j090o12K56O63L38j27p0
63747B25441N03J111J475J604J489J126P67O58N75J27n01n68K50J376K040K168
63731B39641K283K738L342L654L501L173L176L675M313M657M725M851N113N225
63717B94067M989M556M108L566K741J625M51n30j314k209l504m890n527m921l612
63702B89596k597k213j968j370m98K23M32P8l68m9J442L343M369M127L463L309
63686C01319L714M103M047L547K950K692K806K654J616M1j038j211j002p95k30
63671C25213Q65J730J549O32L4K33P64J057J050J016J181J425J217K7j904l499
63655C32590l927l577l533m198m886m789l944l105k822k915k781k191j527j199
$$ plain form
63764 231963 230914 229818 228790 227717 226704 226155 226296 226758 226812 226083 224993 224381 224637 225300 225638 225511 225441
63747 225441 225944 227055 228530 230134 231623 232749 233516 234174 234749 234876 234375 233807 234057 235433 237473 239641
63731 239641 241924 244662 248004 251658 255159 258332 261508 265183 269496 274153 278878 283729 288842 294067
63717 294067 299056 303612 307720 311286 314027 315652 316103 315573 314259 312050 308546 303656 298129 293208 289596
63702 289596 286999 284786 282818 281448 280950 281173 281605 281683 281315 281266 282708 286051 290420 294547 298010 301319
63686 301319 305033 309136 313183 316730 319680 322372 325178 327832 329448 329489 328451 327240 326238 325443 325213
63671 325213 326078 327808 329357 329989 330023 330256 331020 332077 333127 334143 335324 336749 337966 337993 336089 332590
63655 332590 328663 325086 321553 317355 312469 307680 303736 300631 297809 294894 292113 289922 288395 287196
63641B87196j054o77l7N61J162K137L418M327M468M302M554N384O412P196P427
63626C36776P080O657O888P875Q918R452R688J0046J0518J1021J1842J3147J4516
63613D64424J5569J6704J8529K0842K2879K4403K5912K7806K9897L1687L2634
63602G31286L2289L0629K8159K5211K1330J5882R189K504l051p103r727j1112
63590H65486j1621j1674j1543j1537j2173j3756j5897j8042k0211k2651k4901
63579F91480k5972k5581k4425k3123k1453j8960j5824j2781j0464q916p526n494
63567D90961k672J03J942K981M002N212O156O796P756R285J0826J1930J2842J3809
63553E81929J4575J5144J6302J8621K1447K3691K5426K7889L1916L6971M1819
$$ plain form
63641 287196 286142 285465 285428 285989 287151 289288 292706 297033 301501 305803 310357 315741 322153 329349 336776
63626 336776 343856 350513 357401 365276 374194 383646 393334 403380 413898 424919 436761 449908 464424
63613 464424 479993 496697 515226 536068 558947 583350 609262 637068 666965 698652 731286
63602 731286 763575 794204 822363 847574 868904 884786 893975 896479 893428 886325 876598 865486
63590 865486 853865 842191 830648 819111 806938 793182 777285 759243 739032 716381 691480
63579 691480 665508 639927 615502 592379 570926 551966 536142 523361 512897 503981 496455 490961
63567 490961 488289 488392 490334 493315 497317 502529 508685 515481 523237 532522 543348 555278 568120 581929
63553 581929 596504 611648 627950 646571 668018 691709 717135 745024 776940 813911 855730
63542H55730M5672M8372M9591M8058M1900L0252J4761q44j3131k0889k4770k5677
63530A049025k4069k0562j6414j3119j1683j2273j4363j7251k0643k4632k9010
63519H45006l2826l5062l5578l5094l4216l2909l0916k8350k5624k3030k0567
63508E10834j8173j6035j4525j3720j3095j1946j0285q887q273p944p075n705
63496C75171m610m145l837l268k658k277j857j128n31o58j189j061J33J492J868
63481C51445J216N76R45K393M140N212N155M383L806L910M229L874K528P35o58
63466C93889j186j010p91j275k707m482n605n532m508l150j918r60k32L06N53
63451C61392L59m7l2P81K030L179M321N850P543Q753R550J0785J2824J5043J6977
$$ plain form
63542 855730 901402 949774 999365 1047423 1089323 1119575 1134336 1133492 1120361 1099472 1074702 1049025
63530 1049025 1024956 1004394 987980 974861 963178 950905 936542 919291 898648 874016 845006
63519 845006 812180 777118 741540 706446 672230 639321 608405 580055 554431 531401 510834
63508 510834 492661 476626 462101 448381 435286 423340 413055 404168 395895 387951 380876 375171
63496 375171 370561 366416 362579 359311 356653 354376 352519 351391 350860 350202 349013 347952 348085 349577 351445
63481 351445 352661 353237 354182 356575 360715 365927 371082 375465 379271 383181 387410 391284 393812 394547 393889
63466 393889 392703 391693 390902 389627 386920 382438 376833 371301 366793 363643 361725 360765 360533 360839 361392
63451 361392 361751 361704 361672 362453 364483 367662 371983 377833 385376 394129 403679 414464 427288 442331 459308
63436D59308J9129K2033K5300K8287L1130L4329L7702M0507M2063M1480L7305
63425H18573K8702J7042N388l688r134j0668q272k754M208J1170J7603K3296K7797
63412I19263L0831L2654L3594L3439L1544K7271K0418J1784L212l627q609j2723
63400A119051j6277j8442j8788j8182j7724j7698j8253k0218k4157k9103l3189
63389H87020l5412l6124l6002l5267l3847l1695k8902k5878k3241k1150j9001
63378E60501j6185j2944r965p431m990k575n62Q87K063L338M927P007R582J2162
63364E45815J4122J5482J6992J9248K2033K4666K6800K8672L0722L3053L5299
63353H12904L6997L8027L8495L8258L6886L4197L0358K5363J8933J1368L914k312
$$ plain form
63436 459308 478437 500470 525770 554057 585187 619516 657218 697725 739788 781268 818573
63425 818573 847275 864317 869705 866017 856883 846215 837943 835189 839397 850567 868170 891466 919263
63412 919263 950094 982748 1016342 1049781 1081325 1108596 1129014 1140798 1144010 1140383 1131774 1119051
63400 1119051 1102774 1084332 1065544 1047362 1029638 1011940 993687 973469 949312 920209 887020
63389 887020 851608 815484 779482 744215 710368 678673 649771 623893 600652 579502 560501
63378 560501 544316 531372 521407 513976 508986 506411 505849 506736 508799 512137 517064 524071 533653 545815
63364 545815 559937 575419 592411 611659 633692 658358 685158 713830 744552 777605 812904
63353 812904 849901 887928 926423 964681 1001567 1035764 1066122 1091485 1110418 1121786 1125700 1123388
63341A123388p366j1767j5133j6461j5789j4670j4670j6017j8049k0391k3163
63330I49912k6286k9197l1318l2492l2844l2284l0407k7035k2700j8262j3997
63319F53090r541m884q50J860L486M239K886k494j1957k2643l0706l3974l2751
63306E15761k8771k3945j9641j6394j4062j2352j1058r861q319o396m689l816
63294C56457l702l770l676l604l806m201m471m424m077l483k686j909j543j705
63280C09400j825j205j9P39N43Q6K15O52N21j93n21Q5J117J856K141K037J502
63263C17131P75M53P35J104J144J261K050L356M388M625M218L707L537L689L645
63248C55818L125K839L805N774P187P259P155Q281J0188J1396J1795J2802J5131
$$ plain form
63341 1123388 1116022 1104255 1089122 1072661 1056872 1042202 1027532 1011515 993466 973075 949912
63330 949912 923626 894429 863111 830619 797775 765491 735084 708049 685349 667087 653090
63319 653090 643549 638665 637815 639675 643161 647400 650286 647792 635835 613192 582486 548512 515761
63306 515761 486990 463045 443404 427010 412948 400596 389538 379677 371358 364962 360273 356457
63294 356457 352755 348985 345309 341705 337899 333698 329227 324803 320726 317243 314557 312648 311105 309400
63280 309400 307575 306370 306351 307090 307633 307719 307934 308586 309107 308914 308393 308478 309595 311451 313592 315629 317131
63263 317131 317906 318359 319094 320198 321342 322603 324653 328009 332397 337022 341240 344947 348484 352173 355818
63248 355818 358943 361782 365587 371361 378548 385807 392962 401243 411431 422827 434622 447424 462555
63235D62555J7704J9166J9472J9510J9935K0867K2098K3051K3073K2277K1659
63224F91367K1915K2501K2364K1285K0027J9386J9508K0057K0546K0644K0385
63213I19985J9976J9220J7411J4114R761N099K97m915j0404j5491j9726k3213
63201I32114k6080k8093k9066k9215k8779k7536k5124k1709j8004j4523j1137
63190F72848p476l579J06L305O212R107J1814J3802J4928J5831J7412J9881K2418
63177G96609K3845K3695K2638K1822K1756K1909K1515K0510J9339J8038J6045
63166A027721J3143R979P163M214P9n421j1272j6517k1211k5817l0154l3474l5394
63153H83039l6301l6756l6857l6279l4726l2258k9305k6486k4205k2270k0079
$$ plain form
63235 462555 480259 499425 518897 538407 558342 579209 601307 624358 647431 669708 691367
63224 691367 713282 735783 758147 779432 799459 818845 838353 858410 878956 899600 919985
63213 919985 939961 959181 976592 990706 1000467 1005566 1005863 1000948 990544 975053 955327 932114
63201 932114 906034 877941 848875 819660 790881 763345 738221 716512 698508 683985 672848
63190 672848 665372 661793 661899 665204 671416 680523 692337 706139 721067 736898 754310 774191 796609
63177 796609 820454 844149 866787 888609 910365 932274 953789 974299 993638 1011676 1027721
63166 1027721 1040864 1050843 1058006 1062220 1062299 1056878 1045606 1029089 1007878 982061 951907 918433 883039
63153 883039 846738 809982 773125 736846 702120 669862 640557 614071 589866 567596 547517
63142E47517j7363j4690j2909j2027j1015r032o547m787m208m050l540k843k448
63129D42058k205j672j099j160j760j907j124j87%k08L37J963L692M411L994L136
63113D48269K457K113K094K517L382M215M267L306K105J758K457L267L232K396
63099D87835J499R59O29L60L82R08J704K196K041J519J310J755K421K572K088
63084E10178J531J219P92L6l69L21J672K455K309K187K965M348N577O588P835
63069E49644R332J0610J1464J2172J2919J3607J4313J5437J7136J8963K0438K1771
63057G27806K3659K6373K9417L2164L4582L7079L9809M2465M4775M6883M9043
63046A134055N1176N2922N4027N4450N4164N3234N2043N1143N0775N0715N0689
$$ plain form
63142 547517 530154 515464 502555 490528 479513 470481 463934 459147 454939 450889 447349 444506 442058
63129 442058 439853 438181 437082 435922 434162 432255 431131 430944 430944 430736 431073 433036 436728 441139 445133 448269
63113 448269 450726 452839 454933 457450 460832 465047 469314 472620 474725 476483 478940 482207 485439 487835
63099 487835 489334 490293 490922 491282 491664 492572 494276 496472 498513 500032 501342 503097 505518 508090 510178
63084 510178 511709 512928 513720 513756 513387 513708 515380 517835 520144 522331 525296 529644 535221 541809 549644
63069 549644 558976 569586 581050 593222 606141 619748 634061 649498 666634 685597 706035 727806
63057 727806 751465 777838 807255 839419 874001 911080 950889 993354 1038129 1085012 1134055
63046 1134055 1185231 1238153 1292180 1346630 1400794 1454028 1506071 1557214 1607989 1658704 1709393
63035A709393N0678N0722N0643N0168M9128M7304M4190L9215L2252K3744J4240
63024B161677L934p268j9203l1137m2055n1288n8742o4439o8017o8987o7423o4120
63012A622932n9926n5082m9372m2670l5171k7188j9038j1074l615L265R703J5667
63000A348431K0853K5099K8842L2683L6455L9054L9648L8859L8232L8451L8619
62989A725226L7581L5501L3582L2468L1475K9438K5873K1048J5257Q308k15j0225
62977A985317k0822l0941m0310m9368n8022o5095o9499p1571p2450p2457p0976
62966A363806o7888o4052o0105n5714n0577m5363m0984l7437l4094l0723k7572
62955H49297k4758k2281k0402j9408j8992j8512j7735j6868j6007j5095j4325
$$ plain form
63035 1709393 1760071 1810793 1861436 1911604 1960732 2008036 2052226 2091441 2123693 2147437 2161677
63024 2161677 2165611 2158343 2139140 2108003 2065948 2014660 1955918 1891479 1823462 1754475 1687052 1622932
63012 1622932 1563006 1507924 1458552 1415882 1380711 1353523 1334485 1323411 1319796 1323061 1332764 1348431
63000 1348431 1369284 1394383 1423225 1455908 1492363 1531417 1571065 1609924 1648156 1686607 1725226
62989 1725226 1762807 1798308 1831890 1864358 1895833 1925271 1951144 1972192 1987449 1995757 1995542 1985317
62977 1985317 1964495 1933554 1893244 1843876 1785854 1720759 1651260 1579689 1507239 1434782 1363806
62966 1363806 1295918 1231866 1171761 1116047 1065470 1020107 979123 941686 907592 876869 849297
62955 849297 824539 802258 781856 762448 743456 724944 707209 690341 674334 659239 644914
62944F44914j3961j3786j3270j2390j1724j1572j1507j0963r860q493p182o215
62932E13991n757n604n364n048n058n409n422m600l429k766k600k070p59N96J020
62917D61721M49m11j127j868k688l075k551j368k18M86O29j9j567l342m197l711
62901D37143k606j727j144n91j42O7L31Q94J321J068M46L40J013J845K280K317
62885D42855K035J303K44n75p08l27R3L53N86R69J449J664J214J98o67q14m87
62868D49385l04l93n32q42j617k538k904k658k431k405k046j127j73M43R73J480
62852D32311J472R16P27J481K446K679K345K058J662Q20J78N69J373J127k19j143
62836D50802q21k00l26q06p41j57L29O46J108J628J850J812J810J853J810J835
$$ plain form
62944 644914 630953 617167 603897 591507 579783 568211 556704 545741 535881 527388 520206 513991
62932 513991 508234 502630 497266 492218 487160 481751 476329 471729 468300 465534 462934 460864 460105 460701 461721
62917 461721 462170 461759 460632 458764 456076 453001 450450 449082 448864 449350 449979 449960 448393 445051 440854 437143
62901 437143 434537 432810 431666 431075 430933 431000 431331 432225 433546 434614 435060 435400 436413 438258 440538 442855
62885 442855 444890 446193 446437 445862 445154 444827 444920 445273 445859 446828 448277 449941 451155 451353 450686 449872 449385
62868 449385 449081 448688 448156 447314 445697 443159 440255 437597 435166 432761 430715 429588 429415 429858 430831 432311
62852 432311 433783 434699 435426 436907 439353 442032 444377 446435 448097 448917 449095 449664 451037 452164 451945 450802
62836 450802 449981 449781 449455 448649 447908 447751 448080 448726 449834 451462 453312 455124 456934 458787 460597 462432
62820D62432K064K178J893J622J997K873L505L626L640L754L685L442L608M434
62806E04753N214N154M482M145M650N720O971Q341R706J0647J0927J0987J1585
62793F03282J2951J4536J5687J6395J7295J9016K1694K5107K9052L3369L7801
62782H46185M2140M6576N1603N7387O3400O8897P3632P7923Q2062Q5885Q8828
62771A584518R0171Q9208Q5519P9194P0678O0289M8103L4325J9447L974j1746
62760B153680k7138m1205n3167o3125p1618p8553q3142q5005q4811q3522q1483
62749A400911p8632p5188p1522o7521o2711n7160n1665m6876m2534l8008l3281
62738G75813k9053k5861k3489k1330j9075j6879j4913j3037j0969q691o521m811
$$ plain form
62820 462432 464496 466674 468567 470189 472186 475059 478564 482190 485830 489584 493269 496711 500319 504753
62806 504753 509967 515121 519603 523748 528398 534118 541089 549430 559136 569783 580710 591697 603282
62793 603282 616233 630769 646456 662851 680146 699162 720856 745963 775015 808384 846185
62782 846185 888325 934901 986504 1043891 1107291 1176188 1249820 1327743 1409805 1495690 1584518
62771 1584518 1674689 1763897 1849416 1928610 1999288 2059577 2107680 2142005 2161452 2165426 2153680
62760 2153680 2126542 2085337 2032170 1969045 1897427 1818874 1735732 1650727 1565916 1482394 1400911
62749 1400911 1322279 1247091 1175569 1108048 1045337 988177 936512 889636 847102 809094 775813
62738 775813 746760 720899 697410 676080 657005 640126 625213 612176 601207 592516 585995 581184
62726E81184l701l134k848k376j316J90J494K235K853L936N301O278O841P793
62712F04730R654J2015J4321J6695J9462K2405K5058K7515L0240L3334L6657M0481
62700H92567M5258N0698N5892O0485O5022O9813P4233P7501P9555Q0647Q0630
62689A632301P9168P6125P1193O3647N3188M0710K7449J3713q12j5772l0155m3533
62677A967222n6171o7727p6799q2384q5015q5893q5421q3288p9556p4946p0092
62666A119930o5095n9849n4463m9264m4491m0117l5901l1779k8080k5137k2747
62655F63007k0431j8214j6635j5810j5098j3968j2706j1853j1395j0931j0238
62644E05728r212p727o033m926m851n112m662l414k117j172l83K98O34P80J223
$$ plain form
62726 581184 577483 574349 571501 569125 567809 567999 569493 571728 574581 578517 583818 590096 596937 604730
62712 604730 614384 626399 640720 657415 676877 699282 724340 751855 782095 815429 852086 892567
62700 892567 937825 988523 1044415 1104900 1169922 1239735 1313968 1391469 1471024 1551671 1632301
62689 1632301 1711469 1787594 1858787 1922434 1975622 2016332 2043781 2057494 2056682 2040910 2010755 1967222
62677 1967222 1911051 1843324 1766525 1684141 1599126 1513233 1427812 1344524 1264968 1190022 1119930
62666 1119930 1054835 994986 940523 891259 846768 806651 770750 738971 710891 685754 663007
62655 663007 642576 624362 607727 591917 576819 562851 550145 538292 526897 515966 505728
62644 505728 496516 488789 482756 477830 472979 467867 463205 459791 457674 456502 456119 456417 457051 457831 459054
62629D59054J836J811Q28m54j338j855k198k127j536r62q85q73k17R08J645J722
62613D55359J827K613L913N113N915O517P339Q644J0232J1449J1807J1658J1957
62600E54343J3254J5231J7302J9349K1631K4233K6977K9756L2643L5677L8695
62589H29091M1356M3123M3352M1734L8665L4883L0616K5422J8967J1583L792m273
62577A158311j2493k0109k6174l0634l4347l7806m0435m1438m0848l9401l7707
62566G96919l5995l4318l2525l0179k7031k3506k0429j8290j6979j6051j4927
62555E26689j3111j0607q131o434n589n204n108n331n586n346m518l505k637j936
62541D43646j408j012l62Q79K229K714K206J757K220L144L549L315L119L352L792
$$ plain form
62629 459054 460890 462701 463529 463075 461737 459882 457684 455557 454021 453059 452174 451301 451084 451992 453637 455359
62613 455359 457186 459799 463712 468825 474740 481257 488596 497240 507472 518921 530728 542386 554343
62600 554343 567597 582828 600130 619479 641110 665343 692320 722076 754719 790396 829091
62589 829091 870447 913570 956922 998656 1037321 1072204 1102820 1128242 1147209 1158792 1162584 1158311
62577 1158311 1145818 1125709 1099535 1068901 1034554 996748 956313 914875 874027 834626 796919
62566 796919 760924 726606 694081 663902 636871 613365 592936 574646 557667 541616 526689
62555 526689 513578 502971 494840 488406 482817 477613 472505 467174 461588 456242 451724 448219 445582 443646
62541 443646 442238 441226 440864 441743 443972 446686 448892 450649 452869 456013 459562 462877 465996 469348 473140
62526D73140M322N297O988R072J0956J2461J4005J6108J8791K1546K3939K6154
62514F42779K8749L1943L5364L8516M1203M3455M5244M6365M6463M5178M2493
62503A087752L8818L4453K9081K2196J3986N352k995j0847j7922k3651k7819l0846
62491A117558l2988l3820l2915l0619k7617k4127k0058j5675j1499p675l940m4
62479H76581M103Q475J2631J5640J6907J6975J6834J6508J4959J1473O557J236
62467A018879l931q838j3294j7176k0905k5192l0040l4317l6696l7010l6364l5826
62455G19290l5289l3946l1485k8360k4996k1436j7895j4945j2801j0948q935p058
62443D71196n783m926l987k970k213j638q49J57J008J675K466L260L342K319P39
$$ plain form
62526 473140 477462 482759 489747 498819 509775 522236 536241 552349 571140 592686 616625 642779
62514 642779 671528 703471 738835 777351 818554 862009 907253 953618 1000081 1045259 1087752
62503 1087752 1126570 1161023 1190104 1212300 1226286 1231638 1228643 1217796 1199874 1176223 1148404 1117558
62491 1117558 1084570 1050750 1017835 987216 959599 935472 915414 899739 888240 880565 876625 876581
62479 876581 880684 889159 901790 917430 934337 951312 968146 984654 999613 1011086 1017643 1018879
62467 1018879 1014948 1006110 992816 975640 954735 929543 899503 865186 828490 791480 755116 719290
62455 719290 684001 650055 618570 590210 565214 543778 525883 510938 498137 487189 478254 471196
62443 471196 465413 460487 456500 453530 451317 449679 448830 448987 449995 451670 454136 457396 460738 463057 463796
62428D63796m22p19o11r92k341m076m975m550l752l858m866n614n392m632l960
62413D13036l384k720k175j964j836j484j055q70r02r06q52q59q88q49q39r36
62397C90517r24n09K75J132J862K417K775K923K929K817K551K299K438L022L490
62382D20014L272K601K302K867M052N307O276O833P086P399Q079Q941R488R681
62368E04198J0138J1380J3153J4868J6389J7970J9616K1110K2712K5217K9036
62357G05787L3579L7945M1883M5680M9329N2447N4936N7004N8379N8030N5125
62346A250124M9817M2689L3854K3347J2163K042o133j3058j9831k6483l2185l6532
62334A279814l9950m2860m5020m5960m5622m4316m2238l9400l5934l2232k8758
$$ plain form
62428 463796 463374 462655 462044 461052 458711 454635 449660 445110 441358 437500 432634 427020 421628 416996 413036
62413 413036 409652 406932 404757 402793 400957 399473 398418 397548 396646 395740 394888 394029 393141 392292 391453 390517
62397 390517 389593 389084 389359 390491 392353 394770 397545 400468 403397 406214 408765 411064 413502 416524 420014
62382 420014 423286 425887 428189 431056 435108 440415 446691 453524 460610 468009 476088 485029 494517 504198
62368 504198 514336 525716 538869 553737 570126 588096 607712 628822 651534 676751 705787
62357 705787 739366 777311 819194 864874 914203 966650 1021586 1078590 1136969 1194999 1250124
62346 1250124 1299941 1342630 1376484 1399831 1411994 1414036 1407903 1394845 1375014 1348531 1316346 1279814
62334 1279814 1239864 1197004 1151984 1106024 1060402 1016086 973848 934448 898514 866282 837524
62323H37524k5832k3550k1728k0071j8576j7649j7609j8051j8127j7538j6870
62312F21923j6773j7061j6989j6159j4883j3702j2869j2184j1114r223o736m618
62300D69612l693l780l956l577k777k026j611j542j525j117k43M84M75J45N66
62285D45435K015L514M119M010L892L918L712L237K916L054L523M048M458M672
62271D96523M698M673M791N268O334Q043J0083J2043J3914J5996J8367K0941K4019
62258F45693K8094L2914L7488M1438M5602N0685N5895N9719O1649O2347O2252
62247A183776O0795N6993N0336M1045K9911J7964O085n039j4680k2352k8529l4436
62235A341869m0646m6411n0881n4311n7284n9381n9588n7691n4319m9884m4542
$$ plain form
62323 837524 811692 788142 766414 746343 727767 710118 692509 674458 656331 638793 621923
62312 621923 605150 588089 571100 554941 540058 526356 513487 501303 490189 480966 474230 469612
62300 469612 465919 462139 458183 454606 451829 449803 448192 446650 445125 444008 443765 444249 444724 444869 445435
62285 445435 447450 450964 455083 459093 462985 466903 470615 473852 476768 479822 483345 487393 491851 496523
62271 496523 501221 505894 510685 515953 522287 530330 540413 552456 566370 582366 600733 621674 645693
62258 645693 673787 706701 744189 785627 831229 881914 937809 997528 1059177 1121524 1183776
62247 1183776 1244571 1301564 1351900 1392945 1422856 1440820 1446905 1441866 1427186 1404834 1376305 1341869
62235 1341869 1301223 1254812 1203931 1149620 1092336 1032955 973367 915676 861357 811473 766931
62224G66931l8955l4041k9870k5844k1986j9060j7260j5757j3939j2216j1170
62213E26833j0631j0022r124q074p049o260n869n674n244m409l304k001o23L02
62199D48851L40M0M75J800L014L373L256L360L855M691O027P728R140R802J0010
62184E15762J0269J0617J0880J1083J1249J1206J0886J0412R620Q092N975M285
62172F30336L965N039O907R026J1096J3110J5575J9149K3785K8702L3367L7840
62160H37897M1924M4795M5875M5377M3447L9573L3462K5884J7911R897J888n502
62148A182428j1458j5959j9721k3349k7003l0566l3645l5669l6440l6254l5186
62137H77178l2816k9079k4731k0428j5966j1166o758l470p74K413O118R404J1895
$$ plain form
62224 766931 727976 693935 664065 638221 616235 597175 579915 564158 550219 538003 526833
62213 526833 516202 506180 497056 488982 481933 475673 469804 464130 458886 454477 451173 449172 448549 448851
62199 448851 449191 449231 449706 451506 454520 457893 461149 464509 468364 473055 479082 486810 495950 505752 515762
62184 515762 526031 536648 547528 558611 569860 581066 591952 602364 611984 620076 626051 630336
62172 630336 634301 639340 646247 655273 666369 679479 695054 714203 737988 766690 800057 837897
62160 837897 879821 924616 970491 1015868 1059315 1098888 1132350 1158234 1176145 1186042 1187930 1182428
62148 1182428 1170970 1155011 1135290 1111941 1084938 1054372 1020727 985058 948618 912364 877178
62137 877178 844362 815283 790552 770124 754158 742992 736234 732764 731990 734403 740521 749925 761820
62124G61820J4187J6769J9398K1649K3408K4720K5652K6271K6348K5269K2750
62113A008241J9273J5310J0573M825j003n459q163r885j1241j2335j3530j5418
62101I81188j7762j9398j9503j8210j5891j2680q943n360k181R47M122O789Q520
62088H81638R496R963R865R421R350J0073J1174J2069J2757J3439J3972J4241
62076A017458J4712J6048J8330K1054K3731K6049K7557K7748K6501K4368K2240
62065A265796K0784K0050J9643J9303J9271J9897K1012K1990K2379K2102K1052
62054A493279J8912J5494J1040O104J300k887o410r771j3625j8251k3512k9168
62042A442505l4862m0007m4181m7477n0046n1495n1381n0206m9081m8286m6836
$$ plain form
62124 761820 776007 792776 812174 833823 857231 881951 907603 933874 960222 985491 1008241
62113 1008241 1027514 1042824 1053397 1058222 1057219 1051760 1043597 1033712 1022471 1010136 996606 981188
62101 981188 963426 944028 924525 906315 890424 877744 868801 863441 861260 862207 866329 873118 881638
62088 881638 891134 901097 910962 920383 929733 939806 950980 963049 975806 989245 1003217 1017458
62076 1017458 1032170 1048218 1066548 1087602 1111333 1137382 1164939 1192687 1219188 1243556 1265796
62065 1265796 1286580 1306630 1326273 1345576 1364847 1384744 1405756 1427746 1450125 1472227 1493279
62054 1493279 1512191 1527685 1538725 1544829 1546129 1543242 1536832 1527061 1513436 1495185 1471673 1442505
62042 1442505 1407643 1367636 1323455 1275978 1225932 1174437 1123056 1072850 1023769 975483 928647
62031I28647m3812l9564l5248l1694k8999k6793k4440k1387j7794j4605j2718
62020F31593j2112j1988j1595j0784r949r589r756r873r331q191p057o266n544
62007E09558m425k732o32J373K604K881K997L945N633O967P277O959O530N822
61993E54757M563L004J477k25k349m488n943o604p027p707q622r414r726r546
61979D92150r280r252r123q282o883n856n622n513m911m237m126m187l508k095
61965D09275q98n08o05p45q81r57o63J03J032J915K903M034M877N041M787M853
61949D33563N685P002Q117Q605Q778R468J1260J3821J6166J7602J8443J9617K1660
61936E99787K4068K5790K6338K6228K6134K5882K4709K2534K0341J8977J8022
$$ plain form
62031 928647 884835 845271 810023 778329 749330 722537 698097 676710 658916 644311 631593
62020 631593 619481 607493 595898 585114 575165 565576 555820 545947 536616 528425 521368 515102 509558
62007 509558 505133 502401 501769 503142 505746 508627 511624 515569 521202 528169 535446 542405 548935 554757
61993 554757 559320 562324 563801 563576 561227 556739 550796 544192 537165 529458 520836 511422 501696 492150
61979 492150 482870 473618 464495 456213 449330 443474 437852 432339 427428 423191 419065 414878 411370 409275
61965 409275 408377 407869 407264 406519 405638 404681 404018 404121 405153 407068 409971 414005 418882 423923 428710 433563
61949 433563 439248 446250 454367 462972 471750 481218 492478 506299 522465 540067 558510 578127 599787
61936 599787 623855 649645 675983 702211 728345 754227 778936 801470 821811 840788 858810
61925H58810J6346J3532J0214P114M228J112k469o323r948j2679j3964j3669j2209
61912H40095j0228q130n835k929Q40N107R054J2148J4576J6767J8570J9255J8363
61899I27653J6169J3150R257M121k057q190j3151j6753j9626k2201k4221k5299
61887H38852k5521k5222k4439k3041k1219j9450j8010j6843j5839j4922j3947
61876F20399j2933j2272j2188j2057j0933q856o938n892n151l912k306r51J82
61863E26192J601L336M915O268P930J0203J2747J5146J7411J9744K2177K4706
61851F72376K7449L0469L3638L6716L9428M1400M2354M2438M2052M1219L9432
61840A088971L6307L2062K7032K1015J3613N212k870r435j4287j7860k0258k1099
$$ plain form
61925 858810 875156 888688 898902 906016 910244 911356 908887 902564 892616 879937 865973 852304 840095
61912 840095 829867 821737 815902 812973 813813 818920 827974 840122 854698 871465 890035 909290 927653
61899 927653 943822 956972 966229 970350 968293 960103 946952 930199 910573 888372 864151 838852
61887 838852 813331 788109 763670 740629 719410 699960 681950 665107 649268 634346 620399
61876 620399 607466 595194 583006 570949 560016 551160 544222 538330 533179 529267 526961 526010 526192
61863 526192 527793 531129 536044 542312 550242 560445 573192 588338 605749 625493 647670 672376
61851 672376 699825 730294 763932 800648 840076 881476 923830 966268 1008320 1049539 1088971
61840 1088971 1125278 1157340 1184372 1205387 1219000 1224212 1221342 1211907 1197620 1179760 1159502 1138403
61828A138403k0150j7611j3686q407k191L852Q687J2290J5236J7452J7899J5711
61816A167485J1188N433p17p083j3746k0567k7144l2975l7615m0751m2268m2373
61804I18867m1607m0445l8696l5715l1538k7357k4327k2124j9570j6543j4228
61793F06717j3259j2676j1370r713q845q883q833q014o727n607n003n017n479
61780D97291n830n589m973m566m433m125l488k870k395j769r82n68q45j355j472
61765D52031j184r45j044j480k130k689k675j893p23L69J452K786M031M329L343
61750D53578J838Q87Q01J049J063Q05N68O07R89J629K207K330J936J427J140Q76
61734D73730K72m38m55O10K142L175L389L227L212L454L776L992M065M146M472
$$ plain form
61828 1138403 1118253 1100642 1086956 1078549 1076358 1080210 1088897 1101187 1116423 1133875 1151774 1167485
61816 1167485 1178673 1184106 1183389 1176306 1162560 1141993 1114849 1081874 1044259 1003508 961240 918867
61804 918867 877260 836815 798119 762404 730866 703509 679182 657058 637488 620945 606717
61793 606717 593458 580782 569412 559699 550854 541971 533138 525124 518397 512790 507787 502770 497291
61780 497291 491461 485872 480899 476333 471900 467775 464287 461417 459022 457253 456271 455703 454858 453503 452031
61765 452031 450847 449902 448858 447378 445248 442559 439884 437991 437268 437637 439089 441875 445906 450235 453578
61750 453578 455416 456303 457104 458153 459216 460021 460589 461196 462185 463814 466021 468351 470287 471714 472854 473730
61734 473730 474002 473564 473109 473719 475861 479036 482425 485652 488864 492318 496094 500086 504151 508297 512769
61719E12769N134N932O559O892P050P226P491P648P263N960L873J618k19j495
61705E83701k377l059l721m536n460o160o331o006n426m848m535m710n220n502
61691E15810n183m561m180m100l945l561l203l043k917k629k251j950j818j901
61677D70568k223k595k606k020j174p90j264k167k610k181j393j006j051r12l08
61662D46268K71L53J49J16K43K63K98P24J511K256K809L413M063M269L634K433
61646D73073J423J228J941L161M307M992N242N306N305N167M752L975K828J446
61632E24146Kj496l082m460n114n025m832m977n086m660l953l532l291k690j780
61617D70170j113o94M3R93J146N5j280j687j382j496k404l402l922m280n031o117
$$ plain form
61719 512769 517903 523835 530394 537286 544336 551562 559053 566701 573964 579924 583797 585415 585196 583701
61705 583701 581324 578265 574544 570008 564548 558388 552057 546051 540625 535777 531242 526532 521312 515810
61691 515810 510627 506066 501886 497786 493841 490280 487077 484034 481117 478488 476237 474287 472469 470568
61677 470568 468345 465750 463144 461124 459950 459160 457896 455729 453119 450938 449545 448539 447488 446576 446268
61662 446268 446539 446892 447041 447157 447400 447663 447961 448685 450196 452452 455261 458674 462737 467006 470640 473073
61646 473073 474496 475724 477665 480826 485133 490125 495367 500673 505978 511145 515897 519872 522700 524146
61632 524146 524148 522652 519570 515110 509996 504971 500139 495162 490076 485416 481463 477931 474640 471950 470170
61617 470170 469057 468363 468406 469399 470545 470600 469320 467633 466251 464755 462351 458949 455027 450747 445716 439599
61601D39599o971p228p022o659o162n338m270l553l665m259m453l931l302l128
61587C69658l146k848k415k438k944l366l446l471l503l094k117j352j623k678
61573C31217l462l398k812k119j251j33P69Q82K06q23j895k823l180k596j428
61558C07154n51k91j57J42J26n41j122o37O59J499J291P67P98J249J422J105P00
61541C13613O16R24J417J701J452Q70O78J311K265K682K406K035J990K005J714
61526C37679J196O83M6r62k140k927l107l052l128l206k982k576k441k704k924
61511C07455k599j721o98P1M52N47N07L83R2l90q96j252j575k066k547k541j905
61494B91317j141q62j198j809k224k022j073J19O31O9q91j274q55r7O27J217J499
$$ plain form
61601 439599 432628 425400 418378 411719 405557 400219 395949 392396 388731 384472 380019 376088 372786 369658
61587 369658 366512 363664 361249 358811 355867 352501 349055 345584 342081 338987 336870 335518 333895 331217
61573 331217 327755 324357 321545 319426 318175 318042 318811 319693 319899 319076 317181 314358 311178 308582 307154
61558 307154 306603 306312 306155 306297 306423 305882 304760 304123 304782 306281 307572 308339 309137 310386 311808 312913 313613
61541 313613 314229 315153 316570 318271 319723 320593 321271 322582 324847 327529 329935 331970 333960 335965 337679
61526 337679 338875 339558 339604 338642 336502 333575 330468 327416 324288 321082 318100 315524 313083 310379 307455
61511 307455 304856 303135 302437 302508 302960 303507 304014 304397 304489 304099 303203 301951 300376 298310 295763 293222 291317
61494 291317 290176 289314 288116 286307 284083 282061 280988 281107 281738 281807 280916 279642 278787 278690 279317 280534 282033
61477B82033J345J124J403K127K598K394J774J035J71o87j014o02j5J57J82P32
61461B94757J677K051J291O0n31j68N23R01R69R57P75K90o2L90J483K027J160
61444C08550m51j299p63L90J151J292J198J212J509K216L289M391N038M885L909
61429C36517K554J652J719K288K294J301l9q31q43l11N46J469K017K005J867K103
61413C56308K523K544K069J560J307J069N62j74r94j822k484k760k794l065l715
61398C50134m195l944l224k825l047l382l238k619j926j392r47n05r0K49M55M50
61382C19954K46M5j7j39n89j144j053J55K027L488L772L006J945J335J387J725
61366C36143J791J330N62m9r7N64J670K624K980K874K790K924L112L345L877M699
$$ plain form
61477 282033 283378 284502 285905 288032 290630 293024 294798 295833 296004 295317 294303 293701 293686 293843 294025 294757
61461 294757 296434 298485 299776 299836 299305 299137 299660 300561 301530 302487 303262 303552 303490 303880 305363 307390 308550
61444 308550 308099 306800 306037 306427 307578 308870 310068 311280 312789 315005 318294 322685 327723 332608 336517
61429 336517 339071 340723 342442 344730 347024 348325 348286 347455 346612 346301 346847 348316 350333 352338 354205 356308
61413 356308 358831 361375 363444 365004 366311 367380 367942 367768 366774 364952 362468 359708 356914 353849 350134
61398 350134 345939 341995 338771 335946 332899 329517 326279 323660 321734 320342 319395 318890 318800 319049 319504 319954
61382 319954 320200 320245 320228 320089 319500 318356 317303 317458 319485 322973 326745 329751 331696 333031 334418 336143
61366 336143 337934 339264 339826 339777 339680 340244 341914 344538 347518 350392 353182 356106 359218 362563 366440 371139
61350C71139N399N844O507P689Q864R347R308R473R984J0215R769Q962Q195P388
61336D88083O321N188M452M308M443M234L254J686K25o44j190k018l221m267m640
61321E06214m310l578k841k440k393k273j727j046p64p49k50J054K545L478L792
61306D94712L918M174M661N478O574P616Q277Q606Q846Q941Q468P046M738K013
61292E84068o35l005n066o610p266p040o469o033n704n348n228n482n515m670
61278E09997l352k615k550k046m23J644L225M345N453O405O748O564O231N700
61264E45326M805L994L945M514M947N158N997P914J0103J1426J1762J1912J2420
61251F44223J2985J2949J1967J0117P729N252L073J302k54j762l090m002m549
$$ plain form
61350 371139 376538 382382 388889 396578 405442 414789 424097 433570 443554 453769 463538 472500 480695 488083
61336 488083 494404 499592 504044 508352 512795 517029 520283 521969 522194 521550 520360 518342 515121 510854 506214
61321 506214 501904 498326 495485 493045 490652 488379 486652 485606 484842 484093 483843 484897 487442 490920 494712
61306 494712 498630 502804 507465 512943 519517 527133 535410 544016 552862 561803 570271 577317 582055 584068
61292 584068 583433 580428 575362 568752 561486 554446 547977 541944 536240 530892 525664 520182 514667 509997
61278 509997 506645 504030 501480 499434 499011 500655 503880 508225 513678 520083 526831 533395 539626 545326
61264 545326 550131 554125 558070 562584 567531 572689 578686 586600 596703 608129 619891 631803 644223
61251 644223 657208 670157 682124 692241 699970 705222 708295 709597 709343 707581 704491 700489 695940
61238F95940n052n709o432p041p375p165o239m996m225m159m026l105j812j129
61224F27475j081o45Q01K634L881M273M037L308K298J660J932K724L099K810K595
61209F61801L112L991M301L744K895K372K109J685J072O83Q17J419K419L895N797
61194G02112P913J0233J2936J5799J8089J9411K0214K1015K1511K0987J9259J6685
61182I06164J3663J0728Q744Q130Q090P453O170N127M638M014K718J030p07k508
61168I83454m204n273n695o294p797j0044j2363j4229j5328j5656j5769j6294
61156H54508j6967j6934j6175j5698j5883j5650j3946j1279q919p270n873m531
61144G05383l469k642j755j001j045k266m370o693q563r511r479q768p596o018
$$ plain form
61238 695940 690888 685179 678747 671706 664331 657166 650927 645931 641706 637547 633521 630416 628604 627475
61224 627475 626394 625749 626550 629184 633065 637338 641375 644683 646981 648641 650573 653297 656396 659206 661801
61209 661801 664913 668904 673205 676949 679844 682216 684325 686010 687082 687765 688582 690001 692420 696315 702112
61194 702112 710025 720258 733194 748993 767082 786493 806707 827722 849233 870220 889479 906164
61182 906164 919827 930555 939299 947429 955519 962972 969142 974269 978907 982921 985639 986669 985962 983454
61168 983454 979250 973977 968282 961988 954191 944147 931784 917555 902227 886571 870802 854508
61156 854508 837541 820607 804432 788734 772851 757201 743255 731976 723057 715787 709914 705383
61144 705383 701914 699272 697517 696516 695471 693205 688835 682142 673579 664068 654589 645821 638225 632207
61130F32207m354l113k189o91J869M738O769P796Q615R921J1870J4329J6975J9296
61116G24038K1010K2449K4147K6162K8158K9922L1421L2528L3106L3272L3206
61105A039419L2787L1685K9775K7261K4526K1914J9440J6695J3231R122M835O52
61093A271342l418p287j0986j5030j9806k4495k7573k8599k8716k9087k9721l0190
61081A016434l0458l0422k9528k7611k5526k4131k3243k2109k0399j8224j5796
61070G48987j3639j2419j1991j1254r529p395n639m186k725j534q70k64P93K042
61056F70377L100M197N565O873P946R202J0659J1496J1501J1918J3690J5948J7442
61043G99914J8498K0168K2287K3998K5536K7830L0750L3287L5215L7182L9403
$$ plain form
61130 632207 627853 624740 622551 621860 623729 628467 635236 643032 651647 661568 673438 687767 704742 724038
61116 724038 745048 767497 791644 817806 845964 875886 907307 939835 972941 1006213 1039419
61105 1039419 1072206 1103891 1133666 1160927 1185453 1207367 1226807 1243502 1256733 1265855 1270690 1271342
61093 1271342 1267924 1260637 1249651 1234621 1214815 1190320 1162747 1134148 1105432 1076345 1046624 1016434
61081 1016434 985976 955554 926026 898415 872889 848758 825515 803406 783007 764783 748987
61070 748987 735348 722929 710938 699684 690155 682760 677121 672935 670210 668676 667806 667542 668335 670377
61056 670377 673477 677674 683239 690112 698058 707260 717919 729415 740916 752834 766524 782472 799914
61043 799914 818412 838580 860867 884865 910401 938231 968981 1002268 1037483 1074665 1114068
61032A114068M1565M3776M6299M8628N0109N1137N2631N4593N6267N7307N7796
61021A674176N7865N8456O1575O8270P7189Q6634R7097J10130J25813J43469J64060
61010B724734J89847K22493K63421L14820L77864M51668N36904O38944P63970
61001F484665R13811J087749J284052J490691J677842J813189J885387J893373
60993A8530759J802625J537382J055925M42369j06024m12707m46276l09116j24187
60984B1970750L5933J14206J9641l29379r02109j526781j992366k184501k127633
60975A3077761j920246j653503j382558j137454r32483p66924o31722n20356m30772
60966C701743l59730l01863k54142k16483j87708j64775j46014j31530j20123
$$ plain form
61032 1114068 1155633 1199409 1245708 1294336 1344445 1395582 1448213 1502806 1559073 1616380 1674176
61021 1674176 1732041 1790497 1852072 1920342 1997531 2084165 2181262 2291392 2417205 2560674 2724734
61010 2724734 2914581 3137074 3400495 3715315 4093179 4544847 5081751 5720695 6484665
61001 6484665 7398476 8486225 9770277 11260968 12938810 14751999 16637386 18530759
60993 18530759 20333384 21870766 22926691 23369060 23263036 22850329 22404053 22094937 21970750
60984 21970750 22006683 22120889 22140530 21811151 20909042 19382261 17389895 15205394 13077761
60975 13077761 11157515 9504012 8121454 6984000 6051517 5284593 4652871 4132515 3701743
60966 3701743 3342013 3040150 2786008 2569525 2381817 2217042 2071028 1939498 1819375
60957A819375j09074r7442q6736p7720o9211o0558n2863m6974m2386l8840l7004
60946A100567l6698l6283l4676l2535l0654k8699k6290k4047k2613k1706k0867
60935G85499k0296k0257k0391k0162j9394j8082j6360j4811j4030j3711j2983
60924E95022j1696j0513r740r044q432q339q505p915o337m897m603n128n526n380
60910D88967m786l946l216k952k853k119o36O65J072J021J280J833K178K214K202
60895D80924K081J525O30K5K03R45J597J757J481Q54l29k009l353l459k722k578
60879D77572l580m641m741m486n004o071o457n704m421l098j829j023j149j806
60865D23562k069j802j623j607j118k9J027J760K555L430L771L381K864K577K235
$$ plain form
60957 1819375 1710301 1612859 1526123 1448403 1379192 1318634 1265771 1218797 1176411 1137571 1100567
60946 1100567 1063869 1027586 992910 960375 929721 901022 874732 850685 828072 806366 785499
60935 785499 765203 744946 724555 704393 684999 666917 650557 635746 621716 608005 595022
60924 595022 583326 572813 563073 554029 545597 537258 528753 520838 514501 509604 505001 499873 494347 488967
60910 488967 484181 480235 477019 474067 471214 469095 468459 469124 470196 471217 472497 474330 476508 478722 480924
60895 480924 483005 484530 485160 485185 485388 486333 487930 489687 491168 492022 491693 489684 486331 482872 480150 477572
60879 477572 473992 469351 464610 460124 455120 449049 442592 436888 432467 429369 427540 426517 425368 423562
60865 423562 421493 419691 418068 416461 415343 415314 416341 418101 420656 424086 427857 431238 434102 436679 438914
60850D38914J838K017K923L754L920L822L913L792K980J869J191J040J045J069
60836D74087J095Q32K2j088k014k499k455j846r72m30m23n25m07l59o55r64r11
60819D60488p73j074j741k265k481k684l028l319l435l565l871m140l904k959
60805D21249j782j290j937l131l757l322k324j574j417j631j754j481r84p49q89
60790C93227q57k23N02M93j07k93L81J227J571J696K210L023L477L242K624K186
60774D14379K306L011M012M907N416N475N217N044N375O049O293N738N139N392
60760D83753O172O379N844N492N673N365L671J239m40p23j58N28J149J887K834
60745E28665L795M384M368L959L579L373L094K477J459J57j093j784j678j050
$$ plain form
60850 438914 440752 442769 445692 449446 453366 457188 461101 464893 467873 469742 470933 471973 473018 474087
60836 474087 475182 476014 476036 474948 472934 470435 467980 466134 465162 464732 464309 463784 463377 463018 462363 461399 460488
60819 460488 459715 458641 456900 454635 452154 449470 446442 443123 439688 436123 432252 428112 424208 421249
60805 421249 419467 418177 416240 413109 409352 406030 403706 402132 400715 399084 397330 395849 394865 394116 393227
60790 393227 392370 392147 392649 393142 393035 392742 393123 394350 395921 397617 399827 402850 406327 409569 412193 414379
60774 414379 416685 419696 423708 428615 434031 439506 444723 449767 455142 461191 467484 473222 478361 483753
60760 483753 489925 496304 502148 507640 513313 518678 522349 523588 523148 522425 522267 522795 523944 525831 528665
60745 528665 532460 536844 541212 545171 548750 552123 555217 557694 559153 559310 558217 556433 554755 553705
60731E53705k36P33J701K056J592J244K082L744M970N489O251P696R021R574R830
60716F19452J0421J1154J1616J1943J2407J2878J3255J3776J4423J4713J4523
60705G60561J4423J4657J4582J3676J2400J1412J0606R640Q626P579N850L057
60693H87069L2k129l533n097p063q875j0324j1752j3242j4492j5464j6321j6676
60680G62133j5854j4112j2764j2699j3371j3666j3273j2732j2452j2219j1731
60669F17260j1171j0954j1042j0843r996q961q459q490q370p706o814o071n445
60656E02938m858m382l862k984k032j912k877l820l462j883k54O18Q09O95N31
60641D73265M51L45k37j448k606k824k140j495j547j974k008j322k60N38O95M04
$$ plain form
60731 553705 553469 554202 555903 557959 559551 560795 562877 566621 571591 577080 583331 591027 600048 609622 619452
60716 619452 629873 641027 652643 664586 676993 689871 703126 716902 731325 746038 760561
60705 760561 774984 789641 804223 817899 830299 841711 852317 861957 870583 878162 884012 887069
60693 887069 887101 884972 881439 876342 869279 860404 850080 838328 825086 810594 795130 778809 762133
60680 762133 746279 732167 719403 706704 693333 679667 666394 653662 641210 628991 617260
60669 617260 606089 595135 584093 573250 563254 554293 545834 537344 528974 521268 514454 508383 502938
60656 502938 498080 493698 489836 486852 484820 482908 480031 476211 472749 470866 470612 471230 472039 472734 473265
60641 473265 473716 474061 473824 472376 469770 466946 464806 463311 461764 459790 457782 456460 456200 456738 457433 457837
60625D57837J60J83L04M19O85J051J060M37m26r36r74q43q74j311k218l151l392
60608D48011k892k539k973l620l550k849k360k334k241j906j885k491l185l292
60594D09894k870k463k300k123j679j049n45l75n54r79j515j923j911j476r87
60579C87145o78j94Q89K233K947K703K049J594J542K056L325M959O169O885P905
60564D31529R402J0317R904Q997Q700Q534P115M317J465n02j990l673n396o450
60550D82269o385n307l800k517j538k48J762L951N505O380P058P583P658P454
60536E09825P408P339O570N023L366K006P20o35j756k431k782k844k512k023j910
60521E25364k261k555k332j590n00O40J260R96L82L94J146J833K003K151K737
$$ plain form
60625 457837 457997 458180 458484 458903 459588 460639 461699 462136 461710 460774 459800 458957 458083 456772 454554 451403 448011
60608 448011 445119 442580 439607 435987 432437 429588 427228 424894 422653 420747 418862 416371 413186 409894
60594 409894 407024 404561 402261 400138 398459 397410 396865 396490 395936 394957 393442 391519 389608 388132 387145
60579 387145 386467 386273 387162 389395 392342 395045 397094 398688 400230 402286 405611 410570 416739 423624 431529
60564 431529 440931 451248 461152 470149 478849 487383 494498 498815 500280 499778 497788 494115 488719 482269
60550 482269 475884 470577 466777 464260 462722 462474 464236 468187 473692 480072 487130 494713 502371 509825
60536 509825 517233 524572 531142 536165 539531 541537 542257 541622 539866 537435 534653 531809 529297 527274 525364
60521 525364 523103 520548 518216 516626 516126 516766 518026 519022 519404 519798 520944 522777 524780 526931 529668
60506E29668L397L604L522L826N047P366J0548J3878J6706J9238K2271K5897K9122
60493F94090L1144L2244L2996L3158L1908K8798K3842J7049Q446j546j2112k2285
60481H97732l0998l7255m0649m1572m0710l8531l5417l1781k7814k3492j9149
60470E30364j5623j3372j1871j0349q834p911p729p807p752p631p533p200o253
60457D10499m646k816j485j138j554j982j896j445r93o14k62j65n86j281j593
60442C88043j161k80M04L99l71j549k529k836k389j414l12L97K72n74j395j487
60426C73218r12l14j01j17o6J14L69P57J301J790J914J653J300J098J036J054
60410C84094J304J889K432K292J409N50M53Q73R67M60m4N7O54J237J506J453J163
$$ plain form
60506 529668 533065 536669 540191 544017 549064 556430 566978 580856 597562 616800 639071 664968 694090
60493 694090 725234 757478 790474 823632 855540 884338 908180 925229 933675 932129 920017 897732
60481 897732 866734 829479 788830 747258 706548 668017 632600 600819 573005 549513 530364
60470 530364 514741 501369 489498 479149 470315 462404 454675 446868 439116 431485 423952 416752 410499
60457 410499 405853 403037 401552 400414 398860 396878 394982 393537 392544 391930 391668 391503 390917 389636 388043
60442 388043 386882 386602 387006 387405 387034 385485 382956 380120 377731 376317 376005 376402 376674 376100 374705 373218
60426 373218 372306 371992 371891 371774 371708 371822 372191 372948 374249 376039 377953 379606 380906 382004 383040 384094
60410 384094 385398 387287 389719 392011 393420 393970 394423 395296 396263 396723 396679 396736 397390 398627 400133 401586 402749
60393D02749Q19P12J021J656K444L221L714L617L005K385K078J854J441J102J266
60378D33084J783K052J843J569J645K060K653L389M069M243L770L225L232L575
60364D72192L504K813K073J631J074R6o98n42K05L30o12j689j804r15L12J509
60348D79479K683L644M072M147M556N713P261Q455Q829Q366P231N549L447J217
60334E54649p19k119l096l848m309m370m329m609n041m975m318l792l861l993
60320E01270l635l244l580m299m247l065j633p96m11J28J078K356L843N372O788
60305D95925Q187R759J1341J2634J3892J5724J7886J8957J7690J4316J0040N625
60293F51976J091l518p711j0995j3168j4059j3357j1057p908n185l789l577l658
$$ plain form
60393 402749 403568 404280 405301 406957 409401 412622 416336 419953 422958 425343 427421 429275 430716 431818 433084
60378 433084 434867 436919 438762 440331 441976 444036 446689 450078 454147 458390 462160 465385 468617 472192
60364 472192 475696 478509 480582 482213 483287 483383 482685 482143 482348 482678 482066 480377 478573 477658 477970 479479
60348 479479 482162 485806 489878 494025 498581 504294 511555 520010 528839 537205 544436 549985 553432 554649
60334 554649 553930 551811 548715 544867 540558 536188 531859 527250 522209 517234 512916 509124 505263 501270
60320 501270 497635 494391 490811 486512 482265 479200 477567 476771 476360 476488 477566 479922 483765 489137 495925
60305 495925 504112 513871 525212 537846 551738 567462 585348 604305 621995 636311 646351 651976
60293 651976 653067 649549 641838 630843 617675 603616 590259 579202 571294 566109 562320 558743 555085
60280E55085l403l135l668n242p138q327q339p448o297n431n054n045n203n403
60266D75952n511n327m753l962l154k317j422p20m79n52n90n86q07j180j321j199
60250D42072j277j736k094j857j250q81q83q14k77O08J347J541J260R70J039J315
60234D39083J367J171J177J638K200K462K625L220M263N037M841L703K233R64
60220D75984N0m34k38P18J876K387K085J749K190L308M352M868M964M891M776
60205E13526M784N033N376N585N737O040O326O143N412M602M134L942L695L177
60191E83512K358J428P72N93N57J46o05j181j420j797k751m052n115n559n329
60176E61557m612l845l501l652l903l937l783l553l196k746k406k248k032j541
$$ plain form
60280 555085 551682 548547 544879 539637 532499 524172 515833 508385 502088 496657 491603 486558 481355 475952
60266 475952 470441 465114 460361 456399 453245 450928 449506 448786 448307 447755 447165 446579 445772 444592 443271 442072
60250 442072 440795 439059 436965 435108 433858 432977 432094 431280 431003 431611 432958 434499 435759 436729 437768 439083
60234 439083 440450 441621 442798 444436 446636 449098 451723 454943 459206 464243 469084 472787 475020 475984
60220 475984 476034 475600 475362 476080 477956 480343 482428 484177 486367 489675 494027 498895 503859 508750 513526
60205 513526 518310 523343 528719 534304 540041 546081 552407 558550 563962 568564 572698 576640 580335 583512
60191 583512 585870 587298 588070 588663 589220 589366 588761 587580 586160 584363 581612 577560 572445 566886 561557
60176 561557 556945 553100 549599 545947 542044 538107 534324 530771 527575 524829 522423 520175 518143 516602
60162E16602q76k68J35K31J5k24j6P00J411J573J223Q71R50J448J981K158K029
60145E29943K050K501L072L312L318L527M038M591N144N881O723P328P613P709
60131E96750P490O744N731M839L736J730q85k847l536l587l533k970j673m75p4
60116F07440J66J183K530K958K229J232N18j45p61q58m35j90m50p10o06n92j168
60099F12341k053k717l243m062n048n562n291m601l937l270k342j110K59J663
60085E71027L006L922M006L428K955L078L451L468L161L010K986K473J170m52
60071F10689j775k630l128l394l673m248n018n543n756o054o505o554n958n396
60057E45057n526n922n681m738l826l321k905k428k277k634k929k439j132L71
$$ plain form
60162 516602 515726 515458 515593 515824 515839 515615 515599 516299 517710 519283 520506 521377 522327 523775 525756 527914 529943
60145 529943 531993 534494 537566 540878 544196 547723 551761 556352 561496 567377 574100 581428 589041 596750
60131 596750 604240 610984 616715 621554 625290 627020 626135 623288 619752 616165 612632 609662 607989 607514 607440
60116 607440 607606 608789 611319 614277 616506 617738 618256 618111 617350 616492 616057 615867 615417 614707 614101 613509 612341
60099 612341 610288 607571 604328 600266 595218 589656 584365 579764 575827 572557 570215 569105 569364 571027
60085 571027 574033 577955 581961 585389 588344 591422 594873 598341 601502 604512 607498 609971 611141 610689
60071 610689 608914 606284 603156 599762 596089 591841 586823 581280 575524 569470 562965 556411 550453 545057
60057 545057 539531 533609 527928 523190 519364 516043 513138 510710 508433 505799 502870 500431 499299 499670
60043D99670J545K412L295M326N257N795N982O049N989N516M592L595K862K265
60029E59150J513N73l88j317k294l342m419n443o303o975p621q333q794q613p969
60014D89425p465p261o912o234n638n337m867l907k919k403k043j246j37O56R55
59999D34667J091J314J708K431L399L982L697K984K668K846L003L038L321L836
59985D73985M096M055M223M702M832M114K880J670N03p92j957k571k711k926l577
59970D90526m398m787m426l593k888k579k401k015j445r00m07L9K75K51L21Q34
59954D62407J540J907J863J763J713J468R68N36M20N87Q83J040O80j91q65p72
59938D75947n30j271k868l848l474k855l271m243m328l292k311k060j836r25J45
$$ plain form
60043 499670 501215 503627 506922 511248 516505 522300 528282 534331 540320 545836 550428 554023 556885 559150
60029 559150 560663 561236 560848 559531 557237 553895 549476 544033 537730 530755 523134 514801 506007 497394 489425
60014 489425 481960 474699 467787 461553 455915 450578 445711 441804 438885 436482 434439 433193 433056 433712 434667
59999 434667 435758 437072 438780 441211 444610 448592 452289 455273 457941 460787 463790 466828 470149 473985
59985 473985 478081 482136 486359 491061 495893 500007 502887 504557 505060 504268 502311 499740 497029 494103 490526
59970 490526 486128 481341 476915 473322 470434 467855 465454 463439 461994 461094 460687 460726 461001 461252 461573 462407
59954 462407 463947 465854 467717 469480 471193 472661 473629 474165 474585 475172 476055 477095 477775 477584 476719 475947
59938 475947 475417 474146 471278 467430 463956 461101 457830 453587 449259 445967 443656 441596 439760 438835 438980
59923D38980M14j12o50q91j206j649j546m13J221K360K567K166J707J602K044
59908D46594K812L272L024K478K353K718L015K971K880K898K756K359K088K208
59894D84426K442K503K558K838L237L688M472N709O845P207O731N848M916M184
59880E47604L924M144M348M081L451K808K261J813J647J706J396K40j466l118
59866E74839m616o072p096p165o461n688n080m300l245k269j562q53J13J244K307
59851E24096L165L892M830O278P863Q717Q596Q271Q143P216M471P41j947k716
59837E91616k384j825j102l83l84j375k785m181n768p427q237p577o011m532l550
59822E34095l153l544m552n382n563n636o146o502n770m247l294l635m553m918
$$ plain form
59923 438980 439394 439282 438632 437741 436535 434886 433340 432927 434148 436508 439075 441241 442948 444550 446594
59908 446594 449406 452678 455702 458180 460533 463251 466266 469237 472117 475015 477771 480130 482218 484426
59894 484426 486868 489371 491929 494767 498004 501692 506164 511873 518718 525925 532656 538504 543420 547604
59880 547604 551528 555672 560020 564101 567552 570360 572621 574434 576081 577787 579183 579423 577957 574839
59866 574839 570223 564151 557055 549890 543429 537741 532661 528361 525116 522847 521285 520432 520545 521789 524096
59851 524096 527261 531153 535983 542261 550124 558841 567437 575708 583851 591067 595538 596279 594332 591616
59837 591616 589232 587407 586305 585922 585538 584163 581378 577197 571429 564002 555765 548188 542177 537645 534095
59822 534095 530942 527398 522846 517464 511901 506265 500119 493617 487847 483600 480306 476671 472118 467200
59808D67200m375l382k607k414k617k551j707m12L97J96n06q11m85j52m15j110
59792D44249j617j718j748j919j909j402o10L0L68M56J96m00q97r41p45o48m05
59775D30340K96R61P81j4k85L45R72Q48M05L58O50R27J283J757J743Q35j68p4
59757D41960J125K371L075L557L948L790L084K781L576M783N199M668M029L737
59743D91683L459L075L117L779M241L706K558J697J175M08l55o2J378K472K022
59728E24353P00j4J31J81m05j092j158m48P14J675J673N89n57n70N59J828K638
59711E30797L117L198K421R75j3K97J495K612L141L045K309J115K5m55l45K5M30
59694E54189P16O66K47j97k57J38O64Q08J46j298k840l591l240k167r21J48Q25
$$ plain form
59808 467200 462825 459443 456836 454422 451805 449254 447547 447135 447532 447728 447222 446411 445926 445774 445359 444249
59792 444249 442632 440914 439166 437247 435338 433936 433326 433356 433724 434180 434376 433976 433079 432138 431393 430745 430340
59775 430340 430636 431597 432378 432364 432079 432424 433396 434244 434649 435007 435657 436584 437867 439624 441367 442202 442034 441960
59757 441960 443085 445456 448531 452088 456036 459826 462910 465691 469267 474050 479249 483917 487946 491683
59743 491683 495142 498217 501334 505113 509354 513060 515618 517315 518490 518898 518543 518481 519859 522331 524353
59728 524353 525053 525039 525170 525351 524946 523854 522696 522248 522962 524637 526310 526899 526342 525772 526331 528159 530797
59711 530797 533914 537112 539533 540508 540495 540792 542287 544899 548040 551085 553394 554509 554534 554079 553734 553759 554189
59694 554189 554905 555571 555818 555621 555364 555502 556166 556974 557120 555822 552982 549391 546151 543984 543063 543211 544036
59677E44036J021Q80N21k43j499k691l044k594k214k508l198l726l922l909l770
59662E13140l566l331k965k382j781j442j295j081p87m73Q5R63J559J281O60Q34
59646D99419J909K767K650J984J335N60n16j451j867k156k792l495l621l036k108
59631D89582j132j81P76J849K965L569L067J709M34l08q59j328j216n20l06j364
59615D96737k948l698l369k871k809k813k277j140J75J257J978K390K505K280
59601D85397J929J878K067J720M18r38j079j27O07M57kk71n11o18n4Q83R34k23
59583D92467j174q07M1m9r39j505j523j745k481l349m138m890n272m838l785k725
59567D53288j883j208r11j086j146m70O21J279J344J348J533J640J537J384J233
$$ plain form
59677 544036 545057 545937 546458 546215 544716 542025 538981 536387 534173 531665 528467 524741 520819 516910 513140
59662 513140 509574 506243 503278 500896 499115 497673 496378 495297 494510 494037 494122 495085 496644 497925 498585 499419
59646 499419 501328 504095 506745 508729 510064 510624 510108 508657 506790 504634 501842 498347 494726 491690 489582
59631 489582 488450 488269 489045 490894 493859 497428 500495 502204 502638 502330 501471 500143 498927 498407 498101 496737
59615 496737 493789 490091 486722 483851 481042 478229 475952 474812 474987 476244 478222 480612 483117 485397
59601 485397 487326 489204 491271 492991 493409 492471 491392 491265 491872 492329 492327 492056 491545 490927 490873 491756 492690 492467
59583 492467 491293 490486 490527 490478 489539 488034 486511 484766 482285 478936 474798 469908 464636 459798 456013 453288
59567 453288 451405 450197 449286 448200 447054 446584 447205 448484 449828 451176 452709 454349 455886 457270 458503
59552D58503J086J192J710K306K637K928L492L982L895L506L528M079M742N566
59538E03152P205R910J2982J5351J6493J6766J6916J6870J5015R597J372o061
59526F35568r499r037o947m531j450K358N776P737Q216P723O678N454M200K555
59512F54801J89k401m389n859p573r588j1037j1502j1622j1989j2269j1849j0711
59499E44201r291p927o700n557m354l132k279j987j717q65J99N23L4k47L43J276
59483E02520J759J868K198K948L831M613N282N821O178O468O961P823Q795R174
59469E76239Q310O294L912J822P9j359k162k088j474p47K55J873L837N552P001
59454F07344Q704J0830J2861J4185J4653J4603J4691J5391J6364J6574J5470J3570
$$ plain form
59552 458503 459589 460781 462491 464797 467434 470362 473854 477836 481731 485237 488765 492844 497586 503152
59538 503152 510357 520267 533249 548600 565093 581859 598775 615645 630660 640257 641629 635568
59526 635568 626069 617032 610085 605554 604104 606462 612238 619975 628191 635914 642592 648046 652246 654801
59512 654801 654990 652589 648200 642341 634768 625180 614143 602641 591019 579030 566761 554912 544201
59499 544201 534910 526983 520283 514726 510372 507240 504961 502974 501257 500392 500591 501114 501148 500901 501244 502520
59483 502520 504279 506147 508345 511293 515124 519737 525019 530840 537018 543486 550447 558270 567065 576239
59469 576239 584549 590843 594755 596577 596656 595297 593135 591047 589573 588826 589081 590954 594791 600343 607344
59454 607344 616048 626878 639739 653924 668577 683180 697871 713262 729626 746200 761670 775240
59442G75240J1417Q538M152j456p131j2092j6098j8698j9327j8116j5871j3245
59430F77313j0671q824q287q684q928q358p029n059k428N94L593O517R482J2324
59416F41555J4903J7563K0491K3049K4565K5245K5367K4337K1857J9148J7014
59405H75094J3208M368q915k1186k7369k7113k3135j7459j1064n383j742J04P97
59392G50205q48o825j6477k5777l0802l0859k7764k3269j8217j3451j0093q583
59380E37240q065p275n846m365l299k375j264l27j55o29r44n68K97J136J577J502
59364E06640J151J075J588K362K934L392M092M936N615O263P149P937Q154Q274
59350E71562R314J1346J3445J5190J7117J9349K0984K1355K0992K0690K0417J9766
$$ plain form
59442 775240 786657 795195 799347 797891 790760 778668 762570 743872 724545 706429 690558 677313
59430 677313 666642 657818 649531 640847 631919 623561 616532 611473 609045 609639 613232 619749 629231 641555
59416 641555 656458 674021 694512 717561 742126 767371 792738 817075 838932 858080 875094
59405 875094 888302 892670 883755 862569 835200 808087 784952 767493 756429 751046 749304 749408 750205
59392 750205 749357 742532 726055 700278 669476 638617 610853 587584 569367 555916 545823 537240
59380 537240 529175 521900 516054 511689 508390 506015 504751 504424 504269 503640 502696 502128 502425 503561 505138 506640
59364 506640 507791 508866 510454 512816 515750 519142 523234 528170 533785 540048 547197 555134 563288 571562
59350 571562 580876 592222 605667 620857 637974 657323 678307 699662 720654 741344 761761 781527
59338G81527J8761J7484J5551J2654R179N653K057j773n503q702j1489j4184j6551
59325H04664j8073j8722j8948j8962j8510j7367j5729j4082j2779j1704j0380
59314F29408q612o869n715m927l733j930j58J006J721K450L427M788O611Q587
59300F26054J0079J0754J0832J0627J0297R836Q631N199j422r731j6240j8568
59288F56348j7338j4723j2101r758p808o204m423k119J68J714K689L745M940N875
59274F01005O679P979R907J1916J3522J4640J5189J5110J4785J4837J5253J5223
59262G56045J4081J1980R431O544L067r39m873q123j0624j2725j4530j5652j5716
59249G17966j4932j3896j2955j2044j1029r915q668p193n464l478j200J123K848
$$ plain form
59338 781527 800288 817772 833323 845977 855156 860809 862866 861093 855590 846888 835399 821215 804664
59325 804664 786591 767869 748921 729959 711449 694082 678353 664271 651492 639788 629408
59314 629408 620796 613927 608212 603285 599552 597622 597464 598470 600191 602641 606068 610856 617467 626054
59300 626054 636133 646887 657719 668346 678643 688479 697110 702309 700887 691156 674916 656348
59288 656348 639010 624287 612186 602428 594620 588416 583993 581874 582042 583756 586445 590190 595130 601005
59274 601005 607684 615663 625570 637486 651008 665648 680837 695947 710732 725569 740822 756045
59262 756045 770126 782106 791537 798081 801148 800209 795336 787213 776589 763864 749334 733682 717966
59249 717966 703034 689138 676183 664139 653110 643195 634527 627334 621870 618392 617192 618315 621163
59236F21163L585L864M593N835O721O604N820N069M537L848K551N46j761l739
59222F69236n203o610q288r754j0438j0679j1266j2120j2360j1656j0568r453
59210E50841p999o218m853m358m191l635k751k028j679j686k011k344k114j152
59196E03822rP15R35Q80P88R88J741K772L516L918M408N010N175M799M560M894
59180E48912N348N379N140N026N065N189N539O033O160N672N020M765M990N565
59166F23803O471P598Q715R859J1216J2444J2732J1825J0286Q584O661M583K756
59153G37533J153q05l226n455p214r064j1198j2763j3049j2508j1885j1183j0245
59140F30091r552r451r290q276o802n920n855n865n308m169k711j298l74q0j6
$$ plain form
59236 621163 624748 628612 633205 639040 645761 652365 658185 663254 667791 671639 674190 674736 672975 669236
59222 669236 664033 657423 649135 639381 628943 618264 606998 594878 582518 570862 560294 550841
59210 550841 542842 536624 531771 527413 523222 519587 516836 514808 513129 511443 509432 507088 504974 503822
59196 503822 503813 504528 505463 506343 507131 508119 509860 512632 516148 520066 524474 529484 534659 539458 544018 548912
59180 548912 554260 559639 564779 569805 574870 580059 585598 591631 597791 603463 608483 613248 618238 623803
59166 623803 630274 637872 646587 656446 667662 680106 692838 704663 714949 723533 730194 734777 737533
59153 737533 738686 737881 734655 729200 721986 712922 701724 688961 675912 663404 651519 640336 630091
59140 630091 620539 611088 601798 593522 586720 580800 574945 569080 563772 559603 556892 555594 555220 555140 555124
59125E55124K63Q04J578K815M620O625Q410R840J0739J0782J0120R570R785J0603
59111F51678J1493J2138J2326J1875J0984J0110R286Q183O967O210N773M793L142
59098G64958J853J536J401N02r42k161k879l118k826k312k253k622k583j935j651
59083G44968k262k950l120l676n613q273j0219j0996j1021j0545r867r677j0064
59070F46685r973q750p381o987o963o096m724m195m705n202n102m654l887k613
59056E65453j376j056j569k030k095k129k246k209k110k144k047j611j384j815
59042E39632k174j508l11P4n14q87l07P45J583K083K351K552L011L750M152L839
59026E58071L516M075N275O316P248Q638J0257J1301J1704J2042J2329J2087J1438
$$ plain form
59125 555124 555387 556191 557769 560584 565204 571829 580239 590079 600818 611600 621720 631290 641075 651678
59111 651678 663171 675309 687635 699510 710494 720604 729890 738073 745040 751250 757023 761816 764958
59098 764958 766811 768347 769748 770250 769308 767147 764268 761150 758324 756012 753759 751137 748554 746619 744968
59083 744968 742706 739756 736636 732960 727347 719074 708855 697859 686838 676293 666426 656749 646685
59070 646685 636712 627962 620581 613594 606631 600535 595811 591616 586911 581709 576607 571953 568066 565453
59056 565453 564077 563021 561452 559422 557327 555198 552952 550743 548633 546489 544442 542831 541447 539632
59042 539632 537458 535950 535639 535713 535199 534312 534005 534750 536333 538416 540767 543319 546330 550080 554232 558071
59026 558071 561587 565662 570937 577253 584501 593139 603396 614697 626401 638443 650772 662859 674297
59013F74297J0924J0372R031O798M296J871m36k132k613k150j494p13N31J897
58999G10479K739L367M608O247P254P444P600P880P487O145M651L660K941K123
58985G84625J163j15j996m214o089p418q466r105q892p928o748n362l357r31J129
58970G16296K480L508M588N852P456R316J0786J1420J1662J2019J2107J1506J0856
58957H29852J0835J0624Q887N899L083P42k198o175j0269j3480j5475j6139j5685
58944G90501j5044j4834j4198j2090r228p205o010m411k472j607k055k610l041
58931F95696m571p307r318r174p645o093m886m147m344n137n189m090l081l022
58917F17692l080k347j331p92m31K44Q75J109J449K284L126L657M486O030P662
$$ plain form
59013 674297 685221 695593 704624 711422 715718 717589 717153 715021 712408 710258 708764 708051 708582 710479
58999 710479 713218 716585 721193 727440 734694 742138 749738 757618 765105 771250 775901 779561 782502 784625
58985 784625 785788 785673 783677 779463 773374 765956 757490 748385 739493 731565 724817 719455 716098 715167 716296
58970 716296 718776 722284 726872 732724 740180 749496 760282 771702 783364 795383 807490 818996 829852
58957 829852 840687 851311 860198 866097 869180 869922 867724 861549 851280 837800 822325 806186 790501
58944 790501 775457 760623 746425 734335 725107 717902 711892 707481 705009 703402 701347 698737 695696
58931 695696 691125 683818 674500 665326 657681 651588 646702 642555 638211 633074 627885 623795 620714 617692
58917 617692 614612 612265 610934 610142 609711 609955 610830 611939 613388 615672 618798 622455 626941 632971 640633
58902F40633Q898J0332J2419J4349J5167J5229J5522J6188J6608J6385J5530J4235
58890H11495J3098J2970J4074J5916J8254K1228K4260K6015K6085K5498K4908
58879A033801K3409J9984J5025R513L723k269p684j1818j5165j8701k2522k5884
58867A001412k8165k9076k8498k6792k4829k3115k1261j8795j5968j3443j1697
58856G59773j1003j1283j1688j1136r674q525q380q521q094p360p038p186p292
58843F42593o985o205n147m328m153m281m073l631l530l699l626l613m448n692
58829E79182n852m560l116k402j762o27K84L19P8L17P63R93J355K163K912L165
58813E73212L267L487L438L036K941L289L153K082J002O96N43j53p54l97L60K98
$$ plain form
58902 640633 649531 659863 672282 686631 701798 717027 732549 748737 765345 781730 797260 811495
58890 811495 824593 837563 851637 867553 885807 907035 931295 957310 983395 1008893 1033801
58879 1033801 1057210 1077194 1092219 1101732 1105455 1103186 1095502 1083684 1068519 1049818 1027296 1001412
58867 1001412 973247 944171 915673 888881 864052 840937 819676 800881 784913 771470 759773
58856 759773 748770 737487 725799 714663 704989 696464 688084 679563 671469 664109 657071 649885 642593
58843 642593 635608 629403 624256 619928 615775 611494 607421 603790 600260 596561 592935 589322 584874 579182
58829 579182 573330 568770 565654 563252 561490 560863 561147 561466 561544 561861 562624 563617 564972 567135 570047 573212
58813 573212 576479 579966 583404 586440 589381 592670 595823 597905 598907 599603 600146 599993 599239 598842 599202 599500
58797E99500p44j994k961l527l464k812k229k136k038j410o32k81r5N52J684K845
58781E80258L741M234M321M451N202O287O727O288N757N395M292J891r92l343
58767F34509n165o744p736p798p278o613n805m942m385m009l269k313j930k000
58753E64522j395J56J530K088K535L269L538L139L250M467N525N222M248L886
58739F05980M190M664N485O748P692P899Q155Q947R295Q307O777N983N961O066
58725G02149O150O117N400L988K840K317J496oj072j030q73j242r52Q64K842L414
58709G32402L171L384L639L006K136J974J629k23k839m528n427o942r159j1051
58695G11172j2622j4617j6604j7315j6578j5101j2927r991p528o790o911o147
$$ plain form
58797 599500 598756 596762 593801 590274 586810 583998 581769 579633 577595 576185 575553 575272 575177 575729 577413 580258
58781 580258 583999 588233 592554 597005 602207 608494 615221 621509 627266 632661 636953 638844 637852 634509
58767 634509 629344 622600 614864 607066 599788 593175 587370 582428 578043 574034 570765 568452 566522 564522
58753 564522 563127 563283 564813 566901 569436 572705 576243 579382 582632 587099 592624 597846 602094 605980
58739 605980 610170 614834 620319 627067 634759 642658 650813 659760 669055 677362 684139 690122 696083 702149
58725 702149 708299 714416 719816 723804 726644 728961 730457 730451 729379 728349 727476 726234 725282 726146 728988 732402
58709 732402 735573 738957 742596 745602 747738 749712 751341 751118 748279 743751 738324 731382 722223 711172
58695 711172 698550 683933 667329 650014 633436 618335 605408 595417 587889 581099 574188 568041
58683E68041m788m573n588o062n309m564m642m807m342l503k414o69J528L195
58669E21503L954M394M892N157N282O083Q078J0783J3159J4232J3558J1666R684
58656F32425P914N462J894j656l893m973n658n903n473n001n025m910m023l059
58642E98121k831k711j860j000j235k013j968j153n33r8P72J652J697J373J788
58627E90001K683K883K191J300L38q64j571r96J77Q23J280K535M305N761P377
58612F18223R942J2407J2953J1887J1195J1440J1293R930P821N198J851j445l262
58599G19433l569l716m390n038n270n258m903m132l706m222m724l926k290j094
58585F63195p7J920M471N962O276O856Q179R229R591J0021J0691J0765R906Q631
$$ plain form
58683 568041 563253 558680 553092 547030 541721 537157 532515 527708 523366 519863 517449 516780 518308 521503
58669 521503 525457 529851 534743 539900 545182 551265 559343 570126 583285 597517 611075 622741 632425
58656 632425 640339 645801 647695 646039 642146 637173 631515 625612 620139 615138 610113 605203 601180 598121
58642 598121 595290 592579 590719 589719 588484 586471 584503 583350 582817 582719 583491 585143 586840 588213 590001
58627 590001 592684 595567 597758 599058 599396 598532 596961 595965 596142 596965 598245 600780 605085 610846 618223
58612 618223 628165 640572 653525 665412 676607 688047 699340 709270 717091 722289 724140 722695 719433
58599 719433 715864 712148 707758 702720 697450 692192 687289 683157 679451 675229 670505 666579 664289 663195
58585 663195 663118 665038 669509 675471 681747 688603 696782 706011 715602 725623 736314 747079 756985 765616
58571G65616P166N464M324M764O399P942R196J0965J3239J5150J6521J7947J9541
58558I04234K0988K2380K3619K3714K2187K0254J8867J6706J2197O467J956r17
58546A092652l372n428o273o678q155j0134j0808j0445j1004j2772j4265j5374
58534I77944j7594k0898k3240k3499k2421k0515j7562j4336j2150j0545p929m571
58522G82684k331j430k30J594K571K385K461L195L325K590K329K892L069K622
58508H07726K857M102M976M788M308L832K779J428O62m7j921m121m597l658l706
58493H19408n189o013n355m778m922m352k696j711k080j965k9K615M528N704O385
58478G99550O497O950R065J2116J3881J3987J4048J4247J2799R341N787L028j69
$$ plain form
58571 765616 772782 778246 782570 787334 793733 801675 810871 821836 835075 850225 866746 884693 904234
58558 904234 925222 947602 971221 994935 1017122 1037376 1056243 1072949 1085146 1091613 1093569 1092652
58546 1092652 1089280 1083852 1077579 1070901 1062746 1052612 1041804 1031359 1020355 1007583 993318 977944
58534 977944 960350 939452 916212 892713 870292 849777 832215 817879 805729 795184 787255 782684
58522 782684 780353 778923 778693 780287 782858 785243 787704 790899 794224 796814 799143 802035 805104 807726
58508 807726 810583 814685 819661 824449 828757 832589 835368 836796 837458 837411 835490 831369 826772 823114 819408
58493 819408 814219 808206 802851 798073 793151 788799 786103 784392 782312 780347 780318 782933 787461 793165 799550
58478 799550 806047 812997 822062 834178 848059 862046 876094 890341 903140 912481 918268 921296 921127
58465I21127m193p497r281j0413j1061j0263q426p214o367l991m36J639J848K886
58451H48358N786Q199Q674Q826R543Q841N491J422j481l919o641q447q599q362
58437H67691q373p327m911l108k877k456n93J436K637M154O619Q529R081R699
58423H80201J1202J2243J2190J2497J3665J3816J1998R852Q429O394L076J33j512
58410I94184l206n435o396n443m694n434o211o165o811q612r341p849o084n383
58396I07120m270j976m43o18l85J560L231L114K779L434L424J590l11r47j598
58381I15704k859k851j090k50j547k307p43R15Q79J217L660O014O158N874P270
58366I36044Q917R005Q867J0073J1340J1471J2078J4311J6304J6694J7082J8217
$$ plain form
58465 921127 916934 909437 900156 889743 878682 868419 859993 852779 846412 842421 841985 843624 845472 848358
58451 848358 854144 862343 871017 879843 889386 898227 903718 905140 903659 899740 893099 884652 876053 867691
58437 867691 859318 851991 847080 843972 841095 838639 838046 839482 842119 846273 852892 861421 870502 880201
58423 880201 891403 903646 915836 928333 941998 955814 967812 977664 986093 992487 995563 995696 994184
58410 994184 990978 985543 979147 973704 969010 963576 957365 951200 944389 935777 926436 918587 912503 907120
58396 907120 902850 900874 900431 899813 899428 900988 904219 907333 910112 913546 916970 918560 918249 917302 915704
58381 915704 912845 909994 908904 908654 907107 904800 904057 904972 905851 907068 910728 916742 922900 928774 936044
58366 936044 944961 953966 962833 972906 984246 995717 1007795 1022106 1038410 1055104 1072186 1090403
58354A090403J7732J4615J1797J1204J0473P728N074L983K051j837l978j717J830
58341A169358L268M453P873J1213J1686J1529J3852J6890J7598J7257J8340J9425
58329A322742J8343J6859J7216J7593J5859J4056J4222J3724R997N953N233N914
58317A477711M553K635L263N036N167N145P432J0003J0004R501J1695J4750J5341
58304A582236J4960J6782J9540K0308K0208K1549K2789K1887K1046K2491K3548
58293A807344K1653J9923K1637K3752K2450K0501K2163K5297K5820K5536K8037
58282B064113L1195L1439L1175L4031L7086L6026L3766L5489L9218L9992L9398
58271B452928M2052M6376M7895M8164N1468N6186N8289N9685O4213O9239P0395
$$ plain form
58354 1090403 1108135 1122750 1134547 1145751 1156224 1163952 1169026 1173009 1175060 1173223 1169245 1167528 1169358
58341 1169358 1172626 1177079 1184952 1196165 1207851 1219380 1233232 1250122 1267720 1284977 1303317 1322742
58329 1322742 1341085 1357944 1375160 1392753 1408612 1422668 1436890 1450614 1460611 1466564 1471797 1477711
58317 1477711 1482264 1484899 1488162 1493198 1498365 1503510 1510942 1520945 1530949 1540450 1552145 1566895 1582236
58304 1582236 1597196 1613978 1633518 1653826 1674034 1695583 1718372 1740259 1761305 1783796 1807344
58293 1807344 1828997 1848920 1870557 1894309 1916759 1937260 1959423 1984720 2010540 2036076 2064113
58282 2064113 2095308 2126747 2157922 2191953 2229039 2265065 2298831 2334320 2373538 2413530 2452928
58271 2452928 2494980 2541356 2589251 2637415 2688883 2745069 2803358 2863043 2927256 2996495 3066890
58260C066890P0610P4935Q0629Q2059Q1262Q3605Q7230Q7178Q5702Q7891R1365
58249C979356R1157R0446R5176J02506J06142J08491J15629J24965J30382J34898
58239E079148J45218J58267J66546J72267J82614J95675K05117K13924K28942
58230F747718K46751K59953K72329K92160L16061L35699L54894L82805M16079
58221I624449M45858M76387N17564N65346O09776O56238P17350P90110Q63680
58212A5266758R43392J043266J161376J288127J432478J613381J831976K080813
58204B6661567K373679K736168L174125L684122M288019N022945N904753O936734
58196F0782112Q144160R562968J1210767J3114818J5348587J7979439K0979239
$$ plain form
58260 3066890 3137500 3212435 3293064 3375123 3456385 3539990 3627220 3714398 3800100 3887991 3979356
58249 3979356 4070513 4160959 4256135 4358641 4464783 4573274 4688903 4813868 4944250 5079148
58239 5079148 5224366 5382633 5549179 5721446 5904060 6099735 6304852 6518776 6747718
58230 6747718 6994469 7254422 7526751 7818911 8134972 8470671 8825565 9208370 9624449
58221 9624449 10070307 10546694 11064258 11629604 12239380 12895618 13612968 14403078 15266758
58212 15266758 16210150 17253416 18414792 19702919 21135397 22748778 24580754 26661567
58204 26661567 29035246 31771414 34945539 38629661 42917680 47940625 53845378 60782112
58196 60782112 68926272 78489240 89700007 102814825 118163412 136142851 157122090
58189A57122090K4209263K7426254L0223584L2053525L2468862L1284474K8269254
58182C63057306K2717622J3783691J633358j1842220k3818007l2185326l6442276
58175B96904148l7244278l5533900l2184214k8039714k3834740j9996971j6656183
58168A03414148j3832235j1523194r663890q141542o882444n862386n040814m353077
58160C8114566l765657l279765k880120k530800k220392j963751j757745j576308
58152A8140028j409462j268879j153741j046142r41481q51468p75820p00643o25522
58143I366870n64273n17807m72378m25364l87809l60770l33244l04487k85383
58134E715355k76149k64342k46545k31624k21179k06666j87493j72912j64164
$$ plain form
58189 157122090 181331353 208757607 238981191 271034716 303503578 334788052 363057306
58182 363057306 385774928 399558619 401191977 389349757 365531750 333346424 296904148
58175 296904148 259659870 224125970 191941756 163902042 140067302 120070331 103414148
58168 103414148 89581913 78058719 68394829 60253287 53370843 47508457 42467643 38114566
58160 38114566 34348909 31069144 28189024 25658224 23437832 21474081 19716336 18140028
58152 18140028 16730566 15461687 14307946 13261804 12320323 11468855 10693035 9992392 9366870
58143 9366870 8802597 8284790 7812412 7387048 6999239 6638469 6305225 6000738 5715355
58134 5715355 5439206 5174864 4928319 4696695 4475516 4268850 4081357 3908445 3744281
58125C744281j52697j37627j27504j23251j16351j05587r9048r7764r3464q4596
58115B606392p8974p8346p5401o8357o3967o3667o0940n4847n2359n4594n4114
58104A900826m8753m5220m6074m5648m1937m0334m2282m1998l7789l5401l6748
58093A438642l6202l1526k8002k8183k7573k4059k1957k3097k3100j9986j7813
58082A157144j8466j8266j5829j4997j7041j7956j6366j6179j8677j9837j8236
58071I65294j7834k0160k1319j9540j8244j8857j7985j4556j2524j3447j3413
58060G77415j0378p932q628r892r547r355j0338j0374r002r000j0843j1263r327
58047F51536q168q825q302n710m294n219n388l601k887m477n341m135l734n492
$$ plain form
58125 3744281 3591584 3453957 3326453 3203202 3086851 2981264 2882216 2784452 2690988 2606392
58115 2606392 2527418 2449072 2373671 2305314 2241347 2177680 2116740 2061893 2009534 1954940 1900826
58104 1900826 1852073 1806853 1760779 1715131 1673194 1632860 1590578 1548580 1510791 1475390 1438642
58093 1438642 1402440 1370914 1342912 1314729 1287156 1263097 1241140 1218043 1194943 1174957 1157144
58082 1157144 1138678 1120412 1104583 1089586 1072545 1054589 1038223 1022044 1003367 983530 965294
58071 965294 947460 927300 905981 886441 868197 849340 831355 816799 804275 790828 777415
58060 777415 767037 759105 750477 740585 731038 721683 711345 700971 691969 682969 672126 660863 651536
58047 651536 643368 634543 626241 620531 616237 611018 605630 602029 599142 594665 589324 585189 581455 575963
58033E75963o582n544m959o229p079o580p156r358j0079q307p274q471r018p408
58019D71919o336p224p345n206l538l988m021k011m71j178j858p76J4r86j699
58004D25296p64l93j942k973j785o72j516k278r18J006J639K013L105L365K047
57989D25230J286K197K502P53p88j90Q19L14n21k58No27o95N24J083l1q08r2K9
57970D30732j749l129k145m84j36j34N96N04j499l351l164k267k324k404j628
57955D07418j563l205m485l676k419k612l175k622k013k467k551j018M89L33o3
57940C76371J150K982L762M132N208O123O042O313Q052R838J0166R891R941R177
57926D69148O912M888M245L200L43k495l401l718n296p006p130o813p977r818
$$ plain form
58033 575963 569381 563837 558878 552649 545570 538990 531834 522476 512397 504090 496816 488345 479327 471919
58019 471919 465583 458359 451014 445808 442270 438282 434261 432250 431779 430601 428743 427967 427981 426995 425296
58004 425296 424532 424139 422197 419224 417439 416767 415251 412973 412055 413061 414700 416713 419818 423183 425230
57989 425230 426516 428713 431215 431968 431180 430990 431809 432123 431602 431344 431349 430722 430027 430551 431634 431603 430795 430703 430732
57970 430732 428983 425854 423709 423225 423089 422955 423551 424055 422556 419205 416041 413774 411450 409046 407418
57955 407418 405855 402650 398165 394489 392070 389458 386283 383661 381648 379181 376630 375612 376101 376434 376371
57940 376371 377521 380503 384265 388397 393605 399728 405770 412083 420135 429973 440139 450030 459971 469148
57926 469148 476060 480948 485193 488393 488736 486241 482840 479122 473826 466820 459690 452877 444900 435082
57912D35082j0445j0068r720q829o944n752o493p276n972l915l652m831n331m909
57898C40945m767m884m577m361m747m604l142j899k277k874j745L05J286J231
57884C03890J242J010j0n85M67J871J834R22N39K12j011k170k079j761k521l252
57868B98598k422j155j317k100j561k12M2n68l30P96J527J932K985M275M809N157
57852C10456O248P078O301M979N017N883N732M722M353M336L189J279L36L21l56
57837C69874j931l143l685m312m895m721m266m395m466l468k264k267k693j761
57823C21607J44J190J293J839K748K673J840J847K784L203K874K840K856J388
57809C51126j643m539o402p758q632q298p091o241n808m870l709l556m144l824
$$ plain form
57912 435082 424637 414569 404849 396020 389076 383324 376831 369555 363583 359668 356016 351185 345854 340945
57898 340945 336178 331294 326717 322356 317609 313005 309863 307964 305687 302813 301068 301373 302659 303890
57884 303890 305132 306142 306132 305547 306014 307885 309719 310641 311180 311392 310381 308211 306132 304371 301850 298598
57868 298598 296176 295021 293704 291604 290043 289831 289873 289305 288975 289771 291298 293230 296215 300490 305299 310456
57852 310456 316704 323782 330083 335062 340079 345962 351694 356416 360769 365105 368294 369573 369909 370230 369874
57837 369874 367943 364800 361115 356803 351908 347187 342921 338526 334060 330592 328328 326061 323368 321607
57823 321607 321751 322941 324234 326073 328821 331494 333334 335181 337965 341168 344042 346882 349738 351126
57809 351126 349483 344944 338542 330784 322152 313854 306763 300522 294714 289844 286135 282579 278435 274611
57795B74611k338j262j393j796j759j660j540p09P13J553J344Q46O13M77N49J321
57779B69570K586L572M101M457M441L851L426L805M162L453K418K423K942K269
57765C17476L66j137j642k173l314m501n428o274o578n701m349l864m030l522
57751B65329k366j911k318k144q20M25N62O9k38k21J2L21J87p12j673j927j980
57734B50595k585l013k096m76J96m6K33J096J077m2o15J86J210J368J035Q12N84
57717B49519L97P08J238J007J1o03l25J38L41O68J128J000J11q51j598k390k838
57700B47661k053k98J009J316J531K213K687K417J925J690J344M83o39j655k459
57685B57172k825k530j910j404o37J050L376N473P300R503J2220J5174J8695K3228
$$ plain form
57795 274611 272273 271011 269618 267822 266063 264403 262863 262154 262867 264420 265764 266610 267223 267700 268249 269570
57779 269570 272156 275728 279829 284286 288727 292578 296004 299809 303971 307424 309842 312265 315207 317476
57765 317476 317842 316705 315063 312890 309576 305075 299647 293373 286795 281094 276745 272881 268851 265329
57751 265329 262963 261052 258734 256590 255770 256195 256757 256826 256588 256367 256379 256700 256887 256175 254502 252575 250595
57734 250595 248010 244997 242901 242425 242621 242575 242808 243904 244981 244939 244324 244510 245720 247088 248123 248935 249519
57717 249519 249916 250624 251862 252869 252880 252277 251952 252090 252431 253099 254227 255227 255338 254487 252889 250499 247661
57700 247661 245608 245310 246319 247635 249166 251379 254066 256483 258408 260098 261442 261925 261286 259631 257172
57685 257172 254347 251817 249907 248503 247866 248916 252292 257765 265065 274568 286788 301962 320657 343885
57671C43885K8165L2634L7059M2393M8003N2002N3568N3070M9841M1600K6582
57660H08802N287j9501m3029n9646o6014o3777n7547n0273m2176l3618k6372k1443
57648C30693j7914j4722j1921r607p407n625n141n551n088l075q92J57L70M23
57634B44700K77O1M77J470J817R25k26n79l57k32l17n57j065j543j411r08r63
57617B41569j712k273k247k121k005j393n40n19j493k290k201j805j562j027Q
57602B18389Q87J189J246J133M82l95n76j08m1n84q17o70j381l262m692m369l043
57585B03388k084j620j174r25j183j504j273n84J11N22L80m33j326j465r65o29
57569A89236n67k49J22j76p63m25P48J270O79K57Q49J706K061K142J964R46n15
$$ plain form
57671 343885 372050 404684 441743 484136 532139 584141 637709 690779 740620 782220 808802
57660 808802 814089 794588 751559 691913 625899 562122 504575 454302 412126 378508 352136 330693
57648 330693 312779 298057 286136 276529 269122 263497 258356 252805 247717 244642 243750 243907 244277 244700
57634 244700 244977 245038 245515 246985 248802 249727 249501 248922 248565 248333 248016 247459 246394 244851 243440 242532 241569
57617 241569 239857 237584 235337 233216 231211 229818 229278 228759 227266 224976 222775 220970 219408 218381 218389
57602 218389 219276 220465 221711 222844 223326 222931 222355 222247 222206 221622 220805 220135 218754 215492 210800 206431 203388
57585 203388 201304 199684 198510 197585 196402 194898 193625 193041 193152 193674 194054 193621 192295 190830 189865 189236
57569 189236 188669 188420 188542 188366 187603 187178 187926 189196 189875 190132 190981 192687 194748 196890 198854 199800 199285
57552A99285q75K76J401J427J249J916K904L268L013K325J021l46l65J128K398
57537B20025K288J743J820J912J307Q25J310J913J506N29Q0J86M51J187K492L329
57521B42903K923K083J749J445N25j63M65J816K617K896L427L958L685K857K333
57506B75519K081J548J021J158J586J367N08j73m01n55q11j146j753k536k688
57491B74725j757n59o9n6K71Q83J239J312J309J004L85L01J337K627K919K295
57475B88166J796J807J852J550R05M5n81l08P27J427J288J279K216L284L233K237
57459C10923J340Q28M08L32J029K035K527K513K561K746K810K894L126L069K416
57444C41557J644J232R40P09J220K558L383K797J954K364L457L547K604K190K959
$$ plain form
57552 199285 198410 198686 200087 201514 202763 204679 207583 210851 213864 216189 217210 216864 216499 217627 220025
57537 220025 222313 224056 225876 227788 229095 229920 231230 233143 234649 235178 235258 235444 235895 237082 239574 242903
57521 242903 245826 247909 249658 251103 251628 251465 251930 253746 256363 259259 262686 266644 270329 273186 275519
57506 275519 277600 279148 280169 281327 282913 284280 284788 284615 284214 283659 282848 281702 279949 277413 274725
57491 274725 272968 272409 272340 272284 272555 273438 274677 275989 277298 278302 278687 278988 280325 282952 285871 288166
57475 288166 289962 291769 293621 295171 296076 296121 295540 295232 295959 297386 298674 299953 302169 305453 308686 310923
57459 310923 312263 313091 313499 313831 314860 316895 319422 321935 324496 327242 330052 332946 336072 339141 341557
57444 341557 343201 344433 345373 346082 347302 349860 353243 356040 357994 360358 363815 367362 369966 372156 375115
57429C75115L911M124L711L055K387K180K770L610L804L374L103L288L539L584
57415D21555L432L056K655K777L422L650L012K603L522M998N429M770M323M570
57401D73774M731M421M207M416M640M605M486M280L802L373L598M397N109N460
57387E35299N674N751N519N310N749O802P740P989P541O707N960N661N562N022
57373F22286M164M014M986O105O431O308O336O229N732N571O197O625N958N204
57359G02146N834P334Q007P641P534Q178Q794Q976R112R153Q675Q110Q388R275
57345H17157R633R344R415J0024J0090R174Q230Q037Q196Q216Q408R064R722R832
57331I44542R460R048Q986R543J0555J1290J1242J0893J0906J0978J0423R521
$$ plain form
57429 375115 379026 383150 386861 389916 392303 394483 397253 400863 404667 408041 411144 414432 417971 421555
57415 421555 424987 428043 430698 433475 436897 440547 443559 446162 449684 454682 460111 464881 469204 473774
57401 473774 478505 482926 487133 491549 496189 500794 505280 509560 513362 516735 520333 524730 529839 535299
57387 535299 540973 546724 552243 557553 563302 570104 577844 585833 593374 600081 606041 611702 617264 622286
57373 622286 626450 630464 635450 641555 647986 654294 660630 666859 672591 678162 684359 690984 696942 702146
57359 702146 707980 715314 723321 730962 738496 746674 755468 764444 773556 782709 791384 799494 807882 817157
57345 817157 826790 836134 845549 855573 865663 874837 883067 891104 899300 907516 915924 924988 934710 944542
57331 944542 954002 963050 972036 981579 992134 1003424 1014666 1025559 1036465 1047443 1057866 1067387
57319A067387R160R414R640R728J0086J0567J0697J0756J1351J2110J2155J1705
57307A194756J1775J2360J2515J2237J2606J3804J4590J4307J3893J4275J5001
57296A342119J5216J4945J4708J4726J5028J5694J6541J7190J7661J8202J8554
57285A520584J8215J7503J7356J7986J8586J8563J8158J7797J7659J7949J8703
57274A719059J9342J9295J9005J9333K0106K0371J9993J9736J9763J9430J8728
57263A934161J8622J9563K0806K1576K1921K2112K2128K2047K2102K2159K1873
57252B169070K1406K1181K1111K0979K1165K1894K2225K1202J9708J9493K0539
57241B399973K1178K0771K0389K0578K0487J9735J9308J9849K0685K1241K1890
$$ plain form
57319 1067387 1076547 1085961 1095601 1105329 1115415 1125982 1136679 1147435 1158786 1170896 1183051 1194756
57307 1194756 1206531 1218891 1231406 1243643 1256249 1270053 1284643 1298950 1312843 1327118 1342119
57296 1342119 1357335 1372280 1386988 1401714 1416742 1432436 1448977 1466167 1483828 1502030 1520584
57285 1520584 1538799 1556302 1573658 1591644 1610230 1628793 1646951 1664748 1682407 1700356 1719059
57274 1719059 1738401 1757696 1776701 1796034 1816140 1836511 1856504 1876240 1896003 1915433 1934161
57263 1934161 1952783 1972346 1993152 2014728 2036649 2058761 2080889 2102936 2125038 2147197 2169070
57252 2169070 2190476 2211657 2232768 2253747 2274912 2296806 2319031 2340233 2359941 2379434 2399973
57241 2399973 2421151 2441922 2462311 2482889 2503376 2523111 2542419 2562268 2582953 2604194 2626084
57230B626084K2701K2907K2435K2459K3589K4893K5471K5615K5608K4879K3322
57219B889963K1986K1495K1010J9875J8841J8578J8303J7239J6209J6294J6900
57208C096693J6659J5542J4657J4450J4471J4502J4781J5360J6089J6940J7718
57197C267862J7969J7822J8225J9568K0835K0958K0331K0012K0103J9968J9557
57186C483210J9450J9849K0395K0779K0857K0439J9553J8587J7734J6742J5626
57175C693221J5020J5198J5435J4989J4142J3563J3176J2370J0945R241P649O388
57163C841337N391M140K257M82J26J174J984J450M34K81J034K076L537N766Q142
57148C879611R733J0694J1731J2554J2174J0580Q985Q281Q125P716O626M804K302
$$ plain form
57230 2626084 2648785 2671692 2694127 2716586 2740175 2765068 2790539 2816154 2841762 2866641 2889963
57219 2889963 2911949 2933444 2954454 2974329 2993170 3011748 3030051 3047290 3063499 3079793 3096693
57208 3096693 3113352 3128894 3143551 3158001 3172472 3186974 3201755 3217115 3233204 3250144 3267862
57197 3267862 3285831 3303653 3321878 3341446 3362281 3383239 3403570 3423582 3443685 3463653 3483210
57186 3483210 3502660 3522509 3542904 3563683 3584540 3604979 3624532 3643119 3660853 3677595 3693221
57175 3693221 3708241 3723439 3738874 3753863 3768005 3781568 3794744 3807114 3818059 3827300 3834949 3841337
57163 3841337 3846728 3850868 3853125 3853607 3853733 3854907 3856891 3858341 3858775 3859056 3860090 3862166 3865703 3871469 3879611
57148 3879611 3889344 3900038 3911769 3924323 3936497 3947077 3956062 3964343 3972468 3980184 3986810 3991614 3993916
57135C993916p60m252q063j1838j4951j6947j7700j6982j4386j0090n122l47M252
57122C876730Q813J2623J4691J4979J4414J3879J3752J4336J6162J9853K5768
57111D046000L3640M2532N1588O0946P1621Q4581J00583J20866J47072J80135
57101D939564K20167K67920L25652L96056M81067N82081P00426Q36757R90353
57092I740043J159521J342118J534908J732553J927355K109566K267822K390428
57084B4204314K468124K497669K484842K444293K392494K333758K247897K091573
57076D3164964J816091J391041Q20067J42504n77679j270434j877720k363016
57068D1245818k710452k919588l001553k976045k866850k697389k488964k260575
$$ plain form
57135 3993916 3993156 3988904 3980841 3969003 3954052 3937105 3919405 3902423 3888037 3877947 3872825 3872478 3876730
57122 3876730 3885543 3898166 3912857 3927836 3942250 3956129 3969881 3984217 4000379 4020232 4046000
57111 4046000 4079640 4122172 4173760 4234706 4306327 4390908 4491491 4612357 4759429 4939564
57101 4939564 5159731 5427651 5753303 6149359 6630426 7212507 7912933 8749690 9740043
57092 9740043 10899564 12241682 13776590 15509143 17436498 19546064 21813886 24204314
57084 24204314 26672438 29170107 31654949 34099242 36491736 38825494 41073391 43164964
57076 43164964 44981055 46372096 47192163 47334667 46756988 45486554 43608834 41245818
57068 41245818 38535366 35615778 32614225 29638180 26771330 24073941 21584977 19324402
57060A9324402k027909j802203j590723j398029j226393j075958r45695q34067
57052H423425p38655o56297n84544n22467m69434m24089l85032l51421l22013
57043C969473k94756k68351k43323k20566j99796j80293j62125j45475j29709
57034B125079j14244r9470q5654p1827n6837m0868k5110j0790R27R489J5923K1029
57022A667647K1216Q983j9239n6637r0049j10036j15445j10009r8221q4367p1745
57011I42098o1116n1416m2540l5827l1635k8475k5122k1913j9377j7143j4914
57000E92620j3185j2298j1863j1519j1275j0860r746q082o655n752m956m026l016
56987D79387j616M87K718M182M980N761O215N359L103J18l637q540j3608j6952
$$ plain form
57060 19324402 17296493 15494290 13903567 12505538 11279145 10203187 9257492 8423425
57052 8423425 7684770 7028473 6443929 5921462 5452028 5027939 4642907 4291486 3969473
57043 3969473 3674717 3406366 3163043 2942477 2742681 2562388 2400263 2254788 2125079
57034 2125079 2010835 1911365 1825711 1753884 1697047 1656179 1631069 1620279 1621206 1630695 1646618 1667647
57022 1667647 1688863 1697846 1678607 1621970 1531921 1421885 1306440 1196431 1098210 1013843 942098
57011 942098 880982 829566 787026 751199 719564 691089 665967 644054 624677 607534 592620
57000 592620 579435 567137 555274 543755 532480 521620 511874 503792 497137 491385 486429 482403 479387
56987 479387 477771 478258 480976 485158 490138 495899 502114 507473 510576 510694 507057 498517 484909 467957
56973D67957j8159j8475j8437j7189j4540j1790r719p462m299j041J379L380N735
56960C57340Q225J0281J2037J3783J5176J5802J5713J4585J1179M651m011j2494
56948D62267j8820k2118k2493k0764j8038j5038j1980r013o279l594o79K283N039
56935C20773Q030J1858J6098J9587K1815K3077K3297K1916J8813J4099P150k507
56923E04006j3217k1826k6779k9026k9507k7702k3663j9478j7124j6068j4537
56912B65079j2167r933q206o556n029m221m107l910l161k140j264o53k33J99Q29
56897B04527J518J903K114K798M206N851P444R390J1857J4111J5514J6485J7717
56884C15435J8886J8993J7555J4650J0161L997k941q881j2515j3863j3700j2584
$$ plain form
56973 467957 449798 431323 412886 395697 381157 369367 359648 352186 347887 346846 348225 351605 357340
56960 357340 365565 375846 387883 401666 416842 432644 448357 462942 474121 478772 474761 462267
56948 462267 443447 421329 398836 378072 360034 344996 333016 324003 317724 314130 313451 315734 320773
56935 320773 328803 340661 356759 376346 398161 421238 444535 466451 485264 499363 506513 504006
56923 504006 490789 468963 442184 413158 383651 355949 332286 312808 295684 279616 265079
56912 265079 252912 242979 234773 228217 223188 218967 214860 210950 207789 205649 204385 203732 203499 203698 204527
56897 204527 206045 207948 210062 212860 217066 222917 230361 239751 251608 265719 281233 297718 315435
56884 315435 334321 353314 370869 385519 395680 399677 396736 387855 375340 361477 347777 335193
56872C35193j0522p394l435P77M799Q691J2678J6756K0871K5350L0533L6049M0914
56859E11260M4352M6053M5674M2565L6059K5668J1424n279k1300l3198l9320m0125
56847F23833l6832l0630k2971j5338q307j538N198J1791J8599K6406L5345M4671
56835F50227N3704O2056O8737P2192P1593O6989N7707M1835J8403j0257l8856
56824A114330o1699p5139p8755p4973o7089n7320m6692l6158k6613j7899r099
56813E62894j07Q139J5361K2542L0361L8004M4089M7881M9065M7172M1639L1730
56801I38770J6364m531k7975m8468o1536o6304o4562n8720n1016m3186l5626k7694
56789D65516j9493j2379p173k987J396O142J1027J6170K1024K3919K3889K1937
$$ plain form
56872 335193 324671 317277 313842 314619 319418 328109 340787 357543 378414 403764 434297 470346 511260
56859 511260 555612 601665 647339 689904 725963 751631 763055 757776 736476 703278 663958 623833
56847 623833 587001 556371 533400 518062 509755 508217 513415 525206 543805 570211 605556 650227
56835 650227 703931 765987 834724 906916 978509 1045498 1103205 1145040 1163443 1153186 1114330
56824 1114330 1052631 977492 898737 823764 756675 699355 652663 616505 589892 571993 562894
56813 562894 562787 570926 586287 608829 639190 677194 721283 769164 818229 865401 907040 938770
56801 938770 955134 950603 922628 874160 812624 746320 681758 623038 572022 528836 493210 465516
56789 465516 446023 433644 426471 423484 424880 431022 442049 458219 479243 503162 527051 548988
56777E48988J9255J5022P472l423j5558k6461l4448l8637l9160l7250l4169l0212
56765C31419k5350k0370j6502j4188j2908j1916j0695r119p607o681o141n362
56753A84580m590m759n692n847m561l166k874k939k167j087j025j904k466k191
56739A39312j594j067o12l34k14J38O20L60q21j586j011k27p15j785j630k02Q23
56722A29455P33N43J043J736J986J820J337N05k06n3Q62J631J722J364P84j1p02
56705A44549q28m69o8L16Q48J247J143Q23P83Q19M40p3OO56J153J111O59j31j126
56686A51858j746j535q65k40O04J939K987K779J724J086J192J327J184J166J360
56671A64820J341R85N73J91j21m9M04N19Q7K37J727L189K751Q98j75K39Q27Q54
$$ plain form
56777 548988 568243 583265 590737 587314 571756 545295 510847 472210 433050 395800 361631 331419
56765 331419 306069 285699 269197 255009 242101 230185 219490 210371 202764 196083 189942 184580
56753 184580 179990 175231 169539 163692 159131 155965 153091 150152 147985 146898 145873 143969 141503 139312
56739 139312 137718 136651 136039 135705 135491 135629 136249 136609 135788 134202 133191 132964 132249 130464 128834 128632 129455
56722 129455 130188 130731 131774 133510 135496 137316 138653 139158 138952 138899 139761 141392 143114 144478 145262 145251 144549
56705 144549 143721 143252 143184 143500 144348 145595 146738 147561 148344 149163 149603 149530 149536 150192 151345 152456 153115 152984 151858
56686 151858 150112 148577 147712 147472 148076 150015 153002 155781 157505 158591 159783 161110 162294 163460 164820
56671 164820 166161 167146 167719 167910 167789 167740 168144 168663 168750 168987 170714 173903 176654 177552 177377 177616 178443 179297
56653A79297J157K143K780K323J465J002O99K31n4Qj61q21j320j175q27p26n57
56636A85464nN06M10k58j083j638j417j94J319J933J428P03M11K65k2j64mP8o1
56617A87671NM31O83L79j09k84j22K23P25J183J210P33O7o09j305j751j566r57
56599A86607n86p34j176j695k061j720m85P39Q29mn92n34m34n04k34M14P24M68
56581A79022K48L79M42K09J2j31o42j387j550q39J28Q55J439J872J915J873K419
56564A86264L392L922L927M333N491O635P276P934Q852R188Q142N995L486J044
56550B65881r44j982k103j881j563j011o22j140k295k841k355j819j942k161j927
56535B39295j689j897k108j887j636j725j731j263p46o19o23m57m47q59j292j334
$$ plain form
56653 179297 180454 182597 185377 187700 189165 190167 190866 191097 191043 191051 190890 190069 188749 187574 186747 186021 185464
56636 185464 185459 185965 186375 186117 185034 183396 181979 181785 183104 185037 186465 187168 187579 187844 187822 187658 187654 187732 187671
56617 187671 187676 188107 188790 189169 189060 188776 188654 188877 189602 190785 191995 192728 192795 192186 190881 189130 187564 186607
56599 186607 186021 185287 184111 182416 180355 178635 178150 178889 179718 179714 179122 178588 178154 177650 177416 177830 178554 179022
56581 179022 179270 179649 180091 180300 180312 180181 179539 178152 176602 175763 175891 176746 178185 180057 181972 183845 186264
56564 186264 189656 193578 197505 201838 207329 213964 221240 229174 238026 247214 255356 261351 264837 265881
56550 265881 264937 262955 260852 258971 257408 256397 255775 254635 252340 249499 247144 245325 243383 241222 239295
56535 239295 237606 235709 233601 231714 230078 228353 226622 225359 224613 223994 223371 222914 222467 221608 220316 218982
56519B18982j168j037q07m40k68l86n49q24j562k483k810k533k472k830k876k319
56503A93618j761j439p95J98O57L01K3L25M91K2m34l62k72n03m42J45L63k78q28
56484A89029m10M04Q40J284K199K849K405J386P23K51n21j024m29P58J236P15
56468B01695L3k02o6K82P76J235J529J699J577Q83q3n94o06p57j012n61N58J167
56450B07553R01Q90J658J978R24m37p52m55o32j019p42j24o1l34J9J170K473L418
56432B16428L543K294O1j499j351m11M9J93O12P62M6o41j69Q56J113P90R37J304
56414B24917P52m70q61M2J124J482J321J011O19L73M85N33L7n87n82o4L18N28
56396B30978R35J383J502J548J918K219J852J057M18j27p79j079o49j26k34n29
$$ plain form
56519 218982 217814 216777 215970 215530 215262 214876 214327 213503 211941 209458 206648 204115 201643 198813 195937 193618
56503 193618 191857 190418 189623 189821 190478 190779 190802 191127 191618 191640 191206 190844 190572 190069 189627 189772 190135 189857 189029
56484 189029 188619 189023 189863 191147 193346 196195 198600 199986 200709 200960 200439 199415 198986 199744 200980 201695
56468 201695 201728 201526 201460 201742 202518 203753 205282 206981 208558 209441 209358 208764 208158 207401 206389 205828 206386 207553
56450 207553 208454 209344 211002 212980 213904 213467 212715 212260 211628 210609 209867 209743 209682 209348 209367 210537 213010 216428
56432 216428 219971 222265 222326 220827 219476 219065 219114 219307 219919 220681 220727 220086 219917 220773 221886 222676 223613 224917
56414 224917 225669 225199 224338 224380 225504 226986 228307 229318 229937 230310 230795 231328 231365 230778 230196 230132 230450 230978
56396 230978 231913 233296 234798 236346 238264 240483 242335 243392 243810 243683 242904 241825 241176 241050 240816 240287
56380B40287k31L61M87K95M19P30O90M01K50J84K10Q20J898K283J523R21J485
56363B53013K178J756J010J257J885J484N32O36J809K660K764K785K672J799N57
56348B78797j30m08q51r08M3Q96L16o45N8K006K973K634K819M052M748M216L738
56331C04354M003M018L264K670K598K065Q47K97J088J954J666P19J36L1R4K85
56315C30089M24J97j37j33k29j031j677p44J321K500K142J578J641J668J429J862
56299C40900L171M100L929L526L658L877L687L336K857J940J176J738L290L978
56285C85163L133K228K488L315L830M285M959N286N019M912N380N761N654N732
56271D47145O527P669Q881J0403J1973J2704J2597J2834J4034J5491J6567J7530
$$ plain form
56380 240287 240056 240417 240904 241199 241618 242348 243038 243439 243689 243873 244083 244903 246801 249084 250607 251528 253013
56363 253013 255191 256947 257957 259214 261099 262583 263115 263751 265560 268220 270984 273769 276441 278240 278797
56348 278797 278667 278259 277408 276500 276543 277439 277755 277110 277168 279174 282147 284781 287600 291652 296400 300616 304354
56331 304354 308357 312375 315639 318309 320907 322972 323819 324116 325204 327158 328824 329543 329679 329710 329804 330089
56315 330089 330513 330710 330573 330440 330211 329180 327503 326759 328080 330580 332722 334300 335941 337609 339038 340900
56299 340900 344071 348171 352100 355626 359284 363161 366848 370184 373041 374981 376157 377895 381185 385163
56285 385163 388296 390524 393012 396327 400157 404442 409401 414687 419706 424618 429998 435759 441413 447145
56271 447145 453672 461341 470222 480625 492598 505302 517899 530733 544767 560258 576825 594355
56259E94355J8693K0062K2115K5499K9621L3126L5999L9615M4489M9687N4689
56248I67950N9991O5567P0636P5377Q0832Q6622R0756R2376R2725R2705R1428
56237A866965Q7858Q1964P3559O1995M7899L3241J8873L862j1994k7064m0202
56226B196956n2039o2914p1547p6999q0177q2207q2953q2245q0798p8873p5644
56215A370560p0921o5950o1535n7106n2423m8429m5418m2219l8162l4107l0662
56204H23628k7282k3936k1684k0560j8934j6124j3579j2325j1305r476p597o583
56192F34243o007n428n316n455m489k281p18q73j402j061o68j103j515j074n37
56177E96316n11q7J221K200K048J873K551L101K693K320K881L545L654M173N702
$$ plain form
56259 594355 613048 633110 655225 680724 710345 743471 779470 819085 863574 913261 967950
56248 967950 1027941 1093508 1164144 1239521 1320353 1406975 1497731 1590107 1682832 1775537 1866965
56237 1866965 1954823 2036787 2110346 2172341 2220240 2253481 2272354 2276216 2264222 2237158 2196956
56226 2196956 2144917 2082003 2010456 1933457 1853280 1771073 1688120 1605875 1525077 1446204 1370560
56215 1370560 1299639 1233689 1172154 1115048 1062625 1014196 968778 926559 888397 854290 823628
56204 823628 796346 772410 750726 730166 711232 695108 681529 669204 657899 648423 640826 634243
56192 634243 628236 622808 617492 612037 607548 605267 604549 603676 602274 601213 600545 599442 597927 596853 596316
56177 596316 595805 595718 596939 599139 601187 603060 605611 608712 611405 613725 616606 620151 623805 627978 633680
56162F33680P010P220P383Q325Q983Q615Q566J0000J1963J3365J4840J6883J8332
56149G75165J8534J8974K0930K3620K6306K9985L5232M0780M6073N2766O1636
56138A150001P0653P8253Q5927R5153J04156J10261J13069J12800J08074R8183
56128B126530Q5470P2839O0949N0170M2706L9743L8574L5350K8795J9037N599
56117B605762j0405k4728l4077l9878m5316n1137n7315o5942p8409r1812j01826
56106B004917j07466j09621j07300r9170q7209p4904o3248n1744m1521l3866k7442
56095A201426k0616j4876j2313j1437r315o173m102k792m93K202L418L649M634
56082A133212N906N992N753O954Q880R710R835J0477J0773R715R052J0643J2824
$$ plain form
56162 633680 640690 647910 655293 663618 672601 681216 689782 699782 711745 725110 739950 756833 775165
56149 775165 793699 812673 833603 857223 883529 913514 948746 989526 1035599 1088365 1150001
56138 1150001 1220654 1298907 1384834 1479987 1584143 1694404 1807473 1920273 2028347 2126530
56128 2126530 2212000 2284839 2345788 2395958 2438664 2478407 2516981 2552331 2581126 2600163 2605762
56117 2605762 2595357 2570629 2536552 2496674 2451358 2400221 2342906 2276964 2198555 2106743 2004917
56106 2004917 1897451 1787830 1680530 1581360 1494151 1419247 1355999 1304255 1262734 1228868 1201426
56095 1201426 1180810 1165934 1153621 1142184 1132869 1126696 1122594 1119802 1119309 1121511 1124929 1128578 1133212
56082 1133212 1139118 1145110 1150863 1157817 1166697 1176407 1186242 1196719 1207492 1217207 1226259 1236902 1249726
56069A249726J3143J2680J3794J5722J6453J6828J8525K0098J9440J8176J9081
56058A433666K1136K1698K1501K2719K4123K3143K0889K0242K0688K0037J9303
56047A669145K0782K3141K3586K3095K4360K6488K6968K6910K8865L1520L2106
56036A956966L1923L3843L6561L7214L7301L9849M3199M4019M4018M6792N0596
56025B402281N1429N0911N3461N7845N9434N8914O0637O4133O5567O5992O9616
56014C060220P5309P8419P9744Q3940R0354R4367R6606J01618J08541J12559J14586
56003D096263J19846J27847J33531J37504J44930J55177J62893J68628J77717
55994E424336J89521J98723K06364K18243K33308K45530K56326K72717K94104
$$ plain form
56069 1249726 1262869 1275549 1289343 1305065 1321518 1338346 1356871 1376969 1396409 1414585 1433666
56058 1433666 1454802 1476500 1498001 1520720 1544843 1567986 1588875 1609117 1629805 1649842 1669145
56047 1669145 1689927 1713068 1736654 1759749 1784109 1810597 1837565 1864475 1893340 1924860 1956966
56036 1956966 1988889 2022732 2059293 2096507 2133808 2173657 2216856 2260875 2304893 2351685 2402281
56025 2402281 2453710 2504621 2558082 2615927 2675361 2734275 2794912 2859045 2924612 2990604 3060220
56014 3060220 3135529 3213948 3293692 3377632 3467986 3562353 3658959 3760577 3869118 3981677 4096263
56003 4096263 4216109 4343956 4477487 4614991 4759921 4915098 5077991 5246619 5424336
55994 5424336 5613857 5812580 6018944 6237187 6470495 6716025 6972351 7245068 7539172
55985G539172L13847L33004L58762L90084M19407M47948M84228N27933N71289
55976A1385674O16122O72513P40545Q11220Q85911R76300J084538J203412J337244
55967A9713479J501869J702671J934880K207353K542771K952506L436480M010469
55959D0002478M707173N547041O534479P684031R022178J0567550J2346167J4421837
55951A10832934J6862028J9658578K2697149K5757243K8463465L0283861L0727888
55944B85283146K9552717K6582395K1278775J2846045J207467j2068748k4139300
55937C40542497l2466186l6155418l5950799l3272185k9390430k5192705k1230194
55930A26884580j7758970j4815069j2355911j0341493q712541p380303o275510
$$ plain form
55985 7539172 7853019 8186023 8544785 8934869 9354276 9802224 10286452 10814385 11385674
55976 11385674 12001796 12674309 13414854 14226074 15111985 16088285 17172823 18376235 19713479
55967 19713479 21215348 22918019 24852899 27060252 29603023 32555529 35992009 40002478
55959 40002478 44709651 50256692 56791171 64475202 73497380 84064930 96411097 110832934
55951 110832934 127694962 147353540 170050689 195807932 224271397 254555258 285283146
55944 285283146 314835863 341418258 362697033 375543078 376750545 364681797 340542497
55937 340542497 308076311 271920893 235970094 202697909 173307479 148114774 126884580
55930 126884580 109125610 94310541 81954630 71613137 62900596 55520293 49244783
55923D9244783n369039m631897m016306l489093l045975k679373k363704k083054
55915B1566342j843219j644972j471534j312097j173197j057226r52088q51078
55907A1260931p62353o90181o25683n63900n11978m72787m37213m00001l67636
55898F429199l43656l20933k95188k72053k54504k36626k15848j98466j87164
55889D104761j75360j59634j45857j37393j28749j16602j06091j00408r4756q6421
55879B853490q0815q1620q4133q3936q3362q4134q2291p5875o9649o7103o5275
55868A995297o2034o0712o2790o3483n9544n4515n1748m9004m4303m0389l8952
55857A407823l6909l2701k9966l0722l1179k8550k5969k6277k6871k5163k3561
$$ plain form
55923 49244783 43875744 39243847 35227541 31738448 28692473 26013100 23649396 21566342
55915 21566342 19723123 18078151 16606617 15294520 14121323 13064097 12112009 11260931
55907 11260931 10498578 9808397 9182714 8618814 8106836 7634049 7196836 6796835 6429199
55898 6429199 6085543 5764610 5469422 5197369 4942865 4706239 4490391 4291925 4104761
55889 4104761 3929401 3769767 3623910 3486517 3357768 3241166 3135075 3034667 2939911 2853490
55879 2853490 2772675 2691055 2606922 2522986 2439624 2355490 2273199 2197324 2127675 2060572 1995297
55868 1995297 1933263 1872551 1809761 1746278 1686734 1632219 1580471 1531467 1487164 1446775 1407823
55857 1407823 1370914 1338213 1308247 1277525 1246346 1217796 1191827 1165550 1138679 1113516 1089955
55846A089955k4529k5871k5192k4275k4887k4967k2872k0873k0807k0567j8494
55835H36621j6737j6892j6697j4499j2647j3021j3450j1919j0262j0367j0639
55824F89491r488q471q949r386q812r126j1158j2392j1465j0828j2156j3111j1632
55811E52517r514q721p984o050m511m474m084k233j005j603j749K6J398O65J40
55796E02818J889L840L609K561K648K661J202K4P62J512K31j443j358q60k009
55781E18087l639l979m577p687j1985j4524j5045j5001j4238j1949r116o917m538
55768C94892j251J315J749J484J986J610j534n681p632p198o336n577m303l115
55754C60409k980l270l206l703n464o962o801o281p014p869p027n356m865n332
$$ plain form
55846 1089955 1065426 1039555 1014363 990088 965201 940234 917362 896489 875682 855115 836621
55835 836621 819884 802992 786295 771796 759149 746128 732678 720759 710497 700130 689491
55824 689491 680003 671532 662583 653197 644385 635259 624101 611709 600244 589416 577260 564149 552517
55811 552517 543003 534282 526298 520248 515737 511263 507179 504946 503941 502338 500589 500615 502013 502678 502818
55796 502818 504707 508547 512156 514717 517365 520026 521228 521252 522014 523526 523757 522314 520956 520096 518087
55781 518087 514448 510469 505892 498205 486220 471696 456651 441650 427412 415463 406347 399430 394892
55768 394892 393641 394956 396705 398189 400175 401785 400251 394570 386938 379740 373404 367827 363524 360409
55754 360409 357429 354159 350953 347250 341786 334824 328023 321742 314728 306859 299832 294476 289611 284279
55740B84279n207m568m444m474l732k746k405k095j078k92p07j371j313j579l172
55725B45096m679m446l439l467m138m108l833m366m888m037k480j650j128K62
55711A98699J927K561K553L059L775L825L677M037M052K786J123J60q44k735m360
55696B24295m538m458n550o591n662l577k470k288j579o10p61j639j686r89p63
55681A81134p37L28K086L070L126L143L011K115J105Q53N21j018k757k954k073
55666A90953j767j867j032L41O16j73n58l72n88r14j63J237J716J358J700K843
55650A93330L279K633K140K232J882O27p32j650k304k532k047j608k252l466l887
55635A85645l524l558m211m590m465m369m133l065j488n20m37n86o99r06r59p47
$$ plain form
55740 284279 279072 274504 270060 265586 261854 259108 256703 254608 253530 253238 252531 251160 249847 248268 245096
55725 245096 240417 235971 232532 229065 224927 220819 216986 212620 207732 203695 201215 199565 198437 198699
55711 198699 200626 203187 205740 208799 212574 216399 220076 224113 228165 230951 232074 232234 231390 228655 224295
55696 224295 219757 215299 209749 203158 197496 193919 191449 189161 187582 186972 186211 184572 182886 181897 181134
55681 181134 180397 180725 182811 185881 189007 192150 195161 197276 198381 199234 199755 198737 195980 193026 190953
55666 190953 189186 187319 186287 186628 187244 187071 186513 186141 185553 184639 184476 185713 187429 188787 190487 193330
55650 193330 196609 199242 201382 203614 205496 206123 205391 203741 201437 198905 196858 195250 192998 189532 185645
55635 185645 182121 178563 174352 169762 165297 160928 156795 153730 152242 151722 151285 150699 150000 149094 148135 147388
55619A47388q88j534j487q1J217Q15m87r54p57j135j800j652j240j911l104l089
55603A29301j979j478j952k202j882j701j411j31J385J387K6p21j81L00n5m35
55587A18271l32k81l55R6R23J166P85O63Q81Q00P17J535K837L278K892L022L949
55570A40847M662M896N419O194O298N678N031M009J747r09k012j569j699l396
55556A75196n300o140o231o102n609n029n105n532n081l586k160j271l88L95L11
55541A18368l54m18R6L7o47p93k72j79n73l26N05N10l96n89L31P05k59j087p00
55522A13959k24q92j975k205j655j048m85R9L82L55M00L32m07j409j616j151j102
55505A01358j385q49K71K64j138k051j439o46r84j819k160k175k059j215K28R06
$$ plain form
55619 147388 146500 144966 143479 143398 144615 145430 144943 143989 143232 142097 140297 138645 137405 135494 132390 129301
55603 129301 127322 125844 123892 121690 119808 118107 116696 116565 117950 119337 119363 118642 118461 118761 118706 118271
55587 118271 117939 117658 117303 117399 118322 119488 120273 120936 121817 122617 123334 124869 127706 130984 133876 136898 140847
55570 140847 145509 150405 155824 162018 168316 173994 179025 183034 184781 183872 181860 180291 178592 175196
55556 175196 169896 163756 157525 151423 145814 140785 135680 130148 125067 121481 119321 118050 117662 118057 118368
55541 118368 118014 117596 117692 117729 117082 116289 116017 115838 115265 114939 115444 115954 115558 114969 115300 116005 115746 114659 113959
55522 113959 113735 112843 110868 108663 107008 105960 105475 105574 105956 106311 106711 107043 106636 105227 103611 102460 101358
55505 101358 99973 99124 99395 99659 98521 96470 95031 94385 93401 91582 89422 87247 85188 83973 84201 85107
55489H5107L28j26N85J527J486P02j12r41j601j300r5O03J09m45QR15J408J618
55471H9776J771J421N99K08M27K30o82j150o77m01r36j173l91K85l4l04M51J181
55453I0601N88o21j003o34m39m10j52o4m72o13M3N46J7p22m79M02R83J377J943
55434I0891J952Q15m08m47R0j55r32r81k69J53O3P6J40k77p55k96R28J707J562
55415I3857J217J263J523J689J669J319O27l7m63j010j777k056j414p06j047k198
55399I2456k990k841j984o82P83J723J605Q41K55Q8J09L14P80J212J255R75N43
55382I4442o6o83q34m45m7J0n2r1k13j67M14R18K62j211j796r29lL0P5Q51J209
55361I1674M1j629k099j441q70n91k4O83Q89O37K89l26j158j226OJ341J359M36
$$ plain form
55489 85107 85435 85309 85894 87421 88907 89609 89497 88556 86955 85655 85560 86163 86272 85827 85835 86750 88158 89776
55471 89776 91547 92968 93567 93775 94202 94432 93750 92600 91923 91522 90586 89413 89022 89307 89273 88969 89420 90601
55453 90601 91189 90568 89565 88931 88492 88082 87930 87866 87394 86781 86824 87370 87387 86665 86186 86588 87571 88948 90891
55434 90891 92843 93658 93250 92803 92893 92738 91806 90825 90556 90709 90772 90848 90988 90711 89956 89660 90588 92295 93857
55415 93857 95074 96337 97860 99549 101218 102537 103164 103127 102664 101654 99877 97821 96407 95701 94654 92456
55399 92456 89466 86625 84641 83959 84742 86465 88070 88911 89166 89254 89363 89677 90457 91669 92924 93899 94442
55382 94442 94376 93693 92859 92414 92367 92377 92325 92234 92021 91854 92268 93186 93448 92237 90441 89512 89509 89539 89614 90465 91674
55361 91674 91715 90086 87987 86546 85676 85085 85061 85744 86633 87270 87559 87233 86075 84849 84855 86196 87555 87991
55343H7991j48k97o83j076q11k97l53n04K54J367J255j71j305j276r34j157j547
55326H0308j340n28L18P17N26R7O8N55R02P14O11J212K023K197J782J327Q27Q9
55308I2405m63l91j39k76m38j05K12k22r45r50l24K1r4r9J31K69M33Q90J215Q77
55288I2007L40L84P13M70j65k56K63N11J93p6N5K25J75M4j18l51m01j27M2k34
55268I3694m61q2M81M93P9j43j55k28j17L79O82L62J31O92J280P25o39j548j750
55249I3875j877j856j146k10r7p00r41n96m47p08p86n11k12K81J311K228K015
55232H9623R79L31K75J7m86n33k94o72j433j335l09L76L58P33J817K248J177k61
55214I2611o89l15m0J09N45R97Q95L56N0K83P08P35J22n65l83O59J253M92o95
$$ plain form
55343 87991 87843 87546 86863 85787 84976 84679 84326 83822 84076 85443 86698 86527 85222 83946 83012 81855 80308
55326 80308 78968 78440 78758 79475 80001 80098 80166 80721 81623 82337 82948 84160 86183 88380 90162 91489 92316 92405
55308 92405 91942 91551 91412 91136 90698 90593 90805 90583 89638 88688 88364 88385 88291 88192 88323 88592 89025 89915 91130 92007
55288 92007 92347 92731 93444 93914 93749 93493 93756 94267 94460 94384 94439 94664 94839 94883 94765 94414 94013 93886 93928 93694
55268 93694 93233 93151 93632 94125 94204 94061 93906 93678 93561 93940 94622 94984 95115 95807 97087 97812 97173 95625 93875
55249 93875 91998 90142 88996 88786 88689 87989 87048 86452 86005 85297 84511 84000 83788 84069 85380 87608 89623
55232 89623 90602 90933 91208 91225 90739 90206 89912 89240 87807 86472 86163 86539 86897 87630 89447 91695 92872 92611
55214 92611 91922 91607 91567 91676 92221 93218 94113 94469 94519 94802 95510 96245 96367 95802 95419 96078 97331 97823 97128
55195I7128r10l90l27o38k28P67R78J27n26l28l7r3R1N69L93n29q37J11J025O76
55175I7022l06o67l61p4O3K24K05MJ80Q88J323R33L48K87M36K32l5J84N95M94
55155A01975j62p81r07m59L62J054J185J009J098J260P31l89r71m71K54K98j41
55138A04945n06p88j072j051o59l98m95n26l02k26l10Q9R40J124J27r30r36m72
55120I8554p39j643k099j713j053o35n60p77r70n11P41J954K255J768J149O57
55104I6378L34M93J245J968K021J571J081M57n11j277j066j2R65J317J273J171
55088A07408J024P07J72n04j048j119o97o3O87J579K108J407m65k073k062o20
55072A06441R93J837J692O65p83j784j773j122n61k53M4J76k80j195j803j554
$$ plain form
55195 97128 96218 95828 95501 94863 94635 95402 96380 96507 95981 95653 95616 95523 95614 96183 96576 96047 95210 95321 96346 97022
55175 97022 96716 96049 95688 95614 95677 95901 96106 96110 96290 97178 98501 99434 99782 100069 100505 100737 100702 100886 101481 101975
55155 101975 101813 101032 100125 99666 100028 101082 102267 103276 104374 105634 106365 105976 105005 104534 104788 105086 104945
55138 104945 104439 103651 102579 101528 100869 100471 99976 99450 99148 98922 98612 98701 99641 100765 100892 99962 99026 98554
55120 98554 97815 96172 94073 92360 91307 90672 90112 89335 88365 87854 88595 90549 92804 94572 95721 96378
55104 96378 96712 97205 98450 100418 102439 104010 105091 105548 105037 103760 102694 102682 103647 104964 106237 107408
55088 107408 108432 109139 109311 108807 107759 106640 105943 105880 106567 108146 110254 111661 111196 109123 107061 106441
55072 106441 107434 109271 110963 111628 110845 109061 107288 106166 105605 105352 105396 105572 105292 104097 102294 100740
55056A00740p02R3M49M99O10R73J476J905K104J836Q32o88j798j703o66L37O79
55039A06976L14o12j668j980j156j42j56q26o43O93J709J356M34K04O66J014R70
55022A07153P79N21J71o8j13k42o10r33r76q43n45P6P66Q80L60o9Q1M87P81J029
55002A08685J164Q41K05rL82O63M24J68K86L85J72O7K63K60p8k6P15J238Q35J68
54982A16808R4K62m6n37m77L1M39P94J327J596J146N34N47Q97P47J27k95m33o75
54963A22886q40m31K95N55K97K17N36O90L21k42n83n78k33L59Q13P52K37m19j033
54944A23599j382j128l86P7j46l91Q3R32J281J025O53K28m70j059q85j36K94J30
54926A22319J6M60J240K022K812L665M406M928N295N531N639N798O108O267N857
$$ plain form
55056 100740 100038 100131 100580 101079 101689 102662 104138 106043 108147 109983 110815 110127 108329 106626 105960 106297 106976
55039 106976 107290 106678 105010 103030 101874 101732 101576 100750 100107 100800 102509 103865 104299 104503 105169 106183 107153
55022 107153 107932 108453 108624 108556 108443 108201 107591 106658 105682 104839 104294 104370 105136 106016 106376 106307 106388 106875 107656 108685
55002 108685 109849 110690 110895 110886 111268 111931 112355 112523 112809 113194 113366 113433 113696 113956 113878 113852 114567 115805 116640 116808
54982 116808 116902 117164 117118 116581 116104 116135 116574 117368 118695 120291 121437 121971 122518 123415 124162 124289 123994 123561 122886
54963 122886 122046 121615 121910 122465 122762 122979 123515 124205 124526 124284 123701 123123 122890 123249 124062 124814 125051 124632 123599
54944 123599 122217 121089 120703 120780 120634 120243 120326 121258 122539 123564 124217 124445 123975 122916 122031 121895 122189 122319
54926 122319 122335 122795 124035 126057 128869 132534 136940 141868 147163 152694 158333 164131 170239 176506 182363
54911A82363M883L618K144M51j139k177k689l164l928m853n626o017n950n480
54897A52436m742l860l011k449k176j755r42k90m36r30p10K66R37Q53P55J056
54881A35002J140P74R19K102L244L325L119L879N157N507M872M561N059N388M769
54866A88817L669K780J946N58j555l856n484n942n640n475n645n388m320l249
54852A51216l071l516l778l696l466k870j773q62q31j304j515j559j893k139j516
54837A17427k34Q08J325J657J689J038J02k85j67l41r97j531j631j553j282n59
54821A15466L19O77N26N05Q00J025J051J049P93rp91o27L36R81P86K66j43n83
54803A22427r76q53j99L90O50Q64J088R84N53J85r7n72r98q04j46K01J14K68Q73
$$ plain form
54911 182363 187246 190864 193008 193459 192320 190143 187454 184290 180362 175509 169883 163866 157916 152436
54897 152436 147694 143834 140823 138374 136198 134443 133501 133211 132775 131845 131135 131401 132338 133191 133946 135002
54881 135002 136142 136916 137835 139937 143181 146506 149625 153504 158661 164168 169040 173601 178660 184048 188817
54866 188817 192486 195266 197212 197770 196215 192359 186875 180933 175293 169818 164173 158785 154465 151216
54852 151216 148145 144629 140851 137155 133689 130819 129046 128184 127353 126049 124534 122975 121082 118943 117427
54837 117427 117193 118001 119326 120983 122672 123710 123812 123527 123360 123019 122022 120491 118860 117307 116025 115466
54821 115466 115785 116462 116988 117493 118293 119318 120369 121418 122211 122202 121411 120784 121120 122101 122887 123153 123010 122427
54803 122427 121451 120598 120399 120789 121439 122303 123391 124375 124928 125113 125016 124444 123446 122642 122496 122697 122811 123079 123952
54784A23952J312J239J041R47O18l9n25n20k20K89J203K262K761K564K401K809
54768A42094L527M106M489M746M939N316N965O373O074N630N909O509O062M259
54754B15998K261Q49n71k642m915o709q009q851q774p615o111m987m146l257k462
54739A50059j906j303o06l91r77j743j863j229j71J052K012K086J346Q49J393
54724A48608K488L197L409L585L795L807L844M318N007N232M815M261L888L271
54710B03525J804m67k753m266m959n378n829n994n594m971m560m115l204k199
54696A51040j909k234k146j215l54n16j438k116k000j315n34q7k05p85j424j756
54680A31006j620r53J12J040J243O95o1m72l00L37Q94O96k24q92o21k1l4m84n68
$$ plain form
54784 123952 125264 126503 127544 128491 129109 129070 128545 128025 127805 128094 129297 131559 134320 136884 139285 142094
54768 142094 145621 149727 154216 158962 163901 169217 175182 181555 187629 193259 199168 205677 211739 215998
54754 215998 218259 219108 218537 215895 210980 204271 196262 187411 178637 171022 164911 159924 155778 152521 150059
54739 150059 148153 146850 146244 145853 144876 143133 141270 140041 139870 140922 142934 145020 146366 147215 148608
54724 148608 151096 154293 157702 161287 165082 168889 172733 177051 182058 187290 192105 196366 200254 203525
54710 203525 205329 204862 202109 197843 192884 187506 181677 175683 170089 165118 160558 156443 153239 151040
54696 151040 149131 146897 144751 143536 143182 142666 141228 139112 137112 135797 135263 135176 134971 134186 132762 131006
54680 131006 129386 128433 128545 129585 130828 131523 131462 130990 130690 131027 131921 132617 132393 131501 130880 130859 130825 130341 129773
54661A29773l52n24r16o42K36O14J06l86k96k19o36r99p43j89K07N64R27Q08R1
54642A27424m73k93K17L98K94K44K71M01Q48J372J242L19n43p50p65j048j135
54625A28023n31L11P29Q75J106J045K19q82j298r45m97k97j00K44N73P74P97M98
54607A30644m3k94R0O94Q23L56l28r60j447j574j181n21l8J59L47P84J389J723
54589A30623J327K89o27q14o02o65r03o86n5L07L63P95J567J650O16n66r55q01
54571A30863o49l13L71P83M41m9R1N64O71N00N08M54p1n71k83L98L39n30r89l50
54551A32178N54N86j94p98o59j71j0k70m67k61J40M09O34J018J383J437J372J474
54533A38355J413P28r1j8Q93J389Q71K88O22J486J860J483P46j03r31j468j632
$$ plain form
54661 129773 129421 128897 127981 127339 127575 128189 128295 127909 127613 127394 126758 125759 125016 124827 125034 125598 126525 127333 127424
54642 127424 126951 126658 126875 127273 127567 127811 128082 128483 129331 130703 131945 132264 131721 130971 130206 129158 128023
54625 128023 127492 127803 128532 129407 130513 131558 131777 130895 129597 128652 128155 127858 127758 128002 128575 129349 130146 130644
54607 130644 130601 130307 130397 131091 131914 132270 131942 130982 129535 127961 126780 126259 126221 126380 126727 127511 128900 130623
54589 130623 131950 132239 131612 130798 130196 129531 128628 127942 127887 128194 128557 129352 130919 132569 133185 132619 131664 130863
54571 130863 130214 129901 130272 131055 131496 131447 131538 132102 132773 133273 133781 134235 134164 133593 133310 133708 134047 133517 132528 132178
54551 132178 132732 133318 133124 132326 131667 131496 131486 131216 130749 130488 130628 131037 131671 132689 134072 135509 136881 138355
54533 138355 139768 140496 140405 140387 141280 142669 143540 143828 144450 145936 147796 149279 150025 149922 148991 147523 145891
54516A45891j715j755j305k89N42N20j07p31j171j451j365q04r2M59Q66J141J165
54499A39799J092J194J211O50j93m88k97n01j108r95J27R36M91l79n50k15n1L1
54481A40754K55J84l18l70N25J425J403R94R79R30K97j07O39J733J719P08p9l25
54463A51346n05m14M81J495J375L14k10L69J105J098M12m96j139r44P1Q23M91
54446A55672j37P9O08L9j402j943r50J72J02p73j401j491j383j249r36j73J083
54429A45917K174K098R29J66P32J410N80j204j970j189j94J54L82Q98J173Q62
54413A52918M21K27J34J04L08M78J90k65k77o8k78o45l08P17J582J937J938J312
54395A60425j52j431j286k76O1k11L48J742K239J279M32O76Q50j09j266j318n74
$$ plain form
54516 145891 144176 142421 141116 140827 141369 141889 141782 141051 139880 138429 137064 136260 136168 136627 137493 138634 139799
54499 139799 140891 142085 143296 143946 143753 143265 142968 142467 141359 140364 140491 141427 141918 141539 140989 140774 140723 140754
54481 140754 141009 141193 140875 140505 141030 142455 143858 144852 145831 146761 147058 146951 147590 149323 151042 151750 151671 151346
54463 151346 150841 150427 150908 152403 153778 154092 153882 154251 155356 156454 156866 156370 155231 154287 154358 155181 155672
54446 155672 155535 155614 156222 156261 154859 152916 151966 152138 152240 151467 150066 148575 147192 145943 145007 144834 145917
54429 145917 148091 150189 151118 151284 152016 153426 154006 152802 150832 149643 149449 149603 149985 150883 152056 152918
54413 152918 153339 153566 153700 153804 154112 154590 154780 154515 154238 154170 153892 153247 152939 153656 155238 157175 159113 160425
54395 160425 160273 158842 157556 157280 157341 157130 157478 159220 161459 162738 163170 163846 164696 164587 163321 162003 161429
54378A61429o9O1J02j73p90r11m3R48J020L83l3J11N51R64R41K00p11p71K0N80
54358A63809M80N66J219J421L98r99j531j153m66L52J182J439R23K88p5o51j524
54341A65678j689o54M03K52n79q88o76o17m80L95J565J911J266M50m2k65j32M01
54323A66299P34K81m91o48j38L72O80J060J352J091N23M53J074J708J793J477
54307A77620J237J438K179L102L527L174K402J489J80j469k516k255j370j154
54293A87584j900k863l445l532l006j886p87l91n44n78l49k21k57k04r3j33j63
54276A67232L7J43k56q18q57m70l39n89p14n88n70o05j75O11Q83K74l96k44N20
54257A63079J064J061Q76Q72J015J074R05N49J82l0q2j52l84o99p79l66K78M05
$$ plain form
54378 161429 161360 161421 161523 161350 160560 159649 159606 160554 161574 161957 161924 162035 162586 163550 164491 164691 163980 163209 163229 163809
54358 163809 164289 164855 166074 167495 167893 166894 165363 164210 163744 164096 165278 166717 167640 167928 167853 167202 165678
54341 165678 163989 163335 163738 163990 163411 162523 161847 161230 160750 161145 162710 164621 165887 166337 166295 166030 165898 166299
54323 166299 167033 167314 166823 166175 166037 166409 167089 168149 169501 170592 171115 171568 172642 174350 176143 177620
54307 177620 178857 180295 182474 185576 189103 192277 194679 196168 196348 194879 192363 190108 188738 187584
54293 187584 185684 182821 179376 175844 172838 170952 170165 169774 169230 168652 168303 168082 167825 167621 167528 167395 167232
54276 167232 167269 167412 167156 166338 165481 165011 164672 164083 163369 162781 162211 161606 161431 162042 162925 163199 162803 162559 163079
54257 163079 164143 165204 166080 166952 167967 169041 169946 170495 170677 170647 170565 170413 170029 169330 168551 168185 168463 168868
54239A68868l55j285j324n54k08r11j726j502n22Ml45q76r67o95k85K85R30J254
54221A59786R97L16m44j025j171o97K74J213J522R72q5r25j029n96k75l67n71
54204A57895n82n37o20o36l04K37O13O90O36O50Q06J047J198J184J222J481J639
54187A66619J251N57K56L69P0j017k101k236j465m88K43N66L59j72m41k51j66
54170A61953n66q69l88N25R66P26L24Q4r1k19k16k06k71j39L15N59J41l57j5R33
54150A63189J215K64r50j195m63K43K16l20p24p35n68l83j4N95R56O06k9k1P06
54131A62588J142O13k40m09J75Q18J086J019P63M48K36L4m26r29p21L66J328J157
54113A69048J50o20o90l77K5M68Q05Q94Q77Q82O69Q0m94o01l17M9L82M68r3j034
$$ plain form
54239 168868 168513 167228 165904 165350 165142 164231 162505 161003 160481 160485 160140 159264 158297 157602 157317 157602 158532 159786
54221 159786 160783 161099 160655 159630 158459 157762 158036 159249 160771 161743 161658 160733 159704 159108 158833 158466 157895
54204 157895 157313 156776 156156 155520 155216 155453 156066 156756 157392 158042 158848 159895 161093 162277 163499 164980 166619
54187 166619 167870 168427 168683 169052 169122 168105 166004 163768 162303 161815 162058 162624 162983 162811 162370 162119 161953
54170 161953 161387 160518 160130 160655 161621 162347 162671 162755 162664 162445 162229 162023 161752 161613 161928 162487 162628 162271 162256 163189
54150 163189 164404 164668 163718 162523 162060 162303 162519 162199 161475 160740 160172 159789 159775 160370 161326 161932 161903 161882 162588
54131 162588 163730 164343 164103 163694 163869 164687 165773 166792 167555 168003 168239 168273 167847 166918 166197 166563 167891 169048
54113 169048 169198 168578 167888 167511 167536 168004 168809 169703 170580 171462 172131 172211 171717 171116 170799 170848 171230 171698 171605 170571
54093A70571j233j78R92R20k6l49M08J223J250P17K36P7K49N01K90n28j158p84
54075A73178J45M70M1j29N22J295J325O58K3Q8R66K001K144J149R5K5M46J85n94
54056A84033n71N32J345Q55j58m01J93P37P64O02P36J348K260K990L135K866K765
54039B04031L061L443L664L875M253M765N402O174O748O560N484M050K937K497
54025B66944K723L241L401K863K067J708J817J820J330L93q29k055k843l108l399
54010B76073l983m142l312k422k815m089m521l653k907l249l798l542k949k869
53996B27822k894k140q61q8n8j27j8j02m82o84m69k33l54n73l72K82Q48Q53N23
53977B20873N34J160J891K188K292K875M041N264O264P330Q728J0361J2129J4023
$$ plain form
54093 170571 169338 169160 170152 171072 171046 170697 171105 172328 173578 174295 174531 174608 174857 175358 175648 175120 173962 173178
54075 173178 173323 173793 173834 173705 174227 175522 176847 177505 177528 177616 178582 180583 182727 183876 183971 183996 184442 184627 184033
54056 184033 183462 183994 185339 186194 186036 185635 185828 186565 187329 187931 188667 190015 192275 195265 198400 201266 204031
54039 204031 207092 210535 214199 218074 222327 227092 232494 238668 245416 251976 257460 261510 264447 266944
54025 266944 269667 272908 276309 279172 281239 282947 284764 286584 287914 288307 287478 285423 282580 279472 276073
54010 276073 272090 267948 264636 262214 259399 255310 250789 247136 244229 240980 237182 233640 230691 227822
53996 227822 224928 222788 221927 221839 221781 221654 221636 221534 221052 220368 219899 219666 219312 218739 218367 218649 219497 220350 220873
53977 220873 221407 222567 224458 226646 228938 231813 235854 241118 247382 254712 263440 273801 285930 299953
53963B99953J5715J6573J6272J4873J2128P424P76o534j2685j6476j7693j6848
53951C13478j4835j2420r839p143m807l448k902k265j132j09J92R2L06J012J858
53936B58038K486K708K540K419K933L970M573M092L086K607K845L095K864K470
53922C00726K468K899L319L382L193L071L103L160L312L861M833N732O123O070
53908C55252N717M896L615K490J953J408N4j774k951l122k949k882k791k783l285
53893C52848m095m436m311m709n986p092p027o188n616n615n813n872n536m563
53879B75989l228k393k462k833k840k635k612k631k472k391k571k621k293k068
53865B39939k253k191j328m82q69k193k875k206j130p49r91j141r27o23m99o23
$$ plain form
53963 299953 315668 332241 348513 363386 375514 382938 383714 377180 364495 348019 330326 313478
53951 313478 298643 286223 276384 269241 264434 260986 258084 255819 254687 254578 254770 254862 255168 256180 258038
53936 258038 260524 263232 265772 268191 271124 275094 279667 283759 286845 289452 292297 295392 298256 300726
53922 300726 303194 306093 309412 312794 315987 319058 322161 325321 328633 332494 337327 343059 349182 355252
53908 355252 360969 365865 369480 371970 373923 375331 375385 373611 370660 367538 364589 361707 358916 356133 352848
53893 352848 348753 344317 340006 335297 329311 322219 315192 309004 303388 297773 291960 286088 280552 275989
53879 275989 272761 270368 267906 265073 262233 259598 256986 254355 251883 249492 246921 244300 242007 239939
53865 239939 237686 235495 234167 233685 232816 230623 227748 225542 224412 223663 222672 221531 220604 219981 219482 218859
53849B18859r83j471j843j821j285m02M50J006J357J676J732J122J3q49j078j090
53833B15393j311j489j285r45q11o30l1O30O71J70o2L74J005J292J336J545J994
53816B17846K364K350J957J474J258J502K174L055L778M008L832L906M770O051
53802B60325O837O876O867P415Q345R323J0528J2166J3912J5428J7046J9199K1387
53789D15654K2449K1889K0307J8255J5089R385N34j0015j9295k4816k6229k5022
53777D18185k2780k0102j7072j4095j1824j0575j0086r673q582o614m559l568
53765B78655l894m632m854m504l987l447k885k446k164j762j166p93j020j640
53751B39461k179k388k174j514p70n61r70j284r22j35O24J371K153K469J916J010
$$ plain form
53849 218859 217876 216405 214562 212741 211456 211054 211504 212510 213867 215543 217275 218397 218410 217561 216483 215393
53833 215393 214082 212593 211308 210363 209552 208922 208891 209521 210192 210362 210300 210674 211679 212971 214307 215852 217846
53816 217846 220210 222560 224517 225991 227249 228751 230925 233980 237758 241766 245598 249504 254274 260325
53802 260325 267162 274038 280905 288320 296665 305988 316516 328682 342594 358022 375068 394267 415654
53789 415654 438103 459992 480299 498554 513643 523028 523562 513547 494252 469436 443207 418185
53777 418185 395405 375303 358231 344136 332312 321737 311651 301978 293396 286782 282223 278655
53765 278655 274761 270129 265275 260771 256784 253337 250452 248006 245842 244080 242914 242121 241101 239461
53751 239461 237282 234894 232720 231206 230436 229875 228905 227621 226699 226564 227188 228559 230712 233181 235097 236107
53735B36107O97J274K287L219L780L884L809M132N023N969O577P135P870Q199
53721B99962P569O504N939N741M823K690K4k254l741m428m520m498m723m882m342
53706B99864l100j861j163r36r16r63q18j04J140K262K596K113J367R56J056J413
53690C02906J748K067K436K557K026J026K26j21m05p98q83m89j51k10k09J67L21
53673C12214l11j202j556j624k092k647k390j403o66m63j76K82J36p50j283o94
53657B95375K52L49m02j028r97o48l93j83J76N84P64O87O85J028J495J610J403
53640C00757J428J877K110J540O16K40N57R46J084J199J431J574J618J846K314
53625C21137K716K923L134L371L315K819K208J898K053K666L651M757N590N818
$$ plain form
53735 236107 236804 238078 240365 243584 247364 251248 255057 259189 264212 270181 276758 283893 291763 299962
53721 299962 307531 314035 319974 325715 330538 333228 333252 330998 327257 322829 318309 313811 309088 304206 299864
53706 299864 296764 294903 293740 292804 291888 290925 290107 290003 291143 293405 296001 298114 299481 300437 301493 302906
53690 302906 304654 306721 309157 311714 313740 314766 314992 314871 314466 313668 312785 312296 312145 311935 311726 311893 312214
53673 312214 311903 310701 309145 307521 305429 302782 300392 298989 298323 297860 297684 297966 298102 297352 296069 295375
53657 295375 295627 295976 295574 294546 293549 292901 292508 292325 292501 293085 293849 294536 295221 296249 297744 299354 300757
53640 300757 302185 304062 306172 307712 308328 308568 309125 310071 311155 312354 313785 315359 316977 318823 321137
53625 321137 323853 326776 329910 333281 336596 339415 341623 343521 345574 348240 351891 356648 362238 368056
53611C68056N263M048K810K429L091L905L961L402K985K862K603K127J841J810
53597D11193J624J103N29J12j59j66J73M32M7p69j272j351j603k143k203j355
53581D04192k86J30n6k30k15l33p76j417k078k668l137l414l373k807j689m42
53565C81401L41M62J34m02r28j076o50n4J55J02L56R21J173R11P12J006J435J510
53547C87509J301J137J084J198J797L033M469N408N543N085M563M600N521O993
53533D39241Q285R049R558J0164J0927J1858J3012J4207J5104J5775J6693J8004
53521E91877J9223J9963K0503K1296K2254K2839K2663K1782K0665J9970K0009
53510H23044K0330K0180J9550J9229J9716K0586K1295K2017K3132K4283K4626
$$ plain form
53611 368056 373319 377367 380177 382606 385697 389602 393563 396965 399950 402812 405415 407542 409383 411193
53597 411193 412817 413920 414449 414561 414402 414236 414409 414841 414888 414119 412847 411496 409893 407750 405547 404192
53581 404192 403906 404036 403980 403750 403535 403202 402426 401009 398931 396263 393126 389712 386339 383532 381843 381401
53565 381401 381742 382204 382338 381936 381008 379932 379282 379228 379383 379485 379841 380762 381935 382846 383558 384564 385999 387509
53547 387509 388810 389947 391031 392229 394026 397059 401528 406936 412479 417564 422127 426727 432248 439241
53533 439241 447526 456575 466133 476297 487224 499082 512094 526301 541405 557180 573873 591877
53521 591877 611100 631063 651566 672862 695116 717955 740618 762400 783065 803035 823044
53510 823044 843374 863554 883104 902333 922049 942635 963930 985947 1009079 1033362 1057988
53499A057988K3935K2905K2310K2207K2171K1983K1879K2172K2731K3020K2619
53488A305920K1653K0594J9787J9291J9017J8816J8518J8088J7649J7201J6513
53477A513047J5509J4446J3467J2169J0081P324M489K040J53j258k727n066q321
53464A575353j1332j2967j3523j4089j4920j5430j5597j6193j7529j9015k0233
53453A404525k1434k2693k3543k3865k4188k4593k4206k2455k0135j8503j7803
53442A161107j7309j6413j5064j3407j1611r911q443p159n993m880l541j783m0
53429A045553R92J492K627N091Q107J0362J1419J1812J2238J3173J4875J7157
53417A154898J9383K1067K2294K3338K4265K5156K6355K8115L0280L2600L4992
$$ plain form
53499 1057988 1081923 1104828 1127138 1149345 1171516 1193499 1215378 1237550 1260281 1283301 1305920
53488 1305920 1327573 1348167 1367954 1387245 1406262 1425078 1443596 1461684 1479333 1496534 1513047
53477 1513047 1528556 1543002 1556469 1568638 1578719 1586043 1590532 1592572 1592725 1591467 1588740 1583674 1575353
53464 1575353 1564021 1551054 1537531 1523442 1508522 1493092 1477495 1461302 1443773 1424758 1404525
53453 1404525 1383091 1360398 1336855 1312990 1288802 1264209 1240003 1217548 1197413 1178910 1161107
53442 1161107 1143798 1127385 1112321 1098914 1087303 1077392 1068949 1061790 1055797 1050917 1047376 1045593 1045553
53429 1045553 1046545 1048037 1050664 1055755 1063862 1074224 1085643 1097455 1109693 1122866 1137741 1154898
53417 1154898 1174281 1195348 1217642 1240980 1265245 1290401 1316756 1344871 1375151 1407751 1442743
53406A442743L7258L9050M0394M1811M3584M5409M7119M9188N1938N4771N6869
53395A950134N8325N9869O1589O2681O2537O1635O1023O1152O1427O0862N9097
53384B620331N6576N3744N0460M6496M2295L8619L5598L2705K9552K6053K1961
53373C054390J7085J2011P691M055j50n822j2567j9566k6528l3409l9976m6118
53361B911096n1880n6769n9852o1019o1334o1548o1264o0137n8899n8196n7284
53350B262914n5132n2212m9983m8914m8239m7511m7224m7676m8225m7982m6673
53339A723143m4613m2252l9905l7549l4873l1757k8559k5677k3084k0599j8350
53328A375925j6611j5422j4766j4755j5296j5862j6024j5845j5384j4300j2467
$$ plain form
53406 1442743 1480001 1519051 1559445 1601256 1644840 1690249 1737368 1786556 1838494 1893265 1950134
53395 1950134 2008459 2068328 2129917 2192598 2255135 2316770 2377793 2438945 2500372 2561234 2620331
53384 2620331 2676907 2730651 2781111 2827607 2869902 2908521 2944119 2976824 3006376 3032429 3054390
53373 3054390 3071475 3083486 3091177 3095232 3095082 3089260 3076693 3057127 3030599 2997190 2957214 2911096
53361 2911096 2859216 2802447 2742595 2681576 2620242 2558694 2497430 2437293 2378394 2320198 2262914
53350 2262914 2207782 2155570 2105587 2056673 2008434 1960923 1913699 1866023 1817798 1769816 1723143
53339 1723143 1678530 1636278 1596373 1558824 1523951 1492194 1463635 1437958 1414874 1394275 1375925
53328 1375925 1359314 1343892 1329126 1314371 1299075 1283213 1267189 1251344 1235960 1221660 1209193
53317A209193j0533r306q763q244p307n961m317k506o52J379L827O310P921Q497
53303A179538R097J0599J2508J3965J5208J7047J9405K1520K3241K4993K6658
53292A373779K7609K7836K8025K8468K8771K8684K8366K7729K6350K4184K1660
53281A671461J9033J6263J3568J1351R511P477M978K168q90m175p236r628j1732
53268A722149j4309j7184j9348k0594k2005k4452k7360k9507l0403l0499l0463
53257A456025l0725l1369l2125l2642l2836l2729l2104l0811k9355k8458k8066
53246A114805k7450k6400k5596k5561k5982k6369k6682k6902k6606k5537k4120
53235H27600k2937k1941k0686j9016j7189j5439j3807j2272j0829r526q615q471
$$ plain form
53317 1209193 1198660 1189354 1180591 1172347 1165040 1159079 1154762 1152256 1151604 1152983 1156810 1163120 1171041 1179538
53303 1179538 1188635 1199234 1211742 1225707 1240915 1257962 1277367 1298887 1322128 1347121 1373779
53292 1373779 1401388 1429224 1457249 1485717 1514488 1543172 1571538 1599267 1625617 1649801 1671461
53281 1671461 1690494 1706757 1720325 1731676 1741187 1748664 1753642 1755810 1754920 1750745 1743509 1733881 1722149
53268 1722149 1707840 1690656 1671308 1650714 1628709 1604257 1576897 1547390 1516987 1486488 1456025
53257 1456025 1425300 1393931 1361806 1329164 1296328 1263599 1231495 1200684 1171329 1142871 1114805
53246 1114805 1087355 1060955 1035359 1009798 983816 957447 930765 903863 877257 851720 827600
53235 827600 804663 782722 762036 743020 725831 710392 696585 684313 673484 663958 655343 646872
53223F46872r210j0489j1804j2863j3626j4127j4328j4148j3584j2858j2280j1866
53211D95689j1257j0184q826p593o774o582p106p954q345p934p231o830o710o660
53197C85703o836p206p095o103m992m737n047m935m312l848l510k665j653j655
53183C21109k703l253k379j104p04r35q84o60r70j648j821j270o26l21j59N6K11
53166C01939K99N56R83J177Q23J81j48J20N52M46k20n63O0R67Q62m21j622j740
53148C04251j167q18q67r26q71p85n26k4K89L1m18m01m0r3p19j105o01K69L77
53129B95856o08j789k129j600j048j028j202j059o90m51k52K27P64Q16M24J79
53113B86410J90j22r36j576j491j049q42q23p22p43j161j643j693j465j439j533
$$ plain form
53223 646872 637662 627173 615369 602506 588880 574753 560425 546277 532693 519835 507555 495689
53211 495689 484432 474248 465422 457829 451055 444473 437367 429413 421068 413134 405903 399073 392363 385703
53197 385703 378867 371661 364566 358463 353471 348734 343687 338752 334440 330592 327082 324417 322764 321109
53183 321109 318406 315153 312774 311670 310966 310031 309147 308487 307517 305869 304048 302778 302152 301831 301672 301728 301939
53166 301939 302238 302794 303777 304954 305777 305958 305810 305930 306482 306928 306708 306145 306205 307172 308034 307613 305991 304251
53148 304251 303084 302266 301399 300473 299602 298817 298291 298267 298556 298587 298169 297768 297728 297635 296916 295811 295210 295479 295856
53129 295856 295248 293459 291330 289730 288682 287654 286452 285393 284703 284252 284000 284227 284991 285807 286231 286410
53113 286410 286600 286478 285542 283966 282475 281426 280584 279761 279039 278296 277135 275492 273799 272334 270895 269362
53097B69362j253o63m29q16j270j228q55o97r36j270j301q82j84L70M17n5o71
53080B57639j011q83l09N31J343J776J644J123O53N41O46M92j74j056j567j405
53064B59983q15l08j76j95J43J001J807J807J053M35N00P31M32j14k1Q69J719
53047B68851J808J292Q05P48J074J393J238N29k60o97q87r97p09K08J083J061
53031B76540M10J12K15j97j242j786j248n91o58p85j03O73J94j342k349k034j153
53014B64656n37j07L65N56K34j34p3J45Kl34k10M70R98Q52M10L48N90M05m41j229
52994B66966j219o31j77qK57O48P27M34K53M12N46M12L28N50P76O18J13n56j292
52975B69157j715j187K40J547J973J993K358K744K292J163N26R63J827K348K523
$$ plain form
53097 269362 268109 267446 267017 266201 264931 263703 262848 262151 261215 259945 258644 257762 257578 257948 258365 258310 257639
53080 257639 256628 255745 255436 255967 257310 259086 260730 261853 262506 263047 263693 264185 264011 262955 261388 259983
53064 259983 259168 258860 258684 258489 258632 259633 261440 263247 264300 264735 265235 265966 266398 266284 266263 267132 268851
53047 268851 270659 271951 272756 273504 274578 275971 277209 277738 277478 276781 275894 274897 274188 274396 275479 276540
53031 276540 276950 277062 277277 277080 275838 274052 272804 272213 271555 270770 270667 271340 271534 270192 267843 265809 264656
53014 264656 264119 264012 264377 264933 265167 265033 264960 265105 265107 264773 264563 265033 266031 266883 267293 267641 268231 268636 268195 266966
52994 266966 265747 265116 264939 264931 265188 265836 266563 266997 267250 267662 268208 268620 268948 269498 270274 270892 271005 270449 269157
52975 269157 267442 266255 266495 268042 270015 272008 274366 277110 279402 280565 281091 282054 283881 286229 288752
52960B88752K600K369J550M60k56m46n35q82j314j446j206r29r01j102j400j807
52944B83507k248k295j551l39M85M86R6j43k83o10r92j034p18m77o63j201j694
52927B70326j699j075k41J15k31p89r60o81k68L0J10r1m40o20n22l83l62k67P
52908B61959J95J66K58O37O94j83j451j711l20J757K931K516J176N3l85n88j039
52891B66665j427j084j61L63O0k35L31J290J495P44m7j70J50M08M72M28K87Q3
52873B69652j11m02r28j468j500q52J8N25N19K97K30M67Q82J280J656K123K465
52856B74853K093P98p41j549j448j097j059j216j240j176j326j737k030j839j348
52841B59938j216j803k487k253j013R9N5q41j513j524j316j255j174r25p44p74
$$ plain form
52960 288752 291352 293721 295271 295731 295475 295029 294494 293612 292298 290852 289646 288717 287816 286714 285314 283507
52944 283507 281259 278964 277413 277074 277559 278045 278141 277998 277715 277105 276113 275079 274361 273884 273221 272020 270326
52927 270326 268627 267552 267311 267426 267195 266406 265446 264765 264497 264527 264637 264546 264106 263486 262964 262581 262219 261952 261959
52908 261959 262154 262320 262578 263215 263909 263726 262275 260564 260244 262001 264932 267448 268624 268677 268292 267704 266665
52891 266665 265238 264154 263993 264356 264416 264181 264512 265802 267297 268041 267994 267824 267974 268382 268854 269282 269569 269652
52873 269652 269541 269139 268211 266743 265243 264391 264409 264934 265453 265750 265980 266447 267329 268609 270265 272388 274853
52856 274853 276946 277744 277003 275454 274006 272909 271850 270634 269394 268218 266892 265155 263125 261286 259938
52841 259938 258722 256919 254432 252179 251166 251265 251320 250479 248966 247442 246126 244871 243697 242772 242028 241254
52825B41254p12k55L56N56J65l84n91m77m82p72q87l56N24R51O06l4m32n31l94
52806B38105J17R96J937K788L642M171L559J654m64j714k295k932l440l096k098
52791B40930j470j536j547r53j07N12Q28P27o2j217j798j438q37n80k31O97J596
52774B33514J446L89l31L2Q78J159O33o8k86L4M72O98P74R23J097R74L54n57j308
52755B40827j483r62p1N34M63O6j2K61K56l33q98o52L24J217J437J159Q80Q67
52737B43880J080J322J359J050N74M12Q77J709K254K126J533Q79L01k36o39q17
52721B57664j047j682k460k546j541j18P06O44K02j18k48l07k93j05L23Q78J205
52704B51157R80L76o4j63l62r04j247q19o1J0p91j553j514r14l86m3M39J150J804
$$ plain form
52825 241254 240542 240287 240643 241199 241364 240980 240389 239912 239430 238658 237771 237415 237939 238890 239496 239462 239030 238499 238105
52806 238105 238222 239218 241155 243943 247585 251756 255315 256969 256505 254791 252496 249564 246124 243028 240930
52791 240930 239460 237924 236377 235424 235317 235829 236657 237384 237322 236105 234307 232869 232032 231452 231221 231918 233514
52774 233514 234960 235349 235018 235050 235928 237087 237720 237652 237366 237400 237872 238570 239344 240267 241364 242338 242692 242135 240827
52755 240827 239344 238382 238311 238845 239308 239374 239362 239623 239879 239546 238648 237996 238320 239537 240974 242133 243013 243880
52737 243880 244960 246282 247641 248691 249265 249677 250554 252263 254517 256643 258176 259055 259356 259120 258481 257664
52721 257664 256617 254935 252475 249929 248388 248270 248976 249620 249822 249704 249456 249149 248856 248751 249074 249952 251157
52704 251157 252137 252513 252449 252286 251924 251020 249773 248954 248893 248903 248112 246559 245045 244131 243745 243702 244141 245291 247095
52685B47095K118K097J974J946K006J931J513Q09N7n34q56q27m54N0M03N00M39
52668B60267L63L74N21P08P67O57N40M59K18k62o99p50m04J30P12J221J448J349
52650B67619J250J480J948K246K012J057n37k162k919k540j774j428j364r57k56
52635B63675P5j66l91m7P85J728K545L095L266L161L094L345M006M844N130M023
52619C02168J564r39k221k471k856l731m201l513k117r90n22m30l73k97l46o83
52603B78042j238j648j599j171o45j26L44N70N20O41J254J871J731R56M53P04
52587B80659J290J655J643J213M13j91J81J409K394K393J853J548J498J241O87
52572B99886J69j24k32j65Q9L79N02L84O6l12n62o92r98j599k002j648q38m67
$$ plain form
52685 247095 249213 251310 253284 255230 257236 259167 260680 261489 261546 261012 260156 259329 258875 258925 259328 259828 260267
52668 260267 260630 261004 261525 262233 263000 263657 264197 264656 264874 264612 263913 263163 262759 262889 263601 264822 266270 267619
52650 267619 268869 270349 272297 274543 276555 277612 277075 274913 271994 269454 267680 266252 264888 263931 263675
52635 263675 263750 263584 263193 263146 263931 265659 268204 271299 274565 277726 280820 284165 288171 293015 298145 302168
52619 302168 303732 302793 300572 298101 295245 291514 287313 283800 281683 280693 280171 279741 279368 279071 278725 278042
52603 278042 276804 275156 273557 272386 271741 271615 271959 272529 273049 273690 274944 276815 278546 279502 279955 280659
52587 280659 281949 283604 285247 286460 286873 286682 286863 288272 290666 293059 294912 296460 297958 299199 299886
52572 299886 300055 299931 299699 299534 299623 300002 300504 300888 300954 300642 300080 299388 298390 296791 294789 293141 292303 291836
52554B91836p76j075q08k06M28J225K087K216J056p11j705j301q5R42J216Q68
52538B95207M95N37P25L90n43j263j070k65L43M81N35P59R26P23J95k69k67K83
52520B97922J069J633J702J233L58n07o94K5R43J133O84N74J271K124K351K020
52504C13841J636J390J218J100Q54N5j374k789l513l598l530l482l233k614j714
52489B94247q55n56j066j789j612l42Q18P56o5k94M56J328J619J602J751J925
52473B97923J754J339J085J052Q63L46p5J74J045J792J827J419J308J748K336
52458C15936K764L155L492L229J917o4j795k707k909k751k463k160j925j766j664
52443C10289j625j611j491j107m91R5L23J08k86m86m41m32o20q17q35q25j011
$$ plain form
52554 291836 291060 289985 289177 288971 289399 290624 292711 294927 295983 295272 293567 292266 292181 293123 294339 295207
52538 295207 295702 296239 296964 297354 296811 295548 294478 294213 294556 295037 295572 296331 297257 297980 298175 297906 297639 297922
52520 297922 298991 300624 302326 303559 303917 303410 302716 302741 303684 304817 305501 306075 307346 309470 311821 313841
52504 313841 315477 316867 318085 319185 320039 320094 318720 315931 312418 308820 305290 301808 298575 295961 294247
52489 294247 293392 292836 291770 289981 288369 288027 288845 289601 289536 289242 289698 291026 292645 294247 295998 297923
52473 297923 299677 301016 302101 303153 304016 304362 304287 304461 305506 307298 309125 310544 311852 313600 315936
52458 315936 318700 321855 325347 328576 330493 330429 328634 325927 323018 320267 317804 315644 313719 311953 310289
52443 310289 308664 307053 305562 304455 303964 304059 304382 304490 304204 303718 303277 302845 302225 301408 300573 299748 298737
52426B98737j310j440j221n73M19J231J165K80m58l84Q0M51J191K730M203M449
52410C09550L910M087N224O111O254O646P943R354J0004J0114J0013R161P048
52397D05419M089P82l061p310j0627j1745j1028r725q298o434m338k818k238k256
52383C30412k451k578k328j470j62J272K597L484L555L044K807L295M030M508
52369C50015M846N092M785L927L449L828M070L111J489M40Mo59j599k102k088
52354C78608k083j920r36N65J347J029O16R19J560K000K516L544M717N307N206
52339D02995N000N263O091P198Q247R107R733R917R523R112R723J1606J3759J5210
52325E32484J6218J7481J8843J9638J9958K0522K1484K2286K2529K2209K1297
$$ plain form
52426 298737 297427 295987 294766 294193 294612 295843 297008 297288 296830 296446 296526 296977 298168 300898 305101 309550
52410 309550 313460 317547 322771 328882 335136 341782 349725 359079 369083 379197 389210 398371 405419
52397 405419 409508 410290 407229 399919 389292 377547 366519 356794 348496 342062 337724 334906 332668 330412
52383 330412 327961 325383 323055 321585 321423 322695 325292 328776 332331 335375 338182 341477 345507 350015
52369 350015 354861 359953 364738 368665 372114 375942 380012 383123 384612 385052 385056 384397 382798 380696 378608
52354 378608 376525 374605 373669 374234 375581 376610 377226 378145 379705 381705 384221 387765 392482 397789 402995
52339 402995 407995 413258 419349 426547 434794 443901 453634 463551 473074 482186 491909 503515 517274 532484
52325 532484 548702 566183 585026 604664 624622 645144 666628 688914 711443 733652 754949
52314G54949J9933J8832J8562J8613J8100J7178J6698J6667J6198J5048J4007
52303I44785J3532J3118J2341J1474J0683R561P951O412N411M679L731K410O48
52290A046736j690m368o685q146q775q743q330q157q664r176q366n967l198j207
52276I55264J38J487K930M272N692P429R186J0438J1154J1814J2848J4280J5692
52263A062624J6473J6345J5740J5254J4878J4182J3162J2279J1614J0791R802
52252A213144R205R241R358Q903P740O052M099K174K80k179n583r021j0935j1034
52238A231444j0660j0925j1511j1633j1274j0744r949q798p709p019o397n448
52226A119377m406l662l153k752k632k694k194p10J097K322L008L687M263M282
$$ plain form
52314 754949 774882 793714 812276 830889 848989 866167 882865 899532 915730 930778 944785
52303 944785 958317 971435 983776 995250 1005933 1015494 1023445 1029857 1035268 1039947 1043678 1046088 1046736
52290 1046736 1045046 1040678 1033993 1025847 1017072 1008329 999999 991842 983178 974002 965636 959669 956471 955264
52276 955264 955402 956889 959819 964091 969783 977212 986398 996836 1007990 1019804 1032652 1046932 1062624
52263 1062624 1079097 1095442 1111182 1126436 1141314 1155496 1168658 1180937 1192551 1203342 1213144
52252 1213144 1222349 1231590 1240948 1249851 1257591 1263643 1267742 1269916 1270196 1268017 1262434 1253413 1242478 1231444
52238 1231444 1220784 1209859 1198348 1186715 1175441 1164697 1154748 1145950 1138241 1131222 1124825 1119377
52226 1119377 1114971 1111309 1108156 1105404 1102772 1100078 1097884 1097174 1098271 1100593 1103601 1107288 1111551 1115833
52212A115833M066M507N802P131P814Q066Q400Q846R103R054Q790Q253P210N669
52198A218544M162L426L688M451N105N516N728N428M277K713J689J541J650J474
52184A269392J175J006N88o58k707m930o727p915q753r717j0962j1915j1755j0372
52170A185750q472o718n281m183l469k833j745k17J148K053K852L790M576N038
52156A172289N418N703N358M175K756J600M54r16j986k241k060k088k163j632
52142A184667m31Q19J557J561Q19k72q94n96R9M87P69J735L590N772P834R836
52126A217352J1935J4105J6372J8860K1526K4150K6595K8755L0391L1263L1472
52115A472776L1379L1185L0722K9631K7729K5297K2910K0737J8237J4962J1471
$$ plain form
52212 1115833 1119899 1124406 1130208 1137339 1145153 1153219 1161619 1170465 1179568 1188622 1197412 1205665 1212875 1218544
52198 1218544 1222706 1226132 1229820 1234271 1239376 1244892 1250620 1256048 1260325 1263038 1264727 1266268 1267918 1269392
52184 1269392 1270567 1271573 1272161 1271503 1268796 1263866 1257139 1249224 1240471 1230754 1219792 1207877 1196122 1185750
52170 1185750 1177278 1170560 1165279 1161096 1157627 1154794 1153049 1152832 1153980 1156033 1158885 1162675 1167251 1172289
52156 1172289 1177707 1183410 1188768 1192943 1195699 1197299 1197753 1196837 1194851 1192610 1190550 1188462 1186299 1184667
52142 1184667 1184236 1185055 1186612 1188173 1188992 1188720 1187826 1187230 1187329 1187816 1188585 1190320 1193910 1199682 1207516 1217352
52126 1217352 1229287 1243392 1259764 1278624 1300150 1324300 1350895 1379650 1410041 1441304 1472776
52115 1472776 1504155 1535340 1566062 1595693 1623422 1648719 1671629 1692366 1710603 1725565 1737036
52104A737036Q797P033N296L197J416N61L07J52R4N5n63j948l332m080m759o279
52088A742983q566j0887j2986j5015j6735j7577j7252j5677j2748q908n356k908
52076A598368j021J240L798O007P868R687J1064J1584J2148J4131J7144J9110
$$ plain form
52104 1737036 1745833 1752866 1758162 1761359 1762775 1763336 1763643 1763795 1763889 1763944 1763381 1761433 1758101 1754021 1749262 1742983
52088 1742983 1734417 1723530 1710544 1695529 1678794 1661217 1643965 1628288 1615540 1606632 1601276 1598368
52076 1598368 1597347 1598587 1602385 1608392 1616260 1625947 1637011 1648595 1660743 1674874 1692018 1711128
$$ [...]
##END NTUPLES=NMR SPECTRUM
##END=
