
##TITLE=AC1337_BRAAS10080_6528710_QpMuhVfFTn
##JCAMPDX= 6.0         $$ Bruker NMR JCAMP-DX V2.0
##DATA TYPE= NMR SPECTRUM
##DATA CLASS= NTUPLES
##ORIGIN= BRUKER
##OWNER= Administrator
$$ 1.72 TOPSPIN		Version 2.1
$$ 2012-07-15 16:03:34.750 -0500  Administrator@TOPSPIN
$$ Compression mode = diff/dup
##.OBSERVE FREQUENCY= 400.02188249412
##.OBSERVE NUCLEUS= ^1H
##.ACQUISITION MODE= SIMULTANEOUS (DQD)
##.ACQUISITION SCHEME= undefined
##.AVERAGES= 8
##.DIGITISER RES= 22
##SPECTROMETER/DATA SYSTEM= spect
##.PULSE SEQUENCE= zg30
##.SOLVENT NAME= COFFEE_meoh
##.SHIFT REFERENCE= INTERNAL, COFFEE_meoh, 1, 14.98509
##AUDIT TRAIL= $$ (NUMBER, WHEN, WHO, WHERE, PROCESS, VERSION, WHAT)
$$ ##TITLE= Audit trail, TOPSPIN		Version 2.1
$$ ##JCAMPDX= 5.01
$$ ##ORIGIN= Bruker BioSpin GmbH
$$ ##OWNER= Administrator
$$ $$ C:\Bruker\TOPSPIN/data/COFFEE/nmr/AC1337_BRAAS10080_6528710_QpMuhVfFTn/10/pdata/1/auditp.txt
$$ ##AUDIT TRAIL=  $$ (NUMBER, WHEN, WHO, WHERE, PROCESS, VERSION, WHAT)
(   1,<2012-07-15 16:03:27.578 -0500>,<Administrator>,<TOPSPIN>,<go>,<TOPSPIN 2.1>,
      <created by zg
	started at 2012-07-15 16:02:21.015 -0500,
	POWCHK enabled, PULCHK disabled,
       configuration hash MD5:
       6B 1B 68 BB D9 2E 58 E2 7F 35 AD 54 07 DF 0E 41
       data hash MD5: 64K
       F1 68 AB 5A 1B ED 5E A4 FD 62 F9 63 27 80 F9 96>)
(   2,<2012-07-15 16:03:30.546 -0500>,<Administrator>,<TOPSPIN>,<proc1d>,<TOPSPIN 2.1>,
      <Start of raw data processing
       efp LB = 0 FT_mod = 6 PKNL = 1 PHC0 = 0 PHC1 = 0 SI = 32K 
       data hash MD5: 32K
       59 81 B5 A9 5F 28 F2 B0 FC CA D9 72 83 BA 96 31>)
(   3,<2012-07-15 16:03:30.859 -0500>,<Administrator>,<TOPSPIN>,<proc1d>,<TOPSPIN 2.1>,
      <pk PHC0 = 175.7483 PHC1 = 0 
       data hash MD5: 32K
       F1 F1 EA 6D 3E 5A C2 25 5B 9A 20 15 5E D4 D5 CB>)
(   4,<2012-07-15 16:03:31.031 -0500>,<Administrator>,<TOPSPIN>,<proc1d>,<TOPSPIN 2.1>,
      <abs ABSG = 1 
       data hash MD5: 32K
       26 2D 2C C6 6D 9C F7 26 00 EB 25 73 31 B0 8E E8>)
(   5,<2012-07-15 16:03:31.171 -0500>,<Administrator>,<TOPSPIN>,<proc1d>,<TOPSPIN 2.1>,
      <abs ABSG = 2 
       data hash MD5: 32K
       A8 BC EB 0A 3F AE 6A 30 77 55 45 5E 77 F9 86 28>)
(   6,<2012-07-15 16:03:31.203 -0500>,<Administrator>,<TOPSPIN>,<proc1d>,<TOPSPIN 2.1>,
      <abs ABSG = 3 
       data hash MD5: 32K
       01 FD 3D 4C DE 22 6A EC 5A CF 5C 7C 7D C8 E0 00>)
(   7,<2012-07-15 16:03:31.234 -0500>,<Administrator>,<TOPSPIN>,<proc1d>,<TOPSPIN 2.1>,
      <abs ABSG = 4 
       data hash MD5: 32K
       D4 A7 39 5D EF C4 76 0C 00 F6 D8 A4 E8 5F 28 A0>)
(   8,<2012-07-15 16:03:31.265 -0500>,<Administrator>,<TOPSPIN>,<proc1d>,<TOPSPIN 2.1>,
      <abs ABSG = 5 
       data hash MD5: 32K
       28 7B 68 6D 45 1D 2C 1C 18 6A 67 AA 6F 13 FF CF>)
$$ ##END=
$$ 
$$ $$ hash MD5
$$ $$ 16 10 6E 6A 71 A5 F7 03 DA 37 02 36 CA 1A 49 17
##$RELAX= 
##$RELAX= 
##$RELAX= 
##$RELAX= 
##$RELAX= 
##$RELAX= 
##$RELAX= 
$$ Bruker specific parameters
$$ --------------------------
$$ [...]
##$TP= (0..7)
150 150 150 150 150 150 150 150
##$TP07= 0
##$TPNAME0= <>
##$TPNAME1= <>
##$TPNAME2= <>
##$TPNAME3= <>
##$TPNAME4= <>
##$TPNAME5= <>
##$TPNAME6= <>
##$TPNAME7= <>
##$TPOAL= (0..7)
0.5 0.5 0.5 0.5 0.5 0.5 0.5 0.5
##$TPOFFS= (0..7)
0 0 0 0 0 0 0 0
##$TUNHIN= 0
##$TUNHOUT= 0
##$TUNXOUT= 0
##$USERA1= <user>
##$USERA2= <user>
##$USERA3= <user>
##$USERA4= <user>
##$USERA5= <user>
##$V9= 5
##$VALIST= <valist>
##$VCLIST= <CCCCCCCCCCCCCCC>
##$VD= 0
##$VDLIST= <DDDDDDDDDDDDDDD>
##$VPLIST= <PPPPPPPPPPPPPPP>
##$VTLIST= <TTTTTTTTTTTTTTT>
##$WBST= 2048
##$WBSW= 25
##$XGAIN= (0..3)
0 0 0 0
##$XL= 0
##$YL= 0
##$YMAX_a= 508776
##$YMIN_a= -650158
##$ZGOPTNS= <>
##$ZL1= 120
##$ZL2= 120
##$ZL3= 120
##$ZL4= 120
##$ABSF1= 14.98509
##$ABSF2= -5.573092
##$ABSG= 5
##$ABSL= 3
##$ALPHA= 0
##$AQORDER= 0
##$ASSFAC= 0
##$ASSFACI= 0
##$ASSFACX= 0
##$ASSWID= 0
##$AUNMP= <proc_prof1d_extract_pilot.lims>
##$AXLEFT= 0
##$AXNAME= <>
##$AXNUC= <1H>
##$AXRIGHT= 0
##$AXTYPE= 0
##$AXUNIT= <>
##$AZFE= 0.1
##$AZFW= 0.1
##$BCFW= 0
##$BC_mod= 0
##$BYTORDP= 0
##$COROFFS= 0
##$CY= 15
##$DATMOD= 1
##$DC= 0
##$DFILT= <>
##$DTYPP= 0
##$F1P= 0
##$F2P= 0
##$FCOR= 0.5
##$FTSIZE= 32768
##$FT_mod= 6
##$GAMMA= 0
##$GB= 0
##$INTBC= 1
##$INTSCL= 1
##$ISEN= 128
##$LB= 0
##$LEV0= 0
##$LPBIN= 0
##$MAXI= 10000
##$MC2= 0
##$MEAN= 0
##$ME_mod= 0
##$MI= 0
##$NCOEF= 0
##$NC_proc= -8
##$NLEV= 6
##$NOISF1= 0
##$NOISF2= 0
##$NSP= 0
##$NTH_PI= 0
##$NZP= 0
##$OFFSET= 14.98509
##$PC= 1
##$PHC0= 175.7483
##$PHC1= 0
##$PH_mod= 1
##$PKNL= yes
##$PPARMOD= 0
##$PPDIAG= 0
##$PPIPTYP= 0
##$PPMPNUM= 2147483647
##$PPRESOL= 1
##$PSCAL= 4
##$PSIGN= 0
##$PYNMP= <proc.py>
##$REVERSE= no
##$SF= 400.02
##$SI= 32768
##$SIGF1= 0
##$SIGF2= 0
##$SINO= 400
##$SIOLD= 32768
##$SPECTYP= <>
##$SREGLST= <1H.CDCl3>
##$SSB= 0
##$STSI= 32768
##$STSR= 0
##$SW_p= 8223.68421052631
##$SYMM= 0
##$S_DEV= 0
##$TDeff= 65536
##$TDoff= 0
##$TI= <>
##$TILT= no
##$TM1= 0
##$TM2= 0
##$TOPLEV= 0
##$USERP1= <user>
##$USERP2= <user>
##$USERP3= <user>
##$USERP4= <user>
##$USERP5= <user>
##$WDW= 1
##$XDIM= 32768
##$YMAX_p= 470398971
##$YMIN_p= -694556
##$CURPLOT= <Network HP LaserJet P1505>
##$CURPRIN= <$Network HP LaserJet P1505>
##$DFORMAT= <normdp>
##$LAYOUT= <+/1D_H.xwp>
##$LFORMAT= <normlp>
##$PFORMAT= <normpl>
##$SURQMSG= 1
$$ End of Bruker specific parameters
$$ ---------------------------------
##NTUPLES= NMR SPECTRUM
##VAR_NAME=  FREQUENCY,     SPECTRUM/REAL,   SPECTRUM/IMAG
##SYMBOL=    X,             R,               I
##VAR_TYPE=  INDEPENDENT,   DEPENDENT,       DEPENDENT
##VAR_FORM=  AFFN,          ASDF,            ASDF
##VAR_DIM=   32768,         32768,           32768
##UNITS=     HZ,            ARBITRARY UNITS, ARBITRARY UNITS
##FACTOR=    0.250966925370066, 1,           1
##FIRST=     8223.43324360094, 10205,        6202
##LAST=      0,             86530,           -45550
##MIN=       0,             -694556,         0
##MAX=       8223.43324360094, 470398971,    0
$$ Real data points
##PAGE= N=1
##DATA TABLE= (X++(R..R)), XYDATA
$$ [...]
23844 -196070 403374 -82814 -23655 98852 109433 -229418 -104980 -144120 -237850 128707 -226672
23832 29279 -107934 -372882 -24888 -33939 169956 -42683 19978 43379 -60396 101958 -326587
23820 144313 -479703 3445 50725 -4585 -358246 184599 -29031 -206330 -63489 -105782 59613
23808 113368 -22266 -99379 -27769 25223 -70955 22808 117773 -72722 -232655 253453 50520
23796 -19142 210540 72767 145341 149083 -155207 -228951 -266427 199110 -255683 43875 370982
23785 370982 35763 -315739 82140 -28957 135230 -415278 -237708 -193511 -33056 -98818 -30754
23773 45112 -232971 -198156 -310603 -145180 -159704 -632 21314 -99 71706 -250737 241792 32965
23760 -236030 164850 -302621 205685 -188095 -354366 -17457 199217 181212 373153 -6709
23749 370241 208106 -159074 220193 80211 -110153 70072 318036 -185512 -145249 6493
23738 -189762 -278730 -66418 -152002 -92628 -214255 242073 147946 -72414 -85498 82599 -124391
23726 82024 -372080 -28505 103247 78796 -84288 -217127 -100363 152795 171163 29983 -208131
23714 -139642 -27847 -249863 -238054 188967 -33950 -54190 2500 207618 -20054 176276 17640
23702 61062 -123304 94188 -102479 -306150 -34966 35553 -151918 -89958 -150272 -67189 -31334
23690 -189037 20696 55268 38794 325337 231709 -50 -264521 329501 92389 -55454 48148
23678 -18150 258664 190639 408311 76298 -106312 177903 -102491 -17878 -28813 -240885
23668 -240885 -104520 -257596 179785 -178164 154850 5357 -14104 195742 35102 -32074
23657 -245607 -7567 140177 -159935 79138 -221068 17261 -218882 -263672 214239 151569 -43728
23645 -168264 219623 -350762 -112507 419266 39480 323780 85051 -119251 -133426 164374
23634 -18318 36537 32338 234599 74273 152139 -58861 -276943 -47440 -91678 94200 -101851
23622 -280264 11250 -290712 -107353 -66913 -159082 -22500 -146297 -111323 -278935 233424
23611 -138938 142066 193749 -428713 252402 -210696 -62918 105896 179690 -387931 45442
23600 -67328 22705 35780 -164652 16984 -19393 145599 181724 123527 88630 178960 124168
23589 124168 -2870 -25384 396431 -44427 -290449 181233 84329 -15920 -310968 322192 38695
23577 -207942 77764 -162597 37347 -41664 -71129 306710 -10927 138738 79056 -150133 7182
23565 77864 -124441 -27260 -108852 53446 126988 5913 17034 156180 -170553 25214 166859
23554 166859 32324 -95187 52986 17498 64626 -53381 -281251 -128284 -146328 -385701 89168
23542 29467 -38113 132601 145182 -94054 -26474 -150318 -123316 116628 36391 35803 -153104
23530 -4819 -94827 -82093 -315548 15589 2858 -109845 -272472 181509 -46193 62632 -236140
23518 -243194 -145470 -131629 26577 85797 14904 2422 -177784 -37263 -91952 69063 -9681 82930
23505 -131279 39650 -157202 43749 -22411 -239149 -143851 -8686 -65577 104198 37972 -226732
23493 62887 25617 67913 135146 -356982 -415142 -233479 77599 132072 179822 -63667 -118378
23482 -118378 31780 -334273 44837 -111705 68838 141047 202539 -426974 125738 -129063
23471 -72200 237020 1092 83530 34593 154297 168591 -423875 -104980 -161425 -45795 106790
23459 268950 -22483 -352867 33770 60852 30628 71990 -28475 -28773 -45642 68770 11607 78194
23447 78194 70130 -79305 63493 76440 226635 3540 -17571 -279049 -162437 324861 -378168
23435 -138839 -8492 216472 -242481 -4349 -39966 -72967 275598 -435399 -114106 -68183 -122851
23424 -122851 -92631 -191902 -180631 -101182 -45854 117288 -86254 171057 65571 -125434 105816
23412 33804 -193002 56277 -38717 30611 30902 49508 -57290 -122507 -173056 261150 -152600
23400 244004 852 84444 -232509 -108340 170502 -237146 248292 70987 -28828 -586213 57372
23388 -19733 304176 -358723 -78433 100665 -325710 40197 -142744 -41456 94078 2392 105285
23377 105285 -549008 -191116 -31119 -42880 315739 224313 126724 -55475 319706 14491 66262
23366 66262 77936 -11808 111213 -98182 215058 98590 80423 -211766 340165 135088 171762
23355 171762 -159566 -100107 -230869 99345 -96962 97569 -47768 -496470 -103201 64424 95861
23344 95861 -198031 107687 163930 -4484 228396 92944 -22223 -214511 -69142 -10714 38434
23332 322159 -115404 4791 61116 -121028 15110 -105610 -46892 -361713 -81358 170619 -125578
23320 -181505 -7602 -318122 -73013 -239580 -1911 137902 99483 -150677 271729 -47972 -303398
23309 -303398 -92410 112954 -56213 116701 -145708 -201155 32792 -89373 -94569 -66290 -529803
23298 -529803 20448 -97437 -194556 -378491 -80842 -19446 -234375 -358659 99309 -132800 -148358
23287 -148358 211511 -202492 -4876 240014 10362 -167838 -284546 -25730 18206 255615
23277 255615 -142701 370057 56105 11730 94777 13668 32084 -231131 168902 -207267
23266 -106431 437476 140736 -239281 -89972 -279651 36896 -21048 -14952 -233709 103833
23255 -102805 60727 155944 191138 -122799 -75544 -268840 -115692 -514738 -113681 601707
23244 -58573 80700 -31235 -236392 79582 81107 275815 188140 213477 231057 -48708 -41449 211456
23231 61485 207398 -216231 -84175 -67866 -220968 -228000 -282511 362088 303038 92337 118432
23220 118432 -105881 140481 -326328 21701 105057 -29290 -81599 74316 80699 46803 -19520
23208 99803 -208456 109515 67973 -212093 360201 -315117 -36043 45320 -58081 21093 -172493
23196 149743 -309241 -27954 -242114 -170360 -88007 -463704 227664 -126396 -271866 -67765
23185 -70792 -111465 -70968 -242131 59002 3927 -189824 95489 -248162 -67899 185284 -68201
23173 -73541 -129341 195153 -60927 -48772 -49208 49654 74713 148158 -23347 176076 84581 33936
23160 102208 -504881 76608 -53973 323752 210749 -17277 -142468 -38381 -61824 190167
23149 228052 56980 -14959 -179395 33064 237194 46536 165474 139145 93954 137076 27952
23137 165372 29078 -98358 -214917 -64420 -7722 -248 242756 -158421 -17132 29146 219748
23126 219748 -204403 274458 265217 63658 -208580 122287 -18092 -57486 90876 -191867 -58458
23114 239052 173787 -106064 -13229 -310924 118079 -222230 105808 -369572 333812 20664
23103 -185717 -137969 -223703 231694 17632 -49735 117667 -140266 -116715 -42092 69854 -68874
23091 58056 418961 188534 -104664 -324315 19690 -119235 -59504 -233816 139230 -34655
23080 -162068 272612 -126594 -26466 129986 164462 85139 -284895 134134 -19288 -111102
23070 -111102 -305105 -234083 -374606 316788 8714 68481 -64457 226431 193417 103633 108500
23059 108500 137653 -130643 53765 210000 -18873 -145207 38689 -38397 -58225 -155237 -192078
23048 -192078 -144550 -70581 20201 184843 69137 110657 -87099 -40781 -131541 -73803 -62023
23037 -62023 -57434 -280843 80567 43293 -58743 -21875 3043 331631 -59684 -215400 -229340
23026 -229340 -270534 199788 112272 -140422 -282557 -318891 58813 -185938 -135634 -637989
23016 -637989 -126526 145674 -14259 -35991 -93249 94849 -80385 26870 207812 -227852 -267751
23005 -267751 141876 64178 291704 156970 -69807 173168 -64994 -84957 191194 263437
22995 263437 222810 151572 329755 -313253 221 161515 -143298 -114106 42059 -265089 165606
22983 -104871 -158927 -245595 -225477 75269 -63386 -9756 -19943 -140876 87311 -381253 19118
22971 213722 -343109 -343999 397416 -24856 -77541 -150541 53761 -126634 180258 -33199 -403405
22960 -403405 148364 -146256 -23948 -176440 35043 182461 -156534 -102917 -86743 -249170
22950 -249170 42237 -373671 -128075 57305 168881 -15930 28448 342002 127229 -120302
22939 301150 -17464 -194183 -127683 -123852 -45218 261177 94641 331364 -172781 188160 46600
22927 -76165 3902 -234068 56644 -192548 14651 55802 -2928 -62360 13438 26842 -235190
22915 -60109 237011 -18178 -19758 167320 -124079 -158192 -226972 54974 201268 -88158 175552
22903 56571 38356 -98940 -71764 -98954 -14342 -98650 136290 -113668 56337 -28243 -538010
22892 -538010 -10402 -470443 57091 106767 -466454 -65972 74081 -60573 121246 53479 -82891
22880 -496424 125372 -4584 -249290 -90133 -118156 224012 -275971 146512 173767 209073 8951
22868 106161 357577 -20091 -40279 13019 -56940 14483 -69636 -198348 8351 68491 -184221
22856 -296952 -107037 180190 -211296 -43088 -375347 -71837 -9115 78508 12837 -7314 208536
22844 153615 13847 -319441 188229 -15957 -162019 -170382 149423 -71809 -153145 -107393 -105484
22833 -105484 -67475 -31227 -144788 -267966 288691 22427 175803 -258958 -171852 219561
22822 -93015 -58726 -163196 -78805 -371820 38528 232755 262709 96390 -173431 33584 -57138
22810 179218 -203355 137340 185248 25625 333281 -30128 135803 145685 -63777 -799 4826
22798 180376 -106126 -58267 73256 46329 225088 -142461 111445 -86037 200937 -150064
22787 -360101 -74896 -1161 -32623 -119392 -4697 69882 -295226 9718 -102791 -137497 107273
22775 451926 118786 -15940 -94798 -132111 -299846 -99641 -138155 142510 -396158 -142468
22764 -188202 -62522 1562 -127413 162943 -159117 243674 25214 -92041 11755 -213693 258779
22752 -108169 16295 180657 -101555 -189545 58887 51466 3692 17076 127593 -196511 -218254
22741 -218254 -455864 -78082 -161816 37996 150549 192736 9884 -109068 204036 60188 -274870
22729 -210404 528 -515615 171934 101121 38255 212175 69907 -61211 -196458 79731 -46096
22717 -77651 205058 -114693 140884 91944 89521 76059 -33399 137142 193833 -132251 -173746
22706 -173746 80997 -57009 158381 -78626 205949 -238285 -490296 -218392 35049 1257 6140
22695 6140 -29045 -300253 150092 -169045 -382639 -120496 -169720 -159103 60358 -165543 -283407
22684 -283407 -246591 -46006 -261275 49399 11782 -142021 -210596 -61961 -106635 -426300 242256
22672 -109995 -108709 39561 352216 245983 -164007 -56346 -111111 -255287 151808 179399 -153293
22660 -162783 -32765 -76772 -30504 -190746 -297181 -151523 29910 -257673 -401048 -124999
22649 -245297 174161 204594 -49637 321524 586875 33476 63162 61606 80441 -97021 -64102
22638 -64102 -351699 -95213 115532 -47976 -174900 -26940 5408 32696 -231016 -1066 49607
22626 -152910 330762 188435 -123605 -213198 -30313 -50909 -152456 -44254 246372 -226623
22615 197765 49436 105319 -174076 -241374 41246 -176317 85253 -33131 -107727 -387632 192755
22603 -186808 -110333 43511 -17433 119343 -125541 -226872 204251 124623 -314267 13935
22592 155200 195064 -195765 52875 147629 -9405 -24043 -176678 -69450 -134322 126379 110721
22581 110721 67952 70297 236207 -95424 -263981 -140137 83479 29025 -11417 41066 -28075
22569 -156518 147709 -27090 -84607 -141174 -61612 -58460 -6840 -453174 -175906 164611 -208218
22557 240687 -152643 -123019 -16984 -211295 22904 -310595 121037 214963 141429 -160710
22546 4100 211864 -71100 -36898 44116 43409 156092 -227660 158095 161668 41610 -197207
22534 -140108 -162874 104107 -120122 89630 -229904 -481877 96614 -108098 68465 19860
22523 -153983 -107720 83224 124283 -68714 116521 -117358 151701 10136 119200 342331
22513 342331 -50238 -165288 -149562 -59635 -55451 -107180 218907 -91110 256054 -238702 286
22501 88429 176317 -48322 19712 24541 67805 112813 142699 73319 19787 42018 108224 -234200
22488 20487 -52582 198749 -48048 -41749 197795 33382 122322 70014 -237546 -379068 -117297
22476 -213708 -299722 -62093 59077 23808 -290676 -154058 -49137 293140 141477 200484 134093
22465 134093 93438 125766 -98789 27822 -145885 -256156 -52416 12949 -258198 80346 -393553
22453 -299047 -173794 53376 -15773 151401 114342 -73851 -230815 -211052 18363 -84201 -6248
22441 -193622 98855 -158310 3192 297159 -9071 114075 245027 259101 257273 -79207 212617
22429 -72325 108109 75262 -73452 -4625 -9837 131055 74477 -195347 163167 82701 80271
22418 80271 -414506 144540 -242903 -234003 239374 -46045 -108981 -7888 -123245 14021 144637
22407 144637 230463 272329 -261393 192404 -196161 -138414 -184890 99103 -122318 -114807 -57881
22396 -57881 103320 19055 -332654 216041 -86739 -175840 -85369 -50175 82757 -189126 -192542
22385 -192542 170960 14909 -284849 127513 239065 80063 12729 -92296 186843 -83863
22374 -112852 -149411 -72931 -311076 130423 -180127 -209523 -4796 58191 -335783 -187615 331698
22362 -32971 -44655 -284350 -141930 84 -605075 117938 -164572 237648 -280541 7481 -190172
22350 -41314 -21232 58629 -39287 50000 -179975 -86766 163081 -211807 -194121 138648 180996
22339 180996 -313712 -83885 39086 156240 -86430 194079 -359090 -91395 6352 -247374 54653
22327 -105977 69643 16378 25339 11175 43223 70236 291307 -286919 -54642 -103534 -83258
22316 -83258 -70944 261069 -177175 98916 222097 174073 -304054 -77826 84849 -19630 -203343
22305 -203343 27054 -64675 270556 -49881 -176284 335552 123803 122335 -40726 -177032 -215269
22294 -215269 26132 -197051 23995 51834 28180 19961 -78568 15368 -169192 -242738 -122756
22283 -122756 224759 -37754 24650 -329370 23760 -104695 -171109 -65506 143167 -60225 -100830
22272 -100830 -81583 -187045 -5420 -135963 -386938 18002 -73156 278514 111871 -203685
22261 78997 -80310 94284 128293 -172344 -13454 -227032 29048 189472 -89908 284390 263303
22250 263303 43536 83221 114029 -92459 -382086 44558 -262413 312589 89742 -213037 -76423
22238 -179067 39059 -150498 -412515 -124916 114449 -140787 -131257 143471 90621 330714
22228 330714 70877 -142727 -138911 -13669 -240278 163420 294051 -47674 -110778 -84515 29447
22216 -148055 13270 472154 -109664 -39064 -194688 -239871 -36977 84906 -317952 -73146 81637
22204 -321411 -417498 -413998 -142285 -209883 219848 73195 -122354 -50127 204094 166936 61826
22192 -194378 -227708 106458 -11186 -17321 -154469 88080 259653 -196233 -74582 238966 179724
22181 179724 -7376 -74600 -117258 -182841 186479 219815 122456 -169604 -50639 -6408 -108255
22170 -108255 -150222 -167503 153083 -71406 40390 -258787 -99289 -437249 43384 44646 -146203
22158 146740 -17730 -78447 99804 222682 170428 -13876 97331 130090 118454 44319 -243013
22146 -83253 -212227 125609 4047 -89154 15087 69005 57417 41955 -3004 84526 -330294
22134 223867 -380070 -88466 -236262 -71088 -148102 -48365 291540 51840 -151545 -265538
22124 -265538 -83299 140220 -160065 -60510 92167 237156 91579 -148421 -96798 56193 188663
22113 188663 -33846 34160 68739 139588 -188801 -266204 165093 206691 -56093 232835 -260921
22101 -147510 18807 -241772 -248981 -18369 69485 220855 151637 -275326 186822 10649 -457724
22089 -231793 154256 139541 146602 -124259 25243 -21768 98394 -119934 -59461 123136 71303
22078 71303 -177274 44687 10607 60042 -109662 -15050 -129469 77263 -26620 -360578 329027
22066 -246296 227531 1526 -50787 131600 -237202 31688 145236 56592 -445301 -41312 -90690
22055 -90690 -209615 -203705 224106 173316 -176152 -176291 -191995 -16394 -15622 -241915 138851 -1513
22042 -174331 239192 -118026 -214758 29536 213357 144906 -189213 72795 107931 -123549
22031 49146 -162647 105165 48449 92603 -181784 -129473 -255106 -67476 10708 132555 140793
22020 140793 -225923 -177559 -214993 -28835 -174599 35015 -115207 31187 142884 128956 -54456
22008 73323 310203 216907 -114355 -183596 186742 -186096 -169252 -226758 -345761 253645
21997 -205162 -91927 -48530 35241 173101 -39559 32558 127834 -10848 166617 -106736 -379675
21986 -379675 -25486 220035 -29561 -250126 -235218 74527 320104 -159481 175626 22785
21975 190797 -228378 -63774 -59714 -225649 -32790 149401 -17503 -245415 -134772 84722 -74247
21963 -198438 -499713 -7580 249980 -103719 -79671 -103699 185743 110982 260308 91464 -95754
21951 -235396 211993 -80932 -561114 -365743 154033 266226 -5777 5801 -6014 15166 -104568
21939 -134931 -139800 64114 -154891 45701 -261638 191954 -146878 -64283 -90563 -27337 -260475
21928 -260475 -26500 111884 87254 336513 88153 303868 -213051 48048 -205011 101050
21917 -400044 43848 49943 -94784 172542 -108745 -94592 69771 -29721 -116337 -151985 -39596
21905 -137983 155105 -99020 -5729 68657 -216499 275454 -220098 76752 -121509 -50757 -261877
21894 -261877 95386 -184971 -183652 -88939 -194818 64907 236490 -8909 182778 76715 -53280
21882 -72536 -381002 37167 146805 -118219 233952 -127988 -135923 139814 -238454 7184 -243866
21870 -426182 -67760 170373 -319017 -186333 -157273 56108 201461 -398766 -227631 295786
21859 -98039 -288041 98340 -116802 290321 -133330 41889 61896 -208842 -143360 -8641 -35712
21848 -35712 -156090 -273997 -136933 -18099 34840 81740 200864 -259943 -157962 326515
21837 -441251 245820 19310 -36886 342 136744 92446 198253 67637 275006 51506 184593
21826 184593 -24761 84440 -393761 -100946 -47500 -21465 -204872 -322430 -222481 -189635 -494661
21815 -494661 2802 -148920 -72362 -437964 -57604 335914 218368 1487 194015 432556 -44567
21803 226167 98164 -21536 -112140 -76441 411255 -108522 -208663 -121297 -168741 30885 -348861
21791 310973 -244466 -293076 -68599 -101482 -31393 -129706 90915 172013 207526 83530 -27886
21779 -234185 -34763 -63127 -148352 17182 167014 380085 -66719 -241746 22390 -104957 -176040
21768 -176040 -175158 95560 -349772 -347860 166438 -21312 39047 -195158 268811 -50401 122198
21756 196559 -282002 -11466 228094 117246 287089 1196 136361 -6487 225246 -198792
21745 318815 271629 -31215 219425 -365391 -221243 -73369 11996 -72355 -16962 -18436 -382513
21734 -382513 -177392 -75220 203446 57070 151143 170338 -292704 -23349 -160679 52175 10629
21722 -1081 216 88509 -136358 -105995 232844 -292622 -241782 -15978 -316821 -23909 147047
21710 -208934 -269395 113426 -118984 -304421 -3076 4074 -186637 175124 16645 -64447 34196
21698 123052 -266093 94743 122793 -218586 -314446 343054 121022 -394998 -65350 -158577
21688 -158577 -367140 -167612 -89260 -133068 233155 294248 116041 -185295 156611 39371
21677 180568 -11048 86636 -192172 143742 -353753 -51080 192932 165318 2082 -112266 -59544
21666 -59544 -256488 67368 -42395 -236001 44835 -78735 20758 36001 266118 91360 -24875
21654 208886 -65681 -132765 -53069 -410210 -63396 -480609 -200964 -132080 193980 71594 210698
21643 210698 -8511 -76296 -234406 -28370 -186323 -117406 68756 -294012 -119421 -232398 -181661
21632 -181661 -26424 -32851 -115498 216942 -47715 10905 -211860 -37171 77482 15339 210887
21621 210887 -9356 167819 163027 -575041 148324 177727 -4893 -237971 156436 -259079 78177
21609 -207490 -52225 27288 -48962 -451365 248470 138385 60752 -143446 237610 -185173
21598 345288 -466331 85657 -43785 -134022 -1661 24795 -67340 -224302 -35392 -129581 -149853
21587 -149853 -160697 -251139 83186 -232853 -17619 -11851 64831 50035 179564 -108223 -304490
21576 -304490 25296 -39229 -367327 -210367 -264568 -251073 165509 66927 224773 -65624 -164498
21565 -164498 13644 97883 180358 -2976 -202852 124555 86309 -270129 118218 -113861 -279076
21554 -279076 143226 87426 158304 -92648 117565 -156044 -125651 -178106 -78217 -122649 -3844
21542 -96493 53734 -95731 56415 148713 -32741 -99816 -283982 -80406 28836 7001 108803
21531 108803 -30904 193038 247781 -221658 93491 -300459 221235 -68658 -51054 177328
21520 -236255 -264543 -424864 8862 -160254 -271793 -105792 -100652 85736 -449758 -488598 50406
21508 201872 -92625 93426 6444 -107721 46835 56897 -42182 -186388 -221219 -58505 -309841
21497 -309841 186857 119830 28093 -197806 79722 140445 98450 248877 -328036 -125557
21486 194441 132528 -403764 -335882 93543 -186243 96096 190922 320496 -63404 -489556 -159925
21474 -412758 41508 -51001 35263 80366 -61904 -174923 177298 -8327 -108553 114036 -71986
21462 -198417 276841 121088 -28559 -378435 -131796 34654 -217858 60195 240973 119784
21451 -112198 -336036 3267 36289 -273809 -185650 -294153 131655 -39575 -121394 241196 329004
21440 329004 -875 -6480 -133484 193766 619084 296676 77709 487648 317107 221244 129721
21429 129721 -173542 -19798 136285 37939 -89733 -140263 -61185 -211075 42579 -155947 -75358
21417 -92013 -157171 -81045 210495 277089 -256006 -67180 53372 21923 -90709 -25616 -197300
21406 -197300 -100244 215982 72374 -295146 -143217 90751 74681 55131 119389 175587 134498
21395 134498 379970 214182 -9307 155952 -360917 -101321 93425 -199982 385020 -247377
21384 -127758 -33078 28712 -100757 247449 -266173 -347536 188955 -68341 -11128 -11667 -187944
21373 -187944 -28906 -161159 -57046 22754 -178217 -31704 132856 -92901 -122714 -107446 -476559
21362 -476559 -152957 -30778 -305328 -110707 -157340 -268650 128146 285299 -83233 -57727
21352 -57727 -22137 -121562 -66410 -106719 -427563 -259657 -304825 -24421 98829 130864 319675
21341 319675 38693 200041 -440575 114151 122082 46378 -52276 -269599 -90592 -83055 -17886
21329 -64330 -250335 -55854 -137258 -12139 -108989 12074 -9772 156663 -52708 -82614 9098 -216645
21316 131096 -64253 -73034 -79467 -93799 323577 -255743 -102818 -141848 374971 167506 -284999
21304 6022 -198508 -136811 -142793 -8522 -93863 128011 87465 319858 -56919 -76181 -243043
21293 -243043 -140601 34672 88177 -209656 91630 -194597 -11895 -39397 -62085 -156439 111747
21281 -212065 -150739 -57560 -124169 -303750 -144232 88796 -45780 -80119 298450 -42302 3057
21269 293447 -229420 -17074 -454638 300231 24836 -197623 -157266 -112903 -120849 -121682 -502007
21258 -502007 75119 -111021 -297951 -10930 8293 38025 148606 228350 -147585 -123470 -60362
21246 -246792 -98876 228186 -106838 -230619 -532736 -92217 -154441 -35105 -312593 -200904
21236 -200904 -212448 -414494 -306458 155938 382039 -181979 -23821 -686408 48242 -318511
21225 58882 -4557 -578653 -115360 184948 52827 -64934 62344 -289663 -6685 22915 7845
21213 -216032 -76426 -259763 -279058 13040 28143 13059 -19088 149616 -7529 217531 25615
21201 113620 -8331 -11894 66862 -367328 -13753 65561 -6263 -139554 40709 352477 -49404
21189 126230 -21211 -50126 6185 -87731 -385642 -260794 -181225 155470 2202 249154 -156955
21177 233822 -61014 -53922 -278621 -19405 39104 -249200 -36033 64903 -187394 -97792 -5474
21165 99389 -89162 -392320 -258425 231512 -102244 105802 69475 -185704 -85757 -95377 -471433
21154 -471433 -296890 165555 -60007 245004 -7270 -80813 125292 10086 134649 -24785 -105792
21143 -105792 -81457 -276225 235944 -250348 -271071 -25281 -45365 202366 12238 -265695
21132 -60104 -64016 -301995 -96268 379730 -105355 -212621 -271766 20851 -92973 132264 159626
21121 159626 -32734 -86175 -186238 90525 240650 -232203 -77162 146763 -174389 -160484
21111 -160484 76266 25772 -265551 22182 98835 243786 -313027 -80888 -483606 138445
21100 51384 -154878 -417907 -15093 -133249 72741 13917 109964 -98000 296244 88019 67006
21089 67006 -672 180746 21378 155738 -244481 -116738 -64550 -309482 -74926 -69983 295556
21077 205105 -220047 -127957 -66442 -111349 -2574 -79354 77053 161358 -77723 -186851 -283794
21066 -283794 285539 -30826 -105116 -35652 104977 -265410 -145785 148694 80048 -160036
21055 -7405 40929 170261 -63763 -231523 -334828 -232147 138778 140448 -153300 -155211 29897
21043 -125436 -200752 -37694 -46190 27149 164396 -260306 803 -21779 16253 77015 -108134
21031 -108418 -157900 -131759 -61307 180982 90439 -335332 -119515 34362 -330073 -214491
21021 -214491 139476 70899 -208124 -23922 -350800 228885 -7643 -42719 -124336 55441 199498
21010 199498 891 157754 -80798 -210570 175764 -37719 -151094 2136 -56663 63041 -49259
20998 -332185 173572 -118116 55482 -584348 -202589 -293652 405670 -113971 -142884 -21890
20987 -332439 113283 30458 -61649 -240359 -52265 -32582 -267095 -71656 5155 -53270 227698
20975 7133 -393271 -184431 95320 -252405 -85691 -184579 -206267 -191427 -24111 -394510 4435
20963 -246331 194598 -15412 -138133 162843 57147 110708 -296474 -183026 -349424 -143970
20952 -449514 -23888 -177463 -51840 -15967 -175171 -152021 71541 -111743 -97027 -20355 7177
20940 -98005 -29511 -102974 -94174 -15812 -125211 -151492 -88559 221021 41322 -133661 -16225
20928 -33450 -154826 -331704 46647 -327646 314337 -168681 -28243 -93971 12932 -64732 78070
20916 30375 -169218 -428476 -116926 -137855 -295231 67708 -89543 -570820 133364 -264600
20905 -399699 -6569 -2710 -39899 83865 -405096 -280837 -49513 130661 -177949 26643 24341
20894 24341 -486174 -55 -135567 -183337 -100971 -320243 -222745 3001 124086 -186533 -119383
20883 -119383 -401509 210244 -46882 -39047 -63421 -38003 31414 19262 -207712 19201 -133069
20871 -40183 -167865 -226166 -244683 -76455 108903 -323439 -24862 37437 -66451 -38527 -70080
20860 -70080 31188 -88373 -168735 148386 83768 -403353 264443 -88384 60682 -76625 -244053
20849 -244053 123476 -62193 -205123 -304917 42448 -304452 291567 137408 27507 -57097
20838 -152083 244682 -214341 -337166 -21615 -71421 6977 84784 299225 -229977 -15640 109334
20826 -51620 -97492 -169813 -112876 -404717 -344517 79209 -109889 -218064 -38335 -376118 87901
20814 -98707 -137571 98515 -89036 55679 -313513 -9941 3217 -64067 -42090 229915 36718 -5156
20801 264002 -14175 -258239 -181076 -144581 -281252 101912 24834 -93239 -250700 196329
20790 -66828 37119 194883 169403 -100619 -59523 20706 117853 -94812 63549 -68289 -46485
20779 -46485 -142005 43723 29126 96617 130735 252519 185585 -292238 64657 -246702 52715
20767 70558 167215 -154683 -6890 -51462 -9302 58229 158668 -90877 12265 6593 129562 -418109
20754 156559 -35456 23496 -134264 98617 -145805 -25841 -230786 -11616 95138 23774 -80791
20742 53136 -77493 -118499 -371421 -370769 33422 48355 -212462 -219400 -11053 134806 -183820
20730 -288780 109696 106335 -2047 -129225 -139810 220865 -5925 292607 -28175 -188695 -129407
20719 -129407 27846 -206905 -313572 -78722 -94413 47492 -149573 -117473 -252949 -199982 105164
20707 -227555 -178446 -120753 507 143629 -333562 -216857 -223876 -83198 -69528 -7992 -493259
20696 -493259 344080 -211706 -23007 -367615 -273363 18681 -42791 -157215 132330 201383
20686 201383 -221327 -134138 -7168 -103246 -273952 44039 174669 -292127 -143407 -29618 119885
20674 -132174 33039 86425 -296885 -216362 -395290 -179165 -508640 -167929 -106415 53887
20663 -83988 13074 -32388 -127790 213802 10742 -178462 71521 22688 225086 -130381 -205031
20652 -205031 -39913 -384696 -154598 -95326 -23220 221588 -388934 -126646 -277963 202803
20641 -105447 -322828 -111305 -115214 20158 83416 -5714 143240 -63249 241041 -11583 -317280
20630 -317280 -5124 -239684 -257463 -1094 -370819 -327222 -479510 232063 -101808 99396 -241032
20618 163955 -49467 -123403 148271 292290 -67031 -198586 -95114 -105872 12884 304816 11868
20606 -97980 -54761 35180 -52005 -102167 242900 -31501 7596 -543825 -753 -165383 226125
20594 -325504 -105161 91494 -3501 56735 108702 271751 -255586 -4865 -71263 11946 90155
20583 90155 49259 -213756 215752 136358 -41685 34301 46996 -129788 -7948 338964 141612
20571 155389 -342850 182366 82791 -76361 -148054 -514769 -306766 9935 134979 -110513
20560 202879 68092 -37230 25197 -482389 144801 -221475 -170598 -186858 -137502 349240 -377151
20548 -97952 -272317 262369 -59107 -80559 -102242 91159 -237691 294059 -53212 -36341 147249
20536 -313577 -457993 97455 -405768 7482 111314 -124815 -476343 298267 -336169 -330755
20526 -330755 -83375 -101757 140427 148688 27975 -80289 -53812 156244 234459 88103 -33607
20514 -479578 -396800 9739 -19554 158890 23966 125445 -172653 -174424 -97957 -68775 -135632
20503 -135632 -399111 -145381 72938 -169715 -294497 -105179 -142248 24694 66644 176885
20493 176885 -256077 -143764 -366719 -54207 -288063 -43574 -488026 -54535 -167449 232553
20482 -37911 -169750 -78816 -28851 138502 -103291 -64134 -13383 277018 427763 -317942
20471 -139153 312212 71075 -192783 59620 15788 -162737 21099 -251732 -49105 -60277 -248751
20460 -248751 -44878 331098 -23713 -328448 -156942 -50653 -42947 14252 -83093 51735 -224592
20448 198229 -302099 172281 1353 245101 -375755 291667 -413257 145889 6954 -290005
20437 -119223 -223595 321189 40009 67659 -257725 205423 68116 146322 -47755 108109
20426 -18740 -76915 -54869 -286767 -388931 -18530 -249923 -320441 38596 -187926 76254 -256990
20414 107068 -32777 -110718 -184102 -147452 8816 -146996 76893 -248540 40830 -317638 -95072
20402 28353 -96684 161218 50668 -240636 -46554 71201 -195486 -175300 -39614 -115149 15893
20390 -157155 125563 -206978 -39222 -227202 4718 179790 -109513 -454678 -320075 67297
20379 171255 -123741 -200462 -128291 310028 172355 146855 -360257 -43929 -183426 -238025
20369 -238025 -293960 -91405 -241289 -185773 271328 -68870 -229247 -283468 -124555 -248980
20359 -248980 -150938 172545 -111599 -979 128264 163159 -191183 -280766 -243221 43528 -304565
20347 -307525 226122 61988 236828 -35848 40727 -19646 7861 -230333 23782 -12449 8022
20335 54997 -147299 -18120 323535 3704 -125756 -58226 -214205 -99554 248719 -45696 79645
20323 -229757 -32708 40206 145074 189382 -387440 -141824 -236589 -103909 209451 301523
20313 301523 -84610 131202 23207 -88086 -56570 -108291 -197330 -89787 -64756 -210796 -318537
20302 -318537 -176486 -138742 -95907 61980 -10019 138778 -188961 -174594 -238437 -308288 11347
20290 -286009 -318424 -340539 -44862 -101318 65667 116564 -207817 -44843 -213268 -82581 -181377
20279 -181377 8910 -4375 -137019 -195676 176858 -25054 -366054 -200892 -201272 127155 -108227
20267 40562 -72602 202096 77163 141276 20768 -145269 49811 192199 -50386 4527 84977
20256 84977 -68096 31295 -187 -100188 126420 -50912 155545 131187 15867 181766 217353
20245 217353 -32111 129718 291965 -70931 57969 -233234 -73830 25713 9653 -124207 -2000
20233 -356820 -175563 -91537 352863 -191308 -150197 -85650 36601 167031 16829 -101462
20222 18155 261286 27239 82346 -36542 -18946 147098 -17621 -239011 269821 364030 -114103
20210 228505 -39415 30938 21066 -87679 -107329 -341622 -314247 -178019 66033 442869 -115091
20198 -46514 -97559 -1219 16554 -224719 3940 -80297 -94291 -103554 -196874 186382 -31620 -175433
20186 -175433 90353 -102666 -215650 -120534 189742 149925 -161638 -77348 -3016 138631 -413318
20174 24267 -155113 45156 -236017 -36556 -349359 -337496 -90331 -13883 -331983 -172497 155237
20162 177115 -235706 223202 -114642 136207 -87619 76711 35987 -289134 -56521 -40828
20152 -40828 -150044 -189738 -204104 -202630 -94367 -76247 95714 -239941 -77616 -81112 6488 14741
20140 14741 110820 -406174 -259844 -46929 261404 1332 -149281 -76225 243799 -40780 29768
20128 -213737 -121815 68406 -166735 -195001 67711 48109 376092 -178173 -522315 -84386 -96305
20117 -96305 5007 -347482 77696 44849 118824 -296664 -291404 -163630 128260 134705 153961
20106 153961 -305891 -102301 -278828 165220 74830 -46162 -166481 -280450 -14405 -260672
20096 -260672 -34774 53678 -281977 -248738 80740 -65191 -152008 -47625 28004 -243552 14473
20084 19698 -194022 -138142 -272314 -76741 -342987 -254436 44829 -47253 -119670 -19340 -255543
20073 -255543 -93828 -45065 -148601 126907 -127338 133433 -214255 143316 -314455 -263043
20063 -263043 -290988 44312 185090 63209 -127473 340705 34341 -221296 -224606 -165969 -64131
20051 -204778 47422 134708 -81268 123262 -210142 -33078 33527 -525736 -102560 -83598 190158
20039 -164277 121297 -152026 -20361 -59579 -189658 -110784 -45673 -83901 35567 86680 -287033
20027 157139 56780 -91834 -58834 -296459 -3760 43662 -384544 170338 135735 -111982 -220531
20016 -220531 -238581 2437 118636 -146583 -149546 -263290 164919 -175678 -183653 174718 108062
20005 108062 463471 24878 -127170 -111002 -137203 -17657 -183515 -212816 -176619 -51948 -482605
19994 -482605 -324436 235055 -198841 95041 56195 177014 198691 79967 138560 185166 -351366
19982 -109601 -229384 38714 -57052 -282973 -45309 -6386 4589 -54498 -96941 -121902 -116608 -252041
19970 -252041 -68635 -256738 -99923 14397 -257428 -167502 -120740 102837 361845 194503
19960 194503 -22539 -230864 -2570 -90324 5835 -245819 -36070 -8976 186063 -131573 -9676
19948 58560 -174273 -198295 100610 -206736 -205327 20879 -115352 -37725 -352210 125266 -268392
19936 -139581 -402564 -14522 146252 -47870 -123405 -353287 -339135 134699 -247151 -146555
19926 -146555 -215291 -74307 -158162 2328 -197058 113413 -16082 -42970 112207 -62286 -35825
19915 -35825 -76837 128774 51789 -328369 -216840 42002 -143685 94190 -236470 -81498 -217663
19904 -217663 -229675 104024 -484523 28528 -106014 9804 88189 -254566 -312444 306905 254761
19893 254761 175773 -237822 -257298 93343 -59417 -42039 49688 53666 -226644 -15125 -275917
19882 -275917 -170424 28217 -243233 -31140 -24323 -215860 -62081 -18337 -129886 125349 -195422
19870 24896 129704 256656 -57821 -129329 97199 -34555 -109023 -156685 -9569 -60376 -200530
19859 -200530 -232722 269054 35279 -33872 -137725 -415848 62955 150762 -250072 -199088 -58802
19847 -94803 376641 -259356 -110775 15992 -33284 -114015 87035 -219604 -45157 -388290 -155807
19835 113586 -214572 -106993 -237798 -96815 -249271 -282175 -234174 -164115 -64527 -8900 -179566
19824 -179566 114292 -213620 -172247 -460690 -140151 69143 -143178 -109955 36214 44444 46766
19813 46766 -195442 -194428 97322 -128669 6857 89747 186840 128555 34508 59130 -30168 -140063
19801 -140063 47407 -34664 -189561 -11680 -418433 -486550 -179750 77958 -104514 -209277
19791 -209277 233809 4466 -190696 -169336 222918 83863 -297218 133778 -282289 -225680
19781 -225680 49455 -165735 -257727 -153951 -62969 45171 -149088 193822 -183666 -53280
19770 -52157 -135523 -19717 52721 99394 53082 -179711 -479500 77889 -43502 -188505 -217363
19759 -217363 -105651 9436 263565 -155145 -118544 -254498 33049 11006 -131326 -8634 -330985
19748 -330985 -73871 -40731 234419 158118 -161139 -102049 -273835 -62536 -73648 100016 77977
19737 77977 -228318 122730 -86909 -72903 -157885 -35026 114702 30694 110340 -238498 -104772
19725 10736 -41108 114303 46010 -216542 -269164 -57808 97328 -298489 562848 26107 -182722
19713 -185645 -148403 -173570 18690 -214524 -89939 -90841 -212168 142502 -102129 245458 -132889
19701 70919 -98875 300676 -13024 10106 -156990 -330444 92468 -164126 130936 -230591
19690 -200344 -244104 -47388 -159671 -139400 -121547 -166876 184966 241831 -155480 -346924 -78448
19678 63988 -50225 -276619 133098 70882 100240 -199987 -64155 144767 99752 1302 -258992
19666 38810 -143326 2381 46390 354906 293463 -399669 337051 -206417 157250 -140402
19655 38104 -196566 -174921 -47967 -89184 -33143 8664 -151114 97439 168366 87346 -115741
19643 70744 -43132 -290183 -196558 -65316 121313 -174121 189391 -242258 -266128 137707
19632 -261264 274739 -96113 -54057 67345 -208755 -118427 9071 -199857 -81565 -121386 -44911
19620 -60356 -141885 139184 18009 134985 -60067 -168587 47829 96990 -42646 -255581 437158
19608 -102629 170882 31094 -148401 -28197 -345110 137590 -2059 -237863 126748 -5004 -130453
19597 -130453 -80407 9903 65674 -20823 -2056 293141 85069 -118227 8730 -190320 -69984
19585 -119747 -25076 -326194 -86706 42424 -254992 -68474 -403826 -27089 55914 -258331 -171366
19574 -171366 16690 -173773 -231207 -290030 -270742 105299 -247122 -134973 -206674 1465 97966
19563 97966 -215723 -75684 -172086 88145 -152755 51093 -209016 -252000 151115 31285 -237461
19551 -96278 16829 -122101 -198937 193679 -83937 -73062 -254653 131783 42020 -9514 171348
19539 301319 -93263 163975 41198 -156180 -78847 223562 148003 -377986 121068 -337827
19528 -39235 -102758 3526 -96162 80023 159402 -43314 132880 142586 -298285 131728 47740
19516 154883 32945 11405 -97891 90396 -179815 189354 -347652 -162889 291712 -169250
19505 31095 -96065 217790 10678 332141 -226607 36247 34042 131500 -120702 -4161 44538
19493 -191707 -197500 259700 -46568 -136088 -456 12631 -132363 156520 358265 294229 17512
19481 -296556 -93450 -372630 -78087 -84166 -156811 -58693 -270513 73229 -139833 -66286 -125925
19470 -125925 -69025 -396115 -266633 120708 -52388 -117877 40306 -24297 178504 -92045 -132970
19459 -132970 -255595 -17743 -204938 -49130 4281 -129613 45427 188807 -107429 84837 63693
19448 63693 271423 91122 -238664 -351247 45034 -125545 -166936 153990 26484 -15696 59753
19436 160707 116171 23012 84448 -290526 -40915 -222946 -35032 -80529 -467948 41201 106575
19425 106575 139648 -3621 324623 -191621 -90691 -61861 350338 -122514 96577 111894 -312740
19413 -61335 -95483 -471103 28104 317914 85511 195335 32826 116073 -224991 -169937 14484
19401 -47142 -356333 126670 -130908 -102681 233202 211564 23324 141633 -34918 -16886 145865
19389 6564 -201189 -244371 67891 -85881 19436 -202366 -189142 -107615 -158388 -33755 26111
19377 -261279 -236346 -28920 268828 54773 52644 -13493 72985 -38827 171952 227108 -286215
19365 -457728 136061 -270558 73931 -9342 -242954 104397 -299658 -302812 59055 -227423 -58316
19353 -56754 -365209 -488403 -113691 -80946 209648 16817 -261701 -2572 357654 -51777 -38213
19342 -38213 176371 -75079 -197744 232545 -463492 -44386 -120574 -138624 -89233 -26244 -204713
19331 -204713 -357751 -11592 103809 -188342 55564 275849 -303 -125097 -100251 24827 -182520
19319 7026 175822 -197588 -159421 -254912 36717 -44459 147714 -47018 -150972 -209025 -293630
19308 -293630 162156 -59224 -154933 -171859 -361639 164117 -246570 212958 -95756 239167
19297 283689 84092 315875 131584 -127640 -397017 -209145 -332876 -116839 -150192 -197359
19287 -197359 -64797 188409 130349 216294 -90553 136617 -207342 -83706 274963 -276952
19276 -334776 -258872 62567 256272 -294721 308530 -11803 75669 -37807 -183573 137015
19265 -73961 47010 -292485 65586 -318703 -109215 -208948 -14187 -348881 23158 92973 -253596
19253 -142831 -102570 -13804 35103 -268407 -57510 -179744 -245607 -71857 54398 -74266 -281914
19242 -281914 79100 -302299 -231119 -158176 97180 -625889 39030 21341 12457 -240826 -174974
19231 -174974 -69440 -170464 104476 61618 -471904 171014 -55923 9900 -50585 -157243 63551
19219 32317 26485 309662 64677 61133 -150670 275498 -130843 70559 -160367 -285830 -111369
19207 -151305 -137212 -524499 11179 -36157 74202 -159259 58048 -176635 -127749 306315 -3558
19195 145326 -38526 128526 53093 -101215 -156761 -24437 34770 -176334 97612 311063 71678
19183 -195747 -61521 77340 -148593 -2727 161993 -194082 201705 110796 92752 -121414 -120108
19172 -120108 -148091 -231159 -57000 -12279 -25319 -267458 15496 -196749 -287762 297464 -428359
19160 -66197 -23883 -18782 -310520 69846 -498321 121160 -262017 18655 -421790 69286 -96892
19148 -371853 -179306 -829 23044 -244540 -112593 -119139 53602 -182747 402 126328 -15442
19136 -77547 62009 -41220 -261385 -153511 -247750 -60627 -45699 179786 45016 47951 -29766
19124 -261928 274324 -320175 -65802 -85021 134779 -252699 -108019 237620 130471 -116199
19113 -113477 -233510 24862 -146792 -67360 -81199 161299 -566289 42023 307805 -60035
19102 -100657 -3926 145514 19788 -404729 253362 -270435 -296352 -32873 -97709 -268173 319159
19090 258488 -306500 -87242 -38297 96525 42796 -198460 -58965 -34015 -61919 -114266 7301
19078 -50779 161778 -201057 25997 75189 51964 -128985 5650 -164406 -344653 14955 181064
19067 181064 -89430 254391 -207574 49328 -31577 56235 -124645 -349065 -220139 38352
19056 -180993 -173651 -81413 20901 366 133110 -318392 132575 -10631 -266944 -57007 -147821
19045 -147821 -118806 -97157 -170828 -170936 -65999 -62571 347839 110235 22545 -75112 -248915
19034 -248915 -420537 164923 -156891 99844 76292 170349 -71172 206675 358790 146821
19023 80330 171413 344983 -36164 228455 -239271 -38696 -90082 168558 -139251 -163639 -78620
19011 -253021 -188298 89184 -48712 -85894 -280 63740 -126366 -130476 -278991 -73765 -88571 -138268
18999 -138268 35473 -97680 -510121 -64526 162820 -191267 -230547 -358720 -171757 -19232
18988 -243921 -27151 -213575 -80940 -122832 -81646 -133659 83890 68819 153591 -29477 131086
18976 -33920 -150688 -159309 -231826 90759 -43887 -103333 -9750 -81317 -246731 161655 -308311
18964 -52998 236739 365005 320802 88545 -158550 -283949 -213696 211803 198575 -279407
18953 27950 106091 30887 -212159 -170503 20349 -275644 -212699 -146668 -59213 -161068 85839
18941 -47483 125881 16380 106713 -110093 -61986 42959 27513 124575 -268496 -100078 -11773
18929 -351073 -414021 -150936 -343332 286901 -115364 -205866 356930 152275 51622 148400
18919 148400 -138853 394060 89759 207316 -163705 -64262 15306 -193591 -316013 265816
18908 186808 -234088 133529 118685 59791 -257169 -305327 -229459 2234 -88493 -118957 -396572
18897 -396572 78966 11468 -174971 66692 -348130 -95892 -232256 187888 -121527 -131495 70767
18885 144910 -345597 -224914 24022 171720 40621 -104404 -36698 -444108 -130335 -191627
18875 -191627 -397611 -74984 259226 -162632 -98535 75015 -278255 -201302 35823 -13479 -45845
18864 -45845 -188127 -349376 -55788 -119363 49792 -334739 221300 63148 -265881 344794
18853 -25943 -240632 -233975 83631 -25624 -10653 43219 -5816 -210904 -141512 -151362 -23680 66795
18840 257575 -51146 125638 -180274 -87762 -28924 -223955 -88094 -14418 87958 68093 152354
18829 152354 -204417 -21258 250003 -245440 -215203 261561 -15824 -54454 -140252 140330
18818 74760 212897 -308014 16355 -70941 -114324 215098 150088 308172 475073 74771 207031
18807 207031 -10396 275065 201489 -364639 -188396 -113274 -59725 299979 -294580 228742
18796 3323 90364 -5631 -234670 -109855 -240019 79532 -42951 170393 -108958 -131262 -148720
18785 -148720 53269 -26591 -318118 123030 35695 -85283 370 -299135 -321568 268183 -270940
18773 -487933 -90695 -252489 57487 -137773 128464 -513719 -84542 -285356 121308 -231871
18762 165827 -102194 90773 1304 -119861 -92106 131192 16686 -250164 -206166 34798 5771
18750 -37579 80679 54497 -200511 -147867 -325605 116877 -1756 -504849 110713 -29718 149500
18738 32320 -35912 -218372 8927 32141 -403700 88119 -17836 -46902 -65326 -73283 198079
18726 -59341 17614 -75890 -205494 99472 101852 114493 111116 -90369 28604 189218 -241650
18714 159097 -240303 139714 49932 -208749 -54823 49518 -183278 71986 -215335 -37377
18703 165888 -365332 -147246 -335714 32058 173760 203476 -100205 301492 -3171 94919
18692 13873 -32404 -217444 -56615 316204 -174582 142501 -14286 -129617 -6345 -161170 218543
18680 -252352 -123864 -79523 -160584 179490 -169869 152379 116559 -391943 -269986 110276
18669 51371 57460 16050 223800 -128745 -82610 -41684 -130903 317589 -265518 -86653 60230
18657 -55957 226575 -304430 196834 -997 -72075 179381 -313702 -307012 -128690 -147516 -180227
18646 -180227 -3340 10869 -272402 75809 -72714 -69736 40742 31494 -94022 -259296 173796
18634 -201851 -113397 26666 -373882 77458 -155072 -394744 98702 -287063 -313403 37414 -50162
18622 -190684 -192596 43607 -261370 116600 81120 262486 -180397 -51636 -199373 -222274 20337
18610 -33575 167085 -103493 12054 85286 -62572 4530 -121938 96412 45970 -90229 -62288
18599 -62288 -274759 -110086 23921 -223162 123594 -86496 24363 -43163 -244056 -170023 31621
18587 -77096 -176996 77720 109967 -123265 -155535 -57357 48017 -1713 -52980 -78604 -13855 181132
18574 -93806 118541 54461 303953 -81379 313467 2465 -211915 100945 49704 -31879 -166605
18563 -166605 -189895 -249013 10831 199742 235360 51807 70840 -29980 76076 36502 -119713
18551 -84816 -386760 -49376 -180699 -10099 270599 329623 -70344 -170035 82388 -61342 -39987
18540 -39987 -111404 -286772 99745 334729 61192 27774 -251262 250454 -219984 -172385 86616
18528 182483 -155596 91216 -63268 -82131 406002 121549 119134 139258 66762 -221828 56347
18516 90781 81748 -33389 19335 -243731 -120784 260629 -67948 209190 -194618 -67077 323551
18504 -132640 -337130 88418 -29333 -64963 98385 128844 130848 -127401 124596 -274307 -41675
18492 158436 -192852 -142670 -60398 -70656 138340 -1590 -239336 -40950 -47198 -346295 219008
18480 46642 -54555 -44175 -113161 -246858 -212728 -183915 -148753 49228 -63174 -282229 200812
18468 -178042 51150 -166838 -144718 -192012 -165649 -99904 -248208 -397947 -90459 -91709 199361
18456 -180978 28846 119326 -216323 84615 353356 18543 1133 79430 -208217 74185 -402496
18444 26644 21499 -88819 79209 -36973 7185 -99917 -75395 197414 -166206 -320249 35556
18432 -419067 83194 -216729 33770 -73773 -228762 -100653 17814 -118124 1054 -194063 -103509
18421 -103509 -22824 29517 311300 -208461 121119 -17563 -175792 -310233 -184038 -39004
18410 191256 -16108 -140563 335361 148386 45269 -64187 84705 -61564 63480 220312 -23243
18398 -8030 -13332 -12241 -18757 -87463 -66250 -145277 66974 19988 179426 -153142 -313437 -325561
18386 -325561 -148263 -385136 -257546 121168 56268 -56024 -81448 206121 -219488 174055
18375 195958 250036 -177826 111872 -233100 -49745 113305 -160996 -119515 -12725 -70469
18365 -70469 -193028 -160270 234533 -34829 -87371 -29629 -68541 -164216 -31425 44572 13126
18353 109791 196940 -136200 -60779 -80508 -389278 -61030 -1761 169450 -81027 -24974 -112925
18342 -112925 -49255 64843 -26886 -274431 -275222 -25328 -153936 -82145 -19958 -234237 -139123
18331 -139123 -155556 -156749 -188996 -484783 -246492 -27707 155602 -277342 -101686 -294043
18321 -294043 -141641 137428 63826 129884 -369858 179255 130918 -141823 -335679 -5102
18310 -83643 -103534 -368889 -32235 -103334 41845 -170476 9931 -245393 138191 -169476 43349
18298 145790 -4404 127135 -374046 -49679 -232669 -260375 -261974 -140910 -183415 469843 43248
18286 1867 -116812 -142754 -206271 -108054 -190380 132699 143375 131111 164980 119471 -104934
18274 -499548 108050 -40292 114572 -110979 -137668 -173609 -115407 -158292 -201518 189541 46669
18262 -18019 54434 -82071 239996 -129909 -10856 76207 405229 -212522 -209484 78465 121729
18251 121729 19195 102252 -25765 -378369 -203924 163252 -270924 281826 73946 30626
18240 -41901 -24035 247225 58101 114195 97421 -130305 -234386 91246 -79302 46706 -90146
18228 -43569 -79656 119251 -157649 -125892 -208880 272992 -103076 -6569 -435406 -352251 -179277
18217 -179277 -32824 -158408 -256433 -56718 36569 106840 -72492 14284 -228580 -104499 -171059
18206 -171059 -7503 37358 -77762 -80893 -156573 143133 -49653 128303 138067 38329 95508 207209
18194 207209 -17709 -397420 104726 -216277 120571 -43754 99484 -67294 37704 127621 134848
18183 134848 224536 56007 -26935 -261329 -22874 -182591 19480 -15680 265010 -172606 -77319
18171 401281 -137044 -260502 100838 344937 -327712 173108 60769 403569 -289387 -294838
18161 -294838 -469372 -219711 -239283 9693 -110750 -124469 -134419 -273486 228387 -27848 -105048
18150 -105048 -249878 -66586 -86252 -151550 73250 137256 -19378 -2222 180155 189241 -239568
18138 61601 108114 -444787 -192119 55261 224547 -284428 -38687 51559 65317 -12328 67584
18126 -66392 156592 -149059 -102009 221170 87227 -113458 -16572 -18665 -18595 -50876 -35825 -249979
18114 -249979 296466 130595 -261426 -252959 86992 -243875 -243651 -260007 -118547 142040 319903
18103 319903 70079 50419 -74762 19683 -87858 -274017 -217761 -281177 234227 -12648 94052
18091 -349496 -107379 -140514 39319 -351089 87402 -16123 -44398 -3197 -427216 -31893 -42108
18080 -42108 -245871 6424 -149023 34989 -52015 -23645 -81486 -340264 73196 -171387 164811
18068 -26018 36132 15216 -138344 -278726 -178886 -239129 9915 -76531 128025 14924 -377697
18056 45959 41548 225103 48050 15590 -62807 -410345 154669 -535694 -8158 24004 -30390
18044 130263 -58021 185065 -112935 -79588 153532 234389 131917 181904 -34311 -219454
18034 -219454 36872 60945 424621 -54297 72514 52563 221900 -210208 48681 269359 -335993
18022 57339 91712 209532 9646 10864 -242062 -96252 -7040 82019 -257106 342550 68348
18010 -30509 -49534 -68870 -69417 -176974 -209293 136205 -232677 340636 92219 -26502 -82152
17999 -82152 -101048 119489 -9758 -61625 248035 -176921 236952 -188737 -13697 123969 61284
17987 285731 -103724 -4601 131707 114769 -35057 183777 -64012 139471 148483 -51081 66247
17975 58443 226548 -165001 53696 27179 158919 -206072 -139511 -52478 -40318 7616 -41857
17963 -16085 191833 -313045 -97374 -237813 192069 250998 -413783 -182412 131191 -16396
17952 152939 -34053 415287 -137493 98265 -120201 62621 -57489 147515 -4631 -32707 195090
17940 28140 137258 -49681 -13090 -208 -189663 -219902 -156031 -465212 -156472 -5379 251966
17928 131289 72235 -129106 -263586 328757 78597 -97554 -419536 314929 230747 71734
17917 -255321 -28343 178344 21828 276255 -127281 -413604 322161 193154 14331 -21069
17906 133837 16043 106743 28780 -88623 -170218 316623 -171120 -139710 150684 -15248 155272
17894 37808 -51171 -230444 495921 67888 -11078 -19651 77863 -93524 -257106 -145734 -20604
17882 220780 -418896 -134579 5421 85194 -157779 -75933 -22669 58709 -167122 -84173 -480601
17871 -480601 36024 -294769 -43339 162179 -84918 -283473 -231437 -164820 -146293 191229 -227466
17859 110828 -89642 232282 -307182 -99384 223998 30611 151694 -157830 193496 30744
17848 -16767 169349 37378 139625 41672 -178133 -31550 20975 -70288 193016 180560 58302
17836 -98389 33434 -188533 150733 46280 -254632 50746 174976 -57506 125579 -189666
17825 276031 158084 190504 -152354 -181797 -156152 -23931 -25754 24098 2334 35511 41113 66518
17813 66518 64980 141084 190021 61220 -2084 86369 84909 -242357 230090 104273 -181041
17801 68464 230948 72774 441281 147075 17242 -262662 98460 -65090 27824 -1238 -160172
17790 -160172 211888 -79941 -334857 27898 -256149 -6514 -195408 12416 -232082 193151
17779 169735 -298105 192708 355626 -8088 -137212 -61825 39288 -51322 76724 119016 -92105
17767 -43314 -119606 -237295 -65212 61970 -252014 166360 62151 -207787 53059 -138357 -200874
17756 -200874 -73727 107945 281275 11543 38644 -187212 75289 72835 369122 108049 -237542
17744 369726 158489 -62048 158927 318347 -103321 -133230 -98994 -177804 -199040 76883 64420
17733 64420 -62422 56066 208383 64659 -32564 85033 -266122 -112124 -11790 -106742 35140
17721 -374107 57254 -8490 -112135 200240 71855 87795 404562 -392573 -176675 214470
17710 16399 62700 103212 74012 -249618 -149290 146072 27592 437568 156600 121641 42721
17698 318959 79363 260845 80386 169899 194985 -97819 305534 -25021 -490286 175952 305032
17687 305032 -95107 286345 -416708 -47785 351098 19868 73298 465382 -133634 -60138
17676 -178453 -32077 28882 219497 -258693 222500 -48268 262780 207470 102432 147043
17666 147043 262748 -170996 -70480 -55371 96 141325 -91828 -101173 105326 63100 -32892
17654 223961 -370015 283661 -488343 -8039 171781 74877 30221 308773 382471 -132059
17643 107265 173345 176136 252096 -105936 -3669 243608 -74079 -100968 58138 -148116 -68332
17631 114247 187598 -93243 265706 -217756 -82569 189013 -33656 -75352 -206964 -311644
17621 -311644 -179984 369756 93647 -134136 135425 219218 -15865 -116551 -214014 88197
17610 183722 8984 2393 36091 282993 -204922 -61694 191775 -121154 50703 308308 -36907
17598 362177 345368 9043 144302 106015 77982 -4921 -165964 338047 68536 -113782 425091
17586 122090 -14684 -124509 -157322 230625 3603 27237 77489 18037 160801 291992 199346
17575 199346 72607 200074 -181520 -121224 106157 -40435 -240132 -51661 134083 23721
17564 -61750 247617 83755 22468 155476 16120 176721 -3020 54233 -35824 93363 -83723
17552 276828 -63084 -107509 -154012 68560 -154834 11770 136122 -64667 140451 37531 79651
17541 79651 -97114 131743 153526 -47564 251100 120505 -65653 191442 338044 -578 140605
17529 242073 -173222 96381 -197660 244865 -277439 261629 -77245 -192441 281549 315552
17519 315552 51562 -17185 487840 211282 138576 89848 195952 464456 131771 277582
17509 277582 129257 188145 318196 199477 66771 -88863 -98083 116018 38951 140402 15809
17497 359833 -73153 -28938 -132625 -50155 221960 179893 -91847 327121 2675 -262580 273573
17485 279271 -80327 -271098 -80999 42110 -117757 -1205 237773 85909 183816 201809 103096
17474 103096 -26468 -154550 51380 63530 203068 38836 364131 191779 182197 39443 223244
17463 223244 217153 304021 218397 289361 221033 10566 342381 579535 -64435 202741 220032
17452 220032 256947 455764 294842 363471 349625 197098 330073 -146227 362566 553601
17442 553601 41846 4396 116518 126288 149464 203022 57653 207470 121549 413959 215998
17431 215998 436884 277774 263573 203818 422285 483120 269427 187791 422790 452942
17421 452942 266773 107326 251399 182301 703209 -9277 348946 373052 325860 -30318 171186
17409 151236 -60643 246579 274435 321286 -91987 187102 -195793 264417 122245 234151
17399 234151 416344 286216 -82971 -53865 153044 295913 200300 611000 236592 115779
17388 316734 -108790 145833 318021 211618 453375 -221409 61718 436694 83621 144347
17378 144347 597558 295296 154277 -14196 120232 377384 179543 96358 86519 -265904
17367 -67088 90900 121377 346049 203739 166463 246490 303898 194302 89812 451831 8223
17355 311153 206550 242977 -730 216279 263975 -7956 72382 122487 288592 198225 -5785 84078
17342 244652 336233 261769 360779 -13050 323721 -154774 -83333 60500 88912 411240 89097
17330 201033 121437 286312 158579 -68434 201598 368330 345980 -3784 202829 292752 -174865
17318 368150 42439 168030 231560 279356 223056 -123373 180282 144125 470766 173971
17307 -84528 407630 -132614 359376 336691 133881 203403 -80163 -13252 93460 51371 237870
17296 237870 128328 387476 278061 226733 216679 224510 285872 92144 305732 133947 108550
17285 108550 -62049 283063 334237 74414 356134 102628 77502 508598 179417 341026
17275 341026 344230 321419 190535 284888 11091 -175223 50915 -192937 111289 319283 59788
17263 361937 41681 -319144 486493 337535 221014 336345 43588 262341 302421 211746
17253 211746 -165805 259335 105447 199798 362427 505782 -17534 350139 19718 -118110
17242 59589 523645 309716 155805 104623 15407 156314 388677 31595 279590 721044
17232 721044 338608 56047 340711 113814 149648 135744 49904 323347 28649 123308 -112488
17220 124370 -2647 200241 250388 161118 431064 56591 140647 346588 402599 315800 508789
17209 508789 251548 323368 76073 399225 248907 523464 487685 -161450 253880 -106321
17198 54502 225353 250245 218556 483890 421234 26825 -43013 238624 -228696 105186 402860
17187 402860 165660 185378 273803 432455 183042 213960 152587 212007 528492 54376 -38034
17175 455774 320610 207334 494067 132991 266643 286664 164732 568209 129003 223044
17165 223044 78635 424476 158953 166658 277363 126971 29011 518209 2992 330953 238836
17154 238836 312981 360018 481720 447184 400108 96826 136069 162609 684403 111482 410597
17143 410597 481513 184760 143006 473426 250233 529258 316730 82504 -2397 307048
17132 407476 -82746 701695 154874 469222 373316 418930 418883 200177 272900 351041 343146
17121 343146 148134 337622 439967 198530 46059 350712 360161 96044 224079 605824
17111 605824 232560 554404 318831 219512 503634 403364 240791 245806 541106 578613
17101 578613 656939 426260 638489 56603 516195 590658 296942 266034 626990 453112
17091 453112 429919 220636 120580 579530 549696 316037 447169 228826 598231 325856
17081 325856 452075 436618 696502 604906 485077 759267 535585 888934 585728 685220
17071 685220 519295 410330 532607 420518 297359 300418 329521 -44787 562299 273811
17060 524561 379470 760720 458409 530236 713558 314578 494306 213349 609296 524423
17050 524423 740325 506939 390415 528330 781181 362733 655546 684952 377887 456278
17040 456278 510185 514951 496269 745344 930935 656424 577506 606958 509834 405885 583617
17029 583617 840489 645144 679090 959521 627686 717989 839784 685374 651853 224628
17018 493492 683346 306771 529433 732164 562896 926527 635096 800974 857419 569666
17008 569666 656623 948440 483327 574116 507006 359046 704268 851544 792005 809254
16998 809254 800200 742663 1010238 546472 1069846 923129 779543 696717 898579 754010
16988 754010 673344 948288 661188 935031 840729 824717 559915 805309 809355 856978 1133759
16977 1133759 880626 680492 877674 1151536 1031418 1159337 776193 959614 817603
16968 817603 1024358 949033 1101201 1041406 1045151 875777 626833 1016214 905931 1050942
16958 1050942 1245843 1001391 900190 1167361 940450 1096847 750189 1017723 1221321
16949 1221321 868060 1110016 1040962 1032509 834644 1322942 1010700 1175962 1244803 1125383
16939 1125383 1174961 1107081 1423088 1344745 1255841 977279 1540170 1150531 1408544 1070035
16929 1070035 1563117 1376618 1426824 1353621 1379168 1302513 1193264 1161455 1243139 1446970
16919 1446970 1423488 1363874 1365766 1350312 1529569 1411542 1532485 1813808 1526870 1320945
16909 1320945 1768878 1562574 1445775 1561276 1771806 1566576 1886110 1811710 1842959 1606249
16899 1606249 1954189 2113147 2109799 2124985 1987034 2055949 1841309 1690313 1772366 2475768
16889 2475768 2036680 2167186 1991365 2061142 2137754 2220764 2275984 2248769 2258522 1944301 2204473
16878 2204473 2351619 2256216 2208964 2395772 2223815 2520087 2737593 2355843 2521720 2542340
16868 2542340 2599008 2585509 2543088 2583075 2815092 2670437 2857412 2974475 3247887 2859144
16858 2859144 2696433 3194066 3145678 2824132 3102150 3125969 3319333 3336675 3231424 3589559
16848 3589559 3516962 3354229 3697265 3716296 3788358 3578745 3951093 3850901 3898589 4177613
16838 4177613 4258783 4302273 4172909 4199214 4304602 4748525 4638482 4517695 4671551 4463853
16828 4463853 5083788 4932473 4797882 4802993 4680786 5317400 5432843 5859021 5752520 5402529
16818 5402529 5641068 5841263 5731786 6270371 6179155 6212485 6068082 6521631 6849501 6671760
16808 6671760 7191262 7000089 7075484 7467301 7497254 7779080 8206194 8333330 8314794 8357993
16798 8357993 8813251 8954191 8780039 9200744 9572291 9638309 9994070 10506390 10755013 10802201
16788 10802201 11160219 11346942 11821229 12052291 12512868 12917439 13177911 13620902 13866065
16779 13866065 14410414 14669242 15172330 15832725 16102300 16736815 17424387 17836597 18146998
16770 18146998 19245772 19512526 20663391 21230374 21892351 22348393 23639796 24219228 25507092
16761 25507092 26493493 27390217 28763156 29899443 31455994 32540597 33875005 35432458
16753 35432458 37141646 38978064 40888202 42525365 44524678 47220856 49159501 51979293
16745 51979293 54532567 57124240 60801692 64227921 67887759 71499195 75603341 80273897
16737 80273897 84997459 90258289 95836162 101463219 107559519 114256471 121545772 128651296
16729 128651296 136537767 144000343 152153865 160295724 167982035 175677496 183030044 189594921
16721 189594921 195760466 200271274 203637135 206332849 207292920 206713755 204797973 201195989
16713 201195989 196667919 191475204 184757821 177894829 170473824 162204013 153867424 146101904
16705 146101904 137949934 130094844 122584626 115349545 108152863 101601165 95875979 90112281
16697 90112281 84461264 79477260 74865410 70705354 66452725 62671326 59054934 55687846
16689 55687846 52830532 49999630 47346666 44730260 42523682 40317747 38368840 36895637
16681 36895637 34911945 33330582 31790564 30338897 29283146 27653576 26633957 25430665
16673 25430665 24339088 23597399 22354523 21395804 20970585 20304443 19316083 18418985 17874660
16664 17874660 17497422 16551001 16094007 15681236 15069369 14268122 14240249 13497919 13114508
16655 13114508 12965561 12616043 11987369 11952112 11444690 10728152 10247739 10375245 10196015
16646 10196015 9718118 9472844 9185601 8996829 8943887 8605274 8273060 7935335 7975909 7884613
16636 7884613 7528433 6891190 7173777 7178109 6731001 6551822 6564240 6115296 6041707 5982610
16626 5982610 5869542 6084280 5670385 5772095 5596108 5257099 5437783 5080075 5094743 4651269
16616 4651269 4360744 4509388 4677616 4656218 4428363 4420841 4240641 4098545 4143862 4261368
16606 4261368 3946031 3861448 4014799 3365549 3586869 3632050 3339284 3534233 3605500 3611861
16596 3611861 3392868 3190785 3094569 3111700 3038492 3586024 2951894 3186089 2677289 2784826
16586 2784826 2655930 2954493 2596204 2356204 2499683 2621213 2576493 2340337 2718882 1979062
16576 1979062 2528158 1939243 2453208 2345846 2388938 2397063 2058793 1828867 1939245 2502830
16566 2502830 1919713 2209629 2152855 1792892 1688647 2016334 1932311 2190990 1714204 1673641
16556 1673641 1886257 1694813 1653604 1538466 1825968 1792932 1713283 1516852 1561840 1620006
16546 1620006 1640384 1800442 1622159 1493977 1589341 1579947 1395006 1485520 1533614 1674000
16536 1674000 1562059 1444006 1255969 1419221 1059031 1260008 1204019 1075132 1311863 1088217
16526 1088217 1261172 1501182 1149111 1384004 1048589 1462478 1186803 938526 1106748
16517 1106748 1211972 1366491 1290757 1438633 1275770 885162 805527 1094634 838322 1186870
16507 1186870 964497 1091558 1399606 956974 969843 1077980 774075 958990 853590 1036323
16497 1036323 879324 913108 1344127 804251 1017760 1020852 1056665 852115 807985 663031
16487 663031 994374 939573 756151 690412 747313 874874 748738 869755 841310 714301
16477 714301 563025 562359 767565 570602 759933 958214 804727 604017 744493 561154
16467 561154 581648 324500 706623 660221 197360 285943 411353 353005 734156 468384
16457 468384 549172 528379 399416 654713 642971 1200140 859499 446915 637499 693858
16447 693858 518622 639176 387223 335338 504423 849176 664277 483309 652780 467757
16437 467757 927811 363712 669492 923529 59189 310996 709074 157198 309466 620476
16427 620476 152807 262590 425174 66372 583038 610266 432117 461677 447760 606271
16417 606271 448536 135934 170286 251656 481158 650864 230180 608446 118079 508660
16407 508660 311343 537931 439055 266691 704335 155682 319740 202673 335515 471775
16397 471775 219811 350652 343958 510207 144958 501548 330878 412813 526852 69124
16386 402101 447337 286559 448893 326706 380712 477992 291040 603311 116930 276077
16376 276077 461658 339562 470159 778316 232477 279591 178763 439853 150705 32034
16365 152425 654085 167296 329065 418740 377818 16372 436635 245670 394748 240139
16355 240139 69974 306476 229700 375748 348422 232965 49674 418993 141471 399259
16345 399259 179495 121659 409731 390149 215879 163712 165327 102064 158513 -83578 255811
16333 139656 414480 -18651 303928 284992 157541 221923 338243 2324 272189 169019
16323 169019 91785 186515 382104 332287 523020 258346 326653 61697 392014 165510
16312 105541 -77449 141510 -228817 99773 416934 236390 317660 2418 180921 124096 369754
16301 369754 114023 311581 137613 154687 151139 52401 149774 197595 33167 348838 -92906
16289 241948 127666 73317 152746 196752 130885 161936 49299 450779 225733 257124 158189
16278 158189 325034 27117 -72273 128624 107237 96291 36824 307418 -62223 -59660 351768
16266 298065 156409 196330 -42263 29146 280542 291331 355437 -126892 -71169 347481 -39540
16254 152532 -129722 68979 377633 181274 60615 286786 249222 30138 95964 183827 161138
16243 161138 399960 51661 60565 20964 207602 -78076 173387 -145581 -140502 26834 65764
16232 65764 463001 -51244 165917 115495 16773 159447 -2482 102087 434517 84627 393992
16221 393992 -115622 -82876 90016 -9496 321448 318825 -363566 131993 149031 -98984 172354
16209 328931 255063 -120069 115092 -194901 101633 -161822 217966 25790 -4264 263553
16198 70005 129085 110207 521866 55163 173146 -144996 -83708 163655 144248 -68421 -10202
16186 -131846 -319325 270334 -32698 17364 165396 395205 356188 -60024 97564 89259 -164559
16174 -10371 313113 99999 73025 51107 159918 82042 216254 -286086 113706 35813 -198641
16162 -157022 249905 -9585 241432 -115687 -123513 38953 59559 -7114 -147810 106092 -200412
16150 156745 345205 52432 76528 30811 249082 -199807 421323 408018 -47973 68450 -100265
16138 34161 -124196 133167 -308864 91455 -101752 -70016 -226019 291910 39232 -57943
16127 29037 -137237 95689 -12163 -143010 126144 -53705 -407665 327833 -77207 -91194 196986
16115 -73299 128995 322960 83601 -5172 240191 18954 215103 -365455 -93319 146041 -286071
16103 274451 116044 100900 -156674 82362 90506 350858 -196657 325131 -242057 -179242
16093 -179242 -30947 115899 115591 236441 -173627 16740 -383897 250209 35992 194263 -38593
16081 -68872 149807 346014 138692 -185524 -71920 -127300 -111354 103293 -10528 -74948 576583
16069 -270734 -67096 -94141 -352046 -21167 -227596 -193252 -223540 160583 -109928 149676
16058 105731 138171 -192081 -415319 35621 324499 13928 -300620 -33409 62805 -70441 115788
16046 -158220 177279 -304928 -83817 -222231 -342926 299689 88854 -241377 28633 -122027
16035 185060 -80044 -74394 18784 -197457 -147637 -56300 -204967 20960 224809 88020 2986
16023 106886 -316739 -40752 173936 -10686 -12072 -56164 96283 70072 174007 -28484 394985
16011 -120925 -102371 -177306 -11138 -305157 -207740 49380 -29180 173128 182288 -149501 84405
15999 -24164 -108871 -330043 -16692 -611 -184640 109003 -250145 48557 -55963 -48497 -144460
15988 -144460 -388243 -108412 -260309 53400 141431 20839 347793 301586 312585 266803 89847
15976 165592 209030 -72638 -146290 -25696 239239 -37514 -344984 241612 211231 -93931 324749
15964 179558 214996 152070 173922 145099 6459 -101187 -479678 -74001 62674 166921 -147406
15952 -93603 -124846 282675 -239621 96958 4164 219774 -100204 33623 -137810 -88292 -284188
15941 -284188 -162270 -128979 182743 -267218 196 -248960 196388 168771 -65045 -27341 164554
15929 -339013 23990 -95787 88150 -208674 51915 -176260 -12036 173667 -204488 -40444 -283169
15918 -283169 -62270 -99128 -246078 -180217 159025 36864 108110 -84263 33652 -195882 101852
15906 -130323 -52716 -74503 57819 -42925 -44762 -121196 -66994 -66993 52627 -157036 -210589 121572
15893 203932 -264974 -151227 -52353 -233841 -154666 -229534 412505 213119 -91575 217806
15882 214368 -101618 -355501 -171108 324511 -191201 576 256918 -234041 237487 -3254
15871 29865 103573 -97281 189699 -153123 -136487 113922 -472992 201338 -211532 -95923
15860 -146726 -147402 -52619 70925 -82856 202364 131963 -10823 -175735 -418493 131108 118475
15849 118475 -5692 -127534 -201461 160955 -127849 193782 -95888 233208 -114537 -229326
15839 -229326 -45783 33153 443404 -92225 116653 -32237 -45103 -126796 137364 -322346 64519
15827 34614 -225632 8069 -213510 -113801 -114584 -142131 -39462 253550 75000 -345436 -53841
15815 346553 180752 12456 -194557 115788 -158318 -194355 -203605 140756 -96340 178021
15804 -202959 85052 45141 -67796 -277147 97690 -232158 114854 -199108 -171624 83556 115608
15793 115608 -249101 -219493 133446 399010 204600 -230746 -172107 -313130 -203069 -239259
15783 -239259 -69827 -92809 -142207 13209 -116573 12273 -6726 -279970 -439202 -360322 -63027
15771 -158795 -89320 -79442 80011 -77255 130173 193664 93054 -214714 19502 202211 -196830
15759 -171122 -142260 -112790 160136 430216 16456 311341 -129299 168769 -253263 -158821
15749 -158821 -63963 -15617 51969 43304 48592 195876 48149 -72973 -362684 234931 46422
15737 369783 -179366 87447 116648 -222162 -64244 56023 35535 -12044 -210428 58201 -203919
15725 -158635 114023 148790 98125 82915 89833 57047 -206001 7929 -88009 -276805 -214590
15714 -214590 2394 -295361 -44565 -91660 -115294 -72348 31748 -133708 -121181 -159182 -81558
15703 -81558 40189 -179047 -65381 -84990 103295 -107287 25580 195591 29138 -294085 -234393
15692 -234393 -151945 -84629 224967 262251 -88626 176525 -234024 115493 -103543 61937
15681 81073 13365 -168911 -88947 -24995 92834 -255049 214758 -97231 110764 129971 -53410
15669 230455 -3956 79587 -243708 135525 -170077 -133083 -133349 144127 -169323 -239071 50815
15657 -40027 -204581 201625 36301 -106654 -224831 110288 -41507 -37139 -361169 -208929
15647 -208929 33349 333674 -138147 -9445 87154 88232 -63680 30041 -100711 -2236 -222976
15636 -222976 61206 -198972 -261952 -49957 -167829 -283893 -81954 -126286 -188427 -44668 22249
15624 -86017 -254318 60856 -47733 265873 -176125 -85518 -38298 196350 -148008 175181
15613 992 -26904 279744 31786 -56163 -25769 20462 -48230 24879 -97908 -1900 -103878 -44312
15600 317550 191194 -220251 -26902 -172915 219941 -323521 -258102 92191 140903 147863 149892
15589 149892 -245479 316721 104904 -104200 -36831 -5186 176146 1707 -140245 -23639 -130755
15578 -130755 241120 -22180 -21266 -145083 -123433 82736 -165028 -99157 -173451 -20355 81252
15566 -31977 -104976 34218 -66707 226077 -65467 63074 325020 135649 -87908 -138171 -19779
15554 -119283 -138745 -38941 382485 -2953 37717 90010 33643 177120 -243763 -113925 -31005
15542 50028 -250290 131205 -22977 -114688 -10599 393510 153974 -137355 104870 -239923
15531 -39902 -106091 -333438 96837 307157 -224652 129883 265965 152990 -197361 151900
15520 -234936 -224337 -40825 228935 -23812 40765 -27705 3960 148013 105300 -78861 -6064
15508 168672 -71375 107372 -350642 87551 -39699 232605 -319400 -222136 -116785 -27736
15497 -171267 98087 287133 186064 202083 -150111 476126 252550 -507347 -8275 -140988
15487 -140988 -117608 -188539 -128281 186683 27397 -45708 -92752 -284362 -478702 -210206 8138
15475 424024 50272 158965 52734 -23117 35629 74616 82913 146218 -188791 -69665 18009
15463 -83421 44659 33863 -1810 150890 118756 50312 21930 -317139 213567 -368707 45509
15451 -213963 -8605 119907 36855 30889 62305 -66228 168046 -18806 -81315 95467 -158310
15439 91685 -75412 -221305 -269452 256168 -115017 335307 -213392 -78847 -55133 -51220 -51152
15428 -51152 -296978 79158 -137247 -59937 237862 121522 103677 -74877 -10523 -53371 140338
15416 -252272 -257095 -137494 47465 130118 -85530 100197 -82232 -245653 -20130 157092 75919
15404 200626 51258 -165581 76888 13515 -125724 -11353 -218055 -180873 -71855 -104895 120269
15392 198069 384356 -115463 -133974 -195189 -104619 -95366 127920 228008 48330 -112461 75747
15380 -88894 -353902 13836 36790 -31545 77432 155232 411390 17498 34295 -253470 32878
15368 -77151 120290 -318046 -100764 263829 -83304 -22083 -102567 -108228 287059 320845 -217995
15356 -59645 -9559 9470 -13372 130349 -281959 -62933 -236382 -22859 168989 3412 -30907
15344 287913 -105386 -59127 113749 -153341 -84885 -61871 -239875 205111 -31599 -41312 123648
15332 1488 333441 64022 125664 150023 157387 -181401 147123 -121460 57097 -18556 177516
15320 225868 -220685 224534 103255 183955 229507 -251420 113863 24649 112815 -98766
15309 68581 262986 -153448 400550 -135467 103001 179854 183572 284002 207484 -223711
15298 104945 54482 70465 528190 -116650 -30185 55091 42666 -206658 -47003 10041 108938
15287 108938 26713 -56507 178390 147192 287207 119278 67620 122224 -136022 -83535 -158271
15276 -158271 -213332 42032 69951 148689 -5264 109227 180212 210348 28460 85010 -219980
15264 -16753 157612 134421 -141520 254592 -97407 196133 -139132 242298 -82622 -8657 39748
15252 -201802 -167187 196368 446517 293199 684692 1699158 1298806 1611563 1299857 606321
15241 276429 -42520 219742 12616 237849 103874 72928 177799 307300 89541 -88080
15230 -111989 181791 -262768 161521 -27811 133908 -150157 281398 -25763 7067 -181903
15219 -95535 -148673 -30433 66840 95673 -96880 -202 163193 -96092 201831 -18870 -147930
15208 -147930 -333523 412914 275091 181438 5212 141892 -172726 -213584 18249 86183 -98087
15196 21164 -163725 142999 -61984 -16582 131387 -4219 138401 141646 181118 82812 52850
15185 52850 62574 160277 196899 111311 -136792 52349 -123270 255558 122059 57948 143854
15174 143854 260724 -75661 78644 -218776 32253 -26347 402024 72199 217676 -115253
15163 191316 272386 76110 324475 78486 57193 232122 -116146 -200608 360853 308668 178567
15152 178567 82564 87804 392583 54022 186417 237606 335142 198863 -92775 -203893 199154
15140 303423 334942 -45930 109181 -170060 -95500 -19754 419854 242947 95150 -281926
15129 -18529 -90561 98719 -6415 83226 107657 130577 -78979 154422 -61829 224692 108712
15117 -296058 166944 107996 134648 327249 -23027 127879 106622 221753 323355 -112977
15106 193981 188007 385662 359832 32938 23726 90763 100121 -87826 395020 148311 285515
15095 285515 -202599 183578 -178343 16098 23684 13753 126365 4411 328699 338226 103209
15083 67513 260948 19026 353058 30365 29501 225995 327894 228557 279134 162883 91711
15072 91711 408771 122285 194573 39027 -2096 331166 220410 232109 217131 1635 55542
15061 55542 276107 278660 483707 652270 56108 -121101 216521 192853 63401 267181 264151
15050 264151 190557 311621 42065 329243 94194 404732 79711 275993 -61185 216087
15039 481669 374942 269620 -194956 264778 -50122 86281 70182 288935 345704 83401
15028 33061 40505 88369 223525 218908 75523 226035 292708 184090 151358 303335 368602
15017 368602 -26679 225076 299965 309909 308819 126454 209076 232186 104292 232389 498377
15006 498377 122211 189874 350729 -29147 338978 240498 356676 120303 72437 124339
14996 124339 157267 60685 454567 363292 403027 121751 178790 327111 39238 568133 151931
14984 109163 569473 207173 184888 466568 397129 170077 152004 329236 142022 105630
14974 105630 263365 190215 74226 234221 -29389 190824 192879 383414 97549 164911 440149
14963 440149 54263 108225 88437 261932 303384 392529 110557 117140 195544 219994 191625
14952 191625 372811 378730 18042 90472 106014 421728 169961 93375 -17869 454121 566675
14941 566675 -101011 322358 167283 331882 363736 -39597 52415 -26972 158998 208307
14931 208307 612889 307779 619874 181972 180600 469328 347722 158816 329829 -62698
14920 360760 301444 557861 260151 553468 89786 453856 206242 359026 199436 326820
14910 326820 400443 151302 339674 171990 490967 109474 114123 207566 393851 113310
14899 299021 337002 369495 308063 135208 135509 201843 458758 626904 270113 300129 477373
14888 477373 377337 178287 38082 560973 436056 137829 255841 421290 216322 557117
14878 557117 316576 749755 531403 225660 439981 556097 169766 420536 385388 521383
14868 521383 182746 214603 550219 281686 378464 525590 317656 478057 476416 299215
14858 299215 450957 688826 605151 125989 176684 503593 602907 527194 451468 307925
14848 307925 339708 716851 337191 463933 586666 572717 483227 534973 734944 454453
14838 454453 361759 372852 267318 819979 522446 375463 476648 543521 467805 793589
14828 793589 629525 409463 522620 454723 705072 397651 436553 661559 588513 414541
14818 414541 718338 383980 360366 659300 564714 525180 549615 550609 284346 505895 647901
14807 647901 816158 752276 797031 553279 824411 734357 515401 532259 219981 500542
14797 500542 460158 547326 517106 559268 298126 470127 461611 827444 415637 704056 838303
14786 838303 567285 843449 852248 626089 548316 459555 641395 708204 654149 747610 562062
14775 562062 553697 786570 808862 755798 675147 775248 929874 818365 760198 479749 579005
14764 579005 509687 876140 811060 737110 587711 291545 722675 306054 544356 532631
14754 532631 449633 770864 725269 587473 485983 709976 880900 727080 892341 1030650
14744 1030650 537369 588688 811347 730959 770611 628368 869392 695870 210537 1124085
14734 1124085 645317 663053 1079143 550362 734440 747302 900027 913017 528778 623272
14724 623272 874893 804584 1136238 754383 1074470 788479 1101820 865817 1111993 941564
14714 941564 604460 926603 864503 1160567 1295955 1094673 1131441 973398 908119 848070
14704 848070 765732 1078577 839183 961954 686367 945759 850159 1022646 1007718 600759
14694 600759 894930 950482 951302 859298 953205 1034852 845812 1138719 961167 1237356 1088478
14683 1088478 753122 1057264 794373 1153288 753024 1168268 971840 1145796 1047804 1243544
14673 1243544 1128146 1000275 951877 1189337 1299310 1153550 1203318 1165174 1168683 1232454
14663 1232454 1206980 1006324 1217395 1098463 718888 1263050 1153733 1311021 1123019 1521451
14653 1521451 1140837 1142038 1095689 1348599 1383667 1380281 1225368 1406430 1233123 1107712
14643 1107712 1122652 1293373 1253242 1291113 1209453 1645136 1285102 1647100 1586991 1482484
14633 1482484 1680028 1356348 1269072 1560265 1719430 1796504 1589141 1486096 1535068 1690635
14623 1690635 1956280 1485428 1560357 1103896 1590992 1688864 1292111 1550582 1450180 1625701
14613 1625701 1688661 1929291 1366386 1809936 1736508 1988509 1719813 1662157 1702875 1620047
14603 1620047 1742677 2087385 1674145 1888405 1587882 1621347 2104560 1943419 1857058 1831658
14593 1831658 1848972 1899245 2184231 1759853 2216785 1991913 2056401 2118330 2131531 2295107
14583 2295107 2159237 2225786 1964151 2188443 2126312 2123523 2476867 2150098 2230591 2444512
14573 2444512 2399074 2427602 2298412 2721589 2622560 2579429 2663937 2458433 2544085 2776616
14563 2776616 2762444 2763398 2953749 2776087 2896949 3133110 3334612 3377087 3745436 3873788
14553 3873788 4107582 4726847 5086201 6950109 9152505 13513573 21935981 35687013
14545 35687013 42312385 25314394 12208411 6777973 4699549 3329564 2739836 2543628
14537 2543628 2644099 2345277 2429556 2264471 2294754 2642787 2303549 2196629 2548388 2375554
14527 2375554 2289612 2399640 2614191 2913460 2676838 2802455 2568991 2879698 2921308 2865094
14517 2865094 2931490 3061392 2860145 2959315 2896478 3068120 3352905 2891161 3201112 3092876
14507 3092876 3312577 3523419 3139482 3195978 2995052 3505467 3424633 3306601 3599408 3785919
14497 3785919 3516626 3622796 3857958 3380372 3595857 3709852 3962039 3739393 3531539
14488 3531539 4095431 3907754 4208762 4081898 4174927 4025312 3906933 3991248 4252403 4348860
14478 4348860 4489858 4311353 4273815 4782227 4247265 4373683 4711682 4694950 4568046 4798599
14468 4798599 4809065 4689166 4863215 5058244 5090007 5181419 5386254 5334384 5557919 5100437
14458 5100437 5495753 5533815 5492686 5800017 5735957 5355960 5886378 6002182 5911070 5878215
14448 5878215 6210431 6429977 5734734 6580749 6471503 6329669 6422235 6922187 6671761 6914122
14438 6914122 7030059 6941413 7246463 7245068 7315329 7388585 7622326 7574982 7635022 7954263 7919954
14427 7919954 8029449 8199912 8141788 8235601 8351373 8491482 8810535 8702016 8889901 8901387
14417 8901387 9206796 9184548 9656925 9567897 9764879 9887045 10028345 9986548 9938655 10617682
14407 10617682 10250414 11025775 10814835 11057072 11453971 11606054 11508300 11713222 11804811 12285648
14397 12285648 12367160 12476288 12663779 13076493 12910783 13233574 13533988 13732089 14277790
14388 14277790 14160448 14814144 14674613 15062149 15250396 15668421 15975954 16142624 16691155
14379 16691155 16853414 16653438 17625479 17754334 18293881 18541502 18593619 18798608 19835030
14370 19835030 19912036 20175772 20383555 21249820 21640598 22450015 22527982 23351033 23402311 23985458
14360 23985458 24866790 25171959 25740804 26414511 26714132 27636096 27928193 28858773 29451603
14351 29451603 30208421 30969394 31814904 32683353 33250806 34030531 34718358 35927528 36910766
14342 36910766 37783998 38832465 40009363 41016826 42139217 43343659 44677532 45823935
14334 45823935 47237835 48736219 49850386 51728642 53194108 54785379 56098316 58481962
14326 58481962 59866522 62296567 64119781 66393368 68480748 71028686 73608041 76180842
14318 76180842 79125564 81845448 84812508 88463139 91777832 94815572 98806790 102913933
14310 102913933 106894711 111367997 116067399 121257285 126387432 131431590 137143496 143228981
14302 143228981 149516501 156755556 163757966 171632330 179509944 187855959 197118994 206424285
14294 206424285 216745117 226987887 238217009 249749032 261754028 274222517 287399120
14287 287399120 301209950 315197325 329606543 344310155 358796504 373756826 388417723
14280 388417723 402964517 416731843 430082670 442365879 453455549 462525528 468850216
14273 468850216 470398971 469580836 467699545 466540661 466361350 465081905 456645864 446647789
14265 446647789 436179102 425058907 413562941 400924061 387379903 373116733 358669939
14258 358669939 343744190 328792330 314052271 299899742 285467360 272968964 259345141
14251 259345141 246472330 234419972 222988094 211895189 201677042 191858860 183062599
14244 183062599 174375368 166545061 158552339 151579609 144627245 138341873 132404163 126821882
14236 126821882 121437089 116341063 111065339 106810918 102849455 98938183 94837551 91243387
14228 91243387 87947306 84428495 81238177 78182613 75651549 72718070 70398716 68020087
14220 68020087 65618362 63878199 61269249 59157046 57431990 55491219 53922083 52661615
14212 52661615 50827871 49529445 47772787 46386780 45213720 44449543 43110157 41838702
14204 41838702 40471051 39126117 38497012 37572241 36649746 35669249 34514346 33820853 32803140
14195 32803140 32149116 31397941 30660616 29989981 29252296 28418040 27836160 26614271 26511325
14186 26511325 26226669 25305190 24672068 23987550 23782631 23241621 22648061 22249112 21890007
14177 21890007 21381944 20858351 20296192 20283542 19707523 19347790 19046321 18589919 18157552
14168 18157552 17869770 17390962 17205450 16943096 16645740 16377220 16065579 15951568 15466141
14159 15466141 15507494 14904195 14852421 14532374 14311029 14262632 13739947 13667750 13419887 13088401
14149 13088401 12850078 12775252 12527577 12644099 12165258 12235408 11976967 11687978 11291120 11028501
14139 11028501 10914411 10879507 10587225 10570020 10476600 10155860 10319578 10166202 9729866 9608149
14129 9608149 9648472 9657150 9330243 9110394 9319006 9119567 8579014 8657040 8607013 8621289
14119 8621289 8421551 8509935 7892779 7900660 7881717 7613959 7409856 7939256 7479329 7580627
14109 7580627 7324903 7357467 7050957 6831715 6863528 6726315 6695358 6757882 6765639 6478233
14099 6478233 6444697 6662914 6162475 6509754 6237066 5850772 6289330 6376382 6038897 5908630
14089 5908630 5715852 5674952 5526540 5704360 6041397 5699669 5230920 5606641 5464186 5226776
14079 5226776 5388930 5174116 4969660 5093652 4988278 5046788 5136151 4947160 4924344 4827297
14069 4827297 4700071 4775264 4627945 4664973 4341632 4333793 4205923 4326474 4215006 4272981
14059 4272981 3881744 4692858 4113457 4203616 4185482 4268521 4173329 3890902 3749493 4154716
14049 4154716 3583377 3879790 3929200 3264421 3721398 3357600 3162551 3602000 3243531 3537041
14039 3537041 3503096 3567041 3537829 3605087 3288269 3156098 3412786 3196223 3464919 3324945
14029 3324945 3420918 3153689 3358865 3128751 3202040 2945681 3157544 2803726 2886800 2840539
14019 2840539 3033246 2774836 2692943 2861905 2876707 2773297 2719779 2733799 2649764 2642364 2611551
14008 2611551 2404939 2637997 2448603 2625390 2458087 2260099 2571505 2458110 2439312 2455977
13998 2455977 1855022 2586560 2166153 2607106 1885290 2302336 2336781 2522837 3117512 4766922
13988 4766922 8345287 15261780 29535064 41843010 29685808 14850747 9413631 7191799
13980 7191799 5536126 4785709 4297856 3919480 3498601 3446733 3046916 2968108 3493974 2791887
13970 2791887 2782690 2519634 2501531 2589865 2534911 2708019 2575970 2670979 2183187 2314451
13960 2314451 2246402 2123131 2352411 2367941 2495337 2434082 2340761 1996411 2241187 2163015
13950 2163015 2199637 2276277 2237658 1745113 2040582 1848280 1970107 1667205 2224217 2006356
13940 2006356 1910164 1781090 1794630 1903945 1753216 1697930 1676500 1972376 1808261 1680687
13930 1680687 1772552 1584194 1671209 1831341 1841710 1832039 1532962 1732379 1786122 1671965
13920 1671965 1481864 1657416 1872866 1795599 1727741 1752347 1902192 2113488 1734945 1593321
13910 1593321 1610308 1560563 1411888 1810118 1440001 1242600 1486978 1299544 1262953 1365658
13900 1365658 1496035 1504076 1586510 1008013 1466354 1459295 1389604 1712898 996242 1228414
13890 1228414 1433029 1383185 1186055 1063120 1490176 1286863 1247951 1056109 1423133 1434180
13880 1434180 1251355 1258193 1172517 1366541 1289218 1357506 1278660 1510814 1222214 1162934 1011344
13869 1011344 1341385 1385721 1364705 1439251 1210068 1215761 1393461 906127 1434877 1430265 1222441
13858 1222441 1571945 1313180 1436103 1199789 998936 878592 1491069 1035760 603829
13849 603829 1005663 1260819 1658517 817464 919320 1326871 763697 1078794 939009 1397779
13839 1397779 1052953 1145496 1099118 1039751 909117 1244432 1112634 1136105 1122027 1176827
13829 1176827 676853 999391 838001 1155637 814273 941941 958251 850315 1039781 1045858
13819 1045858 699059 841256 1068167 823488 999189 884270 985164 852256 911148 968586
13809 968586 1018019 659861 986970 757640 522009 721262 729623 903289 654455 573282
13799 573282 1033365 828374 706184 960632 800994 677012 958190 630256 777104 772106
13789 772106 1039587 1033258 923983 708952 704655 856032 849365 796111 664817 889244 918507
13778 918507 811193 724774 807808 875627 1080340 567767 577961 637756 798313 952971
13768 952971 721898 768700 729594 934338 497054 777602 616112 663363 750862 559944
13758 559944 814958 554964 964977 910439 877708 482191 833809 809762 492107 681069
13748 681069 988909 802880 498625 1015819 741408 545954 466329 905291 368424 626415
13738 626415 919688 384669 728713 977057 824014 845645 442159 266595 400657 609375
13728 609375 618185 710186 550364 601537 648040 645953 602848 704800 416802 657796 933031
13717 933031 697584 534439 529291 442542 628670 763311 555659 695904 580273 577323
13707 577323 306102 467374 669727 684769 284227 191666 518621 532808 559418 161964
13696 545246 629912 758369 615799 57138 249036 467586 455089 510741 658201 708721
13686 708721 353759 744095 176413 335365 566118 652195 692375 262902 377130 468315
13676 468315 528790 627553 785568 667094 478635 540079 159800 559486 265870 176947
13666 176947 398848 348544 811746 727125 315054 479338 557081 371630 361113 765140
13656 765140 381798 304234 706045 291910 85923 184126 657912 487372 373342 626657
13646 626657 439101 556074 620212 421959 485103 414848 455499 358731 420734 365698 689473
13635 689473 66499 206461 512656 307543 363659 447116 465206 368765 359148 528680 635774
13624 635774 306767 490149 383363 457069 329502 562173 448800 274768 249964 193114
13614 193114 628672 498086 251744 370831 269619 459435 460137 770644 113842 273476
13604 273476 756179 725446 216464 276086 607714 -12142 -23769 651036 517330 358244
13594 358244 571309 221097 694787 334226 333304 520005 111280 465758 654955 457568
13584 457568 475110 494545 390185 471773 116559 463498 351106 240996 405986 397773
13574 397773 343563 82218 511472 530766 36457 286089 522135 318170 657314 205545
13563 187581 71565 309862 474571 2430 398348 397952 390621 207958 94364 580161 499122
13552 499122 202705 435069 162969 341304 376840 804939 166107 328865 388153 287939
13542 287939 362866 528703 682280 458334 357465 466802 165768 464786 479468 455719
13532 455719 439832 321916 34256 299873 285747 366048 253837 283886 468428 351265
13522 351265 256406 420772 565565 502987 541001 631849 58324 291846 267879 516724 196022
13510 583825 79792 428377 232538 272105 643319 310404 132638 387724 371925 204052
13500 204052 339421 -123948 304398 116139 254854 111047 259939 104699 296733 430641
13490 430641 416967 295018 414085 449363 422443 340203 612273 23250 535384 244952
13479 46542 305168 86806 246447 -13651 243605 154910 256143 164851 238170 71297 115061
13468 115061 172531 271994 239646 474086 240095 366761 517184 27125 94121 86070 471558
13457 471558 81637 247288 -101975 -116409 68912 298768 313099 343220 430024 565809 525827
13446 525827 284450 64916 282542 -22964 205017 303672 205515 199273 343859 272309 638227
13435 638227 394268 472546 641137 116153 -13159 401206 147240 -109098 250853 261163
13425 261163 56325 51114 231193 294684 -31892 418146 -146003 148082 119749 600195 89032
13413 -45798 525959 411405 297441 215199 437749 314577 191374 132268 125573 231302
13403 231302 321447 681246 -115007 171939 509830 216320 220664 397683 37066 -97518
13392 -4431 341453 202350 224054 35458 323415 214240 152195 318423 56511 -5780 405341
13380 99082 -236272 369386 135340 -169431 286848 218063 56117 347111 409380 442 248416
13369 248416 220173 -210135 281986 34213 272879 -23477 396995 261020 380129 324628
13359 324628 348325 412164 -107948 222490 298024 361204 476704 187884 125007 46082 237938
13348 237938 348392 328627 454305 237021 184458 579037 340565 331494 167696 191282
13338 191282 79900 476750 332798 147329 357137 455364 182111 242198 341490 279674
13328 279674 -621 111752 32560 285942 222478 435271 126180 140161 493383 190509 126080
13317 126080 50433 159641 -15441 159702 242813 -11455 251081 67778 138640 284505 -11875
13305 17918 351191 40291 211592 169895 298411 -210182 46632 123089 141400 23563 -44977
13293 505819 81688 467283 57913 -97885 321289 126381 168057 316848 -20929 109851
13282 -4329 -34588 198800 49545 202265 -130643 46334 446548 198258 -270253 255889
13271 -61974 409645 -812 266648 223093 237915 127356 305881 127861 -34079 236245 245713
13260 245713 383436 42419 332081 152731 428430 311188 -67863 363226 -153868 82300
13249 53198 145399 -161094 54187 270930 122848 146076 96776 197532 23439 -20340 175835
13237 -246541 249934 130841 -33891 149033 404898 529162 398870 -250914 341548 34519
13226 9664 -327117 24077 277484 85658 277144 26967 82374 530276 250359 235300 -235697
13214 -98679 2903 -67191 157003 16541 -156034 197449 257355 32047 38694 166219 103335
13203 103335 145887 -61232 -122466 -37747 301822 93516 -61944 37815 88152 26390 -225409
13191 -172470 440434 -122537 271681 20663 162979 170002 -36606 -227766 -29976 130911
13180 -73993 111275 239399 195290 12599 170333 15638 83828 -26721 349021 514358 364429
13169 364429 -336796 11875 251375 118802 -67783 151379 -242073 -36392 -217966 -213843
13159 -213843 195064 275423 -38516 193765 422985 84512 -205997 -273976 -93739 240388
13148 -204084 222110 327348 267669 316402 -110593 -32025 76895 115020 144132 357552 489650
13137 489650 -34940 235540 261291 -13970 258386 -130963 114577 57761 203043 321251
13127 321251 -89013 -52037 119931 24471 -20164 522450 348211 197765 81142 -14537 325114
13115 30245 15269 -248145 10942 -69966 -47350 424498 -58791 209848 187742 264398 -94756
13103 330209 -103731 -43279 75422 -135231 -127935 119465 236367 37182 57110 114379 -77184
13091 396864 27571 46160 72056 -43308 -9397 238152 -12918 -23499 -270006 -103672 151718
13079 324532 129773 352550 -48350 113589 320915 486640 312435 -127955 10887 77446
13069 77446 425882 -137430 12092 -128197 283020 294567 -32987 286914 84227 40063 331756
13058 331756 -166806 88152 22808 -13050 111387 134094 48767 420343 61716 177602 488661
13047 488661 463775 -48686 319603 286192 -96692 311667 162686 315579 -8213 -53502 -98442
13036 -98442 300028 -76332 295138 204104 110373 -64279 296794 43065 240015 76507 -272994
13024 236730 -13835 253082 114316 62259 345115 186368 124405 33174 297730 15893
13013 217973 128949 -130747 410970 177100 228982 56884 80816 -44993 -3182 56138 234537
13002 234537 375879 140964 -16882 597326 -133797 507470 352384 244668 264922 8737
12991 -6624 159006 246627 55138 -197902 22763 -159592 268096 233150 28572 -170704 197228
12979 3767 44334 107103 -190944 165740 105647 -57321 -3594 26579 -19929 -243926 -207577
12968 -207577 39688 116643 -117374 -72575 200578 134586 -146493 19747 13596 -108541 33509
12956 -54667 177034 204309 -61620 205761 214297 -125979 193976 -276573 -352497 134089 -128106
12944 240607 -68156 218707 -341396 151511 86773 -102612 -119813 101615 94253 332819
12934 332819 55928 155749 -143148 58476 287035 -21530 -85188 61033 165923 -41822 137443
12922 -93589 50524 21845 -179373 31789 -117601 60737 123407 150964 184965 -202959 -31065
12910 47746 -33295 -38918 29577 -59372 -150495 -349708 171502 38428 -70204 -74880 -71775 -133756
12898 -133756 -157041 125372 -162154 2483 -2085 118368 -7279 -62610 15262 358811 113647
12886 362924 79696 177860 305542 100175 -154687 -11390 -139211 -249302 34078 -74451
12875 382799 142430 204974 -157368 50965 280333 115072 385393 -13315 -70437 389 107864
12864 107864 -180861 487547 69567 178782 39978 89910 166331 287674 167021 -355995
12853 224139 308105 139940 -224406 -108212 -172310 -184025 144884 53804 31580 37327 51087
12842 51087 -60182 244060 -88978 -57158 -327077 211418 187770 66480 -32782 357391 -117503
12830 -217154 212927 -241130 -117649 105381 -103701 157321 176827 127356 80262 -9295
12819 -131085 124816 126878 -190072 42059 -164097 -7728 105613 64586 117643 363470 68193
12807 328292 287241 -155715 237777 -170555 53428 58215 -24951 141556 153844 -12331 172745
12795 -192003 -68567 -2866 103768 -86867 -16152 -497038 27863 50866 217409 -102166 72225
12783 -12988 -86467 -76875 -190278 55740 215263 203565 -43142 15884 -258246 187083 -220839
12771 297656 77216 -166586 -4159 115622 274167 49289 358025 11181 315350 -176104
12760 139410 218719 241999 116983 -234690 -160072 -863 141454 91715 299831 -38735 202082
12748 443652 -84011 252851 -125781 155265 138136 13034 102351 -154245 380937 -4663 27376
12736 202243 99455 -118791 -68301 181444 98574 -132032 193547 41295 -194093 158796
12725 -112712 210330 -90435 121532 75096 56415 188160 -172507 -5876 -84152 312323 15266
12713 -139702 169017 125129 178469 28232 233109 127505 51196 330537 127675 83329
12703 83329 244448 442353 291744 408590 66394 -19217 58668 -55411 24462 312159 -137467
12691 -191904 111700 336915 288970 -195319 -122746 78320 195358 -152205 -105319 -75528
12681 -75528 349846 -67031 395500 286000 298258 189958 349158 276265 43887 280093
12671 280093 -135257 128265 -294219 46034 -163817 63572 -67058 87205 14758 -106730
12660 -34671 -59926 110280 200110 -40582 124849 60577 111776 -42980 -55284 196759 -229364
12648 409650 -52865 -8534 172631 147706 255617 87097 -166173 191441 -38931 -86582 304244
12636 -198471 -49339 167673 177836 127128 114656 -27292 148177 80520 147709 35331 365233
12625 365233 305512 211288 129905 103513 11318 -73598 -293280 34956 193870 101644 60503
12614 60503 -58903 267549 -150532 105640 -135352 121093 4426 -151307 256010 -32117
12603 80213 6952 72314 -32336 434801 134263 -46259 133581 -187644 33110 136456 47314
12591 77318 1349 195445 -158540 -79669 -409187 325706 234631 -63162 212895 -44265 199650
12579 -33386 -343870 42730 2065 -123272 398302 177835 -206972 51924 109653 -145942 43795
12567 -158650 49248 76054 197523 -273887 95236 55423 -203379 -302549 231233 -116180
12556 -146737 -135011 -304505 238451 -101798 266472 -218701 99605 -53621 -75928 194825
12545 231947 142254 125189 132772 -221626 208940 115053 85216 -76813 -28614 169434 246606
12534 246606 273065 -154077 -124091 -83645 -53397 101875 -84594 -133649 26795 81582 55647
12523 55647 90050 383455 76877 -120746 146920 -110475 38084 11808 188026 234643 21204
12511 -161681 135964 118693 -60145 180481 -23714 -79036 303683 -180762 251191 -270800
12500 53743 24691 216564 243996 377848 80579 213058 96084 -33329 230947 301116 -115244
12488 129685 -117642 -2050 49240 -277815 161769 189159 27570 48067 -102625 -184193 -98229
12477 -98229 83519 64213 127010 236 161949 -98035 163890 105352 -17752 175998 176233 113072
12465 113072 -35560 -329872 5532 101991 179156 -254855 -201941 162252 229637 32329 195300
12454 195300 34512 -185334 -925 63825 262526 86510 -74750 8039 -98431 126564 76916
12443 76916 -98707 420275 -19220 213239 -27360 38492 74478 -243241 109745 -147983 -189419
12432 -189419 -221966 -192845 114765 140492 134595 -137034 296833 83005 32659 95489 93056
12421 93056 -75314 -77199 -268639 -45098 -118164 -97476 176619 -168309 71580 231154 61298
12409 -490329 45764 57113 -196639 -473767 -178201 214993 -43971 286963 -92625 26534
12398 -273157 126949 112278 30124 99362 367706 -149278 -86507 -266864 271254 -58583
12387 -41407 -62842 -228609 -120571 67462 -112499 -16979 353405 291527 101883 422080
12377 422080 183155 -118802 -146367 115307 130863 125192 65691 -137620 198973 -134953
12366 -60515 -77280 -39816 -225743 -268238 -48248 237024 204163 -115082 43503 38497 -38934
12354 31876 345589 -238383 48674 -146572 -210347 83363 -93921 159109 15793 -70995 232993
12342 -290661 -3418 -230281 110799 -1766 103323 -49384 -213171 175188 -185830 25859 -133810
12330 -206604 -41520 -273775 -62151 191784 -341858 32098 154480 -179316 -71187 85606
12319 206314 60232 103795 110333 145656 -217621 -59838 -4092 223657 204138 -17616 130877
12307 23929 -17490 145323 -81272 -4802 159153 -70252 72485 64348 303992 -85077 66188
12295 27011 129177 -311509 136560 -10930 -335760 200603 -70010 207504 197977 219137 -200012
12283 -75585 254973 5495 205387 226941 -77570 27969 65181 -172205 99640 145882 165374
12272 165374 198170 298275 -38552 446067 41809 4596 310261 87778 268060 -45705 -17702
12260 293840 13547 -183438 419957 439408 -41699 149317 -15300 126941 46120 132106 233780
12249 233780 -344786 399201 214898 73156 126526 81209 285307 169633 -36189 -306595
12239 -306595 124704 -198054 -1850 -38665 -208058 -74967 313715 -121154 -119622 56564 123490
12228 123490 55258 405008 214488 227260 513920 308200 345498 298865 162533 309846
12218 309846 199690 92591 403271 -2778 407810 230379 56236 25244 306674 290612 103270
12206 215056 42972 47771 488556 117612 281251 693293 319872 254817 122180 431960
12196 431960 140768 86952 265021 23415 -188713 32612 63895 77584 -59112 37002 -148592
12184 124588 256389 265272 360753 96845 -51487 -3711 304210 15761 -178150 257248 52918
12172 76854 199412 240818 301556 259689 -175532 366754 298571 -294188 366913 36790 268641
12161 268641 199230 332639 103659 -261936 61572 215338 32061 370381 224324 -55038
12150 -77004 43809 31521 41961 349961 101424 50439 23802 184869 102834 249097 148942
12139 148942 -132349 188213 -181282 -159144 99091 307035 165341 320423 72181 -185097
12128 133865 35274 120290 -74886 -14459 60474 -205245 -126345 80522 185798 -25353 -135422
12117 -135422 -219845 -37883 131922 -1940 -322440 244594 279681 128312 -72245 -283531 -212540
12106 -212540 -23659 24541 -76296 -39054 -97935 -1745 -129878 -338213 -203194 -70294 42217
12094 169219 236085 -136415 170421 173848 -150682 -62496 276227 -239452 -435765 -161678
12083 -60219 355707 -17228 20218 -141773 283016 177611 27704 102931 125960 -105172 37510
12071 -12129 64077 122102 -324371 32145 -153914 101904 -82750 -492580 -30579 -4218 107144
12059 216103 213095 78257 248472 89684 84585 1057292 1279090 1276433 752136 76152 -165780
12047 125305 52266 43849 299739 80860 -303801 212857 -208758 -27802 178531 -123205
12036 -85826 -31847 24404 -55330 -165280 154216 2080 -110839 212151 -234772 -293329 -223698
12025 -223698 45768 -23029 -286661 27583 -274145 -142119 -210653 73905 -53702 -200053 76925
12013 149052 214114 172096 -19270 -319571 114957 -3984 -129648 131008 -71739 -31745 91247
12001 184021 75210 242774 -223553 -149118 232289 -112188 74424 -68402 -151613 -122129 -143884
11990 -143884 210599 88184 -315847 223366 213947 100290 -14995 67351 65695 -153693 108173
11978 20940 220730 -195114 149793 154270 363969 -120572 42439 56062 160909 -121974
11967 66966 61560 -16728 215206 -295466 484609 -46923 -234081 -49511 58029 55330 61633
11956 61633 17377 -186014 -285553 -148185 311514 -94244 21334 119718 57247 -290535 -179966
11945 -179966 165689 37505 -181951 -158019 189759 -73453 96691 -89916 -150081 -970 -12264
11934 -12264 260110 221357 -61630 -77856 42149 -277087 -69118 28674 251149 159815 -146735
11922 -231539 -76650 35248 -232690 53458 -249309 195283 -281893 -68719 27846 -73321 -293008
11911 -293008 68036 334974 61224 -78056 77133 -14205 68248 46150 239793 77089 152634
11900 152634 172145 -96174 53703 -231251 -132163 111781 74848 -91582 184907 143271 206113
11889 206113 100528 274709 -189192 -142078 -259998 229404 -119293 6068 -152179 -119349
11879 -119349 148789 113115 99910 135468 -93329 -23916 19638 170717 125960 -224073 -99870
11867 -201396 -117520 -89435 65163 64588 -16649 137450 -25372 -161917 229541 -66671 -373670
11856 -373670 -199429 -30648 113677 136444 -16662 -258777 -217206 -260062 -285705 -281516 40666
11844 23477 170687 253155 198311 131621 226579 -232454 13996 -321492 56512 12871 -37059
11832 -286194 -195307 -309119 -299385 -189480 -314464 -94543 48826 13335 180426 -32065 37720
11820 -188260 -179141 324624 -343174 71287 393469 171597 -276859 44027 154709 -60952
11809 -57138 153552 -96244 5457 -68706 -55989 -96090 280194 -54422 -107359 133410 82868
11798 82868 137206 -133509 -504407 24073 109615 -34480 60489 -213235 -140372 154418 -36765
11786 27455 238313 -116373 -10937 -210317 -302578 -86748 69350 61297 -101881 -158108 -136669
11775 -136669 152565 -33204 -46848 236952 118182 -124466 -203016 201751 -174282 243172
11764 -32576 74308 -34454 -377334 31966 -171071 -106524 -46708 -104710 -88017 208610 -110138
11752 -247925 38087 -255505 -42688 246430 142874 266178 -52220 77526 104707 -59174 -22517
11740 -195392 -233029 51698 35246 127890 55139 144368 -97767 495962 -66059 28816 216409
11729 216409 -88596 70490 -170370 -282425 -106295 245423 221772 24567 -94052 -166372 260127
11717 -273776 -39790 -58846 -3478 148286 250161 9669 -129779 21780 197637 49722 -246365
11705 18289 -158603 -119753 46268 117048 -63812 35934 175937 137993 -30495 48843 -17869
11693 45711 -129162 94683 133173 -188152 116390 -158400 82858 132712 77240 108934 63390
11682 63390 -40700 36052 117631 287791 137072 402172 218994 43354 66934 309412 59947
11670 151719 65466 -118636 -41604 284884 -125178 -68568 254534 -44405 200693 40636
11659 89300 16288 10091 114937 -59540 -214489 -263575 317224 -68043 91130 154699 64439
11647 170038 85994 116693 -151479 270560 -77021 -122835 -59662 -49564 82501 -149114 -29127
11635 19881 122007 -90409 -108698 -251124 107291 -240580 96946 181878 87378 -42850 -111203
11624 -111203 -26549 402514 -88587 -46083 -188679 210051 -57855 354643 102729 -173583
11613 169961 73907 -202178 -239282 -195478 -182638 119082 -69307 178631 -338212 131611
11602 -24398 -270439 337254 123256 -30154 80814 114553 -57487 176803 -47610 -298122 238457
11590 -127141 -29823 -158871 -43528 327683 -20931 154490 298143 73628 -31504 -23733 -13600
11579 -13600 56737 -211355 69025 98627 79045 -219261 14627 83487 100164 -69173 459405
11567 269080 -27395 116789 -208170 314931 107458 74401 -95671 -57205 -78169 80233 258357
11556 258357 196403 -64182 133760 -215488 -202911 215852 -88839 -213664 5705 -38371 158708
11544 149453 176088 -38045 87734 303938 44485 21126 -148918 262187 132655 -262732
11533 -88201 167051 37025 -113612 332397 259048 186297 495872 -120718 -78208 31678 187732
11522 187732 91405 473196 842152 233014 -193209 255901 71082 113879 -49801 353213
11511 311468 4591 207842 207019 286277 4280 63887 279800 381421 281279 83200 258636
11500 258636 375303 189706 -31803 16082 -24121 184143 105307 126228 170172 359110 122769
11488 353732 182429 347648 126403 208249 223246 97505 471553 265079 -90335 76911
11477 504397 137360 33697 -102719 411161 -82800 421384 218355 295538 63092 212620
11467 212620 -194573 189080 331859 -35577 17461 -48929 188435 263843 192575 90403 254440
11456 254440 -92510 74993 63755 472725 300721 -28100 -50458 4760 169211 -193935 -268512
11445 -268512 273639 170811 183185 285812 -49244 110211 -229029 236143 115441 -2238
11434 92257 -122015 227698 -192039 -55091 -149173 -102865 24504 98274 200487 -201496 -27366
11422 -51011 -347982 175284 -77548 210109 352533 73679 -323220 360722 291622 -61183
11411 -60586 129691 228225 214596 -144681 -224962 144280 -76873 535810 -137205 -61160 -49156
11400 -49156 345682 50032 8653 78698 213927 139266 356318 -73622 23152 92276 -71742
11388 63803 -268737 -114847 84839 79341 87873 55493 281746 -89395 -226846 -8115 -174042
11377 -174042 -124654 103196 399095 10497 -62094 -238880 159450 -290646 95769 -239711
11366 240012 48893 8168 -187092 -84751 255607 76145 -149530 52312 194684 -186731 21954
11354 -121062 -342440 -259629 29914 -101758 167746 -89866 -21770 -288168 38423 -90010 -129178
11343 -129178 249573 68551 27150 9916 -245580 148107 30417 -168998 9380 180294 161760
11332 161760 -70577 -57325 -29099 -53122 -25652 -253043 -76645 -280995 -8379 123866 -323671
11320 -142910 115552 143891 -232178 -135134 -244901 -194496 -60710 107826 -213961 42177
11309 135115 -97533 307156 -108948 157655 79494 -6726 -51065 -44673 -186861 -19058 -247432
11298 -247432 -123325 -281478 -111287 -212168 64574 50468 -163266 -109050 -279147 195254
11287 -50744 113938 -65729 132805 31668 -433104 -116171 163321 171633 -81212 569 -87411
11275 -113753 101238 77734 -122826 3707 48296 -103684 -13979 69259 75766 -19875 -270445
11264 -270445 73934 182167 17462 -153883 -22504 -118072 -84889 -549890 -52527 -242762 285324
11252 -18299 -16944 237132 -100668 -336238 52764 -57559 32 -228193 5277 148172 -61025 38401
11239 -15100 207798 222336 -116193 -79970 233433 94989 -56881 -32927 202507 156864 22397
11227 -309477 -63469 -357445 10445 -255573 -314384 -132782 -69279 -156887 -205973 37401 -237127
11215 -189783 -168788 -183124 12742 -62261 25445 -239937 -16681 -390717 109899 -12935 -205552
11204 -205552 -136260 46411 -79793 -18439 148129 -159370 64884 54030 -128122 -17549 -150233
11193 -150233 22070 163127 -482980 -208230 197917 58223 -268821 19678 -43494 -330541
11183 -330541 189606 210342 -245221 -437711 -33780 348058 136732 -409490 -220618 -146258
11173 -146258 -89094 357326 -210682 -359630 292514 143050 -315759 515888 196215 -250155
11162 65315 -93762 -587921 -74685 261482 -393602 -102383 -177382 -144296 57562 -1190 103536
11150 -53896 118191 -8576 -174406 -111174 220400 20208 245688 73057 -66259 -46067 -148619
11139 -148619 164257 -12624 -44350 -19873 -150895 -249876 107665 25784 293838 183443
11129 183443 -56629 -94729 -180396 -81042 403991 51164 205765 79633 81903 214184 113554
11118 113554 195802 82258 -57773 -48921 49464 185111 -123288 232302 113043 164441 84826
11107 84826 284620 -92913 248519 28760 174123 337698 -156665 -41551 93206 488162
11097 488162 46191 229478 -123870 310136 306828 84168 -74357 -78618 210085 181475 557928
11086 557928 251854 373551 461631 203252 330372 366397 276067 562764 598516 -20383
11075 -16674 278082 527710 255244 623435 331631 619813 583080 794713 205254 240794
11065 240794 499915 276303 427897 647145 391501 732732 649365 544174 766533 847500
11055 847500 751369 648028 686390 848904 480634 752263 930283 653837 604750 1139485
11045 1139485 722994 720595 529472 575847 434585 978743 1135312 838546 732118 572292
11035 572292 559181 755325 1099108 792191 761534 627027 797055 669085 937915 832370
11025 832370 788742 1044494 620920 980058 703048 466847 649853 871976 859412 665397
11015 665397 424947 823873 633475 640490 859333 468518 547228 303179 781478 785355
11005 785355 450541 856943 849559 312549 708464 611206 1025713 971613 794565 730431
10995 730431 467072 715783 570435 774334 830319 714310 919143 821178 838554 911776
10985 911776 1176813 1110466 1157394 1261458 1283052 1189504 1455779 1559471 1626285 2279888
10975 2279888 2570221 2554720 2819283 3024409 3718770 3173673 3087035 3114241 3062756 2771586
10965 2771586 2423532 2154845 2072784 1926889 1881517 2023494 1697235 2128748 2097084 2167337
10955 2167337 1867807 2290104 1965187 1446059 1177195 1085201 712339 700055 583971 196953
10944 489204 163894 559284 266335 675824 413469 174424 157729 190408 426993 293736
10934 293736 276405 95671 -202020 -25900 316126 130287 393695 183375 211935 -199552
10923 160004 -35073 255766 -14008 325112 -179870 -48391 226422 122888 293213 88185
10912 97382 37370 115564 160126 -207061 101881 17055 330625 146769 -5309 -259934 -261881
10901 -261881 -281560 -256383 179013 23807 -39817 82168 -43313 140326 124680 -180310 376175
10889 10535 -136196 -331407 125395 9550 -35553 -60613 -37334 -74858 -35085 11821 -97036
10877 -7093 -262216 -147648 -120828 280896 -246184 -17850 13052 -124503 155850 -200470
10866 397686 -154948 159745 -345589 -56628 11642 -39258 -32254 -61144 160241 247440 -24881
10854 163063 -277008 256080 119025 -20267 -144182 -6198 -3900 -94755 -149931 -199454 103185
10842 375637 170481 114254 -259239 9653 134580 76116 -260734 -63626 15774 -156780 146175
10830 74768 -94500 151297 28331 -22454 -159712 191204 102192 -82899 -136607 63286 -36939
10818 -100847 -20184 -365345 -341164 196388 101540 -253849 301463 -274261 181351 -171813
10807 -95816 14902 81245 -48556 -71960 -188580 166075 -309057 -116515 105110 -5584 -353044
10796 -353044 82928 -85207 137352 -250989 -22177 -4882 192811 -259427 -56408 178849 -199287
10784 -214384 119792 98511 -369511 -450450 -263147 -27732 82966 144152 196820 19671 70218
10773 70218 -263097 89214 -246788 477091 -41576 176536 -260660 115199 -2842 -231974
10763 -231974 17853 118030 11472 -51676 -158282 -374897 -68211 275793 122463 -27390
10752 272687 -109187 132882 -115762 169615 -285379 -5259 195290 -285073 -71320 -443666
10742 -443666 81427 28452 -192728 -12645 90690 -102753 82308 269351 -275833 -331641 223360
10730 23709 113137 -389290 -213886 132850 -325086 107984 -116583 157843 -30328 -216682
10720 -216682 103702 140380 -157468 -110676 363 -99905 -240278 165379 158591 -153800 -37243
10708 107969 -276594 -224952 -214663 -70438 -195703 -51510 63762 -294756 78574 81719 237419
10697 237419 -156938 -288988 110509 4942 -182879 -83017 -79379 71789 431548 6339 -258810
10685 -315258 -136776 -1117 -49089 -144345 213640 -252833 4988 225127 -17539 -40867 -176112
10674 -176112 188176 -165753 155960 106700 -183385 69891 -90427 106233 231178 -105911
10663 -2063 -171366 123974 -124814 -2697 269563 -35972 -80619 -139467 53337 -14368 -238176
10652 -238176 -65203 170414 174216 -192902 -118696 116029 76856 -170307 -252872 -105045 78332
10640 -19821 -266200 -18786 -60656 86017 -425763 52531 -138877 -274925 230831 19328 -93049
10628 118368 69304 -252880 -401094 345107 -400761 -211595 -393015 -59373 84309 -333481
10617 154038 -100861 -150324 90852 -109558 9923 -206470 90470 -135180 436578 -336795
10606 262138 60177 -107572 -88407 -303423 -9097 -175582 -366861 -236234 -59075 -222450
10596 -222450 22865 25916 -234617 42321 20838 51718 -303245 -184742 187610 -288338 87339
10584 391972 -171939 -118895 -151265 -42901 148807 72953 127250 -186426 -211085 -440687 -270851
10573 -270851 161835 -247777 -215474 -171783 377174 529347 -46192 -206275 -289182 183 -193038
10561 -204001 183473 37819 38905 77803 -30644 281214 236053 -179981 14536 -146209 -291673
10550 -291673 -73714 5373 -93606 89711 -95461 -335794 -109164 35497 -155794 -172309 36786
10538 125769 -85093 254922 131634 169621 -64356 172027 -173723 -30537 36809 -116179
10527 172401 119896 -90265 13898 640 -14460 -291064 -143308 -21871 -1406 -440658 -49994
10515 60856 183577 -65460 153530 -65876 -315165 185068 313346 -34279 208125 -156211
10504 -139410 52561 212782 -11187 103548 -114820 -62224 -240 400765 99767 137414 116375
10493 116375 38010 79724 263598 -289900 -145533 287469 -132646 -92133 88416 -56024
10482 24906 34950 414256 538034 408952 591486 195544 245791 112745 36143 -118181
10471 165396 -13766 89026 70437 34658 9907 124999 -116298 182887 14447 383249 99707
10459 -297076 -316358 202939 -9652 -84122 147568 279557 -5622 102175 115351 -75306 -17816
10447 236589 451232 17122 62827 39701 137254 -258109 -223218 226082 -213771 -69857 4894
10435 -45874 -92192 12706 -101458 47747 105101 -225967 -30016 -146696 84264 -302864 -36089
10423 135840 -466200 -161381 -273287 -169469 170984 56765 -118282 303461 -65725 16781
10412 -291765 -50090 278599 87227 43876 -66630 55969 -134608 100394 21642 -91889 45930
10400 147629 75513 82471 -330689 -3348 456984 -67897 -37539 29885 55289 357572 -176494
10388 87113 -105060 185854 186309 155682 305134 -58953 421995 472913 123337 -54614 110396
10376 479008 112238 570650 216102 392482 56187 341544 276015 343952 400728 507004
10366 507004 293829 772523 60302 472901 473156 111320 158079 316431 415153 188826 5196
10354 179546 141003 117971 837134 314173 623955 575382 337135 414980 188830 260029
10344 260029 214388 642286 525956 319506 765287 52049 142353 166641 84773 289674
10334 289674 84323 -151411 229226 22007 96649 32401 -99219 46984 -84668 121504 -56202
10322 -6520 289434 218259 12821 -332928 -165912 -96039 26098 -63707 191756 283388 160657
10311 160657 -52645 -40540 -144352 -123580 339461 22511 399870 211492 41180 -38607 220092
10299 150521 -136585 32594 129124 -30825 -196386 -578976 8910 14640 105797 425538 -189841
10287 228142 -114469 -192849 -27186 235951 116992 -170568 122222 217640 -230449 -23036
10276 -138681 -111721 -257204 169914 -117633 -349839 322216 -25151 16789 338080 -205012
10265 -113173 -28103 235077 -33746 307525 114539 141731 101863 467016 295934 297475 196023
10254 196023 -69848 -128109 109765 380787 145739 -263468 -15423 1271 100264 181358 74401
10242 70558 -357059 103495 73717 93158 -88073 81265 114613 -132747 -93724 -263785 237915
10230 -75361 112327 -14088 377923 -295277 153715 351379 -24376 -24289 118579 -227693 -6942
10218 167667 -107912 -82917 -189284 339420 -452522 -156864 -324035 9733 273695 -62580
10207 142692 -76032 330345 75957 182181 6897 -195429 -64188 82050 -423216 -48318 -62087
10196 -62087 -2872 -149055 -369559 31058 190328 106107 -33353 -78843 1428 -142227 -291464
10185 -291464 -207249 38069 -173661 288684 209425 -158308 -386135 -291368 19153 -74782 2502
10173 -82244 -52259 -281384 140853 -397592 -135730 34522 32628 -340883 -403233 4392 -154210
10161 -152658 15193 75996 133636 -456428 -126313 341377 -88219 -7526 89668 -172462 181509
10149 41716 153912 -56861 -36537 -8934 45630 53580 -17527 -322694 -30936 -82704 -23118 73057
10136 -364915 96085 58024 -66298 -150175 -305321 -105748 -259107 -96399 -42186 -211800 -63725
10124 -83010 -32022 132802 34462 -234136 -73302 218112 5751 67491 -66745 29807 -251343
10112 -277318 81290 199081 67788 -10113 -247475 -407708 -180300 -323129 18798 -80541
10101 -149237 -30098 -286538 -235222 -209249 216254 -244543 -438426 170619 -18514 -420468
10091 -420468 89909 43202 -320727 301405 21306 -292948 -34968 175816 -212315 -74702
10080 -135458 -112040 98726 -22969 32929 177225 39782 -4064 31572 -94800 -96253 -92509 -198962
10068 -198962 -379950 -266105 -399639 -16553 -185087 38607 -14984 86346 166595 -162307
10057 32815 17301 -434077 -13569 -21842 430646 -265749 35326 -274121 -110741 -82455 -214427
10046 -214427 -30100 111719 -94375 -424748 52430 -27395 -388635 -129739 -275289 -152546
10036 -152546 94004 -138718 317910 185419 -138798 -121190 -34768 -25287 197744 -75500 60044
10024 -225745 -93117 219669 -136689 -21853 -460539 -103635 -189623 -65790 -110940 -214628
10014 -214628 -197444 -137265 48506 -78680 -228300 90798 97576 257920 -177154 -184217 -127738
10003 -127738 -234808 -108105 106640 -334731 -222409 -44051 -135228 -153621 -477073 -14673
9992 -124701 -183182 143842 25252 -80999 190686 -63869 -180606 -93037 157171 -239273 -37244
9980 -290621 9022 -259709 -353180 -150301 -266097 56047 -114752 -415640 -127538 -484008
9970 -484008 -107521 188525 -73057 -24703 -102007 -17122 -50398 -246441 -73769 -15081 -12404
9959 -12404 58400 -7985 -75291 -139508 38642 -98120 38097 -170033 59698 -196242 212635
9947 -133361 -200993 126287 -146148 -416733 8795 -420160 -147675 175970 -152201 -80582
9937 -80582 -165559 -118829 97411 -44480 -10481 -204411 -30590 96856 131744 -177213 -247638
9926 -247638 -53673 240156 -204545 89120 60299 7047 -140669 65011 104734 -97094 251880
9914 109282 192990 -47787 -258841 -145299 91664 -232500 -41388 217520 -267891 -128344
9903 -23880 -188055 -355374 211565 -206956 332657 -104081 -65306 142693 -109879 -64630
9893 -64630 112610 -61430 -279575 71796 -373585 115696 -68527 -9825 -146032 -61513 -199087
9882 -199087 -221777 36867 -10110 45221 70425 -260296 -401449 43068 -477912 73119 197377
9871 197377 -171124 -170989 -9874 -126430 -26404 -1478 104703 -309247 -355704 -14662 -204619
9860 -204619 -117323 205039 87336 -107139 -149588 -233872 74936 -286193 -17389 2651 -246806
9848 91281 -58156 -140492 -134424 -386147 121165 -424543 295892 -79537 77952 -35932 -99034
9837 -99034 -258020 123101 -113619 212959 -77483 -71042 -14715 -5721 -273936 -264558 -127215
9825 190549 -308882 24526 94737 -244990 168850 -211375 -14895 117926 221786 -56922
9814 -77500 44767 305109 -33264 -136848 -292690 138050 -170537 -59383 -272734 -200101 -414040
9803 -414040 196808 15493 -123219 207991 -156529 172748 85021 -140946 -115913 1887 -62372
9791 -117916 67980 70013 -385575 9817 -130555 -140382 18355 -97955 -273984 -286942 -356619 -289902
9779 -289902 -45885 -434413 67703 78665 -166673 -195345 -126603 -76177 -198947 -130749 -7301
9767 58810 -223172 36859 -437595 151162 410437 239487 207574 -4140 99431 92965 187926
9756 187926 27300 -84185 278203 -253879 -275077 45178 -21551 23162 168222 -60146 71279
9744 2598 -122754 -23931 -229659 -363006 -211317 -166139 -140891 -135891 -73564 -57592 -66790 -235093
9732 -235093 -92129 -149381 -173317 30586 -51380 -270991 96431 -289239 -222413 11957 -224449
9720 -160830 157886 -102998 -132938 -213820 -64281 -5708 -127277 -94734 -214582 -3418 100579
9708 37493 -25801 -154936 -105389 -38110 -288104 -291889 256776 356424 -240997 165160 -33084
9696 97725 -110041 -172396 214230 -482726 -165906 -192217 -194210 -31929 96243 32595 92653
9685 92653 -177888 -18359 28484 -68291 -149154 -83066 -151427 -64132 238978 125995 -307090
9673 -98880 -36742 -84448 69828 51625 -217694 235520 -362276 -377480 -368955 -37134 -64770
9662 -64770 -211292 40901 -347977 -83178 -125878 221179 -199953 -4243 118356 244919 -128026
9650 153796 82885 143530 -102299 -335204 -424625 136677 -48830 -119648 -359424 -171216 -68012
9638 15419 70772 -46467 -331939 167093 -108378 -232192 -82399 -217489 101859 -196244
9627 -249737 -45704 -57458 134053 -31406 -114131 -33085 -21428 -31298 104934 125251 -604839
9615 -20364 44867 -205712 -218882 -18645 -149323 -95602 60283 -161986 73060 -20044 211228
9603 98408 -172173 -179419 -21198 -216380 90534 -51375 -227110 -67626 -262106 -253782 30409
9591 242091 -2496 -119035 -229091 -224397 -187565 11543 -361452 -349403 192712 -109215 18983
9579 127120 -74800 188362 -193125 -90014 72457 -16157 -13443 -89130 124858 -38299 144130
9567 -25480 40336 -39201 208462 -192983 -299871 -159755 235991 -60002 188483 217480 -112676
9555 -147404 -236967 -336677 30626 -148217 211727 372962 -186276 -152849 -66345 56941 -192951
9543 491392 -303718 -46939 -56362 -263437 -346920 33114 137301 -214511 -255260 -14299 45930
9531 143008 147707 -120395 -233562 -227295 -76754 -95742 -73904 92913 -141516 140111 -336177
9519 19139 91849 167949 10256 -170115 -73275 157229 -112616 144519 -193207 90194 -37829
9507 218897 -520229 -60899 52856 -53775 -85507 -181366 -282654 -158157 -246687 115229 -211805
9495 -232807 -299866 222089 -94156 -412037 -65854 -28773 -263598 206272 27634 -188851 245080
9483 -375501 -1688 -104641 167766 70836 -54490 -164914 66537 -219058 -111914 -246007 -233350
9472 -233350 -88672 135031 173551 172080 -66359 -52664 180355 30799 138591 -6941 -138445
9461 -138445 -131618 30635 25355 -279363 -44028 114224 -97122 -81319 -25539 59904 389810
9450 389810 -22537 -197632 104578 -275480 -146211 241838 -160071 188165 -4265 -296072
9440 -296072 -196784 -313068 12626 127145 -359285 -376764 -8554 -364451 -105633 52705 128991
9429 128991 -419480 352958 98338 134079 -245482 149886 -366221 -279718 -95266 5853 40527
9418 40527 -329334 53041 -160067 -60214 72647 50015 -36005 -247533 494890 179051 -77162
9406 87098 192937 95818 -206581 -142352 -140595 -112818 -127931 10580 207748 -78304 -23967
9394 201 -74844 164529 102641 -101390 -137010 -130623 107324 -556312 132769 -12837 -128187
9383 -128187 222936 -248962 -71750 -337806 -285586 183920 101904 -122610 -264735 -74240
9372 -45429 -55109 -264201 -173787 -547803 -77618 -129197 143732 99807 -80942 -192346 -84200
9360 49950 -117755 -429554 2443 148708 -89893 -31836 138475 -147951 -156564 -184295 12020
9348 -352905 -147490 -164087 18255 -74226 101103 129755 136049 -11702 -37754 -122245 -119446 141552
9335 -180835 -299905 -128913 -203869 39687 121137 233655 -43834 343981 216405 -48739 123421
9323 -120700 138047 -350319 -38371 -360185 -116141 -157035 -142666 187863 -175634 -58620
9312 -14459 -55520 10747 -185979 -118142 39838 -500290 -427642 -3663 -38602 -20786 -217994
9301 -217994 97430 -74323 -252338 -227424 -306135 232257 152077 26717 52099 -206707 -232759
9290 -232759 -83360 -133295 11081 -502848 33271 -254681 -240455 -117978 131826 1046 -84574
9278 127150 -35838 12047 -142885 93866 96434 -117281 -104131 -20591 -576735 215998 -104537
9266 -29955 290066 66935 107084 -407952 192616 -46476 -211625 -6691 -130724 -105718 -152330
9255 -152330 12600 -7604 -73992 -188386 -14223 46513 22500 -143708 -145611 -29628 71182 219437
9243 219437 -7965 55436 -159271 -277784 149413 -148785 16327 167633 69876 -90563 -188531
9232 -188531 101666 -68379 -243747 34754 -20041 -117571 -335267 -94598 10805 186280 -321512
9220 -49188 119820 231087 -280848 -295640 -115703 188340 -90291 -130080 186844 -206565
9209 187434 -79454 -62072 176289 -45490 126555 -100236 197132 122457 -18845 2764 -96736
9197 -315786 -268626 -169006 92026 -12382 9576 -221037 -137167 -217693 -118991 -472804 -262344
9186 -262344 -120147 -70328 -153255 43344 -68485 222679 14070 26924 -186435 -57780 -210624
9175 -210624 117467 -93230 243660 -45759 -75290 -151796 312589 25974 -305109 -389583 -93161
9163 10012 -79270 49358 -117896 -158576 -278257 31083 -84102 -218704 227218 -217498 -51572
9151 -353562 -170229 -80113 -13811 -138868 157714 141095 65605 116173 123845 151644 -116085
9139 144436 96633 86474 -265872 59709 27896 275528 -97083 -83730 26786 -41203 -192648
9128 -192648 -87263 182088 -64946 -329014 -139364 64625 -67364 61436 -90185 -7704 -80033
9117 -80033 -87845 -80853 -69139 315831 -331208 30480 150385 -195559 -118216 -7674 99604 -20014
9104 -36726 -256664 -3615 268493 -252828 281147 -390183 279971 -112719 -91468 -138511 2495
9092 26918 76459 -504201 275493 -32450 -150815 -150610 74531 -96136 -25999 -144132 -84391
9081 -84391 -17749 -161234 -279708 58206 -151051 36906 -156752 13971 -37509 337372 -99754
9069 -242784 -168975 -280980 93829 -72810 -291279 -307157 -31644 -79096 -280419 -114694 -342617
9058 -342617 21369 -8159 240831 102661 309930 -102320 -71103 -233267 -138 -70187 98776
9046 -5118 306301 -367416 -51374 144809 -34823 -191238 119456 -149976 -192475 88878 -85465
9034 -174694 -39988 -220174 -150571 -33809 -29723 -202312 125968 -195 -297428 289145 -308357
9022 -110160 -286751 118022 -140308 -15764 127559 -435062 -213487 55811 89221 -87499
9011 -40499 -230592 -66043 -85643 -182136 -165935 292971 -179262 228905 39977 -777 -298345
9000 -298345 -385967 -132484 -15631 -11562 35313 -81915 -341439 36807 -42685 202898 31622
8988 -100755 -123249 -98608 -82267 -214918 -116281 181530 -21451 -71849 89738 106342 184955
8977 184955 -303359 -80295 60867 -83896 -224044 -133966 -295528 -13033 44310 -478 39454
8965 113238 245264 -107176 -215166 -31619 22530 -143912 -89753 -112843 -110151 -53589 174211
8953 -362136 -183333 -144946 -301015 -219577 -237205 -402480 -203547 -115880 95076 -295811 -173525
8942 -173525 -142155 34664 -138821 -83285 111203 -129393 -91850 454094 171557 317130
8932 317130 -49978 -149121 149182 214180 -128158 135173 5417 462698 934636 2648146
8922 2648146 5857833 6683384 1614462 587824 359267 403098 315865 126582 307786 152730
8911 -245021 7143 229261 69336 3266 102477 -258602 -140838 -161144 86837 -85581 11977
8899 16953 -148483 -242618 58529 24020 -147917 171355 -153857 -74848 -219096 -193400 86058
8887 1201 149885 -34522 -85151 -81944 -101042 22946 -469200 -128625 -13977 -350305 -158959
8875 143408 -279013 -481773 -233859 -197335 -36973 -344821 287882 -41134 -32286 -216095 17378
8863 199285 47907 163972 -102879 -69205 -158566 41103 -516473 -58498 286132 53679 279373
8852 279373 -137458 -56520 -40461 -240095 -391696 248751 -52943 21516 -142798 136481
8841 -289453 -23346 -377571 70706 80163 73116 -171686 -135417 56639 179523 55417 -263029
8829 187527 -29504 -384984 -77225 -130938 -112398 -8740 -143122 -106339 119396 91223 -166937
8817 -50351 196714 -291839 -378722 -277165 -40351 3340 -111780 1840 66582 -282429 -62009
8805 80139 -163470 19042 -91027 -153102 162767 -225350 150985 394794 72494 -95602 -137190
8794 -137190 -237481 -44253 85232 -176642 -210957 -117186 -75163 -287958 -375930 -240040 25727
8782 -73032 -90950 -92592 -147774 44715 13556 -126684 75258 -96181 -82234 -279705 -285795 -454964
8770 -454964 -26859 208144 -237767 -106457 -63703 -249644 -53818 -208125 223395 40006
8759 -21637 -18199 -411897 -175016 -368158 -367252 -172325 -123728 119897 -324235 216463 -303460
8747 40468 -54231 -421290 162239 -16753 200373 21111 74692 -9041 -50364 83237 -51022
8735 -174912 -80849 103427 73732 307089 -14181 -83540 -14743 -49496 -155363 -134066 -64081
8723 2445 105906 -45829 -33076 65067 -178548 94691 -173385 120159 -174596 269033 13439
8711 -261770 67632 -112413 -175349 -87620 -621369 156523 -91632 -85653 104512 -277948 -233097
8700 -233097 -97560 -421138 209519 31604 -22501 -145184 -108023 -326550 -324588 -1270 -86445
8689 -86445 -291816 4433 267043 5437 -1858 -233724 84557 211064 -15991 110168 -217608
8677 433100 -100827 -15047 244055 111884 -98076 -77095 -4503 127012 -1659 156963 45354
8665 -11853 247776 -13801 225137 20276 -248804 187769 735 -98345 -198072 258925 -58456
8653 134878 -77349 25423 -104483 -49423 159996 54378 145183 -36668 67803 82187 -159005
8641 -216302 229928 2726 -345607 -308614 133574 67561 18430 -384265 175654 10099 -355247
8629 85726 268083 -208355 -51991 -163960 120305 -8892 -30658 198510 -76919 -179095 -285069
8618 -285069 30708 86980 22085 -172036 -354651 -30048 -339794 359758 -72990 -87134 -246132
8607 -246132 232230 41985 308093 -119622 111357 36721 28478 -296219 119033 -153068
8596 -186722 -350704 319290 152610 -131668 80942 -183120 108622 89847 44418 -79148
8585 -216442 -46766 73073 70774 -318470 -88555 -97429 -145088 -60592 -268797 -63888 128783
8573 -174345 -70072 32267 -32129 -230591 -32510 176047 -222562 -356171 -128580 -190072 -229554
8562 -229554 -395655 -57526 -42346 -88393 -91406 162420 -60301 -461804 -95174 3919 -7087 42388
8549 -4346 435557 113521 106784 -108758 -266793 158567 -167553 -236541 70784 -193370 -34742
8537 -271854 -10120 103379 -350697 -211676 -146660 -183832 -111880 35089 16219 -139784 251178
8525 -76315 -292493 -167796 -18209 -18920 27926 34039 54865 8504 116903 -180741 329204 -362504
8512 -61830 -232252 95025 -100406 37106 55453 -50029 -185418 17646 -111708 298231 153402
8501 153402 -372640 134470 58470 182249 -111641 -266147 49610 46098 147320 2162 -4390
8489 -31621 -21455 -231989 -180271 79216 -260224 198463 125188 -19485 -285660 68285 -277906
8477 -430224 32831 -284428 -62890 45015 56524 194229 -64746 60228 5738 -126221 96686
8465 78496 -69131 158622 -6547 -69497 -79503 -25101 26356 -134799 -9342 -18993 -81247 -60944
8453 -60944 -107744 45973 -148944 -70691 -150793 -488984 98956 -48361 -96646 -122433 -206285
8442 -206285 -216950 -17966 84349 22963 90280 -39853 -134828 -69229 120086 6283 68883 -18037
8429 -89007 -222168 249474 -76658 -90744 -242069 63827 -303429 -84760 -119403 -336160 81125
8417 -15120 159474 -54520 -1173 -187009 58498 -153100 171747 129583 -192184 95322 187513
8406 187513 108547 -38384 -96679 -126849 -235682 -232649 122013 170056 -93144 -152643 -2754 75594
8393 -185874 283606 106594 2788 7209 6036 -102171 -261478 69994 -376894 -128635 43534
8381 60083 -223860 -16753 97422 -201831 55644 -160652 112503 -406999 -83388 -184429 82248
8369 61340 104045 -230383 69643 -230940 -278866 -4407 -271752 -141453 207420 -353640 490494
8357 169145 -139489 245279 -177570 334340 85565 279729 188622 98129 174927 -132790
8346 162103 -158895 -287036 1800 93783 -74369 201261 208967 -252557 -175696 -228051 40027
8334 -220161 -314186 28788 -109718 -105978 -177045 -146456 -166236 -281762 -113361 10198 -33959
8322 -119528 -79436 -302608 -139729 4735 123865 -119135 -76183 -72417 -51869 -18686 -528688
8311 -528688 141441 133545 69296 -188289 -232889 -21872 -254567 92471 -69748 -60654 -378365
8300 -378365 -21258 -184677 -78787 112576 -266403 -268876 -248932 -51651 77366 171482 17943
8288 97265 -115495 -368999 -63004 153606 -140032 145165 111059 -113519 197502 95495
8277 -112422 -144496 -277892 -246122 85663 -403101 -51055 52147 -143110 80269 -163534 -103213
8266 -103213 92958 8537 -16481 -159079 25912 134721 -6454 -129631 112185 146769 299454
8255 299454 -115738 -208101 -61607 102995 -189468 46892 -225856 -109600 -30161 8518 87604
8244 87604 -136652 188441 -93001 -73022 -220096 -216641 263846 -220429 -81655 -173358 -283633
8233 -283633 12275 -78788 -266780 -39786 -84809 90460 3207 -180930 238357 -4190 -110995
8222 -110995 129597 10335 -7385 186200 17087 -81193 -260120 -329697 34086 -285909 380361
8210 496645 -339895 -295456 -375138 88579 -85423 -250169 -13688 -103123 125333 -97117 -12888
8198 -98504 317126 17341 137252 -366621 -81984 -498738 -83887 -191037 -242778 19202 -43094
8186 -88168 -15351 -117970 -231591 317827 219824 80479 67335 -367637 -217104 165911 -185406
8174 -203739 332806 -328331 -187037 -100553 -40406 -103055 111472 -164317 10150 -101389
8163 -204474 9821 415 -257847 -78428 35719 126285 -100602 -147072 403921 -38992 -343376
8152 -343376 299854 -79018 -73696 -41762 -36217 -111045 -16886 204110 129672 -71094 -216531
8141 -216531 -52174 -21633 96329 169068 -160179 -192551 -297203 248256 -26790 -132042 63243
8129 -182853 97748 -44167 213732 11295 -205402 -14475 -69509 -73492 -24764 -199447 -31021
8117 114675 143797 3309 -148647 -73718 -336748 -500438 398821 -174215 -89155 -284458 -182536
8106 -182536 87020 54951 -248909 108239 -154162 338149 -82491 -223466 53344 -18985 -83616
8095 -83616 -30279 -119948 -221986 17846 -42400 -52525 -48498 -115100 -269163 449498 -198164
8083 -292927 3839 77042 -353818 -141914 39260 69239 -60709 17053 -129295 326274 345987
8072 345987 150817 -20687 -13453 451099 17394 11343 387438 163850 112580 -174712 -15252
8060 385059 -237043 -232900 -106835 105268 -170265 -158649 -202257 -156610 -48587 105494 59526
8049 59526 -123054 -149513 220483 -135962 127551 -151580 -52268 -190153 -260843 -176569 24095
8037 93008 -81230 -73448 -198334 37568 -235664 -161094 -222931 -48525 -273740 -200963 -149400
8026 -149400 265377 71328 -63015 173642 -66204 -120484 -192106 -172533 69917 -170117 90394
8014 105359 -212872 109523 -230092 -230360 -140443 -172219 14160 -156692 -362077 30535 255855
8003 255855 -133740 56467 -61197 338351 -139264 29337 -57941 438 165097 219054 33598
7991 182100 63091 98689 291440 -17968 -122956 -273715 -33884 -171730 57256 -164178 16408
7979 -81693 37139 -34162 -35583 -308484 -182116 84392 -315338 -115953 177823 325719 198735
7968 198735 -40170 104996 -318911 -73732 394994 42333 50650 36732 73980 -401621 -75408
7956 -165618 19310 -221988 -109216 -7914 8695 -93947 -369265 -80541 77522 -2426 -99559 -52893
7944 -52893 -12849 -64879 50749 108230 98743 -178999 -190216 14198 93433 -97280 152587 -347879
7931 -189852 -185548 258919 -105514 -297768 -118092 312427 -34638 -177757 80636 106555 105716
7920 105716 -256557 -38429 -136553 -174938 -398108 -58492 -126373 41291 -124859 -19271 -27306
7909 -27306 422488 16306 -13462 71806 84326 -74469 -13028 104751 -235794 236446 -27999
7897 3463 -30077 23280 20154 -5207 -252257 -25792 -7833 -114766 300612 -109031 -199938 -302039
7885 -302039 -5985 -83405 75716 62701 -127036 348573 -31047 121423 133668 -272477 121938
7873 90434 754 46262 26375 -184552 -197285 114519 -315040 -368396 124067 96002 44762
7861 -304427 -316185 -43740 -75979 -10786 293264 -171682 -149899 45304 32733 -82945 -188341
7850 -188341 -504975 -31846 -90232 -270716 530363 81636 318384 -116260 -131504 -213803 -189466
7839 -189466 93230 -45713 -21027 -19090 141384 85846 96765 -267153 -207035 163368 16655
7827 5749 -127066 -474178 -52602 170971 -122308 -118899 3402 -72735 -5485 -87720 -2348 -28995
7815 -28995 -38776 -50318 -108046 231789 86552 3254 -86549 -181847 -57434 -221383 -40876 -48799
7803 -48799 -251362 -236628 -195960 -141002 -185558 -107420 319204 -338982 -40611 127130 99633
7792 99633 -57866 -116306 -19896 -333156 -96950 135126 -7699 -276072 -121535 97669 117966
7781 117966 -194766 -229268 -181780 -256739 -30144 122313 58057 -31435 -64627 -407101 90199
7769 -524 1505 132 15176 160921 -158971 -40718 178655 70396 -143402 -100200 341688 -217435
7756 129181 -107064 67138 32796 -206356 84117 -103739 -16758 -320136 218467 191818 -17354
7744 53974 -216954 -100890 -75982 138019 -266016 -266300 173926 30749 57415 13345 231325
7733 231325 -63954 99389 76020 -148392 -69480 -217936 65282 252937 -203775 -75029 -42606
7722 -42606 -310502 -483264 -323612 62006 -136539 68391 60905 39663 -251093 83960 17562
7710 -137421 -116937 3009 -200974 29780 97183 -607591 -280432 1608 -239548 199772 58702
7698 -41575 -318984 -52476 130979 1406 -252090 -241438 166985 -34494 107127 -247320 -380222
7687 -380222 -228474 -253703 -39621 -209497 124886 -43101 -18786 -47175 257188 -264497 108008
7675 -181699 -115182 169345 6440 176737 99701 82799 -141358 63395 6779 -57403 -67484
7664 -67484 -90465 -271337 -44116 -204642 -252704 -26552 -188785 -111602 -242976 -67815 -265385
7653 -265385 382404 220368 88543 81170 -82535 -228004 241492 -346001 -200673 -150468 147911
7641 -97673 -86745 -130669 24736 -110352 -171867 232325 45220 -156863 -242539 106666 -214629
7629 -562850 -291454 235281 167385 -396268 -106095 -131912 182941 126904 77293 -136499
7618 273922 158680 -223828 5868 321443 -29030 -76309 174658 134488 158469 -169060 -5496
7606 -265562 -149014 -280674 -184979 -231338 65493 -193897 -272291 -123665 -89968 -323793 -39280
7594 -12362 226217 206237 40488 -154475 153385 -18173 98469 -108447 187915 -120762 -355485
7583 -355485 -16768 -122429 136530 128001 70990 32611 158866 219532 -215663 -103366 -9287
7571 -261043 80548 138360 -207109 49038 -282365 68611 -76755 38992 -38911 -42136 139895
7559 60695 -222663 -114251 -127718 388971 56163 157197 91899 94959 -58354 75525 -19980
7547 -11058 128652 101304 -71911 -180586 -22481 -143708 -151093 139068 -204574 -316029 -96908
7535 -272699 124143 116486 -66356 111554 -134362 241409 97494 81874 150886 -124117 111353
7523 -210768 138671 411485 245508 239812 70487 37723 -67116 -260838 -227893 -162342 -147630
7512 -147630 65717 -235763 30967 -321672 130774 -156953 -123114 258641 29690 -109247
7501 -98060 140523 39816 -197395 92068 -296496 -315395 173065 -88008 208391 89246 293364
7490 293364 -3805 36500 76274 -160655 -161012 -233184 157961 -205008 -50799 50536 -166628
7478 -218560 191681 52169 98132 -147010 -205157 -227036 -773 -3167 187465 -249362 109007
7466 188988 -234892 211974 -153944 564249 49061 31452 -133665 -163763 -254663 113371
7455 -79748 -108787 388861 55544 -31550 -12852 -134497 -56653 -203611 234425 147588 -100745
7443 244284 -10894 -69360 311682 -16493 -131289 -216454 56364 243649 -328479 40900 -131045
7431 -340008 152334 -277508 -118448 367043 -82362 -122599 80391 200691 -160636 -87196
7421 -87196 -58863 -77424 -134966 -143310 -89993 139905 -88722 -190030 -98271 -301590 -160841
7410 -160841 66008 91931 16484 -163554 8127 -13673 -136889 -414631 36390 65082 -49706
7398 -85353 12552 267722 94570 -98453 81801 -208213 -286067 33568 -57400 -110417 -128381
7387 -128381 52190 12006 95061 -295858 116602 -132911 82018 -8297 -284513 -44129 -220875
7376 -220875 -24891 140560 -204257 -222159 -91059 116814 -53182 -379649 -19393 -107088 -122250
7365 -122250 41838 61443 -44163 35801 -148499 44270 91274 214787 -22203 -440234 125702
7353 129489 159816 76456 -75059 59487 244064 162070 231961 71173 -181108 66750 154291
7342 154291 -39140 114885 -109601 16468 -58390 -95490 217490 116789 -76304 -140382 -23341
7330 -149594 -110385 -28373 34248 175327 -375505 -115719 12121 -297727 223120 -47818 -15429
7318 190149 -203302 -87157 4011 115903 129107 -181528 -68893 -20077 78776 -343457 208040
7306 76201 -173672 -112320 162679 45795 36412 -63138 62138 75927 -28807 -135836 -113173
7295 -113173 117502 59842 254219 -221206 310155 188450 286745 140853 28321 156447
7285 156447 145608 134930 -27747 302316 51536 235899 -38021 39631 -101618 -28789 152555
7273 23296 -42955 122303 99324 339311 257363 125672 225460 -303041 232290 130243 183433
7262 183433 -317816 -201874 -17366 66354 180604 75843 260328 236898 -493990 -114769
7251 -124754 -148903 -201439 -206642 232489 205917 106619 84381 -77868 -214862 -61720 -106235
7240 -106235 -245224 80956 -21444 -79591 -71208 -15342 -351728 -255598 -96388 196748 188074
7229 188074 52044 -108546 -330728 48023 275440 -139209 38990 -40386 2123 62051 3506
7217 243703 49661 -79871 38235 -278119 147011 -56788 -91266 50388 -77362 69706 172415
7206 172415 -53791 265760 -373894 -469324 -116903 189407 -183680 90610 -209478 236146
7195 20169 297164 64734 55650 -195916 -198699 -214811 139756 -44803 -247080 23503 272849
7184 272849 195216 49473 -278205 124888 -143059 -122043 -30147 13262 347162 -990 250524
7172 362376 172301 102999 -219969 209258 54691 -247703 136523 102994 399118 -211960
7161 -59577 -76248 -212247 -2166 -96611 -206230 24055 46048 54265 84675 88732 275741 -163749
7148 162331 -86328 -177969 -405996 216129 -158446 39701 106036 -84997 155826 -50085 89065
7136 434392 -145718 -155621 106924 -140094 92670 27646 -131406 -204675 -128652 -296736 -52427
7124 225230 -73701 -41817 96612 94560 310744 93153 128614 -394968 -172188 75917 -188343
7112 -22918 -239017 278534 -70346 194552 101542 153100 -49134 65158 106833 -141537 -151402
7101 -151402 -167789 721 -218319 41107 -318647 286208 56756 36804 -200482 -98768 -174571
7090 -174571 -162538 -32440 -40274 8947 128071 52875 81656 -55252 -380532 -146091 143294
7078 -111208 67486 30444 -73368 -250811 -80500 20236 263876 117344 -103906 90571 5839
7066 165171 51880 -93029 78614 92250 -174953 -385706 -68314 131553 -17140 -11958 -131728
7055 -131728 -193492 3061 -174313 -159732 -116808 -217832 -208648 61676 -61677 227884 -171939
7043 -109099 224906 -79380 -46263 -272922 179533 -151981 -45329 97537 -43425 89345 326482
7032 326482 -85644 -88156 20872 101649 542788 340424 122318 292778 -203416 -129653 83343
7020 336391 -114766 66046 -155742 118746 -65924 43121 139391 -36120 -343369 -215309 -129006
7009 -129006 191343 44824 -95646 -329307 120586 -297449 -320644 -57264 -538961 78902 -55943
6997 163786 111758 -71815 -94336 -196694 -422809 143854 -163315 -121908 -218755 421620 -16989
6985 -180787 127728 -78585 -344084 -58653 -84295 -410662 56261 -17766 102439 -201067 98146
6973 113219 217753 -65850 -18959 -19250 11065 327934 35304 4847 291132 -38198 135769
6961 209972 -178144 -170439 152309 -164704 -179883 -41563 36567 -329601 -64483 -71689 -158697
6950 -158697 9019 324687 -234589 122217 12721 -68972 -184353 361527 143003 96848 -346083
6938 -300666 -135192 -359942 -53744 16791 -25580 -174269 -154549 -210885 -298459 40186 224343
6927 224343 -111083 194157 -179154 -105703 -56026 -263065 -82820 -11665 45931 -58451 29806
6915 -77906 -73895 -73372 217200 -4263 133862 -105433 23243 -96509 202137 110201 -217478 -152544
6903 -152544 -130314 631437 -134230 -103514 63740 -119594 -197163 55756 30574 -104215 -63374
6892 -63374 41696 -200157 168663 208458 -119459 -252451 -40334 -29413 -49471 102185 -58074
6880 -78655 -20895 30609 -73579 -184406 214965 158655 -329583 329673 115025 -134000 -71920
6869 -71920 -159478 -41783 31628 22015 -17402 183642 1302 17201 -112277 -209192 450328 -8552
6856 161590 -127142 -27923 -9430 183485 -302590 8401 -124719 -227867 -157131 -156395 -282144
6845 -282144 -112607 -270326 -54226 -124663 -96928 -73077 58200 398422 -254617 170925 390303
6834 390303 80166 -55001 -106501 416792 106262 -264355 -131394 -92829 -97927 -9927 120263
6822 46988 -83634 -214310 -230908 -40578 126044 -158290 -105936 -35458 -160049 220800 -240271
6810 75519 -78651 -355791 -24735 -206794 -2200 -222289 222793 -263032 -64237 -317139 -232690
6799 -232690 51477 25677 -3387 77565 -178970 229474 1514 -217901 -352553 -4455 153817
6787 215594 -18238 -234544 200964 -161108 158740 -93080 -294309 207947 -6842 -16164 54517
6775 152155 342143 178778 -16100 288563 -74433 -176010 -117863 52268 -90719 -119526 78565
6763 -162190 -168023 -301671 13368 -151336 -330874 -103229 6533 -138308 23289 -104041 -66517
6752 -66517 188409 -96367 -65685 -425603 80590 90489 -79032 -91631 7243 13817 -10309 45418
6739 340868 57243 106278 -4811 207208 427789 -181899 219068 -43556 136477 -195007 272919
6727 -70433 36157 -51733 -291250 -130351 -21402 -89788 -17446 -91153 -52542 -11477 -116304
6716 -116304 31410 -53876 18052 -238256 -118411 -13559 19699 -2124 -197524 -113803 -248292
6705 -248292 26974 -206557 -169126 -140014 -50198 -150490 339394 65655 19539 159695 -160567
6693 -29085 76452 -77010 32429 68235 70847 117404 58770 -23695 -180797 32105 -170661 111641
6680 62882 15289 -182060 -234566 83854 -378082 -234276 183629 -213510 126206 -246633
6669 -220300 -210464 67096 -82793 -20461 168672 -141815 -3785 110246 7984 241817 185994
6658 185994 -223681 16064 -346992 228955 198232 -391504 -25956 75207 68176 255063 -142139
6646 -239096 245199 -228298 176260 -19470 210565 -54681 -240684 108574 329424 -85884
6635 28350 -218105 98259 -118715 -2387 82083 -9760 76787 -8290 -69463 -454694 87642 -156139
6622 -154532 -52703 -3685 36393 -221644 145234 -4834 247977 279438 109092 332770 -401218
6610 136030 138088 -128964 120612 -405132 -55631 85815 202969 102596 58898 -178924 -48757
6598 147155 260049 -117933 -52236 -87189 -413739 254817 256600 -84458 184459 -116947 130956
6586 -15428 241280 44412 -169798 -41127 56074 13827 22722 2256 -57329 -205503 -11531 96985
6573 5739 214983 132374 9951 127569 -272854 31428 -88405 -6724 -167237 6091 60463 125969
6561 125969 3058 91440 49317 -169261 -57855 -187636 71980 -242599 -54877 128371 91262
6550 91262 -2697 -198930 85817 -176692 649 560102 33170 -185476 95860 -52613 -64212 -65667
6538 -65667 -278200 217601 132398 208276 -10210 -1571 297787 -132520 95963 -128902 72114
6526 278082 -35752 -208692 -122601 -151215 -8570 280610 -21991 -24026 53585 -85964 242445
6514 324755 38152 -311275 -162569 -118700 35816 -10453 -217562 -196659 -23820 41950 -126155
6502 8391 -152 -1242 50266 82129 -1443 248760 33087 98664 -42160 -252357 148352 -34541
6489 54574 29695 57014 -125759 -224689 40466 -124861 -32458 -212105 -197781 -84422 -147747
6478 -147747 -56688 237568 10773 155443 -11312 114569 36766 -23320 -355818 -315454 7040
6466 -173718 -337451 -192065 -217776 -85300 6142 -58355 1806 -89898 -15517 -131385 254562
6454 92959 -131643 81442 149672 154300 41606 80119 -126415 161419 80458 -83504 69136
6442 -156973 -165832 305833 -60823 1555 32134 -168931 -22325 -388195 -297216 -99781 478548
6430 334005 -75883 -109252 86718 -30275 -129083 -164816 56871 -223688 -184183 71728 -149779
6418 21389 108441 315880 178960 209562 46818 -119596 380258 -60487 -89750 -3354 73834
6406 -139711 593 109654 -161149 106234 -184358 291255 -154040 85930 -13850 2195 -25415
6394 112938 73590 428463 -111168 59607 -165127 -82392 6127 -298184 52580 -59042 -92014
6383 -92014 96639 -105867 -11812 -8852 -2762 135143 -191910 36604 368698 134217 -189585
6371 405140 -185073 -1044 -55824 -49709 -376612 -116563 -94385 132955 -41315 -308685 117102
6359 -69243 112455 153756 -21463 45142 95451 -152601 -1475 -8658 -323035 12692 176937
6348 176937 -255200 164507 47884 -240976 143870 -113611 10601 -44210 194801 21784
6337 215848 -141562 58941 -145385 -97689 225674 44250 285208 -66023 -429023 -254153
6327 -254153 132949 41793 280261 138325 -118618 -121431 19750 322958 -43906 -144571 -146614
6316 -146614 -150318 119406 114859 -20846 49534 -167010 -179652 -100296 54580 258981 -85694
6304 11023 -285185 73162 42064 236035 -215602 -120322 151761 19880 -528268 -278453 114780
6292 -10778 -243648 65921 169743 227401 256866 201958 -99815 -124986 42477 75228 31445
6280 -34447 80605 122518 8477 351542 130820 -104979 -203230 197254 -152555 -120861 218136
6268 141107 85399 -322246 -327858 288228 -328639 187497 -122333 141993 28506 -179367
6257 111284 -163621 224797 -59734 100619 -156270 -278026 -323289 -48840 -69454 145339
6246 -67666 61320 113312 55377 88652 129427 88044 174569 47991 34983 23249 226050 -234730
6233 -160923 -28523 334958 -155756 -62191 -113072 -36779 134080 209502 -43732 -73511 -32213
6221 -18973 -176319 301260 100304 -171446 24689 -21193 26685 96586 73396 86611 -110457
6209 8877 -332552 -32133 -382353 70950 -588960 -216172 -196448 50577 -38103 -46178 -403123
6198 -403123 -73872 162019 -82158 -61720 -19390 -255552 184360 -75167 -39611 179105 97026
6187 97026 -232290 48477 418803 11036 -22917 -499678 93380 -170719 76542 -173329 -232408
6176 -232408 18359 137750 339353 113885 2961 -106204 -350809 14410 135086 -210029
6165 349419 -84867 -147723 -122088 -262958 264515 79610 -128929 -160381 -61389 -42937 43976
6153 40130 4463 93393 37780 -507998 113396 -41789 -254016 -17658 -117332 -44954 -76704
6142 -76704 -381384 152763 -119080 93924 -77939 -166843 -210382 -44851 -93879 -249375 26642
6130 71830 -155766 76371 222944 83341 -37098 -17170 -126566 208539 1609 25986 158321
6119 158321 103244 -121836 69809 240783 160853 -157522 223375 -23847 488917 -130017
6108 16804 -60081 214049 13830 77865 -265950 -245214 -105525 -459159 -103179 86611 186170
6097 186170 162846 -187585 -121938 149109 -319357 290720 186484 456792 132073 -177608
6086 190597 -103650 8232 -448459 -67560 88111 -257991 -20113 105425 78102 -241645 60294
6074 121736 180907 -86803 82246 -189214 -179970 -36767 183329 33674 160140 -18232 96748
6062 -202525 80679 42678 229465 128035 -26260 39003 25131 51627 -11699 102503 -143036
6050 141773 160031 264360 39441 175925 -196237 -108667 -80992 -247163 -314647 101660 -346821
6038 193322 168913 -76263 -46055 95799 -226159 -1925 -18326 111457 159195 -31369 178441
6026 307361 20992 -125570 71340 129609 138561 -65015 83795 -55247 -17118 253984 247581 -250495
6013 -138430 61443 -100858 203664 -96929 17375 5331 21605 85363 -146999 55969 -397866
6001 75034 -180127 80370 32814 71288 80122 -49407 67377 -60432 -44295 -295426 -51204 -319015
5989 -319015 65372 -146844 -125761 32305 61083 -138586 5390 -315448 -196201 -212380 -2028
5977 -141135 39835 -20391 111602 35809 233391 83058 -217057 54666 -398104 -109929 145443
5965 -51247 129302 -172323 17320 -32160 212711 131179 -116621 -106820 47320 -240520 63899
5953 2929 -304379 65678 -12808 -146784 272313 -229750 3617 -385957 18756 -149131 208637
5941 -44812 -261033 -101087 -137029 -95016 148860 -27535 -132442 -165254 -120370 67722 28510
5929 21742 41525 49670 -106435 133044 -220166 105451 174022 81451 -145282 -310939 115422
5917 18118 129632 176351 24401 32918 -76242 43319 386243 84983 -332100 -169193 -52807
5905 -117565 -2893 -107241 88346 -56425 145249 75305 13063 10668 -36923 70812 13082 -56312
5892 477284 -62206 157412 -14546 163665 -112564 554780 -158545 -221025 11621 -320049
5881 -51250 97978 -29205 20821 -116867 -82296 -245147 254423 214376 -124178 -56169 -289413
5870 -289413 -176230 -6684 125630 -281043 102449 266588 75360 -175563 -84095 20061 -3962
5858 145905 292949 299959 85326 -19523 74403 28352 -236024 259635 129021 -294646 -195628
5847 -195628 -152523 -24837 -166273 -44044 -123919 -377736 -169907 -122886 -107718 -134967 -187055
5836 -187055 63828 -8998 -6906 155830 208916 379946 197897 95306 -109349 -37775 15466
5824 358985 116237 -66347 73299 57225 -303584 -293248 -337567 -262056 4548 -128206 1130
5812 -179497 210747 7846 10141 -85251 277990 118103 -248922 -32744 89029 149627 253781
5801 253781 4024 -54890 44057 20757 376449 148126 -187541 291390 -240032 -219180 -51554
5789 206892 79868 18305 286658 107285 39211 -341974 -120529 315056 -269801 288549
5778 -117203 244701 88580 35075 23088 -164459 -44132 206583 193428 -77142 -241313 -78143
5766 -164984 -13288 331102 -25222 -55484 -128931 87192 -137986 16138 -345775 -70568 -281113
5755 -281113 2560 -215504 262035 180326 -324045 -189330 69684 -166025 125091 139459 171230
5744 171230 -316786 -90858 37997 76774 65046 184239 18695 122382 -144793 -213818 91838
5732 -195016 -40102 42232 63621 8393 -170534 -83721 49523 346524 355470 -210254 -39425
5720 111791 211303 -45871 -69294 -248823 106434 -200039 -21472 -422354 33835 -143694 -253701
5709 -253701 993 36877 -161028 206024 71297 -54343 -71999 41592 -29948 -279295 85566
5697 74419 -101458 -217367 -122187 39066 -304565 -123935 -21259 275847 -117648 105153
5686 90702 -6011 -65671 31262 23275 7451 -42574 203570 -280276 109415 -285921 -151215
5675 -151215 -13318 31522 -73037 101890 -2141 -265898 175827 60327 -197180 39725 251208
5664 251208 296477 -21105 209934 66645 286699 179000 -120443 87342 -171318 -176257 192698
5652 -164893 100664 -102509 190367 -167193 -277396 -124837 331301 -86947 -203809 231314
5641 3164 226931 -61394 200562 -27609 -100330 -105939 -164346 -62597 323656 -10201 -136032
5630 -136032 127900 302411 83412 -16317 -62879 -93222 -113394 -40608 -19790 -112477 185892
5618 -109550 -164919 -43845 -5119 -96650 -292344 517579 -48902 100359 19804 -264074 -220201
5607 -220201 -35814 -229979 -123879 -20313 90350 -382719 -158317 -179832 188896 28327 -351129
5595 -5533 -173829 -240798 243644 -27941 -228952 38522 -195094 -203181 -231533 -89122 -38598
5583 24558 325415 -121277 -8300 -61761 -3281 211453 58536 236202 -61910 72502 -56689
5571 26235 137946 -12079 41751 -55104 381922 -147983 55790 125287 -397874 -239959 293354
5559 -199376 -93681 121477 -78213 101297 -76239 18336 31939 125663 -11139 122198 63803
5548 63803 68620 -15102 114065 -81303 45830 30526 130058 -25699 -211403 -240786 30034 28971
5536 28971 469798 38671 55308 342131 79957 -44653 -127991 116930 -112245 -99608 -306902
5525 -306902 297907 254078 -149920 -139962 -206908 -4306 319415 56209 82732 -2807 -240645
5514 -240645 -99630 147494 212589 -111262 -118489 -98598 -153634 75492 -127094 116678 94617
5503 94617 107403 214801 108470 -60673 -43444 38136 436 3447 -183405 53472 -385153 -60458
5490 -89188 147028 238726 297924 13731 42406 -48638 -176365 -337710 47371 17225 145676
5479 145676 225572 1941 -96042 38995 -62734 221732 -212574 -67138 118347 -199315 -9357
5467 -1390 497775 21771 -19707 -74215 -170963 237011 -117313 148073 -149241 -120635 -202563
5456 -202563 155425 -196345 188284 40844 -189361 68604 146941 23505 91595 -55178 -14100
5444 -169669 258833 -126024 -183146 18014 168116 -23208 51326 115341 476101 13586 40260
5433 40260 67553 72923 -357766 -113987 295459 102571 215276 91555 24461 186813 308505
5422 308505 354087 124262 -338485 -229256 174490 23279 111278 187245 -31684 280551 17977
5410 -87352 -168637 203121 -82163 -2723 -46428 153079 -362455 -182140 54329 -93428 -51890
5399 -51890 205477 45098 -238881 -139288 180393 323036 16638 72921 -270737 -238017 -107126
5387 -281134 -201501 37222 -25000 180298 -88308 94670 60466 -128495 -172139 16469 136245
5376 136245 188373 101841 -132349 139314 95852 -18057 241680 -556 9201 -16778 32564 -136709
5363 -43611 -46387 -268203 -180265 107550 278632 -117449 -230098 219662 151131 242824 -3745
5351 146813 58810 -36727 -18102 79312 -82029 188519 -74517 250044 -199401 55948 -67404
5339 223414 -116062 270107 -30270 -150801 -199821 -218490 47830 -33364 104050 -220495 -399261
5328 -399261 256764 20721 -51276 -75091 66719 44532 -398425 -19384 359190 29429 342816
5317 342816 4078 -143488 -54973 -75565 -89900 -41586 -200748 90137 -12999 34735 -119543
5305 146971 275870 157903 -235676 -120935 -129857 -71541 76745 412203 -29733 -203194 -7580
5293 192931 -19071 206507 159329 -209292 -72656 -76708 -22118 -320154 406660 119547 -81181
5281 158608 44274 -5541 -168320 90229 235328 104482 -78538 160778 278065 -112902 -178904
5270 -178904 -18708 -192272 60937 172704 -78048 28592 72445 138561 49587 -49816 146979
5258 -132592 66718 387371 321622 -72224 207154 24074 102443 -93069 13514 -27851 160177
5246 77240 200601 -266319 119627 194115 -103605 -160653 -119871 -244847 96685 210908 -196267
5234 38568 -39073 -179316 423584 116834 -27992 108433 -55206 245396 -193444 -17493 -117726
5223 -117726 244805 -213073 3814 -10837 -41086 133212 -127745 118022 -337666 65600 256070
5212 256070 -15821 -27211 -214475 204958 190024 10128 210650 189206 -87365 -147685 118449
5200 -36822 -3303 -175479 -275306 -75432 88121 459532 -238091 61884 39173 -111737 198259
5188 103465 -53437 142535 -143814 -90150 -223355 140811 -195061 233384 -79826 86335
5177 -19809 -40806 13893 -21133 94290 118610 -75720 111415 13095 -156536 95722 455274
5166 455274 -56320 174605 7539 124387 -57351 146034 -105573 104439 -188164 -142306 -181119
5155 -181119 -127183 -93197 213562 -266610 -44037 52860 103483 -178213 5677 3213 -238391
5143 -394708 20200 209892 -198535 -116356 114090 109036 100401 225315 -128834 -358477 44158
5131 81524 45316 157976 78609 -251592 100468 92135 -109610 -25607 454440 -93852 122476
5119 -171396 106531 161810 -137344 288378 34475 106670 -1109 -125147 -188894 300000 148484
5107 -112905 -185335 283027 552276 52531 -149805 -137174 -144062 -186674 -142725 -358434 -119761
5095 69164 102126 -70695 -153008 -45304 -169589 -37994 46098 -11132 63350 -32806 205492
5083 26218 228120 345071 54611 -254040 -1818 -107382 -119967 108720 -147174 80965 -256749
5071 -8403 172957 86528 -43893 208562 71810 -302284 -77369 -53416 56339 94281 -101961
5059 159293 261636 13705 -109742 -159341 31343 -57235 54195 -135953 -33676 33544 135119
5048 135119 -1842 -233607 -66897 -31927 -126691 -109535 -125191 12639 -30910 30888 -166204
5036 -184827 -143317 207013 50011 122469 -7743 159646 150465 124043 282243 89596 112725
5025 112725 954 -110787 264292 308445 105654 235783 -409045 -128116 -192506 211248 -92730
5013 -52481 148056 70927 -85681 39203 -118666 -123191 -351220 -63623 46336 287437 -156997
5001 5999 317547 146854 28678 222818 -214481 173507 -17652 -121094 46913 97274 -34445
4989 -67754 -84341 -60422 163 50361 5876 -88231 186057 -42301 164958 516740 160355 20876
4976 207977 -80520 -145679 136028 -87166 -276935 -357439 313423 -105743 -118768 -462015 -194616
4964 -173820 -248119 182188 149193 336664 -234544 8676 144604 276634 99463 56299 -250991
4952 -120771 269498 -171640 -26836 187351 350546 108639 -84456 21699 62376 73143 47890
4941 47890 130114 59835 -92518 -84701 244909 -299772 56203 99220 145642 30173 180803
4930 180803 -116460 151842 234064 -44431 293471 -117215 -202756 213687 58796 -158765
4919 53556 108652 -174192 -161219 -145921 -144355 194041 58591 -288565 -365449 110488 203600
4908 203600 554882 -133457 -358998 265144 42246 55336 39480 51618 258602 -171505
4897 345975 -92638 15664 1844 32473 145019 41897 -228620 -317453 77213 68054 -91047 175076
4884 -163328 133892 -310529 -52419 -303458 36920 319752 30022 121893 290166 361765 37922
4872 28586 -220742 -28033 -96977 72260 -260810 175895 206808 25399 -15302 -192338 85197
4860 204927 -154063 -190648 -16371 55331 22980 8431 301241 103933 -131886 -99565 334026
4848 -312863 -113801 -335314 65645 197794 -89895 327143 -18339 -446311 -216682 35901
4837 29976 203941 -194080 -118459 -21007 179705 286050 152978 -222432 122179 394391
4827 394391 -20559 224990 -51230 -247249 -22335 -224561 106107 293948 111200 -172082
4816 -81385 -224647 179347 -245389 167142 -97725 -302070 -23758 -193081 -278232 211849
4805 -11993 151007 142587 -201823 200231 67570 217569 153373 -305290 242462 70793 -205320
4793 -278649 233952 -59940 283396 125343 55787 115306 -241996 90287 256747 -190357
4782 -17114 -149602 159106 -202660 172828 -109015 135113 277070 -133148 252531 7160
4771 128205 -191858 -66171 285023 94574 -7355 -127970 12391 -159075 -65818 174260 -117635
4759 -21544 -119915 -148501 64386 100493 -19003 -141358 -8009 99287 -50502 -177186 -204664 96751
4746 -241790 -152285 -158893 184631 244000 -132488 171379 26239 147317 89480 404313 -48666
4734 -126293 70801 236469 -318384 2415 142953 214966 160897 104679 -79523 -26477 102059
4722 -47808 43916 57609 39062 345304 55100 154566 -52370 -123024 50038 52041 -228803 -251196
4710 -251196 34708 65537 95203 58042 -177348 -22602 -75121 61834 -165143 -263130 -66450
4698 287562 258485 210045 -88551 3243 -44390 -291181 -117261 -135964 134745 117546 180424
4687 180424 127700 -123720 -75200 100553 -113292 62057 -162515 161909 183948 109854 -15607
4675 246427 56338 53030 5902 -89068 264889 -615 -11756 187741 44142 127312 -387462 181869
4662 227883 73786 -79925 225081 -101496 -88677 -59215 -147797 158628 237103 -90478 136946
4650 -144972 -160764 180898 73176 141826 75733 -309414 -337286 251514 68204 -232607 42928
4638 -156283 7537 -30512 -4127 29608 53824 122700 -130844 -10719 104182 -19388 -61942 -238382
4626 -238382 161527 121823 256947 -6335 278338 -82193 -77878 -79326 44175 -94485 -34522 69959
4613 126282 153995 270293 -218199 137931 79032 -151436 -180193 316958 105777 260810
4603 260810 -414344 -61594 -136250 -269866 57196 64646 203058 16117 -149828 -280735 -293290
4592 -293290 280511 -120326 9484 116217 10332 -111464 166373 23279 148216 -132479
4581 -264420 -5009 24679 262266 -343917 174989 -245921 -61944 -152768 30213 8032 36758
4570 36758 107417 -239664 488166 49660 69901 135411 -85334 353051 -254662 55790 112279
4559 112279 -210123 230521 94775 73236 131476 -220247 -220281 -69984 362261 -220464 -49752
4547 322920 -182036 273620 -183380 284934 -213091 104351 -147528 71856 -12669 223641
4536 -71725 78796 142975 17810 -27722 -176219 41066 9057 -240694 -61275 115274 293590
4525 293590 -240074 169175 -346895 -360046 121528 38730 -199059 95210 46005 -134061
$$ [...]
##END NTUPLES=NMR SPECTRUM
##END=
