
##TITLE=AC1337_BRAAS10080_6528710_QpMuhVfFTn
##JCAMPDX= 6.0         $$ Bruker NMR JCAMP-DX V2.0
##DATA TYPE= NMR SPECTRUM
##DATA CLASS= NTUPLES
##ORIGIN= BRUKER
##OWNER= Administrator
$$ 1.72 TOPSPIN		Version 2.1
$$ 2012-07-15 16:16:37.890 -0500  Administrator@TOPSPIN
$$ Compression mode = diff/dup
##.OBSERVE FREQUENCY= 400.02188249412
##.OBSERVE NUCLEUS= ^1H
##.ACQUISITION MODE= SIMULTANEOUS (DQD)
##.ACQUISITION SCHEME= undefined
##.AVERAGES= 64
##.DIGITISER RES= 22
##SPECTROMETER/DATA SYSTEM= spect
##.PULSE SEQUENCE= noesygpps1d.comp
##.SOLVENT NAME= COFFEE_meoh
##.SHIFT REFERENCE= INTERNAL, COFFEE_meoh, 1, 14.96101
##AUDIT TRAIL= $$ (NUMBER, WHEN, WHO, WHERE, PROCESS, VERSION, WHAT)
$$ ##TITLE= Audit trail, TOPSPIN		Version 2.1
$$ ##JCAMPDX= 5.01
$$ ##ORIGIN= Bruker BioSpin GmbH
$$ ##OWNER= Administrator
$$ $$ C:\Bruker\TOPSPIN/data/COFFEE/nmr/AC1337_BRAAS10080_6528710_QpMuhVfFTn/12/pdata/1/auditp.txt
$$ ##AUDIT TRAIL=  $$ (NUMBER, WHEN, WHO, WHERE, PROCESS, VERSION, WHAT)
(   1,<2012-07-15 16:16:32.906 -0500>,<Administrator>,<TOPSPIN>,<go>,<TOPSPIN 2.1>,
      <created by zg
	started at 2012-07-15 16:05:02.609 -0500,
	POWCHK enabled, PULCHK disabled,
       configuration hash MD5:
       6B 1B 68 BB D9 2E 58 E2 7F 35 AD 54 07 DF 0E 41
       data hash MD5: 64K
       E7 CC A7 20 73 6D 10 B0 4E 02 E4 00 74 4D 3D 3B>)
(   2,<2012-07-15 16:16:35.812 -0500>,<Administrator>,<TOPSPIN>,<proc1d>,<TOPSPIN 2.1>,
      <Start of raw data processing
       efp LB = 0.3 FT_mod = 6 PKNL = 1 PHC0 = 0 PHC1 = 0 SI = 128K 
       data hash MD5: 128K
       7D 3F 52 7F 7E F7 B6 11 5E F7 F1 74 7F 08 D8 14>)
(   3,<2012-07-15 16:16:36.921 -0500>,<Administrator>,<TOPSPIN>,<proc1d>,<TOPSPIN 2.1>,
      <pk PHC0 = -1.675415 PHC1 = 0 
       data hash MD5: 128K
       D5 9C 0C F7 FA AF 03 E8 1E EF 58 AF 0F E9 B0 3E>)
(   4,<2012-07-15 16:16:37.546 -0500>,<Administrator>,<TOPSPIN>,<proc1d>,<TOPSPIN 2.1>,
      <abs ABSG = 1 
       data hash MD5: 128K
       17 06 36 5D 83 F1 9F AB 44 5C 98 13 0B 50 9F 7E>)
(   5,<2012-07-15 16:16:37.609 -0500>,<Administrator>,<TOPSPIN>,<proc1d>,<TOPSPIN 2.1>,
      <abs ABSG = 2 
       data hash MD5: 128K
       9D C5 64 F5 D5 4E F9 85 CD CB 39 CD 06 B9 00 CB>)
(   6,<2012-07-15 16:16:37.671 -0500>,<Administrator>,<TOPSPIN>,<proc1d>,<TOPSPIN 2.1>,
      <abs ABSG = 3 
       data hash MD5: 128K
       38 B2 1A 2A CB 4E CD 20 C3 31 39 66 C8 1A 87 99>)
(   7,<2012-07-15 16:16:37.734 -0500>,<Administrator>,<TOPSPIN>,<proc1d>,<TOPSPIN 2.1>,
      <abs ABSG = 4 
       data hash MD5: 128K
       6F F7 55 F3 CF 6E 09 60 C8 1F 18 06 8D 27 94 7E>)
(   8,<2012-07-15 16:16:37.796 -0500>,<Administrator>,<TOPSPIN>,<proc1d>,<TOPSPIN 2.1>,
      <abs ABSG = 5 
       data hash MD5: 128K
       68 8B 36 6D 7C 8D 79 B5 7D 82 AD 0B 00 C3 52 C0>)
$$ ##END=
$$ 
$$ $$ hash MD5
$$ $$ 95 42 79 E9 D3 24 D9 1C 1F 2E B2 EE A1 C8 A1 BC
##$RELAX= 
##$RELAX= 
##$RELAX= 
##$RELAX= 
##$RELAX= 
##$RELAX= 
##$RELAX= 
##$RELAX= 
$$ Bruker specific parameters
$$ [...]
##$TP07= 0
##$TPNAME0= <>
##$TPNAME1= <>
##$TPNAME2= <>
##$TPNAME3= <>
##$TPNAME4= <>
##$TPNAME5= <>
##$TPNAME6= <>
##$TPNAME7= <>
##$TPOAL= (0..7)
0.5 0.5 0.5 0.5 0.5 0.5 0.5 0.5
##$TPOFFS= (0..7)
0 0 0 0 0 0 0 0
##$TUNHIN= 0
##$TUNHOUT= 0
##$TUNXOUT= 0
##$USERA1= <user>
##$USERA2= <user>
##$USERA3= <user>
##$USERA4= <user>
##$USERA5= <user>
##$V9= 5
##$VALIST= <valist>
##$VCLIST= <CCCCCCCCCCCCCCC>
##$VD= 0
##$VDLIST= <DDDDDDDDDDDDDDD>
##$VPLIST= <PPPPPPPPPPPPPPP>
##$VTLIST= <TTTTTTTTTTTTTTT>
##$WBST= 2048
##$WBSW= 25
##$XGAIN= (0..3)
0 0 0 0
##$XL= 0
##$YL= 0
##$YMAX_a= 12447435
##$YMIN_a= -10122776
##$ZGOPTNS= <>
##$ZL1= 120
##$ZL2= 120
##$ZL3= 120
##$ZL4= 120
##$ABSF1= 14.96101
##$ABSF2= -5.597172
##$ABSG= 5
##$ABSL= 3
##$ALPHA= 0
##$AQORDER= 0
##$ASSFAC= 0
##$ASSFACI= 0
##$ASSFACX= 0
##$ASSWID= 0
##$AUNMP= <proc_prof1d_extract.lims>
##$AXLEFT= 0
##$AXNAME= <>
##$AXNUC= <1H>
##$AXRIGHT= 0
##$AXTYPE= 0
##$AXUNIT= <>
##$AZFE= 0.1
##$AZFW= 0.1
##$BCFW= 0
##$BC_mod= 0
##$BYTORDP= 0
##$COROFFS= 0
##$CY= 15
##$DATMOD= 1
##$DC= 0
##$DFILT= <>
##$DTYPP= 0
##$F1P= 0
##$F2P= 0
##$FCOR= 0.5
##$FTSIZE= 131072
##$FT_mod= 6
##$GAMMA= 0
##$GB= 0
##$INTBC= 1
##$INTSCL= 1
##$ISEN= 128
##$LB= 0.3
##$LEV0= 0
##$LPBIN= 0
##$MAXI= 10000
##$MC2= 0
##$MEAN= 0
##$ME_mod= 0
##$MI= 0
##$NCOEF= 0
##$NC_proc= -2
##$NLEV= 6
##$NOISF1= 0
##$NOISF2= 0
##$NSP= 0
##$NTH_PI= 0
##$NZP= 0
##$OFFSET= 14.96101
##$PC= 1
##$PHC0= -1.675415
##$PHC1= 0
##$PH_mod= 1
##$PKNL= yes
##$PPARMOD= 0
##$PPDIAG= 0
##$PPIPTYP= 0
##$PPMPNUM= 2147483647
##$PPRESOL= 1
##$PSCAL= 4
##$PSIGN= 0
##$PYNMP= <proc.py>
##$REVERSE= no
##$SF= 400.020009634283
##$SI= 131072
##$SIGF1= 0
##$SIGF2= 0
##$SINO= 400
##$SIOLD= 131072
##$SPECTYP= <>
##$SREGLST= <1H.CDCl3>
##$SSB= 0
##$STSI= 131072
##$STSR= 0
##$SW_p= 8223.68421052631
##$SYMM= 0
##$S_DEV= 0
##$TDeff= 65536
##$TDoff= 0
##$TI= <>
##$TILT= no
##$TM1= 0
##$TM2= 0
##$TOPLEV= 0
##$USERP1= <user>
##$USERP2= <user>
##$USERP3= <user>
##$USERP4= <user>
##$USERP5= <user>
##$WDW= 1
##$XDIM= 131072
##$YMAX_p= 363335857
##$YMIN_p= -11763
##$CURPLOT= <Network HP LaserJet P1505>
##$CURPRIN= <$Network HP LaserJet P1505>
##$DFORMAT= <normdp>
##$LAYOUT= <+/1D_H.xwp>
##$LFORMAT= <normlp>
##$PFORMAT= <normpl>
##$SURQMSG= 1
$$ End of Bruker specific parameters
$$ ---------------------------------
##NTUPLES= NMR SPECTRUM
##VAR_NAME=  FREQUENCY,     SPECTRUM/REAL,   SPECTRUM/IMAG
##SYMBOL=    X,             R,               I
##VAR_TYPE=  INDEPENDENT,   DEPENDENT,       DEPENDENT
##VAR_FORM=  AFFN,          ASDF,            ASDF
##VAR_DIM=   131072,        131072,          131072
##UNITS=     HZ,            ARBITRARY UNITS, ARBITRARY UNITS
##FACTOR=    0.0627417313425164, 1,          1
##FIRST=     8223.62146879497, -3944,        -68162
##LAST=      0,             -1945,           -69233
##MIN=       0,             -11763,          0
##MAX=       8223.62146879497, 363335857,    0
$$ Real data points
##PAGE= N=1
##DATA TABLE= (X++(R..R)), XYDATA
$$ [...]
61572D29181k603k990l475l802l812l707l641l377k687j944j739k041k239k012
$$ 429181 426578 423588 420113 416311 412499 408792 405151 401774 399087 397143 395404 393363 391124 389112
61558C89112j648j477j475j560j722j664r40J95P06Q4p85p77r5K16jJ17P15P10
$$ 389112 387464 385987 384512 382952 381230 379566 378626 378821 379527 379611 378826 378049 377954 378170 378169 378286 379001 379711
61540C79711m47j563j185L90J659K043K263K745K822J965Q23L63N34M67k56j171
$$ 379711 379264 377701 376516 376906 378565 380608 382871 385616 388438 390403 391226 391589 392123 392590 392334 391163
61524C91163j715j937k314l129m094m562m152l179k345j971j773j473j279j489
$$ 391163 389448 387511 385197 382068 377974 373412 369260 366081 363736 361765 359992 358519 357240 355751
61510C55751j932k140j940j543j157q04m51r2K84N00J82o71j292r05J02M23n00
$$ 355751 353819 351679 349739 348196 347039 346235 345784 345692 345976 346476 346658 345987 344695 343790 343892 344315 343815
61493C43815j681j884j175n90n91o74m22j06k5P6N10J010J092Q29P54J142J768
$$ 343815 342134 340250 339075 338485 337894 337220 336798 336692 336667 336743 337253 338263 339355 340184 340938 342080 343848
61476C43848K319K598K389J534L53m21l69J99P20R94J126J004L75o06j201q08
$$ 343848 346167 348765 351154 352688 353041 352620 352251 352450 353170 354164 355290 356294 356669 356063 354862 354054
61460C54054K48Q66L01r46j586r45K86R51P74M51N49Q99J224J644K170K210J297
$$ 354054 354302 355168 355469 354523 352937 351992 352278 353229 354003 354454 355003 355902 357126 358770 360940 363150 364447
61443C64447L6m23K12J039J192P64L80M12Q90J716K592L065L065L070L384L548
$$ 364447 364483 364060 364272 365311 366503 367267 367647 368059 368949 370665 373257 376322 379387 382457 385841 389389
61427C89389K948J749P37K92J27j4K7L85Q47J235J651K090K192J756J133P17L38
$$ 389389 392337 394086 394823 395115 395242 395228 395255 395640 396487 397722 399373 401463 403655 405411 406544 407261 407599
61410D07599l38j052j241j007j132j933k686k612j920j452j558j850j930j861
$$ 407599 407261 406209 404968 403961 402829 400896 398210 395598 393678 392226 390668 388818 386888 385027
61396C85027j912k171k511k684k483k026j765j960k195j822q42RJ68j43l25j17
$$ 385027 383115 380944 378433 375749 373266 371240 369475 367515 365320 363498 362656 362665 362833 362690 362365 362248
61380C62248L33P82J065J188J368J822K337K360J713R30O96J092J672J953J724
$$ 362248 362581 363363 364428 365616 366984 368806 371143 373503 375216 376146 376842 377934 379606 381559 383283
61365C83283J095N65P25J502K004J593Q87J069K343L647M063L899M061M820N682
$$ 383283 384378 384943 385668 387170 389174 390767 391654 392723 395066 398713 402776 406675 410736 415556 421238
61350D21238O240O673P297Q050Q637R036R501J0041J0201R612Q540P549O761N920
$$ 421238 427478 434151 441448 449498 458135 467171 476672 486713 496914 506526 515066 522615 529376 535296
61336E35296N084M651M571M146L047J840J099N22l98j351j723j743k206l159l799
$$ 535296 540380 545031 549602 553748 556795 558635 559734 560256 559858 558507 556784 555041 552835 549676 545877
61321E45877l786l668l849l967l634l039k350j229N42K411L640M148M353M472
$$ 545877 542091 538423 534574 530607 526973 523934 521584 520355 520897 523308 526948 531096 535449 539921
61307E39921M451M314M284M634N680P454R270J0124R870R444R433R071P290M275
$$ 539921 544372 548686 552970 557604 563284 570738 580008 590132 600002 609446 618879 627950 635240 639515
61293F39515J193j289l325n015o175o989p884q655q555p634p039p403p682o399
$$ 639515 640708 639419 636094 631079 624904 617915 610031 601376 592821 585187 578148 570745 563063 556664
61279E56664l664j134j7P9K20P26J132J174J340K308M041N671O334O047N667N912
$$ 556664 553000 551866 551849 551928 552148 552874 554006 555180 556520 558828 562869 568540 574874 580921 586588 592500
61263E92500O651P265P523P727Q076Q312Q259Q360R218J0661J1748J1807J1093
$$ 592500 599151 606416 613939 621666 629742 638054 646313 654673 663891 674552 686300 698107 709200
61250G09200J0232R368Q226O725N095L406J448q45l134m989o175o598o254n445
$$ 709200 719432 728800 737026 743751 748846 752252 753700 752855 749721 744732 738557 731959 725705 720260
61236G20260m838m948n605o021n517m153k699j899j758j596q81J56R53J431J991
$$ 720260 715422 710474 704869 698848 693331 689178 686479 684580 682822 681226 680345 680501 681454 682885 684876
61221F84876K845L763M542N231N754N768N181M449M047L889L602L152K843K839
$$ 684876 687721 691484 696026 701257 707011 712779 717960 722409 726456 730345 733947 737099 739942 742781
61207G42781K997L102L050K802K407K076K039K333K816L372M040M984O371Q208
$$ 742781 745778 748880 751930 754732 757139 759215 761254 763587 766403 769775 773815 778799 785170 793378
61193G93378J0329J2527J4718J6768J8325J9108J9330J9468J9513J8836J7004
$$ 793378 803707 816234 830952 847720 866045 885153 904483 923951 943464 962300 979304
61182I79304J4379J1720R452P630O318N507M783L531J622k78j315j410j519k793
$$ 979304 993683 1005403 1014855 1022485 1028803 1034310 1039093 1042624 1044246 1043968 1042653 1041243 1039724 1036931
61168A036931n364q120r873j0635j1382j2641j3862j4325j4188j4252j4977j6056
$$ 1036931 1031567 1023447 1013574 1002939 991557 978916 965054 950729 936541 922289 907312 891256
61156H91256j6803j6709j5734j4248j2696j1240r840q533p312n830l763j589l43
$$ 891256 874453 857744 842010 827762 815066 803826 793986 785453 778141 772311 768548 766959 766616
61143G66616l51o93m17J69p3j682m153o657q604r542r138p501n298l259j607J3
$$ 766616 766265 765572 765155 765324 765251 763569 759416 752759 744155 734613 725475 717974 712676 709417 707810 707823
61127G07823K031M362O413P776Q827J0315J2466J4818J6936J8772K0365K1734
$$ 707823 709854 714216 720629 728405 737232 747547 760013 774831 791767 810539 830904 852638
61115H52638K3196K5187K7518K9360L0159L0111K9591K8778K8018K7781K7835
$$ 852638 875834 901021 928539 957899 988058 1018169 1047760 1076538 1104556 1132337 1160172
61104A160172K7255K5692K3820K2044J9671J6194J2460R516O924L404j298o269
$$ 1160172 1187427 1213119 1236939 1258983 1278654 1294848 1307308 1316824 1323748 1327152 1325854 1319585
61092A319585j0849j5074j8898k2086k4817k7417k9480l0215k9708k8926k8455
$$ 1319585 1308736 1293662 1274764 1252678 1227861 1200444 1170964 1140749 1111041 1082115 1053660
61081A053660k8088k7616k7120k6386k4984k3077k1306j9776j7990j5880j4024
$$ 1053660 1025572 997956 970836 944450 919466 896389 875083 855307 837317 821437 807413
61070H07413j2660j1411j0147r184q327o768m381k233j191p87l8J249K626L863
$$ 807413 794753 783342 773195 764011 755684 748916 744535 742302 741111 740324 740286 741535 744161 748024
61056G48024N010N965O551O908P381Q246R650J1541J3418J4686J5401J6311J7885
$$ 748024 753034 758999 765550 772458 779839 788085 797735 809276 822694 837380 852781 869092 886977
61043H86977J9797K1551K3177K4981K6943K8767L0219L1288L2127L3016L4077
$$ 886977 906774 928325 951502 976483 1003426 1032193 1062412 1093700 1125827 1158843 1192920
61032A192920L5121L5989L6918L8216L9703M1014M2183M3496M4979M6702M9091
$$ 1192920 1228041 1264030 1300948 1339164 1378867 1419881 1462064 1505560 1550539 1597241 1646332
61021A646332N2184N5007N6754N8292O1278O6036P1803P8898Q8916J02560J19109
$$ 1646332 1698516 1753523 1810277 1868569 1929847 1995883 2067686 2146584 2235500 2338060 2457169
61010B457169J38512J62255J91306K24936K62712L06169L57335M17338M88040
$$ 2457169 2595681 2757936 2949242 3174178 3436890 3743059 4100394 4517732 5005772
61001E005772N73801O79291Q05102R45203J087230J216013J322091J411085J500787
$$ 5005772 5579573 6258864 7063966 8009169 9096399 10312412 11634503 13045588 14546375
60992A4546375J599952J685896J707106J613607J387705J049993O46042K35983
$$ 14546375 16146327 17832223 19539329 21152936 22540641 23590634 24236676 24472659
60984B4472659j08897l20925l70637k96510j95556j73342k91678n50855r05397
$$ 24472659 24363762 24042837 23672200 23375690 23180134 23006792 22715114 22164259 21258862
60975B1258862j286425j616805j828508j887042j805888j633756j424205j214144
$$ 21258862 19972437 18355632 16527124 14640082 12834194 11200438 9776233 8562089
60967H562089j022482q57519p20707o08044n14066m35727l71799l20207k78060
$$ 8562089 7539607 6682088 5961381 5353337 4839271 4403544 4031745 3711538 3433478
60958C433478k43477k15576j92975j73783j56870j42050j29098j17426j06563
$$ 3433478 3190001 2974425 2781450 2607667 2450797 2308747 2179649 2062223 1955660
60949A955660r6297q6545p7653p0428o5204o1296n7960n5424n4127n3393n1853
$$ 1955660 1859363 1772818 1695165 1624737 1559533 1498237 1440277 1384853 1330726 1277333 1225480
60938A225480m9126m6121m3637m1417l8916l6225l3878l2068l0497k8733k6584
$$ 1225480 1176354 1130233 1086596 1045179 1006263 970038 936160 904092 873595 844862 818278
60927H18278k4231k2155k0760j9910j9006j7615j5899j4360j3296j2595j2021
$$ 818278 794047 771892 751132 731222 712216 694601 678702 664342 651046 638451 626430
60916F26430j1471j0939j0358r573q476p118n758m781m382m237l679k463j153
$$ 626430 614959 604020 593662 584089 575613 568495 562737 557956 553574 549337 545658 543195 542042
60903E42042m38k41m6R2m12j483k142j862j404j633k134j865p61K86Q01J150J557
$$ 542042 541604 541363 541317 541409 540997 539514 537372 535510 534106 532473 530339 528474 527713 527999 528800 529950 531507
60886E31507J622J031Q8p42j327j710j934k094k289k430k509k856l719m657m985
$$ 531507 533129 534160 534248 533506 532179 530469 528535 526441 524152 521722 519213 516357 512638 507981 502996
60871E02996m678m279m001l615l180l070l167k887k110j348p87JJ041J590J268
$$ 502996 498318 494039 490038 486423 483243 480173 477006 474119 472009 470661 469874 469875 470916 472506 473774
60856D73774Q07J029J707K106K106K104K184K091J902K053K748L679M345M416
$$ 473774 474581 475610 477317 479423 481529 483633 485817 487908 489810 491863 494611 498290 502635 507051
60842E07051L940L343K996K717K056J093M41K65Qo31j159j230j382k045k511j836
$$ 507051 510991 514334 517330 520047 522103 523196 523637 523902 523910 523279 522120 520890 519508 517463 514952 513116
60826E13116m54K34j49m66K69J557K225J846Q77j99j236k110k551k454k111k055
$$ 513116 512662 512896 512747 512281 512550 514107 516332 518178 519055 518856 517620 515510 512959 510505 508394 506339
60810E06339k642l759m915n572n548n135m829m888n072m879m114l145k481k247
$$ 506339 503697 499938 495023 489451 483903 478768 473939 469051 463979 459100 454986 451841 449360 447113
60796D47113k220k230k221k068j733j529j775k168k028j292p31r22j495j721j350
$$ 447113 444893 442663 440442 438374 436641 435112 433337 431169 429141 427849 427118 426196 424701 422980 421630
60781D21630n64M60J401J650R55J9j68M82J205J573K033L038M251M965N011M869
$$ 421630 421066 421526 422927 424577 425532 425551 425383 425865 427070 428643 430676 433714 437965 442930 447941 452810
60765D52810M979N326N700O016O219O075N422M590M242M596N106N143M739M303
$$ 452810 457789 463115 468815 474831 481050 487125 492547 497137 501379 505975 511081 516224 520963 525266
60751E25266L887L250K561K338K633K864K638K214J820J181Q4j075j816k299l002
$$ 525266 529153 532403 534964 537302 539935 542799 545437 547651 549471 550652 550736 549661 547845 545546 542544
60736E42544l939m729n216n516n629n478n243n159n037m474l587l023l086l315
$$ 542544 538605 533876 528660 523144 517515 512037 506794 501635 496598 492124 488537 485514 482428 479113
60722D79113l162k739k528k555k262j292m8P89J110J407J909K235K107J964K308
$$ 479113 475951 473212 470684 468129 465867 464575 464527 465316 466426 467833 469742 471977 474084 476048 478356
60707D78356K825K877K721L309M762O018O359O462P200Q175Q343P676P221P619
$$ 478356 481181 484058 486779 490088 494850 500868 507227 513689 520889 529064 537407 545083 552304 559923
60693E59923Q420Q890Q754Q069P044O203O115O723P345P619P959Q772R670R882
$$ 559923 568343 577233 585987 594056 601100 607303 613418 620141 627486 635105 643064 651836 661506 671388
60679F71388R341Q892R438J1064J3058J4634J5506J5860J5967J6028J6289J6946
$$ 671388 680729 689621 699059 710123 723181 737815 753321 769181 785148 801176 817465 834411
60667H34411J7791J8201J7773J6751J5648J4625J3510J2235J0846R211P127M692
$$ 834411 852202 870403 888176 904927 920575 935200 948710 960945 971791 981002 988129 992821
60655I92821K336L65j204k462l574m959p034r627j1911j3186j3511j3461j3500
$$ 992821 995157 995522 994318 991856 988282 983323 976289 966662 954751 941565 928054 914593 901093
60642I01093j3780j4330j5028j5468j5247j4554j4211j4830j5969j6437j5500
$$ 901093 887313 872983 857955 842487 827240 812686 798475 783645 767676 751239 735739
60631G35739j3590j1752j0593r954r376q546p457o358n559n053m495l801l506
$$ 735739 722149 710397 699804 689850 680474 671928 664471 658113 652554 647501 643006 639205 635699
60618F35699l999m667m497l513k853l197l941m369m812n921p334p946p364o312
$$ 635699 631700 627033 622536 619023 616170 612973 609032 604663 599851 593930 586596 578650 571286 564974
60604E64974n628n501n675n844n687n068m400m375n134n947n954n029l793k942
$$ 564974 559346 553845 548170 542326 536639 531571 527171 522796 517662 511715 505761 500732 496939 493997
60590D93997k734k982l335l495l249k560j737j317j522j848j565o58J81N16O64
$$ 493997 491263 488281 484946 481451 478202 475642 473905 472588 471066 469218 467653 466995 467176 467692 468356
60575D68356J025J441J603J655J930K390K804L224L868M663N425O206P149Q085
$$ 468356 469381 470822 472425 474080 476010 478400 481204 484428 488296 492959 498384 504590 511739 519824
60561E19824Q740R098R118Q392O707M735L426K727J636l22k363l447l422k895
$$ 519824 528564 537662 546780 555172 561879 566614 570040 572767 574403 574081 571718 568271 564849 561954
60547E61954k324j744j022j1J450L369N411P007P689P383O615O294P027Q454R435
$$ 561954 559630 557886 556864 556853 558303 561672 567083 574090 581779 589162 595777 602071 609098 617552 626987
60532F26987R028P174M475J620q73k674l843m827n925o622n963l796j410l56p48
$$ 626987 636015 643189 647664 649284 648411 645737 641894 637067 631142 624520 618557 614761 613351 612995 612247
60517F12247j265r50k94j72l96j44O57J339J734K363L297L910M098M715O303Q227
$$ 612247 610982 610032 609738 609566 609170 609026 609683 611022 612756 615119 618416 622326 626424 631139 637442 645669
60501F45669R700J0940J2637J4979J7840K1315K5241K8751L1110L2594L3902L5041
$$ 645669 655369 666309 678946 693925 711765 733080 758321 787072 818182 850776 884678 919719
60489I19719L5531L5131L3604L0207K4353J6464P408k405j2605k2058k9648l5432
$$ 919719 955250 990381 1023985 1054192 1078545 1095009 1102417 1100012 1087407 1065349 1035701 1000269
60477A000269l9969m2879m3353m1750l9359l6605l2995k8807k5301k2869k0479
$$ 1000269 960300 917421 874068 832318 792959 756354 723359 694552 669251 646382 625903
60466F25903j7501j4813j3298j2392j1089r519q549q370q285p689o625n636n340
$$ 625903 608402 593589 580291 567899 556810 547291 538742 530372 522087 514398 507773 502137 496797
60453D96797n864o498o326n339m343l813l479l202l250l494l203k158j126p36
$$ 496797 490933 484435 478109 472770 468427 464614 461135 457933 454683 451189 447986 445828 444702 443966
60439D43966o61m07j28r2m2K04K32k66p87p28l34k91p48j279j479j171m20K96
$$ 443966 443305 442898 442770 442678 442636 442840 443072 442806 442019 441291 440957 440666 439918 438639 437160 435989 435569 435865
60421D35865M34J52K04P71J176R88O30M48J78j63J11J079J662J221O78J014J636
$$ 435865 436299 436451 436655 437426 438602 439590 440220 440668 440846 440683 440794 441873 443535 444756 445434 446448 448084
60404D48084J523J082J328J880J504K90l63Q4P38R49J121J557J844J731J588J587
$$ 448084 449607 450689 452017 453897 455401 455691 455328 455412 456150 457099 458220 459777 461621 463352 464940 466527
60388D66527J471J398J930K915L409L128K906L225L360K656J711J508K002K408
$$ 466527 467998 469396 471326 474241 477650 480778 483684 486909 490269 492925 494636 496144 498146 500554
60374E00554K322J885J304Q72J042J840K474K173J132J99j35M2N52J242J786J904
$$ 500554 502876 504761 506065 506937 507979 509819 512293 514466 515598 515797 515662 515704 516256 517498 519284 521188
60358E21188J660J268P37P8l95l52N6M15O10Q28J144J459J801K295K861L282L538
$$ 521188 522848 524116 524853 524931 524536 524184 524240 524655 525265 526093 527237 528696 530497 532792 535653 538935 542473
60341E42473L782L974L860L385K844K561K551K640K620K231J138p32k869m428
$$ 542473 546255 550229 554089 557474 560318 562879 565430 568070 570690 572921 574059 573327 570458 566030
60327E66030m945m744m441m213l736k920k265k223k426k027p69O20J271J090O64
$$ 566030 561085 556341 551900 547687 543951 541031 538766 536543 534117 532090 531321 531941 533212 534302 534966
60312E34966N15O89J071J717K815M321N848P059Q095R394J1034J2577J3690J4599
$$ 534966 535481 536170 537241 538958 541773 546094 551942 559001 567096 576490 587524 600101 613791 628390
60298F28390J5498J5828J4721J2177R143O269L178o39m757q191j0554j2116j2908
$$ 628390 643888 659716 674437 686614 695757 702026 705204 704565 699808 691617 681063 668947 656039
60285F56039j2509j0942r049p579o360m961l718l383l917m382m265m130m622n403
$$ 656039 643530 632588 623539 615960 609600 604639 600921 597538 593621 589239 584974 580844 576222 570819
60271E70819n686n416n250n542n997o205n968n148l840k675k329k587k565j965
$$ 570819 565133 559717 554467 548925 542928 536723 530755 525607 521767 519092 516763 514176 511611 509646
60257E09646j455j492j618j323r36j018j360j323q36l72j57k3L6j96o88j148j455
$$ 509646 508191 506699 505081 503758 502822 501804 500444 499121 498285 497913 497756 497733 497769 497573 496885 495737 494282
60240D94282j630j512q88j5N61P13Q54J294J821K115K208K399K861L461L924M174
$$ 494282 492652 491140 490252 490237 490798 491511 492365 493659 495480 497595 499803 502202 505063 508524 512448 516622
60224E16622M492N101N569N064L447J689Q53J015J591K270L052L731M113M503
$$ 516622 521114 526215 531784 536848 540295 541984 542837 543852 545443 547713 550765 554496 558609 563112
60210E63112N286O136O410O169O073O251O169N745N650O216O793O685O031N289
$$ 563112 568398 574534 580944 587113 593186 599437 605606 611351 617001 623217 630010 636695 642726 648015
60196F48015M450L371K439K218K644L025K825K036R56j17r58j490j822k145k602
$$ 648015 652465 655836 658275 660493 663137 666162 668987 671023 671979 671862 670904 669414 667592 665447 662845
60181F62845l229l915m412m581m582m611m562m297m028m022m034l607k877k473
$$ 662845 659616 655701 651289 646708 642126 637515 632953 628656 624628 620606 616572 612965 610088 607615
60167F07615k491k300j608r78r02j037q53n25m68m96j17N46Q44N89L41O53J401
$$ 607615 605124 602824 601216 600238 599336 598299 597446 596921 596453 595957 595840 596386 597230 597819 598160 598813 600214
60150F00214K009K052J623J248J428K120K830L281L650M018M028L521L073L345
$$ 600214 602223 604275 605898 607146 608574 610694 613524 616805 620455 624473 628501 632022 635095 638440
60136F38440M121M632M678M794N238N548N325M846M566M383L840K756J378N3q94
$$ 638440 642561 647193 651871 656665 661903 667451 672776 677622 682188 686571 690411 693167 694545 694598 693704
60121F93704j174p47m0L77L57L04P20J708K835L344K605O57j597k961k925k051
$$ 693704 692530 691783 691743 692120 692477 692781 693501 695209 698044 701388 703993 704650 703053 700092 697167 695116
60105F95116j328j241j540j803j972k306k941l599l874l755l694l960m111l498
$$ 695116 693788 692547 691007 689204 687232 684926 681985 678386 674512 670757 667063 663103 658992 655494
60091F55494k313j542j604j598m70J439K771K884K409K092J994J971K169K541
$$ 655494 653181 651639 650035 648437 647967 649406 652177 655061 657470 659562 661556 663527 665696 668237
60077F68237K648K352K081K002J584M98p99j977l501n567p145p217o419o198o667
$$ 668237 670885 673237 675318 677320 678904 679402 678603 676626 673125 667558 660413 653196 646777 640579 633912
60062F33912o656n745m867m745m995n083n048m827m038k889k288k447k426j684
$$ 633912 627256 621511 616644 611899 606904 601821 596773 591946 587908 585019 582731 580284 577858 576174
60048E76174j052j315j744j145L40J580K192K817L793M610M809M621M550M851
$$ 576174 575122 573807 572063 570918 571258 572838 575030 577847 581640 586250 591059 595680 600230 605081
60034F05081N459N984N820M648K881J247J7j017j999k849l593m404n343o328p239
$$ 605081 610540 616524 622344 626992 629873 631120 631137 630120 628121 625272 621679 617275 611932 605604 598365
60019E98365p838p788p113o400o136o097n813n370n220n360n320m862m126l181
$$ 598365 590527 582739 575626 569226 563090 556993 551180 545810 540590 535230 529910 525048 520922 517741
60005E17741k016j041q79j454j829j242L1J091J387J045N84N80J345K665L845
$$ 517741 515725 514684 513805 512351 510522 509280 509311 510402 511789 512834 513418 513998 515343 518008 521853
59990E21853M292M009L479L154L171L452L940M551N015M900L996K684J648J174
$$ 521853 526145 530154 533633 536787 539958 543410 547350 551901 556916 561816 565812 568496 570144 571318
59976E71318R19L93n26j711l054m326n006m655l454k131j314j101j174j180r99
$$ 571318 572237 572630 572104 570393 567339 563013 558007 553352 549898 547767 546453 545352 544178 542998 541999
59961E41999p62o20m85j59L22P43J064J434J694J340K60q66j289j064q05p86p75
$$ 541999 541237 540617 540132 539973 540295 541038 542102 543536 545230 546570 546830 545964 544675 543611 542806 542020 541245
59944E41245n51k40o1j08k87l45j01J51k48j518l008l926m215m297m219l686k767
$$ 541245 540694 540454 540393 540285 539998 539653 539552 539703 539455 537937 534929 531003 526788 522491 518272 514586 511819
59927E11819j926j359q28j91M07R42J581K170K220J609R68R79J593K224K534K707
$$ 511819 509893 508534 507706 507515 507922 508864 510445 512615 514835 516444 517412 518391 519984 522208 524742 527449
59911E27449L024L335L159K317J342J040J566K266K549K487K345J998J354R56
$$ 527449 530473 533808 536967 539284 540626 541666 543232 545498 548047 550534 552879 554877 556231 557187
59897E57187J358K141K261J483O63N39R81J646K615L916N085N762O272P059P842
$$ 557187 558545 560686 562947 564430 565093 565632 566613 568259 570874 574790 579875 585637 591909 598968 606810
59882F06810P931P265O554O426O822P234P175O417N077L590K359J424N66k85j014
$$ 606810 614741 622006 628560 634986 641808 649042 656217 662634 667711 671301 673660 675084 675650 675365 674351
59867F74351j673k593l978n561o781p272p055o392n597m965m637m446m020l184
$$ 674351 672678 670085 666107 660546 653765 646493 639438 633046 627449 622484 617847 613401 609381 606197
59853F06197k220j540j164o90J70J303K480L661M853N883O585P049P424P561P073
$$ 606197 603977 602437 601273 600583 600753 602056 604536 608197 613050 618933 625518 632567 639991 647552 654625
59838F54625N743L756J567k96j377j521r89k86J81K00k80j266k781m790o893q301
$$ 654625 660368 664124 665691 665395 664018 662497 661508 661222 661403 661603 661323 660057 657276 652486 645593 637292
59822F37292q503p976p785q286q780q647q146p686o961n580m113l593m104m710
$$ 637292 628789 620813 613028 604742 595962 587315 579169 571483 564522 558942 554829 551236 547132 542422
59808E42422m758m502m341m180l755k981j839m55N95O82K4m30l02k62r57j952
$$ 542422 537664 533162 528821 524641 520886 517905 516066 515611 516206 516888 516912 516482 516180 515918 514961 513009
59792E13009k320j812r83m43m49r49j574j805j502j117j032r85n19K26O65O31
$$ 513009 510689 508877 507894 507451 507002 506053 504479 502674 501172 500055 499023 498038 497519 497745 498410 499041
59776D99041N84R50J594K055K040J578R03L48K04N56J226J878K220K177J939J820
$$ 499041 499625 500575 502169 504224 506264 507842 508745 509093 509297 509853 511079 512957 515177 517354 519293 521113
59760E21113K010K433K804K826K473K192K619L870N224N760N329M654M530N063
$$ 521113 523123 525556 528360 531186 533659 535851 538470 542340 547564 553324 558653 563307 567837 572900
59746E72900N688N704M892L839L475M018M525L935K354Q75K25J91L01L55J89l71
$$ 572900 578588 584292 589184 593023 596498 600516 605041 608976 611330 612205 612430 612621 612922 613277 613466 613095
59730F13095j019j048k35Q56J676K177K317J822R17N36J132J890J809J102P11
$$ 613095 612076 611028 610793 611649 613325 615502 617819 619641 620558 621094 622226 624116 625925 627027 627738
59715F27738R46J447K126L092L798L386K009Q63O44Q56R89J460K784M441N323
$$ 627738 628684 630131 632257 635349 639147 642533 644542 645405 646049 646905 647894 649354 652138 656579 661902
59700F61902N011M017L094K686K924L529L866L505K742K161J813J265M14k71n20
$$ 661902 666913 670930 674024 676710 679634 683163 687029 690534 693276 695437 697250 698515 698929 698658 698138
59685F98138p52j493k571l306l364l056k763k492k107j738j668j946k306k548
$$ 698138 697386 695893 693322 690016 686652 683596 680833 678341 676234 674496 672828 670882 668576 666028
59671F66028k804l403m448n475n630m481k742j880k612l960m278l177j908j751
$$ 666028 663224 659821 655373 649898 644268 639787 637045 635165 632553 628593 624315 621138 619230 617479
59657F17479k515k991k479j342k99L64Q50J491K432L400L765L100J767O21k7q43
$$ 617479 614964 611973 609494 608152 607853 608217 609067 610558 612990 616390 620155 623255 625022 625643 625616 624773
59641F24773k604n010o737o768n455m106l648l859l915l351k408j558j006o85
$$ 624773 622169 617159 610422 603654 598199 594093 590445 586586 582671 579320 576912 575354 574348 573663
59627E73663n05m54m83m70l51k48m25j025j852k483k642k427k097j781j505j378
$$ 573663 573158 572704 572221 571751 571400 571152 570727 569702 567850 565367 562725 560298 558201 556420 554915 553537
59611E53537j552j961k289k177j456k41J046J843J920J634J571J868K111J931
$$ 553537 551985 550024 547735 545558 544102 543861 544907 546750 548670 550304 551875 553743 555854 557785
59597E57785J388P63K22j96m23m33l69m36o68q81q03l34K73N59K78l57r84j541
$$ 557785 559173 559936 560158 559962 559539 559106 558737 558301 557633 556752 555949 555615 555888 556447 556725 556368 555384 553843
59579E53843k205k912l282l086k607k395k768l515m013l694k605j453r55j160
$$ 553843 551638 548726 545444 542358 539751 537356 534588 531073 527060 523366 520761 519308 518353 517193
59565E17193j606j914j933j501n88L29O30L43J42L91P11P36P82J341K288L027
$$ 517193 515587 513673 511740 510239 509651 509980 510610 510953 511095 511486 512197 512933 513715 515056 517344 520371
59549E20371L214L029K841K951L442M107M581M757M920N395O204P217Q338R464
$$ 520371 523585 526614 529455 532406 535848 539955 544536 549293 554213 559608 565812 573029 581367 590831
59535E90831J0516J1661J3137J4651J5355J4615J2529R508N849K100p52k017j944
$$ 590831 601347 613008 626145 640796 656151 670766 683295 692803 698652 700752 700000 697983 696039
59522F96039j082N51K994N315O111N100L494K424J700M43j574l794n697p223q434
$$ 696039 694957 695508 698502 703817 709928 715028 718522 720946 722646 723089 721515 717721 712024 704801 696367
59507F96367r285r849j0401j1043j1469j1314j0639r806q952p921o756n877n471
$$ 696367 687082 677233 666832 655789 644320 633006 622367 612561 603609 595688 588932 583055 577584
59494E77584n084m213l042k128j534r01k28J30K83Q76K112L423M385N175N765
$$ 577584 572500 568287 565245 563117 561583 560682 560454 560584 560867 561743 563855 567278 571663 576838 582603
59479E82603N588M681M315N429P098P640O983O609P223P778P177N774M561L693
$$ 582603 588191 592872 597187 602616 609714 617354 624337 630946 638169 645947 653124 658898 663459 667152
59465F67152K620J234R5l52k12K65J107K506M420O416P994R104J0225J1757J3484
$$ 667152 669772 671006 671101 670749 670537 670802 671909 674415 678835 685251 693245 702349 712574 724331 737815
59450G37815J4907J5925J6775J7319J6938J5359J3173J1218R569P435M011o46
$$ 737815 752722 768647 785422 802741 819679 835038 848211 859429 868998 876433 880444 879798
59438H79798n584r723j2660j4656j5898j6141j5267j3818j2502j1413j0182q794
$$ 879798 874214 864491 851831 837175 821277 805136 789869 776051 763549 752136 741954 733160
59426G33160p664o932o220n113l455j149J780M845P420R595J2133J5311J8303
$$ 733160 725496 718564 712344 707231 703776 702627 704407 709252 716672 726267 738400 753711 772014
59413G72014K0028K0213J9334J8049J7005J6585J6206J4365J0031L824k716q727
$$ 772014 792042 812255 831589 849638 866643 883228 899434 913799 923830 927654 924938 916211
59401I16211j4149j8474k0416j9200j5593j1214p197l950j852j589l662p843j3190
$$ 916211 902062 883588 863172 843972 828379 817165 809968 806018 804166 802577 798915 791072 777882
59388G77882j8470k2539k4602k4407k2364j9348j6209j3312j0584q002n854m393
$$ 777882 759412 736873 712271 687864 665500 646152 629943 616631 606047 598045 592191 587798
59376E87798l402k390j246m56m62j045j506j441j088q31n88M9J093J959K130J930
$$ 587798 584396 582006 580760 580304 579842 578797 577291 575850 574762 573931 573343 573392 574485 576444 578574 580504
59360E80504K270L585N300O508O990P267P766Q362Q890R713J1343J3638J5778
$$ 580504 582774 586359 591659 598167 605157 612424 620190 628552 637442 647155 658498 672136 687914
59347F87914J7171J8015J8833J9737K0483K1004K1401K1499K0788J9002J6474
$$ 687914 705085 723100 741933 761670 782153 803157 824558 846057 866845 885847 902321
59336I02321J3770J1123Q310N043J324k515o061r149j1810j3903j5121j5581j6043
$$ 902321 916091 927214 935524 940567 941891 939376 933315 924166 912356 898453 883332 867751 851708
59323H51708j7042j7985j7753j6246j4576j3536j2596j0894q646o885o101n773
$$ 851708 834666 816681 798928 782682 768106 754570 741974 731080 722434 715549 709448 703675
59311G03675n136l910k305p79K28O21P46R95J416J911K586L573M738N851O902
$$ 703675 698539 694629 692324 691545 691773 692394 693140 694135 695551 697462 700048 703621 708359 714210 721112
59296G21112P944Q844R518J0114J0544J0089Q032M550N13l393o826r272j0203
$$ 721112 729056 737900 747418 757532 768076 778165 786197 790747 791260 787867 781041 771769 761566
59283G61566r767q689p390n694l495j067J429M084O682Q629R802J0893J2492J4255
$$ 761566 751799 743110 735720 730026 726531 725464 726893 730977 737659 746288 756090 766983 779475 793730
59269G93730J5422J5784J5649J5241J4604J3874J3144J2141J0463Q080N326K509
$$ 793730 809152 824936 840585 855826 870430 884304 897448 909589 920052 928132 933458 935967
59257I35967k51k961n787q949j2214j4663j5487j4946j4110j3608j3084j2064
$$ 935967 935716 932755 926968 918019 905805 891142 875655 860709 846599 832991 819907 807843
59245H07843j0765r722q953q037o864n728m624l038p43J579K973L247K981K665
$$ 807843 797078 787356 778403 770366 763502 757774 753150 750112 749369 750948 753921 757168 760149 762814
59231G62814K359K093J966J694O76j166l092m464n591p143r098j0775j1741j2103
$$ 762814 765173 767266 769232 770926 771602 770436 767344 762880 757289 750146 741048 730273 718532 706429
59217G06429j2039j1634j1148j0988j1170j1194j0586r388p995o698n407l816
$$ 706429 694390 682756 671608 660620 649450 638256 627670 618282 610287 603589 598182 594366
59205E94366j905l41O7n64j043m50P01J174O14j24j04Q08K104L129L464L248L113
$$ 594366 592461 592120 592187 591623 590580 590130 590831 592005 592619 592495 592391 593199 595303 598432 601896 605144 608257
59188F08257L381L510K897J980J869K902M372N653O746P589P765P290O940P228
$$ 608257 611638 615148 618045 620025 621894 624796 629168 634821 641567 649156 656921 664211 671151 678379
59174F78379P664P523O944O675P048P704Q157Q299Q378Q694R248R727R926J0120
$$ 678379 686043 693566 700510 707185 714233 721937 730094 738393 746771 755465 764713 774440 784366 794486
59160G94486J0549J0723R821P844N749M230K981J394n55k519m405o317q209r824
$$ 794486 805035 815758 825579 833423 839172 843402 846383 847777 847222 844703 840298 833981 825772 815948
59146H15948j0846j0998j0335r467r058r026q794q250p841p635p163o331n667
$$ 815948 805102 794104 783769 774302 765244 756218 747424 739174 731333 723698 716535 710204 704537
59133G04537n235m342k794j559j414j677j179J36J467K549L790N312O737P898
$$ 704537 699302 694960 692166 690607 689193 687516 686337 686473 687940 690489 694279 699591 706328 714226
59119G14226Q993J0080J1035J1869J2645J3247J3682J4302J5217J5868J5759J5246
$$ 714226 723219 733299 744334 756203 768848 782095 795777 810079 825296 841164 856923 872169
59107H72169J4889J4415J3138J1155R210P527N746L912K611J961J375M71n29j498
$$ 872169 887058 901473 914611 925766 934976 942503 948249 952161 954772 956733 958108 958579 958050 956552
59093I56552k712m118n052n075m579m233m324m876n857o869p216o735o257o765
$$ 956552 953840 949722 944670 939595 935016 930783 926459 921583 915726 908857 901641 894906 888649 881884
59079H81884q340j0255j1821j2762j3044j2742j2114j1481j0997j0615j0215r714
$$ 881884 873544 863289 851468 838706 825662 812920 800806 789325 778328 767713 757498 747784
59067G47784r132q571q000p165o005n127n394o814q215q349p159n646m642m134
$$ 747784 738652 730081 722081 714916 708911 703784 698390 691576 683361 675012 667853 662207 657565 653431
59053F53431l742l466l601m128m522m304l587k904k557k384k110j653j012j71
$$ 653431 649689 646223 642622 638494 633972 629668 626081 623177 620620 618236 616126 614473 613461 613290
59039F13290P93J643K242K648K888K817K429K076K145K653L342M053M865N931
$$ 613290 614083 615726 617968 620616 623504 626321 628750 630826 632971 635624 638966 643019 647884 653815
59025F53815P342Q954J0304J0987J1238J1801J2978J4147J4523J4078J3332J2520
$$ 653815 661157 670111 680415 691402 702640 714441 727419 741566 756089 770167 783499 796019
59013G96019J1359R571P172M411J682n57k008k598k303j276j60K93K98J048L107
$$ 796019 807378 816949 824121 828532 830214 829657 827649 825051 822748 821472 821312 821605 821903 822951 826058
58998H26058N406O561O616O526O433N657M302L461L569L619K650J031k96j201
$$ 826058 831464 838025 844641 851167 857600 863257 867559 871020 874589 878208 880858 881889 881593 880392
58984H80392k213l552n008o480p887q738q397o834m712k724j146O5J110K353M102
$$ 880392 878179 874627 869619 863139 855252 846514 838117 831283 826571 823847 822701 822766 823876 826229 830331
58969H30331O247Q234R577J0327J0957J1816J2829J3683J4167J4169J3496J2038
$$ 830331 836578 844812 854389 864716 875673 887489 900318 914001 928168 942337 955833 967871
58957I67871J0111Q275O676M872K427o54m265q375j2525j5628j6994j7210j7321
$$ 967871 977982 986257 992933 997805 1000232 999578 995313 986938 974413 958785 941791 924581 907260
58944I07260j7428j6836j5425j3888j2588j1111r278p687o797o126n037l753k979
$$ 907260 889832 872996 857571 843683 831095 819984 810706 803019 796222 790096 785059 781306 778327
58931G78327k859k940k966l146l665m426n205n733n718n117m384m067m167m129
$$ 778327 775468 772528 769562 766416 762751 758325 753120 747387 741669 736552 732168 728101 723934 719805
58917G19805l557k656j882j346p57J57J249K100K509K784L368M311N278O096O954
$$ 719805 716248 713592 711710 710364 709607 709764 711013 713113 715622 718406 721774 726085 731363 737459 744413
58902G44413Q007R075J0007J1060J2549J4187J5295J5737J6164J7031J7784J7606
$$ 744413 752420 761495 771502 782562 795111 809298 824593 840330 856494 873525 891309 908915
58890I08915J6843J6925J8607K0900K2361K2940K3747K5154K6065K5306K2931
$$ 908915 925758 942683 961290 982190 1004551 1027491 1051238 1076392 1102457 1127763 1150694
58879A150694J9663J5724J0907N442O1m716q819j2319j5353j8305k1506k4668
$$ 1150694 1170357 1186081 1196988 1202430 1202491 1197775 1188956 1176637 1161284 1142979 1121473 1096805
58867A096805k6989k7845k7207k5439k3042k0535j8227j6086j4047j2330j1195
$$ 1096805 1069816 1041971 1014764 989325 966283 945748 927521 911435 897388 885058 873863
58856H73863j0540j0130r982j0143j0213r680q791q418q877r321q716p152n824
$$ 873863 863323 853193 843211 833068 822855 813175 804384 795966 787089 777768 769052 761900 756076
58843G56076n652o214o325n622n164o022p604q191p225o097o245p236p644p073
$$ 756076 750424 744210 737885 732263 727099 721077 713473 705282 698057 691960 685715 678479 670835 663762
58829F63762o279n660m805l516k240j268l55O26J441K047K685L177K960K085J512
$$ 663762 657483 651823 647018 643502 641262 639994 639639 640265 641706 643753 646438 649615 652575 654660 656172
58814F56172J922K871L528L721L713L499K875K004J311R08N46K7n36q84q48m92
$$ 656172 658094 660965 664493 668214 671927 675426 678301 680305 681616 682524 683070 683097 682561 681677 680829 680337
58798F80337j35j06m78j098j845k578l011k948k610k427k455k376j947j094L32
$$ 680337 680202 680096 679618 678520 676675 674097 671086 668138 665528 663101 660646 658270 656323 655229 655561
58783F55561K342M366N554N646N110M415L681L087K962L257L404K975K076R29
$$ 655561 657903 662269 667823 673469 678579 682994 686675 689762 692724 695981 699385 702360 704436 705365
58769G05365m31j852k970l709m471n559o664p197o830n591l768j910n68J38M68
$$ 705365 704934 703082 700112 696403 691932 686373 679709 672512 665682 660091 656323 654413 653845 653983 654451
58754F54451O09N95O84J293K453L728M817N754O526O997P290P697Q149Q359Q576
$$ 654451 655060 655655 656339 657632 660085 663813 668630 674384 680910 687907 695197 702894 711043 719402 727978
58739G27978R433J0834J1756J1583J0947J0761J0962J0843J0182R428Q972Q722
$$ 727978 737411 748245 760001 771584 782531 793292 804254 815097 825279 834707 843679 852401
58727H52401Q270P244N635L946K678J633P8k154m288n488n685n286m604l840l133
$$ 852401 860671 867915 873550 877496 880174 881807 881885 879731 875443 869955 864270 858984 854380 850540 847407
58712H47407k293r72O37J691J675R07j79j620l413n042o143p061q206r278r879
$$ 847407 845114 844142 844779 846470 848145 849052 848873 847253 843840 838798 832655 825594 817388 808110 798231
58697G98231j0397j1563j3333j4933j5787j5838j5179j3977j2633j1397r950p947
$$ 798231 787834 776271 762938 748005 732218 716380 701201 687224 674591 663194 653244 645297
58685F45297n893m777m831n259n293n015m880m915m743m160l353k636k073j485
$$ 645297 639404 634627 629796 624537 619244 614229 609349 604434 599691 595531 592178 589542 587469 585984
58671E85984o63M20J637K905M247N709P256Q685R647R933R870J0104J0720J0877
$$ 585984 585321 585741 587378 590283 594530 600239 607495 616180 625827 635760 645630 655734 666454 677331
58657F77331R712P445N026L029J414J96m85r67j872l123l879l722l217l039l153
$$ 677331 687043 694488 699514 702543 703957 704153 703668 702701 700829 697706 693827 690105 686888 683849 680696
58642F80696l224l203l157l020k865k924l104k932k239j350m21P34J898K282J559
$$ 680696 677472 674269 671112 668092 665227 662303 659199 656267 654028 652678 652257 652991 654889 657171 658730
58627F58730M31l35p43j048j093p93o68j018j094J24K513M906O476P468Q517R794
$$ 658730 659161 658826 658083 657035 655942 655149 654481 653463 652369 652493 655006 659912 666388 673856 682373 692167
58611F92167J0953J1658J1967J2137J2019J1023R001O800N290M112K269j95k131
$$ 692167 703120 714778 726745 738882 750901 761924 770925 777725 783015 787127 789396 789201 787070
58598G87070l027l626m528n226n142m643m347m184l728k833j399O75K909M397
$$ 787070 784043 780417 775889 770663 765521 760878 756531 752347 748619 745786 744387 745062 747971 752368
58584G52368N077O016P826R739J0872J1433J1919J2034J1391J0476R932R541Q813
$$ 752368 757445 763461 771287 781026 791898 803331 815250 827284 838675 849151 859083 868624 877437
58571H77437P984P516P261P071P561R264J1543J3425J5033J7197K0009K2700K4649
$$ 877437 885421 892937 900198 907269 914830 924094 935637 949062 964095 981292 1001301 1024001 1048650
58558A048650K5733K5962K5559K4955K4066K2107J8811J5067J1589P832L222j323
$$ 1048650 1074383 1100345 1125904 1150859 1174925 1197032 1215843 1230910 1242499 1250331 1253553 1252230
58546A252230m454o302q041j0034j1739j3085j4534j5969j6862j7457j8546k0129
$$ 1252230 1247776 1241474 1233433 1223399 1211660 1198575 1184041 1168072 1151210 1133753 1115207 1095078
58534A095078k1401k2100k2757k3522k3712k2639k0198j6752j3109j0347q863
$$ 1095078 1073677 1051577 1028820 1005298 981586 958947 938749 921997 908888 898541 889678
58523H89678p834o367m765l786l176k068m78Q08J532K019K181J664Q94P47J230
$$ 889678 881844 875477 870712 866926 863750 861682 861204 862012 863544 865563 867744 869408 870302 871049 872279
58508H72279J549J453J423J602J651J695K218L005L213K667K052J749J382O64
$$ 872279 873828 875281 876704 878306 879957 881652 883870 886875 890088 892755 894807 896556 897938 898602
58494H98602k15j123k086k805k829k283j734j374r21j53J049K938N433P786R455
$$ 898602 898387 897264 895178 892373 889544 887261 885527 884153 883232 883079 884128 887066 892499 900285 909740
58479I09740J0853J2543J4261J5552J6636J7517J7094J4541J0998Q245O261L620
$$ 909740 920593 933136 947397 962949 979585 997102 1014196 1028737 1039735 1047980 1054241 1057861
58467A057861L0l326n825q000j0041j1257j1321j0664r488p700n787m407l033
$$ 1057861 1057891 1054565 1048740 1040740 1030699 1019442 1008121 997457 987969 980269 974482 970075 967042
58454I67042n27K895N625O808P026O811N987M770L887L194J546j363m341o310
$$ 967042 966515 969410 975035 981843 988869 995680 1001667 1006437 1010324 1013518 1015064 1013701 1009360 1003050
58440A003050p439q270q808q842q252o754m355j979n01O76K778N474P136P341
$$ 1003050 995611 987341 978533 969691 961439 954685 950330 948351 947850 948526 951304 956778 963914 971255
58426I71255P457Q468R817J0784J1451J1865J1678J1126J0920J0714R141N864
$$ 971255 978712 987180 996997 1007781 1019232 1031097 1042775 1053901 1064821 1075535 1084676 1090540
58414A090540K250n05k578m344n473n831o020o403o669o851p456q230q015o431
$$ 1090540 1092790 1092285 1089707 1085363 1079890 1074059 1068039 1061636 1054967 1048116 1040660 1032430 1024415 1017984
58400A017984m474l044k055j349j168j210n42R63K271K700K632K417J838J033
$$ 1017984 1013510 1010466 1008411 1007062 1005894 1004684 1004142 1005105 1007376 1010076 1012708 1015125 1016963 1017996
58386A017996O31N40j14j439k395k349j817j330p68p1O17J602L243M891N664O069
$$ 1017996 1018627 1019167 1019053 1017614 1015219 1012870 1011053 1009723 1008955 1008884 1009501 1011103 1014346 1019237 1024901 1030970
58370A030970P248Q804R327Q974R370J0773J1696J1706J2206J3763J5031J5160
$$ 1030970 1038218 1047022 1056349 1065323 1074693 1085466 1097162 1108868 1121074 1134837 1149868 1165028
58358A165028J5122J5657J5894J5084J3812J2559J0876Q789P215O160M497K287
$$ 1165028 1180150 1195807 1211701 1226785 1240597 1253156 1264032 1272821 1280036 1286196 1290693 1292980
58346A292980J278K128L318L775M477O289Q313R640J0851J2485J3841J4502J5261
$$ 1292980 1294258 1296386 1299704 1303479 1307956 1314245 1322558 1332198 1343049 1355534 1369375 1383877 1399138
58333A399138J6445J7135J7038J7160J7683J7301J5687J4416J4198J3486J1233
$$ 1399138 1415583 1432718 1449756 1466916 1484599 1501900 1517587 1532003 1546201 1559687 1570920
58322A570920Q765P479O798N889N298N379N199M494M622O132P557Q009Q707J0389
$$ 1570920 1579685 1587164 1593962 1599851 1605149 1610528 1615727 1620221 1624843 1630975 1638532 1646541 1655248 1665637
58308A665637J1712J1907J2586J4960J7559J8774J9371K0515K1434K1196K0736
$$ 1665637 1677349 1689256 1701842 1716802 1734361 1753135 1772506 1793021 1814455 1835651 1856387
58297A856387K1064K1401K1051K1083K2245K3342K3531K4057K5790K7310K7504
$$ 1856387 1877451 1898852 1919903 1940986 1963231 1986573 2010104 2034161 2059951 2087261 2114765
58286B114765K7718K9287L1140L2048L2875L4479L5742L5858L6265L8062L9930
$$ 2114765 2142483 2171770 2202910 2234958 2267833 2302312 2338054 2373912 2410177 2448239 2488169
58275B488169M0767M1833M4073M6058M6910M8438N1851N5165N6556N7522N9972
$$ 2488169 2528936 2570769 2614842 2660900 2707810 2756248 2808099 2863264 2919820 2977342 3037314
58264C037314O3015O5375O8093P1941P5091P6362P7845Q1245Q4554Q5440Q4965
$$ 3037314 3100329 3165704 3233797 3305738 3380829 3457191 3535036 3616281 3700835 3786275 3871240
58253C871240Q4997Q5012Q4584Q5588Q8795R1818R3616R7142J04161J11684J17311
$$ 3871240 3956237 4041249 4125833 4211421 4300216 4392034 4485650 4582792 4686953 4798637 4915948
58242D915948J23542J32570J41523J47772J54346J64700J76586J86623J96628
$$ 4915948 5039490 5172060 5313583 5461355 5615701 5780401 5956987 6143610 6340238
58233F340238K09469K23054K34688K47230K64395K83930L02033L20609L43395
$$ 6340238 6549707 6772761 7007449 7254679 7519074 7803004 8105037 8425646 8769041
58224H769041L68962L94519M22621M56949M95618N35875N81002O35022O95527
$$ 8769041 9138003 9532522 9955143 10412092 10907710 11443585 12024587 12659609 13355136
58215A3355136P59779Q32747R20465J021058J131747J259275J413427J596465
$$ 13355136 14114915 14947662 15868127 16889185 18020932 19280207 20693634 22290099
58207B2290099J809939K065833K379492K758774L213087L764307M431182N208816
$$ 22290099 24100038 26165871 28545363 31304137 34517224 38281531 42712713 47921529
58199D7921529O081941P055266Q155767R414948J0872584J2587848J4601734J6856646
$$ 47921529 54003470 61058736 69214503 78629451 89502035 102089883 116691617 133548263
58191A33548263J9155168K1217023K2812128K3889882K4589767K5042650K5050720
$$ 133548263 152703431 173920454 196732582 220622464 245212231 270254881 295305601
58184B95305601K3953181K0911266J5437419P728390j395581j0741883j8979215
$$ 295305601 319258782 340170048 355607467 363335857 361940276 351198393 332219178
58177C32219178k4925911k7959647k8290469k6782298k4430990k1945252j9672972
$$ 332219178 307293267 279333620 251043151 224260853 199829863 177884611 158211639
58170A58211639j7714457j6011704j4420696j2828547j1238918r734879q384258
$$ 158211639 140497182 124485478 110064782 97236235 85997317 76262438 67878180
58163F7878180p207500o206055n373908m684853m102133l604182l183455k826112
$$ 67878180 60670680 54464625 49090717 44405864 40303731 36699549 33516094 30689982
58155C0689982k513097k237332k001261j799814j621450j462948j328157j214125
$$ 30689982 28176885 25939553 23938292 22138478 20517028 19054080 17725923 16511798
58147A6511798j111909j019095r39053q69442q02980p38276o79452o26416n75195
$$ 16511798 15399889 14380794 13441741 12572299 11769319 11031043 10351591 9725175 9149980
58138I149980n26448m84301m47933m12885l79389l51369l28561l07341k87910
$$ 9149980 8623532 8139231 7691298 7278413 6899024 6547655 6219094 5911753 5623843
58129E623843k73052k61136k47600k32238k18222k05394j91290j77334j67083
$$ 5623843 5350791 5089655 4842055 4609817 4391595 4186201 3994911 3817577 3650494
58120C650494j59461j50324j39723j31158j24649j17004j08176j01084r5702q9325
$$ 3650494 3491033 3340709 3200986 3069828 2945179 2828175 2719999 2618915 2523213 2433888
58110B433888q2316p7711p5352p2004o7139o3287o0846n7654n3640n0957m9604
$$ 2433888 2351572 2273861 2198509 2126505 2059366 1996079 1935233 1877579 1823939 1772982 1723378
58099A723378m7538m4957m3784m3355m1198l7830l6032l5574l3531k9722k7021
$$ 1723378 1675840 1630883 1587099 1543744 1502546 1464716 1428684 1393110 1359579 1329857 1302836
58088A302836k6069k4405k1333j9135j8674j8056j6491j5604j6019j6245j5830
$$ 1302836 1276767 1252362 1231029 1211894 1193220 1175164 1158673 1143069 1127050 1110805 1094975
58077A094975j6212j7708j8794j9044j9735k0964k1158j9956j8831j8476j8159
$$ 1094975 1078763 1061055 1042261 1023217 1003482 982518 961360 941404 922573 904097 885938
58066H85938j7761j7768j7336j5154j2217j0802j0874j0456r316r074r697r389
$$ 885938 868177 850409 833073 817919 805702 794900 784026 773570 764254 755180 745483 736094
58054G36094q210q344j0220j1617j1356j0775j0732j0161q559p175o690o200n388
$$ 736094 727884 719540 709320 697703 686347 675572 664840 654679 646120 638945 632255 626055 620667
58041F20667n326o201o558n739m964n129n498n371n214n421n644n774o088o194
$$ 620667 615341 609140 602582 596843 591879 586750 581252 575881 570667 565246 559602 553828 547740 541546
58027E41546n493m722n174o435o936o633o910p771p629o146m927m837m831m065
$$ 541546 536053 531331 526157 519722 512786 506153 499243 491472 483843 477697 472770 467933 463102 459037
58013D59037l118k548k118j912k403l001k428q49K14L40O17J397J690J206J018
$$ 459037 455919 453371 451253 449341 446938 443937 441509 440660 440874 441214 441831 443228 444918 446124 447142
57998D47142J640K293K507K685K856K579K323L051M302M644M106M060M574M229
$$ 447142 448782 451075 453582 456267 459123 461702 464025 467076 471378 476022 480128 484188 488762 492991
57984D92991K862J988K017J484j53j366j191q07j361k246k616k799l145l144k726
$$ 492991 495853 497841 499858 501342 501189 499823 498632 497825 496464 494218 491602 488803 485658 482514 479788
57969D79788k827l732m438m441m537n036m917l687k458k196k438k581k870l226
$$ 479788 476961 473229 468791 464350 459813 454777 449860 446173 443715 441519 439081 436500 433630 430404
57955D30404k730j307m11r97k244l074l501l620k898j442m54l81r2J089K184K514
$$ 430404 427674 426367 425956 424959 422715 419641 416140 412520 409622 408180 407726 407345 407253 408342 410526 413040
57939D13040L156N041P074P802P714Q218R286R810R613R480R621R472Q788P782
$$ 413040 416196 421237 428311 436113 443827 452045 461331 471141 480754 490234 499855 509327 518115 525897
57925E25897O395M393K060L9j485k916m692o905r186j0851j1500j1550j1593j1482
$$ 525897 532292 536685 538745 538784 537299 534383 529691 522786 513600 502749 491249 479699 468106 456624
57911D56624j0719r611q940q583p654o070m779m228l904l601l838m627n174n230
$$ 456624 445905 436294 427354 418771 411117 405047 400268 396040 392136 388535 384697 380070 374896 369666
57897C69666n462o009n986m979l800l180k794k227j714j352o29O26J815K529K982
$$ 369666 364204 358195 352209 347230 343430 340250 337456 335229 333515 332163 331534 332160 333975 336504 339486
57882C39486L227L004K622K717K899K120O30oO22R92O6j189j573j427j528j612
$$ 339486 342713 345717 348339 351056 353955 356075 356705 356699 357321 358313 358379 357190 355617 354190 352662 351050
57866C51050j127l29M18J366K539L237L218L273L825M210M095M363N513O561O557
$$ 351050 349923 349594 350012 351378 353917 357154 360372 363645 367470 371680 375775 380138 385651 392212 398769
57851C98769O083O140O585O770O711O552N897M683L700L215K207Q2k017k840k899
$$ 398769 404852 410992 417577 424347 431058 437610 443507 448190 451890 455105 457312 457394 455377 452537 449638
57836D49638l428m381m863m812m880n154n200m873m194k993j534p93j155j596
$$ 449638 446210 441829 436966 432154 427274 422120 416920 412047 407853 404860 403326 402533 401378 399782
57822C99782j032K64J449K416L324L734L407L092L396L600K773J431Q35J133J323
$$ 399782 398750 399014 400463 402879 406203 409937 413344 416436 419832 423432 426205 427636 428471 429604 430927
57807D30927P29n03k039l618n011o234p354p827o889n003l797l958m402m227m070
$$ 430927 431656 431153 429114 425496 420485 414251 406897 399070 392181 387178 383381 379423 375021 370794 366724
57792C66724m567m929m335l503l425l636l157k148j232k34J021J723J421J220
$$ 366724 362157 357228 352893 349390 345965 342329 339172 337024 335792 335558 336579 338302 339723 340943
57778C40943K077K964K640K041K819M332M555L449L001L936M748M175K680J110
$$ 340943 343020 345984 348624 350665 353484 357816 362371 365820 368821 372757 377505 381680 384360 385470
57764C85470l18j335j555j521k385m126n490n887n993o199n923m927l968l587
$$ 385470 385152 383817 382262 380741 378356 374230 368740 362853 356860 350661 344738 339811 335843 332256
57750C32256l306k534j389k16P87J284R47J44m01o44j017j235m69J074J945J346
$$ 332256 328950 326416 325027 324811 325598 326882 327829 327973 327572 326928 325911 324676 324207 325281 327226 328572
57734C28572J69l35j14K9k91p18p12o8R55J920K687L431M027L953L223K756L121
$$ 328572 328741 328406 328292 328321 328030 327312 326600 326532 327487 329407 332094 335525 339552 343505 346728 349484 352605
57717C52605L512K921J764J200J263R59L1o71o30l05j05J55N36O13J41n68j060
$$ 352605 356117 359038 360802 362002 363265 364224 364255 363584 362954 362649 362544 362699 363235 363848 363989 363421 362361
57700C62361j089n35L96J079J185J122J245J079K55l85J66J324J627J009R38K167
$$ 362361 361272 360737 361133 362212 363397 364519 365764 366843 367098 366713 366879 368203 369830 370839 371777 373944
57684C73944L753M694N267O275P912R913J2147J4622J7437K0942K5470L0959L7212
$$ 373944 377697 382391 387658 393933 401845 411758 423905 438527 455964 476906 502376 533335 570547
57671E70547M4175N1290N7029O0182O1376O2253O3312O3431O1034N4428M1461
$$ 570547 614722 666012 723041 783223 844599 906852 970164 1033595 1094629 1149057 1190518
57660A190518K0866n353l2182n4661p0114p7716p7805p2222o3923n5197m6744
$$ 1190518 1211384 1206031 1173849 1119188 1049074 971358 893553 821331 757408 702211 655467
57649F55467l8722l1676k5982k1406j7693j4866j2635j0379q047o250n174m281
$$ 655467 616745 585069 559087 537681 519988 505122 492487 482108 474061 467811 462637 458356
57637D58356l321k745k727k755k484k162j823j089r6K78l47j240j641j629j477
$$ 458356 455035 452290 449563 446808 444324 442162 440339 439250 439154 439432 439085 437845 436204 434575 433098
57622D33098j034k26N18Q26P32K28p82j793j906j069k75j52k06R9M37L67J28J16
$$ 433098 432064 431838 432356 433182 433914 434142 433360 431567 429661 428592 428317 428165 427959 428058 428495 428862 428990 429106
57604D29106K25K47L82Q03J304J660J849J703J024K09n0J51L0n39q01n34n58j347
$$ 429106 429331 429578 429960 430763 432067 433727 435576 437279 438303 438512 438462 438613 438643 438104 437303 436769 436211 434864
57586D34864k243k643k923l463l673k871j391j26N15N47O2m97l98M24J066Q71
$$ 434864 432621 429978 427055 423592 419919 417048 415657 415531 416046 416593 416655 416158 415760 416184 417250 418121
57570D18121L01J18L85Q06J280J552J088l8q20n27M13J271K024K825L225K766
$$ 418121 418422 418540 418925 419731 421011 422563 423651 423613 422793 422266 422679 423950 425974 428799 432024 434790
57554D34790J793J066R24J342K199L040L224K823K692L173L540L254K910L212
$$ 434790 436583 437649 438573 439915 442114 445154 448378 451201 453893 457066 460606 463860 466770 469982
57540D69982L859M181M145M002L698L361L543M153M062K686J118O87J142J415
$$ 469982 473841 478022 482167 486169 489867 493228 496771 500924 504986 507672 508790 509477 510619 512034
57526E12034J345J439J591J368J189J782K826L327L192L223L681M020M021M072
$$ 512034 513379 514818 516409 517777 518966 520748 523574 526901 530093 533316 536997 541017 545038 549110
57512E49110M266M255M103M354N091N739N856N481M650L360K105J631K032K603
$$ 549110 553376 557631 561734 566088 571179 576918 582774 588255 592905 596265 598370 600001 602033 604636
57498F04636K719K444K256K509L102L369K665J361P66J506K558K584J714J120
$$ 604636 607355 609799 612055 614564 617666 621035 623700 625061 625827 627333 629891 632475 634189 635309
57484F35309J218J406J303J208J356J595J882K341K808L024L158L501L781L583
$$ 635309 636527 637933 639236 640444 641800 643395 645277 647618 650426 653450 656608 660109 663890 667473
57470F67473L231L413M032M339M117L886L887L779L437L252L445L850M427N263
$$ 667473 670704 674117 678149 682488 686605 690491 694378 698157 701594 704846 708291 712141 716568 721831
57456G21831N948N843N109M738N268O087O332N814M876L910L242L079L312L738
$$ 721831 727779 733622 738731 743469 748737 754824 761156 766970 771846 775756 778998 782077 785389 789127
57442G89127M401N296N938N911N707O146P011P177O265N182M717M549M151L848
$$ 789127 793528 798824 804762 810673 816380 822526 829537 836714 842979 848161 852878 857427 861578 865426
57428H65426M210N018N535N542N521N922O682P342P400O705N696N064N087N442
$$ 865426 869636 874654 880189 885731 891252 897174 903856 911198 918598 925303 930999 936063 941150 946592
57414I46592N745N916N993N969N967O226O708O981O734O203N961O385P319Q111
$$ 946592 952337 958253 964246 970215 976182 982408 989116 996097 1002831 1009034 1014995 1021380 1028699 1036810
57400A036810Q117P379O731O918P757Q420Q418P911P335P133P633Q586R126Q725
$$ 1036810 1044927 1052306 1059037 1065955 1073712 1082132 1090550 1098461 1105796 1112929 1120562 1129148 1138274 1146999
57386A146999Q061Q148Q881R257Q983Q832R289R838R929R757R638R367Q775Q296
$$ 1146999 1155060 1163208 1172089 1181346 1190329 1199161 1208450 1218288 1228217 1237974 1247612 1256979 1265754 1274050
57372A274050Q359Q700Q755Q425Q026P852Q054Q591R003Q761Q092P948Q778R866
$$ 1274050 1282409 1291109 1299864 1308289 1316315 1324167 1332221 1340812 1349815 1358576 1366668 1374616 1383394 1393260
57358A393260J0325J0196J0084J0206J0407J0650J0879J0738J0046R346R296R799
$$ 1393260 1403585 1413781 1423865 1434071 1444478 1455128 1466007 1476745 1486791 1496137 1505433 1515232
57346A515232J0208J0295J0354J0522J0602J0495J0320J0158J0089J0380J1065
$$ 1515232 1525440 1535735 1546089 1556611 1567213 1577708 1588028 1598186 1608275 1618655 1629720
57335A629720J1547J1193J0371J0189J1126J2403J2988J2641J1843J1154J0931
$$ 1629720 1641267 1652460 1662831 1673020 1684146 1696549 1709537 1722178 1734021 1745175 1756106
57324A756106J1255J1799J2036J1882J1815J2143J2475J2288J1715J1365J1493
$$ 1756106 1767361 1779160 1791196 1803078 1814893 1827036 1839511 1851799 1863514 1874879 1886372
57313A886372J1809J2024J2135J2194J2140J2044J2210J2801J3539J3962J3959
$$ 1886372 1898181 1910205 1922340 1934534 1946674 1958718 1970928 1983729 1997268 2011230 2025189
57302B025189J3902J4225J4878J5241J4806J3870J3352J3741J4590J5289J5942
$$ 2025189 2039091 2053316 2068194 2083435 2098241 2112111 2125463 2139204 2153794 2169083 2185025
57291B185025J6929J7862J7842J6865J6086J6295J6880J6884J6407J6246J6601
$$ 2185025 2201954 2219816 2237658 2254523 2270609 2286904 2303784 2320668 2337075 2353321 2369922
57280B369922J7005J7258J7537J7736J7523J7121J7158J7682J8004J7734J7264
$$ 2369922 2386927 2404185 2421722 2439458 2456981 2474102 2491260 2508942 2526946 2544680 2561944
57269B561944J7060J7190J7694J8659J9670K0039J9923K0368K1755K3093K3468
$$ 2561944 2579004 2596194 2613888 2632547 2652217 2672256 2692179 2712547 2734302 2757395 2780863
57258B780863K3379K3831K4738K5286K5362K5657K6535K7772K9240L0897L2143
$$ 2780863 2804242 2828073 2852811 2878097 2903459 2929116 2955651 2983423 3012663 3043560 3075703
57247C075703L2177L1115L0003K9459K9037K8147K6909K5698K4418K2768K0894
$$ 3075703 3107880 3138995 3168998 3198457 3227494 3255641 3282550 3308248 3332666 3355434 3376328
57236C376328J9334J8373J7778J7120J6226J5291J4627J4335J4318J4590J5316
$$ 3376328 3395662 3414035 3431813 3448933 3465159 3480450 3495077 3509412 3523730 3538320 3553636
57225C553636J6474J7643J8385J8579J8267J7524J6655J6212J6332J6429J5964
$$ 3553636 3570110 3587753 3606138 3624717 3642984 3660508 3677163 3693375 3709707 3726136 3742100
57214C742100J5250J5031J5451J6031J6490J6982J7533J7822J7689J7409J7352
$$ 3742100 3757350 3772381 3787832 3803863 3820353 3837335 3854868 3872690 3890379 3907788 3925140
57203C925140J7624J8071J8333J7966J6870J5611J4969J5160J5749J6278J6634
$$ 3925140 3942764 3960835 3979168 3997134 4014004 4029615 4044584 4059744 4075493 4091771 4108405
57192D108405J6948J7430J8261J9348K0261K0697K0856K1074K1249K1031K0377
$$ 4108405 4125353 4142783 4161044 4180392 4200653 4221350 4242206 4263280 4284529 4305560 4325937
57181D325937J9524J8576J7633J7058J7106J7339J6977J5804J4298J2989J2109
$$ 4325937 4345461 4364037 4381670 4398728 4415834 4433173 4450150 4465954 4480252 4493241 4505350
57170D505350J1701J1506J0888R473P784O618N922N014L873L326L745M351M193
$$ 4505350 4517051 4528557 4539445 4548918 4556702 4563320 4569242 4574256 4578129 4581455 4585200 4589551 4593744
57157D593744L198J912O81m92j695l101m943p244r733j2121j4206j5752j6715
$$ 4593744 4596942 4598854 4599535 4599043 4597348 4594247 4589304 4582060 4572327 4560206 4546000 4530248 4513533
57144D513533j7617j9190k1515k3999k6300k8661l1084l2803l3103l2195l0800
$$ 4513533 4495916 4476726 4455211 4431212 4404912 4376251 4345167 4312364 4279261 4247066 4216266
57133D216266k9218k7282k5047k2955k1382k0452k0232k0740k1720k2743k3612
$$ 4216266 4187048 4159766 4134719 4111764 4090382 4069930 4049698 4028958 4007238 3984495 3960883
57122C960883k4377k4929k4790k3443k0770j7048j2760q515m895j963J118N502
$$ 3960883 3936506 3911577 3886787 3863344 3842574 3825526 3812766 3804251 3799356 3797393 3798511 3804013
57110C804013J1592J8866K6967L6604M9049O5091Q4964J08986J37656J71290K10027
$$ 3804013 3815605 3834471 3861438 3898042 3947091 4012182 4097146 4206132 4343788 4515078 4725105
57099D725105K54106L03624L58042M16183M76553N37710N99068O61381P25060
$$ 4725105 4979211 5282835 5640877 6057060 6533613 7071323 7670391 8331772 9056832
57090I056832P87350Q42766Q86450R13920R17233Q90304Q48447Q38809R13295
$$ 9056832 9844182 10686948 11573398 12487318 13404551 14294855 15143302 15982111 16895406
57081A6895406J076761J263652J374226J337400J142490Q24955M38017L6634l31436
$$ 16895406 17972167 19235819 20610045 21947445 23089935 23914890 24352907 24389541 24058105
57072B4058105o37106q75268j054803j183732j265018j301676j299405j264289
$$ 24058105 23420999 22545731 21490928 20307196 19042178 17740502 16441097 15176808
57064A5176808j201853j118923j023728r23663q24250p29907o43881n67555n01083
$$ 15176808 13974955 12856032 11832304 10908641 10084391 9354484 8710603 8143048 7641965
57055G641965m44360l96555l55609l19701k88645k62707k40906k21823k05254
$$ 7641965 7197605 6801050 6445441 6125740 5837095 5574388 5333482 5111659 4906405
57046D906405j91525j79903j69202j59404j51253j44672j38935j33842j29362
$$ 4906405 4714880 4534977 4365775 4206371 4055118 3910446 3771511 3637669 3508307
57037C508307j24696j19103j13133j07619j02002r5255q7913q1403p5694o9412
$$ 3508307 3383611 3264508 3151375 3043756 2941754 2846499 2758586 2677183 2601489 2532077
57027B532077o2280n5605n0198m5386m0336l4919k9076k3143j9441k2038l3784
$$ 2532077 2469797 2414192 2363994 2318608 2278272 2243353 2214277 2191134 2171693 2149655 2115871
57016B115871n3948p8808j03439j22957j33846j35524j30270j21059j09848r7859
$$ 2115871 2061923 1983115 1879676 1756719 1622873 1487349 1357079 1236020 1126172 1028313
57006A028313q6301p5972o6793n8413n0878m4359l8753l3964l0058k6802k3567
$$ 1028313 942012 866040 799247 740834 689956 645597 606844 572880 542822 516020 492453
56995D92453k0143j7200j5460j4739j4157j3015j1164q732n990l343j217J54Q43
$$ 492453 472310 455110 439650 424911 410754 397739 386575 377843 371853 368510 367293 367447 368290
56982C68290J167J445J594J084n36l100o041q890j1311j2860j3164j2316j0849
$$ 368290 369457 370902 372496 373580 373044 369944 363903 355013 343702 330842 317678 305362 294513
56969B94513r257p702o048m018j580P37K305L297M658O828R083J0600J1529J2367
$$ 294513 285256 277554 271506 267488 265908 266645 268950 272247 276905 283733 292816 303416 314945 327312
56955C27312J2830J2179J0315P643M100p07o393j1595j5006j6153j5327j3363
$$ 327312 340142 352321 362636 370279 374379 373672 367279 355684 340678 324525 309198 295835
56943B95835j1391r918q268n521j920J415M029O554R421J2141J4111J5479J6715
$$ 295835 284444 274526 266258 260737 258817 260232 264261 270815 280236 292377 306488 321967 338682
56930C38682J7736J7799J6075J2230O716N32n495j1124j6200k0077k2021k1997
$$ 338682 356418 374217 390292 402522 409238 409770 404275 393151 376951 356874 334853 312856
56918C12856k0579j8304j5620j3207j1665j0813r963q837p777p054o456n569m161
$$ 312856 292277 273973 258353 245146 233481 222668 212705 203868 196091 189037 182581 177012 172851
56905A72851k396r58o47j398k064j672n26M78J164J911K701L264L932N334P331
$$ 172851 170455 169497 168850 167452 165388 163716 163190 163668 164832 166743 169444 172708 176640 181974 189305
56890A89305R126J0369J1369J2263J2845J3178J3456J3292J1974R435O193K406
$$ 189305 198431 208800 220169 232432 245277 258455 271911 285203 297177 306612 312805 315211
56878C15211k022o422r442j0384r643p769m986j748J214L757O429R536J2815J6154
$$ 315211 313189 306767 297325 286941 277298 269529 264543 262795 264009 267766 274195 283731 296546 312700
56864C12700J9722K3245K6013K7901K9537L1171L2173L1842K9785K5356J7742
$$ 312700 332422 355667 381680 409581 439118 470289 502462 534304 564089 589445 607187
56853F07187P283m112j4258k1842k6153k6782k4137j9489j3934p845j644L914
$$ 607187 614470 610358 596100 574258 548105 521323 497186 477697 463763 455918 454274 458188
56841D58188Q718J3712J9610K5857L1461L6224M0559M4660M8448N1665N3202N0926
$$ 458188 466906 480618 500228 526085 557546 593770 634329 678989 727437 779102 832304 883230
56829H83230M3037K9486J1756q122k7668m3767n3762n7015n5034m9940m3171l5400
$$ 883230 926267 955753 967509 959387 931719 887952 834190 777175 722141 672201 629030 593630
56817E93630k7088j8824j1218m559J435P311J3305J9110K4149K7907L0148L1125
$$ 593630 566542 547718 536500 531941 533376 540687 553992 573102 597251 625158 655306 686431
56805F86431L1267L0236K6530J8683O821p391k1930l4828m3987m7990m7376m4111
$$ 686431 717698 747934 774464 793147 799968 792577 770647 735819 691832 643842 596466 552355
56793E52355l9581l3994k7728k1883j7025j2457p453k337K191N949Q914J0869
$$ 552355 512774 478780 451052 429169 412144 399687 392234 389897 392088 398037 406951 417820
56781D17820J2009J3132J4456J4899J3122Q772K310n529j3569k0298k4967k7979
$$ 417820 429829 442961 457417 472316 485438 494210 496520 490991 477422 457124 432157 404178
56769D04178k9686k9617k7505k4276k1177j8576j6305j4407j2813j1017q970p574
$$ 404178 374492 344875 317370 293094 271917 253341 237036 222629 209816 198799 189829 182255
56757A82255p362p382o455m890l886l706l650l433l352l333k972k419k207k197
$$ 182255 174893 167511 161056 156166 152280 148574 144924 141491 138139 134806 131834 129415 127208 125011
56743A25011j738q40k61k90m09k95l30q40j518j834j582q85j08K12j55p39q74
$$ 125011 123273 122433 122172 121882 121473 121178 120848 120008 118490 116656 115074 114189 114081 114293 114138 113399 112525
56726A12525n46k43j12J45O01R47J047J089J150J110J112J495K209K663K435J718
$$ 112525 111979 111736 111624 111769 112370 113317 114364 115453 116603 117713 118825 120320 122529 125192 127627 129345
56710A29345J054Q32J137J727K098J818R52J8m50k76L13Q15Q07L06k51m75l29
$$ 129345 130399 131231 132368 134095 136193 138011 138963 138981 138531 138255 138568 139383 140190 140496 140245 139770 139441
56693A39441N8N14P44M94o0m14m00l63n34p12p19o90o57l94O4L29L65O30J214
$$ 139441 139499 140013 140757 141251 141191 140777 140377 140014 139480 138768 138049 137359 136702 136308 136372 136701 137066 137696 138910
56674A38910J442Q77O1l23l76n09o87q14j230j992k226j141O37J685J453O19r
$$ 138910 140352 141229 141290 140967 140591 140082 139395 138581 137351 135359 133133 131992 132629 134314 135767 136386 136377
56657A36377r0M54J374J946J683J111J095J565J711J330J007R85P33n7q51j024
$$ 136377 136287 136741 138115 140061 141744 142855 143950 145515 147226 148556 149563 150548 151281 151224 150373 149349
56641A49349o01J3N32P52M45k55o91l03O97J545J770J639J644J767J554R78P49
$$ 149349 148748 148761 149293 150045 150490 150235 149544 149241 149938 151483 153253 154892 156536 158303 159857 160835 161584
56624A61584J364K219K315J676J237J371J437R89N17N11O89O35M85M13J43l67
$$ 161584 162948 165167 167482 169158 170395 171766 173203 174192 174709 175220 175909 176544 177029 177442 177585 177218
56608A77218n27RO44O96L33J3l30q47j145q92m51j97J79Q28R91M0j257j624j047
$$ 177218 176691 176700 177344 178040 178373 178386 178056 177209 176064 175172 174721 174524 174703 175531 176522 176562 175305 173681 172634
56589A72634o21q84j309j276p30N3O49O29Q5l22k70j96l21o4Q22J391P75l62o98
$$ 172634 172013 171129 169820 168544 167814 167867 168516 169145 169230 168908 168638 168442 168121 168057 168879 170270 171045 170683 169985
56570A69985pJ006J942K722K997K766K933M103N450N932N926O286O640O214N642
$$ 169985 169978 170984 172926 175648 178645 181411 184344 188447 193897 199829 205755 212041 218681 224895 230537
56555B30537O049O830O321M435K668J635N72o70j169q19o98j163j306q56q23j667
$$ 230537 236586 243416 249737 254172 256840 258475 259047 258377 257208 256389 255691 254528 253222 252366 251543 249876
56539B49876k439k433k147k016j736j433k036l559m536l995k788k087j847j568
$$ 249876 247437 245004 242857 240841 239105 237672 235636 232077 227541 223546 220758 218671 216824 215256
56525B15256j416j589j668j478j615k265k569j958j165j063j374j400j140q72
$$ 215256 213840 212251 210583 209105 207490 205225 202656 200698 199533 198470 197096 195696 194556 193684
56511A93684m81M5J97k05n19l28j42l87n68k11K08N6n10j036j424j554j106m02
$$ 193684 193203 193248 193445 193240 192721 192393 192251 191864 191296 191085 191293 191349 190839 189803 188379 186825 185719 185317
56493A85317m32j342j924j385n91n75q55m25M90Q80N76K53K65M56O88P52K33o88
$$ 185317 184885 183543 181619 180234 179643 179068 178213 177788 178278 179158 179734 179987 180252 180708 181396 182148 182381 181693
56475A81693r42J2J087R28j92q28l75M35P53M28k00o31m48J68M83K48J11N46J037
$$ 181693 180751 180763 181850 182778 182586 181758 181383 181818 182571 182999 182799 182168 181720 181888 182371 182619 182730 183276 184313
56456A84313J010P91Q55Q38L09j82R5P54Q29K38l97q94j387j394k95J428K472
$$ 184313 185323 186114 186969 187807 188116 187934 188029 188783 189612 189850 189453 188559 187172 185778 185483 186911 189383
56439A89383K287J434N28k23n85l94j31m46j049r65mQ85Q94K80k12j98J55L98
$$ 189383 191670 193104 193632 193409 192824 192430 192299 191853 190804 189839 189835 190720 191614 191894 191682 191484 191639 192037
56421A92037J31m44m74N41J833K167J463Q45J033J445J270P05O99J695L014L542
$$ 192037 192168 191724 191250 191791 193624 195791 197254 198099 199132 200577 201847 202552 203251 204946 207960 211502
56405B11502K873J740J143J151R71K47k81J70J183J650J187M08j00m25q29j197
$$ 211502 214375 216115 217258 218409 219380 219627 219346 219516 220699 222349 223536 223944 223844 223419 222590 221393
56389B21393j224q82m81k92k31Q7Q57J761K244K093J465N50l64o80O3J454K517
$$ 221393 220169 219287 218806 218514 218283 218370 219227 220988 223232 225325 226790 227340 226976 226296 226359 227813 230330
56372B30330K778K530K054J343O78N80R39J022O92P17J445K051J713P54k1m53
$$ 230330 233108 235638 237692 239035 239713 240293 241232 242254 242946 243663 245108 247159 248872 249626 249605 249152
56356B49152p86r16n83O6O72J059J065N31j98m03n4J5n42r06l29O62J116R22N55
$$ 249152 248366 247450 246867 246933 247605 248664 249729 250260 250062 249659 249605 249620 249078 248172 247843 248505 249621 250543 251098
56337B51098K02n4J64R36J599J693J752K394L148L151K493K050K267K904L626
$$ 251098 251300 251246 251410 252346 253945 255638 257390 259784 262932 266083 268576 270626 272893 275797 279423
56322B79423M154M152L572K817K069J052j04n23J86J067J061M12L1Q6K10M84J178
$$ 279423 283577 287729 291301 294118 296187 297239 297135 296612 296798 297865 298926 299338 299369 299455 299665 300149 301327
56305C01327J891J981J583J328J401J646K210L227M177M396M003L595L306K861
$$ 301327 303218 305199 306782 308110 309511 311157 313367 316594 320771 325167 329170 332765 336071 338932
56291C38932K275J830J648J757K239K864L076K826K753L143L443L355L463M153
$$ 338932 341207 343037 344685 346442 348681 351545 354621 357447 360200 363343 366786 370141 373604 377757
56277C77757M871N190N641O573P292P241P143P797Q746R278R727J0544J1096J0859
$$ 377757 382628 387818 393459 400032 407324 414565 421708 429505 438251 447529 457256 467800 478896 489755
56263D89755J0930J2662J5480J7690J8982K0478K2717K5140K7448L0074L3309
$$ 489755 500685 513347 528827 546517 565499 585977 608694 633834 661282 691356 724665
56252G24665L7102M1471M6222N0647N4479N8543O3427O8291P2118P5277P8430
$$ 724665 761767 803238 849460 900107 954586 1013129 1076556 1144847 1216965 1292242 1370672
56241A370672Q0860Q1504Q0788P9670P7519P2932O6098N8329M9585L8629K5553
$$ 1370672 1451532 1533036 1613824 1693494 1771013 1843945 1910043 1968372 2017957 2056586 2082139
56230B082139J2141m51j2580k4535l5708m5561n3941o0353o4370o6722o8537o9675
$$ 2082139 2094280 2093829 2081249 2056714 2021006 1975445 1921504 1861151 1796781 1730059 1661522 1591847
56218A591847o9262o7676o6150o4644o1911n7903n4114n1276m8468m4952m1342
$$ 1591847 1522585 1454909 1388759 1324115 1262204 1204301 1150187 1098911 1050443 1005491 964149
56207I64149l8358l5864l3532l1351k9124k6555k3939k1738j9647j7235j5186
$$ 964149 925791 889927 856395 825044 795920 769365 745426 723688 704041 686806 671620
56196F71620j4390j4109j2770j0422q633p982p471o600o115o316o268n229l548
$$ 671620 657230 643121 630351 619929 611296 603314 595843 589243 583128 576812 570544 565315 561767
56183E61767j851n55k04r80j861j673q26o42j165j270o80j22L39J320K513K931
$$ 561767 559916 559361 559157 558177 556316 554643 553817 553175 552010 550740 550060 549938 550277 551597 554110 557041
56167E57041K670K663K893K713K657L794N547O389O542P566R369J0304J0270J0887
$$ 557041 559711 562374 565267 567980 570637 574431 579978 586367 592909 600475 609844 620148 630418 641305
56153F41305J2355J3024J2690J3422J6151J9221K1363K3561K6782L0393L4077
$$ 641305 653660 666684 679374 692796 708947 728168 749531 773092 799874 830267 864344
56142H64344L8952M5426N2113N8209O4824P2651Q0342Q6669R2342R8311J03896
$$ 864344 903296 948722 1000835 1059044 1123868 1196519 1276861 1363530 1455872 1554183 1658079
56131A658079J07892J09805J08976J04235R5617Q4844P3353O1562N0661M2713
$$ 1658079 1765971 1875776 1984752 2088987 2184604 2269448 2342801 2404363 2455024 2497737
56121B497737L7770L3041K6166J7383P528l713j6074k7474l6262m3095m9403n5690
$$ 2497737 2535507 2568548 2594714 2612097 2619625 2615912 2599838 2572364 2536102 2493007 2443604 2387914
56109B387914o2507p1025q1116r0599r7523j01601j02529r9215r1935q3061p4271
$$ 2387914 2325407 2254382 2173266 2082667 1985144 1883543 1781014 1681799 1589864 1506803 1432532
56098A432532o5036n5065m5929l8781l2696k6834k2093j9019j6198j2463q779
$$ 1432532 1367496 1312431 1266502 1227721 1195025 1168191 1146098 1127079 1110881 1098418 1089639
56087A089639o371m834l489k598j956l82K077L681L990M744O546P502O826O717
$$ 1089639 1083268 1078434 1074945 1072347 1070391 1070009 1072086 1075767 1079757 1084501 1091047 1098549 1105375 1112092
56073A112092Q636J0714J1133J1259J2734J4206J3868J2942J3581J5235J6038
$$ 1112092 1120728 1131442 1142575 1153834 1166568 1180774 1194642 1207584 1221165 1236400 1252438
56062A252438J6104J6759J7940J8829J9657K0707K1087K0361J9777K0063J9988
$$ 1252438 1268542 1285301 1303241 1322070 1341727 1362434 1383521 1403882 1423659 1443722 1463710
56051A463710J8762J7725J7813J7856J7190J7293J8870K0119K0157K1042K3955
$$ 1463710 1482472 1500197 1518010 1535866 1553056 1570349 1589219 1609338 1629495 1650537 1674492
56040A674492K6539K6834K6721K8381L0403L0816L0988L2957L5516L6578L7019
$$ 1674492 1701031 1727865 1754586 1782967 1813370 1844186 1875174 1908131 1943647 1980225 2017244
56029B017244L8679M0887M2398M4211M7170M9366M9418M9615N2222N5512N7068
$$ 2017244 2055923 2096810 2139208 2183419 2230589 2279955 2329373 2378988 2431210 2486722 2543790
56018B543790N8136O0733O3460O4513O5876P0055P5300P8642Q1036Q5004Q9720
$$ 2543790 2601926 2662659 2726119 2790632 2856508 2926563 3001863 3080505 3161541 3246545 3336265
56007C336265R3175R6616J02125J08214J12578J16720J23163J30633J36713J42621
$$ 3336265 3429440 3526056 3628181 3736395 3848973 3965693 4088856 4219489 4356202 4498823
55997D498823J50541J59127J66454J74424J85285J97032K07354K18487K32956
$$ 4498823 4649364 4808491 4974945 5149369 5334654 5531686 5739040 5957527 6190483
55988F190483K48483K62787K79091L00577L24034L45836L69525L99988M34881
$$ 6190483 6438966 6701753 6980844 7281421 7605455 7951291 8320816 8720804 9155685
55979I155685M69994N08375N55329O09038O65478P28237Q03750Q91361R88461
$$ 9155685 9625679 10134054 10689383 11298421 11963899 12692136 13495886 14387247 15375708
55970A5375708J100914J237654J399867J587432J811274K087164K422982K825920
$$ 15375708 16476622 17714276 19114143 20701575 22512849 24600013 27022995 29848915
55962B9848915L315767L913320M619218N421779O323963P347620Q518992R872689
$$ 29848915 33164682 37078002 41697220 47118999 53442962 60790582 69309574 79182263
55954G9182263J1462164J3325641J5413960J7554404J9498010K1028673K2077736
$$ 79182263 90644427 103970068 119384028 136938432 156436442 177465115 199542851
55947A99542851K2755700K3198079K3260815K2343929J9622150J4571771P341827
$$ 199542851 222298551 245496630 268757445 291101374 310723524 325295295 332637122
55940C32637122j302067j0270998j8385542k4557497k8075513k8887750k7582007
$$ 332637122 331335055 321064057 302678515 278121018 250045505 221157755 193575748
55933A93575748k5021414k1952870j8862043j6023650j3564327j1495310r767219
$$ 193575748 168554334 146601464 127739421 111715771 98151444 86656134 76888915
55926G6888915q330762p148384o175288n364313m686138m123699l652497l244832
$$ 76888915 68558153 61409769 55234481 49870168 45184030 41060331 37407834 34163002
55918C4163002k887600k578732k310581k071440j858285j673364j511827j365248
$$ 34163002 31275402 28696670 26386089 24314649 22456364 20783000 19271173 17905925
55910A7905925j233451j120789j024217r36162q55854p87163p28244o73343o22191
$$ 17905925 16672474 15551685 14527468 13591306 12735452 11948289 11220045 10546702 9924511
55901I924511n78023n38839m99638m61107m27560l98361l69386l40920l16336
$$ 9924511 9346488 8807649 8308011 7846904 7419344 7020983 6651597 6310677 5994341
55892E994341k94928k73510k53148k37008k23397k08091j91907j78926j68737
$$ 5994341 5699413 5425903 5172755 4935747 4712350 4504259 4312352 4133426 3964689
55883C964689j57414j44895j34690j27041j18868j09858j02660r7527r2410q7769
$$ 3964689 3807275 3662380 3527690 3400649 3281781 3171923 3069263 2971736 2879326 2791557
55873B791557q5968q6296q5709q3931q3037q2749q0860p7579p4836p2119o7644
$$ 2791557 2705589 2619293 2533584 2449653 2366616 2283867 2203007 2125428 2050592 1978473 1910829
55862A910829o2627n9661n7689n3493m7434m2975m0917l8883l6167l4432l3698
$$ 1910829 1848202 1788541 1730852 1677359 1629925 1586950 1546033 1507150 1470983 1436551 1402853
55851A402853l2082k9707k8633k8809k8077k6234k5302k5603k5332k4117k3398
$$ 1402853 1370771 1341064 1312431 1283622 1255545 1229311 1204009 1178406 1153074 1128957 1105559
55840A105559k3144k1747j9351j7899j7721j7277j6374j6436j7423j7609j6600
$$ 1105559 1082415 1060668 1041317 1023418 1005697 988420 972046 955610 938187 920578 903978
55829I03978j5693j5187j4134j2663j1850j1436j0336r138r393j0750j1558j1782
$$ 903978 888285 873098 858964 846301 834451 823015 812679 803541 794148 783398 771840 760058
55817G60058j2492j3078j2073j0299r959j0884j0829r286p818o852n382l751l425
$$ 760058 747566 734488 722415 712116 702157 691273 680444 671158 663340 656488 651106 647355 643930
55804F43930l941l314j614q76j271o83J435L081L205L085L429L023J199r68k727
$$ 643930 639989 636675 635061 634185 632914 632231 633666 636747 639952 643037 646466 649489 650688 649720 646993
55789F46993m568o304o701n662m628m251l798l227l477m343m476l984m627o869
$$ 646993 642425 636121 629420 623758 619130 614879 611081 607854 604377 600034 595558 591574 586947 580078
55775E80078r029r934j0146j0081r171p513o153n128l323q20P70P81K56j57r57
$$ 580078 571049 561115 550969 540888 531717 524204 518051 512923 509600 508780 509550 510331 510587 510430 509473
55760E09473k062k575k745l884n896p118p127p348q320q802q279p932q285q218
$$ 509473 507411 504836 502091 498207 492311 485193 478066 470718 462398 453596 445317 437385 429100 420882
55746D20882p370p137q147q904q201o939o290n890n068m234l845l468k871k588
$$ 420882 413512 406375 398228 389324 381123 374184 367894 362004 356936 352702 348857 345389 342518 339930
55732C39930k630k158j236j228k596l935m079l618l431l351l151l307l825l832
$$ 339930 337300 335142 333906 332678 330082 326147 322068 318450 315019 311668 308517 305210 301385 297553
55718B97553l170k913l458l624k564j093k19K08O01P38O29R07J571J735J252J167
$$ 297553 294383 291470 288012 284388 281824 280731 280512 280720 281321 282059 282688 283595 285166 286901 288153 289320
55702B89320J842K165J400K21p90k094l821n025n241n184n120m240k556j634k220
$$ 289320 291162 293327 294727 294948 294158 292064 288243 283218 277977 272793 267673 263433 260877 259243 257023
55687B57023k792j817M7J278J628J656J384Q08O03J128J722J942K306K943K887
$$ 257023 254231 252414 252461 253739 255367 257023 258407 259215 259818 260946 262668 264610 266916 269859 272746
55672B72746J847J131J592K054J199l18j126j213j245r63k2O42L2r81p68O01J600
$$ 272746 274593 275724 277316 279370 280569 280251 279125 277912 276667 275704 275682 276324 276356 275375 274607 275208 276808
55655B76808J605J426J647J870J673J208P35K11m90j441k502l157k933k203j859
$$ 276808 278413 279839 281486 283356 285029 286237 286972 287183 286693 285252 282750 279593 276660 274457 272598
55640B72598k085k334k699l967n913o947o284n112m716m697m190l548l517l705
$$ 272598 270513 268179 265480 261513 255600 248653 242369 237257 232541 227844 223654 220106 216589 212884
55626B12884l242k262j519j111p00l23j17J61M95K63o57j277r78n95j091j996
$$ 212884 209642 207380 205861 204750 204050 203727 203610 203771 204266 204529 203872 202595 201617 201022 199931 197935
55610A97935k313k094j986j970j743j590j804j879j440j188j754k368j954q89
$$ 197935 195622 193528 191542 189572 187829 186239 184435 182556 181116 179928 178174 175806 173852 172963
55596A72963m03o86r45q86q99j072j128j086j057p55p7K73k63j066j132n25l8
$$ 172963 172560 171874 170929 170043 169144 168072 166944 165858 164801 164046 163969 164242 163979 162913 161781 161256 161218
55579A61218J05K22L59M72R76K101L104L057K128J281J137J767K986M124M265
$$ 161218 161323 161545 161904 162376 163352 165453 168557 171614 173742 175023 176160 177927 180913 185037 189302
55564A89302L513L210L944M443L445J687N74o5j295k854l571l500l806m620m808
$$ 189302 192815 196025 199969 204412 207857 209544 210118 210053 208758 205904 202333 198833 195027 190407 185599
55549A85599l905k733j907j146l70j39o33j198j303j099q77o81n23k72M93J823
$$ 185599 181694 178961 177054 175908 175538 175399 174766 173568 172265 171166 170289 169608 169085 168813 169306 171129
55533A71129K826K590J423L50l40j036j676j817j645j796k247k442k411k639k907
$$ 171129 173955 176545 177968 178318 177978 176942 175266 173449 171804 170008 167761 165319 162908 160269 157362
55518A57362k446j306m96n85j139j636k029k231j994j525j444j909k380k345j777
$$ 157362 154916 153610 153114 152529 151390 149754 147725 145494 143500 141975 140531 138622 136242 133897 132120
55503A32120r56l28l52r15j233r08o01r30j336r71j93L2k54k30J91M98Q17J672
$$ 132120 131164 130836 130484 129569 128336 127428 126827 125897 124561 123590 123397 123429 123175 122945 123136 123634 124451 126123
55485A26123K541K255R17j8K04P96R21P11M41%l80k9R20J297M80o63j003n70j86
$$ 126123 128664 130919 131836 131818 132022 132818 133739 134450 134891 134891 134511 134482 135402 136699 137179 136516 135513 134943 134757
55466A34757l86j131k016k403j909j014n70o09l69L90R34O64o7n75n97k01M25
$$ 134757 134371 133240 131224 128821 126912 125898 125328 124719 124350 124740 125674 126338 126271 125696 125099 124898 125323
55449A25323Q77Q32N83P10J166J377J180Q97N39j17o78l87N60J028N45j10k61
$$ 125323 126200 127032 127615 128325 129491 130868 132048 132945 133484 133367 132689 132302 132862 133890 134435 134325 134064
55432A34064k05k95j76L85Q05N36k3k39k48n72j151j465j327j013p04k57M76J348
$$ 134064 133859 133564 133388 133773 134578 135114 135091 134852 134604 134032 132881 131416 130089 129076 128372 128115 128591 129939
55414A29939J909J792J199Q60J150J496J053j79j365j814j480p66k96o03j412
$$ 129939 131848 133640 134839 135699 136849 138345 139398 139219 137854 136040 134560 133794 133498 132895 131483
55399A31483j674r43k24n44j308j195l34m1o20r51m25J99J95j62m15n50m16K33
$$ 131483 129809 128866 128642 128098 126790 125595 125261 125220 124600 123649 123224 123423 123618 123456 123041 122491 122075 122308
55381A22308Q62N43l94m83O77J665J371M62J9o7k84l62L0L64J30j97k1K99J85
$$ 122308 123170 123713 123319 122836 123513 125178 126549 127011 127030 126963 126679 126317 126347 126711 126841 126644 126623 126922 127107
55362A27107p2N8L50M02M79Q02P08l40j524j575n67L59O05M55Q8n26r91p83k78
$$ 127107 127035 127093 127443 127845 128324 129126 129834 129494 127970 126395 125828 126187 126792 127247 127335 126809 125818 125035 124757
55343A24757l96j219j769j353l37N54J064J285J242Q51R5q68j590j551p35J90
$$ 124757 124361 123142 121373 120020 119683 120237 121301 122586 123828 124679 124774 123906 122316 120765 120030 120220
55327A20220N25K45k08n70q14q20m00M00J233J639J229N2j166j591j243r26j057
$$ 120220 120745 120990 120782 120212 119398 118578 118178 118578 119811 121450 122679 122731 121565 119974 118731 117805 116748
55310A16748j128o26J48O12P20P66Q36R03J037J094P03k8l13K61J057J294J108
$$ 116748 115620 114994 115142 115754 116474 117240 118076 118979 120016 121110 121813 121785 121472 121733 122790 124084 125192
55293A25192J071J131Q69M26L42O49Q29O60L94J36l59j158j835j848j082L1P82
$$ 125192 126263 127394 128263 128689 129031 129680 130509 131169 131563 131699 131340 130182 128347 126499 125417 125448 126230
55276A26230Q02L97J15M1r7k50n4L76M90K40J84L73R8p94j299o73L78P57M79K83
$$ 126230 127032 127429 127544 127585 127488 127238 127184 127560 128050 128290 128474 128847 128945 128151 126852 126179 126557 127314 127793 128076
55256A28076L20J75k68q08j372j764j434l30O09O21L15P46J805K505K487K107
$$ 128076 128396 128571 128303 127495 126123 124359 122925 122595 123204 123825 124140 124886 126691 129196 131683 133790
55240A33790J393J38j178j659j293r41j023j119r26p02o25n40m12l48k00J46K01
$$ 133790 135183 135321 134143 132484 131191 130250 129227 128108 127182 126480 125855 125315 124903 124555 124355 124501 124702
55223A24702m99j318j058L17J499J532Q23K61K19O77J498K170K030J116K11k11
$$ 124702 124203 122885 121827 122144 123643 125175 125998 126259 126478 127155 128653 130823 132853 133969 134180 133969
55207A33969m92j026j623j963j998j689q93J67Q50Q40M33k0m38o34k89M13P59
$$ 133969 133477 132451 130828 128865 126867 125178 124285 124452 125302 126142 126575 126555 126117 125483 125194 125607 126366
55190A26366M40p0k89l47n01o12m84k36J2K95M22J5p35r78l04N57O43q9r19j240
$$ 126366 126806 126736 126447 126100 125599 124987 124503 124267 124279 124574 124996 125011 124276 123298 122994 123551 124194 124105 123186 121946
55170A21946q13L28J678K383K112J539J401J484J187O64O02R61R30K48k87pO05
$$ 121946 121133 121461 123139 125522 127634 129173 130574 132058 133245 133909 134511 135472 136402 136650 136363 136356 136961
55153A36961O66K16N6M32O09Mq33r44l57j04p53j553j437m61L64L92r5n76r05
$$ 136961 137627 137843 137899 138331 138940 138944 138111 137167 136810 136706 135953 134400 132963 132502 132866 133258 133163 132587 131682
55134A31682r96n94K85J018J022N44L46O21P07Pj137j815j672j236j007p13J12
$$ 131682 130686 130092 130377 131395 132417 132961 133307 133928 134635 134642 133505 131690 130018 128782 127775 127062 127174
55117A27174J094J244L91m09k35M52N61p5n94m29Q6M23N65P03Q09P70O70O65Q05
$$ 127174 128268 129512 129903 129494 129259 129711 130272 130197 129603 129174 129260 129683 130248 130951 131760 132530 133200 133865 134670
55098A34670J089J411J470J001K02l71m19j21K95P85J202J183O12p6l30j05J76
$$ 134670 135759 137170 138640 139641 139843 139472 139053 138932 139227 140012 141214 142397 143009 142933 142603 142498 142674
55081A42674J61r6k96k16J07M28N28L66K1l75o09m78q9J24j34o60r91q71k91N97
$$ 142674 142835 142739 142443 142227 142334 142762 143290 143656 143677 143302 142693 142215 142126 142250 142116 141456 140465 139594 139303 139900
55061A39900J363J346L06j155k170k449k224j671q44J2O68J194J606J466N22m91
$$ 139900 141263 142609 142915 141760 139590 137141 134917 133246 132402 132414 133082 134276 135882 137348 137870 137379
55045A37379n61K16P75O14K61R1k50q93j192o98Q7N47Q60J417J894J707R21M1
$$ 137379 136818 137034 137809 138423 138684 138775 138525 137632 136440 135742 135829 136376 137236 138653 140547 142254 143175 143216
55027A43216p83j598j996j482l96L01K22o5j2J74J3m66p28l72M40J130J168M81
$$ 143216 142433 140835 138839 137357 136961 137262 137484 137419 137407 137581 137594 137128 136400 136028 136468 137598 138766 139247
55009A39247n46j438j863j618o60O40J563J632J005J39o68j162r39J27J407K021
$$ 139247 138701 137263 135400 133782 133122 133762 135325 136957 137962 138101 137433 136271 135332 135459 136866 138887
54993A38887J847J558J536J351N36m95q76m47K1j13n33m63K55R99J267J218J192
$$ 138887 140734 142292 143828 145179 145715 145220 144344 143897 143918 143805 143272 142809 143064 144063 145330 146548 147740
54976A47740J076N92o1l17k1L60L92K05J89M39P46R29R41Q13O92P69R74Q57P9
$$ 147740 148816 149408 149347 149030 149009 149369 149761 149966 150155 150594 151340 152269 153210 154023 154715 155484 156458 157315 157394
54957A57394r88j429p25O30J557J431N53l17o84m75K14J168J887J779Q07k79n95
$$ 157394 156406 154977 154252 154882 156439 157870 158423 158106 157422 156947 157161 158329 160216 161995 162802 162523 161928
54940A61928L4R73J420J030N8r05j408j394j006k58P57J525J553J241J614K843
$$ 161928 161962 162935 164355 165385 165443 164538 163130 161736 160730 160472 161229 162754 164307 165548 167162 170005
54924A70005L802L638L141L718N432P010P581P418P054O626O255O222O400O117
$$ 170005 173807 177445 180586 184304 189736 196746 204327 211745 218799 225425 231680 237902 244302 250419
54910B50419M879K809L05k210m231n533o594p929r036q850p409o017n468n129
$$ 250419 255298 258107 258412 256202 251971 246438 239844 231915 222879 214029 206620 200603 195135 190006
54896A90006m290l346k879k458j408j51L85K84N39J463K204J980J048K69J92Q23
$$ 190006 185716 182370 179491 177033 175625 175474 175859 176143 176682 178145 180349 182329 183377 183646 183838 184661
54880A84661J849K913L825M621N332N885O313O794P229P171O438N468M639L583
$$ 184661 186510 189423 193248 197869 203201 209086 215399 222193 229422 236593 243031 248499 253138 256721
54866B56721J753n93k617l987n194o692q236r187r130q144o714n457m721m372
$$ 256721 258474 257881 255264 251277 246083 239391 231155 221968 212838 204694 197980 192523 187802 183430
54852A83430m077l730l418l175k931k623k200j691j326j333j477j206m83Rj85
$$ 183430 179353 175623 172205 169030 166099 163476 161276 159585 158259 156926 155449 154243 153760 153769 153584
54837A53584o00n92l09l46p59j109j239j273j048l06N85Q57L93j63l97n50p26
$$ 153584 152984 152392 152083 151737 150978 149869 148630 147357 146309 146003 146588 147445 147838 147675 147278 146728 146002
54820A46002m96K97R56Q20K93L28J082J655J290L32k63j19J70j49j010j582j283
$$ 146002 145506 145803 146759 147579 147872 148200 149282 150937 152227 152559 152296 152177 152347 152198 151188 149606 148323
54803A48323l91M23Q65J047J004O48J56k9L03Q76J282J302R42L46k07n04n75n29
$$ 148323 147932 148355 149220 150267 151271 151919 152075 152046 152349 153225 154507 155809 156751 157097 156890 156386 155811 155282
54785A55282k33M56J209J426J056Q44J370K222K469J895J340J682K824L904M298
$$ 155282 155049 155505 156714 158140 159196 160040 161410 163632 166101 167996 169336 171018 173842 177746 182044
54770A82044M181M039M023M032M229N024O393P575P821P245O686O714P017O775
$$ 182044 186225 190264 194287 198319 202548 207572 213965 221540 229361 236606 243292 250006 257023 263798
54756B63798N466L288Q74j341l449n681p745q912q875q162p509p034o363n373
$$ 263798 269264 272552 273426 272085 268636 262955 255210 246298 237423 229261 221752 214718 208355 202982
54742B02982m399l734l315k886k313j697j241j003p33j81L74L22l13n42M08J952
$$ 202982 198583 194849 191534 188648 186335 184638 183397 182394 181661 181480 181854 182176 181863 181321 181729 183681
54726A83681K845K871L061M119N441O070O008N993O302O444N990N152M384L694
$$ 183681 186526 189397 192458 196577 202018 208088 214096 220089 226391 232835 238825 243977 248361 252055
54712B52055K689J105q73k808m362n355n764n811n949o471p068p057o119m670
$$ 252055 254744 255849 254976 252168 247806 242451 236687 230876 224927 218456 211388 204331 198212 193542
54698A93542l415k735k564k585k433j940j368j169j333j369j073r74j529k271
$$ 193542 190127 187392 184828 182243 179810 177870 176502 175333 174000 172631 171558 170584 169055 166784
54684A66784k299j509o73l33k41p2j00o43j259j068M7J058R08k45j213j160m10
$$ 166784 164485 162976 162303 161970 161729 161657 161557 160914 159655 158587 158634 159692 160600 160355 159142 157982 157572
54667A57572K40N06N83N11J97q2O0L49Q1p20j126o18J62M24K41L7k43p47j061
$$ 157572 157812 158318 158901 159412 159609 159527 159587 159936 160017 159297 158171 157553 157715 158139 158380 158417 158174 157427 156366
54648A56366q28m79n52p02l04L03K88k23k72L59Q69Q30P93J128J335R63L89J40
$$ 156366 155538 155059 154507 153805 153501 153804 154092 153869 153597 153956 154825 155655 156448 157576 158911 159874 160263 160403
54630A60403J36J09K16O31J020R56N13O7j82k03m3nm31j078j231p29l44p11j410
$$ 160403 160539 160648 160864 161495 162515 163471 163984 164051 163869 163666 163623 163618 163187 162109 160878 160149 159805 159094 157684
54611A57684j616j139l52M37R29O61l94j278r37N08J910K458K249J601N54o77
$$ 157684 156068 154929 154577 155014 155943 156604 156210 154932 153995 154503 156413 158871 161120 162721 163275 162598
54595A62598j434j227l71L87O67O46N05J58l74o31k01N37O33k21j170j298q15
$$ 162598 161164 159937 159566 159953 160620 161266 161771 161929 161555 160924 160723 161260 161893 161672 160502 159204 158389
54578A58389n83p39o45j29K04P9Q9O29J155J013M49P1j12l76m35J96J193J597
$$ 158389 157806 157067 156422 156293 156497 156576 156665 157294 158449 159462 159911 159982 159870 159494 159059 159255 160448 162045
54560A62045J064L04J03M71Q71R38O69K30k55p33j091j080n77K8J53k24m71k06
$$ 162045 163109 163413 163516 163987 164858 165796 166465 166695 166440 165707 164616 163536 162959 162987 163140 162916 162445 162239
54542A62239K22M13N81J051J573J766J759J757J412M74l08N5J250J841J177J64
$$ 162239 162461 162874 163455 164506 166079 167845 169604 171361 172773 173247 172939 172994 174244 176085 177262 177426
54526A77426o4N55J391J966J982J184k69j600k140j955j514j075o27j62L37Q49
$$ 177426 177362 177917 179308 181274 183256 184440 184171 182571 180431 178476 176962 175887 175260 175098 175435 176284
54510A76284J112Q25J84k26k62l95q20j041p33l60l67m19q1K49n5p14r75q67j036
$$ 176284 177396 178221 178405 178179 177917 177522 176702 175661 174928 174568 174201 173782 173701 173950 173895 173181 172206 171339 170303
54491A70303j414j157j22O62M82j4J09O72Q32N17M78J021J473J095Q7o17l81N11
$$ 170303 168889 167732 167610 168272 168754 168740 168849 169521 170353 170870 171348 172369 173842 174937 175024 174407 174026 174537
54473A74537J155R34Q5n81m71M05J646K734L132K630J761J342J386J055K7p32
$$ 174537 175692 176626 176711 176130 175659 176064 177710 180444 183576 186206 187967 189309 190695 191750 191777 191045
54457A91045l10O49P51j02o22j62M07K58o1K92Q91N91o58j648j533p45j84j27
$$ 191045 190735 191384 192135 192033 191411 191249 191656 191914 191853 192145 193036 193627 192969 191321 189788 189043 188859 188732
54439A88732k75l39k47n7L3j98o27q00m76n1q7n73r06o80k14p8k62j58N63J369
$$ 188732 188457 188118 187871 187814 187847 187649 187022 186222 185746 185695 185608 185035 184129 183449 183235 183157 182895 182737 183300 184669
54419A84669J516J059P86J138J675J723J150K70o63j485j992k136k079j806j028
$$ 184669 186185 187244 188030 189168 190843 192566 193716 193986 193323 191838 189846 187710 185631 183825 182797
54404A82797J88J069J004M36K49N22O31M93P82J779K781L046K586J732N59o90
$$ 182797 182985 184054 185058 185494 185743 186265 186896 187389 188171 189950 192731 195777 198363 200095 200654 199964
54388A99964j239n64P26J413R95J1q35j286j352j055n50j44K1J06K67M09L79K36
$$ 199964 198725 198161 198887 200300 201295 201306 200471 199185 197833 196778 196228 196084 196105 196211 196478 196887 197266 197502
54370A97502J85K57K51Ml37m26j43K15K36j53o47r01p86l32L56J119J776K147
$$ 197502 197687 197944 198195 198199 197862 197436 197293 197508 197744 197591 196944 196043 195257 194925 195281 196400 198176 200323
54352B00323K022J206j46j365j725j165l70k3k38o42q63q22p52r30j229j063p4
$$ 200323 202345 203551 203405 202040 200315 199150 198780 198757 198519 197877 197014 196192 195440 194510 193281 192218 192144
54335A92144J200J723J145J53m40n74o28p15o79n39n01n99o59o07n71o38p30p21
$$ 192144 193344 195067 196212 196365 195925 195351 194723 194008 193329 192790 192289 191690 191031 190424 189853 189215 188485 187764
54317A87764n51k48J05M43P70J105J343J321R95N20Q4j59o9L69R23J284J450J673
$$ 187764 187213 186965 187070 187513 188283 189388 190731 192052 193047 193567 193651 193492 193423 193792 194715 195999 197449 199122
54299A99122K011K202K104J988K238K813L219K975K084J121P04Q07P58J05p43
$$ 199122 201133 203335 205439 207427 209665 212478 215697 218672 220756 221877 222581 223388 224146 224251 223508
54284B23508j117j090j343k132k997l503l654l486k874k034j570j632j584r37
$$ 223508 222391 221301 219958 217826 214829 211326 207672 204186 201312 199278 197708 196076 194492 193555
54270A93555j28J28j17j75K83R11J224J044N16n8l63l44k51k59k53r7R8J82K31
$$ 193555 193427 193555 193438 193263 193546 194457 195681 196725 197241 197183 196820 196476 196225 195966 195713 195616 195714 195896 196127
54251A96127L59M80M98M84M76L35k0m09o35o96o00k64K66P24R03P73K89n25j300
$$ 196127 196486 196966 197464 197948 198424 198759 198739 198330 197695 196999 196399 196135 196401 197125 198028 198801 199090 198565 197265
54232A97265j579j493j579j859j691q63m5J82Q6P4m2m24n59o2M85L09k98m34J4
$$ 197265 195686 194193 192614 190755 189064 188201 188156 188338 188424 188498 188456 188032 187473 187411 187896 188205 187907 187473 187487
54213A87487L67L14K59M64P34Q76Q49M55m70j513k031j977j819j680j233m06L92
$$ 187487 187854 188168 188427 188891 189625 190501 191350 191805 191335 189822 187791 185814 183995 182315 181082 180676 181068
54196A81068Q76J079J008O72M18O29J089J240J069J075J306J158L04p48j296j135
$$ 181068 181944 183023 184031 184703 185121 185750 186839 188079 189148 190223 191529 192687 192991 192243 190947 189812
54180A89812n70p5p5n90j104j122p88n27k68L10R11Q06n5q26q60l70J19L85M24
$$ 189812 189242 189167 189092 188502 187398 186276 185488 184961 184693 185003 185914 186720 186665 185839 184979 184609 184728 185113 185537
54161A85537K90K11L97O57O55N02N17N42K32q3K60J041J227N50n1J08M82L90Q4
$$ 185537 185827 186038 186435 187092 187747 188249 188766 189308 189540 189457 189717 190758 191985 192535 192484 192592 193074 193464 193548
54142A93548L2r8q32j815k186j780j158o17O3R01J401J147M49Q9M85J182J303
$$ 193548 193580 193482 192650 190835 188649 186869 185711 185094 185157 186058 187459 188606 189055 189144 189629 190811 192114
54125A92114O20j56l50k33m23o76j17J340K652K925K286J348N19J07L36Q82J049
$$ 192114 192734 192578 192228 191995 191572 190896 190779 192119 194771 197696 199982 201330 201849 201956 202292 203174 204223
54108B04223O59J80k07q52j646j783r64l5J79j58o22j267k011k114j266l72l25
$$ 204223 204882 205062 204855 204003 202357 200574 199610 199575 199754 199596 198974 197707 195696 193582 192316 191944 191619
54091A91619o01j78P27R93M07j01P6O11J073J476J783J747J396J106R53O13J2
$$ 191619 191018 190840 191567 192560 192967 192866 192942 193553 194626 196102 197885 199632 201028 202134 203087 203700 203712
54074B03712l67m2Q50J643J710J065N37R01J769J864P59l82l77M03P92N44K29
$$ 203712 203345 203303 204153 205796 207506 208571 209108 210009 211778 213642 214401 214019 213642 214045 214837 215381 215610
54057B15610km24p17k36P42J226J010R33J423J892J847J629J604J522J211J126
$$ 215610 215608 215184 214467 214231 214973 216199 217209 218142 219565 221457 223304 224933 226537 228059 229270 230396
54041B30396J672K602L598M773O097O939O761N912N132M668M338M185M396M802
$$ 230396 232068 234670 238268 243041 249138 256077 262838 268750 273882 278550 282888 287073 291469 296271
54027B96271N004M955M942N029M857M148L130K330K014J870J367M09m46o20k52
$$ 296271 301275 306230 311172 316201 321058 325206 328336 330666 332680 334550 335917 336326 335880 335260 335008
54012C35008m9m90j418k375l079l498l771m071m421m637m630m576m578m404l917
$$ 335008 334959 334469 333051 330676 327597 324099 320328 316257 311836 307199 302569 297993 293415 289011 285094
53997B85094l528l627l799l275k143j409j663k377k769k746k620k438k108j779
$$ 285094 281566 277939 274140 270865 268722 267313 265650 263273 260504 257758 255138 252700 250592 248813
53983B48813j640j512j080l58L52Q09Q80M51l72j060r75OJ315K161K167J657J278
$$ 248813 247173 245661 244581 244223 244575 245384 246264 246715 246343 245283 244308 244314 245629 247790 249957 251614 252892
53966B52892J314J434J266J030J295K257L547M779N860O776P485Q136R005J0112
$$ 252892 254206 255640 256906 257936 259231 261488 265035 269814 275674 282450 289935 298071 307076 317188
53952C17188J1117J1756J2064J2241J2450J2677J2417J0693P004K228k040n128
$$ 317188 328305 340061 352125 364366 376816 389493 401910 412603 419607 421835 419795 414667
53940D14667p552r574j0425r437p245n139l587k179o53O30J243J175P65M75O42
$$ 414667 407115 397541 387116 377679 370434 365295 361708 359529 358876 359506 360749 361924 362689 363164 363806
53925C63806J162J495J201M68q2R4J184K940M642N484N377N084N304N901O354
$$ 363806 364968 366463 367664 368132 368050 368144 369328 372268 376910 382394 387771 392855 398159 404060 410414
53910D10414O564O708O652O102N218M414L697K753J683J001P26J35j251k855l658
$$ 410414 416978 423686 430338 436440 441658 446072 449769 452522 454205 455206 455932 456067 454816 451961 448303
53895D48303l426k970l245m411n792o585o574o236o212o734p510q006p821o979
$$ 448303 444877 441907 438662 434251 428459 421874 415300 409064 402852 396118 388608 380602 372781 365802
53881C65802o020n589n771n917n437m570m054m119m232l940l506l460l786l947
$$ 365802 359782 354193 348422 342505 337068 332498 328444 324325 320093 316153 312647 309187 305401 301454
53867C01454l632l163k997l082k968k460j938j871k189k404k254j941j656j250
$$ 301454 297822 294659 291662 288580 285612 283152 281214 279343 277154 274750 272496 270555 268899 267649
53853B67649n56J36K78k86j105j580j550j338j333j585j826j853j722j527j161
$$ 267649 267093 267229 267507 267221 266116 264536 262986 261648 260315 258730 256904 255051 253329 251802 250641
53838B50641n55L8K85K61L24M94M02n0m70o05p26j036j135o11K20O65O09M98N22
$$ 250641 250086 250124 250409 250670 250994 251488 251890 251840 251370 250765 250039 249003 247868 247257 247477 248142 248751 249249 249771
53819B49771M23J52Q0M01Q15J062J339J895K507K757K603K385K394K617K875L050
$$ 249771 250194 250346 250426 250827 251642 252704 254043 255938 258445 261202 263805 266190 268584 271201 274076 277126
53803B77126L165L362L701M068M334M613N146N823O148N819N152M682M503M325
$$ 277126 280291 283653 287354 291422 295756 300369 305515 311338 317486 323305 328457 333139 337642 341967
53789C41967M001L716L613L524L284L064L224L827M468M705M553M453M730N191
$$ 341967 345968 349684 353297 356821 360105 363169 366393 370220 374688 379393 383946 388399 393129 398320
53775C98320N400N249N127N485O400P585Q670R336R279Q096N329P00n371j1514
$$ 398320 403720 408969 414096 419581 425981 433566 442236 451572 460851 468947 474276 474976 469605 458091
53761D58091j6084j8343j8869j8534j7421j5192j2268r873q681q067p119n843
$$ 458091 442007 423664 404795 386261 368840 353648 341380 331507 322826 314759 307640 301797
53749C01797m892m429m008l443l040k925k771k421k160k143k015j502r17o24m39
$$ 301797 296905 292476 288468 285025 281985 279060 276289 273868 271708 269565 267550 266048 265131 264507 264068
53734B64068l9L54L39R0Q2K86K97K19N69J291J631J302J049J547K402K711K198
$$ 264068 264029 264383 264722 264812 264894 265180 265477 265696 266265 267556 269187 270489 271538 273085 275487 278198 280396
53717B80396J266L88rN12J867L133L385K834K460K661K954K997L108L561M072
$$ 280396 281662 282050 282041 282553 284420 287553 290938 293772 296232 298893 301847 304844 307952 311513 315585
53702C15585M356M675N376O255O805O854O650O456O495O937P657Q094P757O746
$$ 315585 319941 324616 329992 336247 343052 349906 356556 363012 369507 376444 384101 392195 399952 406698
53688D06698N484M100K438N77j157k624l867m723m954m866n182o043o682o441
$$ 406698 412182 416282 418720 419297 418140 415516 411649 406926 401972 397106 391924 385881 379199 372758
53674C72758n713n313n289m964m056l052k409j935j295o32l49n13q58j178j416
$$ 372758 367045 361732 356443 351479 347423 344371 341962 340027 338732 338100 337751 337238 336380 335202 333786
53659C33786j447j100m68Q6K75J49p3k63m55o59p03l48M06J128J254O49j68m85
$$ 333786 332339 331239 330771 330857 331132 331281 331208 330945 330490 329831 329128 328780 329186 330314 331568 332217 332049 331564
53641C31564n6O86J081Q41L10R2M65J174J793K150K244K009J481J076J268J923
$$ 331564 331508 332194 333275 334116 334426 334518 334983 336157 337950 340100 342344 344353 345834 346910 348178 350101
53625C50101K366K191J669J258J101J209J700K470K968K799K334K330K996L776
$$ 350101 352467 354658 356327 357585 358686 359895 361595 364065 367033 369832 372166 374496 377492 381268
53611C81268M065L858L654L878M386M597M250L918M241M799M430L013K002K562
$$ 381268 385333 389191 392845 396723 401109 405706 409956 413874 418115 422914 427344 430357 432359 434921
53597D34921L849M105K956J541P14K66n0%L37K68n03j340j618j575j720k032k228
$$ 434921 438770 442875 445831 447372 448086 448352 448302 448302 448639 448907 448404 447064 445446 443871 442151 440119 437891
53580D37891k324k392k227j748j383j583k213k798l060k923k355j543r42q16r90
$$ 437891 435567 433175 430948 429200 427817 426234 424021 421223 418163 415240 412885 411342 410400 409584 408594
53565D08594j243j508j541r62J7N49K68j06J42O52P06M25L88N29M33M39J308K760
$$ 408594 407351 405843 404302 403340 403357 403906 404174 404068 404210 404862 405568 405993 406381 406910 407343 407782 409090 411850
53547D11850L442K741J707J719K852M091M629M466L984L576L596M248N366O468
$$ 411850 415292 418033 419740 421459 424311 428402 433031 437497 441481 445057 448653 452901 458267 464735
53533D64735P077P079O800O781P337Q344R497J0629J1666J2447J2857J3080J3470
$$ 464735 471812 478891 485691 492472 499809 508153 517650 528279 539945 552392 565249 578329 591799
53520E91799J4158J4934J5500J5772J6089J7072J8970K1051K2215K2437K3065
$$ 591799 605957 620891 636391 652163 668252 685324 704294 725345 747560 769997 793062
53509G93062K5065K7553K8897K8871K8776K9468L0400L0751L0497K9870K8764
$$ 793062 818127 845680 874577 903448 932224 961692 992092 1022843 1053340 1083210 1111974
53498A111974K7260K6039K5442K4653K2686J9875J7549J6348J5766J5370J5525
$$ 1111974 1139234 1165273 1190715 1215368 1238054 1257929 1275478 1291826 1307592 1322962 1338487
53487A338487J6510J7649J7985J7522J7191J7559J8147J8120J7325J6419J6052
$$ 1338487 1354997 1372646 1390631 1408153 1425344 1442903 1461050 1479170 1496495 1512914 1528966
53476A528966J6151J5975J4798J2574R948P599N624L726J827K05j176k906n342
$$ 1528966 1545117 1561092 1575890 1588464 1598412 1606011 1611635 1615361 1617188 1617393 1616217 1613311 1607969
53463A607969p880r629j0687j2057j4142j6010j6605j6169j5991j6945j8779k0631
$$ 1607969 1600089 1590460 1579773 1567716 1553574 1537564 1520959 1504790 1488799 1471854 1453075 1432444
53451A432444k1788k1961k1327k0463j9952j9902j9884j9382j8287j6997j6078
$$ 1432444 1410656 1388695 1367368 1346905 1326953 1307051 1287167 1267785 1249498 1232501 1216423
53440A216423j5646j5138j3865j1854r806q178o760n296m013l159k475j538l15
$$ 1216423 1200777 1185639 1171774 1159920 1150114 1141936 1135176 1129880 1125867 1122708 1120233 1118695 1118380
53427A118380J086K846N020P041Q243Q775R408J0564J2060J3714J5552J7487J9293
$$ 1118380 1119466 1122312 1127332 1134373 1142616 1151391 1160799 1171363 1183423 1197137 1212689 1230176 1249469
53414A249469K0962K2571K3885K4673K5369K6752K8889L0982L2502L3847L5617
$$ 1249469 1270431 1293002 1316887 1341560 1366929 1393681 1422570 1453552 1486054 1519901 1555518
53403A555518L7751L9710M1244M2673M4541M7113N0003N2400N3854N4785N5829
$$ 1555518 1593269 1632979 1674223 1716896 1761437 1808550 1858553 1910953 1964807 2019592 2075421
53392B075421N6951N7690N8068N8546N9088N9083N8275N7117N5925N4458N2546
$$ 2075421 2132372 2190062 2248130 2306676 2365764 2424847 2483122 2540239 2596164 2650622 2703168
53381B703168N0468M8248M5287M1196L6574L2432K9172K6426K3490J9711J4871
$$ 2703168 2753636 2801884 2847171 2888367 2924941 2957373 2986545 3012971 3036461 3056172 3071043
53370C071043R556M700M42m054r412j5235k0899k6489l2316l8065m3094m7270
$$ 3071043 3080599 3085299 3085741 3081687 3072275 3057040 3036141 3009652 2977336 2939271 2896177 2848907
53358B848907n0811n3662n5592n6725n7348n7405n6725n5486n3930n1944m9545
$$ 2848907 2798096 2744434 2688842 2632117 2574769 2517364 2460639 2405153 2351223 2299279 2249734
53347B249734m7445m6453m6496m6922m7439m7983m7856m6170m3228m0501l8846
$$ 2249734 2202289 2155836 2109340 2062418 2014979 1966996 1919140 1872970 1829742 1789241 1750395
53336A750395l7542l5528l2839l0293k8333k6758k5281k3738k1919j9705j7419
$$ 1750395 1712853 1677325 1644486 1614193 1585860 1559102 1533821 1510083 1488164 1468459 1451040
53325A451040j5720j5056j5261j5612j5404j4589j3790j3450j3181j2340j1141
$$ 1451040 1435320 1420264 1405003 1389391 1373987 1359398 1345608 1332158 1318977 1306637 1295496
53314A295496j0465j0481j0216q840o708m592k517j08K297L800M170M205M765
$$ 1295496 1285031 1274550 1264334 1255494 1248786 1244194 1241677 1241569 1243866 1247666 1251836 1256041 1260806
53301A260806O115Q159J0705J3228J5042J6129J7286J9115K1266K3086K4528K5887
$$ 1260806 1266921 1275080 1285785 1299013 1314055 1330184 1347470 1366585 1387851 1410937 1435465 1461352
53289A461352K7020K7502K7410K7203K6876K5961K4429K2836K1355J9398J6626
$$ 1461352 1488372 1515874 1543284 1570487 1597363 1623324 1647753 1670589 1691944 1711342 1727968
53278A727968J3722J1545R946Q014N224J775j930n460q247r965j1070j2385j4123
$$ 1727968 1741690 1753235 1763181 1771195 1776419 1778194 1776264 1770804 1762557 1752592 1741522 1729137 1715014
53265A715014j5831j7322j8991k1085k3252k5065k6528k7813k8938k9887l0673
$$ 1715014 1699183 1681861 1662870 1641785 1618533 1593468 1566940 1539127 1510189 1480302 1449629
53254A449629l1079l0763k9859k9034k8704k8641k8583k8620k8633k8010k6548
$$ 1449629 1418550 1387787 1357928 1328894 1300190 1271549 1242966 1214346 1185713 1157703 1131155
53243A131155k5172k4986k5810k6373k5862k4623k3405k2509k1839k1233k0565
$$ 1131155 1105983 1080997 1055187 1028814 1002952 978329 954924 932415 910576 889343 868778
53232H68778j9727j8700j7482j6049j4568j3473j2977j2681j2106j1507j1604
$$ 868778 849051 830351 812869 796820 782252 768779 755802 743121 731015 719508 707904
53221G07904j2554j3694j4372j4487j4137j3338j2399j1993j2367j2844j2591
$$ 707904 695350 681656 667284 652797 638660 625322 612923 600930 588563 575719 563128
53210E63128j1682j0894j0569j0291r675r018q824r041r100q618p819p182o972
$$ 563128 551446 540552 529983 519692 510017 500999 492175 483134 474034 465416 457597 450415 443443
53197D43443p120p385p557p554p485p544p754p819p381o374n099l913k989k304
$$ 443443 436323 428938 421381 413827 406342 398798 391044 383225 375844 369470 364371 360458 357469 355165
53183C55165j823j552j501j575j636j699j934k349k496j891p72L1J66J59M25M23
$$ 355165 353342 351790 350289 348714 347078 345379 343445 341096 338600 336709 335937 335968 336134 336293 336718 337141
53167C37141m59j700k226j990j913k151j699j41J254J069l25j291r87n0N41N12
$$ 337141 336682 334982 332756 330766 328853 326702 325003 324862 326116 327185 326860 325569 324582 324532 325073 325585
53151C25585K39K52P33J153N85j104k673k734j459k90q6k76MP16J238J260R12
$$ 325585 325824 326076 326809 327962 328547 327443 324770 322036 320577 320287 320201 319925 319929 320645 321883 323143 324055
53134C24055L30l51p92o50p1L49J61m49r20r24o41l70r1L72Q46Q63K82m38q03
$$ 324055 324385 324034 323242 322592 322521 322870 323031 322582 321662 320738 320097 319727 319636 320008 320854 321717 321999 321561 320758
53115C20758q06p39o93n18j24M06P82N63m98j949k898k970k658k504k376j969
$$ 320758 319952 319213 318520 318002 317878 318284 319066 319629 319131 317182 314284 311314 308656 306152 303776 301807
53099C01807j516j477j798k080k177k147j768q19L32R11O31p3n86o67n16o32j279
$$ 301807 300291 298814 297016 294936 292759 290612 288844 288025 288357 289268 289899 289826 289240 288573 288057 287425 286146
53082B86146j872j315N48K348K656J649N42j03n60p99l94M28P55K81l81q46j439
$$ 286146 284274 282959 283507 285855 288511 290160 290702 290599 290039 289240 288846 289274 290029 290310 289929 289083 287644
53065B87644k174k269j271Q5P63O68M18L80L97J94l13q51q09J45J335J607P40
$$ 287644 285470 283201 281930 282015 282778 283446 283864 284244 284641 284835 284522 283671 282862 283007 284342 285949 286689
53048B86689k60n37l41k63k55J6M47O60N81L58Q5p1Q8M19N56O45J259K234K468
$$ 286689 286429 285892 285551 285288 285033 285049 285496 286156 286737 287095 287180 287109 287197 287616 288172 288817 290076 292310 294778
53029B94778J457K09j36J41Q1l14k88K22N02L50L73Q28J114O92j40o57m72K42
$$ 294778 296235 296444 296308 296449 296530 296216 295928 296150 296652 297002 297375 298203 299317 300009 299869 299212 298740 298982
53011B98982R50J114P47M55O45R02O48J13j5K48K15l38q47r01p12m75K9Q28J378
$$ 298982 299932 301046 301793 302248 302893 303795 304443 304556 304541 304789 305004 304666 303819 302918 302206 301731 301760 302588 303966
52992C03966J232O37R8k18l06kO52J078P16j63o63l36L03M24j20n72j11J174K281
$$ 303966 305198 305835 305933 305715 305409 305407 306059 307137 307853 307690 307027 306691 306994 307418 307298 306726 306615 307789 310070
52973C10070K391J770J347J483J640J290O90N23R71J547J731J508J217J070R29
$$ 310070 312461 314231 315578 317061 318701 319991 320681 321204 322175 323722 325453 326961 328178 329248 330177
52958C30177N94J69j7Q4J13j79m81l94j56m20j284k039k105j793j750k013k075
$$ 330177 330771 330940 330923 331007 331120 330941 330460 330066 329910 329490 328206 326167 324062 322269 320519 318506 316431
52941C16431j756j512j651j761j216j32O26M19m43j123j133o65j99j8m9LL31P11
$$ 316431 314675 313163 311512 309751 308535 308403 309029 309448 309005 307882 306749 306084 305885 305867 305818 305821 306152 306863
52923C06863O29k5o70p33m94o84j358j758j446r21q24j053j110q77n44j33L77
$$ 306863 307492 307467 306797 306064 305570 304886 303528 301770 300324 299403 298579 297526 296416 295539 294995 294862 295239
52906B95239O77M15k63q35r56o45q9L68L43j31n24n85p63j355j706j060J14N41
$$ 295239 295916 296331 296068 295233 294277 293632 293543 293911 294254 294123 293599 293014 292251 290896 289190 288130 288244 288785
52888B88785n1n22J03J388K207K035J159J18o27q08n43k55j83j75n3J25K58L05
$$ 288785 288734 288212 288315 289703 291910 293945 295104 295222 294595 293787 293244 292989 292806 292631 292578 292703 292961 293266
52870B93266J93n2o0M97J270J544J308J326J886K215J609M99j84k23o4O3K88N44
$$ 293266 293459 293407 293347 293844 295114 296658 297966 299292 301178 303393 305002 305501 305317 305094 305030 305093 305381 305925
52852C05925N78L69N8m31j192j924k272k460k937l486l401k573j778j598j778
$$ 305925 306503 306872 306930 306499 305307 303383 301111 298651 295714 292228 288827 286254 284476 282878 281100
52837B81100j912k125k596k828k141o80O06J036P53J94m74j148j410q58J99Q26
$$ 281100 279188 277063 274467 271639 269498 268818 269424 270460 271213 271407 270933 269785 268375 267517 267716 268542
52821B68542M16n81j164q63j33L25K79p7m54n28KR86J624J252L05l4O95J676J958
$$ 268542 268958 268377 267213 266350 266217 266542 266821 266744 266290 265762 265764 266750 268374 269626 269931 269897 270592 272268 274226
52802B74226J660J482J469R87p7r21q83l70l36j095k088k599k338j497n79j20
$$ 274226 275886 277368 278837 279824 279747 278826 277943 277573 277237 276142 274054 271455 269117 267620 267041 266921
52786B66921k46m85l44j7j01o43r20m01N31J123J209J154J125Q96M28Q3J40L91
$$ 266921 266675 266190 265846 265829 265728 265085 264165 263764 264295 265418 266627 267781 268906 269802 270230 270313 270453 270844
52768B70844M85L72K34J36K9j8K44R27J763K252K041J242L75p9o2J16K34L87O76
$$ 270844 271329 271701 271935 272071 272100 272082 272326 273253 275016 277268 279309 280551 280926 280847 280785 280901 281135 281522 282198
52749B82198Q17L96m93j152j077o00m49p34q04k05O73J148J147J105J245J325
$$ 282198 283015 283411 282918 281766 280689 280089 279640 278906 278102 277897 278570 279718 280865 281970 283215 284540
52733B84540J093N80m7n23m97J24P75P10j02r17j190j088r03n38R6O82R27R52
$$ 284540 285633 286213 286166 285643 285146 285270 286045 286755 286653 285736 284546 283458 282555 282017 282113 282795 283722 284674
52715B84674Q47L24o72j471j451r16n96n38k77J27J24k85l77J44O57N55O8k06
$$ 284674 285521 285845 285173 283702 282251 281335 280739 280201 279924 280051 280175 279890 279513 279657 280314 280869 280937 280731
52697B80731k3N51J425K266K489J906J131Q69J048J014M12m35r44p96j04P01J229
$$ 280731 280708 281259 282684 284950 287439 289345 290476 291345 292393 293407 293819 293384 292440 291644 291540 292241 293470
52680B93470J449J526J395Q70J60j43J81P13J053J365J885K329K222J566O92k35
$$ 293470 294919 296445 297840 298710 298870 298727 298908 299621 300674 302039 303924 306253 308475 310041 310733 310498
52664C10498j098j521j212n12M0M93J227J967J855P50l43n23j45j29n83q20n60
$$ 310498 309400 307879 306667 306155 306195 306688 307915 309882 311737 312487 312144 311621 311476 311347 310764 309944 309384
52647C09384l23m59n32j05L38n1j139j780j300m19k41p88j172r81o92o15k99N80
$$ 309384 309061 308602 308070 307965 308303 308252 307113 305333 304033 303614 303373 302585 301413 300432 299740 299125 298826 299406
52629B99406J358J147J75m18p2N76P37N12N17Q90J230J241J038P70M00p8n06p72
$$ 299406 300764 301911 302086 301668 301596 302172 302909 303421 303938 304828 306058 307299 308337 309107 309507 309429 308923 308151
52611C08151r55j097j049p60m59l50k85n2J37q9n49n55J44R58J257J175J193J327
$$ 308151 307196 306099 305050 304290 303831 303481 303196 303144 303281 303192 302643 302088 302232 303190 304447 305622 306815 308142
52593C08142J309J314J759K431K537J850J141J120J473J437R49O54R23J372J453
$$ 308142 309451 310765 312524 314955 317492 319342 320483 321603 323076 324513 325462 326116 327039 328411 329864
52578C29864J133Q45R48J313J427R20m7r63j555k003k468k729k491j852j233q68
$$ 329864 330997 331842 332790 334103 335530 336450 336403 335440 333885 331882 329414 326685 324194 322342 321109 320241
52562C20241p08p26j094j860k597k595j519Q1J127J017K65j56K5K22m8m86n60
$$ 320241 319533 318807 317713 315853 313256 310661 309142 309223 310350 311367 311632 311476 311501 311723 311675 311189 310629
52545C10629k43J75O87J410K007J814P25n05j023p68l63l30o00p60o23l95l01
$$ 310629 310386 310561 311248 312658 314665 316479 317204 316699 315676 314908 314545 314215 313615 312855 312232 311837 311536
52528C11536k16J39O92R80P04N5n74r94j113p95j25M82P68J068J776K496K394
$$ 311536 311320 311459 312151 313131 313835 313890 313316 312322 311209 310414 310289 310771 311539 312607 314383 316879 319273
52511C19273J471Q41J351K384K662J940J239J307J609J205J78n30n46o14j451
$$ 319273 320744 321585 322936 325320 327982 329922 331161 332468 334077 335282 335460 334930 334384 333770 332319
52496C32319k649l197k793k047j543j237r11o81p66j030j060o09J64P92Q52L62
$$ 332319 329670 326473 323680 321633 320090 318853 317942 317261 316495 315465 314405 313796 313960 314752 315604 315966
52480C15966j34j06L31O29N98O64J179J908K418K615K657K617K522K481K535K552
$$ 315966 315832 315726 316057 316686 317284 317948 319127 321035 323453 326068 328725 331342 333864 336345 338880 341432
52464C41432K498K502K492K120J342O80N47O53M73k9o04j335k403l398l556k785
$$ 341432 343930 346432 348924 351044 352386 353066 353613 354266 354739 354710 354106 352771 350368 346970 343414 340629
52448C40629j909j754k317k953l084k694k285k312k529k161j012Ljn71n08L30
$$ 340629 338720 336966 334649 331696 328612 325918 323633 321321 318792 316631 315619 315622 315621 315050 314542 314872
52432C14872Q18K54o74r64n99k13o5l7j82n96r54q20l60j34k66k74K07J032J940
$$ 314872 315690 315944 315270 314306 313707 313494 313429 313392 313210 312614 311660 310840 310480 310346 310080 309806 310013 311045 312985
52413C12985K862L690M124M069L888L981M258M399M482M987O033P001P202O720
$$ 312985 315847 319537 323661 327730 331618 335599 339857 344256 348738 353725 359758 366759 373961 380681
52399C80681O207N937N472M337K631Q06q89k450l841m964n778o190n986n127l976
$$ 380681 386888 392825 398297 402634 405265 406071 405182 402732 398891 393927 388149 381959 375973 370846 366870
52384C66870k947k099j339p69m66r7O71J517J790J486J309J655K189K600L154
$$ 366870 363923 361824 360485 359716 359250 359153 359824 361341 363131 364617 365926 367581 369770 372370 375524
52369C75524M089N023N402N266N006M687M005K823J324j92j357j800j500r48n84
$$ 375524 379613 384636 390038 395304 400310 404997 409002 411825 413149 412957 411600 409800 408300 407352 406768
52354D06768k98K30Q59J200J303J573K019K181J863J501J538J922K447L151M045
$$ 406768 406470 406700 407559 408759 410062 411635 413654 415835 417698 419199 420737 422659 425106 428257 432302
52339D32302M830N235N438N768O194O494O770P358Q253R096R751J0494J1436J2292
$$ 432302 437132 442367 447805 453573 459767 466261 473031 480389 488642 497738 507489 517983 529419 541711
52325E41711J2945J3869J5512J7468J8790J9142J9147J9436J9864J9908J9584
$$ 541711 554656 568525 584037 601505 620295 639437 658584 678020 697884 717792 737376
52314G37376J9402J9534J9507J9008J8581J9060K0372K1342K1001J9718J8758
$$ 737376 756778 776312 795819 814827 833408 852468 872840 894182 915183 934901 953659
52303I53659J8792J9358J9735J9750J9422J8388J6349J3825J1795J0547R430P837
$$ 953659 972451 991809 1011544 1031294 1050716 1069104 1085453 1099278 1111073 1121620 1131050 1138887
52291A138887N862L809J561j101l830n802o465o086n563n740o626p344p079o026
$$ 1138887 1144749 1148558 1150119 1149018 1145188 1139386 1132921 1126835 1121272 1115532 1108906 1101562 1094483 1088457
52277A088457m987m182l126j775r04q67p17O97L226N698P405Q568R654J0917J2471
$$ 1088457 1083470 1079288 1076162 1074387 1073483 1072616 1071899 1072596 1075822 1081520 1088925 1097493 1107147 1118064 1130535
52262A130535J4128J5260J5490J5428J6024J7206J7932J7604J6731J6050J5662
$$ 1130535 1144663 1159923 1175413 1190841 1206865 1224071 1242003 1259607 1276338 1292388 1308050
52251A308050J5261J4625J3626J2209J0598R035P249M683J399j767m130n744o882
$$ 1308050 1323311 1337936 1351562 1363771 1374369 1383404 1390653 1395336 1396735 1394968 1390838 1385094 1378212
52238A378212p599q040q601r382j0005j0290j0617j1223j1635j1304j0431r694
$$ 1378212 1370613 1362573 1353972 1344590 1334585 1324295 1313678 1302455 1290820 1279516 1269085 1259391
52226A259391r369r213r007q793q588q273p728o946o002m934l704k370j318j008
$$ 1259391 1250022 1240809 1231802 1223009 1214421 1206148 1198420 1191474 1185472 1180538 1176834 1174464 1173146 1172138
52212A172138j142n93J218L274M144L956M069M928N600N659N957O895P398O667
$$ 1172138 1170996 1170403 1171621 1174895 1179039 1182995 1187064 1191992 1197592 1203251 1209208 1216103 1223501 1230168
52198A230168N652N534N805N370M674M998O138O630O151N847O183O174N323M551
$$ 1230168 1235820 1241354 1247159 1252529 1257203 1262201 1268339 1274969 1281120 1286967 1293150 1299324 1304647 1309198
52184A309198M428L924K024n40k453l839n702p898r091q774q109q319r171r543
$$ 1309198 1313626 1317550 1319574 1319034 1316581 1312742 1307040 1299142 1290051 1281277 1273168 1264849 1255678 1246135
52170A246135q928p781o695n809m983m158l331k382j159K43J498K356K796K891
$$ 1246135 1237207 1229426 1222731 1216922 1211939 1207781 1204450 1202068 1200909 1201152 1202650 1205006 1207802 1210693
52156A210693K648K177J773J650J625J347P51J24k50l23j57J89O51J185J796K419
$$ 1210693 1213341 1215518 1217291 1218941 1220566 1221913 1222664 1222788 1222538 1222215 1222058 1222247 1222898 1224083 1225879 1228298
52140A228298K825K777K259J486P46L08K95N68R14J434K544M347O404Q307J0224
$$ 1228298 1231123 1233900 1236159 1237645 1238391 1238699 1238994 1239562 1240476 1241910 1244454 1248801 1255205 1263512 1273736
52125A273736J2494J4990J7295J9292K1140K2825K4208K5428K6753K8110K9208
$$ 1273736 1286230 1301220 1318515 1337807 1358947 1381772 1405980 1431408 1458161 1486271 1515479
52114A515479K9970L0419L0215K8944K6859K4812K3262K1853K0074J7967J6039
$$ 1515479 1545449 1575868 1606083 1635027 1661886 1686698 1709960 1731813 1751887 1769854 1785893
52103A785893J4720J4002J3388J2286J0751R607R339R171P920N616L377J674k89
$$ 1785893 1800613 1814615 1828003 1840289 1851040 1860647 1869986 1879157 1887077 1892693 1896070 1897744 1897455
52090A897455l161o285q593j0042j1545j3776j6536j8999k0203j9604j7560j5082
$$ 1897455 1894294 1888009 1879416 1869374 1857829 1844053 1827517 1808518 1788315 1768711 1751151 1736069
52078A736069j2854j0768q541o293m250k287k71J604L170M661O354Q173R990J1923
$$ 1736069 1723215 1712447 1703906 1697613 1693363 1691076 1690805 1692409 1695579 1700240 1706594 1714767 1724757 1736680
52064A736680J3875J5250J5678J5667J5966J6508J6651J6193J5523J4832J3840
$$ 1736680 1750555 1765805 1781483 1797150 1813116 1829624 1846275 1862468 1877991 1892823 1906663
52053A906663J2357J0498Q371O023L761J990O76o08k073l648n591q420j1988j5149
$$ 1906663 1919020 1929518 1937889 1943912 1947673 1949663 1950339 1949731 1947658 1944010 1938419 1929999 1918011 1902862
52039A902862j6878j7436j7967j9115k0382k0903k0404j9336j8260j7375j6617
$$ 1902862 1885984 1868548 1850581 1831466 1811084 1790181 1769777 1750441 1732181 1714806 1698189
52028A698189j6033j5741j5558j5009j3962j3015j2881j3459j3933j3807j3476
$$ 1698189 1682156 1666415 1650857 1635848 1621886 1608871 1595990 1582531 1568598 1554791 1541315
52017A541315j3540j3955j4114j3665j2855j2116j1592j1174j0794j0552j0651
$$ 1541315 1527775 1513820 1499706 1486041 1473186 1461070 1449478 1438304 1427510 1416958 1406307
52006A406307j1238j2305j3583j4673j5444j6291j7771j9897k1952k3210k3665
$$ 1406307 1395069 1382764 1369181 1354508 1339064 1322773 1305002 1285105 1263153 1239943 1216278
51995A216278k3839k3970k3740k2811k1339j9756j8298j6907j5540j4405j3819
$$ 1216278 1192439 1168469 1144729 1121918 1100579 1080823 1062525 1045618 1030078 1015673 1001854
51984A001854j3826j4027j3915j3476j3218j3480j3932j4069j3959j3989j4097
$$ 1001854 988028 974001 960086 946610 933392 919912 905980 891911 877952 863963 849866
51973H49866j3836j3184j2663j2411j1820j0410q570o979n692m246k384k12K064
$$ 849866 836030 822846 810183 797772 785952 775542 766972 759993 754301 750055 747671 747459 749523
51960G49523M195N757O400O125N132L600J795J14j310k702m142n255n827o194
$$ 749523 753718 759475 765875 772000 777132 780732 782527 782641 781331 778629 774487 769232 763405 757211
51946G57211o576o450n254l403j853q30K06J504K718L772N099O718P784P545O263
$$ 757211 750635 744185 738931 735528 733675 732845 733051 734555 737273 741045 746144 752862 760646 768191 774454
51931G74454M741L326J808K5j948m093o573r404j2140j4021j4612j4378j4404
$$ 774454 779195 782521 784329 784354 782406 778313 771740 762336 750196 736175 721563 707185 692781
51918F92781j5263j6291j6324j5049j3220j1610j0308r093p914o747n389l814
$$ 692781 677518 661227 644903 629854 616634 605024 594716 585623 577709 570962 565573 561759
51906E61759k339j239l04R02K529M385O131P440Q062P963P340O386N197L831K281
$$ 561759 559420 558181 557877 558779 561308 565693 571824 579264 587326 595289 602629 609015 614212 618043 620324
51891F20324L84k012m704p228r218j0482j0772r952q418o865n514l968j941L10
$$ 620324 620708 618696 613992 606764 597546 587064 576292 566340 557922 551057 545543 541575 539634 539944
51877E39944K402M201N595O438P010P953R370J0452J0492R742Q806P645N857L599
$$ 539944 542346 546547 552142 558580 565590 573543 582913 593365 603857 613599 622405 630050 635907 639506
51863F39506J474l54k202m095n530o136o000n316m148k629r36R20K955M901O473
$$ 639506 640980 640626 638424 634329 628799 622663 616663 611347 607199 604570 603634 604554 607509 612410 618883
51848F18883P806R045R649Q862P050N723N818O584O647N634M128K496M92k104
$$ 618883 626689 635734 645383 654245 661295 667018 672836 679420 686067 691701 695829 698325 698817 696713
51834F96713n141q363j1372j3391j3676j2450j0831r616q505o940n225m275m413
$$ 696713 691572 683209 671837 658446 644770 632320 621489 611873 603368 596428 591203 586928 582515
51821E82515m991n232m976m445l806l235l058l382l761l589k773j699n90O29J827
$$ 582515 577524 572292 567316 562871 559065 555830 552772 549390 545629 542040 539267 537568 536978 537607 539434
51806E39434K518K401J734R41Q1r92k234l375m170m442m164l670l495l664l475
$$ 539434 541952 544353 546087 547028 547109 546117 543883 540508 536338 531896 527732 524062 520567 516903 513428
51791E13428k396r12N4L04K69m7j127k741l597k794j040J91L56P2pJ69M64Q06
$$ 513428 511032 510120 510174 510478 510747 510700 509573 506832 503235 500441 499401 499592 499948 500020 500013 500182 500646 501452
51773E01452R66O49J06J36J177K738M132N384O935Q621R525R071P780O672O076
$$ 501452 502418 503067 503173 503309 504486 507224 511356 516740 523675 532296 541821 550892 558672 565344 571420
51758E71420N447M260K616Q65j009l215n597p639r033r792r836q971p484o224
$$ 571420 576867 581127 583743 584608 583599 580384 574787 567148 558115 548323 538487 529516 522032 515808
51744E15808n634n072l643j518K06R36J221J846K885L986N033O153P285Q185Q675
$$ 515808 510174 505102 501459 499941 500147 501083 502304 504150 507035 511021 516054 522207 529492 537677 546352
51729E46352Q647Q017O895N606M248K582O22r30j380r31m22l20n51j203k551m323
$$ 546352 554999 563016 569911 575517 579765 582347 582969 582039 580659 579728 579306 578986 578435 577232 574681 570358
51713E70358n573n687n008m150l224k153j290j054j222j173p76m93m47M2J694
$$ 570358 564785 559098 554090 549940 546716 544563 543273 542219 540997 539824 539048 538555 538108 538150 539844
51698E39844M156O014O002M240K143J042R75J010N92J48K80R32J599J937J726
$$ 539844 544000 550014 556016 560256 562399 563441 564416 565426 566018 566166 566446 567378 568977 570914 572640
51683E72640O19j476l954n924p042p471p261o236m524k657j037L47J618K797L891
$$ 572640 573259 571783 567829 561905 554863 547392 540131 533895 529371 526714 525677 526024 527642 530439 534330
51668E34330M819N271N023M429M129M255M398M392M550M894M749L415R25k095
$$ 534330 539149 544420 549443 553872 558001 562256 566654 571046 575596 580490 585239 588654 589579 587484
51654E87484m909o847p486p054o311n706m929l464j263J286L587M796M102J569
$$ 587484 582575 575728 568242 561188 554877 549171 544242 540778 539515 540801 544388 549184 553286 554855
51640E54855j710m709p279r491j0835j0860j0093r466q971p865o086m534l792
$$ 554855 553145 548436 541157 531666 520831 509971 499878 490412 481441 473576 467490 462956 459164
51627D59164l419k808k081j669j597j552j373j063o26j44J91L11L52L99L65K24
$$ 459164 455745 452937 450856 449187 447590 446038 444665 443602 442976 442832 443023 443334 443686 444085 444450 444674
51611D44674R2m1l14o27o70m38l47o61j082j187q42p1J118K462L423L863M333
$$ 444674 444766 444725 444411 443784 443114 442676 442329 441668 440586 439399 438557 438486 439604 442066 445489 449352 453685
51594D53685N312O425P013P219P849R153J0367J0651R956Q683O933M618K122L69
$$ 453685 458997 465422 472435 479654 487503 496656 507023 517674 527630 536313 543246 547864 549986 550355
51580E50355L8R40K357L885N654P809J0102J2333J4886J8365K2591K6398K8694
$$ 550355 550393 551333 553690 557575 563229 571038 581140 593473 608359 626724 649315 675713 704407
51567G04407K9528K9909L0756L2284L4212L6072L7337L7606L6970L6109L5848
$$ 704407 733935 763844 794600 826884 861096 897168 934505 972111 1009081 1045190 1081038
51556A081038L6551L7893L9147L9654L8947L6478L1442K3250J2313J08j1799k2678
$$ 1081038 1117589 1155482 1194629 1234283 1273230 1309708 1341150 1364400 1376713 1376821 1365022 1342344
51544A342344l2507m1122m7932n2456n4781n5321n4393n2221m9170m5575m1419
$$ 1342344 1309837 1268715 1220783 1168327 1113546 1058225 1003832 951611 902441 856866 815447
51533H15447l6490l1058k6003k2040j8959j6042j3173j1068j0252j0262j0150
$$ 815447 778957 747899 721896 699856 680897 664855 651682 640614 630362 620100 609950
51522F09950r501q591p814p395p457p809p778o799n276m305m396m960n189m958
$$ 609950 600449 591858 584044 576649 569192 561383 553605 546806 541530 537225 532829 527869 522680 517722
51508E17722m581m220l928l862l997l941l503l151l434m103m328l662k392j049
$$ 517722 513141 508921 504993 501131 497134 493193 489690 486539 483105 479002 474674 471012 468620 467571
51494D67571j1M39J96m50r60j000n60K24J013J200M44p01j166n73K49K44o62j553
$$ 467571 467560 467999 468195 467745 466785 465785 465225 465449 466462 467662 468106 467405 466239 465666 465915 466159 465497 463944
51476D63944j629j077q22j499k783l849m294m335m108l369k152j157r50j118r07
$$ 463944 462315 461238 460416 458917 456134 452285 447991 443656 439548 436179 434027 432870 431920 430802 429895
51461D29895l55n3k9K83R04J078M67j94rJ150K872M713O096O434N930N695O489
$$ 429895 429540 429487 429458 429741 430645 431723 432190 431996 431987 433137 436009 440722 446818 453252 459182 464877 471366
51444D71366P811Q782R433J0402J1761J2991J3870J4566J4922J4418J2861J0494
$$ 471366 479177 487959 497392 507794 519555 532546 546416 560982 575904 590322 603183 613677
51432F13677P471L872L31k126l146l400l673m159m873o065p809r562j0702j1205
$$ 613677 621148 625020 625351 623225 620079 616679 613006 608847 603974 597909 590100 580538 569836 558631
51418E58631j1352j1057r961q136o186m616l391k175q50L49J072J228J120J164
$$ 558631 547279 536222 526261 518125 511939 507323 503932 501757 500907 501256 502328 503556 504676 505840
51404E05840J536K078K556K820K792K604K735L629M986N867N824N558O027P228
$$ 505840 507376 509454 512010 514830 517622 520226 522961 526590 531576 537443 543267 548825 554852 562080
51390E62080Q399R308J0582J2681J5243J7772K0453K3737K7472L1074L4458L8246
$$ 562080 570479 579787 590369 603050 618293 636065 656518 680255 707727 738801 773259 811505
51378H11505M2951M8356N3705N8146O0924O1618O0491N8207N4857M9551M1292
$$ 811505 854456 902812 956517 1014663 1075587 1137205 1197696 1255903 1310760 1360311 1401603
51367A401603L0141J7153L386j0546k4086l6469m7062n5564o1697o5052o5543
$$ 1401603 1431744 1448897 1452283 1441737 1417651 1381182 1334120 1278556 1216859 1151807 1086264
51356A086264o3764o0688n7026n3034m8706m3988l8957l3889k9057k4483k0155
$$ 1086264 1022500 961812 904786 851752 803046 759058 720101 686212 657155 632672 612517
51345F12517j6491j4086j2920j2235j1511j0988j0843j0502r418q102p459p344
$$ 612517 596026 581940 569020 556785 545274 534286 523443 512941 503523 495421 487962 480618
51333D80618o725n270l857l234l129l001k884k871k591j869j384j807k597k572
$$ 480618 473893 468623 464766 461532 458403 455402 452518 449647 447056 445187 443803 441996 439399 436827
51319D36827j507l88j1j18q8J59L48L98M13L74K61K99P32J385J752J528Q99K45
$$ 436827 435320 434932 434921 434803 434715 434874 435222 435620 436033 436407 436668 436967 437699 439084 440836 442364 443263 443508
51301D43508k21n10n69k02O54J594J922J266l7j275j984k183k114j965j865j858
$$ 443508 443287 442777 442208 442006 442660 444254 446176 447442 447405 446130 444146 441963 439849 437884 436019 434161
51285D34161j867j749j439r91n13q4L16Q74J815L049M054M322L860L100K380J754
$$ 434161 432294 430545 429106 428115 427602 427518 427834 428708 430523 433572 437626 441948 445808 448908 451288 453042
51269D53042J148M86k94j015j163l76R12J752J679J151Q83J162J915K935L702
$$ 453042 454190 454676 454382 453367 452204 451828 452740 454492 456171 457322 458205 459367 461282 464217 467919
51254D67919L456J993J64r39j137j106j310j539j534j531j853k396k812l007l153
$$ 467919 471375 473368 473532 472593 471456 470350 469040 467501 465967 464436 462583 460187 457375 454368 451215
51239D51215l385l657l854l840l500k912k383k177k194k117j821j538j486j493
$$ 451215 447830 444173 440319 436479 432979 430067 427684 425507 423313 421196 419375 417837 416351 414858
51225D14858j146l23N64R72Q35N84O18R41J364J816K204K273J873J346J256J774
$$ 414858 413712 413389 413953 414925 415760 416344 416962 417903 419267 421083 423287 425560 427433 428779 430035 431809
51209D31809K541L097L230K956K497K295K660L355L809L781L466K955K181J498
$$ 431809 434350 437447 440677 443633 446130 448425 451085 454440 458249 462030 465496 468451 470632 472130
51195D72130J612K576L356K970J664M54j39k47N1P79J494J506P92M5l42p11j363
$$ 472130 473742 476318 479674 482644 484308 484762 484623 484376 484427 485206 486700 488206 488998 489043 488701 487990 486627
51178D86627k037k432k722l108l288k858j948j111p79j030j604j939j526n60J53
$$ 486627 484590 482158 479436 476328 473040 470182 468234 467123 466344 465314 463710 461771 460245 459685 459838
51163D59838J79lK23P31J076J326J869K568K825K390J599Q42K53p9j10p5l38r86
$$ 459838 460017 460014 460237 460968 462044 463370 465239 467807 470632 473022 474621 475463 475716 475637 475527 475452 475114 474128
51145D74128j835k775l647m000l525k644k131k095j966j476r89p14l23L56Q98
$$ 474128 472293 469518 465871 461871 458346 455702 453571 451476 449510 448034 447045 446331 446008 446364 447262
51130D47262R05O32N04M96L60J48Q5K11N30J163K045K774L094L282L712M358M984
$$ 447262 448167 448799 449303 449799 450159 450307 450392 450603 451133 452296 454341 457115 460209 463491 467203 471561 476545
51113D76545N435N379M368K655J486J726K571K523J463P31J050J509J086K90M66
$$ 476545 481980 487359 491727 494382 495868 497594 500165 502688 504151 504882 505932 507441 508527 508817 509283
51098E09283J919L604M462M354L645K567J339M04P0L1l43j207k061k446k479k505
$$ 509283 511202 514806 519268 523622 527267 529834 531173 531577 531647 531678 531335 530128 528067 525621 523142 520637
51082E20637k488k123j428p83m36l36m64p72p84Q8J566K485K240J732K210L574
$$ 520637 518149 516026 514598 513815 513379 513043 512579 511807 511023 511111 512677 515162 517402 519134 521344 524918
51066E24918M636M784M565M660N123N794O687P628Q147Q155Q221Q787R451R451
$$ 524918 529554 534338 538903 543563 548686 554480 561167 568795 576942 585097 593318 602105 611556 621007
51052F21007Q544P062N360L652K320J950K893M869P023Q413Q721Q507Q543Q889
$$ 621007 629551 636613 641973 645625 647945 649895 652788 657657 664680 673093 681814 690321 698864 707753
51038G07753Q859P903O206M340K808K000K032K245J396j112m437p260r251j1064
$$ 707753 716612 724515 730721 735061 737869 739869 741901 744146 745542 744430 739993 732733 723482 712418
51024G12418j2988j4387j4513j3429j1822j0262q816p215n166k722m03J181J949
$$ 712418 699430 685043 670530 657101 645279 635017 626201 618986 613820 611098 610695 611876 613825
51011F13825K406L070M028N065O000O704P022O905O618O569O921P476P943Q193
$$ 613825 616231 619301 623329 628394 634394 641098 648120 655025 661643 668212 675133 682609 690552 698745
50997F98745Q230Q072P750P418P322P591Q222R178J0380J1525J2222J2571J3354
$$ 698745 706975 715047 722797 730215 737537 745128 753350 762528 772908 784433 796655 809226 822580
50984H22580J5280J7958K0143K1118K1520K2457K4181K5978K7229K8011K8746
$$ 822580 837860 855818 875961 897079 918599 941056 965237 991215 1018444 1046455 1075201
50973A075201K9606L0479L1193L1526L1277L0624L0361L1439L4172L7938M1794
$$ 1075201 1104807 1135286 1166479 1198005 1229282 1259906 1290267 1321706 1355878 1393816 1435610
50962A435610M5269M8525N1828N5128N8143O0634O2466O3543O3857O3453O2192
$$ 1435610 1480879 1529404 1581232 1636360 1694503 1755137 1817603 1881146 1945003 2008456 2070648
50951B070648N9688N5759N0809M5452L9840L3692K7017K0304J3992Q215L275k00
$$ 2070648 2130336 2186095 2236904 2282356 2322196 2355888 2382905 2403209 2417201 2425416 2428691 2428491
50939B428491j996k882l996n788q007j0462j3380j6938k0878k4597k7480k9242
$$ 2428491 2426495 2423613 2419617 2413829 2405822 2395360 2381980 2365042 2344164 2319567 2292087 2262845
50927B262845l0239l1335l3185l5768l8758m2100m5756m9171n1667n3397n5175
$$ 2262845 2232606 2201271 2168086 2132318 2093560 2051460 2005704 1956533 1904866 1851469 1796294
50916A796294n7203n8565n8278n6382n3638n0571m7305m3938m0585l7169l3666
$$ 1796294 1739091 1680526 1622248 1565866 1512228 1461657 1414352 1370414 1329829 1292660 1258994
50905A258994l0466k8015k6173k4350k2339k0534j9128j7597j5292j2391r814
$$ 1258994 1228528 1200513 1174340 1149990 1127651 1107117 1087989 1070392 1055100 1042709 1032895
50894A032895q288p710p446o952o054m851l591k523j689r02j20L17J36j77L97
$$ 1032895 1024607 1016897 1009451 1002499 996445 991594 988003 985480 983791 982889 982769 983086 983222 983045 983442
50879I83442K181M151M983M689M628N784P611Q912R460J0168J1765J3938J5870
$$ 983442 985623 989774 994757 999446 1004074 1009858 1017469 1026381 1035841 1046009 1057774 1071712 1087582
50866A087582J7216J8218J9288K0740K2801K5508K8593L1731L4892L8277M2070
$$ 1087582 1104798 1123016 1142304 1163044 1185845 1211353 1239946 1271677 1306569 1344846 1386916
50855A386916M6504N2042N8981O6771P4298Q1148Q8176R6385J05575J14666J23168
$$ 1386916 1433420 1485462 1544443 1611214 1685512 1766660 1854836 1951221 2056796 2171462 2294630
50844B294630J31562J40186J48393J55126J59849J62528J63104J61437J57542
$$ 2294630 2426192 2566378 2714771 2869897 3029746 3192274 3355378 3516815 3674357
50835C674357J51450J42934J31687J17664J01085Q2242O1731M0742K0741K762
$$ 3674357 3825807 3968741 4100428 4218092 4319177 4401419 4463150 4503892 4524633 4527395
50825D527395j2840k5983l6409m3632m7273m7510m5286m1773l7577l2755k7784
$$ 4527395 4514555 4488572 4452163 4408531 4361258 4313748 4268462 4226689 4189112 4156357 4128573
50814D128573k4061k2943k4719k9013l5823m5372n7044o9401q1395r2913j03905
$$ 4128573 4104512 4081569 4056850 4027837 3992014 3946642 3889598 3820197 3738802 3645889 3541984
50803C541984j13774j21896j28067j31995j33035j31001j26703j21023j13870
$$ 3541984 3428210 3306314 3178247 3046252 2913217 2782216 2655513 2534490 2420620
50794B420620j04777r4228q3566p3683o4518n5858m7855m0553l3618k6889k0723
$$ 2420620 2315843 2221615 2138049 2064366 1999848 1943990 1896135 1855582 1821964 1795075 1774352
50783A774352j5437j0878o994m370l572m089m663m745n115o692r171j1303j2373
$$ 1774352 1758915 1748037 1741043 1736673 1733101 1729012 1724349 1719604 1714489 1707797 1698626 1687323 1674950
50770A674950j2870j3691j5085j6720j8364k0130k2064k3874k5207k5939k6172
$$ 1674950 1662080 1648389 1633304 1616584 1598220 1578090 1556026 1532152 1506945 1481006 1454834
50759A454834k6039k5640k5003k4044k2661k0912j8940j6800j4443j1915r353
$$ 1454834 1428795 1403155 1378152 1354108 1331447 1310535 1291595 1274795 1260352 1248437 1239084
50748A239084o751l972r98J981M874P842J1094J4725J8829K3441K8263L2771L6843
$$ 1239084 1232333 1228361 1227363 1229344 1234218 1242060 1253154 1267879 1286708 1310149 1338412 1371183 1408026
50735A408026M0922M5343M9863N4187N8600O3460O8390P2623P6098P9508Q3108
$$ 1408026 1448948 1494291 1544154 1598341 1656941 1720401 1788791 1861414 1937512 2017020 2100128
50724B100128Q6184Q7975Q8550Q8311Q7058Q4120P9248P2860O5430N7027M7401
$$ 2100128 2186312 2274287 2362837 2451148 2538206 2622326 2701574 2774434 2839864 2896891 2944292
50713B944292L6206K3223Q837n652j8533k8755l6298m1458m4113m3978m1342l7136
$$ 2944292 2980498 3003721 3012558 3006906 2988373 2959618 2923320 2881862 2837749 2793771 2752429 2715293
50701B715293l2230k7013k1688j6748j2880j0532r805j0800j3863j9280k6765
$$ 2715293 2683063 2656050 2634362 2617614 2604734 2594202 2584397 2573597 2559734 2540454 2513689
50690B513689l5362m3957n1848n8757o4416o8328p0065o9581o7123o2876n6956
$$ 2513689 2478327 2434370 2382522 2323765 2259349 2191021 2120956 2051375 1984252 1921376 1864420
50679A864420m9714m1816l3924k6406j9351j2610n747J650R361J6388K1821K5781
$$ 1864420 1814706 1772890 1738966 1712560 1693209 1680599 1674852 1676502 1685863 1702251 1724072 1749853
50667A749853K9203L2740L6083L8324L8662L6872L3525K9786K6567K3703K0359
$$ 1749853 1779056 1811796 1847879 1886203 1924865 1961737 1995262 2025048 2051615 2075318 2095677
50656B095677J6411J2955J1102J0687J0629J0230R615R092Q724Q527Q646R116
$$ 2095677 2112088 2125043 2136145 2146832 2157461 2167691 2177306 2186398 2195122 2203649 2212295 2221411
50644B221411R836J0876J2548J5167J8775K3092K7454L1120L3986L6832M0248
$$ 2221411 2231247 2242123 2254671 2269838 2288613 2311705 2339159 2370279 2404265 2441097 2481345
50633B481345M3476M5111M4899M4004M3167M1613L8391L4032K9851K6191K2262
$$ 2481345 2524821 2569932 2614831 2658835 2702002 2743615 2782006 2816038 2845889 2872080 2894342
50622B894342J7466J1696M439n235j7253l0002m1537n0656n6406n7574n3743m6394
$$ 2894342 2911808 2923504 2927943 2922708 2905455 2875453 2833916 2783260 2726854 2669280 2615537 2569143
50610B569143l8023l0139k2771j5791r889o012m368m417n634q175j2749j9713
$$ 2569143 2531120 2500981 2478210 2462419 2452530 2446518 2442150 2437733 2432099 2423924 2411175 2391462
50598B391462k8184l6329m2999m8763n4798o0964o5698o7789o7534o5941o3621
$$ 2391462 2363278 2326949 2283950 2235187 2180389 2119425 2053727 1985938 1918404 1852463 1788842
50587A788842o0849n7968n5088n1819m7879m3630l9509l5369l0950k6620k2934
$$ 1788842 1727993 1670025 1614937 1563118 1515239 1471609 1432100 1396731 1365781 1339161 1316227
50576A316227j9685j6230j2608r515p073m448r62L002O547R172J0862J1854J2628
$$ 1316227 1296542 1280312 1267704 1258189 1251116 1246668 1245706 1248708 1255255 1264427 1275289 1287143 1299771
50563A299771J3709J5099J6211J6695J6927J7384J8043J8822K0218K2813K6359
$$ 1299771 1313480 1328579 1344790 1361485 1378412 1395796 1413839 1432661 1452879 1475692 1502051
50552A502051K9873L2677L4850L6826L8894M1069M2969M3893M3455M2104M0625
$$ 1502051 1531924 1564601 1599451 1636277 1675171 1716240 1759209 1803102 1846557 1888661 1929286
50541A929286L9186L7463L5620L4590L5091L7022M0066M4284M9622N5321O0495
$$ 1929286 1968472 2005935 2041555 2076145 2111236 2148258 2188324 2232608 2282230 2337551 2398046
50530B398046O5175P0166P5954Q2204Q8356R4206R9777J04989J09704J13815J17086
$$ 2398046 2463221 2533387 2609341 2691545 2779901 2874107 2973884 3078873 3188577 3302392 3419478
50519C419478J19020J19077J16868J12092J04518R4262Q1821O7665N1943L4772
$$ 3419478 3538498 3657575 3774443 3886535 3991053 4085315 4167136 4234801 4286744 4321516
50509D321516J6670j620j9577l6901n3131o7607p9840q9564r6346r9569r8993
$$ 4321516 4338186 4336566 4316989 4280088 4226957 4159350 4079510 3989946 3893600 3794031 3695038
50498C695038r5079q8476p9422o7898n4259l9422k4491j0356K352J3091K1199
$$ 3695038 3599959 3511483 3432061 3364163 3309904 3270482 3245991 3235635 3237987 3251078 3272277
50487C272277K5825K6300K2650J5520N329q154k5001m4058o3139q0324r4661j05753
$$ 3272277 3298102 3324402 3347052 3362572 3367901 3359747 3334746 3290688 3227549 3147225 3052564 2946811
50475B946811j13315j17383j18517j17298j13866j08259j01138r3768q7125q1111
$$ 2946811 2833496 2716113 2597596 2480298 2366432 2258173 2157035 2063267 1976142 1895031
50465A895031p4878o7980o1127n5546n1538m8052m4008l9611l5840l2863k9800
$$ 1895031 1820153 1752173 1691046 1635500 1583962 1535910 1491902 1452291 1416451 1383588 1353788
50454A353788k6101k2329j9145j6284j3096r678o730m578k918j509m60K53J058
$$ 1353788 1327687 1305358 1286213 1269929 1256833 1247155 1240425 1235847 1232929 1231420 1230960 1231213 1232271
50441A232271K306L775M887N347N405N571O057O612O892O952P151P673Q416R370
$$ 1232271 1234577 1238352 1243239 1248586 1253991 1259562 1265619 1272231 1279123 1286075 1293226 1300899 1309315 1318685
50427A318685J0760J2579J4372J5802J7142J8863K0851K2455K3321K3894K5079
$$ 1318685 1329445 1342024 1356396 1372198 1389340 1408203 1429054 1451509 1474830 1498724 1523803
50416A523803K7465L0863L4515L7858M1134M5021M9731N4683N9143O2741O5321
$$ 1523803 1551268 1582131 1616646 1654504 1695638 1740659 1790390 1845073 1904216 1966957 2032278
50405B032278O6812O7535O8079O8462O7820O5347O1128N5633M8945M1141L2924
$$ 2032278 2099090 2166625 2234704 2303166 2370986 2436333 2497461 2553094 2602039 2643180 2676104
50394B676104K4956J6845P704k439j2702k2809l3309m4092n3678o0576o4679o6739
$$ 2676104 2701060 2717905 2725609 2723170 2710468 2687659 2654350 2610258 2556580 2496004 2431325 2364586
50382B364586o7107o5601o2214n7188n0631m2718l4176k6013j8637j1718n117
$$ 2364586 2297479 2231878 2169664 2112476 2061845 2019127 1984951 1958938 1940301 1928583 1923466
50371A923466L92L664M308K969L82l552r383j7026k5447l3516m0686m6626n0863
$$ 1923466 1923858 1927522 1931830 1934799 1935181 1931629 1922246 1905220 1879773 1846257 1805571 1758945 1708082
50358A708082n3282n4528n5238n5113n3453n0411m7020m3961m1107l8260l5619
$$ 1708082 1654800 1600272 1545034 1489921 1436468 1386057 1339037 1295076 1253969 1215709 1180090
50347A180090l3296l1016k8577k6050k3369k0288j6973j4030j1671r470p191n292
$$ 1180090 1146794 1115778 1087201 1061151 1037782 1017494 1000521 986491 974820 965350 958159 952867
50335I52867m211l653l055k298j572r31l88j30k71o14r11j025p17K37J521K403
$$ 952867 948656 945003 941948 939650 938078 937147 936759 936629 936358 935744 934833 933808 933091 933328 934849 937252
50319I37252K700K990L618M151M234M259M602M823M471M071M455N458O130O057
$$ 937252 939952 942942 946560 950711 954945 959204 963806 968629 973100 977171 981626 987084 993214 999271
50305I99271N692N509N584N905O371O545O047N162M547M374M379M524M969N473
$$ 999271 1004963 1010472 1016056 1021961 1028332 1034877 1040924 1046086 1050633 1055007 1059386 1063910 1068879 1074352
50291A074352N563N326N317N691O013O039O024O209O606P297Q367R502J0380J1425
$$ 1074352 1079915 1085241 1090558 1096249 1102262 1108301 1114325 1120534 1127140 1134437 1142804 1152306 1162686 1174111
50277A174111J3427J6125J7947J7550J5011J1263P028K813o87k816l447k944j927
$$ 1174111 1187538 1203663 1221610 1239160 1254171 1265434 1272462 1275275 1274588 1271772 1268325 1265381 1263454
50264A263454j238j677l352n610p892j0336j3224j6208j8488j9439j8799j6613
$$ 1263454 1262216 1260539 1257187 1251577 1243685 1233349 1220125 1203917 1185429 1165990 1147191 1130578
50252A130578j3497j0598q750p749o829n688m594l648k568j256j16M90Q12J491
$$ 1130578 1117081 1106483 1097733 1089984 1083155 1077467 1072873 1069225 1066657 1065401 1065285 1065775 1066587 1068078
50238A068078K803M302N261N381M997M548M046L199J961O68l65j151j872k695
$$ 1068078 1070881 1075183 1080444 1085825 1090822 1095370 1099416 1102615 1104576 1105244 1104879 1103728 1101856 1099161
50224A099161l786n258o962q544r816j0853j1657j1996j1742j1108j0380r655
$$ 1099161 1095375 1090117 1083155 1074611 1064795 1053942 1042285 1030289 1018547 1007439 997059 987404
50212I87404q990q592q575q713q623q106p120n673l932k300j143m49J10Q73K045
$$ 987404 978414 969822 961247 952534 943911 935805 928685 923012 919080 916780 915637 915188 915298 916171 918216
50197I18216L644N440P050Q322R521J1011J2865J4886J6964J9183K1690K4535
$$ 918216 921860 927300 934350 942672 952193 963204 976069 990955 1007919 1027102 1048792 1073327
50185A073327K7627L0730L3568L5982L8004L9739M1230M2348M2721M1849L9562
$$ 1073327 1100954 1131684 1165252 1201234 1239238 1278977 1320207 1362555 1405276 1447125 1486687
50174A486687L6334L2945K9841K7025K4435K2176K0228J8305J5963J2598P465
$$ 1486687 1523021 1555966 1585807 1612832 1637267 1659443 1679671 1697976 1713939 1726537 1734002
50163A734002K33q431j7287k5645l3542m0740m6284m9430n0393m9652m7046m2333
$$ 1734002 1734235 1725804 1708517 1682872 1649330 1608590 1562306 1512876 1462483 1412831 1365785 1323452
50151A323452l6158k9759k3856j8494j3820j0219p742o108n467o491r374j3335
$$ 1323452 1287294 1257535 1233679 1215185 1201365 1191146 1183404 1177296 1171829 1165338 1155964 1142629
50139A142629j7381k1139k4495k6853k7348k5865k3330k0757j8207j5042j1122
$$ 1142629 1125248 1104109 1079614 1052761 1025413 999548 976218 955461 937254 922212 911090
50128I11090p403m973l779k805j522n40n74j314j872j963j936j866j311j10J222
$$ 911090 903687 898714 894935 892130 890608 890068 889494 888180 886308 884345 882409 880543 879232 879122 880344
50113H80344K089K474K736L092L476L650L381K680K044K159L245M766N920O276
$$ 880344 882433 884907 887643 890735 894211 897861 901242 903922 905966 908125 911370 916136 922056 928332
50099I28332N998N599N536N849O196O362O581P142P839Q258Q510R226J0723J2581
$$ 928332 934330 939929 945465 951314 957510 963872 970453 977595 985434 993692 1002202 1011428 1022151 1034732
50085A034732J4226J5549J6803J8292K0323K3104K6313K9086L0717L1355L1826
$$ 1034732 1048958 1064507 1081310 1099602 1119925 1143029 1169342 1198428 1229145 1260500 1292326
50074A292326L2965L5258L8766M3084M7529N1656N5532N9384O3192O6839P0321
$$ 1292326 1325291 1360549 1399315 1442399 1489928 1541584 1597116 1656500 1719692 1786531 1856852
50063A856852P3522P5897P6798P6120P4329P1918O9060O5741O1981N7912N3912
$$ 1856852 1930374 2006271 2083069 2159189 2233518 2305436 2374496 2440237 2502218 2560130 2614042
50052B614042N0502M7812M5045M0832L4221K5098J3671K0j5511l1705m6801n9471
$$ 2614042 2664544 2712356 2757401 2798233 2832454 2857552 2871223 2871243 2855732 2824027 2777226 2717755
50040B717755o9329p6498q1038q2926q2404q0097p6723p2714o8122o2834n6910
$$ 2717755 2648426 2571928 2490890 2407964 2325560 2245463 2168740 2096026 2027904 1965070 1908160
50029A908160n0825m5266m0618l6613l2667k8581k4843k2204k1050k1192k2079
$$ 1908160 1857335 1812069 1771451 1734838 1702171 1673590 1648747 1626543 1605493 1584301 1562222
50018A562222k3138k4034k4813k5695k6605k7089k6863k6284k5994k6110k6091
$$ 1562222 1539084 1515050 1490237 1464542 1437937 1410848 1383985 1357701 1331707 1305597 1279506
50007A279506k5476k4386k3217k2055k0687j9010j7203j5468j3840j2178j0261
$$ 1279506 1254030 1229644 1206427 1184372 1163685 1144675 1127472 1112004 1098164 1085986 1075725
49996A075725p879m976j709J638M811P517R268R475P865M932J847k60j169j699
$$ 1075725 1067846 1062870 1061161 1062799 1067610 1075127 1084395 1093870 1101735 1106667 1108514 1108254 1107085 1105386
49982A105386k874m899o988q255q612q762r334j0125j0324r445p967o803o230
$$ 1105386 1102512 1097613 1090625 1082370 1073758 1064996 1055662 1045537 1035213 1025768 1017801 1010998 1004768
49969A004768n637m444k924j763j016k9J635L648N442O856Q044R132J0283J1901
$$ 1004768 999131 994687 991763 990000 988984 988955 990590 994238 999680 1006536 1014580 1023712 1033995 1045896
49955A045896J4341J7479K0830K4165K7736L1895L6600M1387M5753M9476N2584
$$ 1045896 1060237 1077716 1098546 1122711 1150447 1182342 1218942 1260329 1306082 1355558 1408142
49944A408142N5087N6838N7719N7686N6518N3787M9474M4424L9627L5014K9679
$$ 1408142 1463229 1520067 1577786 1635472 1691990 1745777 1795251 1839675 1879302 1914316 1943995
49933A943995K3464J7581J3070R241M452j896r022j6339k4334l3563m3556n3248
$$ 1943995 1967459 1985040 1998110 2007351 2011803 2009907 2000885 1984546 1960212 1926649 1883093 1829845
49921A829845o1917o9101p4051p5987p4958p1781o7135o1162n4135m7021m0940
$$ 1829845 1767928 1698827 1624776 1548789 1473831 1402050 1334915 1273753 1219618 1172597 1131657
49910A131657l6154l1921k7379k2467j7863j4129j1040p861m251p11K004L764
$$ 1131657 1095503 1063582 1036203 1013736 995873 981744 970704 962843 958592 957881 959885 963649
$$ [...]
##END NTUPLES=NMR SPECTRUM
##END=
