
##TITLE=AC1337_BRAAS10080_6642190_wx7HlNb2sU
##JCAMPDX= 6.0         $$ Bruker NMR JCAMP-DX V2.0
##DATA TYPE= NMR SPECTRUM
##DATA CLASS= NTUPLES
##ORIGIN= BRUKER
##OWNER= Administrator
$$ 1.72 TOPSPIN		Version 2.1
$$ 2012-08-08 16:16:26.843 -0500  Administrator@TOPSPIN
$$ Compression mode = diff/dup
##.OBSERVE FREQUENCY= 400.02188249412
##.OBSERVE NUCLEUS= ^1H
##.ACQUISITION MODE= SIMULTANEOUS (DQD)
##.ACQUISITION SCHEME= undefined
##.AVERAGES= 8
##.DIGITISER RES= 22
##SPECTROMETER/DATA SYSTEM= spect
##.PULSE SEQUENCE= zg30
##.SOLVENT NAME= COFFEE_meoh
##.SHIFT REFERENCE= INTERNAL, COFFEE_meoh, 1, 14.98509
##AUDIT TRAIL= $$ (NUMBER, WHEN, WHO, WHERE, PROCESS, VERSION, WHAT)
$$ ##TITLE= Audit trail, TOPSPIN		Version 2.1
$$ ##JCAMPDX= 5.01
$$ ##ORIGIN= Bruker BioSpin GmbH
$$ ##OWNER= Administrator
$$ $$ C:\Bruker\TOPSPIN/data/COFFEE/nmr/AC1337_BRAAS10080_6642190_wx7HlNb2sU/10/pdata/1/auditp.txt
$$ ##AUDIT TRAIL=  $$ (NUMBER, WHEN, WHO, WHERE, PROCESS, VERSION, WHAT)
(   1,<2012-08-08 16:16:18.890 -0500>,<Administrator>,<TOPSPIN>,<go>,<TOPSPIN 2.1>,
      <created by zg
	started at 2012-08-08 16:15:10.781 -0500,
	POWCHK enabled, PULCHK disabled,
       configuration hash MD5:
       6B 1B 68 BB D9 2E 58 E2 7F 35 AD 54 07 DF 0E 41
       data hash MD5: 64K
       87 E5 79 90 48 57 1E 7E 5D E6 A9 D4 8F 60 01 FB>)
(   2,<2012-08-08 16:16:22.468 -0500>,<Administrator>,<TOPSPIN>,<proc1d>,<TOPSPIN 2.1>,
      <Start of raw data processing
       efp LB = 0 FT_mod = 6 PKNL = 1 PHC0 = 0 PHC1 = 0 SI = 32K 
       data hash MD5: 32K
       FA B7 41 C1 DC 99 47 00 DF F5 59 99 B0 41 B2 6C>)
(   3,<2012-08-08 16:16:22.843 -0500>,<Administrator>,<TOPSPIN>,<proc1d>,<TOPSPIN 2.1>,
      <pk PHC0 = 177.6599 PHC1 = 0 
       data hash MD5: 32K
       D6 24 6F EF B2 E7 F6 A6 D0 5D 85 F1 79 61 51 07>)
(   4,<2012-08-08 16:16:23.000 -0500>,<Administrator>,<TOPSPIN>,<proc1d>,<TOPSPIN 2.1>,
      <abs ABSG = 1 
       data hash MD5: 32K
       EF 28 FC 83 69 50 C3 D7 7F DE 38 67 52 0D 92 0D>)
(   5,<2012-08-08 16:16:23.125 -0500>,<Administrator>,<TOPSPIN>,<proc1d>,<TOPSPIN 2.1>,
      <abs ABSG = 2 
       data hash MD5: 32K
       6C 28 6D 50 CB F6 42 3F 1F 57 D4 3A 96 55 3E 44>)
(   6,<2012-08-08 16:16:23.156 -0500>,<Administrator>,<TOPSPIN>,<proc1d>,<TOPSPIN 2.1>,
      <abs ABSG = 3 
       data hash MD5: 32K
       D1 9F B4 31 C8 40 CF C1 62 CF 4E 4C D6 4C 04 32>)
(   7,<2012-08-08 16:16:23.187 -0500>,<Administrator>,<TOPSPIN>,<proc1d>,<TOPSPIN 2.1>,
      <abs ABSG = 4 
       data hash MD5: 32K
       40 0A E0 78 C5 26 C7 6D 90 C6 BF AB F0 33 7F 62>)
(   8,<2012-08-08 16:16:23.218 -0500>,<Administrator>,<TOPSPIN>,<proc1d>,<TOPSPIN 2.1>,
      <abs ABSG = 5 
       data hash MD5: 32K
       C2 E4 96 9C 3F 1D E6 A2 48 DD F3 7A E4 AD ED F7>)
$$ ##END=
$$ 
$$ $$ hash MD5
$$ $$ 6C B3 F0 61 16 13 BF 61 02 53 1A A4 CD ED 18 A7
##$RELAX= 
##$RELAX= 
##$RELAX= 
##$RELAX= 
##$RELAX= 
##$RELAX= 
##$RELAX= 
$$ Bruker specific parameters
$$ --------------------------
$$ [...]
150 150 150 150 150 150 150 150
##$TP07= 0
##$TPNAME0= <>
##$TPNAME1= <>
##$TPNAME2= <>
##$TPNAME3= <>
##$TPNAME4= <>
##$TPNAME5= <>
##$TPNAME6= <>
##$TPNAME7= <>
##$TPOAL= (0..7)
0.5 0.5 0.5 0.5 0.5 0.5 0.5 0.5
##$TPOFFS= (0..7)
0 0 0 0 0 0 0 0
##$TUNHIN= 0
##$TUNHOUT= 0
##$TUNXOUT= 0
##$USERA1= <user>
##$USERA2= <user>
##$USERA3= <user>
##$USERA4= <user>
##$USERA5= <user>
##$V9= 5
##$VALIST= <valist>
##$VCLIST= <CCCCCCCCCCCCCCC>
##$VD= 0
##$VDLIST= <DDDDDDDDDDDDDDD>
##$VPLIST= <PPPPPPPPPPPPPPP>
##$VTLIST= <TTTTTTTTTTTTTTT>
##$WBST= 1024
##$WBSW= 4
##$XGAIN= (0..3)
0 0 0 0
##$XL= 0
##$YL= 0
##$YMAX_a= 466873
##$YMIN_a= -610569
##$ZGOPTNS= <>
##$ZL1= 120
##$ZL2= 120
##$ZL3= 120
##$ZL4= 120
##$ABSF1= 14.98509
##$ABSF2= -5.573092
##$ABSG= 5
##$ABSL= 3
##$ALPHA= 0
##$AQORDER= 0
##$ASSFAC= 0
##$ASSFACI= 0
##$ASSFACX= 0
##$ASSWID= 0
##$AUNMP= <proc_prof1d_extract_pilot.lims>
##$AXLEFT= 0
##$AXNAME= <>
##$AXNUC= <1H>
##$AXRIGHT= 0
##$AXTYPE= 0
##$AXUNIT= <>
##$AZFE= 0.1
##$AZFW= 0.1
##$BCFW= 0
##$BC_mod= 0
##$BYTORDP= 0
##$COROFFS= 0
##$CY= 15
##$DATMOD= 1
##$DC= 0
##$DFILT= <>
##$DTYPP= 0
##$F1P= 0
##$F2P= 0
##$FCOR= 0.5
##$FTSIZE= 32768
##$FT_mod= 6
##$GAMMA= 0
##$GB= 0
##$INTBC= 1
##$INTSCL= 1
##$ISEN= 128
##$LB= 0
##$LEV0= 0
##$LPBIN= 0
##$MAXI= 10000
##$MC2= 0
##$MEAN= 0
##$ME_mod= 0
##$MI= 0
##$NCOEF= 0
##$NC_proc= -8
##$NLEV= 6
##$NOISF1= 0
##$NOISF2= 0
##$NSP= 0
##$NTH_PI= 0
##$NZP= 0
##$OFFSET= 14.98509
##$PC= 1
##$PHC0= 177.6599
##$PHC1= 0
##$PH_mod= 1
##$PKNL= yes
##$PPARMOD= 0
##$PPDIAG= 0
##$PPIPTYP= 0
##$PPMPNUM= 2147483647
##$PPRESOL= 1
##$PSCAL= 4
##$PSIGN= 0
##$PYNMP= <proc.py>
##$REVERSE= no
##$SF= 400.02
##$SI= 32768
##$SIGF1= 0
##$SIGF2= 0
##$SINO= 400
##$SIOLD= 32768
##$SPECTYP= <>
##$SREGLST= <1H.CDCl3>
##$SSB= 0
##$STSI= 32768
##$STSR= 0
##$SW_p= 8223.68421052631
##$SYMM= 0
##$S_DEV= 0
##$TDeff= 65536
##$TDoff= 0
##$TI= <>
##$TILT= no
##$TM1= 0
##$TM2= 0
##$TOPLEV= 0
##$USERP1= <user>
##$USERP2= <user>
##$USERP3= <user>
##$USERP4= <user>
##$USERP5= <user>
##$WDW= 1
##$XDIM= 32768
##$YMAX_p= 440960798
##$YMIN_p= -685024
##$CURPLOT= <Network HP LaserJet P1505>
##$CURPRIN= <$Network HP LaserJet P1505>
##$DFORMAT= <normdp>
##$LAYOUT= <+/1D_H.xwp>
##$LFORMAT= <normlp>
##$PFORMAT= <normpl>
##$SURQMSG= 1
$$ End of Bruker specific parameters
$$ ---------------------------------
##NTUPLES= NMR SPECTRUM
##VAR_NAME=  FREQUENCY,     SPECTRUM/REAL,   SPECTRUM/IMAG
##SYMBOL=    X,             R,               I
##VAR_TYPE=  INDEPENDENT,   DEPENDENT,       DEPENDENT
##VAR_FORM=  AFFN,          ASDF,            ASDF
##VAR_DIM=   32768,         32768,           32768
##UNITS=     HZ,            ARBITRARY UNITS, ARBITRARY UNITS
##FACTOR=    0.250966925370066, 1,           1
##FIRST=     8223.43324360094, 57652,        -302933
##LAST=      0,             -249575,         -125214
##MIN=       0,             -685024,         0
##MAX=       8223.43324360094, 440960798,    0
$$ Real data points
##PAGE= N=1
##DATA TABLE= (X++(R..R)), XYDATA
$$ [...]
19503A00082e9300l00380O7094f8392k98255c8637l29716H1449b60805J6350P1482
19492a72973B66402b33855A45074m9107c73109a19861B6726J42850c37999F9412
19481C1556c35288f0708j92943K9907H224b98299A26354a7950B24621a23048J878
19470a21170k21775r892E6361B268b39707G4581b52740A87065a98618C6918L19136
19459C56054c69998a06951K8634A31212b2882j54322c6014k33274J05271n3664
19449b17681a4386A32100k0006a1030H5596i2747B31136A9936R0214d50564a3823
19437D8236a15341J0611A99489K63511a17180k03325A14634a429k66806R0253
19427a77982O2719F8660J01339a1187A1011a72292J8573o5793l4989I7995b22227
$$ y = [100082, -59300, -359680, -292586, -68392, -366647, -38637, -368353, 81449, -260805, -244455, -172973, 266402, -233855, 145074, 95967, -373109, -119861, 26726, 169576, -337999, 69412, 31556, -335288, -60708, -253651, -223744, 8224, -298299, 126354, -17950, 224621, -123048, -121170, -342945, -352837, 56361, 2268, -239707, 74581, -252740, 187065, -198618, 36918, 356054, -369998, -106951, -78317, 131212, -22882, -177204, -36014, -269288, -164017, -217681, -14386, 132100, 112094, -11030, 85596, -92747, 231136, 19936, 110150, -450564, -13823, 48236, -115341, -104730, 199489, 463000, -117180, -320505, 114634, -1429, -268235, -177982, -115263, 68660, 169999, -11187, 11011, -172292, -153719, -219512, -254501, 97995, -222227]
19415c10085a09033J3252o5178B5766d02304H4628h05p6011j40397G2672b8282
19403a77456c7784j4839r1572h100B91747b85135g5827k12966B12004i9571j30785
19392b30356M8724E4457a71705o529k86369a03558L0260B4469c0450k23349B9424
19380A49530b32581i2134j5336a0659p0769A49059g1690B8728b25484N1174P7740
19369i6570n1640I778b87846R8033A19165b31689H3223b26244M7076D6755d4304
19357E9150A8919i3660k63875A42662c9209j337k05328a03300n4981f1834C2946
19345a71577G1293i3560d3426A92599i1011j9529A56086a27663k1412k189d6973
19333a81489A7822R7545c1295a1524n3205k24737j6947b0763l6883j76966F5342
$$ y = [-310085, -109033, -95781, -160959, 25766, -402304, 84628, -805, -76816, -217213, 72672, -28282, -177456, -37784, -52623, -144195, -8100, 291747, -285135, -75827, -288793, 212004, -99571, -230356, -181632, 54457, -171705, -178234, -464603, -103558, -73298, 24469, -30450, -253799, 29424, 149530, -232581, -92134, -107470, -10659, -81428, 149059, -71690, 28728, -225484, -174310, -96570, -148210, 9778, -287846, -189813, 119165, -231689, 83223, -226244, -179168, 46755, -44304, 59150, 18919, -93660, -357535, 142662, -39209, -40546, -245874, -103300, -158281, -61834, 32946, -171577, 71293, -93560, -43426, 192599, -91011, -110540, 156086, -127663, -149075, -151264, -46973, -181489, 17822, 115367, -31295, -11524, -64729, -289466, -306413, -20763, -57646, -234612, 65342]
19321b93943J09720g1831k8920j05370h8863C3482J04792E0863c8784k49928a03616
19309a17k11929F7982a62900b3251A93474F1612a99872J3017m2121k7501H8046
19297b31220A43206o200E8021b41540M3869B13285a75605l42175a90987Q2507
19287a08480B40449i8062A17529d3228C7323f1601B23037q6142J07668c23437
19276a42529A915c2726j39979a7467o3580b2302j44755E2377a04389O172C0394
19264c93656a75694D01897f3903p828r7372o629G7318F072a95618k1049i3393
19252c5755B84974j40238g7721l59456h6554n4799n197K9230A40084c24267C7137
19240a53182J9390I9360c54297F1732e2600B06145E0212f0633A99080Q1466a5382
$$ y = [-293943, -184223, -71831, -100751, -206121, -88863, 33482, 138274, 50863, -38784, -288712, -103616, -117, -212046, 67982, -162900, -23251, 193474, 61612, -199872, -186855, -228976, -256477, 88046, -231220, 143206, 137006, 58021, -241540, -197671, 213285, -175605, -517780, -190987, -108480, 240449, -98062, 117529, -43228, 37323, -61601, 223037, 136895, 244563, -323437, -142529, 1915, -32726, -172705, -17467, -81047, -22302, -167057, 52377, -104389, -98217, 30394, -393656, -175694, 401897, -63903, -71731, -169103, -175732, 77318, 6072, -195618, -216667, -93393, -35755, 284974, 144736, -77721, -437177, -86554, -141353, -146550, -117320, 140084, -324267, 37137, -153182, -133792, 99360, -354297, 61732, -52600, 206145, 50212, -60633, 199080, 280546, -15382]
19228D1339b92365M8584H9317e0034A2333a10662k13515C06325a83351A16453
19217G8010f497k29061g7127L8017F3577J84328b3043r0795o3379D9533g2423
19205B98756b35846J6393b8274j04965e2455C2123b41699Q3097L7446J9684J0226
19194i1246k75438J54622d4942C59176c86980A58205a07429F9470k2845b35026
19183a87540A26886b04223e8409B50061d07102J73152m3890b4444q0578j70626
19173b75648D9709d33939h8036f709k15360B10633a09460o2534A64936M038d6445
19161F3945b10624D8553b50700Q8497g4230A7345O1453d936A69770k5288f7573
19149b48949k0334J10608b6317j38852C1160c02262D7814a04995m6057A1440J85185
$$ y = [41339, -292365, -243781, 89317, -50034, 12333, -110662, -324177, 306325, -183351, 116453, 78010, -6497, -235558, -77127, -39110, 63577, 247905, -23043, -113838, -177217, 49533, -72423, 298756, -235846, -219453, -28274, -133239, -52455, 32123, -241699, -158602, -121156, -101472, -91246, -366684, -212062, -44942, 359176, -386980, 158205, -107429, 69470, 46625, -235026, -187540, 126886, -204223, -58409, 250061, -407102, -233950, -277840, -24444, -105022, -275648, 49709, -433939, -88036, -6709, -222069, 210633, -109460, -171994, 164936, 168974, -46445, 63945, -210624, 48553, -250700, -162203, -74230, 17345, 78798, -4936, 169770, 144482, -67573, -248949, -269283, -158675, -26317, -165169, 31160, -302262, 47814, -104995, -151052, 11440, 196625]
19138A96625a38561j47907A46390c05041Q8288D2067a80910G7197K20330b7553
19127b7566G5509K41929f6257A32565b0689I0083a63897C4693R824d2332k13506
19116b55838D9458a69763k38350B09745e2989F5740c56280h2265C38806c3100
19105C44709j70345b0528A6369b16277D5974N9339a29672p9485B88480C1981b24855
19093B29976H9289K35871b3990Q607B27435A1435a78790F7803a72392H6280b38003
19081b95221d0085B30337p2561m5671b05554r628N4613m060J5706A16837d6989
19069f4454k44366H4061a76899k52414J09135f4776i288j77371k6999d3356J6511
19058b6845p871n458B24837a17597B28503e0238A47186f7173A28769l9647a09150
$$ y = [196625, -138561, -286468, 146390, -305041, -216753, 42067, -180910, 77197, 297527, -27553, -27566, 75509, 317438, -66257, 132565, -20689, 90083, -163897, 34693, 44517, -42332, -255838, 49458, -169763, -408113, 209745, -52989, 65740, -356280, -82265, 338806, -33100, 344709, 174364, -20528, 16369, -216277, 45974, 105313, -129672, -209157, 288480, 31981, -224855, 229976, 89289, 325160, -23990, -15383, 227435, 11435, -178790, 67803, -172392, 86280, -238003, -295221, -40085, 230337, 157776, 112105, -205554, -215182, -160569, -164629, -148923, 116837, -46989, -64454, -308820, 84061, -176899, -429313, -320178, -64776, -9288, -186659, -213658, -43356, -26845, -34716, -40174, 224837, -117597, 228503, -50238, 147186, -67173, 128769, 89122, -109150]
19046b4308k81331G9447i272j42083K5798k9402j60505a05156N2162l51172J66170
19035b37996b3250A7473a07677k5437L1134F5548B4988b5048B10473b68170k3604
19024b91774A27399D5514c6931o6842B11652c6180j8637Q75j57898A05328c57147
19012A50801f6399A26408c43279a614B96728I2652K06510c17450J24563P7669
19002a15218o9968j10560C0784J8469K0401j667l1216d027A58472d40381f0946
18990A88009l6232a22817j37112r9269A2351a69342O2008D6512a14322k67106
18980c81428h5070j1385A17153N6416a1445A33483e5858C78725b2258A79237J02043
18969B81280a532A67616e6375A33486a80925B83811a48729G6446a01730P993j68315
$$ y = [-24308, -305639, 79447, -9272, -151355, -125557, -154959, -315464, -105156, -52994, -404166, -237996, -23250, 17473, -107677, -133114, -101980, 65548, 24988, -25048, 210473, -268170, -291774, 127399, 45514, -36931, -103773, 211652, -36180, -54817, -53942, -211840, 105328, -357147, 150801, -66399, 126408, -343279, -1614, 296728, 92652, 299162, -317450, -192887, -115218, -185186, -295746, 30784, 49253, 69654, 67987, 36771, -4027, 158472, -440381, -60946, 188009, 151777, -122817, -259929, -359198, 12351, -169342, -107334, 46512, -114322, -381428, -85070, -96455, 117153, 173569, -11445, 133483, -55858, 378725, -22258, 179237, 281280, -1532, 167616, -56375, 133486, -180925, 283811, -148729, 76446, -101730, -93737, -262052]
18958b62052k15702f0885A91212g186A33207b25898A63142h9422o1001D3016j829
18947D1187b25778h4810j71380A95750i5914c783l10913a25156B3751D730J8613
18936B3343l846a83219F6707a96451b1378A75939b646k1307B34874c2044B39233
18924b01897a3612k44008b8272n1023p3922A15335J27949g1776j92245H7480d0247
18912a77730F7930K46449m6034K53462j03964R0920k50539E8694o213J31307j2230
18901A71558P701C0828A3793c51487J53016D1417a19485a711H8579a87547k12173
18890c99720a32882I418L86019a06961a0252p4742F6557k2336a4676j66067k8421
18879b09164A93357c6071k10829e1725n361J4034j15530d3520h212A71967A5599
$$ y = [-262052, -477754, -60885, 191212, -7186, 133207, -225898, 163142, -89422, -150423, 43016, 41187, -225778, -84810, -256190, 195750, -95914, -3783, -314696, -125156, 23751, 4730, 23343, 19497, -183219, 66707, -196451, -21378, 175939, -2646, -23953, 234874, -32044, 239233, -201897, -13612, -257620, -28272, -79295, -153217, 115335, 243284, -71776, -264021, 87480, -40247, -177730, 67930, 314379, 268345, 521807, 417843, 508763, 258224, 58694, 52481, 183788, 171558, 179259, 30828, 13793, -351487, -198471, 41417, -119485, -1711, 88579, -187547, -399720, -132882, 9418, 395437, -106961, -10252, -84994, 66557, 44221, -14676, -180743, -209164, 193357, -36071, -246900, -51725, -57086, -43052, -158582, -43520, -8212, 171967, 15599]
18867F7254P5569b91865b3067j86916G9208d0143j55242A35795C263e1939K594
18856d9345A6441b00639m3767O7416j19568e078l136m8023F8274R5906k2381N0437
18844A92236m53l8779d7052G5067b89069a41435J8542A32087b02874B22425j07769
18833A14656B0970J13260b20626f6026A5851b59996G5842a59666D5747a6495k3712
18822d0207q0872F2846b7280A53661l1608Q2499b5253I1385e8496B01800J99553
18811D01353F7432b5817B27048J81234A00106k7748k4564f9310E2499K6604b53064
18799e8144k97527A526c9851m0053C85086j52261a89144a1044C3372g5014o5217
18788a40231I307b83376I9555a14832M4146d596A19828b3130n3571p01H6553d4749
$$ y = [67254, 142823, -291865, -23067, -209983, 79208, -40143, -195385, 135795, 3263, -51939, -49345, 16441, -200639, -244406, -176990, -296558, -5078, -8214, -56237, 68274, 164180, 141799, 192236, 191783, 153004, -47052, 75067, -289069, -141435, -122893, 132087, -202874, 222425, 114656, 20970, 134230, -220626, -66026, 15851, -259996, 75842, -159666, 45747, -16495, -40207, -121079, 62846, -27280, 153661, 122053, 204552, -25253, 91385, -58496, 201800, 401353, 67432, -25817, 227048, 408282, 100106, 72358, 47794, -69310, 52499, 79103, -253064, -58144, -355671, 1526, -39851, -79904, 385086, 232825, -189144, -11044, 33372, -75014, -140231, 9307, -283376, 99555, -114832, -70686, -4596, 119828, -23130, -76701, -77402, 86553, -44749]
18775A86095b62235d1051j27933B08144a054k61222G122a67248d9074j67810a7415
18763B65951c13161f7845m09762B4957a47098A042g0867g793o9181j05080j1518
18752a93572k2308B09240q5441l6680J48109a994k70771N3031j42207J35285a2475
18740b15650r4125B79410c6785k86922O0120B3988J3309J748N8269A2630M1646
18729E4276J75266k2420a4436m8484j5283l27198a16661j32299M7242L0301g140
18717H3808i0701M1620A6801c01443i4633j22996H5233A0463b38565Q5434k0621
18706a73752R067e2868B19641a93105H7672d3917j08598j60476L431J09921A64423
18694A4317c08678e3293j49362A0766g8624l0480l17671G9677c925C48488H2241
$$ y = [186095, -262235, -41051, -168984, 208144, -1054, -262276, 7122, -167248, -49074, -216884, -17415, 265951, -313161, -67845, -477607, 24957, -147098, 1042, -70867, -7793, -76974, -182054, -193572, -215880, 209240, 123799, 87119, 235228, -1994, -272765, -219734, -361941, -226656, -12475, -215650, -309775, 279410, -36785, -323707, -263587, 23988, 37297, 39045, 97314, 12630, 54276, 229542, 207122, -14436, -62920, -78203, -405401, -116661, -248960, -201718, -171417, -7140, 83808, -90701, -49081, 16801, -301443, -94633, -217629, 85233, 10463, -238565, -153131, -173752, -164685, -52868, 219641, -193105, 87672, -43917, -152515, -312991, -309560, -199639, 164423, 14317, -308678, -53293, -202655, 10766, -78624, -109104, -426775, 79677, -3925, 348488, 82241]
18682F7016d9499C68271e6032B2285b10614j58288a19661A6697a87198A954h7440
18670h1671j92865H7539J93655b2782B6262g9736q0566D0583G88K09768c81926
18658I3228D044P4097d8632k1807b6615C343f1007G2595b7236B55703c67737a49204
18645B82697c85328J47930O4508K0648k9954F1398K35880g0506A38894f5215j70635
18634b35850g7985D6084d29095a42580n8388k8897A3544a10544A44159K2716b16305
18622f5334C8759J30580i0227C50861a48494B4269i110m5207b5062j7988k65395
18611c08445K8975a6487D8258O653j3242b22561C8262a58027j04980J5329A79252
18599b55097b0508j81140f5095A11320a50840A05573d43097J34718e2536k59691
$$ y = [67016, -49499, 368271, -56032, 22285, -210614, -368902, -119661, 16697, -187198, 1954, -87440, -81671, -274536, 87539, 281194, -22782, 26262, -79736, -160302, 40583, 788, 210556, -381926, 93228, 4044, 78141, -48632, -70439, -26615, 3343, -61007, 72595, -27236, 255703, -367737, -149204, 282697, -385328, -237398, -172890, -152242, -182196, 61398, 297278, -70506, 138894, -65215, -235850, -77985, 46084, -429095, -142580, -200968, -229865, 13544, -110544, 144159, 166875, -216305, -65334, 38759, 169339, -90227, 350861, -148494, 24269, -9110, -54317, -25062, -43050, -308445, -279470, -16487, 48258, 54911, 41669, -222561, 38262, -158027, -263007, -247678, 179252, -255097, -20508, -201648, -65095, 111320, -150840, 105573, -443097, -308379, -52536, -312227]
18589c12227A60807a79580N2010o498e005n1186E2718c2575A54493C021i4988
18577a70535e6571r0448J2687b1515F0541b18433L4656f7418l26613A37455a31023
18565A21711a87076j35347B03660i7171H5658A6948N2079J3970C93P5162a05919
18553F0813f7525A31398O0583J33357a91825M2182N0614A84170b1511l7496B50773
18541I1511b20464D7689b08583p4990a15916B66147a65619j04108i3889E2034
18530b02356g5977j60712b4346a1411k30212A56274a62082I8021k356h0329B0684
18518a64227A45664B7915b79167A26322a10654j40861A40738g9633l448k90470
18508c73551I434d01285J64453P0283B8140R9483j2183b4771D4685b4024j31064
$$ y = [-312227, 160807, -179580, -127570, -134068, -5005, -56191, 52718, -32575, 154493, 3021, -94988, -170535, -56571, -147019, -134332, -21515, 60541, -218433, -183777, -67418, -394031, 137455, -131023, 121711, -187076, -322423, 203660, -97171, 85658, 16948, 69027, 82997, 393, 75555, -105919, 60813, -67525, 131398, 191981, 325338, -191825, -149643, -99029, 184170, -21511, -59007, 250773, 91511, -220464, 47689, -208583, -283573, -115916, 266147, -165619, -269727, -93889, 52034, -202356, -75977, -236689, -24346, -11411, -241623, 156274, -162082, 98021, 95665, -80329, 20684, -164227, 145664, 27915, -279167, 126322, -110654, -251515, 140738, -79633, -83081, -373551, 9434, -401285, -236832, -166549, 28140, 127623, 115440, -24771, 44685, -24024, -155088]
18497a55088f8639K574o2567M6775A99481G4177N1150J52816I5844b77287b7472
18485a358D1667A2833c1238F1619J27791a46680L4429G7946I383c14912B92974
18473D7208c5555B7744f2197A10884a71200C9720Q8171c68789J61910A60601l0205
18462A30396j115d10362J23979j91284R7795B9533i9345B24576b14228i3677d4527
18450b9391H6273c2786r8305A03259e3248j02956C62560A53561J19738h2260k46080
18439c28340E0559c29785A60721J58362D3203q236O0026f5845j3137A97507E130
18427a13687J5283D773a33074j471A53688b02271A38488b00859N8133H548h7049
18415a02074n3089d7123C93903g8331A06397d7795j6631H0388J00066B6826c1869
$$ y = [-155088, -68639, -66065, -128632, -81857, 199481, 74177, 125327, 278143, 95844, -277287, -27472, -1358, 41667, 12833, -31238, 61619, 189410, -146680, -112251, 77946, 9383, -314912, 292974, 47208, -35555, 27744, -62197, 110884, -171200, 39720, 127891, -368789, -206879, 160601, 130396, 129281, -410362, -286383, -477667, -379872, 29533, -99345, 224576, -214228, -93677, -44527, -29391, 86273, -32786, -131091, 103259, -53248, -156204, 362560, 153561, 273299, -82260, -328340, 50559, -329785, 160721, 319083, 43203, 34967, 94993, -65845, -78982, 197507, 5130, -113687, -98404, 4773, -133074, -134545, 153688, -202271, 138488, -200859, -142726, 8548, -87049, -102074, -155163, -47123, 393903, -78331, 106397, -47795, -64426, 80388, 180454, 26826, -31869]
18403e7913l5448H9751P7734f6728k199j17240b7823A51170g1073j55498B04306
18391G102a52390J896B1425b81761a22288Q27l50170a85479d2065n0466j63401
18380b55932A84788G7455O0188d5889j98901c588A60305a51307o7244l54867h8034
18368a01673K3339A272M6704a7084E1298J73983a20150B17889A9777Q6294K31424
18357C37495b5641C6215J51146h9253C052N9798P5072a7510B03276H8487i0725
18345b8443p2205A452f8126n9829D593Q5650c32473a9909j97461A1708a82826
18333b39465c1251j3469F2008K21508h0992c2518k25180A4736h4857B5464L13213
18322C38677a40670n7220D3053a89676B8699f8620B0961d4152j90906B0043h1742
$$ y = [-57913, -93361, 89751, 167485, -66728, -68927, -186167, -27823, 151170, -71073, -226571, 204306, 7102, -152390, -150494, 21425, -281761, -122288, -121461, -471631, -185479, -42065, -92531, -255932, 184788, 77455, 137643, -45889, -244790, -3588, 160305, -151307, -218551, -573418, -88034, -101673, -78334, 1272, 47976, -17084, 51298, 225281, -120150, 217889, 19777, 106071, 337495, -25641, 36215, 187361, -89253, 3052, 62850, 137922, -17510, 203276, 88487, -90725, -28443, -100648, 1452, -68126, -127955, 4593, 90243, -332473, -19909, -217370, 11708, -182826, -239465, -31251, -44720, 62008, 283516, -80992, -32518, -257698, 14736, -84857, 25464, 338677, -140670, -197890, 43053, -189676, 28699, -68620, 20961, -44152, -235058, 20043, -81742]
18310C8725a72437c6949k58599N1701B13413g9734K4150j50786F2779J81943i4917
18298I4269b40585k36565C8604b34215a13022e716G641b53379J22827d2710A7423
18286D01253d5361J6319r6864M1812p9437A83046a97151O1314D1626g4872H9445
18274a14912N0827r2527n4742i0480b1835n9433n617E0539k1080i0332k51A32360
18261c33734c2954D7062B3260g192n2631k54547D4320M6747f0025k02840g08A26701
18248D4296L8332k1397b3657k24885a9130k51570a28468G5987a34862d9891A39842
18236b00151O0689A46943k6551M255k0388J90669h582l26562A63357b6660C79031
18224A860b02932R8444G8835J63914H0762K87242j76311J57766a18846K9609A32131
$$ y = [38725, -172437, -36949, -295548, -243847, 213413, -79734, -55584, -206370, 62779, 244722, -94917, 94269, -240585, -477150, 38604, -234215, -113022, -5716, 7641, -253379, -130552, -42710, 17423, 401253, -45361, -29042, -125906, -84094, -163531, 183046, -197151, -135837, 41626, -74872, 89445, -114912, -64085, -156612, -211354, -90480, -21835, -81268, -86885, 50539, 29459, -90332, -90583, 132360, -333734, -32954, 47062, 23260, -7192, -59823, -314370, 44320, 91067, -60025, -262865, -708, 126701, 44296, 82628, 61231, -23657, -248542, -19130, -270700, -128468, 75987, -134862, -49891, 139842, -200151, -139462, 146943, 120392, 124647, 104259, 294928, -8582, -335144, 163357, -26660, 379031, 1860, -202932, -104488, 78835, 242749, 80762, 368004, 191693, 349459, -118846, -89237, 132131]
18212h5224B9161a1092j21662l2880P3899B05757a43633O7769B09563I4250K41962
18201C36212h325j10298a2345j91237Q0260A06551l94J97807A31855J22055q8771
18190A65139E8687N2428Q6977a70323O7460m759A39576e4567C9936A4983a345
18178b27677K9999e1316k51654J10240B46308A05061a05504C6334a09920o4324
18168a74244q9762A2139R0658b57701b5367j02677C3423b82450D2247G161P7065
18157H4226a61717H7340C2240a35972c9900J2737j23438c534l16605A21922D3530
18145f7365j43355h4992d0421j63009D5610j0542c2808B16289j03509f6353j03321
18134a69674A19840N6178e2417a6327k10142N6605Q2435j40821C6766c2003A44458
$$ y = [-85224, 29161, -11092, -132754, -165634, -91735, 205757, -143633, -75864, 209563, 94250, 336212, -8325, -118623, -12345, -203582, -123322, 106551, 106157, 303964, 131855, 253910, 165139, 58687, 111115, 198092, -170323, -102863, -107622, 139576, -54567, 39936, 14983, -1345, -227677, -197678, -51316, -302970, -192730, 246308, 105061, -105504, 36334, -109920, -174244, -264006, 12139, 102797, -257701, -25367, -128044, 33423, -282450, 42247, 7161, 84226, -161717, 87340, 32240, -135972, -39900, -27163, -150601, -3534, -320139, 121922, 43530, -67365, -210720, -84992, -40421, -203430, 45610, 35068, -32808, 216289, 112780, -66353, -169674, 119840, 176018, -52417, -16327, -226469, -169864, -87429, -228250, 36766, -32003, 144458]
18122A91518I604h2314F6766j8382a75268A00495K90079c55130a04146q9406A68275
18110A65047b29261j00933a03316H6208f9333I4271K69275i5332A91994f6764
18099C17142a40803C06634d07033F2257a3234N879A80892h5906k73147J51041
18089b08012e9999r5899e8679E8063c23462B3718K57155D9860J17203a1108k68577
18078b79685E2539L819b23350d1684J5264j47131P7645o8634G8946K3652h3941
18066d0980l70515J36568E002b3242l2032l11418F0855c07241a8878P43j32788
18055a50923f0987H5210j8905a47917n8949m3273K0957O3154A30865a45790H8992
18043c8970A5822b40282C0329i8122j02273F3362O6371N9384H0341R3880h8443
$$ y = [191518, 9604, -82314, 66766, 48384, -175268, 100495, 390574, -355130, -104146, -193552, 168275, 165047, -229261, -330194, -103316, 86208, -69333, 94271, 363546, -95332, 191994, -66764, 317142, -140803, 306634, -407033, 62257, -13234, -7355, 180892, -85906, -359053, -208012, -59999, -155898, -58679, 58063, -323462, 23718, 280873, 49860, 167063, -11108, -279685, 52539, 56358, -223350, -41684, -26420, -173551, -95906, -164540, 78946, 102598, -83941, -40980, -411495, -274927, 5002, -23242, -55274, -366692, 60855, -307241, -18878, -18135, -150923, -60987, 85210, 66305, -147917, -206866, -250139, -229182, -166028, 130865, -145790, 88992, -38970, 15822, -240282, 30329, -98122, -200395, 63362, 129733, 189117, 80341, 174221, -88443]
18031a0158l5517m5542K9343k86267D24786F3317J44079h07A77786b31976l7936
18020b69912B62260d6595A30567b99303A88896e0169H3912b98670E2335J84047
18010B36382d21565A80501b7102k59662A80423b30649E9236b36307J03843C18895
17999f7802n0396e067C91434f4617A18294b5130A52638J02718H692Q2222a36391
17987A15971i6364A77724b02746a9987j5333B85743A18585a60266g0655k09604
17977b80259D8745J34638q074b39519D2786c15852a30571A76493D2711r943J64188
17966A96956d6547e856G811e0161C2003M23929A26743J04524a93087I6814K74960
17955C71774A80434k3564b67198A06008L713b0712C4219e0831A7864J89099J95496
$$ y = [-10158, -45675, -91217, -61874, -348141, 424786, 63317, 207396, -807, 177786, -231976, -269912, 262260, -46595, 130567, -299303, 188896, -50169, 83912, -298670, 52335, 236382, -421565, 180501, -27102, -286764, 180423, -230649, 59236, -236307, -132464, 318895, -67802, -118198, -5067, 391434, -64617, 118294, -25130, 152638, 255356, 8692, 90914, -136391, 115971, -96364, 177724, -202746, -19987, -35320, 285743, 118585, -160266, -70655, -280259, 48745, 183383, 175309, -239519, 42786, -315852, -130571, 176493, 42711, 32768, 196956, -46547, -5856, 7811, -50161, 32003, 455932, 126743, 231267, -193087, 96814, 371774, 180434, 156870, -267198, 106008, 109721, -20712, 34219, -50831, 17864, 206963, 402459]
17944D02459j44632I4940d514B52081m5623c2715G1734a44303A37922C923K4265
17933B8188J5683M0699M9596n8714a6249m79177C17515M9954A25405b1143C62328
17921a37957B3846J01955a00633A87998c1279j75047D1652a17849C08358d6136
17910I9473O7023c56313c889H388J76923M8589d5271q9388b4238j50865e3819
17898b53816A50883m3429m1001a40202k97859A36060J77635b49463j676i3864
17887A33603k62h2588b1563F6062M1222g4333C5804Q1167q529h4075k5246M6682
17875f2639B29110g4798b4972A38391J65881j31085B0225b12637E482K2978r058
17864A9402O8578g0985j05508b1034i044A23512A0633R8382A3276K67500c0502
$$ y = [402459, 257827, 94940, -4514, 252081, 206458, -32715, 71734, -144303, 137922, 3923, 28188, 43871, 84570, 134166, 75452, -16249, -495426, 317515, 367469, 125405, -21143, 362328, -137957, 23846, 125801, -100633, 187998, -31279, -206326, 41652, -117849, 308358, -46136, 99473, 166496, -356313, -3889, 8388, 185311, 233900, -45271, -134659, -24238, -175103, -53819, -253816, 150883, 107454, 66453, -140202, -438061, 136060, 313695, -249463, -251139, -93864, 133603, 133341, -82588, -21563, 66062, 107284, -74333, 35804, 116971, 108442, -84075, -109321, -62639, 229110, -74798, -24972, 138391, 304272, 173187, 20225, -212637, 5482, 28460, 19402, 87980, -70985, -176493, -21034, -9044, 123512, 10633, 109015, 13276, 280776, -30502]
17852D61730j22615j04247q8443N6518e6038A15273N3302B6409L02271H9950E358
17840i7282k369c9584l60127F8599g1187A09883j8296d1285K002k20896D34957
17828a10086A26188C2707P7877K823L0485a41400B03567a0145A01547a39230C29815
17816H9043J36410b85794A73051l8911M5957i2571F3007a04927B7337J79366K4851
17805B31554q7070A3555a18764F19c20440C2610L38471c28575A55481O6296a03413
17793b829C3956O1695c06436B61350a38798A3322a07516N2347C467i275G9427
17781c0467A78293p7519D0655c04836J38526A78822m5055a66735A44499k7034
17771A17465b56492A66056M8823a38363I6393C0305K82994C972b41908C64540
$$ y = [461730, 339115, 234868, 146425, 202943, -56038, 115273, 168575, 26409, 328680, 89950, 5358, -97282, -99651, -39584, -399711, 68599, -71187, 109883, 91587, -41285, -39283, -260179, 434957, -110086, 126188, 32707, 110584, 113407, 143892, -141400, 203567, -10145, 101547, -139230, 329815, 89043, 225453, -285794, 173051, 134140, 180097, -92571, 63007, -104927, 27337, 206703, 231554, 144484, 13555, -118764, 619, -320440, 32610, 371081, -328575, 155481, 221777, -103413, -2829, 33956, 95651, -306436, 261350, -138798, 13322, -107516, -55169, 3467, -9275, 79427, -30467, 178293, 100774, 40655, -304836, -166310, 178822, 133767, -166735, 144499, 117465, -256492, 166056, 214879, -138363, 96393, 30305, 313299, 3972, -241908, 364540]
17760A47011a47969A78188D231J63809n0611C1231a07675A8411L7925K159h8652
17748c66590A17931h2304b2539A06831L220L90853d6368B93834a0872B63232J52701
17737D15933a3046k3454B89611A21422O2202b14942A46279J58908o9292a03427
17726g1621B3499f3873D0360g9113A09993a5335A56189d0844A05382K8963O5552
17715A99897D9010O6696m186h4832A34463d0292A61520J27432A641b34686A50480
17703D33399k1525h4147C04002o1458a70077A06960J36855f4161l87542I0583
17692G4603a59372p3851B19632a57353e9150A09456K1147a6463A07252k329D7881
17680E2474J74326J64867b4220A73518G2750J58262l0676K62471i0441B142a57705
$$ y = [147011, -147969, 178188, 4231, 168040, 117429, 31231, -107675, 18411, 56336, 58495, -88652, -366590, 117931, -82304, -22539, 106831, 110051, 500904, -46368, 293834, -10872, 263232, 415933, -13046, -36500, 289611, 121422, 183624, -214942, 146279, 305187, 235895, -103427, -71621, 23499, -63873, 40360, -79113, 109993, -15335, 156189, -40844, 105382, 134345, 199897, 49010, 115706, 111520, -84832, 134463, -40292, 161520, 288952, 1641, -234686, 150480, 433399, 411874, -84147, 304002, 242544, -170077, 106960, 243815, -64161, -451703, 90583, 74603, -159372, -233223, 219632, -157353, -59150, 109456, 130603, -16463, 107252, 104923, 47881, 52474, 226800, 391667, -24220, 173518, 72750, 231012, 200336, 462807, -90441, 2142, -157705]
17668G9491O3118A5294J6357K77382K3822b9160A37817K28778j44415m7984h246
17656C99694A76586a37072A06552i6556B31553c1420B57744p2199E7581h175A45191
17644F0036J17713P2539G294K97278f058A33465R562c37284A29388J29783J52955
17633D12126A42626n8748J90021D845J33258K67216B1107K34290D2093c5778C22143
17621E1090F908L29623A57456E5727L986R2668a49273A11448b8476a3018B35926
17609D80690g4158I931N9210K14422k3536m124j05329K98135A08761B167J92805
17598A94972J95488j12214j19902b53915a5599B65437I0060a55614A46826f0793
17587A63886g8887C15369D2478J64986J39780g2473c1709A16875d8761E5108d8944
$$ y = [79491, 142609, 15294, 31651, 309033, 332855, -29160, 137817, 366595, 222180, 174196, -8246, 399694, 176586, -137072, 106552, -96556, 231553, -31420, 257744, 185545, 57581, -8175, 145191, 60036, 177749, 250288, 7294, 304572, -6058, 133465, 143027, -337284, 129388, 259171, 412126, 142626, 83878, 273899, 4845, 138103, 405319, 21107, 255397, 42093, -35778, 322143, 51090, 6908, 336531, 157456, 55727, 59713, 152381, -149273, 111448, -28476, -13018, 235926, 480690, -74158, 9931, 69141, 283563, 260027, 255903, 150574, 448709, 108761, 2167, 194972, 390460, 278246, 158344, -253915, -15599, 265437, 90060, -155614, 146826, -60793, 163886, -78887, 315369, 42478, 207464, 347244, -72473, -31709, 116875, -48761, 55108, -48944]
17575A34751c8363p2504a9265j139F2169K9035M30332F584b14111A23730j5875
17564A07855l2570K63727h6705A40074a19233C19912j5257M5058l2369a2759A87003
17552C39525J9155b0770B99521f7586A95265n4067O7850K48369L3773a95440A79571
17540A78174O7255K2847j27672M36619j52161j91230K53524j22575K68414B74329
17529D87610A18896L38128q6177L39760k01009J7523J93352Q0776K2799l48324
17519D75724G7582J68869M59863k59714q1281Q280K1802J11081J45703m3724K21880
17508H30341M6756j65390j60535A64186L44201J4029A63342J00037J66622j69863
17498B60138l8526K39423m4595q5823n5678R3973A44672m293b5754B51005J70588
$$ y = [134751, -38363, -110867, -19265, -20404, 62169, 91204, 521536, 6584, -214111, 123730, 107855, 75285, 339012, -86705, 140074, -119233, 319912, 304655, 349713, 317344, -12759, 187003, 339525, 358680, -20770, 299521, -67586, 195265, 141198, 209048, 457417, 491190, -195440, 179571, 178174, 245429, 268276, 140604, 577223, 425062, 233832, 487356, 364781, 633195, 274329, 487610, 118896, 457024, 370847, 710607, 509598, 527121, 720473, 801249, 824048, 475724, 77582, 246451, 706314, 446600, 365319, 373599, 395401, 506482, 652185, 608461, 830341, 877097, 711707, 551172, 164186, 508387, 522416, 163342, 263379, 430001, 260138, 221612, 461035, 416440, 330617, 274939, 368912, 144672, 140379, -25754, 251005, 421593]
17487D21593p9961j49183K46785a3003A44554Q93N1553J82350L0466J41887j87968
17476C63735K22970B78199l0040A00608k278M8675b01343A84749J18642J6379
17466C19770m6077k248L13409A29615J01078p4616N7903L5041p4842o5334K8217
17455A37062J42655K37445j29607I5106K23530K21892j12058A33397J58224j7896
17445B73725r4371K83220j57759j33614J99108q158J72737L7673P6271j98902
17435D49930B12213J47548j01432L6698J81492j82081M72495G8237K45789O7573
17425C91599p4541o5639J59833K86517E9535M64277k05758p2093h257C0871R0148
17414A21019J92956Q035A01339Q3209J78150o009L55096C15358J73772j43842
$$ y = [421593, 341632, 192449, 439234, -13003, 144554, 145447, 197000, 379350, 409816, 551703, 363735, 586705, 278199, 248159, 100608, 98330, 147005, -201343, 184749, 303391, 319770, 273693, 271445, 584854, 129615, 230693, 156077, 213980, 249021, 174179, 108845, 137062, 279717, 517162, 387555, 95106, 318636, 540528, 428470, 133397, 291621, 273725, 179354, 462574, 304815, 171201, 370309, 362151, 534888, 572561, 648832, 449930, 212213, 359761, 258329, 295027, 476519, 294438, 766933, 78237, 324026, 391599, 317058, 251419, 411252, 697769, 59535, 523812, 318054, 245961, -8257, 30871, 121019, 313975, 322010, 101339, 184548, 362698, 356689, 711785, 315358, 489130, 345288]
17404C45288A01044M20802H5992L05662o6069E6712J95355o6749E429L70193j82311
17393A93311Q861J04912p1258J24262A2947L4063K52593A44752J42198J0888m606
17382B93232j26544J91281A44959M37496k00480j18707R8834j24257L94n5032
17372A83207J05852J4190r6051K4005I0954L25158m4961j76452L03996A10782
17361B42739J24926G9937M9402m1211J06367i4451B01308J00168k5917l5588N5203
17350B95174A39218L29608k33480P4682N9762A69784K41389I9463K41825J4778
17340C56066K71613H887J44685J04132J08110h5492B23116K9535N203l2247g9378
17328I6917k2934a34613B76203d9983A566L02810p8929M6381O0820a40835D01552
$$ y = [345288, 101044, 521846, 85992, 391654, 325585, 56712, 252067, 185318, 5429, 375622, 193311, 202172, 307084, 235826, 360088, 12947, 47010, 299603, 144752, 286950, 297838, 293232, 166688, 357969, 144959, 582455, 381975, 263268, 362102, 237845, 238239, 183207, 289059, 303249, 207198, 231203, 90954, 416112, 371151, 194699, 498695, 110782, 242739, 367665, 79937, 129339, 88128, 194495, -94451, 201308, 301476, 275559, 239971, 295174, 139218, 468826, 235346, 310028, 369790, 169784, 411173, 99463, 341288, 356066, 627679, 8887, 153572, 257704, 365814, -85492, 223116, 252651, 257854, 225607, -79378, 96917, 73983, -134613, 276203, -49983, 1566, 304376, 225447, 271828, 332648, -140835, 401552]
17316C72827j41970b1858D17663J61964B78919J32828N902K32564C12648o4851
17306B47797J67787j42624o5820J33598n7138J02643G2490K15198o5585K05556
17296D27659A54306M0896K50977A05371J17069I1654K20973k9143J50337l1900
17286D01921A97682R2733k1327F4770L39219j54888R1446q6326q6793M12764k22676
17275C57516p6798H2198L09770j09680j8129j00113K80919q2064J20750B17331
17264D61172A18011J57057L8581j51694J28108M8515M6162j57578R8310M20965
17254G46437A81399l2469K53074A52058L15429B12170K88218B12110o0205N1258
17244B03163Q1656j1227E7329K60991H9286M37404K2415J8055A02208K14320K55328
$$ y = [372827, 230857, -21858, 417663, 579627, 278919, 411747, 417649, 650213, 312648, 247797, 415584, 272960, 207140, 340738, 283600, 386243, 72490, 287688, 222103, 427659, 154306, 195202, 446179, 105371, 222440, 91654, 312627, 283484, 433821, 401921, 197682, 290415, 269088, 64770, 403989, 249101, 340547, 254221, 167428, 580192, 357516, 280718, 82198, 391968, 282288, 264159, 164046, 444965, 362901, 483651, 217331, 461172, 118011, 275068, 313649, 161955, 290063, 338578, 384740, 227162, 325472, 746437, 181399, 148930, 402004, 152058, 467487, 212170, 500388, 212110, 151905, 203163, 284819, 273592, 57329, 318320, 89286, 526690, 549105, 567160, 102208, 316528, 571856]
17233E71856k30807I7927J21535Q6568L81195l00556A63808J55266K30121B11909
17222C81165J05321K50k40932p2657D7397N01841m1873A47169M46690k13104A70855
17210E72322j18397o5325M455p7927q1402O51639m38413J3602j25891R3154j01126
17199C26691c1676C91044A59821K41701K70856A73162L82601p7371n0027j58507
17189B69858M30641B43497K08323j83640K85692N4217B18895L35872k05909K70017
17179F18875O3553l4882C14604K76068j17015R7371q8481Q876K4673l0245j19317
17168C66534K57496j79074N5361m4820L16992C05824N4768L57678l0398m2334
17158F45538j88553j3957j22242K48684k16921L14591k86604K75589l24786K66412
$$ y = [571856, 341049, 97927, 219462, 306030, 687225, 386669, 163808, 319074, 549195, 211909, 381165, 486486, 486736, 245804, 173147, 47397, 549238, 507365, 147169, 593859, 380755, 170855, 572322, 453925, 388600, 393055, 315128, 233726, 885365, 446952, 460554, 334663, 427817, 326691, -31676, 391044, 159821, 401522, 672378, 173162, 555763, 478392, 428365, 269858, 700499, 243497, 451820, 268180, 553872, 608089, 218895, 554767, 348858, 618875, 682428, 647546, 314604, 590672, 473657, 571028, 482547, 491423, 516096, 485851, 366534, 624030, 444956, 500317, 455497, 772489, 305824, 360592, 718270, 687872, 645538, 456985, 443028, 320786, 569470, 352549, 667140, 380536, 656125, 331339, 597751]
17148E97751r0322j93488K26342l1466p2297J3228K37325k81200r5487L04929
17138F15315q5340L1994J23087O6564L35244D50089J6976R267m911K42081K62887
17127I76389k00216j40773k89352K36818J23724k79840J15580K76683P2020l46294
17117E44739J02203j22532N8267j6701j41474K15158j11325J03320r7918q137
17107E25600L9614J86164k75726m9484M96940l30260k9372R2266J47285p9288
17097G23739K77667l77979j38300J26653J00911K70070j79636l71665L51836k46835
17087E36461J56832j26572J52342Q259R0216R5967j61832j97557L09667N7818
17077I21601m4234l82103K42011J3426l7954L29353r9762j59001l63902N19326
$$ y = [597751, 507429, 313941, 540283, 508817, 436520, 449748, 687073, 405873, 310386, 615315, 529975, 561969, 685056, 751620, 1086864, 450089, 467065, 476332, 471421, 713502, 976389, 776173, 635400, 346048, 582866, 706590, 426750, 542330, 819013, 891033, 544739, 646942, 524410, 582677, 565976, 424502, 639660, 528335, 631655, 533737, 525600, 565214, 751378, 475652, 426168, 923108, 592848, 563476, 655742, 803027, 723739, 1001406, 623427, 485127, 611780, 712691, 982761, 803125, 431460, 783296, 536461, 693293, 566721, 719063, 727322, 817538, 913505, 751673, 554116, 863783, 921601, 877367, 495264, 737275, 750701, 712747, 1042100, 942338, 783337, 419435, 938761]
17067I38761j66712p0300K31917j06408M6936J45969j65649k37256L05214J04314
17057A026786l12586j1189J63207o5876q2378L55707j16899k04115J04658O006
17047H63321j08020K34920J42888m61621K79226K02214j57757J93463k58984J52309
17037A081959N2007J24898Q28l70074P2127O4051J39454j2386k76385J14343J07700
17026A098522n5960J28166K80609l31417K8114k57886K61075j46992M3159J56637
17016A204027q4131K79371k54751k11415M24845l42970O6194j87339K65173j9087
17006A139917m1836j08452N03037m94911m2486K45548K45254j24432j7599j10973
16996A193067l0655L56239j50890q667k44990K95802K21707l78777j38139N04174
$$ y = [938761, 772049, 701749, 933666, 827258, 874194, 1020163, 854514, 617258, 922472, 1026786, 714200, 703011, 866218, 800342, 717964, 1073671, 956772, 752657, 857315, 863321, 755301, 990221, 1133109, 671488, 950714, 1152928, 995171, 1188634, 929650, 1081959, 1133966, 1258864, 1259692, 889618, 961745, 1025796, 1165250, 1152864, 876479, 990822, 1098522, 1042562, 1170728, 1451337, 1119920, 1148034, 890148, 1151223, 1004231, 1047390, 1204027, 1119896, 1399267, 1144516, 933101, 1357946, 1014976, 1081170, 893831, 1159004, 1139917, 1098081, 989629, 1492666, 997755, 955269, 1200817, 1446071, 1321639, 1304040, 1193067, 1162412, 1518651, 1367761, 1359094, 1114104, 1409906, 1631613, 1252836, 1114697, 1618871]
16986A618871j85632m18k05363M42338o51337L83432q2128N56695k06002j48305
16976A522151m2985j11557L70508n40071L14186K82319j19218k01798L3214J77870
16966A684619j84676P5353p7143K77095k65066K37046j92976K63900k80904O4060
16956A601308J91638O9472j92288J92960j44275k1007L71991n1433M2592j47939
16946A913019k40797M47885k58620K58495K43931m27786K1804J01524j14985M7242
16936A991712K49025k16963K25231k6994l38202K50605J21036P2923j2136K1935
16926B338172l10387O67003m34408O00071p12906L69489M7220j33307O4992J5135
16916B511074j02927J18066K45133j33585K6893l2906J99824j7970J29026l66228
$$ y = [1618871, 1433239, 1432821, 1227458, 1669796, 1018459, 1401891, 1319763, 1876458, 1670456, 1522151, 1479166, 1367609, 1738117, 1198046, 1512232, 1794551, 1675333, 1473535, 1506749, 1684619, 1499943, 1575296, 1498153, 1775248, 1510182, 1747228, 1554252, 1818152, 1537248, 1601308, 1792946, 1862418, 1670130, 1863090, 1718815, 1697808, 2069799, 2018366, 2060958, 1913019, 1672222, 2120107, 1861487, 2119982, 2363913, 1936127, 1957931, 2059455, 1944470, 1991712, 2240737, 2023774, 2249005, 2222011, 1883809, 2134414, 2255450, 2328373, 2316237, 2338172, 2027785, 2694788, 2260380, 2860451, 2147545, 2517034, 2564254, 2430947, 2495939, 2511074, 2408147, 2526213, 2771346, 2637761, 2664654, 2631748, 2831572, 2813602, 2942628, 2576400]
16906B576400M57516k43339K18281l06790L14891K06098M4654l52267J53308J32313
16896C201065J9527K63993m00706J99073m7262K38114J3057J29358j47879K75836
16886C744176j75339K78302j38946k81635P9928J10909O2560l9910J97158O2219
16876C899422J36550K14629l17368J8729L38408M19991n23505j8508J78578L21681
16866D668607K29335j93587n8466j83481L443O53383m3553j10351o3200P0882
16856D973012j59887K09597N09301j25504O5968K56529o0936K00371k42013N71967
16846F198405l57607N45730k70021j26322N12607J29980P5810k46077L25711L8867
16836F827083q090K54783L47097J89484o5869K4577M3282M9518M36879k62332
$$ y = [2576400, 3033916, 2790577, 3008858, 2702068, 3016959, 3223057, 3267711, 2915444, 3068752, 3201065, 3220592, 3484585, 3083879, 3282952, 3235690, 3473804, 3486861, 3616219, 3468340, 3744176, 3568837, 3847139, 3708193, 3426558, 3506486, 3617395, 3679955, 3640045, 3837203, 3899422, 4035972, 4250601, 3933233, 3951962, 4290370, 4710361, 4186856, 4168348, 4346926, 4668607, 4897942, 4704355, 4645889, 4462408, 4465851, 5119234, 5075681, 4965330, 4902130, 4973012, 4813125, 5022722, 5532023, 5406519, 5472487, 5729016, 5668080, 5868451, 5626438, 6198405, 5840798, 6386528, 6116507, 5990185, 6502792, 6632772, 6708582, 6462505, 6788216, 6827083, 6818993, 7073776, 7420873, 7610357, 7544488, 7569065, 7612347, 7661865, 8098744, 7836412]
16826G836412M34820K37280J07705n2592L52822J44746L04885j9846M46753l70022
16816I422963K60236M99023k1906M41329K8032K38557K12249J73924J47100J54497
16806A1556004N98458L12233K27779J65541N06119k59839N60300K27915K04121
16797A4098631L62920N92678l3140M53991K22756M77980L66560o317J045470J75047
16787A7756576N77964M83138L53440L90124L15678N52432O24887M12876P30462
16778B2197577N65468N47291L75962R42929O50927P29373P18576P62887Q19748
16769B8310738M08872J191965J041657M39405J503672O16917J024159J098165
16761C5635550J091407J222044J049008J695894J271809J127038J027288J399917
$$ y = [7836412, 8271232, 8508512, 8616217, 8563625, 8916447, 9061193, 9366078, 9346232, 9792985, 9422963, 9683199, 10182222, 10160316, 10601645, 10629677, 10868234, 11080483, 11254407, 11401507, 11556004, 12154462, 12466695, 12694474, 12860015, 13366134, 13106295, 13666595, 13894510, 14098631, 14461551, 15054229, 15021089, 15475080, 15697836, 16175816, 16542376, 16536059, 17581529, 17756576, 18334540, 18817678, 19171118, 19561242, 19876920, 20429352, 21054239, 21467115, 22197577, 22763045, 23310336, 23686298, 24629227, 25280154, 26009527, 26728103, 27490990, 28310738, 28719610, 29911575, 30953232, 31392637, 32896309, 33513226, 34537385, 35635550, 36726957, 37949001, 38998009, 40693903, 41965712, 43092750, 44120038, 45519955]
16753D5519955J989368J341077J736232J983129J189308K046452J709441J950565
16745E9465527K352312J724874K322268K223627J923430K333022K346239K383583
16737G7074882K562574K389539K241284K399110K682456K430354K465832K251933
16729I6497964J965252K321023J970176J799839J363475J986140J111940J206964
16721A10222773J043617L17871N28379R3481j00040p73029p54301r62027j358483
16712A08258241j167710j390286k210456j586908k359128k207305k129816k737792
16704I2468840k417260k438487k794638k595874k518644k555223k862276k264184
16696G2022254k601186k221845j930896k534807k232805k278612k077534k186202
$$ y = [45519955, 47509323, 48850400, 50586632, 52569761, 53759069, 55805521, 57514962, 59465527, 61817839, 63542713, 65864981, 68088608, 70012038, 72345060, 74691299, 77074882, 79637456, 82026995, 84268279, 86667389, 89349845, 91780199, 94246031, 96497964, 98463216, 100784239, 102754415, 104554254, 105917729, 107903869, 109015809, 110222773, 111266390, 111584261, 112112640, 112206121, 112106081, 111333052, 110578751, 109616724, 108258241, 107090531, 105700245, 103489789, 101902881, 99543753, 97336448, 95206632, 92468840, 90051580, 87613093, 84818455, 82222581, 79703937, 77148714, 74286438, 72022254, 69421068, 67199223, 65268327, 62733520, 60500715, 58222103, 56144569, 53958367]
16688E3958367j656627j766710j802372j519479j758425j620336j381985j915679
16680D0536754q96556j702458j182093j335176j115590p82716j249718r33756
16672C1338691j082274q59896j095482p84745r51420j031319l44583p95854o15098
16663B3778020p50276p46610m75676q49486o83920n83654p60538j84756n23065
16654A8220039j28775o80530n37038l29671m94701m46627n30790l02571j22231
16645A4647105m59007k47454n57801k33549l85552l0135p05193L7112j75090k27742
16635A1662694l01820o58804R7670m46108M9493m24463j50047j02713k67072P4704
16625I533534l91039k85801k06614j74551k88488K04836j55106j29165k91954
$$ y = [53958367, 52301740, 50535030, 48732658, 47213179, 45454754, 43834418, 42452433, 40536754, 39640198, 37937740, 36755647, 35420471, 34304881, 33522165, 32272447, 31338691, 30256417, 29396521, 28301039, 27516294, 26564874, 25533555, 25188972, 24393118, 23778020, 23027744, 22281134, 21805458, 20955972, 20272052, 19688398, 18927860, 18743104, 18220039, 18091264, 17410734, 16873696, 16544025, 16049324, 15602697, 15071907, 14769336, 14647105, 14188098, 13940644, 13382843, 13149294, 12763742, 12733607, 12028414, 12065526, 11890436, 11662694, 11360874, 10702070, 10799740, 10353632, 10403125, 9978662, 9828615, 9725902, 9458830, 9533534, 9142495, 8856694, 8650080, 8475529, 8187041, 8391877, 8236771, 8107606, 7815652]
16616G815652q4550j70295j64683q1354l8513o6237j72077l14402q8662m3246
16606F591633k21307j02081q9232m52684J23822r8767J6525K07375m58744r1201
16596E425339o0862m7552k67950o0065K7755J16655r0390m61227M25431k78268
16586D728866N8182j56956j12320k09662L43659o50559K9243L7324J87300j19248
16576D135829m11976L46065p5334k17980n8838q8038j09640Q3890j97999k43465
16566C162514M67801k94568N83195q12669O50922k66918n71532P2240M38007l77198
16556C051794K56747k29310k03519P471K62851l05319j8407k81589L15605L2030
16546B888354o3440p3671M8300k47224J71891p8427J73085j90162l43690R0640
$$ y = [7815652, 7731102, 7560807, 7396124, 7314770, 7276257, 7210020, 7037943, 6723541, 6634879, 6591633, 6370326, 6268245, 6179013, 5726329, 5850151, 5751384, 5767909, 5975284, 5516540, 5425339, 5364477, 5316925, 5048975, 4988910, 5016665, 5133320, 5042930, 4581703, 5007134, 4728866, 4787048, 4630092, 4517772, 4308110, 4651769, 4001210, 4030453, 4067777, 4255077, 4135829, 3723853, 4069918, 3994584, 3776604, 3717766, 3629728, 3520088, 3603978, 3405979, 3162514, 3630315, 3335747, 3918942, 3106273, 3757195, 3490277, 2918745, 2990985, 3428992, 3051794, 3308541, 3079231, 2875712, 2883183, 3146034, 2840715, 2822308, 2540719, 2856324, 2888354, 2824914, 2751243, 2799543, 2552319, 2724210, 2645783, 2818868, 2628706, 2285016, 2375656]
16536B375656K20521M5219M3502p340m89664J25357K18169r0981l64717o6145
16526B009577K47732K0m61857L71075l4770n5538j09043n5686j66771K96493j25410
16515A915822J69598J05046j77968R0398K084m26227n3122K75802k99351K67485
16505A869567j7324j66147K53726m93967K45646J72504k23229J50289k31572L86979
16495A946472l92871p3301j71594K12180k82472J39301O0566L478o9018k0554
16485A352187O2373P7166j75514p7562l5429R6237J52389l2198J40620k68802
16475A291467n0781L26695l68229J47135j18358p1509J30529J39926k11678k75319
16465I39878L92478J72236j47846j96658M7506j15879j18869Q0944K25391q0641
$$ y = [2375656, 2596177, 2641396, 2684898, 2677558, 2187894, 2313251, 2531420, 2440439, 2075722, 2009577, 2257309, 2257329, 1795472, 2166547, 2131777, 2076239, 1967196, 1911510, 1744739, 2041232, 1915822, 2085420, 2190466, 2012498, 2102896, 2104980, 1678753, 1625631, 1901433, 1602082, 1869567, 1852243, 1686096, 1939822, 1445855, 1691501, 1864005, 1640776, 1791065, 1559493, 1946472, 1553601, 1480300, 1308706, 1520886, 1238414, 1377715, 1438281, 1441759, 1372741, 1352187, 1414560, 1491726, 1316212, 1238650, 1203221, 1299458, 1451847, 1419649, 1560269, 1291467, 1240686, 1567381, 1199152, 1346287, 1227929, 1156420, 1286949, 1426875, 1215197, 939878, 1332356, 1504592, 1356746, 1160088, 1207594, 1091715, 972846, 1053790, 1279181, 1198540]
16455A198540M6539k50406N6482j18321Q8390J37872k34486k846K35114k85734
16445H71144Q7474J80210l05805K05710o0034j98950M54280m53958J36554R4719
16435A011344r5899Q8245J17773j83447J24998j06834k11309K37880p4711R2456
16425A000496j14938L3236J076j78188j03313O46278m81794N4501l18486N52856
16415A091724l20000K67122Q930N084l8712J88863n55373K21938k02458J55274
16405H22392p4188r6009J80097k9689J9968k49412K33285J2392N3333k13926j68183
16394D90060K86567N1887k70802Q0069J35942j49362K4646j731N8822R5791l45114
16383D56775K62818R9101N089k90571r0099J16507R1191j01380j79980K37453
$$ y = [1198540, 1245079, 994673, 1051155, 932834, 1021224, 1159096, 924610, 921764, 1156878, 871144, 958618, 1138828, 833023, 1038733, 978699, 779749, 1234029, 780071, 916625, 1011344, 915445, 1003690, 1121463, 938016, 1063014, 956180, 744871, 982751, 908040, 1000496, 885558, 918794, 919870, 741682, 638369, 1284647, 802853, 857354, 538868, 1091724, 771724, 1038846, 1047776, 1052860, 1014148, 1203011, 647638, 869576, 667118, 822392, 748204, 652195, 832292, 802603, 822571, 573159, 806444, 818836, 872169, 658243, 490060, 776627, 828514, 557712, 637781, 773723, 624361, 649007, 647276, 706098, 801889, 456775, 719593, 818694, 823783, 533212, 443113, 559620, 650811, 549431, 369451, 606904]
16373F06904l2459K50375j49392C16089L35553j97740L21039l81157J05463J01153
16363F00400r5806K05882k74293J44013n2507A63190M88934M29k07986n4129J04448
16352D94886P2038k7187B48066K84026J00707j30717M5735R0698J11974k19193
16342E31296r9729J26293j77112q4256J46838L19294k28830k48965K31572N8449
16332E74850k53832K01247k4818r3690j87680J76765J7398J06184B08714n1453
16322A57261L10205j1452r5327L2060J26390k52947K39587c723F72715j27916
16312E44799m1702J5783P2252J1545j16857o5853n3094J46354B24746J48647K1752
16301C95145J10544k5872A53912K25405K17259k56787L8145P02J369k7059Q1328
$$ y = [606904, 574445, 824820, 675428, 316089, 651642, 453902, 774941, 393784, 499247, 600400, 504594, 710476, 436183, 580196, 527689, 163190, 652124, 652553, 444567, 390438, 494886, 566924, 539737, 248066, 532092, 632799, 502082, 547817, 638515, 750489, 531296, 431567, 557860, 380748, 296492, 443330, 762624, 533794, 284829, 516401, 574850, 321018, 522265, 497447, 403757, 216077, 392842, 410240, 516424, 208714, 157261, 467466, 456014, 360687, 392747, 519137, 266190, 505777, -3723, 672715, 544799, 503097, 518880, 591132, 602677, 485820, 419967, 366873, 513227, 224746, 373393, 395145, 505689, 479817, 153912, 379317, 596576, 339789, 377934, 378636, 380005, 352946, 434274]
16290D34274A87518K19322Q20q7711L2257j30509L13396K8112j74892A59365K35848
16279C95213A11903J68800A04949M26567j98459J73119Q511B54487P1635Q8459
16269D14581F0835L12531n2437r6182K51245k05246K528j19507J95482O3828E2864
16257A96027k6547J77136K0916j76877Q9056m5469J71922j8766o5744A03391L93880
16246D97271j69428N6376j45300b17691A63195E9944K91993j72926L0493N170
16236B14674M4210K47440k36999a3371D22425j35992L28652k97026n2074R2793
16226C58778E6889A6946J55600i9459A34707K51193j72932J12522o9815J04918
16216C60593o8012p467P7710h3292D6723K9695J31833M3586J18312A30551M28389
$$ y = [434274, 187518, 406840, 407660, 319949, 352206, 221697, 535093, 563205, 388313, 159365, 395213, 111903, 280703, 104949, 531516, 333057, 506176, 514687, 254487, 326122, 414581, 60835, 373366, 320929, 224747, 475992, 270746, 273274, 153767, 349249, 413077, 52864, 196027, 169480, 346616, 367532, 190655, 279711, 234242, 406164, 387398, 321654, 103391, 497271, 327843, 384219, 238919, -217691, 163195, 59944, 351937, 179011, 209504, 214674, 258884, 506324, 269325, -13371, 422425, 286433, 615085, 318059, 265985, 358778, 56889, 16946, 172546, -99459, 134707, 385900, 212968, 325490, 255675, 360593, 292581, 285114, 362824, -83292, 46723, 76418, 208251, 251837, 370149, 130551, 558940]
16205E58940B40024K0031K27048k0475A92936e3530H9233C5694a89846A88718
16194A94986o7633O2183a51027N7322C24357F7981K39269J68434A92648G4799
16183h8647G394N6864a01341c9407A47643K41732A83104J12439r4892a7615B13509
16171C53917j56744M13546a40567C85864F6987K85353a83805B01716a854E31024
16160C7521a3602p6527A99461k8027J88930g0763K4549C41033A34571A6764N6252
16149G3016J14084N7855n8462a40716N8392A70807c820q4852E5850d1778D7610
16137a1626A50650g7580B19745m5431F3233K83856A24159R1352J21962A39373
16126A02899K91838B0377c26105B29993e8386B0888M3032L11885j70987H9773
$$ y = [558940, 240024, 260055, 487103, 466628, 192936, -53530, 89233, 35694, -189846, 188718, 194986, 127353, 189536, -151027, -93705, 324357, 67981, 307250, 475684, 192648, 74799, -88647, 7394, 64258, -101341, -39407, 147643, 389375, 183104, 295543, 200651, -17615, 213509, 353917, 197173, 610719, -140567, 385864, 66987, 352340, -183805, 201716, -1854, 531024, 37521, -13602, -90129, 199461, 171434, 360364, -70763, -46214, 341033, 134571, 16764, 73016, 187100, 244955, 186493, -140716, -82324, 170807, -3820, -88672, 55850, -41778, 47610, -11626, 150650, -77580, 219745, 174314, 63233, 347089, 124159, 215511, 337473, 139373, 102899, 394737, 20377, -326105, 229993, -58386, 20888, 63920, 375805, 204818, 89773]
16115a04686B67220i7146B86393j36274o9065b10879B93306L5247J85720a22336
16104i8744D0845K7446J61413C8927J19922m7976E3590J06503J18306i6644A59182
16092C5468g4305D8062J29095R2430h2752k91368B79553j09883I418K82435A21800
16080E6192M1864P9633q5269e9155K1243A3586L34897A35169J38560p2998Q2940
16069B83671a88753A90368m7261b38059A21141J14826h3214B43338H1711Q5587
16059A67298J24497h9250k20384a0787B118R049R7760d1017k42509A41977l051
16048A38926J63401a27588B6680M79418d8056j32526F3051A5499g6552C21194
16037h321A02379m658B3248L34900g3402B15241d2804F52c89957g3649e597B40744
$$ y = [-104686, 267220, -97146, 286393, 150119, 81054, -210879, 293306, 328553, 514273, -122336, -98744, 40845, 68291, 229704, 38927, 158849, 110873, 53590, 160093, 278399, -96644, 159182, 35468, -74305, 48062, 177157, 269587, -82752, -374120, 279553, 169670, 9418, 291853, 121800, 56192, 98056, 177689, 92420, -59155, -37912, 13586, 348483, 135169, 273729, 200731, 283671, -188753, 190368, 143107, -238059, 121141, 235967, -83214, 243338, 81711, 167298, 291795, -89250, -309634, -10787, 2118, 11167, 108927, -41017, -283526, 141977, 138926, 302327, -127588, 26680, 506098, -48056, -180582, 63051, 15499, -76552, 321194, -8321, 102379, 97721, 23248, 358148, -73402, 215241, -42804, 652, -389957, -73649, -5597, 240744]
16024I3091b20588a06721A62475n3159f1341a3791l6137k47105J04376E590b042
16012c17960A61172G6936A3160c24124e2072I2039l4461L7634L1516F0319e9385
16000b2242j20515M6339A61564K44620A55805J68479j56417a72400E3801K00890
15990B54691O4485n5Q1155J54283R0922M27066p0996N5777k47990k26003k05950
15979C77385l0426A55665C0475L40101a16668j04041a9545B61814N6137H1160
15968c36953g5879B11108a69933I7412R9602c39524d9734m5115F9878b27390B40894
15956f3924m6906K7733D91344j07174b28830G0497d0520j0781r7194o8017p5295
15945b91807j41603d025n583B3331a84054f3703A05912b792p43l4924A49770K43039
$$ y = [93091, -220588, -106721, 162475, 109316, -61341, -13791, -49928, -297033, -192657, 5590, -2042, -317960, 161172, 76936, 13160, -324124, -52072, 92039, 57578, 95212, 126728, 60319, -59385, -22242, -142757, -96418, 161564, 406184, 155805, 324284, 167867, -172400, 53801, 254691, 319176, 319121, 400276, 554559, 645481, 1072547, 1001551, 1057328, 809338, 583335, 377385, 346959, 155665, 30475, 370576, -116668, -220709, -19545, 261814, 317951, 81160, -336953, -75879, 211108, -169933, 97412, 197014, -339524, -49734, -94849, 69878, -227390, 240894, -63924, -110830, -83097, 491344, 384170, -228830, 70497, -40520, -51301, -148495, -216512, -291807, -433410, -4025, -9608, 23331, -184054, -63703, 105912, -2792, -3535, -38459, 149770, 392809]
15933C92809E2851a941n3050A99996k438L42501c3156j56124a2331l52569f3420
15921e2412k56649a44413C03034a80106B67701I3507a16442A98705a434C76461
15910a91140A75986b04272r6990B08077a31216B88853h7261o4426C30883C4274
15899c56287A56543a42943D3783N9828B0029J41622J17563A5931b4768A4877a95927
15887a30963j6324j172N4862A69645N0753a16835C8657L8388b68178C50089a61295
15875b11236K356a01283H0225J40219d4718j78624a5604B40377C8020f812k28436
15864b35248a7115m7875p6782l8059B02244b97206F2890B4497h2180l3292K1870
15853i3602D9184a66548A32960o5155K06507A26795a76663P0006L1811B4821J27490
$$ y = [392809, 52851, -1941, -54991, 199996, 197558, 540059, -33156, -189280, -12331, -364900, -63420, -52412, -309061, -144413, 303034, -180106, 267701, 93507, -116442, 198705, -1434, 376461, -191140, 175986, -204272, -301262, 208077, -131216, 288853, -87261, -151687, 330883, 34274, -356287, 156543, -142943, 43783, 103611, 20029, 161651, 279214, 15931, -24768, 14877, -195927, -130963, -147287, -148459, -93597, 169645, 220398, -116835, 38657, 77045, -268178, 350089, -161295, -211236, -208880, -101283, 80225, 220444, -44718, -223342, -15604, 240377, 38020, -6812, -235248, -17115, -64990, -141772, -179831, 202244, -297206, 62890, 24497, -82180, -115472, -93602, 49184, -166548, 132960, 67805, 274312, 126795, -176663, -106657, -74846, 24821, 152311]
15842A52311D7709g3807l8472G0404J69885B3028O8038b723A80026a18938c652
15830E7309b42916c216k39889e3100B62078j29671a98329a2940p5757A06330l3130
15819G3200i1051A45010F6974K08469G8975n729Q2389n2409k1256d8932j62785
15808b11717A62325a62931f5084J7407b1640n2785A62301A6920i0761l32403J70293
15797b52871M7660B2101c5362q2602I2554g1279I4668A159b68054H0439d9283
15785A4989b9970E2620g6760j10853c2836A0329a0171C15889F3022o833a11941
15773a92604P2328B8544a63671c8523k86660c6992A8717K41147h7086a3671o0251
15762g3922j25937h1818B27244n4173J53579i8208g827F6383i9705j87040a12060
$$ y = [152311, 47709, -73807, -112279, 70404, 240289, 23028, 91066, -2723, 180026, -118938, -3652, 57309, -242916, -3216, -243105, -53100, 262078, 132407, -198329, -12940, -88697, 106330, 73200, -91051, 145010, 66974, 275443, 78975, 73246, 155635, 103226, 81970, -48932, -211717, 162325, -162931, -65084, -47677, -21640, -74425, 162301, 16920, -90761, -423164, -252871, -205211, 22101, -35362, -117964, 92554, -71279, 94668, 1159, -268054, 80439, -49283, 14989, -29970, 52620, -76760, -187613, -32836, 10329, -10171, 315889, 63022, 56189, -111941, -192604, -120276, 28544, -163671, -38523, -325183, -36992, 18717, 259864, -87086, -13671, -73922, -199859, -81818, 227244, 173071, 326650, -98208, -7827, 66383, -99705, -286745, -112060]
15750b30324A04062c9552j58990A18167K4047a91833N3193A72067c4363A88963
15739d26093L7976G2927c87A55866e3567A33505a33096A0405N8313a72222k2556
15728a94778N677b0334D6678f9834l56651A10859g6101C9112a30113j33635B13262
15716C42948a52667D604J20541b03308F679a00952j06534A51983A255L2736b74785
15704A29584c52736A62346b55315G5409j0389a3139B66315b7392r3268F2173J93504
15693B55677A7258J47437c37329A90775b0449C12548e2524b2152j94138B80770
15682a74652A02047b5579l81647B13628j04706B3485Q191c39228B37359J1440
15672B48799a41514b3908o8136m2480A71078b9511A09016R4400b26285L1700H9230
$$ y = [-230324, 104062, -39552, -198542, 118167, 142214, -191833, -138640, 172067, -34363, 188963, -426093, -388117, 72927, -387, 155866, -53567, 133505, -133096, 10405, 68718, -172222, -194778, -189101, -20334, 46678, -69834, -426485, 110859, -76101, 39112, -130113, -263748, 213262, 342948, -152667, 4604, 125145, -203308, 6679, -100952, -207486, 151983, 1255, 33991, -274785, 129584, -352736, 162346, -255315, 75409, 65020, -13139, 266315, -27392, -120660, 62173, 255677, 17258, 164695, -337329, 190775, -20449, 312548, -52524, -22152, -216290, 280770, -174652, 102047, -25579, -407226, 213628, 108922, 23485, 31676, -339228, 237359, 248799, -141514, -23908, -92044, -134524, 171078, -29511, 109016, 203416, -226285, -194585, 89230]
15660e5685A62168i8432A11089Q0448a38616B6794g7390j05446C48283A03667
15649B90159j27189a60397O300N8253q1157A3354J79388D2896a82334B69656j8511
15638B51145C3856b11073d972j83196I4461b45660J14414N081D018b1930A5685
15626I910J1211a001m1629C10138g9188b6442n4922r4564O1052C16987a39274
15614b68958A39149J2679b84483J03829d3172C00629H0486b1721j42449k9481
15604a93651k70315a41442a8513j93383P3080d5371k17425A83011g1226q4460
15594a55686f9806b1776j69496F5255f1056E3608J2704a04757l4736r449A87670
15582a94383L0663M6484A4119J5530P1609c18617C46626p4973d5295r2405E1106
$$ y = [-55685, 162168, -98432, 111089, 191537, -138616, 26794, -77390, -182836, 348283, 103667, 290159, 162970, -160397, -154097, -95844, -177001, 13354, 192742, 42896, -182334, 269656, 251145, 33856, -211073, -4972, -188168, 94461, -245660, -131246, -126165, 4018, -21930, 15685, 9910, 21121, -1001, -42630, 310138, -79188, -26442, -81364, -175928, -114876, 316987, -139274, -268958, 139149, 151828, -284483, -180654, -43172, 300629, 80486, -21721, -164170, -193651, -463966, -141442, -18513, -211896, -138816, -45371, -262796, 183011, -71226, -155686, -69806, -21776, -191272, 65255, -61056, 53608, 66312, -104757, -139493, -148942, 187670, -194383, -163720, -117236, 14119, 29649, 101258, -318617, 346626, 271653, -45295, -137700, 51106]
15570A91379h0612k24127g1467B2370b18242B5841L18199i5112F0774P5240A857
15558b10628a02651J2593F9522a61336b0767j78213D2739K9316J23165a1051j19952
15547a31003o0909O9783n2026j50799I3899A9823R6204a74811d0532A06471J0136
15536A16607b40227A51637e2625j3792A38857B7326h0364C11718h3723A48700
15525i9091C5658L4549b45408E2759e3149C71126e5280k1821A59092a01192C3566
15513C9506J76481g8105H4451P2184L2394a1576A05042f0444G8593K5501J38964
15502B43058o2238F7690J27025M7773I7441K76553b7117A8350K88369j21259K37471
15491D22931j98407K67830a03381I3167L967L1686j0218b0448C86486D9591j9066
$$ y = [191379, -80612, -304739, -71467, 22370, -218242, 25841, 344040, -95112, 60774, 136014, 1857, -210628, -102651, -90058, 69522, -161336, -20767, -198980, 42739, 72055, 195220, -11051, -131003, -191912, -122129, -174155, -324954, 93899, 19823, 116027, -174811, -40532, 106471, 116607, -240227, 151637, -52625, -66417, 138857, 27326, -80364, 311718, -83723, 148700, -99091, 35658, 70207, -245408, 52759, -53149, 371126, -55280, -77101, 159092, -101192, 33566, 39506, 215987, -78105, 84451, 156635, 189029, -11576, 105042, -60444, 78593, 104094, 243058, 180820, 67690, 194715, 242488, 97441, 373994, -27117, 18350, 306719, 185460, 422931, 224524, 492354, -103381, 93167, 97134, 128820, 118602, -20448, 386486, 49591, 30525]
15480C0525J81663o4521c900A13833m617J17088a7890C98326J75720L85788B53931
15468B64475A22952J6502b576r3170j90307d7662A76816a94848P8237D27389a73476
15456A99730n0930o1077J70343A02162L31178A04996A8191K58511e9310H3443
15445C38356o6783q3092o4045O28506l42246L06604J49918j63058k44862h8821
15434B44192J11955A3233J12384K2414A1643b1998A9088K2718b78262a25635E7146
15422A29637D8082N5618d2958B22684E2245a73786j69686G7787L09128A30437
15411b51490a10595m25178a10515D9972J70384J0958B5193R0705a07861A38013
15400I9756f1516A41984M5833m9964h0471q5795g927q3658b714O33A3125J68839
$$ y = [30525, 212188, 147667, -3900, 113833, 109216, 226304, -17890, 398326, 574046, 959834, 253931, 264475, 122952, 139454, -2576, -95746, -286053, -47662, 176816, -194848, -116611, 427389, -173476, 199730, 148800, 87723, 258066, 102162, 433340, 104996, 18191, 276702, -59310, 83443, 338356, 271573, 188481, 124436, 752942, 410696, 717300, 867218, 704160, 459298, -88821, 244192, 356147, 13233, 125617, 148031, 11643, -21998, 19088, 41806, -278262, -125635, 57146, 129637, 48082, 103700, -42958, 222684, 52245, -173786, -343472, 77787, 386915, 130437, -251490, -110595, -535773, -110515, 49972, 220356, 231314, 25193, 115898, -107861, 138013, 99756, -61516, 141984, 187817, 137853, -80471, -166266, -7927, -91585, -2714, -2081, 13125, 181964]
15388A81964I04i9544p1630j5970G0561R2786e5235K7304A88082P1894G0684P8763
15376A49447l516R0529L09936k42077D3342M18239k22585A01091e7085A5728b29997
15364b4555B77021e5636I2523k4104j8293J79321J5385j1616m4369L8014G7393
15352h1480L4095A05115B6301J48035C840K86078E7147g0939B29233M3119J51304
15341D23656j69011o2645d3785G4377P2765M1844a12321B56727A21884J29073
15331B50957J26031a30544C72359a66273B05066p4139J52004q5100a9977j73857
15321a93834B10624I5100J69421C0854K7249J55862J80403a914C64757o4092J51593
15310D52258j22243g769A67229J56742j41609a22166A18241m9614a41172J6517
$$ y = [181964, 904, -99544, -171174, -187144, 70561, 163347, -55235, -27931, 188082, 259976, 70684, 149447, 145931, 236460, 546396, 304319, 43342, 461581, 238996, 101091, -57085, 15728, -229997, -24555, 277021, -55636, 92523, 68419, 50126, 229447, 244832, 233216, 188847, 226861, 77393, -81480, -47385, 105115, 26301, 174336, 3840, 289918, 57147, -70939, 229233, 272352, 423656, 254645, 192000, -43785, 74377, 147142, 188986, -112321, 256727, 121884, 250957, 376988, -130544, 372359, -166273, 205066, 130927, 282931, 197831, -19977, -193834, 210624, 95100, 264521, 30854, 58103, 213965, 394368, -1914, 364757, 300665, 452258, 330015, -7769, 167229, 323971, 182362, -122166, 118241, 68627, -141172, -124655]
15300a24655L2400H818R0597b71227i0107a1131k04134b7256A19559j5701J23035
15289B26893E824J50663J50728J75172j66093j32700B3236M3524a47629B33976
15278A40938e9193B8208h2207B53836c10355B06391a64413I9623a1071C05517
15267B68967d9752B03617a84945G377J83297c0657i35n1625F5895c626k03512
15256b07138e9085B95131j04418j6022b32586E7405A6074J83449P6088F3728J7904
15245H1632K29869J82250j19658O68705M62072k0563k81942l12971m5442l9013
15235H04939l76554A88872O5801p0035n521g6082A19470a6871B83188b4261B16494
15223E30354G5700J08846c4533j53235c5523R976H684K22993I0601L8718E01K17077
$$ y = [-124655, -92255, 8818, 99415, -271227, -90107, -11131, -215265, -27256, 119559, 103858, 226893, 5824, 156487, 307215, 482387, 316294, 183594, 23236, 66760, -147629, 233976, 140938, -59193, 28208, -82207, 253836, -310355, 206391, -164413, 99623, -11071, 305517, 268967, -49752, 203617, -184945, 7377, 190674, -30657, -935, -52560, 65895, -3626, -207138, -59085, 295131, 190713, 174691, -232586, 57405, 16074, 199523, 275611, 63728, 81632, 311501, 493751, 374093, 1042798, 1504870, 1484307, 1202365, 889394, 843952, 804939, 428385, 188872, 254673, 184638, 179117, -76082, 119470, -16871, 283188, -24261, 216494, 530354, 75700, 184546, -34533, -187768, -35523, -25547, 8684, 231677, 90601, 129319, 501, 217578]
15211B17578b8838k97746A60785b11469G6967K66720A41002J23520a89552C9874
15200a43918a828I6264a7958G3080j9601R7979m1989C840K42016F5482a2948j38150
15188a51098l454A96590j8752C7672J00845C5515J33914J04559k6512o8692a1170
15176A48600j2144j4403b89833B48086c6177A11509d2700j84915B89460A05015
15165d5657A9448L75361f3621j09302J6602C77563A87155B7352a13923G6220e6779
15153A34037F3060K00149G3937e3351A38257K2689c5550A92338P9007E757M0631
15142D6388N5347h4532B32029q1481B7547P1076D5952P2793M64310B34318I3794
15130B75014I3288K0754m0394K00118H2959R6210j3176J10540p7029O4865d3312
$$ y = [217578, -28838, -326584, 160785, -211469, 76967, 343687, 141002, 264522, -189552, 39874, -143918, -1828, 96264, -17958, 73080, 53479, 151458, 109469, 3840, 245856, 65482, -12948, -151098, -154552, 196590, 177838, 37672, 138517, 35515, 169429, 273988, 247476, 178784, -11170, 148600, 136456, 122053, -289833, 248086, -36177, 111509, -42700, -227615, 289460, 105015, -45657, 19448, 394809, -63621, -172923, -156321, 377563, 187155, 27352, -113923, 76220, -56779, 134037, 63060, 263209, 73937, -53351, 138257, 160946, -35550, 192338, 271345, 5757, 46388, 101735, -84532, 232029, 150548, 27547, 98623, 45952, 118745, 583055, 234318, 93794, 275014, 93288, 114042, 73648, 273766, 82959, 179169, 165993, 276533, 199504, 264369, -43312]
15118C21961M6807j26816b7796A83109c8455C67165j78849a63672E1247B3470
15107D80119b26870H1048l8194R0459K8332M0806C7711J66963i2494H1006c9976
15095A90587F1769J39220c7749D3349J4281J27883q9462C889M7513f2218A06345
15083f2093A02114J0532l7078b29681a2747D4779J4609Q340J05697O4693p6120
15072A61998D3225K96663h7024A51684a15473E37208b8853E39421A29745O4854
15062A94599l0848M228J1714l0461f476C17271j16839J58370A73247b04202A28237
15050A92864C969K34241M0936L13828k88278n9424L2745M17743J32923B16971
15039C42095M5465K03365A34467K25310E2458N95160k17043J09171k58395L56561
$$ y = [321961, 368768, 241952, -27796, 183109, -38455, 367165, 188316, -163672, 51247, 23470, 480119, -226870, 81048, 42854, 133313, 161645, 202451, 37711, 204674, -92494, 81006, -39976, 190587, 61769, 200989, -37749, 43349, 57630, 185513, 96051, 3889, 51402, -62218, 106345, -62093, 102114, 112646, 75568, -229681, -12747, 44779, 59388, 67728, 173425, 238118, 161998, 43225, 339888, -87024, 151684, -115473, 537208, -28853, 539421, 129745, 194599, 163751, 167979, 179693, 149232, -6476, 317271, 200432, 358802, 173247, -204202, 128237, 192864, 3969, 238210, 279146, 592974, 304696, 245272, 278017, 695760, 828683, 216971, 342095, 387560, 590925, 134467, 359777, 52458, 647618, 430575, 539746, 281351, 637912]
15029F37912l425l04628K58103j77904L87542L522C94038m2801J12126j79302
15019B84061R3263L23110n5253j41433j40548r6903J37340o69J69598B78642A32064
15007B01257N6514J5121K79141B52360P0029N6707r4488N5208N9633n7123j5172
14996C27154K96958B02839L79298L7891N2311k8987r760k98392J14053Q0818B09685
14984B95913r1083M95722R9161j56626J47989j87671N4399q8222A87177K50489
14974D37666L81044j58938O9904k07026B04731R6477A42294L86967o3919A76404
14963E37465l0301j7081j4983Q630A96634K55719m5670K97618B09410J01869R1602
14952D02881O4544q9500j9814M4330A30109Q7713O1425M13681A99364M23465k28898
$$ y = [637912, 634487, 329859, 587962, 410058, 797600, 801122, 394038, 351237, 463363, 284061, 377324, 700434, 645181, 503748, 363200, 266297, 403637, 402968, 572566, 278642, 132064, 201257, 257771, 272892, 552033, 252360, 322389, 379096, 284608, 339816, 399449, 342326, 327154, 624112, 202839, 582137, 620028, 672339, 643352, 633592, 335200, 449253, 530071, 209685, 295913, 204830, 700552, 799713, 643087, 791076, 603405, 657804, 569582, 187177, 437666, 818710, 659772, 729676, 522650, 204731, 301208, 142294, 529261, 465342, 176404, 537465, 507164, 490083, 475100, 483730, 196634, 452353, 406683, 704301, 209410, 311279, 402881, 467425, 377925, 358111, 402441, 130109, 217822, 279247, 692928, 199364, 622829, 393931]
14941C93931J80983p6615k3323A89588K50351j38757N32865k56854p8578K69897
14931G68512M01128j69724j1267k75831O28351M12994m65611Q1938L45653k93908
14921A422235L56406l73481j29509M39766R298J66343k90448l64937k32740J89527
14911A192460j63298m36440J57785J86759q9992D08912Q995Q7770O0991j24669
14901D41999p2549K64607j29827m047j22365N2396j58874R6608A39048K78895
14891D17943K41882k54965M04045M0645l43024J07815j14418N4560j3297K9433
14881E70619K96139n3994J3257J46032m81312M0986M5518J11723k74904o7085
14871C46979j1711J26061J86780j1913p0097j73401J66924J08519n5655k19860
$$ y = [393931, 574914, 498299, 474976, 189588, 439939, 301182, 834047, 577193, 498615, 768512, 1169640, 999916, 988649, 712818, 1341169, 1754163, 1288552, 1370490, 1716143, 1422235, 1778641, 1405160, 1275651, 1715417, 1724715, 1891058, 1600610, 1235673, 1002933, 1192460, 1029162, 592722, 750507, 937266, 847274, 408912, 417907, 505677, 566668, 441999, 369450, 634057, 504230, 500183, 377818, 430214, 271340, 367948, 139048, 417943, 659825, 404860, 808905, 849550, 506526, 614341, 499923, 554483, 541186, 570619, 866758, 812764, 826021, 972053, 490741, 531727, 577245, 688968, 414064, 346979, 335268, 461329, 648109, 636196, 566099, 392698, 559622, 668141, 612486, 392626]
14861C92626M47042r5869B86849J16836J32659K5954B25779L31444B56833n9701
14851A97132J88210O4730k24473K57229J65460m26P6796n0921K7682J77944j03002
14840G76361j61024L99006J2068k50316k16797J02201J29303k15431J44343o8062
14830F51652B73482J41054L08898j4369J23938B69561K67217J58649C29327J12418
14820D41745J50160J44268k55034K08163Q1668k15247p5298K42898p8786j95626
14810D48911K10238P3263J72369j96897L13049M3805l88396p3482K59416l26776
14800E35500Q1067L82341k86076k29384q9876J32007j83055K75316l9435J71975
14790G50380n9090j38765A70151O78967l40782O1678J36368J64418n2295k9540
$$ y = [392626, 839668, 743799, 286849, 403685, 536344, 562298, 225779, 557223, 256833, 197132, 385342, 450072, 225599, 482828, 648288, 647862, 724658, 673737, 701419, 879363, 776361, 615337, 1014343, 1026411, 776095, 559298, 661499, 790802, 575371, 719714, 651652, 273482, 414536, 723434, 709065, 833003, 269561, 536778, 695427, 329327, 441745, 591905, 736173, 481139, 689302, 770970, 555723, 480425, 723323, 644537, 448911, 659149, 732412, 904781, 707884, 1020933, 1064738, 676342, 602860, 862276, 535500, 616567, 998908, 712832, 483448, 393572, 525579, 342524, 617840, 578405, 750380, 691290, 552525, 170151, 849118, 508336, 570014, 706382, 870800, 818505, 788965]
14780G88965j53109K64104l33163K84077J37748q5635m05812N42716k60072l48965
14770D30854Q5949L9970k12507M75670j12081k31989M88057k42265k0221j73831
14760E27606J26437K21880j45805q6147n762Q8018j1282j70446B32001L70857
14750F02858J2518N9025K02617m23153N2473N6619J81877j54887J26746L74677
14740A091370m80293o7080O5106K33240l9483J89115k89433l3186J79261L51453
14730A200070q1596J24833L23075l67042L69813k38005L3174J9141j19301n5733
14720A208429j30821l54290M48517k13989K33135l25101j16882k37465K59398
14711G70931M45K83481j88240J02823k0596P5830m3184L66615P2246J3291J71190
$$ y = [788965, 635856, 899960, 566797, 850874, 988622, 902987, 497175, 1039891, 779819, 430854, 516803, 556773, 344266, 819936, 707855, 475866, 963923, 721658, 701437, 527606, 654043, 875923, 730118, 643971, 638209, 726227, 714945, 544499, 232001, 602858, 615376, 674401, 877018, 453865, 506338, 562957, 744834, 589947, 716693, 1091370, 611077, 543997, 609103, 842343, 802860, 991975, 702542, 669356, 848617, 1200070, 1118474, 1243307, 1566382, 1199340, 1569153, 1331148, 1364322, 1383463, 1264162, 1208429, 1077608, 723318, 1171835, 957846, 1190981, 865880, 748998, 511533, 770931, 771376, 1054857, 866617, 969440, 948844, 1024674, 981490, 1348105, 1420351, 1433642, 1604832]
14700A604832N8147k21343j4115k95362q3040n8567O5519r0580R241r3799P2024
14689I52957k8182q018j25244N0149K04943j3561j30896K56115n5054j14145j83328
14678H05736K40103R6260q0172j45640q2964O0320J02422N5604j66961J46972
14668A031680K9786j1303l35664L49333p5255K16532k31835q8979J47449J30640
14658A162384j21160J26287J66144j83551j84479O64336l51257l7207K39094r3953
14648A386638k71842J15410P2225k76969O4183J09945j87554J50173P9821k57749
14638I84281Q8319j10755j85271K20690N15036n22359J16864J68376M8766J9898
14628A343845j39840J01883J27326r2665L6419k1709K00792K07505Q4030P8546
$$ y = [1604832, 1662979, 1441636, 1427521, 1132159, 1049119, 990552, 1056071, 965491, 974732, 880933, 952957, 924775, 916757, 791513, 841662, 1046605, 1033044, 902148, 1158263, 1103209, 989064, 805736, 1045839, 1142099, 1061927, 916287, 833323, 893643, 996065, 1051669, 884708, 1031680, 1061466, 1050163, 714499, 1063832, 988577, 1205109, 973274, 884295, 1031744, 1162384, 1041224, 1167511, 1333655, 1150104, 965625, 1629961, 1278704, 1241497, 1480591, 1386638, 1114796, 1230206, 1302431, 1025462, 1089645, 1199590, 1012036, 1162209, 1242030, 984281, 1072600, 961845, 776574, 997264, 1512300, 989941, 1106805, 1275181, 1323947, 1343845, 1204005, 1305888, 1433214, 1340549, 1376968, 1355259, 1556051, 1763556, 1847586, 1926132]
14618A926132q04504N35104l01504P2535l5409j13778K35891j29366j47075M74868
14608A712894r1010k01215q4719J76615K1721j46279l9856L51194k45875M12088
14598A865558k46124j06601J55299n3011P8378j31265K63244o0896l55094L19401
14588A728889R3005J8464R622k36321M78540j40932j53213L34311k76973k23383
14578A632009J18428L662L62757J73294k32861n2424K52013k88155M43394k51118
14568B160999J19689q3252M495O37459q0935j21471j77082L29329j08884O5257
14558B745604J42562j13081N58512r2110M42122N12583K15958P43274J749693
14549F905117K818632O098580N886469O33167J560221o026028n227568l228878
$$ y = [1926132, 1121628, 1656732, 1355228, 1427763, 1392354, 1278576, 1514467, 1385101, 1238026, 1712894, 1621884, 1420669, 1335950, 1512565, 1534286, 1388007, 1348151, 1699345, 1453470, 1865558, 1619434, 1512833, 1668132, 1615121, 1693499, 1562234, 1825478, 1764582, 1409488, 1728889, 1821894, 1840358, 1849980, 1613659, 2092199, 1951267, 1798054, 2132365, 1855392, 1632009, 1750437, 1754099, 2116856, 2290150, 2057289, 2004865, 2256878, 1968723, 2412117, 2160999, 2280688, 2197436, 2201931, 2839390, 2758455, 2636984, 2459902, 2789231, 2680347, 2745604, 2888166, 2775085, 3333597, 3241487, 3683609, 4196192, 4412150, 5155424, 6905117, 9723749, 15822329, 21708798, 22341965, 23902186, 17876158, 12648590, 9419712]
14541I419712k145796j681323q53374m49269l97960o13923n90368n326l63473
14532B318900M6592k97571J50387Q9236K9760O0314k0220R0603j42429j65649
14522B159923K99768q2723J53573j2997J2345P6369J2360l71122K86759J40817
14512B675072L89590k28798J84195j35640j32024J22954K28141K7955k11320L32787
14502C252912j17395j68851J36693L6028L06124j69564J2889J03990K09675j72311
14492C430190K07202O5629k6776k36128j02493M20969J67481K5435k96504K70630
14482C925635j14338K84452P9187j69476m9263N00509o07564N80385k33384M18452
14472D614595l06644K00457J43843Q1413J42297l19858K43080j07270J95762K14153
$$ y = [9419712, 7273916, 5592593, 4739219, 4289950, 3891990, 3278067, 2687699, 2682373, 2318900, 2365492, 2067921, 2218308, 2307544, 2337304, 2397618, 2377398, 2468001, 2325572, 2159923, 2459691, 2376968, 2530541, 2517544, 2529889, 2606258, 2618618, 2247496, 2534255, 2675072, 3064662, 2835864, 3020059, 2884419, 2752395, 2875349, 3103490, 3131445, 2920125, 3252912, 3135517, 2966666, 3103359, 3139387, 3445511, 3275947, 3288836, 3392826, 3602501, 3430190, 3637392, 3703021, 3676245, 3440117, 3337624, 3758593, 3926074, 3951509, 3655005, 3925635, 3811297, 4095749, 4174936, 4005460, 3956197, 4456706, 3849142, 4429527, 4196143, 4614595, 4307951, 4508408, 4652251, 4733664, 4875961, 4556103, 4799183, 4691913, 4887675, 5101828]
14462E101828j63293K69203O2428o03035M62658j22719K91719L05506k44925K75811
14452E635181k87868P0971K43450L12270k25999L26271j06470j17337K74026R6019
14442F220514j68137K88397p0246L63200j65966L15127R8155l5775J30299P7821
14432G053389J42097J52640J63095J72963k02650N35615Q2869j71935K86421J00286
14422H314790M02907L63758k81004J75117J95559p5510K80054K23243K88763m27468
14412I460209J98144K08568J05881P8172L50922k2469M58888q5931K42414K45019
14402A1239817K19090Q4510K20914K04354j24742N74896J0006J8373K36949L46568
14392A3030735O7431k4355J06940O67952J79944N19321J10812K70551K6106O70833
$$ y = [5101828, 4938535, 5207738, 5270166, 4667131, 5129789, 5007070, 5298789, 5604295, 5359370, 5635181, 5347313, 5418284, 5661734, 5974004, 5748005, 6074276, 5967806, 5850469, 6124495, 6220514, 6052377, 6340774, 6270528, 6633728, 6467762, 6782889, 6881044, 6845269, 6975568, 7053389, 7195486, 7348126, 7511221, 7684184, 7481534, 8017149, 8100018, 7928083, 8214504, 8314790, 8717697, 9081455, 8800451, 8975568, 9171127, 9095617, 9375671, 9598914, 9887677, 9460209, 9658353, 9866921, 9972802, 10050974, 10401896, 10379427, 10838315, 10752384, 10994798, 11239817, 11458907, 11543417, 11764331, 11968685, 11843943, 12418839, 12428845, 12447218, 12684167, 13030735, 13098166, 13073811, 13180751, 13848703, 14028647, 14547968, 14658780, 14929331, 14955437, 15626270]
14382A5626270J9148O57793L67956R431K25540M24507O60134L16303K7750J40923
14372A8475755K27394N95096J94128O50527L69806O03547M27909N14582M57969
14363B2516713J93542L31161P62557K4364O78536O82120L02664P17119O35557
14354B6844333L48081J057415N45236N37301O53162J127968N13034N30436Q82051
14345C3039017Q57855R62738Q57742N37345J367769P73552J094645J496569N47175
14336D1534407J243115J125274J127698J510882J408722J305577J399742J574981
14328E2230398J266404J946096J471537J713236J922306K197534J782593K262589
14320F6792693J870690K671622K634377K224713K726615K782692K880875K708315
$$ y = [15626270, 15645418, 16303211, 16671167, 16680598, 16906138, 17330645, 17990779, 18307082, 18334832, 18475755, 18703149, 19298245, 19492373, 20142900, 20512706, 21116253, 21544162, 22058744, 22516713, 22710255, 23041416, 23803973, 23828337, 24506873, 25188993, 25491657, 26208776, 26844333, 27192414, 28249829, 28795065, 29332366, 29985528, 31113496, 31626530, 32156966, 33039017, 33896872, 34859610, 35717352, 36254697, 37622466, 38396018, 39490663, 40987232, 41534407, 42777522, 43902796, 45030494, 46541376, 47950098, 49255675, 50655417, 52230398, 53496802, 55442898, 56914435, 58627671, 60549977, 62747511, 64530104, 66792693, 68663383, 71335005, 73969382, 76194095, 78920710, 81703402, 84584277, 87292592]
14312H7292592L481351L392743L627579L944128M110026L765855M671697M577563
14304A18863534M791739N000326N416614N763351O200496O265351P023223P463532
14296A66788166P514401P846575Q256015Q613672R369574R992771J0297131J1027932
14288B39706237J1478852J1950869J2955903J2663310J3589012J4325635J4307011
14281C30976829J5143393J5797446J5460069J5085915J4955358J3606654J0107690
14274D31133354O251800L444432J31212k688330j8647696N486175p295507m133011
14266D13682429n543643n077786k329790j641588m968741j1965597j5564036j6120204
14258C50471044j6279361j6715316j6471041j5529095j5375417j4251326j3429170
$$ y = [87292592, 90773943, 94166686, 97794265, 101738393, 105848419, 109614274, 114285971, 118863534, 123655273, 128655599, 134072213, 139835564, 146036060, 152301411, 159324634, 166788166, 174302567, 182149142, 190405157, 199018829, 208388403, 218381174, 228678305, 239706237, 251185089, 263135958, 276091861, 288755171, 302344183, 316669818, 330976829, 346120222, 361917668, 377377737, 392463652, 407419010, 421025664, 431133354, 437385154, 440829586, 440960798, 438272468, 419624772, 425110947, 417815440, 413682429, 408138786, 403061000, 400731210, 399089622, 394120881, 382155284, 366591248, 350471044, 334191683, 317476367, 301005326, 285476231, 270100814, 255849488, 242420318]
14251B42420318j2505128j2177187j1068840j0471374r906910r239160r109096
14244A67942623q202760p528774p550604o559506o477497o170653n657476n236272
14236A14559081n090518m787682m561780m040663m233235l458121l347537l700558
14228H1338987l229526k795165k947910k742782k537986k308990k600913j712619
14220F0463096k280307j847294j772859j766910k053085j338465j608048j236891
14212D6559237j576728j252704j045294j001407j435439j316555p54472j466057
14204C6710581o40627j158402q08285q58769p52588j092590r52665p25621m74496
14195B9246538j300608m07786q73065n56378n96875m78124p26413l61898p31887
$$ y = [242420318, 229915190, 217738003, 206669163, 196197789, 186290879, 177051719, 167942623, 159739863, 152211089, 144660485, 138100979, 131623482, 125452829, 119795353, 114559081, 109468563, 104680881, 100119101, 96078438, 91845203, 88387082, 85039545, 81338987, 78109461, 75314296, 72366386, 69623604, 67085618, 64776628, 62175715, 60463096, 58182789, 56335495, 54562636, 52795726, 50742641, 49404176, 47796128, 46559237, 44982509, 43729805, 42684511, 41683104, 40247665, 38931110, 38176638, 36710581, 36069954, 34911552, 34103267, 33244498, 32491910, 31399320, 30446655, 29721034, 29246538, 27945930, 27538144, 26665079, 26108701, 25511826, 25033702, 24307289, 23945391, 23213504]
14186B3213504l53866n54727m68549m73402o83057o73734J16889k28736p01040
14177A9193282q52499k3313j82835o17753m02631P7941n93147k10197k71675n37236
14167A5579937n69892k44577o9213k91583j86789m96958J36378o88684K1589l1057
14157A3159151l82961l05146k65503K75820n77771R4045k85976k05987l64016
14148A1141656j60656q6827j19718k10855K6815k37040q8474m58419J9942O3779
14138I890203k95461j46345j12000k53372k69648J3338k36645J13588k24410o7004
14128H412244l93298K02638n91841J1325J17655O1151m45603R9844j06266r881
14118G357968j76769Q7840k25601K50832o94458J82817o2262k17623K21573n19346
$$ y = [23213504, 22859638, 22304911, 21836362, 21362960, 20679903, 20006169, 20123058, 19894322, 19193282, 18340783, 18317470, 18134635, 17516882, 17114251, 17192192, 16599045, 16388848, 16117173, 15579937, 15010045, 14765468, 14696255, 14404672, 14217883, 13720925, 13857303, 13168619, 13190208, 13159151, 12776190, 12471044, 12205541, 12481361, 11903590, 11997635, 11711659, 11505672, 11141656, 10981000, 10894173, 10774455, 10563600, 10590415, 10353375, 10264901, 9806482, 9826424, 9890203, 9594742, 9448397, 9336397, 9083025, 8813377, 8826715, 8590070, 8703658, 8479248, 8412244, 8018946, 8221584, 7629743, 7641068, 7758723, 7819874, 7374271, 7474115, 7367849, 7357968, 7181199, 7269039, 7043438, 7294270, 6599812, 6782629, 6720367, 6502744, 6724317, 6204971]
14108F204971Q5699N7221j87773o1833k66644L8904K37580j42116n49l50358l57123
14097E257979N9180K18844K81082j21539o99241K81241l30220O0301P5029l24090
14087D758566R7708N30512p78841K31117j19035n7900m9677J741N7186o3398j59089
14076D448890j76643j61992L97646l20303J31497l75226K56826O5777q5139N1329
14066D232662l05201O5295k34000L05691q7802o2335l51274J61630K6030J0143
14056C760839L7999m9370o9114k65387L85821o55611J56518L89641l60181l68173
14046B962982L78042N6574j48487j06608K42372k80928Q4387k83484K60346m30085
14036B735111J75494j15181J42784P5034J48296j20777O9168k47705O217J5686
$$ y = [6204971, 6290670, 6347891, 6160118, 6098285, 5831641, 5870545, 6108125, 5966009, 5965460, 5615102, 5257979, 5317159, 5536003, 5817085, 5695546, 4996305, 5277546, 4947326, 5007627, 5082656, 4758566, 4856274, 5386786, 4607945, 4839062, 4720027, 4662127, 4612450, 4614191, 4671377, 4607979, 4448890, 4272247, 4110255, 4507901, 4187598, 4319095, 3943869, 4200695, 4266472, 4181333, 4232662, 3927461, 3992756, 3758756, 4064447, 3976645, 3914310, 3563036, 3724666, 3750696, 3760839, 3798838, 3749468, 3680354, 3414967, 3800788, 3145177, 3301695, 3691336, 3331155, 2962982, 3341024, 3397598, 3249111, 3142503, 3384875, 3103947, 3188334, 2904850, 3165196, 2735111, 2910605, 2795424, 2938208, 3013242, 3161538, 3040761, 3109929, 2862224, 2868441, 2884127]
14026B884127N2049l18979O0421O0160k77989K6698M10607k74487j58085J51931
14016B616453r5224j49357M14824r7767k19418j515M2012n5276j45476K6532r697
14005B326091o9001j14397M09077n7446J38582o55542Q14143n06355j28465K3862
13995B180549k55570P04074m69597N21249K88313L02618K447934N122509P737115
13986A8579194J751459L020506k705949n423724k996735k686057j992658j823381
13978E722655j277700p74542n89350j93697m64155L17290l54281k73389L34994
13969B447825k49862q5304K73978K72767m93477L27469k67323j00763k42911J28953
13959B011352M5967r0943q8070J99702J99738k59550l19473P0653M03833k1710
$$ y = [2884127, 2936176, 2617197, 2677618, 2737778, 2459789, 2486487, 2897094, 2622607, 2464522, 2616453, 2521229, 2371872, 2786696, 2688929, 2469511, 2467996, 2510008, 2454732, 2309256, 2335788, 2326091, 2257090, 2142693, 2551770, 2494324, 2632906, 1977364, 2791507, 2285152, 2156687, 2180549, 1924979, 2629053, 2159456, 2680705, 2969018, 3271636, 5719570, 10842079, 18579194, 20330653, 23351159, 20645210, 15221486, 12224751, 9538694, 7546036, 5722655, 4444955, 3670413, 3081063, 2887366, 2423211, 2740501, 2386220, 2112831, 2447825, 2197963, 2112659, 2386637, 2659404, 2165927, 2493396, 2226073, 2125310, 1882399, 2011352, 2057319, 1966376, 1878306, 2078008, 2277746, 2018196, 1698723, 1769376, 2173209, 2151499]
13949B151499p17157K39181K54470j48048J02240M544k20314J04037k84115K50822
13939A737159l37252J66825K16826k40456j0215o2611l8001l1186K38805K5608
13929A665502q8353k7010q6281J57674J6982k39743m5263J95235m1278k97310
13919A210155J16355J82273j66985n6471J23037J07668K8776Q50m28392J50071
13909A267337L79086l16019j86811M21851j12577j81907j44719j49208L53621
13900A330654k7335k02503L80007m80137K96053k6748j35985J11218j52543L85633
13890A478314j98574k48874L1364M590K63876L48863n05855J51701k74987N4319
13880A104737P249L57024n76964J28432L12429l59155O1792k87030N74989k87924
$$ y = [2151499, 1434342, 1673523, 1927993, 1779945, 1882185, 1886729, 1666415, 1770452, 1486337, 1737159, 1399907, 1566732, 1783558, 1543102, 1532887, 1470276, 1432275, 1401089, 1639894, 1665502, 1577149, 1550139, 1463858, 1621532, 1638514, 1398771, 1353508, 1548743, 1507465, 1210155, 1326510, 1508783, 1341798, 1285327, 1408364, 1516032, 1544808, 1545658, 1117266, 1267337, 1646423, 1330404, 1143593, 1565444, 1452867, 1270960, 1126241, 977033, 1330654, 1303319, 1100816, 1480823, 1000686, 1296739, 1269991, 1134006, 1245224, 1092681, 1478314, 1279740, 1030866, 1062230, 1066820, 1330696, 1679559, 1173704, 1325405, 1050418, 1104737, 1111986, 1469010, 892046, 1020478, 1332907, 973752, 1035544, 748514, 1323503, 1035579]
13870A035579M7798j84847J22027M2087j23979K34255k53085o2413Q5626J97042
13860A140090r4411O4543j9205O4474k66028K22443K4091j88126N6195j19586
13850H84480O1439j60079J23108k529L56091n05252J47912L83539l69906k6899
13840H91904N4702j50530R4247N4785j7113J34070k08509k16574P8876J45032
13830H60890m9667j24353L84045p9057j80939L54444k21517R790k92659K39338
13820I00315J13247j17745J05494j83372r2633L23193o5742l35282K4358o2693
13810F09140M62133p9056D55930K45819O5221M12838o327k87226k8008K15073
13800A073320k65283j23463q0957O5677J60870k58945L55289j78556k67399K28439
$$ y = [1035579, 1083377, 898530, 1020557, 1062644, 938665, 1172920, 919835, 857422, 943048, 1140090, 1045679, 1110222, 1091017, 1155491, 889463, 1111906, 1135997, 947871, 1004066, 884480, 945919, 785840, 908948, 906419, 1262510, 757258, 905170, 1288709, 918803, 891904, 946606, 796076, 890323, 945108, 927995, 1062065, 853556, 636982, 715858, 860890, 811223, 686870, 1070915, 991858, 810919, 1165363, 943846, 953636, 660977, 900315, 1013562, 895817, 1001311, 817939, 725306, 1048499, 982757, 647475, 671833, 609140, 1071273, 992217, 455930, 701749, 766970, 1179808, 1173481, 886255, 858247, 1073320, 808037, 684574, 603617, 669294, 830164, 571219, 926508, 747952, 480553, 708992]
13790G08992n6240J31178O8001j47593R0053j62950L30456k71222J25958Nk2819
13779G93819k64075k3689M47887k54018j23996N71720l44081k81653k30372R9856
13769C91398K32261o3784J94262j06713m1463K21315l09865Q9407L9042j76147
13759D69713L27547k23470K71094l4100k54732j12422J54893J31157B60466L52432
13749F12898R8006r5280j84223J92846J21751n3507N2902j81882p3217j9876Q7445
13738E57863n1021O809j54050J41057m9457P2326K54942Q2883l24529q8432K92903
13727G41294J1287k6646N2675M5077q9436m9171k31433L31284k77926j2522j47139
13716C47344J03113j11564P01589m83401K29628A58632K66093j01545L00377O0322
$$ y = [708992, 652752, 783930, 851931, 704338, 794391, 631441, 961897, 690675, 816633, 816638, 793819, 529744, 506055, 953942, 699924, 575928, 1147648, 803567, 521914, 291542, 391398, 623659, 559875, 754137, 647424, 605961, 827276, 517411, 606818, 645860, 469713, 797260, 573790, 844884, 810784, 556052, 443630, 598523, 729680, 260466, 612898, 710904, 615624, 431401, 624247, 745998, 692491, 745393, 563511, 490294, 470418, 557863, 506842, 513651, 359601, 500658, 451201, 523527, 778469, 861352, 536823, 448391, 741294, 752581, 725935, 778610, 823687, 734251, 685080, 453647, 784931, 507005, 494483, 347344, 450457, 338893, 1040482, 557081, 786709, 158632, 424725, 323180, 623557, 683879]
13706F83879B86348J20958K88993k42877j54448J63452l2946R8298K70114l69897
13696D27995K0526M14980l78109o1293K33339B00076a86565F92995r8095B04304
13685E40764B70058J41101J93894N6593l02444Q0281K2657L51044l90823N20003
13675I42364D11163q4512j2909K46697k09788j9281n609M31J36323o2440j56631
13664B43444N03259k72792k06914M47596k89621D1550M28539k06425J78723K09971
13654F52358k73775K78796k02015J85382j03497p3582j74841p470Q2315M443m3287
13643C24827j04757J56707J34473j12486K69237k92531n3818r6009J24214J54435
13633E04292A41957L75175j15609R608L1455J27190E7398N14257E2800M78026
$$ y = [683879, 286348, 407306, 696299, 453422, 298974, 462426, 429480, 527778, 797892, 427995, 448521, 863501, 485392, 424099, 657438, 200076, -186565, 692995, 594900, 204304, 540764, 270058, 411159, 605053, 661646, 359202, 439483, 462140, 813184, 422361, 942364, 411163, 326651, 313742, 560439, 350651, 331370, 325761, 326192, 462515, 400075, 243444, 746703, 473911, 266997, 714593, 424972, 41550, 470089, 263664, 442387, 652358, 378583, 657379, 455364, 640746, 537249, 463667, 288826, 281356, 363671, 368114, 324827, 220070, 376777, 511250, 398764, 668001, 375470, 321652, 225643, 349857, 504292, 141957, 517132, 401523, 411131, 442586, 569776, 57398, 571655, 52800, 530826]
13623E30826k57011J62590j99727J17503Q5124P8187B13092N1812J04508A01398
13612D95347o9448j62827P9935Q1350A30484M03347j03700r1584E6639K07792
13602B64431A08649R7712K26956d219D2973L49106K32786j85778j44833p3708
13592B20546O635M23339C13866Q9065Q8249j44943n7276P7417M04264B75817J83433
13581D59250A02248J77094C1198J18176J35426J02741J55486q9525j46086J83350
13571D90766k14082M305r1607M04052p864k21621j33889I0993K51420q8994J05307
13560C58726c282B98933j22058L73885k64915J36698L3422c3769E20365k38073
13550B82292Q2518K2462R9752A72550L17437k44409M9278J1263j37484N0989d2534
$$ y = [530826, 273815, 436405, 236678, 354181, 439305, 517492, 213092, 264904, 369412, 101398, 495347, 425899, 263072, 343007, 424357, 130484, 533831, 430131, 338547, 56639, 264431, 108649, 206361, 433317, -4219, 42973, 392079, 624865, 439087, 294254, 220546, 227181, 650520, 313866, 402931, 491180, 346237, 288961, 366378, 770642, 275817, 459250, 102248, 279342, 31198, 149374, 284800, 387541, 543027, 453502, 307416, 490766, 276684, 280989, 189382, 593434, 585570, 363949, 230060, 90993, 342413, 253419, 358726, -3282, 298933, 176875, 550760, 285845, 422543, 455965, -33769, 520365, 282292, 364810, 387272, 487024, 172550, 489987, 245578, 294856, 306119, 168635, 219624, -42534]
13538C69551j24842Q6682m5073K73858o9664A54437L12993A62866J35448n3974
13528B44340B1487K34708K23256A94712L7173L58220A9780N29553A83034O1237
13518B44271j15009E0940M16211A9744N3249Q4221L85726a54138C85799A34721
13507A57739j4811L01732a0808D7690K07386p1786J44934K0987J25508k06177
13497B68542j14308J42668l980D6388j3534O0212K12544G5262R4260K7154J2079
13486B08755L34173p8707j62944B2652K87758q3671a5955B96601A4534a06958
13475A45791L40606c0387D05943j83766h0301D17668A12574g8044A15996J82661
13465B98657J55922j84896f4697A54452C5797P9873J21725q2864J15465E4862
$$ y = [369551, 244709, 331391, 286318, 560176, 490512, 154437, 467430, 162866, 298314, 244340, 21487, 256195, 479451, 194712, 231885, 590105, 19780, 549333, 183034, 244271, 129262, 50940, 467151, 19744, 72993, 157214, 542940, -154138, 385799, 134721, 157739, 142928, 444660, -10808, 47690, 255076, 183290, 328224, 349211, 474719, 268542, 154234, 296902, 292922, 46388, 32854, 93066, 305610, 75262, 169522, 196676, 208755, 542928, 464221, 301277, 22652, 310410, 226739, -15955, 296601, 14534, -106958, 145791, 486397, -30387, 405943, 222177, -80301, 417668, 112574, -78044, 115996, 298657, 454579, 269683, -64697, 154452, 35797, 115670, 237395, 154531, 269996, 54862]
13454C58603J18274j35290A62179J0673P8406R9411n5871A9680J01664K72412
13444C93756Q7667k08676q3724m3170m7414J34036l2497j5054R5453j01909Q1522
13433B59990j22274K41485j82080K62415A89382P0358m1905A03682c3243A72726
13422B20334j7298J06218F5656o965K6979K27023c24072A00944K9723a52066J1783
13411a40283B69291j2392j1607A22425c8266C33104C1815J41828o7739J00273
13401B06177j6012B5615J70492o1375K96996D5003j9202P3868N868K72926A68246
13389B65341H9523K25344F9134J13265q9298Q8344a88795A22694f921B69124j8503
13378B50621n7513l0554d0963B28904q2662J39988K080G3578J88574r9422Q3784
$$ y = [358603, 476877, 341587, 162179, 172852, 251258, 350669, 294798, 19680, 121344, 393756, 481423, 272747, 189023, 145853, 98439, 232475, 199978, 184924, 280377, 178468, 259990, 137716, 379201, 197121, 459536, 189382, 259740, 217835, 103682, -33243, 172726, 220334, 203036, 309254, 65656, 58691, 85670, 312693, -324072, 100944, 130667, -152066, -140283, 269291, 256899, 245292, 122425, -38266, 333104, 31815, 173643, 105904, 206177, 190165, 25615, 196107, 134732, 431728, 45003, 25801, 99669, 105537, 378463, 168246, 265341, 89523, 314867, 69134, 182399, 93101, 181445, -188795, 122694, -6921, 269124, 250621, 193108, 162554, -40963, 228904, 146242, 286230, 288310, 73578, 262152, 162730, 246514]
13367B46514B3523K51325l0662J24855j04079L74927B7215J05168B5545J4993
13357D0538L17538G8505J45862I8105p434M6419h7999A26063a09471c0671C97402
13345A06563J30495I3180M7153M3027J38129l838q9299K16253B11232a5202C81122
13333B37220O4056p5323r2666R2562P0645j46498K00588M9557o8513D0886P311
13322D8197a1417C61751D3995K9443J25259E502b8747E75400B69397j2209K8435
13311B85623A38007K64686p3073L60718A23054m943K53325A01981e655C1102K14821
13300B45923p0610o4363J1511B917J33695k512J70111m2772I7556j2401P5266
13289A60421a77011D984M84806A79827C0121f9535J2394D25680A22674J58650
$$ y = [246514, 23523, 274848, 244186, 369041, 264962, 639889, 27215, 132383, 25545, 40538, 358076, 78505, 224367, 98105, 90671, 137090, -87999, 126063, -109471, -30671, 397402, 106563, 237058, 93180, 140333, 183360, 321489, 317651, 228352, 444605, 211232, -15202, 381122, 237220, 301276, 225953, 133287, 225849, 296494, 149996, 350584, 400141, 331628, 40886, 48197, -11417, 361751, 43995, 73438, 198697, 5502, -28747, 575400, 269397, 257188, 285623, 138007, 402693, 329620, 690338, 123054, 118111, 371436, 101981, -5655, 31102, 245923, 175313, 110950, 122461, 2917, 136612, 134100, 304211, 261439, 97556, 85155, 160421, -177011, 4984, 489790, 179827, 30121, -69535, -57141, 425680, 122674, 281324]
13279B81324N100H0454A9381L70195b21736C95102D7078K87376G1096j3020P9958
13268A38034N5445a58021d0705j91285B69790J20432a22183A61579J38950l9239
13258B61290p1870a43968m1741b8119N405E88277F3945B8882J14211K68398b7387
13246a6812j39710C38427A40839k3215b24728I1825Q1401Q5816r3530k4125a82440
13234A63712M6416B6173b25662B91464b38066G8234E890b6469j61698A44894K54886
13223C99780H7924k5445i8681F59239a22708B64514D6200Q0386b26483C06a00984
13211a05950J9243c9080q0915k1784B56904n289l3748J56230e6773B13985q6891
13200A27094E4951N2896a00138j198j13146B07671J6603c6506A22135J19311B2400
$$ y = [281324, 286424, 80454, 19381, 389576, -221736, 395102, 47078, 334454, 71096, 58076, 138034, 193479, -158021, -40705, -231990, 269790, 390222, -122183, 161579, 300529, 261290, 189420, -143968, -185709, -28119, -22714, 588277, 63945, 28882, 143093, 411491, -27387, -16812, -156522, 338427, 140839, 117624, -224728, 91825, 173226, 259042, 165512, 141387, -182440, 163712, 210128, 26173, -225662, 291464, -238066, 78234, 5890, -26469, -188167, 144894, 399780, 87924, 62479, -98681, 659239, -122708, 264514, 46200, 126586, -226483, 306, -100984, -105950, -86707, -39080, -119995, -141779, 256904, 251615, 217867, 374097, -56773, 213985, 127094, 54951, 107847, -100138, -101336, -214482, 207671, 224274, -36506, 122135, 241446, 22400]
13188a88361A05595b6552A48780L824L0J63961d8602A56299l1919J53882j20063
13177A58199C8734C20K80999G3809g1224A82571i7111B6777M3056c59773e9037
13165A45006a1231k09248a4503k581G2017A5420E013N7274b58017g7141m9989
13154a27130j29422I9145c12858d7114n6650B32201N0910h3967F19678l01626
13144C18052a93565g2196n95B69808A30470a06852j67033a26881C776L45394H8111
13132a51121F2011J10031A391J29451A6571c37881A01804O8482m8923b31269F8626
13120d0107D2626a5033j51771A29848e8199I1113i4507E4832R2200a1604j65197
13109a76801C64456A16867e581A929J59943J57884c84938C45962A05710l8463
$$ y = [-188361, 105595, -26552, 148780, 152604, 152634, 316595, -48602, 156299, 124380, 278262, 158199, 38734, 320, 281319, 73809, -71224, 182571, -97111, 26777, 69833, -359773, -59037, 145006, -11231, -220479, -14503, -17084, 72017, 15420, 5013, 62287, -258017, -77141, -127130, -256552, 99145, -312858, -47114, -103764, 232201, 283111, -83967, 619678, 318052, -193565, -72196, -72791, 269808, 130470, -106852, -273885, -126881, 3776, 349170, 88111, -151121, 62011, 172042, 1391, 130842, 16571, -337881, 101804, 170286, 121363, -231269, 68626, -40107, 42626, -15033, -166804, 129848, -58199, 91113, -94507, 54832, 147032, -11604, -176801, 364456, 116867, -5581, 1929, 161872, 319756, -384938, 345962, 105710, 67247]
13099F7247a00285A71887e495C30079e8036A42554E3771P3698B2652f8163B94096
13087H22J13874l62i8320J6792C5132N8996q759O5667o8980O8675o3881r545J49953
13074B27258j0706g5074A18805b07944A49050p3986l4839a2566p5308C7201d0257
13062A6512a7767j05602D81860j20922r9394A9754K41181h4257C79198F5745c5965
13050B92288h2752A54897B4004r509P1347K18982I0857a9668A65770j6058i4424
13038A20015C0044J14577J01566A1826L18385j13328a99410H9671K4543h376B9831
13026B84401j4886j14971B8833c3701I241D526K868K08577a49448C9238K37933
13015B77171j25511l1997A8378K2656L57531B9702K99653A4595J76385a80627
$$ y = [67247, -100285, 171887, -5495, 330079, -58036, 142554, 53771, 127469, 22652, -68163, 294096, 822, 114696, 114334, -98320, -81528, 35132, 94128, 85369, 151036, 82056, 150731, 86850, 77305, 227258, 216552, -75074, 118805, -207944, 149050, 75064, 40225, -12566, -87874, 37201, -40257, 16512, -17767, -123369, 481860, 360938, 261544, 19754, 260935, -84257, 379198, 65745, -35965, 292288, -82752, 154897, 24004, 14495, 85842, 304824, 90857, -19668, 165770, 149712, -94424, 120015, 30044, 144621, 246187, 11826, 330211, 216883, -199410, 89671, 114214, -8376, 29831, 284401, 269515, 154544, 28833, -33701, 9241, 4526, 7394, 215971, -149448, 39238, 277171, 151660, 119663, 18378, 41034, 398565, 29702, 329355, 14595, 190980, -180627]
13004H5821N9699n1902N23839b09378B02311J3702H3451M27548A25095O7414G1806
12992c8208B33535a44269A13402e9303E8665c32035g7509A18051o271M6243K49123
12981D07146a55947C5576J47969a04217B44417D9946f6165l0325B02384j00335
12971A02049c81957B03188G026a9647h838L604q2539j24762p0159B2283b50960
12959a62561B09929G75J95587h2467A2862K4545A5744b12875R5957H050J99444
12948B07494c5743j22793D8160M3249a41734B91920j1925D3658h6465D61109a21227
12936E3444a9660k53565A73351A4077a54686H0471C3849a43493e5380j04730J9059
12925a41051E5836Q334Q5737R0362c39878A414e4413a4775r642n1217B29227d7019
$$ y = [85821, 145520, 93618, 617457, -209378, 202311, 216013, 83451, 510999, 125095, 192509, 71806, -38208, 233535, -144269, 113402, -59303, 58665, -332035, -77509, 118051, 111780, 158023, 407146, -155947, 35576, 183545, -104217, 244417, 49946, -66165, -96490, 202384, 102049, -381957, 203188, 7026, -19647, -8838, -5234, -87773, -212535, -282694, 22283, -250960, -162561, 209929, 775, 196362, -82467, 12862, 37407, 15744, -212875, -116918, 8050, 207494, -35743, -158536, 48160, 91409, -141734, 291920, 279995, 43658, -86465, 461109, -121227, 53444, -19660, -273225, 173351, 14077, -154686, 80471, 33849, -143493, -55380, -160110, -141051, 55836, 64170, 149907, 240269, -339878, 1414, -54413, -14775, -24417, -75634, 229227, -47019]
12912c5837j04226j0704d2543A78527b87911A20776i3918M0510E5956i3654B3880
12900h7832C85158a36815H3709K7776E4361c65190O4321A30385E560a20806A15034
12888a3535F6518a37621E775O1355J34902b1663B07276h7346B75438j24493a3374
12876g8820j92168f7321J4254A05727l4441P2952b1101p4264j94461h4069J3229
12865g0840B82044J4850g2982H5433e4424J4559F2949g0323K9268G8621j0817
12854F7804L39792A16476g0376A27067N5958e2222A41451a88369A28107D398a67392
12842a10021A38882b67508C29268I0739K07197A20786c95201I3341R7840B0526
12831a21809A74398g2150n1910L0853A8170a3084C1176K22569i9120j1004C50389
$$ y = [-35837, -140063, -150767, -42543, 178527, -287911, 120776, -93918, -53408, 55956, -93654, 23880, -87832, 385158, -136815, 83709, 111485, 54361, -365190, -300869, 130385, 5560, -120806, 115034, -13535, 66518, -137621, 5775, 67130, 202032, -21663, 207276, -87346, 275438, 150945, -13374, -78820, -270988, -67321, -53067, 105727, 71286, 144238, -21101, -95365, -289826, -84069, -70840, 282044, 296894, -72982, 85433, -54424, -39865, 62949, -70323, -41055, 78621, 67804, 407596, 116476, -70376, 127067, 183025, -52222, 141451, -188369, 128107, 4398, -167392, -110021, 138882, -267508, 329268, 90739, 297936, 120786, -395201, 93341, 191181, 20526, -121809, 174398, -72150, -124060, -93207, 18170, -13084, 31176, 253745, -99120, -110124, 350389]
12819c63925C92435b22714A11476i8177A32237a04700M2884j68607C2617a39956
12808A13270J11443A00759b53643p5712B94582m7449j17447c39459C18980I1838
12797a89684A7301K1768K1327A9315a35283l4139P2205A71798D9074c80420f0264
12785a8C3521a7099l112B17335a7260F4235a13485B9344L0817K15556i1721m0606
12773a32327d0418A68543m9912p868J20189b97144C96577A94980n4046i0306a1582
12761a29314L615E1563a33001G5722a93744B66250f5085B8104J11630N3746p6196
12750A17284J19564B6360J18568J71929b15343F2389R5604D5951K53091I7018
12739A15654d168E4959m119J34990a13603l6404A325L51676m3014I7033M8679
$$ y = [-363925, 392435, -222714, 111476, -98177, 132237, -104700, -61816, -230423, 32617, -139956, 113270, 224713, 100759, -253643, -329355, 294582, 247133, 129686, -339459, 318980, 91838, -189684, 17301, 39069, 60396, 19315, -135283, -169422, -97217, 171798, 49074, -380420, -60264, -18, 33521, -17099, -20211, 217335, -17260, 64235, -113485, 29344, 60161, 275717, -91721, -132327, -40418, 168543, 118631, 110763, 230952, -297144, 396577, 194980, 140934, -90306, -11582, -129314, -125699, 51563, -133001, 75722, -193744, 266250, -65085, 28104, 139734, 193480, 117284, 236848, 26360, 144928, 316857, -215343, 62389, 157993, 45951, 299042, 97018, 115654, -4168, 54959, 50840, 185830, -113603, -150007, 1325, 353001, 309987, 97033, 145712]
12728A45712j7121K37024d4570j09988B9920b44154M121A2532a4054G7758A7760
12716G2602J64710A08538K2143f0003j71003I603J42601O0353l0480M365a65394
12704a7257B43499R5711A13292j7226a26687F3636B4757a7705C03624b92133i2625
12692a58201O9942c882k34601A67505b83697A74363a25014B2888b94437A69949
12681B07258J08909R3146A0977J01246M9349b78122J31167d7371j70182F3290
12670e4541A62713a07426L1630H8062K2295a04368j12751c5655F2583B3433J48404
12659A71837J74273D3510e075A30141B266J5077a22112e0201B70345a23292B6285
12647A17056l1303L6760P1407N4626D8703i59j88391A7811J18842E5176c8922
$$ y = [145712, 128591, 365615, -44570, -154558, 29920, -244154, -240033, 12532, -14054, 77758, 17760, 72602, 237312, 108538, 130681, -60003, -231006, 9603, 152204, 212557, 182077, 186442, -165394, -17257, 243499, 339210, 113292, 96066, -126687, 63636, 24757, -17705, 303624, -292133, -92625, -158201, -88259, -3882, -238483, 167505, -283697, 174363, -125014, 22888, -294437, 169949, 207258, 316167, 409313, 10977, 112223, 161572, -278122, -146955, -47371, -217553, 63290, -54541, 162713, -107426, -75796, 88062, 110357, -104368, -217119, -35655, 62583, 23433, 171837, 346110, 43510, -5075, 130141, 2266, 17343, -122112, -50201, 270345, -123292, 26285, 117056, 85753, 122513, 193920, 248546, 48703, -959, -189350, 17811, 136653, 55176, -38922]
12635a88357B44813j718r0865b48698B72004b93496a04046m6421K7719A55464
12624B15722J1211J5419P8975a73650B5439b0286A33041m1540K21499A064J81953
12613A83017b12374B04765c39073Q2479B16457a71557k093K9337A4819c1977k08828
12602b40805I526a94379B77331k2036j09778l3309B9876M1057A4375b9688A42086
12590b9001C9000a14397m4898D0865L37222j75284Q188b92449O8388H9951J17707
12579B07658c1366l5619o2884B23046p7724A7533h2694A25508l9414a54221A45814
12567G4609H315e12494a1328r9697c9648H6503a35656l3840H3565c22527D18491
12555g2514B7593a40661b8836B17855a01066r4436m9922J6001A39868i2722F9649
$$ y = [-188357, 244813, 243095, 152230, -248698, 272004, -293496, -104046, -150467, -122748, 155464, 215722, 226933, 242352, 321327, -173650, 25439, -20286, 133041, 91501, 313000, 1064, 183017, -212374, 204765, -339073, -256594, 216457, -171557, -173650, -144313, 14819, -31977, -240805, 9526, -194379, 277331, 255295, 145517, 112208, 29876, 70933, 14375, -29688, 142086, -29001, 39000, -114397, -159295, 40865, 378087, 202803, 210991, -292449, -224061, 89951, 207658, -31366, -66985, -129869, 223046, 145322, 17533, -82694, 125508, 86094, -154221, 145814, 74609, 8315, -512494, -11328, -111025, -39648, 86503, -135656, -169496, 83565, -322527, 418491, -72514, 27593, -140661, -28836, 217855, -101066, -195502, -245424, -229423, 139868, -92722, 69649]
12543F7824M7947h4130A23396A7646K32762q6842A9696a34848p1156K0377j75942
12532c61569a27q6265l1076I1123J19600J15149H032c4559A02328J64953G8572
12520C17020D7892L1230h4568C26081c3671D00628a35782b0779j77849C366K0701
12509B4067a21001A29575m5586g7820G4239i3654j05293E8138b6011G5520K7025
12498A02545A1238J41855A9167d0397A77312F3155J05137o0555J18157m6709c9028
12486A58813m7675b86540a42481o1405p1117F1941N5349a10384A6734c89742g4064
12474E4368H075g9444A8519J59533D799K97540b49790C54762A53151i0992j43251
12463b34243p93a01524A13402j7355a61841N2639E110d6626C0401K00412B9510
$$ y = [67824, 115771, -84130, 123396, 17646, 250408, 163566, 19696, -134848, -206004, -185627, -361569, -127, -86392, -117468, 91123, 210723, 325872, 8032, -34559, 102328, 267281, 78572, 317020, 47892, 79122, -84568, 326081, -33671, 400628, -135782, -20779, -198628, 3366, 24067, -121001, 129575, 83989, -77820, 74239, -93654, -198947, 58138, -26011, 75520, 102545, 11238, 153093, 19167, -40397, 177312, 63155, 168292, 107737, 225894, 179185, -39028, 158813, 111138, -286540, -142481, -203886, -275003, 61941, 117290, -110384, 16734, -389742, -74064, 54368, 8075, -79444, 18519, 178052, 4799, 302339, -249790, 354762, 153151, -90992, -234243, -235036, -101524, 113402, 96047, -161841, -109202, 5110, -46626, 30401, 230813, 29510]
12451b87110A15766J3043E8392B4603a41057L4675k14550J29221L5197b3625B32254
12439B39776B2340J49885C7991g4175r0274A12534k330Q3872g0965e54k12065
12428b12619f359A07542e3044m2520A40787h1120H6051C8972J26100C4663j6999
12417A7664a16265l7128j62882B72157a91620i3870B24239B4960J05890a89441
12406a40464N8336A84462c51164B03491e2530j3206A15852B3415a30260e679j72822
12395a78501b0137j52493B015b5818k5018E5593e2721b4692D20280a93986A1037
12383e2151F2483h7879K7952G1055Q6823K2260m3175A8340J74172a42803j6159
12372a58962P6747p3160B98175j46333a08192b9211A80054b5863B37718j11692
$$ y = [-287110, 115766, 128809, 58392, 24603, -141057, -106382, -320932, -191711, -156514, -23625, 232254, 239776, 22340, 172225, 37991, -74175, -164449, 112534, 110204, 194076, -70965, -554, -212619, -6359, 107542, -53044, -95564, 140787, -81120, 86051, 38972, 165072, 34663, 17664, -116265, -153393, -316275, 272157, -191620, -93870, 224239, 24960, 130850, -189441, -140464, -82128, 184462, -351164, 203491, -52530, -65736, 115852, 23415, -130260, -5679, -178501, -20137, -172630, 2015, -25818, -50836, 55593, -52721, -24692, 420280, -193986, 11037, -52151, 62483, -87879, -59927, 71055, 157878, 180138, 136963, 18340, 192512, -142803, -158962, -82215, -155375, 298175, 151842, -108192, -29211, 180054, -25863, 237718, 126026]
12362A26026e7122B10107a37953f6199k632L3971C84882A50262K8978e7835B24496
12350i8968L4666d124A04289f9927h004j8024l22276d1505A9881J70462a65131
12338a81725H3274h3970J7383c2134D8552L59697H1482f2613g089A39525Q1826
12327B21351m5359j3321B2974K74796a49631f6678A71180E8482i0111A00842J13439
12316B14281J81837A91120g9822E1439L57670D7913K31298j20978a49587l5764
12306a85351A00520P4113a23033B09958a30564H665N6123d0000B24970o7063f5780
12294c668C02062A19625a10488H4512i5496A56910o051N8974j5094h5747C00517
12282C17299I3081b1900j38321D90203A51208B0924a70450B22025a29610A92053
$$ y = [126026, -57122, 210107, -137953, -66199, -68831, -34860, 384882, 150262, 179240, -57835, 224496, -98968, -64302, -4124, 104289, -69927, -8004, -26028, -348304, -41505, 19881, 190343, -165131, -181725, 83274, -83970, -66587, -32134, 48552, 408249, 81482, -62613, -7089, 139525, 221351, 175992, 162671, 22974, 297770, -149631, -66678, 171180, 58482, -90111, 100842, 214281, 396118, 191120, -79822, 51439, 409109, 47913, 279211, 158233, -149587, -185351, 100520, 174633, -123033, 209958, -130564, 8665, 64788, -40000, 224970, 157907, -65780, -3668, 302062, 119625, -110488, 84512, -95496, 156910, 150859, 209833, 194739, -85747, 300517, 317299, 93081, -21900, -160221, 490203, 151208, 20924, -170450, 222025, -129610, 192053]
12271H4228R9603K02917A77754K06285j21083j01458c955D06814A07230R3538
12261B00768G7693d5531k12144B91505d8399C17119H8420j2826a81517h5201A93582
12249B84057r2500G6675a18386D79948i4913B45815H2843J08826H8767q96d31229
12237C58162G1252b6098O709l2729A01658j9708f7624B07383n4482K91550k00546
12226B43905R5505O8682A50306M1893i9923B03502n9001L9008b3890F7061R5248
12215A62309f4879G5175K40367q6333a05255I3568J76092g3581A03148J64511
12205B67659B2802K63408j16122J5148J89287I1219J52908m6698a13539b5844
12194A81538J7493H4624P8809R2482J07950A23666a8977A2815J20048J3701J30562
$$ y = [84228, 183831, 386748, 177754, 384039, 262956, 161498, -3955, 406814, 107230, 200768, 77693, -45531, -257675, 291505, -48399, 317119, 88420, 75594, -181517, -85201, 193582, 284057, 191557, 76675, -118386, 479948, -94913, 245815, 82843, 191669, 88767, 87871, -431229, 358162, 71252, -26098, -19389, -52118, 101658, 81950, -67624, 207383, 152901, 444451, 243905, 339410, 408092, 150306, 192199, -99923, 203502, 144501, 183509, -23890, 67061, 162309, -64879, 75175, 315542, 229209, -105255, 93568, 269660, -73581, 103148, 267659, 22802, 286210, 170088, 185236, 374523, 91219, 244127, 197429, -113539, -25844, 181538, 199031, 84624, 163433, 255915, 363865, 123666, -18977, 12815, 132863, 146564, 277126]
12183B77126r0170q6023c1847B30681a01941B4575L40280j31430k7766J94045
12173C99704j70731D1880K48644L5946A9492M01877A99146J74226j15416j990
12163B55966L06594k30055E8714J60973h388A69786n2031J99891A2546R1138M1621
12152A45305O7053J155m8332J7636M2931H5033a4549B01010b362B05629m7433
12141A58196D2679j9946a16828A22326C4266i680A76898f7924C12766P7375I0361
12129C14511e5334I0400h3534B86472M2254o2906P5266A47487a51233C23423C6807
12117a01123K7478j84219B37584q5762E1449J73042F8272J95361I0674J38294
12107B28968j029i8598J6130A38802j7966P6731F3941J81463J85829C8278J69743
$$ y = [277126, 186956, 100933, -31847, 230681, -101941, 24575, 364855, 233425, 205659, 399704, 228973, 41880, 290524, 326470, 19492, 421369, 199146, 373372, 257956, 255966, 562560, 332505, 58714, 219687, -8388, 169786, 117755, 317646, 12546, 103684, 145305, 212358, 213513, 165181, 182817, 225748, 85033, -14549, 201010, -2362, 205629, 158196, 42679, 22733, -116828, 122326, 34266, -9680, 176898, -67924, 312766, 390141, 90361, 314511, -55334, 90400, -83534, 286472, 328726, 265820, 341086, 147487, -151233, 323423, 36807, -101123, -73645, -257864, 237584, 151822, 51449, 224491, 68272, 263633, 90674, 228968, 227939, -98598, -82468, 138802, 120836, 197567, 63941, 245404, 431233, 38278, 208021]
12096B08021J06305g28I6170g7034j98554a07363c8624p4221A45866K13322j34916
12085B24272l0001P6885H7607C4808L45940j71836l8454i1309C78073B4619Q4092
12074A08711B7921P8573J78251j07967B4743M122j616J8520K75925j53814B9217
12062C5111J67466c4009A30008n8316j6627j9410b6327B14254j01995b14780B30916
12050b70875i7011r3722B7498L3240A5225a22726A79532A9450a48112A41908a38555
12038a23176A84420b16707h4585A94723N3535G6362a42764N6411k01094K5607
12028b61840E1070d04620E0266a06963B77243A13527d1599C1038J76394H7937
12017A29481b06235G9742d7004E7280O3542L91679e7473D8734d8656A86357N173
$$ y = [208021, 314326, -728, 96170, -77034, -275588, -107363, -38624, -112845, 145866, 359188, 224272, 194271, 271156, 87607, 34808, 380748, 208912, 170458, -91309, 378073, 24619, 108711, 27921, 106494, 284745, 176778, 24743, 28865, 27249, 45769, 321694, 167880, 29217, 35111, 202577, -34009, 130008, 71692, 55065, 35655, -26327, 214254, 112259, -214780, 230916, -270875, -97011, -190733, 27498, 60738, 15225, -122726, 179532, 19450, -148112, 141908, -138555, -123176, 184420, -216707, -84585, 194723, 248258, 76362, -142764, -86353, -287447, -261840, 51070, -404620, 50266, -106963, 277243, 113527, -41599, 31038, 207432, 87937, 129481, -206235, 79742, -47004, 57280, 120822, 512501, -57473, 48734, -48656, 186357, 191530]
12006A91530a62096B35a43111B82690C9003g6010k8210A98995b5659B50119F4742
11994h4060r3056q0081b7494A82124L0781b56044G2071F564E33J89751A4862a81750
11981A5467J57720L9805e1626h008A9055J54186K04632a14526N6591A32304J03665
11970B35969q0003b26043R9656q9197k8247a16109E2050J75230q7626D7168J51383
11959A98551e006l56715C5328a77909A40483J8517c2809a0287p9679l15675a58490
11947g4618c5847n1097A75422c20217A95070c68714R7788h0688J7055O525p2199
11936a29307D6747J47867c58605I321c5710G3791d2014p3992j27276A47117E8672
11924a84754A75802c9017j11128j0732L8826B12070k1604a97647L7661a3735k591
$$ y = [191530, -162096, 235, -143111, 282690, 39003, -76010, -104220, 198995, -25659, 250119, 64742, -84060, -177116, -257197, -27494, 182124, 212905, -256044, 72071, 6564, 533, 190284, 14862, -181750, 15467, 173187, 212992, -51626, -8008, 19055, 173241, 377873, -114526, -57935, 132304, 235969, 155966, -226043, -126387, -215584, -243831, -116109, 52050, 227280, 139654, 47168, 198551, -5006, -361721, 35328, -177909, 140483, 159000, -32809, -10287, -89966, -405641, -158490, -74618, -35847, -86944, 175422, -320217, 195070, -368714, -270926, -80688, -63633, -57108, -129307, 46747, 194614, -358605, 9321, -35710, 73791, -42014, -116006, -243282, 147117, 58672, -184754, 175802, -39017, -150145, -160877, -122051, 212070, 190466, -197647, -159986, -13735, -16326]
11913a6326k34323A8755b83386J38241B61516D5352d10702a42286E9356P1489
11903A30845c17938G9373B3811K04054c04710i2267a9002j865A07536m1012b19069
11891a03790q2383K2034A70228a35758j58344f1205r9501A55311D4236a74297
11880H2700a66388d0750a8049B67004b68216R2113J858Q5909p2342B51725f2968
11868h4052c2706B62742C9393c3992A61052b36202A47558i0459k56063a24702
11857a98356e9138o8230I6504D7487P2142i050k58499Q6224f3830f262M3A0329
11844a49195A17150a91608P6696k59817B17607a12264p1030d2056J3618A00959
11833a81890B13241G1561h5479a1431H3806h2070A01542h8218j47360A23206c33947
$$ y = [-16326, -250649, 18755, -283386, -145145, 261516, 45352, -410702, -142286, 59356, 130845, -317938, 79373, 23811, 227865, -304710, -92267, -19002, -20867, 107536, 66524, -219069, -103790, -186173, -164139, 170228, -135758, -294102, -61205, -160706, 155311, 44236, -174297, 82700, -166388, -40750, -18049, 267004, -268216, -176103, -174245, -88336, -160678, 251725, -62968, -84052, -32706, 262742, 39393, -33992, 161052, -236202, 147558, -90459, -346522, -124702, -198356, -59138, -127368, 96504, 47487, 119629, -9050, -267549, -181325, -63830, -6262, -6219, 10329, -149195, 117150, -191608, -114912, -374729, 217607, -112264, -183294, -42056, -28438, 100959, -181890, 213241, 71561, -85479, -11431, 83806, -82070, 101542, -88218, -235578, 123206, -333947]
11821A72252I401L39748C7652Q5024d0282A16684D7084b53509i6220J7822a1336
11809F3121i7431B50796I358Q5720a90515F843K52721j10487a02128C8272N9171
11798I7443b61j0155j6191k0499r5970F337b17861a3676m4340K7305A19533a83250
11785a33258b639k42284D26506A13897b430D5758K43613C3174a42859L4725B22276
11773a61007r9076N9806B5983J95052D1898N6756A4293b82317l77B13272E8310
11761C74244d3217C24260a95342j7988P1056l16617A22645b3420C08713B5985
11750A48024a14987I5099c02769P8656i5912j69308Q814F2360M1670o069b0535
11738d4013B2808b79196i3754j90087A51251b79968A8746J40909I957J70539E5201
$$ y = [172252, 9401, 349149, 37652, 122676, -40282, 116684, 47084, -253509, -96220, -78398, -11336, 63121, -97431, 250796, 9358, 95078, -190515, 6843, 259564, 149077, -102128, 38272, 97443, -261, -10416, -26607, -47106, -143076, 6337, -217861, -13676, -58016, -30711, 119533, -183250, -133258, -2639, -244923, 426506, 113897, -2430, 45758, 289371, 33174, -142859, -108134, 222276, -161007, -260083, -200277, 25983, 221035, 41898, 98654, 14293, -282317, -282694, 213272, 58310, 374244, -43217, 324260, -195342, -213330, -142274, -458891, 122645, -23420, 308713, 25985, 148024, -114987, 95099, -302769, -224113, -95912, -265220, -256406, 62360, 104030, 97961, -20535, -44013, 22808, -279196, -93754, -283841, 151251, -279968, 18746, 159655, 9957, 180496, 55201]
11726c04902A01369J33538a66738k7882h0764F0192i2194p2730b7589r5462A31991
11714I9202a66659d3866j6972F9070N7840e9477A45023P5622j02757K65655n3102
11703C30441q8844H1684a65563A85914O7322b15332B65774H6403b13976f2264
11692a74703P3078K9079p1789a2910D9208q621L14213j0377A05867b10755G6405
11680a52967K0989D7256i894j03514C06142E5044i7643B50096o3998C1164e49479
11668b72482K4453A96288F7927K97238a78058C15606a46718F7788J96079r7242
11658A66625a1628m7602j03414f8544k36985B57957k4850a7993j18919B92187
11647A33436N6h2152j29419P2899r1410d6383G7202i1825A17839a12078H3855
$$ y = [-304902, 101369, 234907, -166738, -194620, -80764, 60192, -92194, -164924, -27589, -123051, 131991, 99202, -166659, -43866, -60838, 69070, 126910, -59477, 145023, 220645, 117888, 383543, 330441, 241597, 81684, -165563, 185914, 253236, -215332, 265774, 86403, -213976, -62264, -174703, -101625, -72546, -144335, -12910, 49208, 40587, 354800, 344423, 105867, -210755, 76405, -152967, -131978, 47256, -9894, -113408, 306142, 55044, -97643, 250096, 186098, 31164, -549479, -272482, -248029, 196288, 67927, 365165, -178058, 315606, -146718, 67788, 263867, 166625, -11628, -59230, -162644, -68544, -305529, 257957, 233107, -17993, -136912, 292187, 133436, 133492, -82152, -211571, -138672, -230082, -46383, 77202, -91825, 117839, -112078, 83855]
11635a23116N0537m4737I9810j522f2091j19181a4558B11377a7902o9459C2028
11623a5831k29463P3237A56276a31762B6836J47807e0055p3070j90455e7771D8135
11611H5395I180a70182C7155N9246O6377b92224B41g9560j54953E7140e3310E8525
11598A40233b11856k924A32671K03685c01589B69381a59055A96582p2797l5586
11588H8199M93076d23836a85868A99414a15479p6180B13975i9424C9575M3985
11578H3560j9277k6317a45187e3907l01806c3160r3975G2465L41789A34575a27911
11566A46715J2309J80001a56159A99475B2005K14426A08965C7005a93592b4065
11555E1504J19546K5896G5756e3072j30804C40346K9746b851A40662J72981p8730
$$ y = [-123116, -72579, -117316, 99810, 98288, -62091, -181272, -14558, 211377, -17902, -87361, 32028, -15831, -245294, -172057, 156276, -131762, 26836, 174643, -50055, -123125, -313580, -57771, 48135, 85395, 9180, -170182, 37155, 96401, 162778, -292224, 241, -79560, -234513, 57140, -53310, 58525, 140233, -211856, -214780, 132671, 336356, -301589, 269381, -159055, 196582, 123785, 88199, 581275, -423836, -185868, 199414, -115479, -191659, 213975, -99424, 39575, 83560, 64283, 37966, -145187, -53907, -355713, -33160, -127135, 72465, 414254, 134575, -127911, 146715, 159024, 339025, -156159, 199475, 22005, 236431, 108965, 37005, -193592, -24065, 51504, 171050, 196946, 75756, -53072, -183876, 340346, 370092, -2851, 140662, 313643, 234913]
11544B34913K87784F7961d7690F7863a19095B21925C9304K4104J51839r3215R8554
11533B20586b98280c3403A0463a03945L7407k2934A84480L6895A08369E422a44791
11521A81376c01660B35726A08088h639A12195B5297N5006A8751J83563P6672b64537
11509A81994k3691p1852c4777A47931b43285A05446J74571e6985D29966b1509
11498A29847c1532B12068k4858c6895B28375J12225g1474F3392J76500J16871
11488C56763e6991C3291O5998a27817j65581d7960H5118K9818L28220A34754c3058
11476G1536a42673A93566D121J78071n3259O1552H7292J3874b4249D14367n2664
11465C61703L9668a83520C85375L0658j45031k6794K17189j23803p1299F9855
$$ y = [234913, 522697, 67961, -47690, 67863, -119095, 221925, 39304, 63408, 215247, 122032, 220586, -298280, -33403, 10463, -103945, -66538, -89472, 184480, 221375, 108369, 5422, -144791, 181376, -301660, 235726, 108088, -8639, 112195, 25297, 80303, 18751, 202314, 278986, -264537, 181994, 158303, 86451, -34777, 147931, -243285, 105446, 280017, -56985, 429966, -21509, 129847, -31532, 212068, 187210, -36895, 228375, 340600, -71474, 63392, 239892, 356763, -56991, 33291, 99289, -127817, -293398, -47960, 85118, 114936, 443156, 134754, -33058, 71536, -142673, 193566, 4121, 182192, 128933, 190485, 87292, 101166, -24249, 414367, 361703, 401371, -183520, 385375, 416033, 271002, 244208, 461397, 337594, 266295, 69855]
11454b54347A28235O4756a0908m363o0993F3369P951i8626D885M5451h5771j6039
11442a01810A29637K75936c2792B41838L988K4799C6206J69718K13045A10736
11431A09980h9199j03837C70330c50478B60224q1607b24270a00838I4947c9517
11420a86638N2134B32441D881L650J08972J29907E2743a08097L1839H1465a5908
11408C5146a097I7899L2602h1393D5267K69601C7260a13412k09002A52605l6300
11397A16305e8397C545a10144l2140B40096E8987O6728h9660J1869j0929c2942
11385b08116p7570a25834k28259h5229c8147m11381a08848n3128A58186k5103
11375A33083R1888H7622a26483a0290m0109m3112o6202j1003j1528d329C02082
$$ y = [-254347, 128235, 192991, -10908, -15271, -76264, 63369, 71320, -98626, 4885, 50336, -85771, -101810, 129637, 405573, -32792, 241838, 245826, 270625, 36206, 205924, 418969, 110736, 109980, -89199, -193036, 370330, -350478, 260224, 178617, -224270, -100838, 94947, -39517, -186638, -134504, 232441, 4881, 8531, 117503, 247410, 52743, -108097, -76258, 81465, -15908, 35146, -1097, 97899, 130501, -81393, 45267, 314868, 37260, -113412, -322414, 152605, 116305, -58397, 3545, -110144, -142284, 240096, 58987, 125715, -89660, -77791, -88720, -32942, -208116, -285686, -125834, -354093, -85229, -38147, -449528, -108848, -161976, 158186, 133083, 224971, 87622, -126483, -10290, -50399, -93511, -159713, -170716, -182244, -4329, 302082]
11363a05234m1448c4031j41546k42077h8966M4160l00700a07879I6584a19158
11352A04368a12662A16081d8141A3780c14320B36463I6219b10600N3381j98343
11342c55562g9579A99775M6900c2903j88552O0271L8515A03622g1032j33828j07480
11331c12340R6711e1364E542J98952J4402b09663G5631a44587A47232a51068F8158
11319c27481A54866p0771i8991R253A78731p6262b5585H0441a52413j10138c2474
11307B78343a90872B2232a16433A67275c5205m2785m2179N3659H6960l5890K78758
11296C29828A37319N7847c3022a1288j41992A7921d7667l3266A26721n9372K32817
11285C00166a70671B19433A0652d24704a34888j36236f0781k71900B57026a49207
$$ y = [-105234, -146682, -34031, -175577, -417654, -88966, -44806, -345506, -107879, 96584, -119158, 104368, -112662, 116081, -48141, 13780, -314320, 236463, 96219, -210600, -157219, -355562, -79579, 199775, 246675, -32903, -221455, -161184, -122669, 103622, -71032, -204860, -312340, -215629, -51364, 5542, 204494, 218896, -209663, 75631, -144587, 147232, -151068, 68158, -327481, 154866, 84095, -98991, -89738, 178731, 102469, -25585, 80441, -152413, -262551, -32474, 278343, -190872, 22232, -116433, 167275, -35205, -77990, -120169, -66510, 86960, 51070, 329828, 137319, 195166, -33022, -11288, -153280, 17921, -47667, -80933, 126721, 67349, 300166, -170671, 219433, 10652, -424704, -134888, -271124, -60781, -332681, 257026, -149207]
11274a97904B42737B9707b18986P0028D6702a79222a6815D0924a81415A44061
11263c83105B14168a77174e3337p3600j37000A26623A5427J25794d9484F7791
11252c19544a6798B2165f4069j21995B3445a47914N3447F5656e7334A1864a10961
11240a63162J5601M5542b4566e461l92792A97093b0943j31114I5759k6464M1767
11229A11062c36984N2038c5411a0153M248l10987Q3549C8620a15213q8018k1132
11218b24363i1593j45855F1045L2673a14215B92582d90954a28713j87397A07588
11207F9717c4200k84642A21221L8865C1869d46051E4903h7769p2297O7304A18335
11195C33617a68691B1589b12706j4762l5503M267A30208K039b0791D12985a63193
$$ y = [-197904, 242737, 29707, -218986, -148958, 46702, -179222, -16815, 40924, -181415, 144061, -383105, 214168, -177174, -53337, -126937, -263937, 126623, 15427, 141221, -49484, 67791, -319544, -16798, 22165, -64069, -186064, 23445, -147914, -94467, 65656, -57334, 11864, -110961, -163162, -147561, -102019, -24566, -5461, -398253, 197093, -20943, -152057, 95759, 69295, 111062, -336984, -284946, -35411, -10153, -5905, -316892, -233343, 38620, -115213, -203231, -224363, -91593, -237448, 61045, 93718, -114215, 292582, -490954, -128713, -316110, 107588, 69717, -34200, -318842, 121221, 160086, 31869, -446051, 54903, -87769, -160066, -92762, 118335, 333617, -168691, 21589, -212706, -227468, -262971, -258704, 130208, 132247, -20791, 412985, -163193]
11183A31409b96802a1846G4279i5973J3041K6083b2997A75732a77848D386J51417
11172A55803E2458J61409b85549f8814I2729M26814e4884j32740A9034O2009k5351
11161E5692J1533f0633K9245j552D7963a57572C00239a24648B11968a5417j15149
11150a30566c3998B32521b43332J13680e3859A17030a41529B46810K19431A61993
11139b84784J10931A82044K02840b24256p0948A97599J03829D9890a80543k3405
11129b03948B76292E3479J48062a04961g832B16582b01261a1791A41399K35134
11119C76533C9285R9362l6892D7453i7256C64684d1063B28784F9494j5421A6631
11107A75883G6761M06622e3148k40919F0258J86716j8208k6436n1927F9524J6041
$$ y = [131409, -296802, -11846, 74279, -95973, -82932, -56849, -22997, 175732, -177848, 4386, 155803, 52458, 213867, -285549, -68814, 92729, 519543, -54884, -187624, 19034, 81043, 55692, 67225, -60633, -31388, -32940, 47963, -157572, 300239, -124648, 211968, -15417, -130566, -33998, 232521, -243332, -129652, -53859, 117030, -141529, 246810, 466241, 161993, -284784, -173853, 182044, 384884, -224256, -295204, 197599, 301428, 49890, -180543, -203948, 276292, 53479, 201541, -104961, -7832, 216582, -201261, -11791, 141399, 376533, 39285, 138647, 101755, 47453, -97256, 364684, -41063, 228784, 69494, 54073, 16631, 175883, 76761, 483383, -53148, -294067, 60258, 246974, 228766, 202330, 150403, 69524, 85565]
11096H5565l5758B3351L46092m7488b13180B62319F5193K71469A57039K835K45838
11085D05712a66024c2340D13414j11360r4322J43481j01020L96980k43449j56756
11075B46968J01785H6684M55893q9438B23990L0889m7309K06038N6719A34769
11064B07606j01461M08395A93762M47168j06128J21611B96081K9226L75241j54747
11054E45801k38598K60522k5052J28044K9502j42466K34261K53570m13119K05382
11044H37847C58157K66186k88269L84524L206j79163J68849C17281L47198K7425
11034F91904K0916J77134j174k86701L79434J69256m78453J58434l39214M87190
11024I78726D15203J11929m3237L29540J47645m33395M33356D55867K27724m0978
$$ y = [85565, 49807, 23351, 369443, 321955, -213180, 262319, 65193, 336662, 157039, 159874, 405712, -166024, -32340, 413414, 302054, 207732, 351213, 250193, 647173, 403724, 246968, 348753, 86684, 542577, 453139, 223990, 254879, 207570, 413608, 470327, 134769, 207606, 106145, 514540, 193762, 640930, 534802, 656413, 296081, 325307, 700548, 545801, 307203, 567725, 542673, 670717, 700219, 557753, 792014, 1045584, 632465, 837847, 358157, 624343, 336074, 720598, 723804, 544641, 713490, 317281, 664479, 691904, 712820, 889954, 888780, 602079, 981513, 1150769, 672316, 830750, 491536, 978726, 415203, 527132, 483895, 813435, 961080, 527685, 961041, 455867, 683591, 642613]
11014F42613j47592J5840k4357J21932K31780k94013R3242O7734j38287K8665
11004E97557l5628r6569M73880B53090K29299J84607J32491j74265O2872B65123
10993H27235D00687L55914j2318j47480K15213l43004K79433k7332l0659L93816
10983A084270k21591l19288O08833j13389J00892p3032L83765q5800J14024j55569
10973A323115N66530N502J23132L43156j79033L96723k4099M7590l48865K96085
10963B549836l1977n01011J09504m83558M39827m29723j4351k32542K29051j09386
10953A525670o3230L77147m965l81616J06925n81552J25183j95816l34141J70355
10943G43960K6263C55866j49892L04257j26942j21215n6795I1275J10289J56171
$$ y = [642613, 495021, 510861, 486504, 608436, 840216, 546203, 639445, 707179, 568892, 597557, 561929, 465360, 939240, 253090, 482389, 666996, 799487, 625222, 688094, 265123, 827235, 400687, 756601, 744283, 596803, 812016, 469012, 748445, 721113, 690454, 1084270, 862679, 543391, 1152224, 1038835, 1139727, 1066695, 1450460, 1364660, 1478684, 1323115, 1889645, 1895147, 2018279, 2361435, 2182402, 2579125, 2555026, 2602616, 2253751, 2549836, 2517859, 2016848, 2126352, 1642794, 2082621, 1652898, 1638547, 1406005, 1635056, 1525670, 1462440, 1839587, 1834622, 1453006, 1559931, 978379, 1103562, 907746, 573605, 743960, 770223, 355866, 205974, 510231, 383289, 262074, 205279, 91275, 201564, 357735]
10933C57735d0841N401D97814B06035K20975G6072K0304K8111a99547B91873F4623
10921E1928q840L2800a15133L8435B63717A7370M5b61F4974a71064C3142b44534
10908A77059k9316F5752j152a40606B12564a40454B2185a06348B9615a00652j17044
10897b17696A56738d2628B84057a03720k8867B58587f944A09130J71139a34109
10886g8823L319r9894e8810H263i5010L244j22031i9777B8845P387a22680N509
10874a17171k1453H5494P8764a72340M1068B3069L73216A23208a53896k61391
10864d15287C7845P3073a60456f0325r7331B1735P3669d47516b3301j7825A52753
10852f25k34082P7256A58276b15621b1828j8453j9136B16699g3017H1324B8105
$$ y = [357735, -40841, -35440, 497814, 206035, 427010, 76072, 96376, 124487, -199547, 291873, 64623, 51928, 43088, 75888, -115133, -76698, 263717, 17370, 17415, -261, 64974, -171064, 33142, -244534, 177059, 147743, 65752, 64600, -140606, 212564, -140454, 22185, -106348, 29615, -100652, -217696, 156738, -42628, 284057, -103720, -132587, 258587, -6944, 109130, 280269, -134109, -78823, -75504, -175398, -58810, 8263, -95010, -91766, -213797, -99777, 28845, 36232, -122680, -117171, -138624, 85494, 164258, -172340, -131272, 23069, 396285, 123208, -153896, -415287, 37845, 110918, -160456, -60325, -157656, 21735, 95404, -447516, -23301, -41126, 152753, -625, -234707, -157451, 158276, -215621, -21828, -40281, -59417, 216699, -73017, 81324, 28105]
10840B09960a5765l60246C17270c12047J19872A58379a31278q7114A25709m1367
10830H4342J0721K27318A25670a64993l5247G524c5057N703i523A43082i2163
10818b44023j34516J25568R7031O9260c3072k35951E5137i85k032p2155H598K49455
10806B58053b20507A94045b1909I2314C0798a79502j52636O5859J22654f5930
10795a44641c0219p8536A28321E7174J05479b09569O5525f7228j22674f388j04301
10784a10689d4760r2590F0902a96565k8706D0034J27205A3749K74720L6679b40566
10772b26755A75975b05617F8452b31033A82399d3529k0158k18830I0456f2688
10761d2367j86353H829b437k00977f3328I6976a45308B02197b60497g1347r4816
$$ y = [209960, -15765, -376011, 317270, -312047, -192175, 158379, -131278, -218392, 125709, 84342, 95063, 322381, 125670, -164993, -200240, 7524, -35057, -29354, -9523, 143082, -92163, -244023, -378539, -252971, -155940, -86680, -33072, -269023, 55137, -985, -3017, -75172, 8598, 258053, -220507, 194045, -21909, 92314, 30798, -179502, -332138, -266279, -143625, -65930, -144641, -30219, -108755, 128321, 57174, 162653, -209569, -144044, -67228, -189902, -6388, -110689, -44760, -137350, 60902, -196565, -225271, 40034, 167239, 13749, 288469, 325148, -240566, -226755, 175975, -205617, 68452, -231033, 182399, -43529, -63687, -282517, 90456, -62688, -42367, -228720, 8829, -2437, -203414, -63328, 96976, -145308, 202197, -260497, -71347, -166163]
10750a66163D5606d7466A56713J88111I816J05000d7498K263I8368i2553D6804
10738A92779a60878l7122M5170C20013I2230Q3349b81642C08468q3864B686a25729
10726B58062j04635a46487b6454n7588d449j22514B11457b27994A97191J8927
10716B16118g3092J6946k1723F8998a35780B52099h5977G0223c25877f2963A10802
10704c48887f0331C9612L2344a44196r813M6197q8505A53237b95545C428Q3329
10693H6757a54032A49429a60085A45500a38225L8609R529n089J4336K3151k29837
10682b87526C07470A1509e6127A57791a26154j51690J21725M8541A85157F4724
10671a8507j5996A56576E4093J9519a10806C1909b0187k26955A13425a245j08093
$$ y = [-166163, 45606, -47466, 156713, 344824, 9816, 114816, -47498, -45235, 98368, -92553, 46804, 192779, -160878, -198000, -152830, 320013, 92230, 175579, -281642, 308468, 224604, 2686, -125729, 258062, 153427, -146487, -26454, -84042, -4449, -126963, 211457, -227994, 197191, 216118, -73092, -56146, -77869, 68998, -135780, 252099, -85977, 70223, -325877, -62963, 110802, -348887, -60331, 39612, 71956, -144196, -154009, -107812, -196317, 153237, -295545, 3428, 86757, -154032, 149429, -160085, 145500, -138225, -99616, -90087, -95176, -80840, -57689, -287526, 307470, 11509, -56127, 157791, -126154, -277844, -156119, -107578, 185157, 64724, -18507, -34503, 156576, 54093, 73612, -110806, 31909, -20187, -247142, 113425, -1245, -109338]
10660a09338r2930k1579a02504k5283j76632J47499n296j39997a0991k6891j11544
10649a49426d9647B70555H0407C6023J13326a6225k00848A95597b3640A66334
10638f1206M855A35734D5388a42475B67544a37901C3796b88613A36475i9581B9734
10626D2679a7081j52283q6509a25741r8061m929G1908K92419g3665o8117r4970
10615b36752M0451A40691Q444K22025B1456N1201b12726P2144e3228A70276b35968
10603b4608J249B0876R0650c83380G2270c33008C4072h8515B79503b8081A40580
10591d21339A02425a53704P6121p5370P913j66121J11421R5576B4159a07927d8012
10579i1666k04056H0646c56981a14284A41370a89586B67695b2657B1218c15804
$$ y = [-109338, -202268, -223847, -102504, -127787, -304419, -156920, -162216, -302213, -10991, -37882, -149426, -49647, 270555, 80407, 36023, 149349, -16225, -217073, 195597, -23640, 166334, -61206, -56351, 135734, 45388, -142475, 267544, -137901, 33796, -288613, 136475, -99581, 29734, 42679, -17081, -169364, -255873, -125741, -223802, -228731, 71908, 364327, -73665, -141782, -236752, -196301, 140691, 149135, 371160, 21456, 72657, -212726, -140582, -53228, 170276, -235968, -24608, -23359, 20876, 111526, -383380, 72270, -333008, 34072, -88515, 279503, -28081, 140580, -421339, 102425, -153704, -77583, -152953, -145040, -311161, -199740, -104164, 24159, -107927, -48012, -91666, -295722, 80646, -356981, -114284, 141370, -189586, 267695, -22657, 21218, -315804]
10568b35450K3295A32668E1157f4037R373o3149j09838a08202G0604a37773c4194
10556I0904a28804m4482o5222J06711p4016A19965d6444A75455b32444a8084j75224
10545a93308A50638a10947b9165o4100C27142A03379Q2166b19066H9501c06509
10534f2599A2344K1182A1385P7655e3638k94447i4330A05085C1714e08922K37424
10523b71498a01155m6141e8575H9105b25966a9203j99453b9469E6352J7360J54970
10512B28682b16557O1299j05580A89100b42464R4752f8450k4577j41130R9107
10502a35050B58901a81779B00005d69056B5747J97953h2788H2214c8281A9053
10491E6317J72406b48718A05618A7779M76105i6595k87099J21388A56737H481
$$ y = [-235450, -212155, 132668, 51157, -64037, -54664, -117813, -227651, -108202, 70604, -137773, -34194, 90904, -128804, -173286, -238508, -131797, -205813, 119965, -46444, 175455, -232444, -18084, -193308, 150638, -110947, -29165, -93265, 327142, 103379, 185545, -219066, 89501, -306509, -62599, 12344, 33526, 11385, 89040, -53638, -348085, -94330, 105085, 31714, -508922, -271498, -101155, -147296, -58575, 89105, -225966, -19203, -218656, -29469, 56352, 73712, 228682, -216557, -155258, -260838, 189100, -242464, -147712, -68450, -93027, -234157, -135050, 258901, -181779, 200005, -469056, 25747, 223700, -82788, 82214, -38281, 19053, 56317, 228723, -248718, 105618, 17779, 493884, -96595, -383694, -262306, 156737, 8481]
10480I1716J48942p0483l4338P8418J92793j65931L00423j88073r5215j06264
10470A51988c27056A02507K8873d7643I1118b94792e0465j39052G7739a27375
10459A49889c78884d7126A21401a4884q9148A67228E000e7229C61741B9454L0953
10448F0407J44537b24805A31279O2721F8635C1372a41556E9156K11651i7949k55232
10437c53181e7956k73232a40897D8614j3357a56422g5253j27255B21177d4912
10426A48872A7944M67469A0752P107b35942c6310l2029p2717D8004Q974a56606
10414a53167K3528K866j9418H492K57277g7151A31865a7887n5308j99052N2035
10403b20212B23278a21457d3575F3671K69434H9211R7925e989o5800r1293B1343
$$ y = [91716, 240658, 170175, 135837, 214255, 407048, 241117, 541540, 353467, 258252, 151988, -327056, 102507, 131380, -47643, 91118, -294792, -50465, -189517, 77739, -127375, 149889, -378884, -47126, 121401, -14884, -104032, 167228, 5000, -57229, 361741, 29454, 60407, 204944, -224805, 131279, 194000, 68635, 31372, -141556, 59156, 270807, -97949, -353181, -57956, -331188, -140897, 48614, 35257, -156422, -75253, -202508, 221177, -44912, 148872, 17944, 485413, 10752, 17859, -235942, -36310, -68339, -141056, 48004, 56978, -156606, -153167, -129639, -126773, -146191, 8492, 265769, -77151, 131865, -17887, -73195, -272247, -220212, 223278, -121457, -43575, 63671, 333105, 89211, 187136, -5989, -71789, -163082, 21343]
10391c5810n2782E6855h4651B18536o3424i936q4253D14794r4154F7813K10736
10380B78549l8912i7678A22538a27039B09010a14738B72379I9998b5052A8232
10369D39443j83420k6579L07794K25365C1347L03859F9499M52547A46311M56228
10359F02539C2725M95844o0752i0064C82898j28643A17708K58633N544K16341
10349E98226B51520J79768A93281K52049c7397B14444L63655j11732G8681L11173
10339C89854j70451I0426M0381d8228C42755A4847J30940d1171l3662B28889b32855
10327C28168f9002B62692M9417F0261a02219B8480e3226C25887a2676k0853A14335
10315g2188K1273j25762C22699a00990B05357G176M4962K45173l0646I1564b39663
$$ y = [-35810, -88592, 56855, -84651, 218536, 155112, -9936, -94189, 414794, 320640, 67813, 278549, 239637, -97678, 122538, -127039, 209010, -114738, 272379, 99998, -25052, 18232, 439443, 256023, 229444, 537238, 762603, 31347, 335206, 69499, 522046, 146311, 602539, 32725, 528569, 467817, -90064, 382898, 254255, 117708, 376341, 381885, 598226, 251520, 431288, 193281, 445330, -37397, 214444, 578099, 466367, 78681, 389854, 219403, 90426, 130807, -48228, 342755, 14847, 145787, -41171, -74833, 228889, -232855, 328168, -69002, 262692, 312109, 60261, -102219, 28480, -53226, 325887, -12676, -33529, 114335, -72188, -50915, -176677, 322699, -100990, 205357, 7176, 52138, 297311, 266665, 91564, -239663]
10303g5075F5104b00232e8560I460i0601L3808k42988B06792d4720j1924B61867
10291C3676c74584a6981j59957I7129e7507j64850O8486m2622B51031e0458o8986
10280a19444k04348J54358rO60a9568A43204b27147p6995h2360o0316A9045e12127
10267b4251A27580A3653O3852a24695D18936a07865C63829c07291A48617p219
10257A41398a13375B50316i392q798A91476N48003A29769P224n2023c899j2616
10246a6515B13405I0378a15423n8248A10076O0113c4610D376J69105a57714j96693
10235c54407A56956a508l3740o8082h538j75826M2067m2651j1923N7494A16205
10223G2985d20446A79917a4339m49432h6813c7614j32665L2758D3918e9143B9376
$$ y = [-75075, 65104, -200232, -58560, 9460, -90601, -56793, -299781, 206792, -44720, -56644, 261867, 33676, -374584, -16981, -176938, 97129, -57507, -222357, -153871, -196493, 251031, -50458, -119444, -323792, -169434, -169443, -168783, -19568, 143204, -227147, -304142, -82360, -142676, 19045, -512127, -24251, 127580, 13653, 77505, -124695, 418936, -107865, 363829, -307291, 148617, 141398, -113375, 250316, -9392, -18190, 191476, 739479, 129769, 136993, 84970, -3899, -16515, 213405, 90378, -115423, -173671, 110076, 170189, -34610, 4376, 173481, -157714, -354407, 156956, -1508, -35248, -103330, -8538, -184364, -142297, -184948, -196871, -139377, 116205, 72985, -420446, 179917, -14339, -463771, -86813, -37614, -170279, -137521, 43918, -59143, 29376]
10211b27257P5968R847B11263g1495J6942k11861o9786J07522d1086r5542H2391
10199e3294j68886J2573M0114g4886A8512J52962b57815d1202j31472q1926A21682
10187G1635a260n7937j17364O7846A6082J11302c7546k81775O3779H7976b09320
10175B30528a50845k72564a26566M2614A15722R3909D5562f963A98155l9896a62142
10163a67299a7702j97722E603i6313j08434G1454b05122R046M3123k1883C2783
10151b0813l03644B51347F7634a97002j18019e9401B5709j0816a03182D443i6502
10139B82Q6156n863L0191a84078j71997E10232A536a51990j74882J01742D0956
10127E1290g89j72726K7098G1488a8919B22403l3763K3693g7671k0138j03712
$$ y = [-227257, -151289, -141442, 211263, -71495, -54553, -266414, -336200, -228678, -41086, -136628, 82391, -53294, -222180, -209607, -169493, -74886, 18512, 171474, -257815, -41202, -172674, -254600, 121682, 71635, -1260, -59197, -176561, -108715, 16082, 127384, -37546, -319321, -255542, 87976, -209320, 230528, -150845, -423409, -126566, -83952, 115722, 209631, 45562, -6963, 198155, 158259, -162142, -167299, -17702, -215424, 5603, -96313, -204747, 71454, -205122, -196076, -152953, -174836, 32783, -20813, -324457, 251347, 67634, -197002, -315021, -59401, 25709, 14893, -103182, 4443, -96502, 282, 86438, 80575, 110766, -184078, -356075, 510232, 1536, -151990, -326872, -225130, 40956, 51290, -789, -173515, -146417, 71488, -18919, 222403, 188640, 212333, -77671, -97809, -201521]
10116b01521k18095R4530J53257A29766a0870l23369q1662J07909A18952i9013
10105B18485b99006b9791k13882R0512A547a6814j95676f2284m97352a62488e1785
10093B0899d01759A9895a46741G7921c4933k3632j06889C7017h9445H6134c6141
10081e0474A6520a28415A28387L3309c3605G5113e517j11048f394B0131o501b76008
10068e625k80129d1506j70102i5207j31844M4772J3175j50515g9719c6755J7236
10057a9519l5434o6941A8335a36431C68929b18212c2183j71363A01200J51977
10047B53177f2201j42289j42579h4109B08797b15742e9107K8843F7893b63356
10036d3226E7514a13407K3171A07571i158j97098e4282B7535J32401f2480k2068
$$ y = [-201521, -419616, -325086, -171829, 129766, -10870, -334239, -415901, -307992, 118952, -99013, 218485, -299006, -29791, -243673, -153161, 1547, -16814, -212490, -62284, -559636, -162488, -51785, 20899, -401759, 19895, -146741, 77921, -34933, -58565, -165454, 37017, -89445, 86134, -36141, -50474, 16520, -128415, 128387, 161696, -33605, 75113, -5517, -116565, -6394, 20131, 13630, -276008, -5625, -285754, -41506, -211608, -95207, -227051, -182279, -169104, -319619, -79719, -36755, -19519, -54953, -121894, 18335, -136431, 368929, -218212, -32183, -203546, 101200, 253177, -62201, -204490, -347069, -84109, 208797, -215742, -59107, -30264, 67893, -263356, -43226, 57514, -113407, -90236, 107571, -9158, -206256, -54282, 27535, 159936, -62480, -84548]
10025h4548A48688a04452C2257e2493A4120O7587i0737j24313i9850C0131b20555
10013b74094O4022I008K83620b00331A1832L0895a17418A30063J6151b3633j52083
10002a75716M9795D1789b22197i453l3106j19170A04853a72830H0416c15483g3317
9990b52287b3674k94717j56085O1287a77600m4038A75093b35380A67125D3872
9979B12189C0655b25029f5521j91240B69713B5175e9390B54658h0826A73620d5425
9967d2416A94148a70524N5938j41646a2460B9485Q9388M301c5725H5071R4002
9956A79073q2558f1348j31381O9773l01818e9764A06494a54031o8200n6400J3107
9945b65524i9852M737B717b08340d8266j02255g3867E6121a46205o1428A49015
$$ y = [-84548, 148688, -104452, 32257, -52493, 14120, 81707, -90737, -215050, -99850, 30131, -220555, -274094, -210072, 9008, 292628, -200331, 11832, 42727, -117418, 130063, 146214, -23633, -175716, -125921, 41789, -222197, -9453, -42559, -161729, 104853, -172830, 80416, -315483, -73317, -252287, -23674, -318391, -474476, -413189, -177600, -221638, 175093, -235380, 167125, 43872, 212189, 30655, -225029, -65521, -256761, 269713, 25175, -59390, 254658, -80826, 173620, -45425, -42416, 194148, -170524, -114586, -256232, -12460, 29485, 118873, 123174, -35725, 85071, 179073, 96515, -61348, -192729, -122956, -424774, -59764, 106494, -154031, -222231, -278631, -265524, -99852, -95115, 2717, -208340, -48266, -150521, -73867, 56121, -146205, -207633, 149015]
9933D1827d09543a26274m2669O7251M7297l01586B13337H9103g0612F6791a11513
9921A0924d31576B2213M7452i1532A4474b32000A82315a14864e3883k99761A28037
9909a48678A03468b13518f1066m8370o6963r3249f0992B45387B3808e3428G184
9897a08354M3733o3034l85495F6K44075a28140j53234a945G3792c5391n7497k45119
9885c38007D2093a3652k72166J32194G9910b45938j11342i8236l0614k06785O8548
9874b67087h7339C2348L4319d9101H3000A0744K3394a9460q3727A29240A2093
9862a03415A25085d6652m75098a12860a1891A10591J91999i1400A15266J11225
9852B26491f4316l6685F4097a766l43205D4470a36100k02694J60425e9012j52264
$$ y = [41827, -409543, -126274, -168943, -101692, -54395, -355981, 213337, 89103, -70612, 66791, -111513, 10924, -431576, 22213, 69665, -91532, 14474, -232000, 182315, -114864, -53883, -353644, 128037, -148678, 103468, -213518, -61066, -109436, -176399, -269648, -60992, 245387, 23808, -53428, 7184, -108354, -64621, -127655, -513150, 66, 244141, -128140, -281374, -1945, 73792, -35391, -92888, -338007, 42093, -13652, -285818, -153624, 79910, -245938, -357280, -98236, -128850, -335635, -267087, -87339, 32348, 66667, -49101, 83000, 10744, 34138, -19460, -103187, 129240, 12093, -103415, 125085, -46652, -521750, -112860, -11891, 110591, 302590, -91400, 115266, 226491, -64316, -101001, 64097, -1766, -344971, 44470, -136100, -338794, -178369, -59012, -211276]
9841b11276Q516k31578K00305j45025a43421a190A48452i972k83518n0504R5031
9830b48963F7194c59227B09206a13342l8268F3437a00869k68362F7322P3061i3599
9818a78138g8140F7521c3465l10074P2753M5410j7846A66994R6505G1095J37366
9807B08461L54359A19434a19934k77790b5898n4576j33467g3614A10713e2298
9796d9389j02658o9648l7969O2295a0254k21280C0266Q3139a22218A51902B459
9784A43120d75194a50177e1473E3969j8297J40724c78860A3666n518b1462k2875
9773d4337m67046b04119f4204G8035P9308b15012E3690f0229k60783B13564A0495
9761B66088d49289J3166a23580c9231M685p6412A63382c32859J33567B5158J02632
$$ y = [-211276, -202760, -434338, -234033, -379058, -143421, -1190, 148452, -9972, -293490, -343994, -248963, 67194, -359227, 209206, -113342, -151610, 63437, -100869, -369231, 67322, 140383, -93599, -178138, -78140, 67521, -33465, -343539, -270786, -225376, -243222, 166994, 263499, 71095, 208461, 562820, 119434, -119934, -397724, -25898, -80474, -213941, -73614, 110713, -52298, -49389, -152047, -221695, -259664, -197369, -10254, -231534, 30266, 113405, -122218, 151902, 2459, 143120, -475194, -150177, -51473, 53969, 35672, 176396, -378860, 13666, 8148, -21462, -44337, -511383, -204119, -64204, 78035, 157343, -215012, 53690, -60229, -321012, 213564, 10495, 266088, -449289, -436123, -123580, -39231, -34546, -110958, 163382, -332859, -199292, 25158, 127790]
9750A27790d8860E5024e584n7652k40009J33774e668B08118I2184i3463l25802
9739d19265P6634D8756A7889a00810n560H0324h7910k18129h8373L1953C22498
9727G9053a94793d4587n0103d1989B45845A3917a49521a200j26557q0540C30654
9715c66793J51354j886A15363c0214H0937a31884r6655B01041b1060A20560P479
9704A28039a1610q8758k64069E8255k0756b33556f8667k81623f9278C6542i3977
9692b6105A04507l506c33683a11581c095B51176j21957J51721b5066r1859D539
9680F1480L3976b74088P0041A68022a38908k65604A48515A9036N01985A46657
9669A7588e085q4964j00299r948A18603a69998f7665j19477L0578k43897g3691
$$ y = [127790, -48860, 55024, -5584, -63236, -303245, -169471, -5668, 208118, 92184, -93463, -419265, -342631, 48756, 17889, -100810, -106370, 80324, -87910, -306039, -88373, -56420, 322498, 79053, -194793, -44587, -94690, -41989, 245845, 13917, -149521, -1200, -127757, -208297, 330654, -366793, -215439, -217325, 115363, -30214, 80937, -131884, -228539, 201041, -21060, 120560, 128039, -11610, -100368, -364437, 58255, 37499, -233556, -68667, -350290, -69278, 36542, -93977, -26105, 104507, 101001, -333683, -111581, -3095, 251176, 129219, 280940, -25066, -116925, 4539, 61480, 95456, -274088, -204047, 168022, -138908, -404512, 148515, 19036, 521021, 146657, 17588, -5085, -90049, -190348, -200296, 118603, -169998, -67665, -187142, -156564, -400461, -73691]
9657i8203A75688b08114O6604A15616J12891c7126m7564A13729L572a05764J202
9646a04562p8752A35591o5807B0959b73448a5218B4052a72152A52489b5841A88491
9634g5124c5534j50601h8737k4408j29439L9292B16420H1684c76209R8949j84196
9623d61456h8511j0212j2281l04722d5419E6147A3621K7079b28364A47319F6461
9611A72511b91155I9687d57976K10553e3761k22188j90171J6986F1347i786o17031
9600f26817A19329D9190f30051e2222n38443C623b61067f1666p867j2356A89508
9588a7496j59341a2182m1272J4586M971c217A52922f55359B77091d80867a62162
9576H1380j9898e6549j30130c3913p9978I8648b56689A78208a3677k94747J35725
$$ y = [-98203, 175688, -208114, -141510, 115616, 228507, -37126, -84690, 113729, 117301, -105764, -104562, -183314, 135591, 69784, 20959, -273448, -15218, 24052, -172152, 152489, -25841, 188491, -75124, -35534, -186135, -88737, -113145, -242584, -203292, 216420, 81684, -376209, -277260, -461456, -88511, -98723, -111004, -415726, -45419, 56147, 13621, 40700, -228364, 147319, 66461, 172511, -291155, 99687, -457976, -247423, -53761, -275949, -466120, -449134, 61347, -9786, -626817, 119329, 49190, -630051, -52222, -590665, 3623, -261067, -61666, -69533, -81889, 189508, -17496, -176837, -12182, -53454, -38868, -33897, -3217, 152922, -655359, 277091, -480867, -162162, 81380, 61482, -56549, -186679, -33913, -113891, 98648, -256689, 178208, -13677, -308424, -172699]
9565a72699k64940J21976J28834Q9162o501m9176q2712P2850A0200J97435a39730
9553i2776K220j10690l68646A14847l2439J47254B8403a46348k1772Q3283K0400
9542f4437F5317J8531A9822L53183b24449Q0719H5254K63816h1625B6229a31865
9530F4519A0345O755b05871R3552N6068k33148a04932A86096a73890L5102E3618
9518G3366a22907B2622M8073K4450a64232P906A58543r021a78222j1108L1616
9507a57714l7751j29406G5118M7846n1750a52535I3648b20914A5734Q7423D2643
9495g7621j22041E6162P5565B6560b5660C9003b91888a8526B6594b72375J15436
9484a56939B0141J17529a84447F9925a0344E7032h4816p9709D7254a85408h3486
$$ y = [-172699, -437639, -315663, -186829, -97667, -104168, -153344, -236056, -163206, 10200, 207635, -139730, -92776, -90556, -201246, -569892, 114847, 82408, 229662, 28403, -146348, -168120, -84837, -64437, 65317, 83848, 19822, 373005, -224449, -143730, 85254, 349070, -81625, 26229, -131865, 64519, 10345, 17100, -205871, -112319, -56251, -289399, -104932, 186096, -173890, -138788, 53618, 73366, -122907, 22622, 70695, 95145, -164232, -156326, 158543, 149522, -178222, -189330, -157714, -195465, -324871, 75118, 122964, 71214, -152535, 93648, -220914, 15734, 103157, 42643, -77621, -199662, 56162, 131727, 26560, -25660, 39003, -291888, -18526, 26594, -272375, -156939, 20141, 137670, -184447, 69925, -10344, 57032, -84816, -164525, 47254, -185408, -83486]
9472a83877l02734h2444j15847I4292R6416P3058a04155k5212B51492B7374c28948
9460B13078a49397O4616K4471M137k9341j81001N4059p5890a05261N308L9405
9449f0548I9999g7484C25366A9311E673J06473D024K08138a58718A36538b3984
9437b2334j27926e6987B74996h9378k67729B28538c57081e9242D2049a29297C72565
9425A09744J03769a42595d8715q4687L5214B4769J01817N5992b72676C941N8640
9414F2581J20332f8848E4734M9835I261c7787D59386d58572B34603b4910j7991
9403d2901A04421b47373A7822b0525j26604k8030k817H3555J35711e1261A66642
9391a87074A00176c22355J17357c3453o6036j09677g6252j00488N2031m1431L2357
$$ y = [-183877, -486611, -82444, -198291, 94292, 190708, 263766, -104155, -129367, 251492, 27374, -328948, 213078, -149397, -84781, -60310, -56173, -85514, -266515, -212456, -288346, -105261, -99953, -60548, 99999, -77484, 325366, 19311, 5673, 112146, 4024, 212162, -158718, 136538, -23984, -22334, -150260, -56987, 274996, -89378, -357107, 228538, -357081, -59242, 42049, -129297, 372565, 109744, 213513, -142595, -48715, -133402, -98188, 24769, 126586, 182578, -272676, 3941, 62581, 182913, -68848, 54734, 104569, 9261, -37787, 459386, -458572, 234603, -24910, -42901, 104421, -247373, 17822, -20525, -147129, -175159, -177976, 83555, 219266, -51261, 166642, -187074, 100176, -322355, -204998, -33453, -99489, -209166, -76252, -176740, -124709, -166140, -133783]
9380a33783G4169c64674b4528l6932j31513a2465l01286B7784c7665k456j607
9369d1728o6447j25098B17655f839p3653A83674Q5675i5211C9135a94274j23566
9358c17840B40618g3149k57313B19892A5328M5588O9288c6658q2869l0126d1143
9346c54262A30781d81548B32042i4207E8438A9835a64915B27443E8619b11804
9335d58189a80742J1225M269N4221F2788c32528F6617a0521H809a11582j63304
9324b74886g217A32374J08665m0709H672a90956A00502a98927B2127J10946c8966
9312i9212L4022A55322b44351J19004H0487R3342a34510a3112l40173A50963h9476
9300a3704n3106q6718D8606A8996J34353c76558i6638m8127j26282b6681j38276
$$ y = [-133783, 74169, -364674, -24528, -61460, -192973, -12465, -313751, 27784, -37665, -40121, -41728, -108175, -233273, 217655, -6839, -80492, 183674, 269349, -95211, 39135, -194274, -317840, 240618, -73149, -330462, 219892, 15328, 60916, 130204, -36658, -119527, -149653, -41143, -354262, 130781, -481548, 232042, -94207, 58438, 19835, -164915, 227443, 58619, -211804, -458189, -180742, -169517, -165248, -111027, 62788, -332528, 66617, -10521, 8809, -111582, -274886, -7217, 132374, 241039, 200330, 8672, -190956, 100502, -198927, 22127, 133073, -38966, -99212, -65190, 155322, -244351, -125347, 80487, 173829, -134510, -13112, -353285, 150963, -89476, -13704, -66810, -153528, 48606, 18996, 153349, -376558, -96638, -144765, -271047, -26681, -164957]
9289a64957r3974N944a03974r6757c9363J6255j30848E8710O0146E4409K65276
9278C19685a2270j08362g94o3271N03j27645A2181b02462C04863H6202P386a37566
9265a10797M8268b4903I6338a01509A6665b32863k48340a43698L7885j76490d005
9253a3425j03058j20100a04606o5136B6767J16019J211c1976d495m0574Q117K953
9241c3999j19047I989L20639A15197d34444f8025k56365h8821a6275A33717F0650
9229a42351H2379f4191l77548A04078P3332c25445e2322l71395a78044D0679e373
9217I0389B2759J57749b42991J06387R268k82974a25546B93382d70392g0973L3609
9206c7364e554B27126c03920J36320d5048j01138e2629j23920D7384e74273a60294
$$ y = [-164957, -258931, -252987, -103974, -200731, -39363, -23108, -153956, 58710, 118856, 54409, 319685, -12270, -120632, -794, -64065, -63562, -191207, 12181, -202462, 304863, 86202, 93588, -137566, -110797, -62529, -24903, 96338, -101509, 16665, -232863, -481203, -143698, -105813, -282303, -4005, -13425, -116483, -236583, -104606, -169742, 26767, 142786, 143997, -31976, -4495, -45069, -36952, -33999, -153046, 9989, 330628, 115197, -434444, -68025, -324390, -88821, -16275, 133717, 60650, -142351, 82379, -64191, -441739, 104078, 177410, -325445, -52322, -423717, -178044, 40679, -5373, 90389, 22759, 180508, -242991, -136604, -127336, -410310, -125546, 293382, -470392, -70973, -37364, -5554, 227126, -303920, -167600, -45048, -146186, -52629, -176549, 47384, -574273, -160294]
9194G7347P1682A2801a6532C90411a95225g3668D6001d25170a98610A37787L1359
9183A69146a08612d088A68058b15794d5021A15549a41024A61331a77916A08674
9172G0688a20277K1344B42690d1414A87542J0794G156a0835A26503h6939o1603
9161a48542I4333c4367A59666d43109a11067l4233r32f6913A42579d3906o5955
9150a09861p0701M9715l0529f3549j38455m1238n0794b3726l8580A78197a73752
9138B07389A01254c88352a840j14794N2478F5693e900l30529J02746l1856E464
9126b26843i6627d11F5648B5151O8869d58581g4875A55305a40050q1116N921a090
9113b29612O1915f9580q0807I414a58145A25973R9661a65405c6484j5136q5879
$$ y = [77347, 149029, 12801, -16532, 390411, -195225, -73668, 46001, -425170, -198610, 137787, 169146, -108612, -4088, 168058, -215794, -45021, 115549, -141024, 161331, -177916, 108674, 70688, -120277, -98933, 242690, -41414, 187542, 198336, 7156, -10835, 126503, -86939, -148542, 94333, -34367, 159666, -443109, -111067, -145300, -146232, -66913, 142579, -43906, -109861, -180562, -130847, -161376, -63549, -202004, -243242, -294036, -23726, -62306, 178197, -173752, 207389, 101254, -388352, -1840, -116634, -64156, 65693, -5900, -336429, -233683, -265539, 5464, -226843, -96627, -411, 65648, 25151, 94020, -458581, -74875, 155305, -140050, -221166, -215245, -1090, -229612, -167697, -69580, -150387, 9414, -158145, 125973, 225634, -165405, -36484, -51620, -137499]
9102a37499B53542a39849N8472L6638R365k29482o5356A49919b71212q8236i9255
9090b20728B63850b40596D13005c7773j42853O5993j95040A84623h3112r4979
9080a78091g4478l12681c4923j96109A06840J8085a94860A44298k0704B5678c3342
9068A00482g9916n9025G2919a63884a7831F471a10146M5767L155j06891d7340
9056I0621d8117a2377H8469K6925a2901B7157d4820a8889j24623j34819G9607
9044c84369B49720r2307c9140j55500a3878B08434a42951n9327N5730N9646J415
9033h5487j56224J15175j0794j77700A24200A6972d1193q2205A10317a261q2198
9022h3459p8286a3925k97997e8297j32939l4315j8982C40462a65548j02014g6183
$$ y = [-137499, 253542, -139849, -81377, -44739, -35374, -264856, -330212, 149919, -271212, -359448, -99255, -220728, 263850, -240596, 413005, -37773, -180626, -114633, -309673, 184623, -83112, -178091, -74478, -387159, -34923, -231032, 106840, 124925, -194860, 144298, 123594, 25678, -33342, 100482, -79916, -138941, 72919, -163884, -17831, 6471, -110146, -64379, -61224, -168115, -47340, 90621, -48117, -12377, 88469, 115394, -12901, 27157, -44820, -18889, -143512, -278331, 79607, -384369, 249720, 157413, -39140, -194640, -13878, 208434, -142951, -202278, -146548, -86902, -85487, -241711, -126536, -137330, -315030, 124200, 16972, -41193, -123398, 110317, -1261, -83459, -161745, -13925, -311922, -58297, -191236, -225551, -244533, 340462, -165548, -267562, -76183]
9010h2997N995I4978J79497I3607a40256k45789r7338A5655e9123j43646B74880
8998b95530J46433k5221B6037J63864c56361f1899k4147l05076L8172A37358b87804
8986c1410D0997B46b68189b306I946O0806j4360c9184A31258L9932B6969G872
8973i8899H646i7018a373j35045J9995b532A89716g7333E7384K23653C1393l722
8961B7671c54672a62329j49079a00511o6079g1220B8075J97429I1894l9014L9685
8950I2565a50737m6056d7964E1385a09916B28212j08507B1948e8589G6822j6089
8939F0733e23871a20042A60901b6884A80285d0626A47058a28798j92959B99730
8928d4256B20156A3696b0895A91133o7789O6034L90981P40630K28653M84827k99866
$$ y = [-82997, -77002, 94978, 274475, 93607, -140256, -386045, -483383, 15655, -59123, -202769, 274880, -295530, -149097, -174318, 26037, 189901, -356361, -61899, -86046, -391122, -352950, 137358, -287804, -31410, 40997, 246, -268189, -2306, 9946, 70752, 56392, -39184, 131258, 171190, 26969, 7872, -98899, 8646, -97018, -1373, -136418, -116423, -2532, 189716, -77333, 57384, 281037, 31393, 27671, -354672, -162329, -311408, -100511, -166590, -71220, 28075, 225504, 91894, 52880, 92565, -150737, -196793, -47964, 51385, -109916, 228212, 119705, 21948, -58589, 76822, 60733, -523871, -120042, 160901, -26884, 180285, -40626, 147058, -128798, -321757, 299730, -44256, 220156, 13696, -20895, 191133, 123344, 189378, 580359, 1320989, 1549642, 2034469, 1734603]
8917A734603q05789m35780K62085C45025b5147A26437a07502E6228a830B5772
8906B59276b20089k2613a0451p127p5145J2053l5781k7704J3032A295L41180C9560
8893b84607I096f9317j2089n53l82683a3865K631j33882k2160A69888A9671f1618
8880a31846l6509D5313b21892G2657J44740D1332i6234j20717M2366B51667a23852
$$ y = [1734603, 928814, 493034, 755119, 345025, -25147, 126437, -107502, 56228, -1830, 25772, 259276, -220089, -242702, -10451, -17578, -92723, -80670, -116451, -144155, -131123, 1295, 342475, 39560, -284607, 9096, -69317, -81406, -81959, -464642, -13865, -11234, -145116, -167276, 169888, 19671, -61618, -131846, -168355, 45313, -221892, 72657, 217397, 41332, -96234, -216951, -174585, 251667, -123852]
$$ [...]
##END NTUPLES=NMR SPECTRUM
##END=
