
##TITLE=AC1338_BRAAS10081_6528666_6PwlyEnglJ
##JCAMPDX= 6.0         $$ Bruker NMR JCAMP-DX V2.0
##DATA TYPE= NMR SPECTRUM
##DATA CLASS= NTUPLES
##ORIGIN= BRUKER
##OWNER= Administrator
$$ 1.72 TOPSPIN		Version 2.1
$$ 2012-07-15 16:40:34.750 -0500  Administrator@TOPSPIN
$$ Compression mode = diff/dup
##.OBSERVE FREQUENCY= 400.02188249412
##.OBSERVE NUCLEUS= ^1H
##.ACQUISITION MODE= SIMULTANEOUS (DQD)
##.ACQUISITION SCHEME= undefined
##.AVERAGES= 8
##.DIGITISER RES= 22
##SPECTROMETER/DATA SYSTEM= spect
##.PULSE SEQUENCE= zg30
##.SOLVENT NAME= COFFEE_meoh
##.SHIFT REFERENCE= INTERNAL, COFFEE_meoh, 1, 14.98509
##AUDIT TRAIL= $$ (NUMBER, WHEN, WHO, WHERE, PROCESS, VERSION, WHAT)
$$ ##TITLE= Audit trail, TOPSPIN		Version 2.1
$$ ##JCAMPDX= 5.01
$$ ##ORIGIN= Bruker BioSpin GmbH
$$ ##OWNER= Administrator
$$ $$ C:\Bruker\TOPSPIN/data/COFFEE/nmr/AC1338_BRAAS10081_6528666_6PwlyEnglJ/10/pdata/1/auditp.txt
$$ ##AUDIT TRAIL=  $$ (NUMBER, WHEN, WHO, WHERE, PROCESS, VERSION, WHAT)
(   1,<2012-07-15 16:40:27.390 -0500>,<Administrator>,<TOPSPIN>,<go>,<TOPSPIN 2.1>,
      <created by zg
	started at 2012-07-15 16:39:20.843 -0500,
	POWCHK enabled, PULCHK disabled,
       configuration hash MD5:
       6B 1B 68 BB D9 2E 58 E2 7F 35 AD 54 07 DF 0E 41
       data hash MD5: 64K
       FF 34 45 6B 68 89 07 06 15 B0 1B 50 64 B8 2A 64>)
(   2,<2012-07-15 16:40:30.375 -0500>,<Administrator>,<TOPSPIN>,<proc1d>,<TOPSPIN 2.1>,
      <Start of raw data processing
       efp LB = 0 FT_mod = 6 PKNL = 1 PHC0 = 0 PHC1 = 0 SI = 32K 
       data hash MD5: 32K
       28 32 D7 BE 65 FB 56 4A 10 BE 36 5A B8 80 89 2E>)
(   3,<2012-07-15 16:40:30.765 -0500>,<Administrator>,<TOPSPIN>,<proc1d>,<TOPSPIN 2.1>,
      <pk PHC0 = 175.8362 PHC1 = 0 
       data hash MD5: 32K
       F4 38 5E 4A 51 A6 BD A6 7F 45 46 1B 0E 65 4B A1>)
(   4,<2012-07-15 16:40:30.828 -0500>,<Administrator>,<TOPSPIN>,<proc1d>,<TOPSPIN 2.1>,
      <abs ABSG = 1 
       data hash MD5: 32K
       80 74 A9 E7 AE 1D F2 07 0C C6 C9 2F 5A 2A 3B 1F>)
(   5,<2012-07-15 16:40:30.859 -0500>,<Administrator>,<TOPSPIN>,<proc1d>,<TOPSPIN 2.1>,
      <abs ABSG = 2 
       data hash MD5: 32K
       8C D3 41 C0 58 2B 63 3E E6 CB 68 B6 5B 9D 85 4D>)
(   6,<2012-07-15 16:40:30.890 -0500>,<Administrator>,<TOPSPIN>,<proc1d>,<TOPSPIN 2.1>,
      <abs ABSG = 3 
       data hash MD5: 32K
       10 9C B6 5C 4C 45 61 BB F8 08 39 CB 13 D6 3C 93>)
(   7,<2012-07-15 16:40:30.921 -0500>,<Administrator>,<TOPSPIN>,<proc1d>,<TOPSPIN 2.1>,
      <abs ABSG = 4 
       data hash MD5: 32K
       A5 83 E3 46 E4 06 B3 6D 12 AC 8A 9E E9 03 2C 39>)
(   8,<2012-07-15 16:40:30.953 -0500>,<Administrator>,<TOPSPIN>,<proc1d>,<TOPSPIN 2.1>,
      <abs ABSG = 5 
       data hash MD5: 32K
       7F DB 8E BF B8 6C E1 A8 E5 E8 CF 22 47 CD 2A 4B>)
$$ ##END=
$$ 
$$ $$ hash MD5
$$ $$ C7 24 F1 25 92 A5 24 59 67 24 D7 8E 31 B1 25 BE
##$RELAX= 
##$RELAX= 
##$RELAX= 
##$RELAX= 
##$RELAX= 
##$RELAX= 
##$RELAX= 
$$ Bruker specific parameters
$$ --------------------------
$$ [...]
150 150 150 150 150 150 150 150
##$TP07= 0
##$TPNAME0= <>
##$TPNAME1= <>
##$TPNAME2= <>
##$TPNAME3= <>
##$TPNAME4= <>
##$TPNAME5= <>
##$TPNAME6= <>
##$TPNAME7= <>
##$TPOAL= (0..7)
0.5 0.5 0.5 0.5 0.5 0.5 0.5 0.5
##$TPOFFS= (0..7)
0 0 0 0 0 0 0 0
##$TUNHIN= 0
##$TUNHOUT= 0
##$TUNXOUT= 0
##$USERA1= <user>
##$USERA2= <user>
##$USERA3= <user>
##$USERA4= <user>
##$USERA5= <user>
##$V9= 5
##$VALIST= <valist>
##$VCLIST= <CCCCCCCCCCCCCCC>
##$VD= 0
##$VDLIST= <DDDDDDDDDDDDDDD>
##$VPLIST= <PPPPPPPPPPPPPPP>
##$VTLIST= <TTTTTTTTTTTTTTT>
##$WBST= 2048
##$WBSW= 25
##$XGAIN= (0..3)
0 0 0 0
##$XL= 0
##$YL= 0
##$YMAX_a= 514877
##$YMIN_a= -658157
##$ZGOPTNS= <>
##$ZL1= 120
##$ZL2= 120
##$ZL3= 120
##$ZL4= 120
##$ABSF1= 14.98509
##$ABSF2= -5.573092
##$ABSG= 5
##$ABSL= 3
##$ALPHA= 0
##$AQORDER= 0
##$ASSFAC= 0
##$ASSFACI= 0
##$ASSFACX= 0
##$ASSWID= 0
##$AUNMP= <proc_prof1d_extract_pilot.lims>
##$AXLEFT= 0
##$AXNAME= <>
##$AXNUC= <1H>
##$AXRIGHT= 0
##$AXTYPE= 0
##$AXUNIT= <>
##$AZFE= 0.1
##$AZFW= 0.1
##$BCFW= 0
##$BC_mod= 0
##$BYTORDP= 0
##$COROFFS= 0
##$CY= 15
##$DATMOD= 1
##$DC= 0
##$DFILT= <>
##$DTYPP= 0
##$F1P= 0
##$F2P= 0
##$FCOR= 0.5
##$FTSIZE= 32768
##$FT_mod= 6
##$GAMMA= 0
##$GB= 0
##$INTBC= 1
##$INTSCL= 1
##$ISEN= 128
##$LB= 0
##$LEV0= 0
##$LPBIN= 0
##$MAXI= 10000
##$MC2= 0
##$MEAN= 0
##$ME_mod= 0
##$MI= 0
##$NCOEF= 0
##$NC_proc= -8
##$NLEV= 6
##$NOISF1= 0
##$NOISF2= 0
##$NSP= 0
##$NTH_PI= 0
##$NZP= 0
##$OFFSET= 14.98509
##$PC= 1
##$PHC0= 175.8362
##$PHC1= 0
##$PH_mod= 1
##$PKNL= yes
##$PPARMOD= 0
##$PPDIAG= 0
##$PPIPTYP= 0
##$PPMPNUM= 2147483647
##$PPRESOL= 1
##$PSCAL= 4
##$PSIGN= 0
##$PYNMP= <proc.py>
##$REVERSE= no
##$SF= 400.02
##$SI= 32768
##$SIGF1= 0
##$SIGF2= 0
##$SINO= 400
##$SIOLD= 32768
##$SPECTYP= <>
##$SREGLST= <1H.CDCl3>
##$SSB= 0
##$STSI= 32768
##$STSR= 0
##$SW_p= 8223.68421052631
##$SYMM= 0
##$S_DEV= 0
##$TDeff= 65536
##$TDoff= 0
##$TI= <>
##$TILT= no
##$TM1= 0
##$TM2= 0
##$TOPLEV= 0
##$USERP1= <user>
##$USERP2= <user>
##$USERP3= <user>
##$USERP4= <user>
##$USERP5= <user>
##$WDW= 1
##$XDIM= 32768
##$YMAX_p= 472094321
##$YMIN_p= -776925
##$CURPLOT= <Network HP LaserJet P1505>
##$CURPRIN= <$Network HP LaserJet P1505>
##$DFORMAT= <normdp>
##$LAYOUT= <+/1D_H.xwp>
##$LFORMAT= <normlp>
##$PFORMAT= <normpl>
##$SURQMSG= 1
$$ End of Bruker specific parameters
$$ ---------------------------------
##NTUPLES= NMR SPECTRUM
##VAR_NAME=  FREQUENCY,     SPECTRUM/REAL,   SPECTRUM/IMAG
##SYMBOL=    X,             R,               I
##VAR_TYPE=  INDEPENDENT,   DEPENDENT,       DEPENDENT
##VAR_FORM=  AFFN,          ASDF,            ASDF
##VAR_DIM=   32768,         32768,           32768
##UNITS=     HZ,            ARBITRARY UNITS, ARBITRARY UNITS
##FACTOR=    0.250966925370066, 1,           1
##FIRST=     8223.43324360094, -136006,      -166574
##LAST=      0,             195597,          -176230
##MIN=       0,             -776925,         0
##MAX=       8223.43324360094, 472094321,    0
$$ Real data points
##PAGE= N=1
##DATA TABLE= (X++(R..R)), XYDATA
$$ [...]
19516H87d59206I0373a39092f6084p254A2782h6091L6765j47050q6058B57111
19504e30067A56208a89229l22421b25694B20131d12981a64165C2302K51119G9118
19493F0782A2392a81884k06541b4189i824I820a48021B11212G0476b91121J01018
19482a90103k06737D7386b41723d8283r6633M0041B5547K6414Q1381a52434O9208
19471h3226k19728D4804A200i8863C885c6419k51326C8880a40055L5017a5434
19459c09443a4987A63553F5113b70785j4148A2130P8197a7319j09696N0999n2934
19448a28950B0764a9575l36963E7295a20686L3544j03705h2994A50498C0187L1203
19437F1390K5313C5219a39949F5479a47977K2210B296c49098B04078h4083j4134
$$ plain form
19516 887 -459206 90373 -139092 -66084 -73338 12782 -86091 -49326 -196376 -282434 257111
19504 -530067 156208 -189229 -511650 -225694 220131 -412981 -164165 32302 283421 79118
19493 60782 12392 -181884 -388425 -24189 -9824 9820 -148021 211212 70476 -291121 -190103
19482 -190103 -396840 47386 -241723 -48283 -144916 -104875 25547 51961 133342 -152434 -83226
19471 -83226 -302954 44804 1200 -98863 3885 -36419 -287745 38880 -140055 -105038 -15434
19459 -309443 -14987 163553 65113 -270785 -284933 12130 90327 -17319 -127015 -76016 -128950
19448 -128950 20764 -19575 -356538 57295 -120686 -87142 -190847 -82994 150498 30187 61390
19437 61390 86703 35219 -139949 65479 -147977 -125767 2296 -349098 204078 -84083 -98217
19426i8217D2341b3928k38869B0315a18999A47992j1225c08002K4516a36751B3009
19414e9010j46240h415k39579c2629l459o6837k40978A22087j8544P2804J18597
19403B94944a22611k8965b5463C34612a74373A37051k5368L08264a71490G2336
19392A13345p812c69774a02537q3458B2169J00040g0333B498P5986a73350A28742
19380c35995J55409o4430A44855a21499j41651i7672D0505C145a3061A15380a24768
19368a61824A07117b48590i535B5044d40347a053l35480A26605b61930D4538a86449
19356e3876k67899m5364J08632j7769A81512p1427H580K46620c06760d5074C7000
19344a10408M2402p1965E3846f9589l9068j25700J16525p9678j64858a00567c1459
$$ plain form
19426 -98217 42341 -23928 -262797 20315 -118999 147992 136767 -308002 -283486 -136751 23009
19414 -59010 -205250 -8415 -247994 -32629 -36088 -102925 -343903 122087 103543 176347 294944
19403 294944 -122611 -151576 -25463 334612 -174373 137051 111683 419947 -171490 72336
19392 113345 105533 -369774 -102537 -185995 22169 122209 -70333 2498 78484 -173350 128742
19380 -335995 -180586 -245016 144855 -121499 -263150 -97672 40505 3145 -13061 115380 -124768
19368 -161824 107117 -248590 -9535 25044 -440347 -1053 -336533 126605 -261930 44538 -186449
19356 -53876 -321775 -367139 -258507 -276276 181512 110085 8580 255200 -306760 -45074 37000
19344 -110408 -68006 -139971 53846 -69589 -108657 -234357 -117832 -197510 -362368 -100567 -31459
19332g0533l81501f8400D7919c5062k46910B2857b34410i1655j40808j16909j01287
19321d50659K21825f4047A03704k5862C2119b14480B17526r7751d62343A22983
19310B3140M2996J35542a10676J2151j1525c5472l8336c956j36202e3469B57588
19298A84210D3573e0793j62296p51I8937a4529j10587j92991g3299r2588A4222
19286a31086q4867k6831A23763C9881N3575M6643J1392g7017E1521r09a57839
19274h4890k79828F2278m717d98284C1427J42310l2778a29371e4519j617J4053
19263d2083k56959A66456g2291D1046K25877A7972O2906h872j01686d0579r8694
19252a39273k13906A47442h5943G7177j1556c51615f8132A1120i1362A22592h0148
$$ plain form
19332 -70533 -452034 -68400 47919 -35062 -281972 22857 -234410 -91655 -232463 -349372 -450659
19321 -450659 -228834 -64047 103704 77842 32119 -214480 217526 119775 -462343 122983
19310 23140 66136 201678 -110676 -98525 -110050 -35472 -73808 -3956 -140158 -53469 257588
19298 184210 43573 -50793 -213089 -213840 98937 -14529 -125116 -318107 -73299 -165887 14222
19286 -131086 -215953 -242784 123763 39881 93456 140099 151491 -77017 51521 50612 -157839
19274 -84890 -364718 62278 57561 -498284 31427 173737 140959 -129371 -54519 -56136 -42083
19263 -42083 -299042 166456 -72291 41046 266923 17972 80878 -8872 -110558 -40579 -139273
19252 -139273 -353179 147442 -85943 77177 65621 -351615 -68132 11120 -91362 122592 -80148
19240b8831k53951d1510A05802c23194B08408c0013A5936a37130O944d4575q9760
19229a34335C08956j26544a48498j98425A82449h3462a1493l50886H7816K37381
19219C25197H8546g3693G6339a96890R2306E1718N1254c23534q2067C27816i0143
19207h6302B96228a66192G2771a47362A88430b13682g7754A30945e2220F9117
19196a59967J6876k30072g4440k7623l4252f5450n9059C08578A52935a44487D4143
19184c4243F2212g0155D4291a98862Q5713A46590i2593B51745d42371a84133a9738
19172I7215a23712D2657l022d5278j01045C23645A19618a5897j83416O9299e8890
19160b11902A49878c53058a27394K4157A55690j8513b34566A36800e4814l19188
$$ plain form
19240 -28831 -282782 -41510 105802 -323194 208408 -30013 15936 -137130 -130186 -44575 -134335
19229 -134335 308956 182412 -148498 -346923 182449 -83462 -11493 -362379 87816 325197
19219 325197 88546 -73693 76339 -196890 -104584 51718 102972 -323534 -405601 327816 -90143
19207 -86302 296228 -166192 72771 -147362 188430 -213682 -77754 130945 -52220 69117
19196 -159967 -143091 -373163 -74440 -102063 -136315 -65450 -124509 308578 152935 -144487 44143
19184 -34243 62212 -70155 44291 -198862 -113149 146590 -92593 251745 -442371 -184133 -19738
19172 97215 -123712 42657 39635 -45278 -146323 323645 119618 -15897 -199313 -130014 -58890
19160 -211902 149878 -353058 -127394 -103237 155690 137177 -234566 136800 -54814 -374002
19150c74002P6268J42873b6112r3541B56105E4282d52517a47136N6607A65593
19139a24794a3109A06603L5415j2421i0157d2374j49923n9311c0160c305j04628
19128a07933j31846f0008j18103A18955a51161k4089a0713k47959P6041j0145
19118a92776K8706G2569a34076d3798B72459e1695n3461o0439l6459r1681J26729
19107a67006E6856a56480B4248c19521A0569P6993N2958m5549c89858B68315b39693
19095B22059i0284j75439l9186C3038a63936B9217a89484F6074h1522n8221j27898
19084b67641A1142J30288g6635B8124A444d90858A6162g1759l3584A50575n3855
19073I6720a86899A17309k5373f6355m7868B77J3044a45735C49636A66170a48005
$$ plain form
19150 -374002 -297734 -154861 -26112 -119653 256105 54282 -452517 -147136 -90529 165593
19139 -124794 -13109 106603 142018 129597 -90157 -42374 -192297 -251608 -30160 -3305 -107933
19128 -107933 -239779 -60008 -178111 118955 -151161 -175250 -10713 -258672 -182631 -192776
19118 -192776 -164070 72569 -134076 -43798 272459 -51695 -105156 -165595 -202054 -293735 -167006
19107 -167006 56856 -156480 24248 -319521 10569 87562 140520 94971 -389858 268315 -239693
19095 222059 -90284 -265723 -304909 33038 -163936 29217 -189484 66074 -81522 -139743 -267641
19084 -267641 11142 141430 -76635 28124 1444 -490858 16162 -71759 -105343 150575 96720
19073 96720 -186899 117309 91936 -66355 -114223 277 13321 -145735 349636 166170 -148005
19061a47540A46052g3626A5700J14208b04922p0281J28953D164L6547o138J13521
19050A48094F2795n29d3004B1268M8215a60352B37396g9057l11186H0713a10687
19038a18680J366D89212e2398A76593d36972D0027b56554A26817a9622j24475
19028a44097A79574E0368e3184k82896H867P3152c11895A75587B6591b21657J09364
19017a12293K3683B77027F8605Q5066a08294E876a57945C8609M8754i7068A18816
19005h016p6708k68k56052A52276c58106e4513R372J9319A42322E7598K4901K66770
18993C49269h7454d2767j23594l5475r6524k68199a89871E925J46741a9688l1061
18982e0749k9889I5519K399h1019O316j3979k31378J29839a3866A89525F1399
$$ plain form
19061 -147540 146052 -73626 15700 129908 -204922 -275203 -146250 4164 40711 34573 148094
19050 148094 62795 62266 -43004 21268 69483 -160352 237396 -79057 -390243 80713 -110687
19038 -118680 -117314 489212 -52398 176593 -436972 40027 -256554 126817 -19622 -144097
19028 -144097 179574 50368 -53184 -336080 8867 82019 -311895 175587 26591 -221657 -112293
19017 -112293 -88610 277027 68605 153671 -108294 5876 -157945 38609 87363 -97068 118816
19005 -8016 -84724 -84992 -341044 152276 -358106 -54513 -45141 -25822 142322 57598 82499 349269
18993 349269 -87454 -42767 -166361 -201836 -298360 -566559 -189871 5925 152666 -19688 -50749
18982 -50749 -80638 95519 97918 -81019 -74703 -88682 -320060 -190221 -13866 189525 61399
18970a00298b6445j99734a10324l22759A57903b14450d8084o3072p1159P0641
18960a11674k63601A7861c17649i780k3569m3319A04840C3711b50869G0035J62931
18949B32966A00375A9654a41708j75907a32326e4285K6060j14483H8548J27355
18939B15903a3853H001d79601H7181a00571d6350A21845a64092a175n0570E4134
18927c29121b2839G0260k1424j4912k222J34450j9148B1993b03063j22422Q1871
18916b43614Q9245e2346F2422f781A44184a06821K3196D439b2912o9573r5053
18905a87538k22492B85822i4149r3261I5809a16029I2885f13677b75314F5387
18894B29379A1557K73952c80371A4360e1080K3037A52575C9664a87073A42917
$$ plain form
18970 -100298 -26445 -226179 -110324 -433083 157903 -214450 -48084 -111156 -182315 -111674
18960 -111674 -375275 17861 -317649 -9780 -33349 -76668 104840 33711 -250869 70035 232966
18949 232966 100375 19654 -141708 -317615 -132326 -54285 -28225 -142708 88548 215903
18939 215903 -13853 8001 -479601 87181 -100571 -46350 121845 -164092 -1175 -51745 54134
18927 -329121 -22839 70260 48836 33924 31702 166152 147004 21993 -203063 -325485 -243614
18916 -243614 -154369 -52346 62422 -6781 144184 -106821 -83625 4439 -22912 -92485 -187538
18905 -187538 -410030 285822 -94149 -187410 95809 -116029 92885 -613677 -275314 65387
18894 229379 11557 285509 -380371 14360 -51080 -28043 152575 39664 -187073 142917
18883a39549j32275I028d6392A44137L9681C9107K36006N3388j41973G8055a18170
18871a11231B44305B7947i2729j96458F4966a78676j77966e8906j01690k5624
18861a86220G6956Q3602m7512m8910a52645d1046k4105A04369b29060c633k3741
18850b7374j18544F6285P2095b34140G2110J1928K0973b17600N4h086H1330R9977
18838A81307F5537a54343G1501A3671a37861L588g958A8432e3973D1844L72933
18827D14777a04260B00675a08708J0876l40454b16987A3023h5274b6980B64987
18816C33544a46685D89725E8302n678Q5625J13074J17911b41723i9655p5187B20147
18804e2537C03383A44413b70419B160K40510c9666j75875H5112a62460r2046E4496
$$ plain form
18883 -139549 -271824 9028 -46392 144137 183818 39107 275113 328501 186528 78055 -118170
18871 -111231 244305 27947 -92729 -289187 64966 -178676 -356642 -58906 -160596 -186220
18861 -186220 76956 160558 113046 64136 -152645 -41046 -65151 104369 -229060 -3633 -27374
18850 -27374 -145918 66285 138380 -234140 72110 84038 105011 -217600 -217546 -8086 81330 181307
18838 181307 65537 -154343 71501 13671 -137861 -134273 -7958 18432 -53973 41844 414777
18827 414777 -104260 200675 -108708 -97832 -438286 -216987 13023 -85274 -26980 264987
18816 333544 -146685 489725 58302 52624 138249 251323 369234 -241723 -99655 -174842 220147
18804 -52537 303383 144413 -270419 2160 242670 -39666 -215541 85112 -162460 -254506 54496
18792a11111o798r1193b4727p0471k44453J61573A90037h4911j3120a4417o946
18781b1363l36543a40655c7062j41246q225E9033B8348K9920d1756k06656h1849
18769a30225k22672A41310A592d51270b6198l7558A7653J09393K02210A21071
18758A42156a33749j5026E294a19470A18578d29126I6088b5234r0314N086c6766
18746a45329N3328m2655F3533a27350B1502a08115E0913K9195b51894e8028j1609
18735f9637k57709A31456b69751A651a045A97760E2242J24292c34512d5744B16319
18723d32826B21306a1956j36216B07617b70851J7218j0525j1448D5097J745d05065
18711C47478a41024I6289l4831N5129a16083B38428Q9539G6444J6829A6762c22980
$$ plain form
18792 -111111 -117909 -209102 -24727 -95198 -339651 -178078 190037 -84911 -98031 -14417 -21363
18781 -21363 -357906 -140655 -37062 -178308 -186533 59033 28348 58268 -41756 -248412 -81849
18769 -130225 -352897 141310 1592 -451270 -26198 -63756 17653 127046 329256 121071
18758 142156 -133749 -148775 5294 -119470 118578 -429126 96088 -25234 -115548 -110462 -36766
18746 -145329 -92001 -134656 63533 -127350 21502 -108115 50913 80108 -251894 -58028 -69637
18735 -69637 -327346 131456 -269751 1651 -1045 197760 52242 176534 -334512 -45744 216319
18723 -432826 221306 -11956 -148172 207617 -270851 -253633 -264158 -275606 45097 46842 -405065
18711 347478 -141024 96289 61458 116587 -116083 238428 327967 76444 93273 16762 -322980
18699a6736A87489b78095e6613k72637H926a85806E8654a43743l2231h2253q6202
18688a68455E3744a73923a8543A11245c34175C7367a04043A14250K2122b09487
18677a43458B33669A6398L2669b37600A32039b68616a31652m4416I4460a6567
18666D8569J9045f7320F9733J4119K16384j36923b02906Q9188N1000B2362b51509
18654I6573c02628J30780A07692J2067a90936j94229C4413C1L36843H8774b73613
18642A33570i7269j12620h0107e696m5306g226k0366l02863J42210A5520c01436
18630b42650q6090a54245k4735j47381A06439J10151G0492K25424g8359p0279
18620a48638E890M393c82964D5602d51768A6552g7212A49105a14521j25737J16688
$$ plain form
18699 -16736 187489 -278095 -56613 -329250 8926 -185806 58654 -143743 -175974 -82253 -168455
18688 -168455 53744 -173923 -18543 111245 -334175 37367 -104043 114250 136372 -209487
18677 -143458 233669 16398 49067 -237600 132039 -268616 -131652 -176068 94460 -16567
18666 48569 67614 -67320 69733 83852 300236 163313 -202906 -113718 -62718 22362 -251509
18654 96573 -302628 -171848 107692 119759 -190936 -385165 34413 31 336874 88774 -273613
18642 133570 -97269 -209889 -80107 -5696 -51002 -7226 -27592 -330455 -188245 15520 -301436
18630 -242650 -328740 -154245 -178980 -326361 106439 216590 70492 295916 -78359 -148638
18620 -148638 5890 10283 -382964 45602 -451768 16552 -77212 149105 -114521 -240258 -123570
18609a23570f345I155d3220l88970a99505J2389Q8845D0066b41860D0168L0610
18598G0778b21348N3800b4148q2935k4876l6780j45542A151b04056G3123b79702
18586a28256L8469r197j0861A20770g106p3274j56848F1021J68461L5330A23254
18574b91557A27591n033d2350j42743q2166b3014A99518c13378A72729a18603
18563b86068H8311a20380j3942K7351E37960B08577J17697c86264a78467J4825
18553a63642c603A11829b68870A61232a1224q3716A01618a86195A9098b78416
18542e3597m14304A83971a74972B36521a42005K2065j60066a30929J4730L8002
18532g8197m0287m0507l0261B39387a68039F2269c16909B17327i9831j16428f9891
$$ plain form
18609 -123570 -6345 9155 -43220 -432190 -199505 -187116 -98271 40066 -241860 40168 70778
18598 70778 -221348 -167548 -24148 -107083 -131959 -168739 -314281 1151 -204056 73123 -279702
18586 -128256 -89787 -98984 -109845 120770 -7106 -80380 -237228 61021 229482 264812 123254
18574 -291557 127591 122558 -42350 -185093 -267259 -23014 199518 -313378 172729 -118603
18563 -286068 88311 -120380 -134322 -106971 537960 208577 326274 -386264 -178467 -163642
18553 -163642 -3603 111829 -268870 161232 -11224 -94940 101618 -186195 19098 -278416
18542 -53597 -467901 183971 -174972 236521 -142005 -119940 -280006 -130929 -116199 -78197
18532 -78197 -118484 -158991 -189252 239387 -168039 62269 -316909 217327 -99831 -216259 -69891
18520a08095a1173j41580B14683a28969E3480d0748A8037c9986B00841c80322
18509a32958O1002j11451A63099a87487l8185a1813l7131A49132m890i553j32345
18498a41898e4736k54967h4590j48254B43334H2845K7923j9714a23204n1340E7195
18486A53213h1199j76111A49448c02030A57743a2398r9972A7256J47970a81399
18475b99563m8849b647k01401l3981g0947j9233A15787h7011k822j19410a7875
18463i6813a2366A42736K79h5742A21293D4787b41138h7760B74547A01033b96361
18451i4581P10k97369c3459A58506d30004A24616N5729b16727A07621b16219C7025
18439e64076a4447j54700A55522C9803J10764b42908A47734n7483b38642e1675
$$ plain form
18520 -108095 -11173 -152753 214683 -128969 53480 -40748 18037 -39986 200841 -380322
18509 -132958 -71956 -183407 163099 -187487 -225672 -11813 -48944 149132 144242 -9553 -141898
18498 -141898 -54736 -309703 -84590 -232844 243334 82845 110768 91054 -123204 -174544 57195
18486 153213 -81199 -257310 149448 -302030 157743 -12398 -112370 17256 165226 -181399
18475 -299563 -348412 -2647 -204048 -238029 -70947 -90180 115787 -87011 -89833 -209243 -17875
18463 -96813 -12366 142736 143015 -85742 121293 44787 -241138 -87760 274547 101033 -296361
18451 -94581 -93871 -391240 -33459 158506 -430004 124616 180345 -216727 107621 -216219 37025
18439 -564076 -14447 -169147 155522 39803 150567 -242908 147734 90251 -238642 -51675
18428a5589j63991E018Q360e8914j89255j67050D3111a88171O0446F7332b15045
18416B83480h0521A00637a51137j14140Q9985C6462a06239j56633G0455P5785
18406A46240n039a74393F487K85392a04553q6776A24663i6831B96413d6663I73
18394H0678c13877b4465j63026j5083G9045c0403q6508B07961H1226b55271A24546
18382F2691a39244C57691c8804A03465i6450M4774j02024I25a14841K4616k4882
18371a15107A87805A818a58483C2648J35576H2754l9162e5241H7030a33863p5233
18360b09096j1812A37447f4269r9215D65471b1926k01990g2958E838b13397A3628
18348c04442A50139d4840C0132L1920b49513I0093i8065B31883b74861J19078
$$ plain form
18428 -15589 -179580 5018 13378 -58914 -248169 -415219 43111 -188171 -127725 67332 -215045
18416 283480 -80521 100637 -151137 -265277 -175292 36462 -106239 -262872 70455 146240
18406 146240 141201 -174393 6487 291879 -104553 -191329 124663 -96831 296413 -46663 973
18394 80678 -313877 -24465 -187491 -202574 79045 -30403 -116911 207961 81226 -255271 124546
18382 62691 -139244 357691 -38804 103465 -96450 -51676 -153700 925 -114841 -90225 -115107
18371 -115107 187805 1818 -158483 32648 168224 82754 43592 -55241 87030 -133863 -209096
18360 -209096 -220908 137447 -64269 -163484 465471 -21926 -223916 -72958 5838 -213397 13628
18348 -304442 150139 -44840 30132 62052 -249513 90093 -98065 231883 -274861 -155783
18338a55783b1911B8655A94b41286A83349d45146G3285k9758J86726c8431j03880
18327a42311d916k10069a00637G0759h5017A08720h4382o3286e0696G0890c37555
18315F4393e20991b52960N5794A98896J10190b01100Q6150j25457j0680N7731
18305a93356j14277c3559A32747d3479K0379B21920D0593n867g4764A71918a18571
18293A17976k8618D4131Q0606k5571b15137A84759o6395b59388G9132Q4301J51205
18282C14638b6518B7000d6652I9659b93611a11143k4730l1843o5240B67405b60946
18270a31557c2674l1589j66366Q2079M2773A5179a82503A29884a81920B72984
18259a07333a1703k56409A45718k6668a1891H6667m2376a85282B0268b51859D6358
$$ plain form
18338 -155783 -21911 28655 194 -241286 183349 -445146 73285 43527 230253 -38431 -142311
18327 -142311 -4916 -214985 -100637 70759 -85017 108720 -84382 -147668 -50696 70890 -337555
18315 64393 -520991 -252960 -197166 198896 309086 -201100 -114950 -240407 -251087 -193356
18305 -193356 -307633 -33559 132747 -43479 -23100 221920 40593 34726 -74764 171918 -118571
18293 117976 89358 44131 124737 99166 -215137 184759 118364 -259388 79132 163433 314638
18282 314638 -26518 27000 -46652 99659 -293611 -111143 -135873 -167716 -232956 267405 -260946
18270 -131557 -32674 -64263 -230629 -148550 -105777 15179 -182503 129884 -181920 272984
18259 -107333 -11703 -268112 145718 119050 -11891 86667 44291 -185282 20268 -251859 46358
18247b87342H8033d8304k71335J1966B73332b50848A77289b10911B84566b58761
18236a20203l2537O6603a9599j26305B72566a47190D8228a78934c0808m22214
18226d53022B26081E9577C547d38875a02329g151o1308j77179j27133H1035a51025
18214c83793c752k54298B10712b775o5466C02117a33801o1166K6418l1400f0785
18202b86601l0258l8229A17414i3911A51113a68721H6652J096N3212l1890J08207
18191B17277a92832H2362J35063a00319L9064j10686o6312i839k58940d1521A42415
18179b6865F6294a30123j90332j09471a46438F8109c09063D4777A0756N1620e1100
18167f7364j65374A25945b2563j56936C0543c7684k15881N6288D56137a53721
$$ plain form
18247 -287342 88033 -48304 -319639 -307673 273332 -250848 177289 -210911 284566 -258761
18236 -120203 -152740 -86137 -19599 -145904 272566 -147190 48228 -178934 -30808 -453022
18226 -453022 226081 59577 3547 -438875 -102329 -7151 -68459 -245638 -372771 81035 -151025
18214 -383793 -3752 -258050 210712 -2775 -68241 302117 -133801 -194967 -168549 -199949 -60785
18202 -286601 -316859 -355088 117414 -93911 151113 -168721 86652 87748 140960 109070 217277
18191 217277 -192832 82362 217425 -100319 -61255 -171941 -238253 -9839 -268779 -41521 142415
18179 -26865 66294 -130123 -320455 -429926 -146438 68109 -309063 44777 10756 62376 -51100
18167 -67364 -232738 125945 -22563 -179499 30543 -37684 -253565 -197277 456137 -153721
18156f7500B07266n7771g2020j07347B2850i6402B18229c0711k39648I9270g7190
18144b70361J04731N2299N1818l60816J17237a44285n6334A47180c8969C8928
18133b7062B94368b32971R3398C90510F8119J91695d1854j00849c9815A26623
18122A92994b50662i9932c3042B460b00312b0417k98468B36307o0823n7706J95896
18111C13674F1991L5209a37649A30075a54173L7144K2951j03800A83287F3075
18100a50163C4486h7370r923j1512A27113h2885A4852a21269l5102F2937b09706
18088a77865A20327c1540q1288B37335e905j17969k16236A38678c15505A48656
18077c6069I3323a58760O5230C616a3652p3339d2329j49926B42615d9176j09386
$$ plain form
18156 -67500 207266 149495 -72020 -179367 22850 -96402 218229 -30711 -270359 99270 -77190
18144 -270361 -165630 -113331 -61513 -422329 -305092 -144285 -200619 147180 -38969 38928
18133 -27062 294368 -232971 -139573 390510 68119 259814 -41854 -142703 -39815 126623
18122 192994 -250662 -99932 -33042 2460 -200312 -20417 -318885 236307 175484 117778 313674
18111 313674 61991 97200 -137649 130075 -154173 -117029 -94078 -197878 183287 63075
18100 -150163 34486 -87370 -97293 -108805 127113 -82885 14852 -121269 -156371 62937 -209706
18088 -177865 120327 -31540 -112828 237335 -5905 -123874 -340110 138678 -315505 148656
18077 -36069 93323 -158760 -93530 3616 -13652 -86991 -42329 -192255 242615 -49176 -158562
18066a58562d6686D5335b9066m4520c5431D38805b60829A44131D0604A5929K2224
18055C8153D656f6173b5697A10309K6273b2462C9024P6883a84286B50380b22506
18043A88836g7584A27561C9399O9034i4776F4352b17670c8257l713r3795H2639
18031b52848e2978B71261d8236q0052j08501m7433I5021K0907A0371b71844j03978
18020c75822d4224l32463a83237A31385E0428b34470P8473a6114F4623b25803
18009E1359b4041A17666c17505d9100J9562C8387a07610B9789g3497b0444h616
17997A75225m637K09820a39933j24495j215A13968J35405q3293a44685H498J34431
17986A42929a47537q13o9632C0713a87477l7179A21771a84340F6063A2987P6966
$$ plain form
18066 -158562 -46686 45335 -29066 -73586 -35431 438805 -260829 144131 40604 15929 38153
18055 38153 4656 -66173 -25697 110309 136582 -22462 39024 115907 -184286 250380 -222506
18043 188836 -77584 127561 39399 108433 -94776 64352 -217670 -38257 -41970 -135765 82639
18031 -252848 -52978 271261 -48236 -128288 -236789 -284222 95021 115928 10371 -271844 -375822
18020 -375822 -44224 -376687 -183237 131385 50428 -234470 -155997 -16114 64623 -225803
18009 51359 -24041 117666 -317505 -49100 -29538 38387 -107610 29789 -73497 -20444 -8616
17997 175225 170588 380408 -139933 -264428 -265643 113968 249373 166080 -144685 8498 142929
17986 142929 -147537 -148350 -217982 30713 -187477 -224656 121771 -184340 66063 12987 89953
17975H9953c2595B35601n9537p8850h7525A5793R0282a45115E4183b25511J3675
17964b11836a01615j61068c3850B62483c6925G5998a7502p8567F8904J66269c65722
17952A052a61788D56100A21904J71555D4017L4599a60091P0248j90979a2027G3073
17940F160K53127a62147B2294J18404b16628A60557o8147B0794J53572b41855
17929c89751b2935C72927C9438J1669b33161K9616A12738n5227Q5131K1830F5132
17917C28705o0433D1606g1494A50046Q2155q9819N5720A5017R8778m1588c2704
17905a30918q6099b7397A73090o6978f4482j64905h899A27617B8063I404K5345
17894C4749c23842a11472D1123K6519L5011M5558a24907L4491l31349J70521F1785
$$ plain form
17975 89953 -32595 235601 176064 97214 -87525 15793 106075 -145115 54183 -225511 -211836
17964 -211836 -101615 -262683 -33850 262483 -36925 75998 -17502 -96069 68904 235173 -365722
17952 1052 -161788 456100 121904 293459 44017 78616 -160091 -89843 -280822 -12027 73073
17940 6160 259287 -162147 22294 140698 -216628 160557 92410 20794 174366 -241855
17929 -389751 -22935 372927 39438 51107 -233161 -203545 112738 57511 142642 164472 65132
17917 328705 268272 41606 -71494 150046 232201 142382 198102 15017 113795 72207 -32704
17905 -130918 -217017 -27397 173090 106112 -64482 -229387 -8899 127617 28063 9404 34749
17894 34749 -323842 -111472 41123 67642 102653 148211 -124907 -90416 -421765 -251244 61785
17882A7083a9206B4633J32402b55198d3477j67821A28867a5691n12I8820e1282
17870A42398G856Q8947c20440B35859a07326l8428A09108E05b3289A06131e4682
17858B58540a14563A03219K456a70784B16019a66414B76800A865g6458j463k4258
17847a02179H644a88309A71440h5237A77666I131J08443b03974b4574m1904j85544
17836b52022g2139l16974f4806b1666k4234F004K7916J81379c452F2151e5227
17824b73941j3595J43244A31334b18352A11715B057K01885g7622B28924b57526
17813i7493E9635j1945b0825q8495j0168C85186c35537i9241A65385a74325C7887
17801c48099J19101A25076n6937a00312C82528h1496K6316O109k23061l8212G3624
$$ plain form
17882 17083 -19206 24633 157035 -255198 -43477 -211298 128867 -15691 -16203 98820 -51282
17870 142398 7856 96803 -320440 235859 -107326 -145754 109108 505 -23289 106131 -54682
17858 258540 -114563 103219 105675 -170784 216019 -166414 276800 1865 -76458 -77921 -102179
17847 -102179 8644 -188309 171440 -85237 177666 9131 117574 -203974 -24574 -66478 -252022
17836 -252022 -72139 -389113 -64806 -21666 -45900 6004 33920 215299 -3452 62151 -55227
17824 -273941 -287536 -144292 131334 -218352 111715 2057 203942 -77622 228924 -257526
17813 -97493 59635 47690 -20825 -109320 -119488 385186 -335537 -99241 165385 -174325 37887
17801 -348099 -228998 125076 68139 -100312 382528 -81496 -55180 -49071 -272132 -310344 73624
17789H3491H15h0565A61978F1060h1010j22876A45434k5922b50027D0154J34354
17778A74508g8841n4707E4534R7195m6468m0876a43075i679j29858a9617C46475
17766a26137e7372k833k9258B50338j06422f9088C9695L29233E6343a16871B96785
17754i4584A13382N9450b2185B8969a56078D2104L4122a07773A07564i3330k60037
17743c53367E0855c46137c3332k71986A8228f2749b8169j854j32526A54841n1430
17732A03411a51118A74097q5609h5356j36076B58824a49245D8251b0481A26491
17721A84233o9515K5f8382k54934B71180B224b44815B41773a12307B8813a29403
17709I4791a14607B17338b77001C16014E5752Q2141l9575a01788c7707k23402
$$ plain form
17789 83491 815 -80565 161978 61060 -81010 -203886 145434 119512 -250027 40154 174508
17778 174508 -78841 -133548 54534 151729 105261 64385 -143075 -9679 -139537 -19617 346475
17766 -126137 -57372 -60205 -89463 250338 143916 -69088 39695 368928 56343 -116871 296785
17754 -94584 113382 172832 -22185 28969 -156078 42104 76226 -107773 107564 -93330 -353367
17743 -353367 50855 -346137 -33332 -305318 18228 -62749 -28169 -30023 -162549 154841 103411
17732 103411 -151118 174097 88488 -85356 -221432 258824 -149245 48251 -20481 126491
17721 184233 114718 114743 -68382 -323316 271180 2224 -244815 241773 -112307 28813 -129403
17709 94791 -114607 217338 -277001 316014 55752 137893 98318 -101788 -37707 -261109
17699b61109Q9498f3316B54589F9054p719J10873J3458E8341K01912G7454a21252
17687C3593b93636I2402J86406j32719J25988b98301B03462k1984e5981F9877
17676c55805B05537K2292b01148f9597B88258r8971g6585h080A40969f197k23142
17665b29339n7834J07563D2256K41736a18814A54625h7397B38962a5336A13612
17654B19332A8922N08985c13042C8410c15279D53800b50848A45954e8399r3892
17644a52291f4730A31494d0462A00707a26666M1998I8544m3917a74616l9899A4300
17632C55446c23760a03071g055j25985o1930O3486G3449l3657J17264j6624m8797
17621I1635a24417N2382A93498n150A7801J19229F3219J6699J87819A18485n3805
$$ plain form
17699 -261109 -171611 -63316 254589 69054 61335 172208 185666 58341 260253 77454 -121252
17687 33593 -293636 92402 278808 146089 272077 -298301 203462 181478 -55981 69877
17676 -355805 205537 227829 -201148 -69597 288258 189287 -76585 -8080 140969 -6197 -229339
17665 -229339 -287173 -179610 42256 283992 -118814 154625 -87397 238962 -15336 113612
17654 219332 18922 527907 -313042 38410 -315279 453800 -250848 145954 -58399 -152291
17644 -152291 -64730 131494 -40462 100707 -126666 -84668 98544 54627 -174616 -214515 14300
17632 355446 -323760 -103071 -7055 -133040 -194970 -131484 73449 39792 157056 140432 91635
17621 91635 -124417 -72035 193498 188348 17801 137030 63219 79918 267737 118485 64680
17610F4680A4908a17354A18053b92354B73230j8099d01840J50872A13645c32676
17599f3977B80659m5223H031a03369C3953M6194b5639A62474b09353J7640C98784
17587A39297Q6348f2745A8651b8900j65477A46634E0956a96984b003B27513R7446
17576C24959e5853A83154j2421n5902N4937C7489K22300p0938H8021i8696A68790
17564A07287a09757l569E4314g4209q1435C82604j55355a24681d0796B00652c46711
17552a60553B54392K01795I7011L0844J29951E7811i5328c4007C00080D615L13913
17541C18528a35267C2782N1023c0661B38360J92519e842B7635A1164N04817g6366
17529B34868a71536A30244n5681J72378g1919A33483k4421J69365h6355G5599
$$ plain form
17610 64680 14908 -117354 118053 -292354 273230 255131 -401840 -250968 113645 -332676
17599 -63977 280659 235436 8031 -103369 33953 80147 -25639 162474 -209353 -191713 398784
17587 139297 225645 -62745 18651 -28900 -194377 146634 50956 -196984 -2003 227513 324959
17576 324959 -55853 183154 170733 114831 169768 37489 259789 188851 88021 -98696 168790
17564 107287 -109757 -113326 54314 -74209 -155644 382604 227249 -124681 -40796 200652 -346711
17552 -160553 254392 456187 97011 127855 257806 57811 -95328 -34007 300080 4615 318528
17541 318528 -135267 32782 83805 -30661 238360 430879 -5842 27635 11164 515981 -76366
17529 234868 -171536 130244 74563 246941 -71919 133483 109062 278427 -86355 75599
17518D4153J05729a14010d1423B6982f858B35232l8873K5362J12258j12528a10156
17506b81196h7343A01346O1661K34995j40981j2841o1802M63468D3982J46217
17496A90199a26232k54846b1173B36988d9083B12352h2544a6771j04359j49936
17486b71066A36540a70673k43702G4601K20756d22415d8966A93083F4051K31970
17476B96021j417A30111O5386d5789B41463Q693A8947K93430H4772k6189K30638
17465B89221A28471L62473k05346B8238I472K85657j3402b23306A86538a12324
17454B85636L6216M2388l8974O6805K6550n7613C2447M25333m5714j91795e5601
17442B67713k3561H7919b05182B5526J62381f0274B41207j09261c15952C39434
$$ plain form
17518 44153 149882 -114010 -41423 26982 -6858 235232 196359 221721 333979 221451 -110156
17506 -281196 -87343 101346 163007 398002 257021 244180 182378 645846 43982 190199
17496 190199 -126232 -381078 -21173 236988 -49083 212352 -82544 -16771 -121130 -271066
17486 -271066 136540 -170673 -414375 74601 295357 -422415 -48966 193083 64051 296021
17476 296021 294604 130111 195497 -45789 241463 250156 18947 312377 84772 58583 289221
17465 289221 128471 490944 285598 28238 9472 295129 281727 -223306 186538 -112324
17454 285636 321852 364240 325266 392071 418621 361008 32447 457780 412066 220271 -55601
17442 267713 244152 87919 -205182 25526 187907 -60274 241207 131946 -315952 339434
17431A12523L69155k0276A77704M68449B42687E5929h3593A11394K01027H9713
17420B25011k9525K08134j77541a41608B25272r0091M3675J00113l846j2887o144
17409B56092R707n2737r1981k2706K05547I9490N3508P2711a03866A58034g4629
17397A18895h640I4597L01518j09392l4770J10067q899A10297Q1253l6584K44117
17386C99083b96196B31564B112e0740C3289L29134e5963k30556b2513m7606E82766
17374c35864D59036k06355M0734a07736A46949c7435A84839J46526j51758A7930
17363B16325J00374B2830J5165K00555m8914c2938C88308A20042L25k1290b55039
17351D13670A82450J51402j57822j786J83590A1940a4217B79641G0102N8073A75
$$ plain form
17431 112523 481678 461402 177704 646153 242687 55929 -83593 111394 312421 89713
17420 225011 195486 403620 226079 -141608 225272 135181 178856 278969 275123 262236 256092
17409 256092 265799 213062 121081 98375 303922 99490 152998 225709 -103866 158034 -74629
17397 118895 -8640 94597 396115 286723 251953 362020 353121 110297 191550 154966 399083
17386 399083 -296196 231564 2112 -50740 33289 362423 -55963 -286519 -22513 -70119 582766
17374 -335864 459036 252681 293415 -107736 146949 -37435 184839 331365 179607 17930
17363 216325 316699 22830 37995 238550 189636 -32938 388308 120042 120367 99077 -255039
17351 413670 182450 333852 176030 174244 357834 11940 -14217 279641 70102 128175 175
17339I6041L14873j82514B8854a82192g870o8291j03178C92428i4501L6736P01
17328e7064B19898r5733J40827o8758P5596A370J80460i8528C32098l0363G0659
17316H0923J56385N4676j6056c24770E28487g2922A72578J74422A61515O6262
17306B27777b37348A24183R6080r7970C0760K33984J02495m6901p6202g6818A67993
17294B33516q5953l5714L55050a20241B05851q032R2706K8916j31176I3426O2906
17283A56332n2752J06038K73642A66414D9389c701j03456A87863m3367P8879l0811
17272A92564J1854J88424g5345A28854P3188L64449H8661J48459J66008g3136
17261C15723Q3410A97823a27385A092K03777j136q8145K35650j2633J7250A35508
$$ plain form
17339 96041 410914 228400 28854 -182192 -7870 -76161 -179339 392428 -94501 -57765 -57064
17328 -57064 219898 124165 264992 196234 271830 1370 181830 -98528 332098 301735 70659
17316 80923 237308 291984 275928 -324770 528487 -72922 172578 347000 161515 227777
17306 227777 -237348 124183 220263 122293 30760 264744 367239 320338 244136 -76818 167993
17294 233516 147563 111849 466899 -120241 205851 197819 290525 319441 188265 93426 156332
17283 156332 103580 209618 483260 166414 49389 -3701 -107157 187863 144496 223375 192564
17272 192564 204418 392842 -75345 128854 202042 566491 88661 237120 403128 -73136
17261 315723 399133 197823 -127385 1092 204869 203733 115588 351238 338605 355855 135508
17249C61415a73755g7905C76636J37690k31033R0045A60454l5218C9024O4649
17239A03673M6902M6218P3981d5733A18332J8180F0686J76955m0714o165J135
17228A91897k7106L25524C1440K08609j03880L82316A21867p787b05716i5252
17217D79166A17341J80237C8810N64772B46478Q0161j34705J63288j05490r6280
17207A53452J95364a01024G9208L35154A68497L61938j24446j50275K39643A15545
17196B16658K31974j76546J31784H1191K74814p6273K1461N3302J06955A73828
17185A97278O0285J13156j37033p3777k79M32053j51029J10529p386B07708M2164
17174B49872j8600j142B1306L23439p1061L3891M8197R7554G1735b17236C35180
$$ plain form
17249 361415 -173755 -77905 376636 514326 283293 373338 160454 125236 39024 103673
17239 103673 150575 196793 270774 -45733 118332 136512 60686 237641 196927 190762 191897
17228 191897 164791 490315 31440 240049 136169 518485 121867 114080 -205716 -95252
17217 479166 117341 297578 38810 603582 246478 326639 191934 355222 249732 153452
17207 153452 348816 -101024 79208 414362 168497 530435 405989 255714 495357 115545
17196 216658 448632 272086 403870 81191 356005 279732 301193 354495 461450 173828
17185 197278 257563 370719 233686 159909 159630 591683 440654 551183 543797 207708 249872
17174 249872 231272 230130 21306 344745 273684 307575 355772 453326 71735 -217236 335180
17162E15806L17B20598J53966A66683R8646J16289K7144J13164A57073R7815O7148
17151C22036j34828o6149L5253K91618A22395L00775I7174J2503L44435A79064
17140F29229B21961K73303A17949L77743j62579G3944J71175P1338q381m9928
17130B58148L6978n4277q8370L68801m0031j61476O0847j89295J87617K24285
17120F03227k81548J95724m114l0325L46816C66474N5752J10119r6065A79741
17109C14676R2384j01767o1231J52823N505J19861l2542K46142C28803M6874j47032
17098B28645N78951C15203k0033L1906J22750J7327O224C6189J94323A01843L94767
17087D96610B29851J12705K53433B26219L39891J19335l15407m5725R5231c7642
$$ plain form
17162 515806 516123 220598 374564 166683 265329 381618 408762 521926 157073 254888 322036
17151 322036 187208 121059 156312 447930 122395 423170 97174 109677 454112 179064
17140 629229 221961 495264 117949 495692 333113 73944 245119 316457 308076 258148
17130 258148 295126 240849 152479 521280 481249 319773 380620 191325 378942 603227
17120 603227 321679 517403 513289 482964 829780 366474 422226 532345 436280 179741
17109 314676 407060 305293 244062 396885 402390 522251 489709 735851 328803 375677 228645
17098 228645 807596 315203 295170 327076 449826 467153 473377 36189 230512 101843 496610
17087 496610 229851 342556 595989 226219 566110 685445 370038 324313 419544 -37642
17076B45044N485J38400K92488j58706k39861R0550J63547k50463M27003J6889
17066G30376C04435K3862o6526K08393J57102k71652k0951M76117A16813N17998
17056F34811o0614J74508B98143L27190M5517j23140j70433K44404K30306l56088
17046D95899B43098M70504m4710K3948P2911k10420M19209C55816J10734J58420
17036F24970J09934j24489Q0723Q5679m7331N7747B28816J83664L39158r0638
17026F61000j99253K04485j39195L15002k12432J019j75051K6136L12912k82058
17016E12565p8371K76336l37371M81555P593j47891k67941M32136l52940J81952
17006G07623R5724K41441l86513j16127L39957j50468K80475j23365n3653J3871
$$ plain form
17076 245044 250529 388929 681417 522711 282850 373400 536947 286484 713487 730376
17066 730376 304435 328297 261771 470164 627266 355614 334663 810780 116813 634811
17056 634811 574197 748705 298143 625333 670850 547710 377277 621681 851987 495899
17046 495899 243098 713602 668892 692840 765751 555331 974540 355816 466550 624970
17036 624970 734904 610415 691138 776817 729486 787233 228816 412480 751638 661000
17026 661000 461747 666232 527037 842039 629607 630626 455575 481711 794623 512565
17016 512565 434194 710530 373159 854714 862307 714416 446475 878611 525671 707623
17006 707623 803347 1044788 658275 542148 882105 731637 1012112 888747 835094 848965
16996H48965l90579R3876R0141P2339J73630j7111K44966q6229j006k76425K90989
16985A043556m69579K8247M82019j43345k30401L90307l3092N524j77908Q7515
16975I82843J4544j11080k48314J28963L31505o9478k46514l66872O18085J3368
16965A047050k96058K69111Q4844K0767j48295k14718K25159l07858L37457j58838
16955H58621M16213J01257k26782k80128N86646l29741J3415R7731Q1935j19680
16945A199487O9314l18919J96829p1736J78075m5089j52843L15705n4304R9518
16935A416037j84370M19808k70983l3708j2144N9206j08725j61494L90242k8429
16925A485440J79268m05401J25720J58606M6973r299J92104l1379j74304k54057
$$ plain form
16996 848965 458386 552262 642403 714742 888372 871261 1116227 1029998 1028992 752567 1043556
16985 1043556 573977 602224 1084243 940898 710497 1100804 1067712 1073236 895328 982843
16975 982843 997387 886307 637993 766956 1098461 1028983 782469 415597 1033682 1047050
16965 1047050 750992 1020103 1104947 1125714 977419 762701 987860 680002 1017459 858621
16955 858621 1274834 1376091 1149309 869181 1455827 1126086 1139501 1237232 1319167 1199487
16945 1199487 1268801 949882 1146711 1074975 1253050 1207961 1055118 1370823 1316519 1416037
16935 1416037 1231667 1651475 1380492 1346784 1334640 1393846 1285121 1123627 1513869 1485440
16925 1485440 1664708 1259307 1385027 1543633 1590606 1581307 1773411 1742032 1567728 1313671
16915A313671K99151J98146j15963p592r383J36835k55269K57820j42565K12199
16905A887050j66260j27806j35048K2410L1504L26651J04448j58016k88972L57846
16895A853807L32572m03871N59963n3720n34976L43691m7323J90041J0516q2633
16885B168067k27822J24333l1752L59548k92940n0813N2688L67407k4236J5558
16875B460038k25164J05814K69854K4301r7719O773L29075Q1111m1517l19383
16865B593183M77513k77457J58922l3320J17508J24773l20421M45314k19299K67927
16855C334643k47852K91357l03148L36058K26230K42435l71727J5629J49206k06833
16845C465998M42524K53116l90419J77020J67443J15126m7514K55469m26278N73992
$$ plain form
16915 1313671 1612822 1810968 1695005 1687413 1678030 1814865 1559596 1817416 1674851 1887050
16905 1887050 1720790 1592984 1457936 1480346 1511850 1838501 1942949 1784933 1495961 1853807
16895 1853807 2186379 1782508 2342471 2288751 1753775 2097466 2050143 2240184 2250700 2168067
16885 2168067 1940245 2064578 2032826 2392374 2099434 2048621 2101309 2468716 2444480 2460038
16875 2460038 2234874 2340688 2610542 2634843 2537124 2543897 2872972 2954083 2912566 2593183
16865 2593183 3070696 2793239 2952161 2918841 3036349 3161122 2840701 3286015 3066716 3334643
16855 3334643 3086791 3378148 3075000 3411058 3637288 3879723 3507996 3523625 3672831 3465998
16845 3465998 3908522 4161638 3771219 3948239 4115682 4230808 4183294 4438763 4012485 4586477
16835D586477l72697P3035J35601N17236J68360l33971J12006K93573q8380m2180
16825E049060Q3520K82142j69139L59828j47499j04553O94877k45715m51P5098
16815E877168N28108L01870j4923R7832R9145K66729L27421j51483K77135Q5767
16805G694769j31820L03957M49382j27776K09278M00648N1066K1924M22807K44905
16795I539140K88003K93398J77824K1866M31090M90234L47992J50135J89923J94510
16785A2124115L18661Q21142K92873K48668O34667K10547N70768L56944O66256
16776A6244641K24943O88854M95124N82223N76455N48768P88738L33070J437990
16767B1920806J57788J051496R71989J028190R10214Q20008P54142J253698J741992
$$ plain form
16835 4586477 4213780 4286815 4422416 4939652 5108012 4774041 4886047 5179620 5091240 5049060
16825 5049060 5132580 5414722 5245583 5605411 5457912 5353359 6048236 5802521 5802070 5877168
16815 5877168 6405276 6707146 6692223 6790055 6889200 7155929 7483350 7331867 7609002 7694769
16805 7694769 7562949 7866906 8316288 8188512 8397790 8798438 8849504 8871428 9294235 9539140
16795 9539140 9827143 10120541 10298365 10320231 10751321 11241555 11589547 11739682 11929605 12124115
16785 12124115 12442776 13263918 13556791 13805459 14440126 14650673 15221441 15578385 16244641
16776 16244641 16469584 17158438 17653562 18235785 18812240 19361008 20149746 20482816 21920806
16767 21920806 22078594 23130090 24102079 25130269 26040483 26860491 27614633 28868331 30610323
16758C0610323O37322K006805J087045J237981J704741J854924J652434J987149
16750D2778724K167300K112332K454409K574690K904759K577772L117117L420353
16742F4107456L607984L708971L901405M440106M670082N056666N307426N390314
16734A00190410O072935O779310O621599P147378P092012P653740Q048699Q281325
16726A57887408P701756P491925P757993O698338O306478N028390L933215L081522
16718B05887025J651464K62646j367558l006636l416863n008341o080241o709074
16710A82212422p516331p979078p868797q567969q044322q106038p589470p488995
16702A19051422p050023o788104o293895n961297n454719m897587n010245m536952
$$ plain form
16758 30610323 31247645 33254450 34341495 35579476 37284217 39139141 40791575 42778724
16750 42778724 44946024 47058356 49512765 52087455 54992214 57569986 60687103 64107456
16742 64107456 67715440 71424411 75325816 79765922 84436004 89492670 94800096 100190410
16734 100190410 106263345 113042655 119664254 126811632 133903644 141557384 149606083 157887408
16726 157887408 165589164 173081089 180839082 187537420 193843898 198872288 202805503 205887025
16718 205887025 207538489 207801135 206433577 203426941 200010078 195001737 188921496 182212422
16710 182212422 174696091 166717013 158848216 150280247 142235925 134129887 126540417 119051422
16702 119051422 112001399 105213295 98919400 92958103 87503384 82605797 77595552 73058600
16694G3058600m091605l982029l639025l396127l193186l052832k303951k532205
16686D6867640k631647k196106k120443j737047j905728j399668j854207j345870
16678C1676924j377282j347984j113606j074574j296613j019097j062214q32714
16670B2552840q71624p88114q57275p28020o89535l48950q86382o14072o16196
16661A6152672o10434m10889l79231p18711k93241l36597m67057k79106n28813
16652A2128593m82713j02120l18085k63971o39082O1000n83476j88007l83272
16643I228867N9185n16224K1718n33958N9045n36179Q6892k57487R4817m86815
16633G219861m6750l84764K9765j31089m62370L67971k33601o1220l46663j74756
$$ plain form
16694 73058600 68966995 64984966 61345941 57949814 54756628 51703796 49399845 46867640
16686 46867640 44235993 42039887 39919444 38182397 36276669 34877001 33022794 31676924
16678 31676924 30299642 28951658 27838052 26763478 25466865 24447768 23385554 22552840
16670 22552840 21681216 20893102 20035827 19307807 18618272 18269322 17382940 16768868 16152672
16661 16152672 15542238 15131349 14752118 14033407 13740166 13403569 12936512 12657406 12128593
16652 12128593 11645880 11543760 11225675 10961704 10322622 10383622 9800146 9612139 9228867
16643 9228867 9288052 8771828 8793546 8259588 8318633 7782454 7869346 7611859 7706676 7219861
16633 7219861 7173111 6788347 6818112 6687023 6224653 6592624 6359023 6297803 5951140 5776384
16623E776384r8420K38844l17773m75730n4646K13617j42094l57950j08065J45685
16613D819852R7179j71564j30080o0959m36479J98654n0739m15134Q823J99147
16603D058700m72953J25740k10689J83261j54137L4622j12474l1120m7190K41155
16593C614915R9761m68115j95277J03095J09599j28135k70801p5738p2935K51922
16583B968291m17955p2434L07128k90472m08636N96977j98223n9464J96765l31628
16573B290349l97303L91495o6703o0283K52061k04635K2680q7137O9197l53356
16563A856365Q2858K29159k24704N10091m84945j67151O7513n8731L33286k61430
16553A882311j45822K88771j75966j46851k23879J43382J04189M6035j72455n12921
$$ plain form
16623 5776384 5677964 5916808 5599035 5123305 5068659 5282276 5140182 4782232 4674167 4819852
16613 4819852 4917031 4745467 4615387 4554428 4117949 4316603 4265864 3850730 3859553 4058700
16603 4058700 3585747 3711487 3500798 3684059 3529922 3564544 3452070 3420950 3373760 3614915
16593 3614915 3714676 3246561 3051284 3154379 3263978 3135843 2865042 2789304 2716369 2968291
16583 2968291 2550336 2477902 2785030 2494558 2085922 2682899 2484676 2425212 2621977 2290349
16573 2290349 1893046 2284541 2217838 2157555 2409616 2204981 2227661 2140524 2209721 1856365
16563 1856365 1939223 2168382 1943678 2453769 1968824 1801673 1869186 1810455 2143741 1882311
16553 1882311 1736489 2025260 1849294 1702443 1478564 1621946 1726135 1772170 1599715 1086794
16543A086794N30062k57180O2240j40965N80001l94825p9240J07128J44967l17794
16533A321188J21482P3651m45088P13542l87173p0693j11158P8575k08732J4583
16523A100177J56218k34341o7425L84277k47733K56197N6045m00702j63683M31147
16513A270177o7889j72451J30270j61684L39205l79734J40698Q2510k03663M25709
16503A403148k08491J12200l70087J42654K50830F45460R8277K27929J25873j37917
16493I59622J06575j74548j1942O4987l42253L57077o2966j28999r6359K30431
16483I01625j26450k42438L79498k51606J93676m9628r1913k36577P9984P0963
16473F27134K8807l07747M44875J59861l33784K82638j98389j88686R2395k7704
$$ plain form
16543 1086794 1616856 1359676 1421916 1280951 1860952 1466127 1386887 1494015 1638982 1321188
16533 1321188 1442670 1516321 1071233 1784775 1397602 1326909 1215751 1294326 1085594 1100177
16523 1100177 1256395 1022054 954629 1338906 1091173 1347370 1403415 1002713 839030 1270177
16513 1270177 1202288 1029837 1160107 998423 1337628 957894 1098592 1181102 977439 1403148
16503 1403148 1194657 1306857 936770 1079424 1330254 645460 743737 971666 1097539 959622
16493 959622 1066197 891649 879707 944694 602441 959518 896552 767553 671194 901625
16483 901625 775175 532737 912235 660629 854305 804677 712764 476187 556171 627134
16473 627134 655941 348194 793069 952930 619146 901784 703395 514709 607104 579400
16463E79400m2203m7104M33627l16008j20992L42145l76899J75060k5779K83165
16453H84412l23439L3282B65917M21397I3451K67262J29833M530L11467C63457
16442D02632L23168j48908p4333Q2370B40654J9486n7371L02339o0395K01626
16432F46339m8919k26229K74136l9566q771k71868J25769P885K83868j47887A86587
16420F59037J02194j47676j74424K07683j70704k5021B22216M87894k15539B44951
16409C77886K16275J68509j40277O0897j43045C1900N14035p4122K02936C33923
16398A17283N33285j44266k7890K146J2985n2359A65611K04406J78408j17889
16388D30536Q0163N7652k46241L21138j03138B32423J93014j65799K18304K05667
$$ plain form
16463 579400 537197 490093 923720 607712 486720 828865 451966 627026 601247 884412
16453 884412 560973 594255 265917 687314 93451 360713 490546 495076 806543 363457
16442 402632 725800 576892 502559 584929 240654 260140 202769 505108 444713 646339
16432 646339 597420 371191 645327 605761 596990 325122 450891 458776 742644 594757 186587
16420 659037 761231 613555 439131 646814 476110 451089 222216 710110 494571 244951
16409 377886 594161 762670 622393 683290 540245 31900 545935 471813 674749 333923
16398 117283 650568 506302 478412 480558 493543 441184 165611 370017 548425 430536
16388 430536 510699 568351 322110 643248 540110 232423 425437 259638 477942 683609
16378F83609r8254k89342j27197K51479j08967J89367j16015K49167C11224A54388
16367d9046D16484G3443J1051c6185C70536A3565R7087E05M95307N4187j28308
16356D21691j35534A34891L73144Q0713k33668P0473E0764J24753l1464l8781
16346A05272J17153l014J55749P0140o3835A49184J77064J19807D495K43325D5953
16334b32832A96035q7472K05456J06308j33321J01116H5076L35334j86615G1860
16323B16714J63206h9720I6762L39519A69586O5370F0005j2455J08471b05974
16312G6134O6542J98860J41455A64449n8464B858K45309A10627b58942B60398
16301C12081N3603A27398J24375J1754j02411P0503B7050j3172M2035J2525J15620
$$ plain form
16378 683609 585355 296013 168816 420295 311328 500695 384680 633847 311224 154388
16367 -49046 416484 73443 84494 -36185 370536 13565 110652 505 495812 549999 421691
16356 421691 286157 134891 508035 588748 355080 425553 50764 175517 144053 105272
16346 105272 222425 219411 375160 445300 381465 149184 326248 446055 4495 247820 45953
16334 -232832 196035 108563 314019 420327 287006 388122 85076 420410 233795 71860
16323 216714 379920 -89720 96762 436281 169586 234956 60005 47550 156021 -205974
16312 76134 142676 341536 482991 164449 105985 2858 248167 110627 -258942 260398
16301 312081 365684 127398 251773 263527 161116 231619 27050 13878 55913 68438 184058
16290A84058a37231B95768K3079I0174K37804j07703b06833B70568a29487A98417
16279A63025n8272N04935a34403M8917A54385J85307j64610H3550K42922o6437
16269B60035a1906A9872J34565l6287l6851K88152A23166J25248n7691a19357
16258a87226f2144C8532K63696I9207g0593B11016a90210A47771J89526p2595
16248B64702o5745K0594j03076J74046a98017A63687b32197Q5276M9417G3998
16237A67663p8329O605K64111A06553l2196K79876c38713R8400A43858k2731b854
16225H3033J10496C3025c1564B09153J78991A00601P9940d5924E9916R0736o848
16214A43804B1838g3438B06159a04659M8387A53014J97362h4144E4360L29933
$$ plain form
16290 184058 -137231 295768 318847 90174 327978 220275 -206833 270568 -129487 198417
16279 163025 104753 609688 -134403 -85486 154385 339692 175082 83550 326472 260035
16269 260035 -11906 19872 154437 118150 81299 369451 123166 248414 190723 -119357
16258 -187226 -62144 38532 302228 99207 -70593 211016 -190210 147771 337297 264702
16248 264702 198957 219551 116475 290521 -198017 163687 -232197 -146921 -97504 73998
16237 167663 89334 95939 360050 106553 74357 354233 -338713 -240313 143858 121127 -2854
16225 83033 193529 33025 -31564 209153 388144 100601 180541 -45924 59916 150652 143804
16214 143804 21838 -73438 206159 -104659 -56272 153014 350376 -84144 54360 384293
16204C84293A0868c54115J50084B06097D0114a84571M7744I5298C9699J7378K34342
16193B91419p8492J8307b43265E3668J05973n9552N386l7881i5535A01370L29409
16182D30779A74885J54928f366j08898A34252b6325G0156J16326E4206a62538
16171i8404q5396o5853B86940b0164E963a4761q2507A0794K35256P2879j35719
16160A83210a22629A8194a28692P706B48330G5728A822J59236i3174A8413d3396
16148A68421K4130m1170k7816B8397L15543b04462F2101K4339a48059r3009A03640
16136H9560J16907J75689a1511B06138A01839c54113C8898J07503m9209K02516
16126B99708j35176A0715J25634K409b8461j91952B10778L6317c6331H9512k0143
$$ plain form
16204 384293 10868 -354115 -204031 206097 40114 -184571 -136827 95298 39699 57077 291419
16193 291419 212927 231234 -243265 53668 159641 100089 105475 67594 -95535 101370 430779
16182 430779 174885 329813 -6366 -115264 134252 -26325 70156 186482 54206 -162538
16171 -98404 -183800 -249653 286940 -20164 5963 -14761 -97268 10794 246050 318929 183210
16160 183210 -122629 18194 -128692 -120986 248330 75728 1822 161058 -93174 18413 -43396
16148 168421 192551 151381 123565 28397 343940 -204462 62101 86440 -148059 -241068 103640
16136 89560 206467 382156 -11511 206138 101839 -354113 38898 146401 97192 299708
16126 299708 164532 10715 136349 138758 -28461 -220413 210778 247095 -36331 89512 69369
16115F9369b02969N3465h992A32377J91905a53488h888A38380D2815a28238j31141
16104b59379B09644c5145C65983H4453C0310J21687K5992a00779B11095a11313
16093c01539C08427b83209H4366b00157g2203A89502n5774b62257J06126j7275
16083a73406A43938Q0640I1831D1519Q6525l5380a5803l40019G2714Q1904F0276
16071b71512C07971b5567p4490m08569e6139l14346A56527D763J69962E4495P4056
16060A28551a31315A847f7455B5994Q0313b08635a248k09539m9506f064k75593
16049b81657J38040j3680q9043L2264A62423e3624k62681C51721b71258k1706
16039b92964P7496B31751p75c22141J30956P7737r2738C66323B5674c84728R4007
$$ plain form
16115 69369 -202969 -149504 -8992 132377 324282 -153488 -8888 138380 42815 -128238 -259379
16104 -259379 209644 -35145 365983 84453 30310 151997 177989 -100779 211095 -111313
16093 -301539 308427 -283209 84366 -200157 -72203 189502 133728 -262257 -156131 -173406
16083 -173406 143938 224578 91831 41519 128044 92664 -15803 -355822 72714 154618 60276
16071 -271512 307971 -25567 -100057 -508626 -56139 -370485 156527 4763 174725 54495 128551
16060 128551 -131315 1847 -67455 25994 106307 -208635 -1248 -210787 -260293 -6064 -281657
16049 -281657 -143617 -157297 -246340 -214076 162423 -53624 -316305 351721 -271258 -292964
16039 -292964 -215468 231751 230976 -322141 -191185 -113448 -206186 366323 25674 -384728 -290721
16028b90721A74340b36215a11190H1164a2856B4981q790f1635C72948a22932M9994
16017g2938j24278l850b7839j79002A64951n6352K7668O1137g7264C3509c2533
16005b51648P194J2825A80399E3797c7897A23346g3779B74401b05151f9189j87204
15994b56393b5298j006l08662C3923K71685d9075B4596h8439C34673C4774P1971
15983A06745J43135k4725Q9131A10561N18750f8798E5267J10829a99378P4820
15973a24558B68152q4965b04483C761a59516Q207N5180L4106k61178b5098M43
15962b4655n3955j69149A85933F9306M1319J19321a26228B2182a46732j01794
15952b48526l6558h310k95627A74444i7888H3383b90957b2461F198a22222N4244
$$ plain form
16028 -290721 174340 -236215 -111190 81164 -12856 24981 16191 -61635 372948 -122932 -72938
16017 -72938 -197216 -201066 -27839 -206841 164951 108599 136267 197404 -77264 33509 -32533
16005 -251648 -244454 -231629 180399 53797 -37897 123346 -73779 274401 -205151 -69189 -256393
15994 -256393 -25298 -26304 -334966 33923 305608 -49075 24596 -88439 334673 34774 106745
15983 106745 249880 225155 314286 110561 629311 -68798 55267 166096 -199378 -124558
15973 -124558 268152 183187 -204483 3761 -159516 -151309 -96129 -62023 -323201 -25098 -24655
15962 -24655 -78610 -247759 185933 69306 110625 229946 -126228 22182 -146732 -248526
15952 -248526 -285084 -8310 -303937 174444 -97888 83383 -290957 -22461 6198 -122222 -67978
15941f7978k66810B1879a56446h818k77912g2167G7326e9641B79697d7935J080
15930d6855j5105j88573a03933L6881l41576c6463A05875f2165j41244H1827B1368
15918B36776A03324i2681C169b17860L1232p0309d8892j40003a9788A37656b69892
15906c64762A64070C5639b73808B09029E8332I39P7066a88032k13960B35690H0273
15894a50864d8584r6703D4327L0684f5616j15059N207a5310b529j29383D54803
15882F5961b54570F1998f1313C57572a31552E9728c42255O5863g0112E6950A4005
15870i2743D7991a73986m8089I7602J82519a37066L2735j09704M4586H1786c7805
15858a6157g393A6272e0232k169k01180P3564j04207J04148O5684A72109L8560
$$ plain form
15941 -67978 -334788 21879 -156446 -8818 -286730 -72167 77326 -59641 279697 -47935 -46855
15930 -46855 -61960 -250533 -103933 -67052 -408628 -36463 105875 -62165 -203409 81827 21368
15918 236776 103324 -92681 3169 -217860 -186628 -256937 -48892 -188895 -19788 137656 -269892
15906 -364762 164070 35639 -273808 209029 58332 939 78005 -188032 -401992 235690 80273
15894 -150864 -48584 -145287 44327 75011 -65616 -180675 -175468 -15310 -2529 -131912 454803
15882 65961 -254570 61998 -61313 357572 -131552 59728 -342255 -276392 -70112 56950 14005
15870 -92743 47991 -173986 -222075 97602 280121 -137066 -104331 -214035 -169449 81786 -37805
15858 -16157 -7393 16272 -50232 -52401 -253581 -180017 -284224 -180076 -114392 172109 210669
15847B10669J9482A4844h6550c0303j03853N5912C35535a49201c8739C73578g185
15835A04161b78747B44229e4839D7934a77029L4044H9832e02201A40085a98153
15824d3492C7641a58256e1819R27l09010J39565A11248i3385j46238f6294H9850
15812b45271B8911e4429p673l52513A35973c40659J52917M5496A37749b68847
15801b26860A7571i6728A19491j4116k682d3488k43380A16337g6058k4500q7675
15790a88233f3017j773l31574e152j76661C00484a92106H4971g96A90692f5004
15778B49279b01671j52553a05464A24382g1262m4520B3811a45979k0292K9832
15768a36439B1045P7047i8434A79306E995L17724D3943e6861K7819A15152a14891
$$ plain form
15847 210669 230151 14844 -86550 -30303 -134156 -78244 335535 -149201 -38739 373578 -7185
15835 104161 -278747 244229 -54839 47934 -177029 -142985 89832 -502201 140085 -198153
15824 -43492 37641 -158256 -51819 -50892 -359902 -220337 111248 -93385 -239623 -66294 89850
15812 -245271 28911 -54429 -62102 -414615 135973 -340659 -187742 -142246 137749 -268847
15801 -226860 17571 -96728 119491 105375 102693 -43488 -286868 116337 -76058 -100558 -188233
15790 -188233 -63017 -64790 -396364 -5152 -181813 300484 -192106 84971 -796 190692 -65004
15778 249279 -201671 -354224 -105464 124382 -71262 -115782 23811 -145979 -166271 -136439
15768 -136439 21045 98092 -98434 179306 5995 323719 43943 -56861 -29042 115152 -114891
15756b87266A90511J96429c11631A84868b51446A35534a67807G7651d6202q9393
15746a35595L7982J7264C5552c45314i5468A37352k0359a83285B1525g6207C6384
15734A46958a83828b064r531o5105k56900j9701Q4992j8242i2079M0853B3485
15722A1021a06038j51818C98195c06704h1854B2394e65407K13346e7246G8611
15711A2148b50023E5118a1632A78159M1299c01952h8782m3486N8110k77976L8300
15700c13834D8158b14629B9867a0826l28441e1884B1012P167e6630A46392B98
15688B12218R0937a8842B34494D1073d9504j84635E5578K32676a23180A86848
15677d0865j50266B68779A9817a29529r6805B51481A6777K07976o7850J08872
$$ plain form
15756 -287266 190511 386940 -311631 184868 -251446 135534 -167807 77651 -46202 -135595
15746 -135595 -97613 -80349 35552 -345314 -95468 137352 116993 -183285 21525 -76207 36384
15734 146958 -183828 -2064 -11595 -76700 -333600 -353301 -268309 -286551 -92079 -51226 23485
15722 11021 -106038 -257856 398195 -306704 -81854 22394 -565407 -352061 -57246 78611
15711 12148 -250023 55118 -11632 178159 219458 -301952 -88782 -132268 -74158 -352134 -313834
15700 -313834 48158 -214629 29867 -10826 -339267 -51884 21012 28179 -56630 146392 298
15688 212218 303155 -18842 234494 41073 -49504 -234139 55578 288254 -123180 186848
15677 -40865 -191131 268779 19817 -129529 -226334 251481 16777 224753 156903 265775
15667B65775C635b08900m51420a08175e2663j42879O6018j29533A11759P4698
15657A86457i6052D00464b36811A05432b10989f2105C6788O3190b56599c8389
15646d83419a95108j6329B70314j7767K08109f1341A8135J65492J32429E1750
15635i3332k56262A9756b93727N7529d6049k00816R4616B3626a51315A02809G946
15623b49858g909C19156b51136b62A75136o1202b989j8229r5081F2266e665j44902
15611a50567E1473a50314L6365d6475A63867R6491a0530E389h3976F1238K75511
15600C36749J3116A41100o1475a68570L6380L7163p736A0340P638b28354D0193
15588a40177a2367k1360C58541r9171a26987B47671G1674A6228b3277j3327q781
$$ plain form
15667 265775 3635 -208900 -660320 -108175 -52663 -195542 -129524 -259057 111759 186457
15657 186457 -96052 400464 -236811 105432 -210989 -62105 36788 99978 -256599 -38389
15646 -483419 -195108 -211437 270314 252547 460656 -61341 18135 183627 316056 51750
15635 -93332 -349594 19756 -293727 -236198 -46049 -246865 -152249 23626 -151315 102809 7946
15623 -249858 -7909 319156 -251136 -262 175136 113934 -2989 -21218 -116299 62266 -5665 -150567
15611 -150567 51473 -150314 -113949 -46475 163867 260358 -10530 5389 -83976 61238 336749
15600 336749 349865 141100 79625 -168570 -132190 -95027 -102763 10340 17978 -228354 40193
15588 -140177 -12367 -33727 358541 259370 -126987 247671 71674 16228 -23277 -36604 -45385
15577d5385n2655L3548i949B14491a19145L9724B16072b05788O0764o1531jB57475
15564c118j87844Q9476A75439K9487J00430a20330j42844A8910L02610q4250a18066
15552I0781h086D8854b6391A28207i079n03072a84171K9778l1262h4203D4292
15540A01234d4933I2474C6195j5628a44158B10733a14648B432P5446n518c09679
15528a15722A19658a6278C59033i1380j64048F8711i9268G415f9305H932b85975
15516A75054n4692a70494B43893F5166b16783O0241c1648A9589R4421g104p2059
15505g9163I9858c09351e4914A68961b34444P0904r7091k03065K13751o1440F6301
15493b93113A51474R8047a91015c4668l7389j15423f5659B08093H272e7065A24808
$$ plain form
15577 -45385 -98040 -64492 -9949 214491 -119145 -79421 216072 -205788 -145024 -206555 -206556 257475
15564 -3118 -190962 -101486 175439 204926 305356 -120330 -263174 18910 321520 237270 -118066
15552 90781 -8086 48854 -26391 128207 -9079 -512151 -184171 -154393 -185655 -84203 44292
15540 101234 -44933 92474 36195 20567 -144158 210733 -114648 2432 77878 72360 -309679
15528 -115722 119658 -16278 359033 -91380 -255428 68711 -99268 7415 -69305 8932 -285975
15516 175054 120362 -170494 243893 65166 -216783 -156542 -31648 19589 114010 -7104 -79163
15505 -79163 99858 -309351 -54914 168961 -234444 -163540 -260631 -463696 -249945 -311385 66301
15493 -293113 151474 249521 -191015 -34668 -72057 -187480 -65659 208093 8272 -57065 124808
15481a59220K8057b9084k7641B14019a21081B26197B0527h0890j62353g8228D08780
15469H1516M1176M0232c87003E14707c1143J0201j7474k93661D8060Q7503J47326
15458B82889j798A28705M2506J92061G2359O339K17907g7532E3051k4076c09052
15446D06442i8337L1488B28117A3505N6968J20039l6253D3128e1763J0417m9122
15435i0468A89901p1100L1896b40625a03028B8796K7631P1175a4541B83036A24771
15423c08626A32159O6801L1759A13635D5258h5925F789L33731f1240R760j25863
15412a77343j6775A16909D3336J11637a20279n5604j67116E7975J52040f2541
15401E0154c03878Q3389A44259a88496b064l4435n77r2354G528J56534b63121
$$ plain form
15481 -159220 -131163 -29084 -56725 214019 -121081 226197 20527 -80890 -243243 -78228 408780
15469 81516 122692 162924 -387003 514707 -31143 -20942 -38416 -332077 48060 135563 282889
15458 282889 281091 128705 171211 363272 72359 78698 296605 -77532 53051 28975 -309052
15446 406442 -98337 -66849 228117 13505 70473 190512 154259 43128 -51763 -41346 -90468
15435 -90468 189901 118801 150697 -240625 -103028 28796 56427 127602 -14541 283036 124771
15423 -308626 132159 198960 230719 113635 45258 -85925 6789 340520 -61240 -51480 -177343
15412 -177343 -194118 116909 43336 154973 -120279 -175883 -342999 57975 210015 -62541
15401 50154 -303878 -220489 144259 -188496 -2064 -36499 -37076 -129430 7528 164062 -263121
15389i7597E6343J06049h7490n7905j19710i5287l5567A4554h4785a3248A40562
15377a10809h969F0925g162A89601H4221c5153j65186F8236A1547K2142Q4687
15366A18376L1585K4821n8495O868m4186J06210c03269I1635a63000C58059r6396
15355B61663F7665c24614i673B49638q7558A5673b7745B5381J14950c1342k35807
15344b67149H6902N6545j7385b51837j7613D42288C0508R1908l2684K18667A16645
15332A25537J4615o3885a09717C19150a3191A82716h6394m6200O5895A63431l1877
15321A31554a78279A90984d7388C5958a48706c9750j6467C5350M02839a13129
15310c6474j1121q6110a1440B02618i3966r1013A69393H1180K71452j57892a72414
$$ plain form
15389 -97597 56343 162392 -87490 -145395 -265105 -95287 -130854 14554 -84785 -13248 140562
15377 -110809 -8969 60925 -7162 189601 84221 -35153 -200339 68236 11547 33689 118376
15366 118376 149961 174782 116287 123155 78969 185179 -303269 91635 -163000 358059 261663
15355 261663 67665 -324614 -9673 249638 162080 15673 -27745 25381 140331 -31342 -267149
15344 -267149 86902 143447 126062 -251837 -269450 442288 30508 122416 89732 308399 116645
15332 125537 140152 76267 -109717 319150 -13191 182716 -86394 -132594 -66699 163431 131554
15321 131554 -178279 190984 -47388 35958 -148706 -39750 -56217 35350 438189 -113129
15310 -36474 -47595 -133705 -11440 202618 -93966 -184979 169393 81180 352632 194740 -172414
15298H5680M5128C5516a76405M610A80740P2317c0861o5500l0285A51060f5474
15286B08564h7056A97288N1848L7552A13560d731o547K151C9896C808J607L4709
15274D0124M8183a03150r9285p2963o5984D4643a45381L6436j45582H8627K0202
15263A08829f8751A76b21101F3048K2599L1484g318C20328A55265O7821K0342
15252B43428Q5820A18625K90918N83929r1747R02572o12279J22947j15903E26847
15241A74324K82813I3766e9341J27B12427H3758i3248H6181a50708A07166c85109
15229a82677H7172h4666A14929m2439f964n0802B71361A13963J19001c06050A30639
15217A15072L12262i6745c0643B86960A00902J02589K49525F4202H746J56658
$$ plain form
15298 85680 130808 35516 -176405 -171795 180740 253057 -30861 -96361 -126646 151060 -65474
15286 208564 -87056 197288 249136 286688 113560 -4731 -11278 -9127 39896 3808 5415 40124
15274 40124 88307 -103150 -202435 -275398 -341382 44643 -145381 -108945 -254527 88627 108829
15263 108829 -68751 176 -221101 63048 85647 117131 -7318 320328 155265 223086 243428
15252 243428 329248 118625 409543 993472 901725 1804297 1192018 1314965 1199062 526847
15241 174324 457137 93766 -59341 -59214 212427 83758 -93248 86181 -150708 107166 -385109
15229 -182677 87172 -84666 114929 72490 -6964 -57766 271361 113963 232964 -306050 130639
15217 115072 427334 -96745 -30643 286960 100902 203491 453016 64202 8746 165404
15207A65404B1858R6026A122K56373G0099J6740b57647F0059Q0283n054h2169
15195A08667l3161e6672E14440B33816a52732j04518a3927D5568K6414J18538
15185A90520G0106N01299c5859B37067n2961p9520a70265j05044B92310j29363
15175A62947J4981Q6901j29123k6940c2851j04813B26512H5519J16074a29259
15164B03508m8188A8707d5911A47589N9280a6452A32864b41139C33990p8790L07635
15153E62835B15664f5683B48590r8965Q7042a49096j21207B69710K6151j46749
15143A49112C2596b05734i4751c4098G3419K6653K46253R7675j74327f47n3102
15132e3749D74509b2514l1187I8255f4170A98299k8591O3475J8651f40A60362
$$ plain form
15207 165404 21858 117884 1122 257495 70099 86839 -257647 60059 140342 135288 -82169
15195 108667 75506 -56672 514440 233816 -152732 -257250 -13927 45568 71982 190520
15185 190520 70106 571405 -35859 237067 184106 104586 -170265 -275309 292310 162947
15175 162947 177928 264829 135706 108766 -32851 -137664 226512 85519 201593 -129259
15164 203508 155320 18707 -45911 147589 206869 -16452 132864 -241139 333990 255200 562835
15153 562835 215664 -65683 248590 149625 236667 -149096 -270303 269710 295861 149112
15143 149112 32596 -205734 -94751 -34098 73419 100072 346325 444000 269673 -647 -53749
15132 -53749 474509 -22514 -53701 98255 -64170 198299 169708 233183 251834 -640 160362
15120B73449D9287c582o6766D75501A73482P3390F8833K43080j14393f6612K012
15109f4600A23267b45985A74527g9617D21769j46208K98172A63956c05545H7652
15098A17001J71636o785A35216m4163b437A78555G9945J25483p4752C1147M3511
15087G4658K29187p6441K762J1557q9541n963K9657H0879N8513J42933a37481
15075a77033D10527J55773A90799E5925L82266j67847N2143L31588E0394L20002
15065C70396C6696K5684J32145K35207k12186b83120H7148K05898c5729B32074
15054C66234k5736A54530a05726B36031F6784A1474J81690O8926P0648G5897J56526
15043B32423P5815H1033e2097E0297L6627K2515K82505E2776J38119f7169B97918
$$ plain form
15120 273449 49287 -3582 -70348 475501 173482 246872 68833 311913 197520 -66612 -64600
15109 -64600 123267 -245985 174527 -79617 421769 275561 573733 163956 -305545 87652
15098 117001 288637 281852 135216 91053 -2437 178555 79945 205428 130676 31147 74658
15087 74658 303845 227404 230166 241723 152182 146219 175876 80879 139392 282325 -137481
15075 -177033 410527 566300 190799 55925 438191 270344 322487 654075 50394 370396
15065 370396 36696 62380 194525 429732 217546 -283120 87148 293046 -35729 232074
15054 366234 340498 154530 -105726 236031 66784 11474 193164 262090 332738 75897 232423
15043 232423 308238 81033 -52097 50297 86924 109439 391944 52776 190895 -67169 297918
15031B5850J57952J29673q6189q4492b35387B8142R6532c7613B14766K03837B08669
15019a28273B53343J84822C9529K16728J6893l0207j01894L9087C6769K71522
15009C08291r9772H4118R8554D4842J6327K34781o3268p0782a3078B07727k1197
14998A86530J45263R1742A28504D0291L27257j80490N27292C22311j42661J356
14988A81006a39572I4018e5717B25503K66695k42898R2796j1786I2805K61535
14978C54340R3747k15019c6337B18930I1977K69968o5376r4672k7020L47777j05329
14967D17325I2725L07707Q2854c4090B89650G4524J39515L08264C3192L31542
14957C64734J30763j22569j5947g1484c2619C82311p4118a0471B94948O6029r4594
$$ plain form
15031 25850 183802 313475 227286 142794 -235387 28142 124674 -37613 214766 418603 208669
15019 -128273 253343 438165 39529 256257 273150 242943 141049 180136 36769 308291
15009 308291 208519 84118 182672 44842 61169 295950 232682 161900 -13078 207727 186530
14998 186530 331793 423535 128504 40291 367548 187058 714350 322311 179650 181006
14988 181006 -139572 94018 -55717 225503 492198 249300 342096 330310 92805 354340
14978 354340 448087 233068 -36337 218930 91977 361945 296569 201897 174877 522654 417325
14967 417325 92725 400432 483286 -34090 289650 74524 214039 522303 33192 364734
14957 364734 495497 372928 356981 -71484 -32619 382311 308193 -10471 294948 360977 266383
14946B66383K56129j87532P9778a1652N038D15207A69049J9628Q6365M4038J16879
14935D35959R0100k58857k7063L04441B32532l1833K03131J19890A33882N68283
14925G02165j39849A41354h2849D73982j57206L5475n9572r2031K9985H9085J52186
14914B41271A20479k4788L66970l3777J84085A71245J99503J54405j9319j80432
14904C25402l4787M4629K19009A77953H5604J39293K38374m7457j44609J59413
14894D30618k13938J40303K48544B35163R2610e398F90946B52165Q543k6390L13147
14883E47465j12898j56942k453J23385R744K21822A94639K77389K0741P7354f5071
14871C02664K95772j19540m3174m1337k6175J53424E8190M26887B15777K15381
$$ plain form
14946 266383 522512 334980 414758 -11652 -6614 415207 169049 188677 275042 319080 435959
14935 435959 526059 267202 240139 544580 232532 200699 403830 523720 133882 702165
14925 702165 562316 141354 -82849 473982 316776 352251 292679 200648 230633 89085 241271
14914 241271 120479 95691 462661 428884 612969 171245 370748 525153 505834 325402
14904 325402 290615 335244 554253 177953 85604 224897 463271 415814 271205 430618
14894 430618 216680 356983 605527 235163 327773 -5398 690946 252165 260708 234318 547465
14883 547465 434567 277625 275172 398557 408301 630123 194639 472028 492769 570123 -65071
14871 302664 598436 478896 435722 394385 368210 521634 58190 485077 215777 431158
14861D31158J50141j83042J1909j50320j12977L30425L09468B99351p8518L52474
14851E73307j29681o5779M222J03413J28387k72959j39990Q6149L96936j53829
14841E30176j11066A04592L53483j2903K54513J10217l45664n5573J46380j03999
14831D51046j15700J11623q1682K41960j45573j16575j15289L62748j71722J69360
14821E90196B91263R0549j262P0518L3526j8653N8376j53155J68113B47283O19030
14810H66313B41111M28826J27234j3394j27375K7281j92374J80931L2j18676K67045
14799H20641C63303L21804H4227N08911k24851M09929q478j96718k52675N44346
14789H64691l71808N8695A77982M47283N4821k98388j23184N24767k81044J86114
$$ plain form
14861 431158 581299 398257 410166 259846 146869 477294 786762 299351 220833 573307
14851 573307 443626 377847 382069 485482 613869 340910 200920 287069 684005 530176
14841 530176 419110 104592 458075 445172 699685 809902 464238 408665 555045 451046
14831 451046 335346 446969 365287 607247 461674 345099 229810 592558 420836 590196
14821 590196 291263 381812 380550 451068 484594 465941 524317 371162 539275 247283 866313
14810 866313 241111 669937 797171 783777 656402 683683 491309 672240 672272 553596 820641
14799 820641 363303 685107 84227 593138 368287 778216 769738 573020 320345 864691
14789 864691 492883 551578 177982 625265 680086 381698 258514 783281 502237 688351
14779F88351k63150J04817j17939K86598R3833l7789j43344L8809k48439K54644
14769F56391J34164n2267K68120j44977k88936M1501M4780j41077K91805j49657
14759F59847J73668P4921k61399J24087L6654j04966k43565L46325j06409j40362
14749E58801L42652K8864k29758L73462E27778L71470C99572M59357O7339l43719
14739E82549J10867O9611P8512l11017K53568R1175q3433O9526k6317q8227k04527
14728E42287P3570l8934O4763N60505l96843J0049o0414K36673k55754J29911
14718H65813k14480k0004L69885l22943M80232m28673L07824k69238n3075K16044
14708I31385r1362K35367p6965k26110L45103k59126j0242K86685l56473R5732
$$ plain form
14779 688351 425201 530018 412079 698677 792510 754721 611377 650186 401747 656391
14769 656391 790555 738288 1006408 861431 572495 613996 658776 517699 809504 659847
14759 659847 833515 908436 647037 771124 807778 702812 459247 805572 699163 558801
14749 558801 901453 930317 700559 1074021 527778 899248 399572 858929 926268 582549
14739 582549 693416 763027 841539 530522 784090 875265 791832 861358 835041 746814 542287
14728 542287 615857 576923 641686 1202191 805348 815397 754983 991656 735902 865813
14718 865813 651333 631329 1001214 678271 1158503 729830 1037654 768416 715341 931385
14708 931385 840023 1075390 998425 772315 1117418 858292 848050 1134735 778262 873994
14698H73994j00181M31387m45384L10653K9833n2273j9141O0099k22236Q9362
14688I56113K00616l30157n0649K38714K70671m21748K54342J62690m03533L38546
14678A215605q5707L32785m99600K83320k43466k12729J40800J19985L03822j82795
14668A172020M1354j55462j87067M51280k93334J63646j59655J49990K39024k47168
14658A174628J04631k001m20454M78254J8717j03220r9896N51108n35101J68366
14648A335032r5949J49678K26021k31724j22129n7819L47396k85478J92667p9480
14638A378215L5448P9048J47110o5583l67883L21249q0993k39220L70760m525
14628A573626k2662L8730J8285J89197j94403J6780m1519j5313k75219L15073
$$ plain form
14698 873994 773813 1205200 759816 1070469 1100302 1048029 1028888 1088987 866751 956113
14688 956113 1156729 826572 775923 1014637 1285308 863560 1117902 1280592 877059 1215605
14678 1215605 1129898 1462683 963083 1246403 1002937 790208 931008 1050993 1354815 1172020
14668 1172020 1213374 1057912 870845 1322125 1028791 1192437 1032782 1182772 1421796 1174628
14658 1174628 1279259 1277258 856804 1335058 1353775 1250555 1150659 1701767 1166666 1335032
14648 1335032 1239083 1388761 1614782 1383058 1260929 1203110 1550506 1265028 1457695 1378215
14638 1378215 1413663 1492711 1639821 1574238 1206355 1527604 1446611 1207391 1578151 1573626
14628 1573626 1550964 1589694 1607979 1797176 1602773 1619553 1578034 1562721 1287502 1602575
14618A602575j22833l8452L58887K18374N794n13484J87737J40178l15075J76654
14608A700355q6908J12582j49238K40061J37628l80816K61799l56939L94655L353
14598A876532l3036K12667N7734k49108k30975P4213J46199K5001j1838P1557
14588A938946j21297K48494m4955l01143M81338n6812L8599K12727K26938m61855
14578B160980n06634N79122N66954l92085K10883J83593j59476j12602J48133
14569B678868Q3525j15090k3230J63752k0486L69276k73049Q3249L13722k78083
14559B982454K68145j26725K0523L884O11136j3397P14002P0823O73401J239596
14549F443842K601520M607655Q791173J3873017J1087348k0559593A1481147E335016
$$ plain form
14618 1602575 1479742 1441290 1800177 2018551 2024345 1510861 1698598 1838776 1523701 1700355
14608 1700355 1613447 1726029 1576791 1816852 1954480 1573664 1835463 1478524 1873179 1876532
14598 1876532 1843496 2056163 2113897 1864789 1633814 1708027 1854226 1879227 1867389 1938946
14588 1938946 1817649 2066143 2021188 1720045 2201383 2144571 2183170 2395897 2622835 2160980
14578 2160980 1654346 2233468 2800422 2408337 2619220 2802813 2643337 2530735 2678868
14569 2678868 2762393 2647303 2624073 2787825 2767339 3136615 2863566 2946815 3260537 2982454
14559 2982454 3250599 3123874 3144397 3148281 3759417 3746020 4460022 4530845 5204246 6443842
14549 6443842 9045362 13653017 22444190 36317207 47404555 26844962 11481147 5335016
14540C626499j065926j1708q7917L9428l62482J21495L40J95098J02683J1464
14530B568974j64205J06727K04793Q0905p3076k24467J62007J28389K49816L6478
14520C076341k81100K28115k7471k48239R2160O7137J74190O6520k10393L93490
14510C330750m13176K48197N09488l48297Q3132j24559j59295K76093o6486J82998
14500C518845J05689M8161r4415Q6947J66145M4952j56659L001J33907r0880K44054
14489D009747j6602n4668Q0968K88983p9598j8537J90658L1253o7136r2686K46554
14478D518936Q5112r304J48951k1771j8548j9445j80433K38651J11032P4891k9364
14467D898708j46093M40492K63206m78166r766L65349q0061J02884J62894j58480
$$ plain form
14540 3626499 2560573 2548865 2460948 2500376 2137894 2259389 2259729 2454827 2557510 2568974
14530 2568974 2404769 2511496 2716289 2797194 2724118 2499651 2661658 2790047 3039863 3076341
14520 3076341 2795241 3023356 2995885 2747646 2839806 2906943 3081133 3147653 2937260 3330750
14510 3330750 2917574 3165771 3675259 3326962 3410094 3285535 3126240 3402333 3335847 3518845
14500 3518845 3624534 3672695 3578280 3665227 3831372 3876324 3719665 3722666 3856573 3765693 4009747
14489 4009747 3993145 3938477 4019445 4308428 4228830 4210293 4400951 4432204 4365068 4272382 4518936
14478 4518936 4604048 4594744 4743695 4721924 4703376 4683931 4503498 4742149 4853181 4928072 4898708
14467 4898708 4752615 5193107 5456313 4978147 4968381 5333730 5253669 5356553 5519447 5360967
14457E360967N79582l89875M3989L40218j05007k79480N85930k16449J31047L04448
14447F355370J36530j40223O6344M66943k9425k41551R9854L63531l46539L76094
14437G106928l8232L51404R5623J1484K11763O2043o02597Q29103p770o7656K84663
14426H236756j14828J60136K78247K28692N3191J21341J99011j09776J48845K72409
14416I474024J8387n61L69494l5523N29542j57308j16307O31448r7935N22N52820
14405A1168603l9811J17084K75117O21568j61826K58532k94078O29661j82933
14396A2391917O73315O6931J35570K97911K33837J86852L41921J06309O7090M72817
14386A4974470k5435K81930Q34260r567L73845K02751L69648N5619L12473P92803
$$ plain form
14457 5360967 5940549 5550674 5594663 5934881 5829874 5550394 6136324 5919875 6050922 6355370
14447 6355370 6491900 6351677 6418021 6884964 6855539 6613988 6713842 7077373 6730834 7106928
14437 7106928 7068696 7420100 7515723 7527207 7738970 7801013 7198416 8027519 8019749 7952093 8236756
14426 8236756 8121928 8282064 8560311 8789003 8842194 8963535 9162546 9052770 9201615 9474024
14416 9474024 9492411 9491850 9861344 9825821 10355363 10198055 10081748 10713196 10615261 10615783 11168603
14405 11168603 11128792 11245876 11520993 12142561 11980735 12239267 11945189 12574850 12391917
14396 12391917 13065232 13132163 13267733 13565644 13799481 13986333 14328254 14434563 14501653 14974470
14386 14974470 14949035 15230965 16065225 16055658 16429503 16632254 17001902 17057521 17369994 18162797
14376A8162797M17935J13100K22683M19558P61751j01966N63857L04196M53028
14367B1316939P01705L19140O36254K29386P83653L75027O96966M33357L90680
14358B5883107O73443P07179R07885M08313M83902Q28306O16264N94365P50480
14349C1853244P05384O28597J031656Q75541J170227O66815Q48673R77336J218984
14340C9976457Q63761J402069J212938J093906J100311J486363J687381J136423
14332D9959609J297893J933996J583038J048757K194354K213240J877704K011073
14324F4119664K134726J988450K469801K435458K788416K527419K685937L084757
14316H4234628L247872L202001L579908L536044L520074M383011L813764M803331
$$ plain form
14376 18162797 18580732 18693832 18916515 19336073 20097824 19995858 20559715 20863911 21316939
14367 21316939 22018644 22337784 22974038 23203424 23987077 24362104 25059070 25492427 25883107
14358 25883107 26556550 27263729 28171614 28579927 29063829 29892135 30508399 31102764 31853244
14349 31853244 32558628 33187225 34218881 35094422 36264649 36931464 37780137 38757473 39976457
14340 39976457 40840218 42242287 43455225 44549131 45649442 47135805 48823186 49959609
14332 49959609 51257502 53191498 54774536 55823293 58017647 60230887 62108591 64119664
14324 64119664 66254390 68242840 70712641 73148099 75936515 78463934 81149871 84234628
14316 84234628 87482500 90684501 94264409 97800453 101320527 105703538 109517302 114320633
14308A14320633M539287M631725N414658N674437N888875O110961O595942O897176
14300A60073694P562792P189140Q837309Q271947Q759081J0221743R912476J0527289
14292B31355471J1165812J1770168J1803731J2713158J2948376J3653355J4163150
14285C19573221J4182348J4880811J5108021J4870641J4320581J4210449J4090630
14278D21236702J3000014J2305590J0851778Q494535N299135R06567q33988j671304
14270D69589029j472298K237239k898668o091288q741886r926533j1419145j2557660
14262D18718790j4169532j4982570j5046073j5396867j5521351j5515036j5035025
14255C13052336j5143520j3189127j3711028j2985098j2105887j2206577j1332205
$$ plain form
14308 114320633 118859920 123491645 128906303 134580740 140469615 146580576 153176518 160073694
14300 160073694 167636486 174825626 183662935 191934882 200693963 210915706 220828182 231355471
14292 231355471 242521283 254291451 266095182 278808340 291756716 305410071 319573221
14285 319573221 333755569 348636380 363744401 378615042 392935623 407146072 421236702
14278 421236702 434236716 446542306 457394084 465888619 471187754 472094321 471260333 469589029
14270 469589029 468116731 470353970 467455302 461364014 452622128 442695595 431276450 418718790
14262 418718790 404549258 389566688 374520615 359123748 343602397 328087361 313052336
14255 313052336 297908816 284719689 271008661 258023563 245917676 233711099 222378894
14248B22378894j0537824j0210038r686298q779413p968275q255701p795152p168026
14240A51978167o582873o533155n757352n364744n497752n326385m795393m519055
14232A07601458m196566l579488l849435l975277l554111l210880l038822l107827
14224G9089052k838533k475767k750913k246980k458088k016159k135392k150924
14216F0016296j539424j832154j760913j306509j667120j899899j536674j130869
14208D7342734j434504j092107r23147j368145j422270j400536r66237p56446
14200C7979342n42583j273043p06236j025973p09452j218066m37944r54595m42433
14191C0669017j268336m51910j131000j69719r91304k32800p48982l06963o78083
$$ plain form
14248 222378894 211841070 201631032 191944734 183165321 175197046 166941345 159146193 151978167
14240 151978167 145395294 138862139 133104787 127740043 122242291 116915906 112120513 107601458
14232 107601458 103404892 99825404 95975969 92000692 88446581 85235701 82196879 79089052
14224 79089052 76250519 73774752 71023839 68776859 66318771 64302612 62167220 60016296
14216 60016296 58476872 56644718 54883805 53577296 51910176 50010277 48473603 47342734
14208 47342734 45908230 44816123 43892976 42524831 41102561 39702025 38735788 37979342
14200 37979342 37436759 36163716 35457480 34431507 33722055 32503989 32066045 31111450 30669017
14191 30669017 29400681 28948771 27817771 27648052 26656748 26423948 25674966 25368003 24689920
14182B4689920o32433p18592l37660q1877o87585l39512n96926k97666l86574
14173B0611095n30399k61939p74288p9372n61527l09625n985m99497m70435l19249
14163A6798779k46164j52786k05828n73983J08391l42809l52297J5826o60063
14154A4389066l61281n4893k38837m0117j25852k42806m54827M2025k76722l59522
14144A2276234j30596k77942m5147j0249l04996o2018j89598n18398j10671K5567
14134A0652186j58588q8310k08439j13328j8465j8193l31892l54687o4060l28380
14124H967844L90081k02922k10884j38646n0931P9359l24825p8379k42904k63222
14114G924571k37452L0088j93321J39033J00841l43273L91891n13540k25504M05140
$$ plain form
14182 24689920 24057487 23338895 23001235 22919358 22231773 21892261 21295335 20997669 20611095
14173 20611095 20080696 19818757 19044469 18965097 18403570 18093945 18087960 17588463 17118028 16798779
14163 16798779 16552615 16399829 16194001 15620018 15728409 15385600 15033303 15049129 14389066
14154 14389066 14027785 13972892 13734055 13693938 13568086 13325280 12870453 12912478 12635756 12276234
14144 12276234 12145638 11867696 11822549 11812300 11507304 11445286 11255688 10737290 10626619 10652186
14134 10652186 10493598 10405288 10196849 10083521 10065056 10046863 9714971 9360284 9296224 8967844
14124 8967844 9357925 9155003 8944119 8805473 8754542 8833901 8509076 8430697 8187793 7924571
14114 7924571 7687119 7717207 7523886 7662919 7763760 7420487 7812378 7298838 7073334 7478474
14104G478474n38127n7430J61415l47620P8547m95181J63926O647r2683N8347
14094F416315j90865m0152j68743m4454J9508q0172o0244J92297r2718l85620
14084E565152J03559K977m54200J37247j94315j4523M0688J48555l98600K93266
14074E229806j56273m84949K19069P3069l52726M54313l42814P3588m76194J24760
14064D361649K43321J51087l89453L08422m35387K84687M2776K6791j05910j46086
14054D341897j66329J07418l94126Q8937m406k76822L45999l62207m7739L90303
14044D022925k01805j04260k56968J90133p7759j90086N20390l51332m6137J84802
14034C689903l81525K00447K2312J749o9134j8068K334J32492n13900j21017m6007
$$ plain form
14104 7478474 6940347 6882917 7044332 6696712 6775259 6280078 6444004 6450651 6357968 6416315
14094 6416315 6225450 6185298 6016555 5972101 5991609 5911437 5851193 6043490 5950772 5565152
14084 5565152 5668711 5671688 5217488 5354735 5160420 5145897 5186585 5335140 4936540 5229806
14074 5229806 5073533 4588584 4807653 4880722 4527996 4982309 4639495 4713083 4236889 4361649
14064 4361649 4604970 4756057 4366604 4675026 4239639 4524326 4567102 4593893 4487983 4341897
14054 4341897 4175568 4282986 3888860 3977797 3973391 3696569 4042568 3680361 3632622 4022925
14044 4022925 3821120 3716860 3459892 3650025 3572266 3382180 3902570 3551238 3505101 3689903
14034 3689903 3308378 3508825 3531137 3532886 3463752 3445684 3448018 3580510 3066610 2945593 2899586
14023B899586J53924M67596o51945O8604j35215m0672K66226o3174o9980R9499
14013B994449k23140J27616L0998Q7939p5658k30344j64456J03876j11073J82784
14003B722991j58527K88404j59961l56919L91320n50292K55762k39656K63278
13994B456400K94670n23064J42661N05473P14569J361795K969637P831413J3763714
13985B9517268J6202586j3870141A5098507n962510k659119j346006p03651n06415
13977C920806l42765q2246r5991k9263k99283j32094j09618j40702L0961m22818
13967B296987L98010J1692m54577M06453q9623k28685Q6923k96328R9106J45815
13957B375773o5533l50287K70499J00923k43997p8975J53682J88568k21246m429
$$ plain form
14023 2899586 3053510 3521106 2869161 2937765 2802550 2761878 3028104 2964930 2894950 2994449
14013 2994449 2771309 2898925 2929923 3017862 2942204 2711860 2547404 2651280 2540207 2722991
14003 2722991 2564464 2852868 2692907 2335988 2727308 2177016 2432778 2193122 2456400
13994 2456400 2751070 2228006 2370667 2876140 3590709 4952504 7922141 15753554 29517268
13985 29517268 45719854 31849713 15098507 9135997 6476878 5130872 4427221 3920806
13977 3920806 3578041 3495795 3399804 3370541 3071258 2939164 2829546 2688844 2719805 2296987
13967 2296987 2694997 2706689 2252112 2658565 2568942 2340257 2427180 2130852 2229958 2375773
13957 2375773 2310240 1959953 2230452 2331375 2087378 2008403 2162085 2350653 2129407 2124978
13947B124978r3750q9290K62930k55009J43044M7416l3242J4957o6191j72154
13937A883689L11534j62355l04667L17281l57930J97377K48423m59114R0404r2878
13927A671764M2672p9326R3288r5041L49819m07042L55069j60727k52868L21687
13917A839295R7852o0722l2882K3956k33035k59664K61629k6666q4598j9989n8770
13906A446406k43575L63443k50673L02343L9773l4294p9477j41137R0808J19321
13896A612938m194r109J51463l98203J70579K29273k08964k70978k9013L53799
13886A597591r3670k79422L9953L05855j14601j29355Q9985n0182k03052R3387
13876A256489p4505O647Q1012j28071J47381O2084p2858K05774k01356j09354
$$ plain form
13947 2124978 2031228 1941938 2204868 1949859 2092903 2140319 2107077 2122034 2055843 1883689
13937 1883689 2195223 2032868 1728201 2045482 1687552 1884929 2133352 1674238 1764642 1671764
13927 1671764 1714436 1635110 1728398 1633357 1983176 1576134 1931203 1770476 1517608 1839295
13917 1839295 1937147 1876425 1843543 1867499 1634464 1374800 1636429 1609763 1525165 1505176 1446406
13906 1446406 1202831 1566274 1315601 1617944 1657717 1623423 1543946 1402809 1493617 1612938
13896 1612938 1608744 1599635 1751098 1352895 1523474 1752747 1543783 1272805 1243792 1597591
13886 1597591 1503921 1224499 1264452 1570307 1455706 1326351 1416336 1366154 1163102 1256489
13876 1256489 1181984 1188631 1269643 1141572 1288953 1351037 1278179 1483953 1282597 1173243
13866A173243l1440j81057o1667L07944L660l26148L16278J5952j960n550N0420
13855A259675r5031p3315N5723n4343o7333O4630K1450K72872k39236N5042j91682
13844A008452j97385J05319L6976J75876J0977m06507L77791K8972J16978m10272
13834H47177J51975j68036K26768N0286Q7041O8080j51211l71920L46212j4804
13824A071568K56551k82692J4863k52998K45896o4895p0860L5672l1458J37371
13814A059018q7830N0474J06251k99634J53457j78398K62493k48094P7424o0515
13804H34646K13550j41051q1407n1905J75631k31543o1273J13078K664M02272
13794A174662j78313n6185J68688O4139l73878l37173M75916J58207k40791R9486
$$ plain form
13866 1173243 1141803 960746 899079 1207023 1210683 884535 1200813 1216765 1214805 1209255 1259675
13855 1259675 1164644 1091329 1147052 1092709 1025376 1090006 1111456 1384328 1145092 1200134 1008452
13844 1008452 811067 916386 953362 1129238 1140215 733708 1111499 1140471 1257449 847177
13834 847177 999152 831116 1057884 1108170 1195211 1263291 1112080 740160 1086372 1071568
13824 1071568 1328119 1045427 1060290 807292 1053188 988293 917433 953105 921647 1059018
13814 1059018 971188 1021662 1127913 828279 981736 803338 1065831 817737 895161 834646
13804 834646 1048196 907145 825738 773833 949464 717921 656648 769726 772390 1174662
13794 1174662 996349 940164 1108852 1172991 799113 461940 937856 1096063 855272 954758
13784I54758J30458N2549E14025K22121J51826r6487N6239K50526k3449o3044
13774A011757n5271k21360j07932L05335l20074J98896j39919K59205l16574J41889
13764G55952l654q0601j54776l2973N92553k00559Q283k23066L51062j48787m0874
13753H22560K20069m27793J81202J24006j99483J20302M458L0395L16571D11276
13742F16394L15629l84565J70306J82866l14734Q5438p51Q6313K58372k05236
13732H10032k92447J44865K78965k96174J03059r7736j28924K02590K7017J4019
13722G65266k14677n4141J47233K26799q0623J26701D51332J44412M2596J69307
13712H07647B84153L93634j77891J84273k60863J86467q4612K56931B60973M33993
$$ plain form
13784 954758 1085216 1137765 514025 736146 887972 791485 847724 1098250 1074801 1011757
13774 1011757 956486 735126 627194 932529 612455 811351 671432 930637 614063 755952
13764 755952 752298 671697 516921 483948 1076501 875942 884225 661159 1012221 863434 822560
13753 822560 1042629 614836 796038 920044 720561 840863 845321 875716 1192287 411276
13742 616394 932023 547458 717764 900630 585896 671334 670583 756896 1015268 810032
13732 810032 517585 662450 941415 645241 748300 650564 521640 724230 751247 765266
13722 765266 550589 496448 643681 870480 789857 916558 451332 595744 638340 807647
13712 807647 284153 677787 499896 684169 423306 609773 525161 782092 260973 694966
13702F94966J00685l4043k65577N13550m57250L26767l16686L88837j82245r7910
13692F71094k44986H4102N82590j82342K6449Q5961o4723p2844K34776j30876
13682E63093k0414k16137L98499r1221P2268L39047n01241j38122L5006O5653
13672E06431O9466k23547K75476j02791L4641j89010K4798J3138J9434j22939
13662C05097J95057l8965K71467C16352K59663J41912q3033p2949J08428k03426
13652D66947k0616B10007L96225m7502j62969l0758L51304q3800B96142J13428
13642D09570k0404A58216M40038j41744j46888J32001A97498J94165K58099j50037
13632D99725n2390j99939m4145J70565j49701K53105j98801M06289k57127p2200
$$ plain form
13702 694966 795651 761608 496031 1009581 552331 879098 562412 951249 769004 671094
13692 671094 426108 84102 666692 484350 510799 596760 532037 459193 693969 563093
13682 563093 542679 326542 725041 633820 706088 1045135 543894 405772 440778 506431
13672 506431 575897 352350 627826 525035 559676 370666 395464 408602 428036 305097
13662 305097 500154 461189 732656 316352 576015 717927 634894 561945 670373 466947
13652 466947 446331 210007 606232 558730 395761 365003 716307 632507 296142 409570
13642 409570 389166 158216 598254 456510 309622 441623 197498 391663 649762 499725
13632 499725 447335 247396 203251 373816 224115 477220 278419 684708 427581 355381
13622C55381K25468j31959N9592J19047A42390K57510P4944m682J50732Q1068
13612G01962l18482F9452O98851k78732j33497r1300K63909k12504m7724N76766
13602H45221C50515A60657N21538l03752q0825K75259p4083N363B22993J42600
13592C65593O9779A84364E9166J85380Q2263L83256j61564j08436G9973J63366
13582B43339L69052k76720J6811b9215D27416K26872k82954j83177J21334K41480
13572E50971B41741K61629j28920L54259A92581J27162K47714l6741A90018K30939
13562D20957n6056f5992A70013J16565N6203E8068N07007j3701j36082J5614A49803
13550H1322K36516j11555r9405N47601A76276M02603B61455p729J61362r7655
$$ plain form
13622 355381 580849 448890 508482 627529 142390 399900 474844 470162 620894 701962
13612 701962 383480 69452 768303 489571 356074 264774 528683 316179 268455 845221
13602 845221 350515 160657 682195 378443 297618 572877 498794 504157 222993 365593
13592 365593 435372 184364 59166 244546 326809 710065 548501 440065 79973 243339
13582 243339 612391 335671 352482 -29215 427416 654288 371334 188157 309491 550971
13572 550971 241741 503370 374450 728709 192581 319743 567457 530716 190018 420957
13562 420957 364901 -65992 170013 286578 342781 58068 565075 551374 415292 430906 149803
13550 81322 317838 206283 106878 654479 176276 578879 261455 253726 415088 317433
13540C17433O1162K08939k9805A13590N16661k26065L09463B06327m1515M13727
13530E78539B40374K27989j22485M3350A77819K02873j70680K04999k03566L7453
13520B48898j10065a16970F5229J22474K80146p9919J97156A76325l6228P8903
13510B19000M8976a90726A41783N61059C09849N5316j67703J39388p6967n9177
13500B00706J1270r783N7524j1001n9026L29075A84177J96809K6838N4668p4379
13489C88113J46667B58797L84282l10835j43588H4485J79609G9829F767h500A04615
13477g8829D47854A61516J64201M1693k4004E7878M0098L76364J39066E0400L41887
13466C92287H2587N36705B46113O4103E6475K72965k0225J66430j44085c053D26133
$$ plain form
13540 317433 378595 587534 557729 113590 630251 404186 713649 206327 164812 578539
13530 578539 240374 468363 345878 389228 177819 380692 210012 415011 211445 248898
13520 248898 138833 -116970 65229 187703 467849 387930 585086 176325 140097 219000
13510 219000 267976 -190726 141783 702842 309849 365165 197462 336850 259883 200706
13500 200706 211976 202193 259717 248716 189690 518765 184177 380986 407824 462492 388113
13489 388113 534780 258797 643079 332244 188656 84485 264094 79829 6767 -8500 104615
13477 -78829 447854 161516 325717 367410 343406 57878 97976 474340 613406 50400 392287
13466 392287 82587 619292 246113 310216 56475 329440 309215 475645 331560 -3053 426133
13454D74697j08360l7524A49900d7135A69297c7148B816L33187F7955L2943P6664
13443A77562K24836A64125k5309A3975J21010b3396C69889j08835K49287K1565
13433E31906k41317J00809l0788j45948J66205j62535J19102j09721K40672j26318
13423C42067A19466n3095k869M9686J37625J54943c42367D04761r932j86606i3042
13411C26719j7924A22260k2728J10957G6144k8991L73484A94365P7803n2406p2332
13400A47430a03572B54183e678C2172L8161K84273a32861D96080B20363k9096
13390A91267R9893A19948J45355M5849Q4777j19333O5534n1053N5878m3881j9242
13379B83832J5775J1747J76599B30442J09918A00342K33370K24545c2557C23022
$$ plain form
13454 474697 366337 328813 149900 -47135 169297 -37148 2816 336003 67955 100898 177562
13443 177562 402398 164125 138816 13975 134985 -23396 369889 261054 510341 531906
13433 531906 290589 391398 360610 214662 380867 218332 337434 227713 468385 342067
13423 342067 119466 66371 63502 113188 250813 405756 -342367 404761 394829 208223 -93042
13411 326719 308795 122260 99532 210489 76144 47153 420637 194365 272168 219762 147430
13400 147430 -103572 254183 -5678 32172 70333 354606 -132861 496080 220363 191267
13390 191267 291160 119948 265303 311152 395929 276596 342130 291077 346955 303074 283832
13379 283832 299607 311354 487953 230442 340360 100342 333712 558257 -32557 323022
13368C12745J13241A93698n5470J04872J25174a03618a8566E44440j56200A51525
13357D09711A01028P9177f774A45127j5522J29566J67156D0050K72290q5530K71402
13346D98212A16830a22824D54778q7558o2919q4005Q2785B2268K48397a3551D81699
13334E62642l3737B02212J722J0507N033J43468j78295l1492j9130J76010L0635
13323C40670j48070K07495l4468N809E2140J92449O5171j28122K27249H6982J79593
13312B66575j04195l5344O9870J24157b5116B90131q5290B1263g741B34086m4381
13301A89705p2148l6188M9929R0904A201e5960D97953j71304i2135B50134G6420
13289g3858C60035m0266G76K10718d1498C13794j15334B5603K65653A08376J44020
$$ plain form
13368 312745 425986 193698 138228 243100 368274 -103618 -18566 544440 388240 151525
13357 409711 101028 180205 -6774 145127 129605 259171 426327 40050 312340 226810 498212
13346 498212 116830 -122824 454778 367220 304301 220296 303081 22268 270665 -13551 481699
13334 562642 528905 202212 203934 214441 219474 362942 184647 153155 134025 310035 340670
13323 340670 192600 400095 365627 371436 52140 244589 309760 181638 408887 86982 266575
13312 266575 162380 127036 196906 321063 -25116 290131 204841 21263 -7741 234086 189705
13301 189705 117557 81369 131298 222202 1201 -55960 497953 326649 -92135 250134 76420
13289 -73858 360035 319769 776 211494 -41498 313794 198460 25603 291256 108376 252396
13278B52396j15457J1108N3388C3974J35016K40229k135K9232A80903c4136k43628
13267b77764A65947K2242I1276g7561A33654k7602K78060B5254J30328j8101J96229
13256C33710j22885a55158L689C26042M8856A48905e3956D08278f0182J9247B21919
13244A51309n7482J04339h2908C74335H9679i5443B59862M3783r4381A3646R5537
13233A09183N4998b0375k34135d1921D13559B06007n2933e5565A6383M96722E7395
13221A88287b41461B11441L7784C6951J3603P0586K07013m9785b7349A74153a00195
13209F8819M6401a77714O4438F240L58376A25288J09085N9954p5666r9297d5960
13197a15441B63397m1280N3338A29844E5316J64662R5729a3133A04390e0428C39632
$$ plain form
13278 252396 136939 148047 201435 33974 168990 409219 407084 436316 180903 -34136 -277764
13267 -277764 165947 188189 91276 -77561 133654 106052 384112 25254 155582 137481 333710
13256 333710 210825 -155158 -151469 326042 374898 148905 -53956 408278 -60182 -40935 221919
13244 151309 93827 198166 -82908 374335 89679 -95443 259862 303645 209264 13646 109183
13233 109183 164181 -20375 -254510 -41921 413559 206007 153074 -55565 16383 513105 57395
13221 188287 -241461 211441 249225 36951 50554 121140 328153 278368 -27349 174153 -100195
13209 68819 115220 -177714 -113276 6240 364616 125288 234373 294327 218661 119364 -45960
13197 -115441 263397 222117 275455 129844 55316 219978 315707 -13133 104390 -50428 339632
13185E6645b09879C69197p6238H9081L88893k21169P8419j35897H8139J56588
13175B44727H9863g3998A94637G9430J09940q6307m2650a16698D38201c9999A64058
13163C00724A46376O0912I100J96384J0834a38503n3351B57428J41752A21433
13152A00341P4998l893g8148r0823K6921k9056B38292K195A10742D9208a17968
13140h9187B54211e7798A29543A2291K36323e4008K5958B91604p609A37961M5777
13129A83738E9433b11703l3585I3805K45564a32681H7266L8496n5749J45656J22555
13118C38224b28134C3521c26590J05125C42316A00065L3292P9145I8775J78770
13108B77545a21253j93412F6598a40767A07856M8614C1809P987P806O4264R9510
$$ plain form
13185 56645 -209879 369197 292959 89081 477974 256805 335224 199327 88139 244727
13175 244727 89863 -73998 194637 79430 189370 103063 60413 -116698 438201 -39999 164058
13163 300724 146376 207288 9100 205484 216318 -138503 -191854 257428 399180 121433
13152 100341 175339 171446 -78148 -168971 -142050 -171106 238292 240487 110742 49208 -117968
13140 -89187 254211 -57798 129543 12291 248614 -54008 -28050 291604 283995 137961 183738
13129 183738 59433 -211703 -245288 93805 339369 -132681 87266 125762 70013 215669 338224
13118 338224 -228134 33521 -326590 -221465 342316 100065 133357 212502 98775 277545
13108 277545 -121253 -314665 66598 -140767 107856 156470 31809 39796 47602 111866 211376
13097B11376B1464O0388K415l1788J22997J0974R0609r7764H6904M2779J23759
13086B53442b0775B96334A09971J72242i1098l3187A45665d4048A84464a32376
13075B82396a43887C06962A14367g8568I9351J94915G010J81666I014P0835J6659
13064I6508K66699j00334r8384J4661D9550R425K23244b6215E3956a3870B06351
13052e3681C17298j27046B3845a31366A09877k3648Q9058n721J912Q2417N3429
13041C07324b30372A83513p9370J52950m0100M4166e7732B98080c3054B72041
13030d0668A36765K34217j49246a14932C0591J5653J91718O1346B1481K46126
13020B67607K35084H3406a00415C18858a19164B00911I0663L7428M70A127e8734
$$ plain form
13097 211376 21464 81852 84267 52479 175476 186450 277059 179295 86904 129683 253442
13086 253442 -20775 296334 109971 282213 -91098 -124285 145665 -44048 184464 -132376
13075 282396 -143887 306962 114367 -78568 99351 294266 7010 188676 9014 79849 96508
13064 96508 363207 262873 164489 179150 49550 58975 282219 -26215 53956 -13870 206351
13052 -53681 317298 190252 23845 -131366 109877 86229 175287 169566 171478 253895 307324
13041 307324 -230372 183513 104143 257093 216993 261159 -57732 298080 -33054 272041
13030 -40668 136765 370982 221736 -114932 30591 46244 237962 299308 21481 267607
13020 267607 502691 83406 -100415 318858 -119164 200911 90663 128091 128561 1127 -58734
13008a6808j25946a9841j50931A30619a08932H6528m142l9326K69954a46226B49567
12996D07232a539B5907K57116A33220D8142K04921a05965E0784Q465P6388i808
12984A69833F5054a01387B40594d4414h777n2856A36077P3322J36130D0083J67400
12973B07483J33415G874L5915g8391A82061F4433e5850j5607A66930a52488f0894
12961h0788A48207L55499b2040I0369N9683E6433K46907a63259A68869a0629A51168
12949D12885j65393p7587n7811N77861g6152j21935N3292A75035a52145C76577
12938a9265B0811M0879h04A18956C9278a62210A4643f4102A98692J66227l2043
12927C32876H3533e1893E7125I317K37177q5916K10942A1015b73518a4929p9777
$$ plain form
13008 -16808 -142754 -19841 -170772 130619 -108932 86528 82386 43060 313014 -146226 249567
12996 407232 -1539 25907 283023 133220 48142 253063 -105965 50784 59249 135637 -9808
12984 169833 65054 -101387 240594 -44414 -8777 -61633 136077 209399 345529 40083 207483
12973 207483 340898 7874 43789 -78391 182061 64433 -55850 -71457 166930 -152488 -60894
12961 -80788 148207 503706 -22040 90369 150052 56433 303340 -163259 168869 -10629 151168
12949 412885 247492 169905 112094 689955 -76152 -198087 -144795 175035 -152145 376577
12938 -19265 20811 61690 -804 118956 39278 -162210 14643 -64102 198692 364919 332876
12927 332876 83533 -51893 57125 9317 246494 160578 371520 11015 -273518 -14929 -94706
12916i4706L6174j65225G6364b27477a4053E5605a61576b2428C458L04426c61113
12904B32295K8518A18792Q9992q5709D5722J20437E2715L36291G3709g4800A97525
12892a38069A64558j906a70966C03776a53930n580A3572c5284B1222i5873C2170
12880c21981C02636a48502A21123R061F2877j2608a6495m10325a32476D0386O6009
12869A06395P8705l3668a83739C096P6834J59281h0613F2246Q0928l9390J5045
12858A18829h2665I0451b61402B9756b71501a22276r9563B00267R1080A08602
12847d4575A33846d4321l0834n0347c6667I8432a11039F762R9174C764J48738
12836A52502a47875c4857p1398a8691l27766B4710L7027b27495C05820A36749
$$ plain form
12916 -94706 -58532 -223757 76364 -227477 -14053 55605 -161576 -22428 3458 307884 -361113
12904 232295 260813 118792 208784 123075 45722 166159 52715 389006 73709 -74800 197525
12892 -138069 164558 162652 -170966 303776 -153930 -159510 13572 -35284 21222 -95873 32170
12880 -321981 302636 -148502 121123 130184 62877 50269 -16495 -426820 -132476 40386 106395
12869 106395 185100 151432 -183739 3096 79930 239211 -80613 62246 143174 103784 118829
12858 118829 -82665 90451 -261402 29756 -271501 -122276 -221839 200267 291347 108602
12847 -44575 133846 -44321 -75155 -125502 -36667 98432 -111039 6762 105936 3764 152502
12836 152502 -147875 -34857 -106255 -18691 -346457 24710 61737 -227495 305820 136749
12825i2578l76060B05102c6846j9897r3451O7111D0237a53524H9258a78736A24448
12813c30361J04254B02586p8333a52186B07473q1791a86065d6991B26056b4869
12802B2151e6653C1880a98181A45969k2600c0017C13753b50939a1577l029H2302
12790a39273B13688G5167b7369A08979C2334b720A3010Q3666b15215A44916C608
12778c9635m7137J9949j28981O1122m3052K595G3118L6167K57748j21977m9030
12767A96026j9317K43118E5248Q5695a82568B1994a15138B38546c84507H6426
12756b58079B27068N697j09003l696a34525B87570d7265o6534k33454J11866g764
12744b08787P9820A98960b11524A51825J16106j22496c58144B3457g1015A88378
$$ plain form
12825 -92578 -468638 205102 -36846 -56743 -150194 -83083 40237 -153524 89258 -178736 124448
12813 -330361 -226107 202586 124253 -152186 207473 125682 -186065 -46991 226056 -24869
12802 22151 -56653 31880 -198181 145969 123369 -30017 313753 -250939 -11577 -14606 82302
12790 -139273 213688 75167 -27369 108979 32334 -2720 13010 96676 -215215 144916 3608
12778 -39635 -86772 -66823 -195804 -134682 -177734 -175139 73118 109285 367033 245056 196026
12767 196026 176709 419827 55248 140943 -182568 21994 -115138 238546 -384507 86426
12756 -258079 227068 232765 123762 120066 -134525 287570 -47265 -113799 -347253 -235387 -7764
12744 -208787 -128967 198960 -211524 151825 267931 145435 -358144 23457 -71015 188378
12733A36606E5623J17725n6369g9767A56980J41511A39844a71491H3261K4828
12723A08089a59744B63686A30072a60406A31831B4150K57500o1592n6610b1428
12712B3177J44205J09368O3983A60333p9214b43935d6056B04483O7346j25892
12702A45937o4634O5496G2506N77391B43113P554j11828o8090J10303l1432K36588
12691C86208A32632j8215g5105D22716A09393g5359j99838F5682C2805O7646K41250
12680C41701j0250d6351D15377b6007A44272J24592c0425C83361j71213q6733
12670A25415q526g0109D68053A05010K86491I3239J03297H1244b9635a3025A80704
12658D8684J01334g3970I3503d7036D3325b70492B19972j4035J98373j72562j14329
$$ plain form
12733 136606 55623 173348 116979 -79767 156980 298491 139844 -171491 83261 108089
12723 108089 -159744 263686 130072 -160406 131831 24150 281650 220058 163448 -21428
12712 23177 167382 276750 340733 160333 81119 -243935 -46056 204483 271829 145937
12702 145937 81303 146799 72506 649897 243113 250667 138839 70749 181052 149620 386208
12691 386208 132632 114417 -75105 422716 109393 -75359 -275197 65682 32805 100451 341701
12680 341701 331451 -46351 415377 -26007 144272 268864 -30425 383361 212148 125415
12670 125415 116889 -70109 468053 105010 391501 93239 196536 81244 -29635 -13025 180704
12658 48684 150018 -73970 93503 -47036 43325 -270492 219972 205937 404310 231748 117419
12647A17419d905j13337F3009K34769a83247A4381a56798B14746G2838a19506
12636B16906C0124G11L0743g4195H7306K01380A21642P0048l4893J06258K43466
12625E06521j78527A32723B6656e7000A69732J40173b21827B68185q8724C5558
12614a12749E2688A7209L42915A72543d2486A93599i0191A09345L02404H8766
12603B93817e7372B16924J27313G0365K23086e4846i108A56460E4332a60103k24384
12592c84487B06608a83470P9779F8019J98457n7373B1669N2665c2475i0l5501
12581c5591p1191D06177F9955h2706L2911l51747a14575A35763a90450i097A68098
12569h4114N647A30575H120Q9153K111a23897O1263A50334f4308m5656j88821
$$ plain form
12647 117419 -4905 -118242 63009 297778 -183247 14381 -156798 214746 72838 -119506
12636 216906 30124 711 31454 -74195 87306 288686 121642 191690 156797 263055 506521
12625 506521 327994 132723 26656 -57000 169732 309905 -221827 268185 179461 35558
12614 -112749 52688 17209 360124 172543 -42486 193599 -90191 109345 411749 88766
12603 293817 -57372 216924 344237 70365 293451 -54846 -9108 156460 54332 -160103 -384487
12592 -384487 206608 -183470 -103691 68019 266476 209103 21669 74334 -32475 -90 -35591
12581 -35591 -106782 406177 69955 -82706 -49795 -401542 -114575 135763 -190450 -9097 168098
12569 -84114 -78467 130575 8120 97273 99384 -123897 -62634 150334 -64308 -109964 -298785
12558b98785A13468l7399J00580d7302l45566P1421E5266J4550M8218K01069A23153
12546F591J2692c1023r9626B33930C5647P5159N5850a876A30654B7033d83226
12534B53901n7878g3335k62692E4721J82661a89935j45213B08626e7391D0685
12523B97280k6135J41220j89705Q9256j54784c8280A04312f5179E4965L7875a43742
12511A4654h1340b8604A74687b67710B38291C0685a00585D6331P2648b54319A92322
12499D54256a9197m4740A4490K30620A2438O6167b04762R5700A00561J25471f17
12487A83207G0346j7109j1830c5195B38670N270b02431A8430g185A9679e926j16628
12475a22554l76C10147j51328j7700J76254c5337B02066d8479j47131Q1548j16052
$$ plain form
12558 -298785 113468 76069 176649 -47302 -392868 -321447 55266 69816 118034 319103 123153
12546 6591 19283 -31023 -130649 233930 35647 110806 166656 -1876 130654 27033 -483226
12534 253901 196023 -73335 -336027 54721 237382 -189935 -335148 208626 -57391 40685
12523 297280 271145 412365 222660 311916 157132 -38280 104312 -65179 54965 92840 -143742
12511 14654 -81340 -28604 174687 -267710 238291 30685 -100585 46331 118979 -254319 192322
12499 454256 -19197 -63937 14490 245110 12438 78605 -204762 -109062 100561 226032 -617
12487 183207 70346 53237 41407 -35195 238670 243940 -202431 18430 -7185 19679 -5926 -122554
12475 -122554 -122930 310147 158819 141119 317373 -35337 202066 -48479 -195610 -114062 -230114
12464b30114A50778J35347A27188D0738a31524d8455B47652c7111A42281b7829
12453A5257a78411g5269E9782L97473c73748A79348a46735A06030i3395H8095
12442B3285L27344a22652H5887g4275F9789i0240I3853g4750K1461n8291j6886
12431a28466F9080K54541H8325b5730A011g3602I0057a88240c2345A32236c05043
12419B81652m7412F3307e7322A39791a58020A14014D9621c2420G1327f2958B82989
12407A30295d5404j5319C5693Q6219D2194c53258g4758C2554J14613a65701A92681
12395A68460g2209k01689J18080d4676m4653A50870c7440B46743h3081k4449A05753
12383A32176a00438A53258n1709K50506A45374j7624i7562K0021a334A69665c20212
$$ plain form
12464 -230114 150778 286125 127188 40738 -131524 -48455 247652 -37111 142281 -27829
12453 15257 -178411 -75269 59782 457255 -373748 179348 -146735 106030 -93395 88095
12442 23285 350629 -122652 85887 -74275 69789 -90240 93853 -74750 -53289 -111580 -128466
12431 -128466 69080 323621 88325 -25730 1011 -73602 90057 -188240 -32345 132236 -305043
12419 281652 234240 63307 -57322 139791 -158020 114014 49621 -32420 71327 -62958 282989
12407 130295 -45404 -60723 35693 121912 42194 -353258 -74758 32554 147167 -165701 192681
12395 168460 -72209 -273898 -155818 -44676 -89329 150870 -37440 246743 -83081 -107530 105753
12383 132176 -100438 153258 101549 352055 145374 127750 -97562 -77541 -1334 169665 -320212
12371C5182a43909A81847a67617C175J80682E4841J15235J55845E5456J07783
12361A63239a5340j96905f4323J8993m7205B12468P581a39723r2377m232N8567
12350a77765A29829J22237e8079k36313F820g2161A73483b02275A21035c17299
12339F8674N2036a21780p6154e0892K488j86828b9357j86412b8719j84351l2105
12328b45175L0351A46282f1425D4700O5775a1976A87156d192k43486R1146C43153
12316F7751d3539B50226f5663A70J64505J7602D3717B0091M9558a04772k7277
12305a32049B2762h6894r1145A63198b41507M9713i677B2828K47682P4552j38654
12294B06408B7741c66036D34958r7786p4446G1017c11257A97820f5730B92552
$$ plain form
12371 35182 -143909 181847 -167617 3175 183857 54841 170076 325921 55456 163239
12361 163239 -15340 -212245 -64323 -45330 -92535 212468 220049 -139723 -232100 -236332 -177765
12350 -177765 129829 252066 -58079 -294392 6820 -72161 173483 -202275 121035 -317299
12339 68674 120710 -121780 -197934 -50892 -48404 -235232 -29357 -215769 -28719 -213070 -245175
12328 -245175 -214824 146282 -61425 44700 110475 -11976 187156 -4192 -247678 -156532 343153
12316 67751 -43539 250226 -65663 170 164675 182277 43717 20091 69649 -104772 -132049
12305 -132049 22762 -86894 -178039 163198 -241507 -191794 -9677 22828 270510 345062 206408
12294 206408 27741 -366036 434958 337172 262726 71017 -311257 197820 -65730 292552
12283g524c210C5114i6802H9278K96062C4536j2931L54337A50841l4006E257M17464
12271D22721f0939A27946b82574f8445L0727A84283L6048K1311D3478J07180a00433
12259G24h5472j608B8001c07539D90307h7338r1550B45182b26363i5189j28059
12248b23248A33136Q1792p5685N9779k6021A0730f8864A56863b34634K1955C54119
12236A6742M0502k2275c19185J10162C86738a33674B99418b5673a0B71348Q5464
12225C56812A60880L8880J76321C5252M81603A83202L8547G1492J49697R5995
12215C17184A44406K30866G5758J01553k8250J91745A03779a40520B06342d33754
12204A38064f3788q0922A83168K83197B24670p3348J9174A2012a40873A07192
$$ plain form
12283 -7524 -3210 35114 -96802 89278 385340 34536 21605 375942 150841 116835 5257 422721
12271 422721 -60939 127946 -282574 -68445 -37718 184283 220331 241642 43478 150658 -100433
12259 724 -85472 -87080 28001 -307539 490307 -87338 -178888 245182 -226363 -95189 -223248
12248 -223248 133136 214928 139243 199022 173001 10730 -68864 156863 -234634 -212679 354119
12236 16742 57244 34969 -319185 -209023 386738 -133674 299418 -25673 -10 271348 356812
12225 356812 160880 199760 376081 35252 516855 183202 221749 71492 221189 317184
12215 317184 144406 375272 75758 177311 149061 340806 103779 -140520 206342 -433754
12204 138064 -63788 -144710 183168 466365 224670 151322 170496 12012 -140873 107192
12193F3888O0685g5944J753B66054n7899J78761a47540B40449l4581a85904g86
12181B51173l3878J27768E4019L47208A52336J65160E1674O2856K24333q4232
12171B54631o3001J63884j63999j7078a05004D09587A72731J5299J11323m2616
12161B56737A27726Q413E4932a5060A20588k7614d6840I0532c2113A35636J24300
12150B59936a00666E5385i3490o2198A28743M61161B39705b7149A60207D5838
12139G890a02144E4048P3266K04700f6335A65326e4681n4313E9790L14673A78319
12127A85720k9894b38928J01025B87502K7180A31067h3577r5687c4812C6666a95424
12115C47557a02378A64449b93957B6921j2410J21787J64910a04301A69619D2317
$$ plain form
12193 63888 124573 -75944 -74191 266054 208155 386916 -147540 240449 205868 -185904 -786
12181 251173 217295 345063 54019 401227 152336 317496 51674 114530 338863 254631
12171 254631 191630 355514 191515 174437 -105004 409587 172731 188030 299353 256737
12161 256737 127726 136139 54932 -15060 120588 92974 -46840 90532 -32113 135636 259936
12150 259936 -100666 55385 -93490 -155688 128743 589904 239705 -27149 160207 45838
12139 7890 -102144 54048 127314 332014 -66335 165326 -54681 -108994 59790 374463 178319
12127 185720 155826 -238928 -137903 287502 314682 131067 -83577 -179264 -34812 36666 -195424
12115 347557 -102378 164449 -293957 26921 14511 136298 301208 -104301 169619 42317
12104I8014K1502c6332j99852A00978c93493J92986A63038b50828O2681O100N7805
12093a24242A11468b36172j2090R5870G7142F498a56606B12447o5358a41016O0636
12082h0380D1848a18769c6107D43047b19652K5806C9648K1722m993c29267E8527
12070B24344J54803A23960Q7642b3123C30190P48499N30884p16906B66508c04086
12059E2430B4338J17218a71043k1025A78012D7730K41201l7950b3817l78898a44193
12047a47252C22695j41310a79509A21236k8891J8002B9794J81140b49006A36860
12036a21331k19719a54495C11078A27723C1254P2574d9211k19397K5504n4142
12026b97246A52107f4283E2216J71261a31557A83634Q3246a78962N0063B62531
$$ plain form
12104 98014 119516 -36332 -236184 100978 -393493 -200507 163038 -250828 -188147 -182047 -124242
12093 -124242 111468 -236172 -248262 -152392 77142 6498 -156606 212447 147089 -141016 -80380
12082 -80380 41848 -118769 -36107 443047 -219652 -193846 39648 61370 56377 -329267 58527
12070 224344 379147 123960 211602 -23123 330190 1078689 1609573 892667 266508 -304086
12059 52430 24338 141556 -171043 -192068 178012 47730 288931 250981 -23817 -402715 -144193
12047 -147252 322695 181385 -179509 121236 92345 110347 29794 210934 -249006 136860
12036 -121331 -341050 -154495 311078 127723 31254 103828 -49211 -268608 -243104 -297246
12026 -297246 152107 -64283 52216 223477 -131557 183634 266880 -178962 -128899 262531
12015d2288A74156g8802I1017h0492l2328B04417b2307A55970b82146d1784C50155
12003a8479o0059j75767H5898E277i3570C41005F4298L8653a4282I269P8479a58822
11990C76702c48482B81856a76884a1248q3165D45R5911b1039a0516A53150a26883
11978h8997n6745D2073K6059K18340A27577A1320M7287J00320K44472H1909J4678
11967I6587b15958C8580B268N046k684Q146K98985r3675c31357J32676a1047c903
11954A99868K23834H1297b4471F1696L6142J13921n896J21459a1903p1519I7679
11942d8566A64376e8007I6810a0058A41564c93695F7121b61087B21785H2306M3460
11931A25766a1415C59651C9224c6789B72001b6195A25829A4903a02903J7714I05
$$ plain form
12015 -42288 174156 -78802 91017 -80492 -112820 204417 -22307 155970 -282146 -41784 350155
12003 -18479 -78538 -254305 85898 5277 -93570 341005 64298 102951 -14282 9269 87748 -158822
11990 376702 -348482 281856 -176884 -11248 -94413 445 96356 -21039 -10516 153150 -126883
11978 -88997 -145742 42073 68132 286472 127577 11320 58607 158927 403399 81909 96587
11967 96587 -215958 38580 2268 7314 4630 12776 311761 218086 -331357 -198681 -11047 -3903
11954 199868 423702 81297 -24471 61696 97838 211759 205863 327322 -11903 -83422 97679
11942 -48566 164376 -58007 96810 -10058 141564 -393695 67121 -261087 221785 82306 125766
11931 125766 -11415 359651 39224 -36789 272001 -26195 125829 14903 -102903 -85189 905
11919A48298b14940i2026A37458c7319H0266b42687a02259B9767a80045J6497
11909a63548j9414K0831E5496K25389A39763g5348k10515C63903j34626F7440
11898c04769O479J03130B53773b10805A12405j8646b32335e3766I2417c2690E5494
11886C3687a58082C57586e9023J3053H8201c6182A61532f1283I9087b13836G309
11874A29698e66875b66814P0529O1338p4531p141B730J00036a0368j6055j29399
11863a55822A81811a34391R95L9120H0032j9035j3730a07465j6793l02097b1880
11851f1324C0860d4233o1957M0819A3600J28142d4512H8308e9220k61879H8652
11839H2072h6333a0340j73466p3192A488a58346k25759J07985B42690a86031A37990
$$ plain form
11919 148298 -214940 -92026 137458 -37319 80266 -242687 -102259 29767 -180045 -163548
11909 -163548 -182962 -162131 55496 280885 139763 -75348 -285863 363903 229277 67440
11898 -304769 -298290 -195160 253773 -210805 112405 93759 -232335 -53766 92417 -32690 55494
11886 33687 -158082 357586 -59023 -45970 88201 -36182 161532 -61283 99087 -213836 7309
11874 129698 -566875 -266814 -196285 -134947 -209478 -216619 2730 102766 -10368 -26423 -155822
11863 -155822 181811 -134391 -133396 -94276 80032 60997 47267 -107465 -124258 -426355 -21880
11851 -61324 30860 -44233 -106190 -65371 13600 141742 -44512 88308 -59220 -321099 88652
11839 82072 -86333 -10340 -183806 -256998 1488 -158346 -384105 -276120 242690 -186031 137990
11827b03529K2211c0138B85422a98090L6893l0973e3565c981A66338a49095k1544
11816a70639G1411a62860A8645c66219a52135I6619j0256R0833a05260G2789a73455
11804d6714G412i8874j2024C30057K2536e197j42713A04270b18853A60607c59427
11792B27391A6702O6640J48656E1728i0545a2013A17812m1546b00930G7457h2565
11780A67622L47823I0960J17410B7717c21336k5228b3129A1110J85458g4497a0681
11768a3676k4996j65375J1778A32826a3312l12220h169j99971A00695d41808J92718
11757b49090g4966E7006b8875A81243H8084P5009i111E6643P6650K03997a94529
11745B14016F7488c7063A18116D4086J72754a02078A76321c28453J29646A72336
$$ plain form
11827 -203529 -181318 -30138 285422 -198090 -161197 -192170 -53565 -3981 166338 -149095 -170639
11816 -170639 71411 -162860 18645 -366219 -152135 96619 86363 177196 -105260 72789 -173455
11804 -46714 7412 -98874 -110898 330057 352593 -5197 -147910 104270 -218853 160607 -359427
11792 227391 16702 83342 231998 51728 -90545 -12013 117812 76266 -200930 77457 -82565
11780 167622 515445 90960 208370 27717 -321336 -346564 -23129 11110 196568 -74497 -10681
11768 -13676 -38672 -204047 -192269 132826 -13312 -325532 -8169 -208140 100695 -441808 -249090
11757 -249090 -74966 57006 -28875 181243 88084 163093 -9111 56643 133293 337290 -194529
11745 214016 67488 -37063 118116 44086 216840 -102078 176321 -328453 -198807 172336
11734B68192c5875A18047C1455J441b37965F6574a55212K1294n6841A42132b42662
11722a331r4022E2802a30813G4747K6539i7436b8780l39303R2189i061A88276
11710a94358C2320a87629b222B88553b94220f7476A5842a03527C89749j25076
11700B64673G5583k8411J19809p8682f1295q1529B61779a83165G0250K23844A01424
11688H3448c9191A46761m1049J02582b49169B4320L66636A71621n1312k4799r035
11677H6475L10505a08817B97091j22559k769c49365D7831J58250a40062A74846
11666A90328f1934A25176N355L99800E5085O6946a86385j8691A37454R383N3537
11655B00374e4486B60502A8020L14860j31980d280j54356L0152A5519L9617A2431
$$ plain form
11734 268192 -35875 118047 31455 32896 -237965 66574 -155212 -133918 -190759 142132 -242662
11722 -1331 -95353 52802 -130813 74747 101286 -97436 -28780 -368083 -275894 -9061 188276
11710 -194358 32320 -187629 -2222 288553 -294220 -67476 15842 -103527 389749 264673
11700 264673 75583 47172 166981 88299 -61295 -142824 261779 -183165 70250 294094 101424
11688 83448 -39191 146761 105712 208294 -249169 24320 390956 171621 120309 95510 86475
11677 86475 396980 -108817 297091 174532 171763 -349365 47831 206081 -140062 174846
11666 190328 -61934 125176 130531 530331 55085 122031 -186385 -205076 137454 146837 200374
11655 200374 -54486 260502 18020 332880 200900 -4280 -158636 -128484 15519 55136 12431
11643B59635I7292a29437F2065A0810J66836N7938G9312c0691j48867g0407F3557
11631A96393a87204F7160c40374i6752a0295A79241d3437A64600B9208a23692
11620f8429A65071F564a30261A22441m7285L14589A312L72421b7419k9841A87582
11608B33189d92623J92044a8210e994E3437a24766J4747b6356l9038n2280B3384
11596F3129J20596m3144b96677C4932a81117A65849a92216m0300C68623A78742
11585e6014G1675a42297A3691L9766b50059C58943A25204J92902A19467M119K04175
11574C27761p8616a59631A77186N790f2282E6362J45417k498a16240h048A18196
11562A96530a34129M1016B21097m5088o0529n0593i9582F0046j481J27139K9315
$$ plain form
11643 259635 97292 -129437 62065 10810 177646 235584 79312 -30691 -179558 -70407 63557
11631 196393 -187204 67160 -340374 -96752 -10295 179241 -43437 164600 29208 -123692
11620 -68429 165071 6564 -130261 122441 75156 389745 1312 373733 -27419 -57260 187582
11608 233189 -492623 -300579 -18210 -5994 53437 -124766 -110019 -26356 -65394 -117674 23384
11596 63129 183725 140581 -296677 34932 -181117 165849 -192216 -232516 368623 178742
11585 -56014 71675 -142297 13691 53457 -250059 358943 125204 318106 119467 123586 327761
11574 327761 249145 -159631 177186 182976 -62282 56362 201779 199281 -116240 -8048 118196
11562 196530 -134129 -93113 221097 176009 115480 64887 -99582 60046 58565 185704 215019
11551B15019a53772b0995H6264b44288B15569N0800L6384N1398h9470A09237J96727
11540C05964j46370a03229k07201a1712A97264C7402J49223L2407J05022A04371
11529B54664q4653C0956L41587H4642d4493D5716J78360a13010D68971j12435
11519C56536A07481J79880Q3838j00536K64667A25941b89409B69184C351J64736
11509A68087n6722K16074E9662K01207d5434C97460i6728A7661J71835c1896a512
11497d7262B47460A23014c9184R887C39190R4820a35807B04243b19717C41848
11486A33690J51417j21195r492e3927D37436j78322j07735J02703R6679a17145
11475B5836K14502G1116K56746b4545A72143b10302G2074b78766B24017d4261
$$ plain form
11551 215019 -153772 -20995 86264 -244288 215569 266369 302753 354151 -89470 109237 305964
11540 305964 159594 -103229 -310430 -11712 197264 37402 186625 219032 324054 104371
11529 254664 170011 30956 372543 84642 -44493 45716 224076 -113010 468971 356536
11519 356536 107481 287361 371199 270663 535330 125941 -289409 269184 3351 168087
11509 168087 111365 327439 59662 260869 -45434 397460 -96728 17661 189496 -31896 -1512
11497 -47262 247460 123014 -39184 -29297 339190 434010 -135807 204243 -219717 341848
11486 133690 285107 163912 154420 -53927 437436 259114 151379 254082 350761 -117145
11475 25836 240338 71116 327862 -24545 172143 -210302 72074 -278766 224017 -44261
11464e3130F9971K30172o2113A00754J35305q8335j1732a57627O5538C20367J1680
11453C32047o3614J2498f9232l1102J7382l53835B55677d2940q3027B83656P2988
11442C56644L312E7835C389J81010J23136e2503A54247c2198k16858I6956a18453
11430B22694b54198A5598M6769a24255I3950J06629d5872N974j42833C9250j7281
11419B1969a82201B78046f6625A32009J54373b64381B11719a82353B62220q4849
11409A77371a4497B09017H6528O0054P4862a39114M7510A1712c77537a27992E5799
11397H1206J7131d745r8050d5105n5242B5297J13403a11242A36804J1846O7552
11386B16202m7249a21487p7990j22151C48208A64119J19833b27007k05008a48153
$$ plain form
11464 -53130 69971 300143 238030 100754 236059 147724 135992 -157627 -92089 320367 332047
11453 332047 268433 280931 -69232 -100334 -82952 -436787 255677 -42940 -125967 283656 356644
11442 356644 359956 57835 3389 184399 307535 -52503 154247 -32198 -249056 96956 -118453
11430 222694 -254198 15598 62367 -124255 93950 200579 -45872 -39898 -182731 39250 21969
11419 21969 -182201 278046 -66625 132009 286382 -264381 211719 -182353 262220 177371
11409 177371 -14497 209017 86528 146582 221444 -139114 -91604 11712 -377537 -127992 55799
11397 81206 98337 -4745 -102795 -45105 -100347 25297 138700 -111242 136804 148650 216202
11386 216202 168953 -121487 -199477 -321628 348208 164119 283952 -227007 -432015 -148153
11375a53251A59093J20385J8789b82224R8374N6350l014L2695j21703O7557D0375
11363d9420p5459K4710k92378B42858a7127B80008b84107M9094A16258D221f8442
11351b39832R4671b5644B01360a32154I8184g7578B03929a52066A02531J40833
11341B43364b5751k23570a06688G0919b02576h8605J2855L1372C21810F4010i4305
11329A47701M7190L1872a38807M6882k48103a17240j12973A87381K6958b21269
11318B05708d19071E3268h9413m4102F8239a1486k24586H7437g4266j26351N5819
11307a44798k5892C62476R1873a91776h0670F3086J098b5236I0368J73861a4309
11295A63589o5580f9606j64514A4624d2407j26404j168A3988J21722c4344H0266
$$ plain form
11375 -153251 159093 279478 298267 -282224 -183850 -127500 -130514 -97819 -219522 -151965 40375
11363 -49420 -124879 -100169 -392547 242858 -17127 280008 -284107 -235013 116258 4221 -68442
11351 -239832 -145161 -25644 201360 -132154 98184 -77578 203929 -152066 102531 243364
11341 243364 -25751 -249321 -106688 70919 -202576 -88605 -75750 -44378 321810 64010 -94305
11329 147701 194891 226763 -138807 -91925 -340028 -117240 -230213 187381 214339 -221269
11318 205708 -419071 53268 -89413 -133515 68239 -11486 -236072 87437 -74266 -200617 -144798
11307 -144798 -170690 362476 454349 -191776 -80670 63086 64184 -25236 90368 264229 -14309
11295 163589 98009 -69606 -234120 14624 -42407 -168811 -169979 13988 135710 -34344 80266
11283c03821a27225C92535a7589A94449r1569J74615A32748H80J86517L9165a6745
11271B62003q0416d3541j7187B16794g2394n6658M2778K6005k3518P845q3452
11260a59394B66158c11914d6494F253a74874l1400j65721A07970C6005N9028e9572
11248I6206B155R6206a53817d342j79223O0835G4243b1354q8690o465A4699a3175
11235b81708N3703N9918C5304b10469D10743a82558M1065j878J3238m6653A48621
11223H6818A4259P9563a72090f1893h664j55846f9190j94252B04416a8586A04949
11211i5090K5562j06575D8162J57094I330L6867O3099c355o8367K7105B02136
11199a99429L2586A38998b1925D4302b80422M9804e0503o0967b1755C1851H660
$$ plain form
11283 -303821 -127225 392535 -17589 194449 102880 277495 132748 880 187397 226562 -16745
11271 262003 181587 -43541 -60728 216794 -72394 -129052 -86274 -60269 -83787 -75942 -159394
11260 -159394 266158 -311914 -46494 6253 -174874 -206274 -371995 107970 36005 95033 -59572
11248 96206 2155 98361 -153817 -4342 -183565 -122730 74243 -21354 -110044 -116509 14699 -13175
11235 -281708 -228005 -168087 35304 -210469 410743 -182558 -141493 -143371 -130133 -176786 148621
11223 86818 14259 93822 -172090 -61893 -8664 -164510 -69190 -263442 204416 -18586 104949
11211 -95090 -69528 -176103 48162 205256 9330 46197 109296 -3355 -71722 -44617 202136
11199 -199429 -166843 138998 -21925 44302 -280422 -230618 -50503 -111470 -21755 31851 8660
11187B388a53283a26j54399k33011a63274O6164B29896e4974I3949a11146E9384
11175a0215j26838k41795a31869a3894A51369b25832n3179Q6703k55429K12272
11165b35465A9081L72623C4460d9331C2830f9086m676m5456j03712D4024a40795
11153h3352k5493M8788C11880b91305a13614A77101a82789p0144C7842g247m4359
11142e1606j55189c8388a9101j91007C3349g252G5616K75594A24329d9379j51793
11131b01172H6423K051a58878A43419N5592G1146k2109a77082F6798L1872m4744
11120E3926a10584A11626K53290C8294a5125I3123j9228c19635D0326J16260b29687
11108A54002P9857E2637b16087A55240L110b7431F923J34781K11225G4331J49311
$$ plain form
11187 2388 -153283 -126 -154525 -387536 -163274 -97110 229896 -54974 93949 -111146 59384
11175 -10215 -137053 -378848 -131869 -13894 151369 -225832 -279011 -192308 -447737 -235465
11165 -235465 19081 391704 34460 -49331 32830 -69086 -73762 -119218 -222930 44024 -140795
11153 -83352 -108845 -60057 311880 -291305 -113614 177101 -182789 -252933 37842 -7247 -51606
11142 -51606 -206795 -38388 -19101 -210108 33349 -7252 75616 351210 124329 -49379 -201172
11131 -201172 86423 88474 -158878 143419 199011 71146 49037 -177082 66798 98670 53926
11120 53926 -110584 111626 364916 38294 -15125 93123 73895 -319635 40326 156586 -229687
11108 154002 233859 52637 -216087 155240 158350 -27431 6923 141704 352929 74331 223642
11097B23642J16562j41067a40911j8775A32059J12071a3677C08337j48239J04285
11087B64383E9490L62974A94127J48886A37929F4233J50280D1190M00242j87305
11077B54127E272M81778k01916m4790Q4404J59336O17j85178r9729p0836R0924
11066B19882n500L62223k13208R3671J73465k27954J18062r052K06353J49810
11056H67752l84763m5693L91571J68493o4371C88501L45128J61727k44385N0061
11046G01032L8687P4187J79522k97294J61574p9940k55474L81531J50631n06279
11036E48177J45316J0390K58780k19293j15517J95762J4512k22039m6378J73640
11026G43350J00162J75711m06054J87206k55516K17664j80207Q4058L14914m34025
$$ plain form
11097 223642 340204 199137 -140911 -159686 132059 244130 -13677 308337 160098 264383
11087 264383 59490 422464 194127 343013 137929 64233 214513 41190 441432 254127
11077 254127 5272 487050 285134 240344 324748 484084 484701 299523 199794 128958 219882
11066 219882 214382 576605 363397 457068 630533 402579 520641 511589 717942 867752
11056 867752 482989 437296 828867 997360 932989 388501 733629 895356 650971 701032
11046 701032 739719 813906 993428 696134 857708 777768 522294 903825 1054456 548177
11036 548177 693493 703883 962663 743370 627853 823615 838127 616088 569710 743350
11026 743350 843512 1019223 613169 800375 544859 762523 582316 666374 981288 547263
11016E47263J31801M3522k13957R5388L60753q8949j73101K25847l44106R4493
11006F78954J89276k90819L20793l77907K39174O2644l7937j10343O6210J09443
10996H49488j97092L3299L13633B96465L52178K78536k26449K54071n1258j98186
10986G05357L18942j09062K07568M2006j27627J42144k0204K04178K56978M49214
10976B069494L7315J79392J91327K29440K46915J60334j1497l48845L48527l14057
10966B788345j74348m31236j19521m49754J18848L6847P0156L30793k08800n6559
10956A904771J87842m92472k45511N24330l54888l14481j53262l35420q7038l1112
10946F02759j31852l2637A97524K23165L8414j47393J47308B3213P3233B7335
$$ plain form
11016 547263 679064 722586 508629 604017 964770 875821 702720 928567 584461 678954
11006 678954 868230 577411 898204 520297 759471 822115 784178 673835 740045 849488
10996 849488 652396 685695 999328 296465 648643 927179 700730 954801 903543 705357
10986 705357 1024299 915237 1122805 1164811 1037184 1179328 1159124 1363302 1620280 2069494
10976 2069494 2106809 2286201 2477528 2706968 2953883 3114217 3102720 2753875 3102402 2788345
10966 2788345 2613997 2182761 2063240 1613486 1732334 1769181 1839337 2170130 1961330 1904771
10956 1904771 2092613 1600141 1354630 1878960 1524072 1209591 1056329 720909 633871 602759
10946 602759 470907 438270 197524 420689 459103 311710 459018 23213 96446 27335
10935B10435J48077B7404J22637l5176J8997e8169C3222M7503b1267B86298F5139
10923a10984B7450a97414L4969B17891B2509K66286a91591A68146O3528H4836
10912D9701b58000f2516A72211o0619K5952J41075L7606A7985J5898d6224p8057
10901a24281C5602b76209L7173j2006A28064b98445Q2612e7982k89892P9363A53612
10889H3991K33646c99828B8727A3053a66770j52759B6998K40159G3180c99953
10878c8741k9135l32553C2542b47953J20569j5574B73126r6031b27805B10771
10867B33757c83450B3225a02621j5970A48486a10568J904D2346A8231g2109b333
10855A56195J24372a86992j19245a31515c2899n9122J6578C00797i2779D892a22258
$$ plain form
10935 210435 358512 27404 150041 114865 133862 -58169 33222 80725 -21267 286298 65139
10923 -110984 27450 -197414 -162445 217891 22509 288795 -191591 168146 231674 84836
10912 49701 -258000 -62516 172211 111592 137544 278619 316225 17985 33883 -46224 -124281
10901 -124281 35602 -276209 -239036 -251042 128064 -298445 -215833 -57982 -347874 -268511 153612
10889 83991 317637 -399828 28727 13053 -166770 -319529 26998 267157 73180 -399953
10878 -38741 -67876 -400429 32542 -247953 -127384 -142958 273126 177095 -227805 210771
10867 233757 -383450 23225 -102621 -118591 148486 -110568 -108664 42346 18231 -72109 -2333
10855 156195 280567 -186992 -306237 -131515 -32899 -92021 -75443 300797 -92779 4892 -122258
10843A07336k8977h2809B09694H1494N7801L0389a1987I2294f8459A05504c16247
10831b57947A9094K8481k2665e6516G9689O0992F6468h3182C26921A44966b62564
10819D18601a929A25038B3879J4148J19295a8571A81416B7370J11333a42042A76724
10807a38017O2481B6591P9408a5509A06999b52473C80977A04175C420b04980C4561
10795a34174H9998h1238j27488k036f4639j07155A38645J53901B6079J08863a69807
10783e96991h1999D7545a62038o2041O2705c9395m0565k13185f0901j45130L7317
10772a68714g3050j47029A274L09220F3616a42851l1611H6224k7058a89216n6804
10761b46020A25053b24291i4530a1641E46d02629E19b60765E7814e9558k46351
$$ plain form
10843 107336 78359 -82809 209694 81494 139295 169684 -11987 92294 -68459 105504 -316247
10831 -257947 19094 47575 24910 -56516 79689 140681 66468 -83182 326921 144966 -262564
10819 418601 -1929 125038 23879 38027 157322 -18571 181416 27370 138703 -142042 176724
10807 -138017 -75536 26591 105999 -15509 106999 -252473 380977 104175 3420 -204980 34561
10795 -134174 89998 -81238 -208726 -210762 -64639 -171794 138645 292546 26079 134942 -169807
10783 -596991 -81999 47545 -162038 -224079 -161374 -39395 -79960 -293145 -60901 -206031 -168714
10772 -168714 -73050 -220079 1274 310494 63616 -142851 -174462 86224 59166 -189216 -246020
10761 -246020 125053 -224291 -94530 -11641 546 -402629 519 -260765 57814 -59558 -305909
10750c05909G1515d9841K1956B07448H3111a32488L3237a0078j72117M3558G0494
10738A6030d75878G9090c27997O7496G6252a36266j42606D0160J41015J9095d739
10726a00182a2666j75840F1640R3616b06963C4481a32497a2160k7325J0106E5176
10714a91087o2964a09222K7127b1819I4265b1918k35802j08736C7160N9101b9343
10702d9550j95505A00468b5369m0806l2879A00510Q1473g1565A48441b55788R7264
10691a58524A8494Q1426m412a66453p6054A55584b38080a4439k05987A01253d34090
10679A5431b5635k29697F0150b10939R3147C31163c8857A89816b36897e2475f416
10667a30277K8957q0764b1943G7037b44237R2064B9964L9780c88417a11038J0942
$$ plain form
10750 -305909 71515 -49841 -27885 207448 83111 -132488 -99251 -10078 -182195 -138637 70494
10738 16030 -475878 79090 -327997 -260501 76252 -136266 -278872 40160 181175 200270 -4739
10726 -100182 -12666 -188506 61640 155256 -206963 34481 -132497 -12160 -39485 -29379 55176
10714 -191087 -254051 -109222 -82095 -21819 94265 -21918 -257720 -366456 37160 96261 -29343
10702 -49550 -245055 100468 -25369 -66175 -99054 100510 181983 -71565 148441 -255788 -158524
10691 -158524 18494 99920 95508 -166453 -242507 155584 -238080 -14439 -220426 101253 -434090
10679 15431 -25635 -255332 60150 -210939 -117792 331163 -38857 189816 -236897 -52475 -6416
10667 -130277 -101320 -182084 -21943 77037 -244237 -152173 29964 69744 -388417 -111038 -100096
10656a00096k873B34307G2266c34116G2522c12358M1576i2863H4023J07294a5655
10644c46900J49498j47030A72074g548j03412E3411N6612b93664a23856n6023
10634a79879M6818R713k4597A61117B40a23537d2880j35852d6276o0910j31505
10623b38691R2904O8910k77279B38123a54563n393C61393C6926A0206a21141F341
10611D5565O7313c08307Q2444A06533P2879m428e6805K7056k02560i9083H5327
10599H0256a2029B1053J96894k7267a35020C70129a0362A02722K97410b19638
10588C86296e9478j68679j43823A0151b43491a01431A80441J4397D8114a69445
10577h7149E9269J0478J24468E6870b07632M6601A00672A0795b46371A49078b71690
$$ plain form
10656 -100096 -102969 234307 72266 -334116 72522 -312358 -270782 -92863 84023 191317 -15655
10644 -346900 -197402 -344432 172074 -7548 -110960 53411 110023 -293664 -123856 -179879
10634 -179879 -133061 -123348 -147945 161117 240 -123537 -42880 -178732 -46276 -107186 -238691
10623 -238691 -145787 -76877 -354156 238123 -154563 -159956 361393 36926 10206 -121141 6341
10611 45565 112878 -308307 -225863 106533 179412 174984 -56805 -29749 -232309 -99083 85327
10599 80256 -12029 21053 217947 190680 -135020 370129 -10362 102722 400132 -219638
10588 386296 -59478 -228157 -371980 10151 -243491 -101431 180441 194838 48114 -169445
10577 -87149 59269 69747 194215 56870 -207632 -161031 100672 10795 -246371 149078 -271690
10565A27654c61600J10540i4150A42744F2406K50017E9168L5179b6750j47355
10555a74105o2435P1796h1257j17953A41415K45403a8190j53559A15820A9068
10544A8278b92473J37216l2471N6687D7703c9536F442c2498k21959i3484E3505
10532d084l52128a70856L1886B94725E6621h1766b9512j39285j30205J11258a3195
10520A11738p045k6345j6041d903r7860B04186J1804R1262C5215R684c0645l065
10508c3710A27927d2844K858H7085a85493B2270K16254F2056c29689g424B372
10496C7597J35772e3172F6419Q3185O7641F5906a57372q8711A18443b4516A59814
10484A76526n8713J79500K53591I2010K06794A33847J20167a03651E14883G6676
$$ plain form
10565 127654 -361600 -251060 -94150 142744 62406 312423 59168 94347 -26750 -174105
10555 -174105 -236540 -164744 -81257 -199210 141415 386818 -18190 -171749 115820 19068
10544 18278 -292473 -155257 -187728 -131041 47703 -39536 6442 -32498 -254457 -93484 53505
10532 -4084 -356212 -170856 -138970 294725 56621 -81766 -29512 -168797 -299002 -187744 -13195
10520 111738 104693 78348 62307 -4903 -102763 204186 215990 307252 35215 44899 -30645 -33710
10508 -33710 127927 -42844 -39986 87085 -185493 22270 238524 62056 -329689 -7424 2372
10496 37597 173369 -53172 66419 149604 217245 65906 -157372 -246083 118443 -24516 159814
10484 176526 117813 297313 550904 92010 298804 133847 254014 -103651 514883 76676
10473A08872Q306a7326b099k91174H0811N5308k4305b82241A82763k4775E2991
10461b38158b7429A27898n3228K4553a61699O081A67901P1158a44465I2911a37951
10449B2299J10944F0966A1809c83346J80671A09583K4827a51571A15409J87853
10439C03262a95735g322A55822e4197j20100J9913A06584a5734b220l7853k24696
10428b64769f5980k32412A289a91562C4783J21567p4905h3684l8966A42205M1017
10417A83222b29373k0691C45035A71214o1837J08827c6227I8006l0714d46354
10406f4795j23381E102L85175b53708A51234f3080r4459A2978K50969m7137d726
10394B12561A3564a16845A8486P6503b73192B93281A3101J10641J22393K7325
$$ plain form
10473 108872 117178 -17326 -2099 -293273 80811 136119 111814 -282241 182763 157988 52991
10461 -238158 -27429 127898 74670 99223 -161699 -155618 167901 239059 -144465 92911 -137951
10449 22299 133243 60966 11809 -383346 -202675 109583 134410 -151571 115409 303262
10439 303262 -195735 -7322 155822 -54197 -174297 -154384 106584 -15734 -2220 -40073 -264769
10428 -264769 -65980 -298392 1289 -191562 34783 156350 81445 -83684 -122650 142205 183222
10417 183222 -229373 -250064 345035 171214 109377 218204 -36227 98006 67292 -446354
10406 -64795 -188176 5102 390277 -253708 151234 -63080 -157539 12978 263947 216810 -4726
10394 212561 13564 -116845 18486 94989 -273192 293281 13101 123742 246135 273460
10384B73460b44864D25087I5815B0494Q4037R1067l8325J69910A07865l0061J49809
10373B27613K03525n5774j18519O9740J47111q8012N2995l0809j20586J92991
10363D80275j88059K13142O5787B20001L67727k75040J08328C8080K47680r4357
10353A91403O17107B18043H3092K41934J46499J75792A71436M72936j55729j32933
10343C55710M28737C23794g7409A03892L7180K19488N9255A91678D2243J4952
10333E7195q82J51717h4045C54998H0498A8488K0201J04265B3027L68184A59584
10321D08209A5734L54263h9016C2338K1150Q7438a3473I1532O7473O7981b43522
10309c45246I5075B5658g3636E4093g7526j25145R7858j67208d3385A47809p0142
$$ plain form
10384 273460 -244864 425087 95815 20494 104531 195598 157273 327183 107865 77804 227613
10373 227613 431138 375364 256845 326585 473696 385684 438679 407870 287284 480275
10363 480275 292216 505358 571145 220001 587728 312688 421016 38080 285760 191403
10353 191403 808510 218043 83092 325026 471525 647317 171436 644372 488643 355710
10343 355710 784447 323794 -77409 103892 141072 360560 419815 191678 42243 57195
10333 57195 56313 208030 -84045 354998 80498 18488 38689 142954 23027 391211 159584
10321 408209 15734 369997 -89016 32338 53488 140926 -13473 91532 159005 226986 -243522
10309 -345246 95075 25658 -73636 54093 -77526 -202671 -104813 -272021 -43385 147809 77667
10298G7667C0451Q063J15940c11868A45756A6265J5117R0540a39844A6282M0702
10287E6984J37340P9449g1936j16861I9472h4358c7890A5048R1935Q6183c267
10275c07821R3879l4849A12185k8646i6823j47694N3236I833h8336A91280J27985
10264C19265D800R0037b4849A31124o3100K73698K66740k62884m9167j37700g4223
10252C13278a18092k85467a37287C4953P0534m1396J46168a16073l95977A21626
10241g5544C1864J26238a29556A27343P0170E777i8826G4486a20464j70907I0355
10229b9282j59222A40536C4975a20783A28980g8771j3840j06621M7757B17910
10218a19606j74862o4478a15526r9455d6305m18921J7272a15121j94882G9043
$$ plain form
10298 77667 30451 38514 154454 -311868 145756 16265 31382 121922 -139844 16282 56984
10287 56984 194324 273773 -71936 -188797 99472 -84358 -37890 15048 106983 193166 -3267
10275 -307821 -213942 -248791 112185 83539 -96823 -244517 -191281 9833 -88336 191280 319265
10264 319265 4800 94837 -24849 131124 68024 341722 608462 345578 296411 158711 -74223
10252 313278 -118092 -403559 -137287 34953 105487 64091 210259 -116073 -512050 121626
10241 -75544 31864 158102 -129556 127343 197513 5777 -98826 74486 -120464 -291371 90355
10229 -29282 -188504 140536 34975 -120783 128980 -78771 -92611 -199232 -151475 217910
10218 -119606 -294468 -358946 -115526 -214981 -46305 -465226 -447954 -115121 -310003 79043
10207a47869M0728k14570C1930b06255A1788J25458a87247Q3743l08399a75711
10196a13950c125j84603A25400a2814k04539k5159P7326j42533J45008l14272
10186d76983a6338B47066c6623k1785m0099I439K32435G9273b19569M4170Q3692
10175i1707a4265D4495b82187E0972J30907C2766L5178b91676a11755F8452J64452
10164B32904B9269b08705A25236E8422a98997C3899b0016j65495q6960b8121B28508
10152d12526A71645a16836A0323a03969D4807J90628d84487E2731L39479A12914
10141b89039i2271E2681a85499j58510e3181B15596d0628j95527B69961D3966
10130A00289E052d569A31012O181b32678A00713c13775g3668B6387a55918B6357
$$ plain form
10207 -147869 -107141 -321711 31930 -206255 11788 137246 -187247 -103504 -411903 -175711
10196 -113950 -3125 -187728 125400 -12814 -217353 -242512 -165186 -307719 -162711 -476983
10186 -476983 -16338 247066 -36623 -58408 -98507 9439 241874 79273 -219569 -175399 -91707
10175 -91707 -14265 44495 -282187 50972 181879 32766 67944 -291676 -111755 68452 232904
10164 232904 29269 -208705 125236 58422 -198997 33899 -20016 -185511 -272471 -28121 228508
10152 -412526 171645 -116836 10323 -103969 44807 235435 -484487 52731 392210 112914
10141 -289039 -92271 52681 -185499 -344009 -53181 215596 -40628 -236155 269961 43966
10130 100289 5052 -4569 131012 137193 -232678 100713 -313775 -73668 26387 -155918 26357
10118B66494C3425L5378O0559C2539g0963b8185n08938K35080C27064c6892m2629
10107g9521q884k61644a41908D53649h1150A5100K6746c3065C8789a72897b9827
10095a99032i5063m1269D292a73964h3733B12471b01232A87874i6373k51368d2077
10083F5215c21430J07188c079k69305C8328g1920A9595a64035h424I2182b29513
10071i1996k2598p6010C45946e5868D2835P188N0780N3692c38597a47723J917
10060a45806A0033R1879a54273m9610A55841B9516K51858G8938O9257a22879b0691
10048a51627e4092j02259o4104g9507l02973a49785B87254m3982c86878D8663
10037c73182J59008g2289c3961r9023L3955n4154J1230j65754j33534a27935A0779
$$ plain form
10118 266494 33425 68803 129362 32539 -70963 -28185 -537123 -302043 327064 -36892 -79521
10107 -79521 -88405 -350049 -141908 453649 -81150 15100 41846 -33065 38789 -172897 -29827
10095 -199032 -95063 -136332 4292 -173964 -83733 212471 -201232 187874 -96373 -347741 -42077
10083 65215 -321430 -214242 -3079 -272384 38328 -71920 19595 -164035 -8424 92182 -229513
10071 -91996 -114594 -190604 345946 -55868 42835 50023 100803 154495 -338597 -147723 -145806
10060 -145806 10033 101912 -154273 -203883 155841 29516 281374 78938 148195 -122879 -20691
10048 -151627 -54092 -156351 -220455 -79507 -382480 -149785 287254 243272 -386878 48663
10037 -373182 -214174 -72289 -33961 -132984 -99029 -153183 -141953 -307707 -441241 -127935 10779
10025a6122l42823P9869A6252N694d8195k38140A22674e8208E2107d7227k64492
10014c11719a8196h368m9478j17422c0717B87053c02352A12649m1315f6897I4160
10002A35921b38198A24157A4889N1a09136A13828a78730e7965A99068h6940c9568
9990b44923j11198A85020b89932I1050A8783b34202O2559B33336i6207M7572B77477
9978a33095k20854i5580k98a4819k12902A5863e7774D8171c3928A41481b02772
9966a36860A40290a39750k58186a31557L0193B8959c37882Q3585F0214d51227
9955C1405h8060m8945p8819f9210o3633r2363J5515a5840j15243D9063i4611j35583
9943b30194a04754b2624B29497g5711R600b4884l84444a08040F5762b37198c6617
$$ plain form
10025 -16122 -358945 -279076 16252 21946 -48195 -286335 122674 -58208 52107 -47227 -311719
10014 -311719 -18196 -8368 -57846 -175268 -30717 287053 -302352 112649 71334 -66897 94160
10002 135921 -238198 124157 14889 14940 -109136 113828 -178730 -57965 199068 -86940 -39568
9990 -244923 -356121 185020 -289932 91050 18783 -234202 -171643 233336 -96207 -48635 277477
9978 -133095 -353949 -95580 -95878 -14819 -227721 15863 -57774 48171 -33928 141481 -202772
9966 -136860 140290 -139750 -397936 -131557 -101364 28959 -337882 -254297 60214 -451227
9955 31405 -88060 -137005 -215824 -69210 -132843 -225206 -209691 -15840 -131083 49063 -94611 -230194
9943 -230194 -104754 -22624 229497 -75711 -66111 -24884 -409328 -108040 65762 -237198 -36617
9931b8085A3562c09534M2510B7900c71513a77368r6624A92198q7836m6005a41168
9919f2718A36514i1944K1806B195b10398J850N5755e6781k14833A22364J87513
9908C09877b9282p3275F3682d8950A54463i1864H0379B5264c98249a84851D6531
9896C34781D8454i3485A900a63764q8536f3422A30912b47469a2734k40501M4956
9885b08279L5333a1827j31202C27119A2860a40814A15241j5841D908b92711A11213
9873b409j51063j36720A11475c02481E7016b21534J00374r5774A0127K37892B3563
9861a58651P5521A05276b93583J32255L701k22p4955h1941k8774D0190d15667
9849c9947j77891A22607D1637b00034A39949b31821f964l02A25048R711J58426
$$ plain form
9931 -28085 13562 -309534 -267024 27900 -371513 -177368 -273992 192198 104362 58357 -141168
9919 -62718 136514 -91944 -70138 2195 -210398 -208548 -152793 -56781 -271614 122364 309877
9908 309877 -29282 -102557 63682 -48950 154463 -91864 80379 25264 -398249 -184851 46531
9896 334781 48454 -93485 1900 -163764 -252300 -63422 130912 -247469 -12734 -253235 -208279
9885 -208279 -172946 -11827 -143029 327119 12860 -140814 115241 99400 4908 -292711 111213
9873 -2409 -153472 -290192 111475 -302481 57016 -221534 -121160 -216934 10127 248019 23563
9861 -158651 -83130 105276 -293583 -161328 -157627 -157849 -232804 -81941 -110715 40190 -415667
9849 -39947 -217838 122607 41637 -200034 139949 -231821 -6964 -7266 125048 134759 293185
9838B93185j30377J24635h3747c5935A28820l2044a73229F7489c03411a47018
9827d1320B67734E016a69204n3400F7051d4322l2056A69453K3447G0372H172g1267
9814b3188k93650b9994j48160k74282C02152C9047g4026b4892j30025k9022j98644
9803c82583e2245G031h0407k17817K6878H0909a11249M8233k17940J38803E6913
9791b17414d335j20527n8807A46498b34534a00982d6222j88346b3203A14274d79408
9779i1799J2343B78563b22949B23190b29508h0416C7340O1664a13429m8044L2908
9768a28565K8431k26673J16948A75635p893i2820A87171a72742P5545c692o9857
9757g3549j4686I3742d3050j46899j00145J28970K3049p7202O7359r8337g0796
$$ plain form
9838 293185 162808 287443 -83747 -35935 128820 96776 -173229 67489 -303411 -147018
9827 -41320 267734 5016 -169204 -222604 67051 -44322 -76378 169453 192900 70372 8172 -71267
9814 -23188 -316838 -29994 -178154 -452436 302152 39047 -74026 -24892 -154917 -183939 -382583
9803 -382583 -52245 7031 -80407 -298224 -271346 80909 -111249 -63016 -280956 -142153 56913
9791 -217414 -4335 -124862 -183669 146498 -234534 -100982 -46222 -234568 -23203 114274 -479408
9779 -91799 -79456 278563 -222949 223190 -229508 -80416 37340 99004 -113429 -161473 -128565
9768 -128565 -100134 -326807 -209859 175635 167742 -92820 187171 -172742 -97197 -3692 -73549
9757 -73549 -88235 93742 -43050 -189949 -290094 -161124 -138075 -215277 -147918 -246255 -70796
9745f0675j01256d6242q9265B75095G5118b46213d8251D3346h9926b7857m11332
9734d39189g9013I3860c55979a04416A43533h3553k238b7106k96312a54006A30950
9722a1580A9433a79230M8116A18420a6785j01277L0907K9036k26874G0784M8130
9711A18914R3138a38145F9779l0000f7429A92856j6620a31347j42342A01590m7162
9700E4428P690R1741a89097A55807a86467g4889J5608A44716a93733q805R7148
9689a05390o9285A49321L2028H8425C291N119R3560c53297j5677R0479n9751A61361
9676g1073D25470a95772Q6254A38668D9485i3365D89351D2681d3241C68160A38767
9664D2667d8359l34983C03883a22695b6579k73097B76291D109b54988f6879k68493
$$ plain form
9745 -60675 -161931 -46242 -135507 275095 75118 -246213 -48251 43346 -89926 -27857 -439189
9734 -439189 -79013 93860 -355979 -104416 143533 -83553 -85791 -27106 -323418 -154006 130950
9722 -11580 19433 -179230 -131114 118420 -16785 -118062 -87155 -58119 -284993 70784 118914
9711 118914 212052 -138145 69779 39779 -67429 192856 176236 -131347 -273689 101590 54428
9700 54428 62118 153859 -189097 155807 -186467 -74889 -59281 144716 -193733 -202538 -105390
9689 -105390 -174675 149321 181349 88425 3291 8410 101970 -353297 -368974 -278495 -338246 161361
9676 -71073 425470 -195772 -109518 138668 49485 -93365 489351 42681 -43241 368160 138767
9664 42667 -48359 -383342 303883 -122695 -26579 -299676 276291 4109 -254988 -66879 -335372
9653c35372B73335l9216f2840E3411a43953O1500c0559A75001m4114O6559c70651
9641G3104c65807a05027j83459h5794C6983b62867B2270b44905l687J06649L5808
9630a06135k3561B21891I1978d3105l17053B24357C758b34724P3493E0106a90221
9618C1982a72244H260J75755a32315j44981g2758q4996L1106q3779g9460j21563
9607b01023o6578a551B18116f359k30868I420a76887F0322J7153f1089j08182
9596a69271f5560J8Q139j81089D49787c48006a71319P1204A9253h4760E4598a72410
9583A9564b7854i578k27642R2232q902J1241a3868A33219a52994B3514d42447
9571A37637a29273A9910J88924a1315B36514C6711b3662j85953g6455r4079K2066
$$ plain form
9653 -335372 273335 234119 -62840 53411 -143953 -82453 -30559 175001 130887 197446 -370651
9641 73104 -365807 -105027 -288486 -85794 36983 -262867 22270 -244905 -248592 -141943 -106135
9630 -106135 -129696 221891 91978 -43105 -360158 224357 3758 -234724 -161231 50106 -190221
9618 31982 -172244 8260 184015 -132315 -277296 -72758 -157754 -126648 -210427 -79460 -201023
9607 -201023 -267601 -1551 218116 -6359 -237227 9420 -176887 60322 77475 -61089 -169271
9596 -169271 -65560 -65542 -57403 -238492 449787 -348006 -171319 -100115 19253 -84760 54598 -172410
9583 19564 -27854 -9578 -237220 -144988 -153890 -142649 -13868 133219 -152994 23514 -442447
9571 137637 -129273 19910 208834 -11315 236514 36711 -23662 -209615 -76455 -170534 -148468
9560a48468j55958J11835Q377P6723B05009b1197k19762M7554N5741L4965G2814
9548A44449a35338C94476f3867B24392j2933H4207f5939I9217a44670A42196d17162
9536c64987O681B09970a30709B74713B4466h1760r3011A3314J75507a67099A01118
9524B70503i6235K9742j20579L1697I1122j1654A2347e7555j57804j93597A57542
9512B75685c76295A42028j8706e76591b69638O0903A15462b24383l3374B28948
9501A27079c6242A610c0277k65808j3068I3374B8136a69363a0119I2911J22577
9490B15488F5416a40996C6237a75767P6872A13559c0151D7234b02792Q2854j20475
9479b40413g8477C3691b76045d3729a3746j34103k3234A09343m4843N8373a69316
$$ plain form
9560 -148468 -304426 -192591 -184214 -107491 205009 -21197 -240959 -193405 -137664 -102699 72814
9548 144449 -135338 394476 -63867 224392 211459 84207 -65939 99217 -144670 142196 -417162
9536 -364987 -358306 209970 -130709 274713 24466 -81760 -174771 13314 188821 -167099 101118
9524 270503 -96235 -66493 -187072 -155375 91122 79468 12347 -57555 -215359 -408956 157542
9512 275685 -376295 142028 123322 -576591 -269638 -208735 115462 -224383 -257757 228948
9501 127079 -36242 1610 -30277 -296085 -309153 93374 28136 -169363 -10119 92911 215488
9490 215488 65416 -140996 36237 -175767 -98895 113559 -30151 47234 -202792 -119938 -240413
9479 -240413 -78477 33691 -276045 -43729 -13746 -147849 -171083 109343 64500 122873 -169316
9467a98942m4892A20096C0297b94717A59245a4168j33344a2773j20811J1353D0412
9455f7490a54k07634e2727A43808a56119A65644c72259J70638H0298a30354C14652
9443c43207e2524j07600G0320a42702j1637K5355M9391k90902C11858a68315B302
9431D8583b67469a07806j1287k7782j00910D3755K43147b97210B25638g0554B13563
9419f1827B74471a84854q3575F4854B413J53972a07237b1365I4904a11953B49547
9407h0001F8389c96625G4593c6584l42362I5759J37115d3631j18561b4850m6952
9396g1802B41637A9589a34430A94108G2763a516k36186F9135M37514B2806Q387
9385C1193J17714c8191A50183F8578c85685a29512b2150l15771B4883b1155G64
$$ plain form
9467 -198942 -243834 120096 30297 -294717 159245 -14168 -147512 -12773 -133584 -122231 40412
9455 -67490 -154 -207788 -52727 143808 -156119 165644 -372259 -201621 80298 -130354 314652
9443 -343207 -52524 -160124 70320 -142702 -154339 -128984 -79593 -370495 311858 -168315 2302
9431 48583 -267469 -107806 -119093 -146875 -247785 43755 286902 -297210 225638 -70554 213563
9419 -61827 274471 -184854 -268429 64854 2413 156385 -107237 -21365 94904 -111953 249547
9407 -80001 68389 -396625 74593 -36584 -378946 95759 232874 -43631 -162192 -24850 -71802
9396 -71802 241637 19589 -134430 194108 72763 -1516 -237702 69135 506649 22806 31193
9385 31193 148907 -38191 150183 68578 -385685 -129512 -22150 -337921 24883 -21155 764
9373f6991k875j05790P8886k59605a09076j80620C8396b86103G1297b60091O2067
9362a98024B28348a97297M3305a2455l06771e5872j40609g5229B74988Q1701a67575
9350D6857h2559B90872c38500a44559M2669l29318J84946B04634f1167G2965a0125
9338g5957A8484b60075B69345a91676e6029j10543b454k2020j60881E3985b00201
9326a37093j39382J18084j26807Q9681J9753P9662B00156M7363j1469g1969j63593
9315b35562i3871q6465f4098k7901k14415Q6787F7587d2497j89774B7224b5874
9303C76006h9547K0450A43741l5048f6368I2223a13905D4600J64311b17986O4003
9292a53983D2625b2714B40185m2688i7049i610F846a21250a1173p6363k99896
$$ plain form
9373 -66991 -69866 -175656 -96770 -356375 -109076 -289696 38396 -286103 71297 -260091 -198024
9362 -198024 228348 -197297 -153992 -12455 -319226 -55872 -196481 -75229 274988 356689 -167575
9350 46857 -82559 290872 -338500 -144559 -101890 -431208 -246262 204634 -61167 72965 -10125
9338 -75957 18484 -260075 269345 -191676 -56029 -166572 -2454 -24474 -185355 53985 -200201
9326 -137093 -276475 -158391 -285198 -195517 -175764 -96102 200156 247519 236050 -71969 -235562
9315 -235562 -93871 -180336 -64098 -91999 -306414 -219627 67587 -42497 -232271 27224 -25874
9303 376006 -89547 -69097 143741 108693 -66368 92223 -113905 44600 208911 -217986 -153983
9292 -153983 42625 -22714 240185 197497 -97049 -9610 6846 -121250 -11173 -87536 -387432
9281c87432D133b43136j90837a77782m4857b5939k9224b6407B13924C1196j307
9270B9889b71269C24965d5873j02054f7372j44051F5232B9755h0517j08140i0586
9258E5037k1056P912a22249A3422O2096e0280A87332L4189l8102f9587D6615L880
9246E0495k1308a82172h6837B10577a58470n0282A21271E2397R414K86146F9907
9234a55928J8706k93535Q4384I4866O9622b90564A33653i364H1100d99640A14449
9222c25150b0723A22212J6634K7830a15864P23C318O0569b71377B32658C242b79647
9209A31583J1988b77718d0680j72734a1909n98980F361a97245c6399G167c06291
9197c4894j39938L7612A50142B4913b15466d736J938A66050d2066j3184o7532
$$ plain form
9281 -387432 4133 -243136 -433973 -177782 -222639 -25939 -55163 -26407 213924 31196 29889
9270 29889 -271269 324965 -45873 -147927 -67372 -211423 65232 29755 -80517 -188657 -90586
9258 55037 33981 41893 -122249 13422 75518 -50280 187332 221521 183419 -69587 46615 50495
9246 50495 29187 -182172 -86837 210577 -158470 -208752 121271 52397 61811 347957 69907
9234 -155928 -137222 -430757 -346373 94866 164488 -290564 133653 -9364 81100 -499640 114449
9222 -325150 -20723 122212 138846 166676 -115864 -115141 3318 63887 -271377 232658 3242 -279647
9209 131583 143571 -277718 -40680 -213414 -11909 -610889 6361 -197245 -36399 7167 -306291
9197 -34894 -174832 -137220 150142 24913 -215466 -4736 -2798 166050 -42066 -55250 -122782
9186a22782a5253q7950K6532E5083K4870b23314P5451C3476c54341d1187r5617
9175a36804L4674g6A98257E917b48571B40514q2981b3727A43837a58709c1953
9163h4428j17987l8381j23082a59694l08744a23144L9876A3028L052L4537b86633
9151b85223g468A57327a0998B81153l5162B6950c7278k54977R7525p1259E6518
9139B34041b2593j32786f9629j84168h9155C5322a16130A55613l0351e9171B39278
9127b77704h7029m7656n9768j62282g4706A46429o7330b73737b8437k5931H6990
9115A14808C9877b43027d0188m6117c3067D174a40758F396J07433b33674B60585
9103I6794A7343d48590a24922o5542O4645A52661b29847c1526k92702G297a54549
$$ plain form
9186 -122782 -15253 -103203 -76671 55083 79953 -223314 -147863 33476 -354341 -41187 -136804
9175 -136804 -102130 -76 198257 5917 -248571 240514 157533 -23727 143837 -158709 -31953
9163 -84428 -202415 -240796 -363878 -159694 -468438 -123144 -83268 13028 16080 50617 -286633
9151 -285223 -7468 157327 -10998 281153 245991 26950 -37278 -292255 -194730 -265989 56518
9139 234041 -22593 -155379 -69629 -253797 -89155 35322 -116130 155613 125262 -59171 239278
9127 -277704 -87029 -134685 -194453 -356735 -74706 146429 79099 -273737 -28437 -54368 86990
9115 114808 39877 -243027 -40188 -86305 -33067 4174 -140758 6396 113829 -233674 260585
9103 96794 17343 -448590 -124922 -190464 -125819 152661 -229847 -31526 -324228 7297 -154549
9091A61020a46726C7504e091B8458f6785D2917J89251e1921B19467d9904c718
9079h7930A41135f9545A73288b73005a32200B50992b2435j31436A10890l9370
9069G1520c62606D8257a54376B19163o4528B5082a92981B9474e1005m9620A07746
9057A07007b2039l0345H0236l1857a98491e9347j03018B14022j02536a34864K9724
9046a05140k86067h95k10633C5591L32552A74071a13927j23281D2075a68482m8201
9035b16683Q0762m2454A34238b99796D4947a06036m0990p8573Q7477k7468k8579
9024a94169j14984a03138B7021c30431J17822A35061r425P2549a80662k13850
9014c94512B71894f0521B3519O5979J20891a74979A14482B007b29310A31535a44671
$$ plain form
9091 161020 -146726 37504 -5091 28458 -66785 42917 232168 -51921 219467 -49904 -3718
9079 -87930 141135 -69545 173288 -273005 -132200 250992 -22435 -153871 110890 71520
9069 71520 -362606 48257 -154376 219163 154635 25082 -192981 29474 -51005 -100625 107746
9057 107007 -22039 -52384 80236 48379 -198491 -59347 -162365 214022 111486 -134864 -105140
9046 -105140 -391207 -895 -211528 35591 368143 174071 -113927 -237208 42075 -168482 -216683
9035 -216683 -135921 -178375 134238 -299796 44947 -106036 -147026 -225599 -138122 -165590 -194169
9024 -194169 -309153 -103138 27021 -330431 -212609 135061 125636 198185 -180662 -394512
9014 -394512 271894 -60521 23519 89498 210389 -174979 114482 2007 -229310 131535 -144671
9002G8986j8971f9713o5044A4316J7142c2304m8655j0864A18941I608a5413j15686
8990a31099D9899a02609j31042b2125I1893b49349c8482n967j03673B55948j0620
8979B45328a70337e422k74233F657b27298R9998l5630a0621A29907b02557H2595
8967b73918J16012b1911l71943J35564a09713m2144o6890L5028a3974k57079M5429
8956b25624L8628c0942B5774K27936r4488a12079M4521C21176a58445B52881j06157
8945A46724b09507h6274D887e2245a122j7623A39257a01849j77387G2010J10667
8934A82677c5528l93838c755A83140c6311j3043A65775K57325D1300K52786N36989
8923H31075J000707K789735M569014B487828H21121A68496p4983b6760I9657m9040
$$ plain form
9002 78986 60015 -69713 -134757 14316 31458 -32304 -80959 -91823 118941 9608 -15413 -131099
8990 -131099 49899 -102609 -233651 -22125 91893 -249349 -38482 -44449 -148122 255948 245328
8979 245328 -170337 -5422 -279655 6657 -227298 -127300 -162930 -10621 129907 -202557 82595
8967 -273918 -157906 -21911 -393854 -258290 -109713 -151857 -218747 -183719 -13974 -271053 -225624
8956 -225624 -186996 -30942 25774 253710 159222 -112079 -67558 321176 -158445 252881 146724
8945 146724 -209507 -86274 4887 -52245 -1122 -18745 139257 -101849 -279236 72010 182677
8934 182677 -35528 -429366 -3755 183140 -36311 -49354 165775 423100 41300 294086 831075
8923 831075 1831782 4621517 9190531 2487828 821121 168496 93513 -26760 99657 50617
8913E0617e223j27219n0156A6559L7524a10912G6124c45611J50249D91539a36054
8901d9576B14113M5542d84917d9463B46837C8805d1163r9880A88599g8877K0990
8890e7887Q19j14982m9999l2209a24403j4095I116J22702i3830k9019M8689K7642
8878d6518M197J926I1876e5254j70594h0998p0985H195j083J0957K25979A09397
$$ plain form
8913 50617 -5223 -132442 -182598 16559 54083 -110912 76124 -345611 -195362 491539 -136054
8901 -49576 214113 259655 -484917 -49463 246837 38805 -41163 -141043 188599 -78877 -57887
8890 -57887 -57068 -172050 -222049 -254258 -124403 -138498 9116 131818 -93830 -122849 -74160 -46518
8878 -46518 -42321 -40395 91876 -55254 -225848 -80998 -151983 8195 7112 18069 244048 109397
$$ [...]
##END NTUPLES=NMR SPECTRUM
##END=
