
##TITLE=AC1338_BRAAS10081_6528666_6PwlyEnglJ
##JCAMPDX= 6.0         $$ Bruker NMR JCAMP-DX V2.0
##DATA TYPE= NMR SPECTRUM
##DATA CLASS= NTUPLES
##ORIGIN= BRUKER
##OWNER= Administrator
$$ 1.72 TOPSPIN		Version 2.1
$$ 2012-07-15 16:53:37.750 -0500  Administrator@TOPSPIN
$$ Compression mode = diff/dup
##.OBSERVE FREQUENCY= 400.02188249412
##.OBSERVE NUCLEUS= ^1H
##.ACQUISITION MODE= SIMULTANEOUS (DQD)
##.ACQUISITION SCHEME= undefined
##.AVERAGES= 64
##.DIGITISER RES= 22
##SPECTROMETER/DATA SYSTEM= spect
##.PULSE SEQUENCE= noesygpps1d.comp
##.SOLVENT NAME= COFFEE_meoh
##.SHIFT REFERENCE= INTERNAL, COFFEE_meoh, 1, 14.96115
##AUDIT TRAIL= $$ (NUMBER, WHEN, WHO, WHERE, PROCESS, VERSION, WHAT)
$$ ##TITLE= Audit trail, TOPSPIN		Version 2.1
$$ ##JCAMPDX= 5.01
$$ ##ORIGIN= Bruker BioSpin GmbH
$$ ##OWNER= Administrator
$$ $$ C:\Bruker\TOPSPIN/data/COFFEE/nmr/AC1338_BRAAS10081_6528666_6PwlyEnglJ/12/pdata/1/auditp.txt
$$ ##AUDIT TRAIL=  $$ (NUMBER, WHEN, WHO, WHERE, PROCESS, VERSION, WHAT)
(   1,<2012-07-15 16:53:32.859 -0500>,<Administrator>,<TOPSPIN>,<go>,<TOPSPIN 2.1>,
      <created by zg
	started at 2012-07-15 16:42:02.609 -0500,
	POWCHK enabled, PULCHK disabled,
       configuration hash MD5:
       6B 1B 68 BB D9 2E 58 E2 7F 35 AD 54 07 DF 0E 41
       data hash MD5: 64K
       2D 57 6E 3E 4C 63 BE 9C 3F 3E 65 AF F6 A2 19 F8>)
(   2,<2012-07-15 16:53:35.671 -0500>,<Administrator>,<TOPSPIN>,<proc1d>,<TOPSPIN 2.1>,
      <Start of raw data processing
       efp LB = 0.3 FT_mod = 6 PKNL = 1 PHC0 = 0 PHC1 = 0 SI = 128K 
       data hash MD5: 128K
       89 14 C3 02 6C 88 9D 2C F3 C0 7D A3 2A D9 FD E1>)
(   3,<2012-07-15 16:53:36.765 -0500>,<Administrator>,<TOPSPIN>,<proc1d>,<TOPSPIN 2.1>,
      <pk PHC0 = -1.972046 PHC1 = 0 
       data hash MD5: 128K
       5C DB 7D 9B 70 4B 7A F9 43 62 E2 36 EF 20 EE 03>)
(   4,<2012-07-15 16:53:37.421 -0500>,<Administrator>,<TOPSPIN>,<proc1d>,<TOPSPIN 2.1>,
      <abs ABSG = 1 
       data hash MD5: 128K
       9C 87 BF F3 BE 65 92 F2 B2 4F 98 07 5F 57 04 99>)
(   5,<2012-07-15 16:53:37.500 -0500>,<Administrator>,<TOPSPIN>,<proc1d>,<TOPSPIN 2.1>,
      <abs ABSG = 2 
       data hash MD5: 128K
       B8 96 D8 48 54 78 3A F2 14 B8 8F EC B9 8D 29 97>)
(   6,<2012-07-15 16:53:37.546 -0500>,<Administrator>,<TOPSPIN>,<proc1d>,<TOPSPIN 2.1>,
      <abs ABSG = 3 
       data hash MD5: 128K
       06 65 73 13 3D CC 18 9B 53 C6 3C 6B FE F5 49 0A>)
(   7,<2012-07-15 16:53:37.609 -0500>,<Administrator>,<TOPSPIN>,<proc1d>,<TOPSPIN 2.1>,
      <abs ABSG = 4 
       data hash MD5: 128K
       56 03 A3 DC B2 CF F7 0D CA 96 59 48 B2 7B 3D E8>)
(   8,<2012-07-15 16:53:37.671 -0500>,<Administrator>,<TOPSPIN>,<proc1d>,<TOPSPIN 2.1>,
      <abs ABSG = 5 
       data hash MD5: 128K
       C9 A3 5C DA 05 7B B1 19 83 10 F8 DE 62 2B 02 F8>)
$$ ##END=
$$ 
$$ $$ hash MD5
$$ $$ EC AD 9F 87 2B 9C F1 D2 F3 2E BF 5D 58 B0 B7 DB
##$RELAX= 
##$RELAX= 
##$RELAX= 
##$RELAX= 
##$RELAX= 
##$RELAX= 
##$RELAX= 
##$RELAX= 
$$ Bruker specific parameters
$$ [...]
##$TP07= 0
##$TPNAME0= <>
##$TPNAME1= <>
##$TPNAME2= <>
##$TPNAME3= <>
##$TPNAME4= <>
##$TPNAME5= <>
##$TPNAME6= <>
##$TPNAME7= <>
##$TPOAL= (0..7)
0.5 0.5 0.5 0.5 0.5 0.5 0.5 0.5
##$TPOFFS= (0..7)
0 0 0 0 0 0 0 0
##$TUNHIN= 0
##$TUNHOUT= 0
##$TUNXOUT= 0
##$USERA1= <user>
##$USERA2= <user>
##$USERA3= <user>
##$USERA4= <user>
##$USERA5= <user>
##$V9= 5
##$VALIST= <valist>
##$VCLIST= <CCCCCCCCCCCCCCC>
##$VD= 0
##$VDLIST= <DDDDDDDDDDDDDDD>
##$VPLIST= <PPPPPPPPPPPPPPP>
##$VTLIST= <TTTTTTTTTTTTTTT>
##$WBST= 2048
##$WBSW= 25
##$XGAIN= (0..3)
0 0 0 0
##$XL= 0
##$YL= 0
##$YMAX_a= 12317226
##$YMIN_a= -10035616
##$ZGOPTNS= <>
##$ZL1= 120
##$ZL2= 120
##$ZL3= 120
##$ZL4= 120
##$ABSF1= 14.96115
##$ABSF2= -5.597032
##$ABSG= 5
##$ABSL= 3
##$ALPHA= 0
##$AQORDER= 0
##$ASSFAC= 0
##$ASSFACI= 0
##$ASSFACX= 0
##$ASSWID= 0
##$AUNMP= <proc_prof1d_extract.lims>
##$AXLEFT= 0
##$AXNAME= <>
##$AXNUC= <1H>
##$AXRIGHT= 0
##$AXTYPE= 0
##$AXUNIT= <>
##$AZFE= 0.1
##$AZFW= 0.1
##$BCFW= 0
##$BC_mod= 0
##$BYTORDP= 0
##$COROFFS= 0
##$CY= 15
##$DATMOD= 1
##$DC= 0
##$DFILT= <>
##$DTYPP= 0
##$F1P= 0
##$F2P= 0
##$FCOR= 0.5
##$FTSIZE= 131072
##$FT_mod= 6
##$GAMMA= 0
##$GB= 0
##$INTBC= 1
##$INTSCL= 1
##$ISEN= 128
##$LB= 0.3
##$LEV0= 0
##$LPBIN= 0
##$MAXI= 10000
##$MC2= 0
##$MEAN= 0
##$ME_mod= 0
##$MI= 0
##$NCOEF= 0
##$NC_proc= -2
##$NLEV= 6
##$NOISF1= 0
##$NOISF2= 0
##$NSP= 0
##$NTH_PI= 0
##$NZP= 0
##$OFFSET= 14.96115
##$PC= 1
##$PHC0= -1.972046
##$PHC1= 0
##$PH_mod= 1
##$PKNL= yes
##$PPARMOD= 0
##$PPDIAG= 0
##$PPIPTYP= 0
##$PPMPNUM= 2147483647
##$PPRESOL= 1
##$PSCAL= 4
##$PSIGN= 0
##$PYNMP= <proc.py>
##$REVERSE= no
##$SF= 400.020009575953
##$SI= 131072
##$SIGF1= 0
##$SIGF2= 0
##$SINO= 400
##$SIOLD= 131072
##$SPECTYP= <>
##$SREGLST= <1H.CDCl3>
##$SSB= 0
##$STSI= 131072
##$STSR= 0
##$SW_p= 8223.68421052631
##$SYMM= 0
##$S_DEV= 0
##$TDeff= 65536
##$TDoff= 0
##$TI= <>
##$TILT= no
##$TM1= 0
##$TM2= 0
##$TOPLEV= 0
##$USERP1= <user>
##$USERP2= <user>
##$USERP3= <user>
##$USERP4= <user>
##$USERP5= <user>
##$WDW= 1
##$XDIM= 131072
##$YMAX_p= 400954599
##$YMIN_p= -11066
##$CURPLOT= <Network HP LaserJet P1505>
##$CURPRIN= <$Network HP LaserJet P1505>
##$DFORMAT= <normdp>
##$LAYOUT= <+/1D_H.xwp>
##$LFORMAT= <normlp>
##$PFORMAT= <normpl>
##$SURQMSG= 1
$$ End of Bruker specific parameters
$$ ---------------------------------
##NTUPLES= NMR SPECTRUM
##VAR_NAME=  FREQUENCY,     SPECTRUM/REAL,   SPECTRUM/IMAG
##SYMBOL=    X,             R,               I
##VAR_TYPE=  INDEPENDENT,   DEPENDENT,       DEPENDENT
##VAR_FORM=  AFFN,          ASDF,            ASDF
##VAR_DIM=   131072,        131072,          131072
##UNITS=     HZ,            ARBITRARY UNITS, ARBITRARY UNITS
##FACTOR=    0.0627417313425164, 1,          1
##FIRST=     8223.62146879497, 2178,         -64460
##LAST=      0,             3103,            -64138
##MIN=       0,             -11066,          0
##MAX=       8223.62146879497, 400954599,    0
$$ Real data points
##PAGE= N=1
##DATA TABLE= (X++(R..R)), XYDATA
$$ [...]
65063 157020 159259 160478 160576 160093 159695 159593 159503 159130 158516 157917 157586 157756 158671 160346 162300 163637 163582 162107
65045 162107 160117 158871 158919 159503 159174 157156 154033 151039 148853 147273 145893 144722 144053 143982 144259 144491
65029 144491 144333 143583 142294 140780 139362 138078 136775 135506 134656 134543 135042 135722 136252 136484 136309 135798 135506
65012 135506 136194 137941 139799 140745 140856 141139 142184 143525 144512 145358 146869 149360 152383 155459 158587 161847
64996 161847 164937 167445 169435 171367 173391 174959 175299 174265 172541 170962 169750 168637 167695 167633 169019
64981 169019 171462 174023 176338 178870 181988 185315 188227 190502 192043 192331 190784 187646 183999 180758
64967 180758 177987 175299 172527 169736 166869 163832 160938 158950 158460 159255 160350 160674 159792 158074 156260
64952 156260 154820 153657 152378 150837 149313 148114 147139 146104 145219 145210 146343 147710 148042 147150 146047 145520
64936 145520 145209 144420 143305 142645 142790 143432 144271 145303 146417 147299 147890 148493 149230 149778 149847 149564 149139 148532
64918 148532 147732 147089 146965 147227 147425 147422 147484 147778 148124 148331 148537 149072 150147 151796 154036 156903 160344 164166
64900 164166 168198 172479 177211 182471 188007 193405 198461 203293 208109 212972 217822 222587 227210 231636
64886 231636 235825 239713 243197 246232 249027 251930 255005 257830 259826 260753 260745 259902 257987 254639 249846
64871 249846 244174 238490 233429 229113 225331 221952 219057 216782 215142 214060 213433 213103 212806 212203 210930
64856 210930 208664 205313 201178 196816 192635 188648 184656 180566 176471 172549 169056 166398 164966 164708
64842 164708 164920 164655 163499 161897 160618 159963 159674 159564 159845 160646 161530 161895 161759 161733 162161 162619 162443 161504
64824 161504 160244 159139 158442 158376 159254 161135 163538 165766 167635 169696 172517 175928 179305 182535 186240
64809 186240 190875 196104 201424 206989 213240 219982 226493 232517 238475 244535 250046 254211 256896 258416
64795 258416 258751 257354 253718 248051 241478 235468 230751 226721 222200 216840 211446 206973 203698 201509
64781 201509 200351 199994 199784 199128 198078 197114 196625 196903 198313 201012 204613 208464 212157 215550 218663 221931
64765 221931 226244 232186 239274 246377 252854 258982 265316 271984 278495 284002 287938 290714 293561 297284
64751 297284 301397 304903 307648 310256 312862 314757 315420 315209 314709 313918 312433 310023 306614 302025 296170
64736 296170 289431 282503 275814 269259 262550 255774 249535 244413 240307 236572 232941 229976 228274 227531
64722 227531 226943 226281 225983 226221 226582 226775 227030 227628 228637 230351 233375 237822 242892 247631 251779 255500
64706 255500 258675 260882 261839 261497 259922 257383 254233 250395 245327 238871 231795 225002 218550 212071 205901
64691 205901 201034 197936 196061 194701 193745 193356 193366 193373 193217 193106 193390 194337 196022 198358 201297 204940 209215
64674 209215 213526 217170 220271 223966 229338 236307 243852 251189 258399 265801 273046 279114 283164 285126
64660 285126 285334 283831 280376 275157 269045 262891 256784 250371 243797 237886 233333 230047 227547 225746
64646 225746 225009 225442 226439 227144 227287 227432 228446 230876 234883 240483 247558 255699 264380 273348 282679 292408
64630 292408 302418 312740 323551 334604 344994 353828 360912 366353 369642 369693 365910 358878 349884
64617 349884 340069 330032 319827 309087 297499 285458 274132 264612 257060 250804 245108 239719 234889
64604 234889 231108 228662 227198 225811 223809 221300 218803 216455 214024 211607 209788 208916 208705 208781 209165
64589 209165 209871 210501 210909 211978 214908 219701 225114 230348 236002 242884 250644 258376 266151 274956 285139
64574 285139 295754 305650 314484 322382 329252 334899 339407 342889 345088 345599 344351 341550 337299 331529
64560 331529 324141 315094 304637 293659 283434 274591 266581 258617 250791 243740 237456 231271 225120
64547 225120 220024 216869 215296 214310 213628 213768 214885 216227 216997 217327 218031 219573 221710 224038 226369 228318
64531 228318 228987 227638 224537 220653 216529 212007 207206 203066 200492 199355 198853 198553 198553 198888 199430 200315
64515 200315 201886 204107 206499 208679 210516 211745 212014 211547 211323 212263 214507 217622 221200 225079 229308
64500 229308 234130 239733 245871 252029 258130 264666 271867 279153 285813 291860 297698 303080 306944 308341
64486 308341 307195 304159 300046 295501 290946 286622 282699 279307 276393 273713 271250 269545 269289 270411
64472 270411 271791 272097 270876 268692 266224 263504 260212 256596 253680 252329 252321 252697 252887 253159 254047 255762
64456 255762 258236 261328 264793 268334 271753 274735 276506 276289 274427 272469 271762 272345 273651 275688 278793
64441 278793 282624 286390 290058 294434 299860 305627 311114 316871 324100 333453 344885 358352 374067
64428 374067 392102 412302 434798 460394 490253 525296 565987 612580 665371 724615 790409
64417 790409 862910 942655 1030234 1125336 1226224 1330238 1434516 1535988 1631195 1716971 1791476
64406 1791476 1854127 1904438 1941282 1963291 1969459 1959229 1932631 1890756 1835797 1770232 1695972
64395 1695972 1614218 1525614 1430382 1329032 1223641 1118183 1017037 923081 837367 760119
64385 760119 691359 630776 577814 532118 493499 461303 434318 411500 392463 377007 364524
64374 364524 354143 345307 337866 331727 326635 322263 318256 314135 309336 303544 296992 290340 284132 278376
64360 278376 272733 267108 261830 257189 253065 249238 245902 243570 242490 242409 242914 243758 244886 246411 248587
64345 248587 251551 255001 258422 261693 265173 268987 272512 274862 275728 275396 274037 271354 267112 261788 256500
64330 256500 252274 249417 247521 245984 244555 243479 243189 243822 245027 246207 246974 247386 247752 248264 248849 249349
64314 249349 249738 250108 250480 250703 250547 249920 248994 248051 247133 245921 244073 241599 238707 235396 231565 227538
64298 227538 223967 220941 217580 212995 207475 202284 198412 195933 194505 193914 193982 194403 194976 195757 196783 197890
64282 197890 198998 200421 202678 206146 210916 216770 223145 229398 235316 241226 247404 253592 259334 264642
64268 264642 270000 275732 281609 287134 292004 296135 299317 301065 301060 299720 298031 296615 295146 293021 290479
64253 290479 288574 287964 288040 287417 285009 280606 274821 268672 262875 257320 251435 245147 239144 234118 230135
64238 230135 226906 224175 221633 219040 216792 215765 216074 216548 216114 215203 215025 215817 216788 217533 218433 219618
64222 219618 220594 221216 222079 223438 224492 224352 223235 222119 221591 221510 221459 221073 220105 218624 217019 215578 214278
64205 214278 213182 212661 212871 213321 213420 213210 213143 213356 213656 214055 214818 216012 217446 219136 221386 224305 227588
64188 227588 231048 235202 241061 249226 259191 269724 280085 290717 302377 314632 325747 334252 340013
64175 340013 343378 343912 340832 334419 326151 317334 308213 298515 288262 277858 267888 259056 251820 245863
64161 245863 240342 234929 230198 226691 224125 221900 219969 218602 217619 216538 215443 215059 215783 217108 218245
64146 218245 219028 219988 221770 224640 228300 232019 235179 237890 240903 244669 248650 251743 253246 253164 251862
64131 251862 249866 247891 246494 245502 244175 242169 240018 238504 237910 238193 239466 241809 244830 247983 251276
64116 251276 255191 259886 264934 269903 274796 279866 285379 291619 298689 306269 313983 322052 330914 340074
64102 340074 348053 353876 358007 361304 363777 365099 365793 366908 368716 370761 373197 377080 382911 389607
64088 389607 395361 399059 400504 399776 396993 392508 386801 380043 372026 362628 352343 342286 333514 326133
64074 326133 319164 311537 303204 295071 288033 282449 278384 275747 274064 272734 271770 271823 273156 275053 276557
64059 276557 277420 277926 278235 278504 279341 281391 284473 287733 290847 294504 299386 305099 310628 315672 321026
64044 321026 327563 335275 343608 352396 361926 372105 382163 391497 400348 409192 417794 425384 431510 436058
64030 436058 438570 438411 435795 431892 427585 422709 416906 410618 404756 399840 395957 393121 391137 389522
64016 389522 388142 387533 387993 388729 388627 387489 385653 382727 377821 371107 364089 358005 352739 347653 342718
64001 342718 338350 334779 332082 330343 329272 328143 326601 325203 324723 325276 326492 328191 330393 333058 336292
63986 336292 340473 345620 350927 355576 359843 364771 370866 377682 384581 391284 397736 404155 411322 420146
63972 420146 430651 441898 453088 464273 475845 487939 500673 514446 529500 545589 562495
63961 562495 580575 600343 621864 645056 670361 698563 730106 765201 804592 849664 901632
63950 901632 961056 1028297 1104135 1189872 1287160 1397855 1523658 1665546 1823579 1997224
63940 1997224 2185612 2387530 2601558 2826253 3059747 3298907 3539364 3776645 4006957
63931 4006957 4226507 4430511 4613426 4769994 4895702 4986830 5041090 5058419 5040356 4988243
63921 4988243 4902419 4783364 4633035 4454877 4253180 4033050 3800505 3561672 3321682 3084557
63911 3084557 2853793 2632360 2422167 2224237 2039598 1869565 1714982 1575737 1451310
63902 1451310 1341387 1245544 1162685 1091256 1029914 977659 933445 896008 864099 836663 812867
63891 812867 792129 774065 758239 744055 731021 718920 707535 696498 685811 676295 669028 664396
63879 664396 662122 662148 664897 670568 678839 689506 702919 719444 738909 760964 785542 812519 841322
63866 841322 871491 903383 937698 974352 1012395 1050979 1089760 1128278 1165556 1200630 1233063
63855 1233063 1262668 1289021 1311451 1329202 1341377 1347030 1345576 1336945 1321333 1299201 1271720 1240648
63843 1240648 1207255 1171631 1133461 1093156 1051674 1009453 966277 922324 878681 836495 796002
63832 796002 756742 718484 681573 646528 613650 583035 554735 528816 505350 484380 465796
63821 465796 449161 433745 418853 404300 390579 378424 368080 358936 349979 340649 331288 322810
63809 322810 315903 310467 305768 301232 297075 293947 291886 289903 286896 282885 278945 275942 273704 271566
63795 271566 269336 267327 265564 263412 260189 255962 251547 247795 244984 242915 241275 239805 238296 236692
63781 236692 235231 234232 233691 233181 232191 230470 228138 225695 223873 223164 223391 223990 224674 225469 226107 225987 225062
63764 225062 224233 224380 225379 226530 227554 228448 228699 227550 225165 222769 221386 220954 220843 220646 220236 219595 218945
63747 218945 218684 218903 219342 220035 221449 223666 225896 227368 228383 229887 232156 234474 236106 237135 238246
63732 238246 240030 242590 245628 248783 251944 255226 258661 262135 265707 269725 274381 279392 284347 289139
63718 289139 293801 298186 302202 306158 310364 314462 317614 319405 320192 320482 320312 319392 317517 314736 311301
63703 311301 307621 304128 301095 298706 297258 297004 297748 298841 299760 300570 301735 303603 306134 308984 311758
63688 311758 314335 317028 320274 324107 328046 331582 334630 337391 339938 342092 343619 344334 344075 342820 340942
63673 340942 339206 338330 338487 339275 340150 340881 341615 342611 343923 345274 346201 346465 346369 346504 347023 347339 346726 345054
63655 345054 342643 339591 335754 331313 326763 322165 317065 311487 306419 302701 299823 296572 292771 289638
63641 289638 288291 288546 289411 290236 290959 291680 292549 294033 296757 300866 305722 310446 314692 318781 323137 327847
63625 327847 332920 338664 345430 353036 360887 368768 377118 386348 396377 407196 419398 433555 449284
63612 449284 465642 482354 500024 519061 539127 559894 581757 605322 630548 656856 683770
63601 683770 710948 737649 762665 784905 803747 818755 829385 835237 836490 833856 828171 820249
63589 820249 811098 801863 793143 784432 774569 762780 749025 733385 715602 695483 673410 650164
63577 650164 626559 603508 582101 563098 546527 532182 520291 511155 504357 499086 495259 493666
63565 493666 494722 497670 501381 505513 510496 516680 523896 531698 539681 547654 555750 564403 574090 585117
63551 585117 597635 611737 627564 645431 665769 688723 713969 741255 771024 804000 840080
63540 840080 878052 916325 953185 986071 1011450 1026376 1030309 1025194 1014014 999477 983558 967483
63528 967483 951990 937844 925973 916689 908756 899665 887033 869745 847939 822252 793172 760934
63516 760934 726023 689787 654325 621434 591630 564378 539134 515934 495067 476620 460476
63505 460476 446464 434283 423398 413273 403728 395015 387513 381365 376389 372238 368603 365292 362246
63492 362246 359562 357394 355735 354372 353154 352162 351484 350987 350544 350317 350505 351018 351857 353586 356748 360787
63476 360787 364371 367093 370109 374539 379847 384525 388012 391087 394472 397755 399878 400148 398601 395743
63462 395743 392133 387971 383059 377350 371479 366394 362444 359187 356176 353629 352101 351755 352162 352765 353469
63447 353469 354805 357506 361813 367225 373082 379347 386702 395872 407018 419746 433576 448371 464429
63434 464429 482168 501759 523162 546585 572604 601607 633146 665844 697602 725757 747624
63423 747624 761724 768701 770817 770570 769958 770652 774101 781224 792476 808371 829488 855670 885555
63410 885555 917157 948745 978926 1006249 1029226 1046785 1058462 1064183 1064126 1058914 1049748 1038125 1025325
63397 1025325 1012144 998963 985809 972100 956502 937515 914546 888313 859988 830063 798326
63386 798326 764839 730628 697324 666312 638248 613191 591045 571885 555809 542528 531352
63375 531352 521790 514019 508555 505638 505159 506951 510745 515979 522190 529600 538834 549938 562178 575045
63361 575045 589036 605113 623732 644743 667986 693451 720933 749976 780297 811975 845006
63350 845006 878816 912302 944287 973782 999861 1021515 1037823 1048328 1053142 1052745 1047810 1039276
63338 1039276 1028332 1016075 1003140 989754 975930 961389 945405 927095 906066 882653 857461
63327 857461 830777 802503 772676 742084 712357 685274 661878 642392 626916 615756 608787 604941
63315 604941 602840 601682 600810 598532 592239 580104 562343 540663 517040 493293 471178 452011 436181
63302 436181 423313 412839 404151 396464 389074 381822 375035 368961 363541 358738 354760 351755 349447 347268
63288 347268 344808 342045 339185 336461 334110 332358 331181 330104 328523 326380 324293 322818 321804 320811
63274 320811 319944 319710 319989 319817 318562 316940 316306 317133 318667 320047 321281 322954 325402 328444 331676 334654
63258 334654 336916 338225 338971 340083 342329 345787 350075 354889 360126 365676 371423 377384 383514 389469
63244 389469 395061 400985 408475 417923 428337 438629 449031 460723 474360 489603 505888 522987
63232 522987 540869 559625 579660 601379 624558 648463 672672 697300 722292 747010 770803
63221 770803 793616 815879 838069 860456 882902 904885 926139 947235 968936 990862 1011541
63210 1011541 1029933 1046070 1059690 1069125 1072438 1069206 1060382 1046740 1028372 1005584 979354 950710
63198 950710 920276 888719 857167 826969 799304 775042 754574 737682 723949 713416 706555 703530
63186 703530 703870 707039 713017 722093 734314 749331 766667 785910 806698 828673 851523 875073
63174 875073 899266 923934 948514 972161 994257 1014715 1033676 1051136 1067057 1081547 1094511
63163 1094511 1105150 1112175 1114505 1111507 1102720 1087934 1067703 1043277 1015683 985127 951526 915345
63151 915345 877592 839252 801159 764274 729621 697813 668970 643184 620732 601620 585186
63140 585186 570491 557003 544687 533561 523514 514580 507049 501137 496697 493304 490478 487854 485430
63127 485430 483685 483104 483503 484218 485099 486753 489493 492638 495486 498467 502456 507162 511190 513787 515676
63112 515676 517926 520781 523896 526996 529853 532209 534188 536337 538811 541004 542406 543334 544331 545369 546235
63097 546235 547266 548903 550783 552003 552218 551884 551442 550890 550168 549449 548947 548806 549194 550136 551284 552263 553261
63080 553261 554908 557505 560702 563958 567083 570328 574204 579221 585586 593123 601554 610706 620331 630124
63066 630124 640233 651401 664195 678287 693016 708444 725323 744155 764842 787272 811707
63055 811707 838584 868319 901345 937860 977532 1019807 1064544 1112010 1162320 1215319 1270853
63044 1270853 1328610 1387690 1446893 1505547 1563656 1621264 1678216 1734586 1790771 1846914 1902677
63033 1902677 1957745 2012153 2065895 2118457 2168826 2215699 2257624 2293173 2320879 2338878 2345005
63022 2345005 2337888 2317807 2285924 2242937 2189290 2126531 2057442 1984572 1909550 1834086 1760696
63011 1760696 1691792 1628706 1572135 1522996 1482205 1449985 1425906 1409424 1400099 1397689 1402241 1413761
62999 1413761 1431577 1454537 1482023 1514120 1550477 1589638 1629974 1670680 1711455 1751892 1791745
62988 1791745 1831210 1870220 1907955 1943702 1977615 2009822 2039162 2063642 2081894 2093363 2097318
62977 2097318 2092550 2078064 2053366 2018156 1972510 1917504 1855044 1786984 1714805 1640040 1564437
62966 1564437 1489660 1417204 1348432 1284137 1224181 1168110 1116095 1068754 1026223 988026 953688
62955 953688 922796 894526 867917 842688 819098 796979 775661 754941 735257 716677 698556
62944 698556 680568 663334 647455 632585 618070 604068 591391 580488 571035 562374 553968 545627
62932 545627 537647 530578 524614 519440 514850 511141 508608 506956 505551 503976 502045 499613 496842 494415
62918 494415 492948 492259 491582 490460 489043 487564 485918 483867 481430 478944 476785 474980 473076 470548 467461
62903 467461 464492 462188 460378 458532 456415 454203 452194 450722 450049 449998 449931 449465 449012 449116 449553 449694 449650
62886 449650 450288 452000 454116 455794 456832 457266 456828 455480 454075 453713 454527 455706 456744 457980 459746
62871 459746 461510 462338 461906 460681 459278 457965 456784 455811 455146 454782 454533 454094 453255 452197 451473 451496 452054
62854 452054 452563 452801 453148 454042 455475 457121 458706 459955 460481 460198 459785 460249 461802 463547 464463 464472 464204
62837 464204 464009 463654 462976 462321 462115 462318 462583 462776 463059 463548 464244 465212 466513 467849 468654 468774 468806 469497
62819 469497 470960 472779 474739 477021 479660 482294 484694 487292 490804 495439 500652 505721 510396 515028
62805 515028 520197 526227 533019 540279 547846 555678 563653 571660 580019 589468 600498 612865 626031
62792 626031 639915 654910 671249 688831 707730 728551 752066 778732 808753 842428 880234
62781 880234 922680 970239 1023320 1082082 1146315 1215726 1290288 1370048 1454506 1542419 1632353
62770 1632353 1723160 1813594 1901563 1984205 2058835 2123592 2177014 2217359 2242735 2251868 2244534 2221356
62758 2221356 2183512 2132514 2069924 1997215 1916187 1829427 1739906 1649939 1560777 1473247 1388349
62747 1388349 1307109 1230296 1158577 1092554 1032302 977193 926578 880435 838986 801952 768623
62736 768623 738462 711251 686832 665165 646444 630615 616888 604325 592940 583673 577156 572961
62724 572961 570160 568137 566686 565772 565508 566071 567489 569722 573039 577943 584649 592994 602935 614688 628270
62709 628270 643466 660469 679981 702320 727031 753914 783986 818725 858622 903104 951664
62698 951664 1004352 1061195 1121967 1186743 1256087 1330215 1408264 1488668 1570011 1651271 1731393
62687 1731393 1808916 1881875 1947897 2004519 2049653 2081867 2100167 2103712 2091889 2064699 2022933
62676 2022933 1967975 1901520 1825581 1742635 1655486 1566768 1478489 1392062 1308679 1229422 1155010
62665 1155010 1085708 1021616 962947 909821 861944 818684 779496 744101 712289 683637 657530
62654 657530 633441 611324 591684 575082 561396 549710 539026 528897 519223 509729 500127 490702
62642 490702 482273 475407 469927 465310 461275 457811 454887 452435 450530 449358 448977 449204 449688 450059 450087 449813
62626 449813 449420 448911 448071 446870 445763 445249 445204 444954 444169 443409 443566 444914 446973 449236 451675 454528 457981
62609 457981 462322 468097 475657 484590 494008 503485 513371 524096 535567 547590 560611 575570 593121
62596 593121 613368 636326 662147 690745 721624 754429 789460 827308 868068 911124 955558
62585 955558 1000321 1043905 1084293 1119610 1148847 1171734 1187955 1196695 1197022 1188538 1171604 1147136
62573 1147136 1116409 1080984 1042453 1002036 960429 918131 875848 834475 794820 757510 723099
62562 723099 691974 663983 638365 614353 591916 571754 554519 540125 527840 516947 507256 499026
62550 499026 492464 487256 482602 477841 473120 469230 466612 464699 462510 459809 457322 455772 455172 455199 455808
62535 455808 457071 458732 460500 462646 465662 469256 472288 474099 475483 477897 481983 487389 493898 502131
62521 502131 512889 526247 541696 558985 578435 600445 625054 652170 681937 714622 750245
62510 750245 788627 829749 873694 920101 967946 1016023 1063423 1109278 1152360 1191245 1224765
62499 1224765 1251925 1271595 1282820 1285547 1280601 1268895 1251146 1228471 1202629 1175214 1147044 1118875
62487 1118875 1092387 1069800 1052460 1040307 1032769 1029771 1031686 1038619 1049996 1064796 1082069 1101277
62475 1101277 1122047 1143496 1163897 1181180 1193669 1200271 1200293 1193627 1181021 1163545 1141506 1114191
62463 1114191 1080823 1041562 997548 950501 902481 855474 810629 767961 727183 688671 653338
62452 653338 621827 594315 570952 551832 536371 523226 511232 500247 490921 483813 478945 475935
62440 475935 474279 473610 473914 475456 478289 481886 485472 488650 491538 494250 496498 497811 497997 497259 495865
62425 495865 493766 490549 485805 479574 472426 465058 457838 450776 443829 437068 430611 424600 419254 414767
62411 414767 411023 407562 403982 400377 397357 395575 395160 395456 395386 394307 392588 391177 390603 390618 390867 391481
62395 391481 392750 394532 396390 398162 399957 401683 403067 404285 406128 409235 413360 417596 421248 424343
62381 424343 427436 431090 435547 440719 446424 452608 459375 466921 475438 484927 495037 505309 515778
62368 515778 527071 539542 552519 564899 576505 588438 602060 618133 636973 658801 683544
62357 683544 710870 740908 774598 812785 855240 901085 949938 1001888 1056305 1111276 1164433
62346 1164433 1213943 1258505 1296853 1327682 1349970 1363224 1367633 1364197 1354473 1339832 1320813 1297245
62334 1297245 1268905 1235990 1199156 1159347 1117713 1075500 1033911 994026 956801 922941 892561
62323 892561 864970 839066 814146 790294 767831 746579 725945 705632 685837 666631 647577
62312 647577 628241 608828 589993 572224 555692 540565 527054 515148 504546 494922 486128 478256
62300 478256 471606 466414 462397 458793 455207 452251 450927 451389 452738 454094 455478 457497 460428 463785
62286 463785 466685 468566 469715 471043 473270 476441 480388 485232 490896 496325 500053 501814 502991 505147
62272 505147 508547 512444 516281 520125 524250 528964 534780 542226 551451 562363 575179 590539 608999
62259 608999 630635 655253 682893 714085 749685 790301 835739 885000 936923 990750 1046005
62248 1046005 1102020 1157784 1212005 1262979 1308507 1346438 1375509 1395508 1406526 1408326 1400635 1383897
62236 1383897 1359356 1328248 1291012 1247475 1197888 1143693 1087176 1030370 974401 919817 867325
62225 867325 818049 773118 733056 697561 665919 637726 613184 592555 575376 560468 546703
62214 546703 533586 521154 509689 499642 491418 484913 479454 474368 469395 464457 459431 454521 450485
62201 450485 447941 446568 445518 444574 444401 445605 448016 451107 454720 459079 464286 470095 476250 482944 490878
62186 490878 500706 512295 524726 537222 549911 563370 577662 592282 606989 622001 637176 651602
62174 651602 664463 676096 687745 700418 714241 728819 743933 759934 777767 798643 823481
62163 823481 852531 885424 921410 959498 998635 1038031 1077249 1115774 1152500 1185733 1213650
62152 1213650 1234789 1248329 1254181 1252772 1244689 1230597 1211512 1188699 1162904 1133857 1100975 1064658
62140 1064658 1026588 988677 951998 916788 883175 851681 823192 798645 778606 762903 750717
62129 750717 741222 734160 729651 727516 727028 727487 728907 731909 736908 743535 750939 758520 766225 774277 782904
62114 782904 792333 802647 813293 822864 829749 833127 833274 831006 827090 822197 817012 812016 807195 802180
62100 802180 796686 790697 784249 777230 769660 762195 756234 753283 753993 757690 762850 768081 772816 777376
62086 777376 782590 789284 797801 807763 818323 828806 839181 849960 861722 874750 889036 904511
62074 904511 921216 939312 958954 980170 1002799 1026449 1050533 1074444 1097759 1120201 1141449
62063 1141449 1161240 1179844 1198229 1217423 1237710 1258743 1280288 1302388 1324664 1345958 1365014
62052 1365014 1381166 1394021 1402806 1406651 1405440 1399827 1390263 1376428 1357826 1334494 1306783 1274722
62040 1274722 1238102 1197222 1153216 1107460 1060837 1013815 967188 922434 881051 843574 809477
62029 809477 778062 749176 722963 699333 678134 659618 644173 631488 620445 610098 600394 591716
62017 591716 583986 576584 568991 561202 553559 546445 540125 534657 529852 525493 521681 519003 518208 519567
62003 519567 522476 525886 529345 533441 538915 545545 552387 558958 565471 571777 576944 580383 582678 584579
61989 584579 585685 584948 582115 577768 572130 564877 556205 547052 537878 528106 517222 505770 494709 484407
61975 484407 474889 466540 459783 454323 449472 445052 441397 438502 435792 432768 429370 425678 421821 418346
61961 418346 416155 415635 416110 416403 415903 414961 414375 414592 415329 415886 415894 415776 416451 418645 422538 427880 434249 441343
61943 441343 449275 458556 469528 481887 495042 508828 523552 539404 556295 574301 593736 614516
61931 614516 635795 656532 676183 694646 711858 727782 742527 756077 768000 777730 785095 790298
61919 790298 793435 794353 792925 789245 783559 776323 768305 760406 753374 747922 745095 745981 750840 758744 768419
61904 768419 779329 791742 805829 820930 835687 848752 859377 867461 873043 875723 874643 869149
61892 869149 859404 846325 831024 814455 797415 780548 764216 748500 733419 719019 705271 692039
61880 692039 679295 667243 656140 645990 636495 627221 617850 608425 599430 591488 584866 579378 574842
61867 574842 571429 569362 568510 568578 569647 572153 576201 581244 586708 592834 600624 610840 623132 636329
61853 636329 649666 663666 679663 698471 719809 743047 768108 795236 824142 853876 883506
61842 883506 912416 939960 965409 988424 1009045 1026899 1040855 1049840 1053646 1052553 1046656 1036231
61830 1036231 1022561 1007638 992972 979169 966766 956870 950697 948852 951290 957624 967125 978642
61818 978642 990915 1002979 1014036 1022961 1028149 1028010 1021685 1009329 991678 969296 942347 911169
61806 911169 876953 841573 806700 773206 741386 711509 684025 659348 637429 617624 599190
61795 599190 582144 567342 555371 545556 536577 527968 520375 514339 509531 505510 502518 500956 500466 500110
61781 500110 499248 497813 496032 494386 493596 494035 495180 496139 496665 497148 497720 497995 497820 497667 498023 498871 500074
61764 500074 501820 504257 506934 509065 510326 511155 512303 514276 517081 520292 523375 526076 528510 530904
61750 530904 533412 536183 539325 542556 545052 545959 545093 543029 540466 537598 534098 529684 524708 520060 516347
61735 516347 513254 510004 506470 503456 501760 501310 501526 502169 503326 504732 505742 506150 506614 507997 510494
61720 510494 513612 516847 520059 523262 526319 529017 531319 533370 535262 536926 538328 539570 540592 540862
61706 540862 539745 537250 534101 530853 527219 522601 517037 511240 505778 500696 495943 491710 488067 484612
61692 484612 480802 476580 472447 468939 466129 463605 460907 458014 455403 453548 452394 451455 450352 449030
61678 449030 447506 445771 444028 442724 442086 441845 441585 441189 440769 440371 440003 439760 439734 439905 440307 441067 442034 442583
61660 442583 442136 440770 439032 437314 435764 434639 434258 434646 435686 437548 440418 443702 446173 447279 447869
61645 447869 449243 451767 454845 457917 460999 464291 467705 470827 473149 474445 475087 475754 476542 476635 475330
61630 475330 473164 471403 470467 469498 467601 464830 461646 458107 454141 450207 446991 444581 442529 440615 439021
61615 439021 437788 436717 435935 435984 437003 438245 438752 438228 436865 434587 430983 426011 420308 414626 409148
61600 409148 403534 397497 391228 385248 379912 375066 370216 365039 359630 354308 349342 344929 341199 338059
61586 338059 335222 332643 330693 329574 328703 327155 324703 321934 319313 316659 313808 311243 309523 308396
61572 308396 306985 304868 302517 300660 299513 298790 298207 297780 297684 297881 297999 297683 297033 296486 296263 296247 296500 297381
61554 297381 298872 300202 300713 300789 301286 302272 303039 303315 303617 304238 304786 305111 305899 307635 309575 310550 310504 310405
61536 310405 310821 311446 312156 313613 316369 319869 322893 324741 325595 325900 325831 325358 324434 323007 321079 318913
61520 318913 317037 315830 315126 314343 313069 311400 309703 308128 306523 304773 303040 301581 300490 299742 299360
61505 299360 299349 299459 299272 298629 297839 297306 296963 296258 294828 293015 291501 290520 289716 288874 288393 288771 289872 291123
61487 291123 292258 293370 294273 294411 293572 292198 290703 289019 287219 286167 286837 289063 291525 293038 293472
61472 293472 293426 293475 293948 294989 296484 298006 299087 299524 299422 299088 298942 299314 300153 301029 301593 301955 302429 302926
61454 302926 302901 302084 301059 300807 301625 302856 303895 305066 307022 309503 311392 312179 312688 313943 315801 317305
61438 317305 318083 318761 320014 321812 323718 325520 327421 329914 333534 338410 343929 349064 353099 355923 357726
61423 357726 358749 359307 359710 360056 360347 360729 361288 361698 361582 361304 361879 363823 366504 368885 370494 371383 371533
61406 371533 370806 369276 367229 364915 362515 360145 357619 354503 350793 347310 344963 343730 342861 342007 341602
61391 341602 341990 342687 342829 342106 341010 340306 340420 341202 342107 342668 342958 343517 344777 346639 348694 350710 352736
61374 352736 354806 356757 358393 359695 360819 361969 363314 364907 366584 368046 369253 370680 372898 375810
61360 375810 378573 380546 382136 384372 387780 392004 396489 401041 405610 410035 414351 419013 424430 430527
61346 430527 437181 444821 453952 464029 473395 480657 485784 489626 492734 495129 497016 499087 501890 505182
61332 505182 508204 510443 511910 512760 512934 512282 510857 508865 506346 503073 498906 494224 489890 486727 484970
61317 484970 484257 484097 484251 484673 485300 486164 487648 490323 494397 499554 505475 512281 520257 529375 539356 550029
61301 550029 561258 572609 583498 593678 603136 611391 617330 620042 619649 617112 613452 609317 605053
61288 605053 600771 596339 591472 585935 579674 572899 566121 559926 554563 549851 545553 541687 538386 535722
61274 535722 533882 533302 534334 536846 540398 544722 549839 555774 562384 569401 576394 582744 587976 592260
61260 592260 596414 601315 607336 614312 621891 629873 638305 647202 656103 664015 670032 674067 676790 678851
61246 678851 680352 681097 681036 680227 678550 675735 671664 666440 660224 653264 646135 639591 633879 628459 622735
61231 622735 616961 611943 607860 604040 600270 597675 597577 599726 602435 604526 606377 608919 612325 616106 619928
61216 619928 623786 627781 632226 637643 644045 650498 656033 660809 665771 671173 676235 680343 683825 687186
61202 687186 690225 692527 694493 697175 701179 706295 712340 719857 729629 741776 755698 770830 787052
61189 787052 804240 821794 838925 855263 870738 884869 896595 905089 910542 913939 916243 917975
61177 917975 919312 920145 920032 918474 915409 911288 906567 901231 894824 886966 877821 868135 858654 849430 839790
61162 839790 829121 817491 805365 792885 779832 766215 752526 739312 726720 714576 702761
61151 702761 691455 681114 672246 665077 659420 654936 651425 648712 646393 643965 641098 637479 632493 625553
61137 625553 616896 607630 598778 590570 582929 576279 571406 568650 567681 568063 569676 572554 576701 582307 589850
61122 589850 599600 611132 623658 636859 651170 667227 685334 705553 727916 752184 777594 803294
61110 803294 829094 855440 882582 910044 937033 963072 988115 1012233 1035361 1057125 1076800
61099 1076800 1093604 1107177 1117565 1124659 1127884 1126625 1120739 1110558 1096698 1080038 1061504 1041553
61087 1041553 1020049 996976 972945 948747 924623 900369 875938 851589 827718 804937 784036
61076 784036 765289 747993 731278 715258 700828 688443 677786 668611 661104 655212 650368 646297
61064 646297 643469 642257 642064 641877 641468 641581 642983 645695 649196 653172 658003 664501 673044 683031 693467
61049 693467 704094 715585 728528 742741 757904 774443 793266 814710 838146 862592 887487
61038 887487 913005 939962 969357 1001530 1035639 1070310 1105060 1140875 1179163 1220308 1263560
61027 1263560 1308213 1354376 1402420 1452188 1503255 1555655 1609747 1665516 1722849 1782778 1847712
61016 1847712 1920037 2001107 2092259 2196329 2317365 2458922 2623204 2811850 3027446 3274885
61006 3274885 3562054 3899170 4297480 4769566 5331415 6002895 6804895 7756826 8876731
60997 8876731 10178422 11660917 13299699 15054150 16884046 18745664 20556427 22166082
60989 22166082 23387852 24089064 24271491 24071630 23685745 23287730 22990524 22837939 22790453
60980 22790453 22709373 22382526 21609352 20299963 18518848 16447823 14304098 12268364 10451578
60971 10451578 8896821 7599516 6531012 5655855 4939936 4352968 3869678 3470227 3138839
60962 3138839 2862003 2628188 2428380 2255605 2104033 1969098 1847970 1738941 1640466 1551355
60952 1551355 1471365 1400576 1338315 1283386 1234983 1192473 1154465 1118980 1084553 1050554 1016760
60941 1016760 983404 951407 921568 893592 866728 841131 817577 795970 775260 754983 735779
60930 735779 718234 702174 687396 674027 661803 649980 638389 627703 618240 609433 601013 593749
60918 593749 588306 584159 580405 576942 574066 571513 568776 565924 563233 560377 556893 553149 549995 547595
60904 547595 545408 543195 541231 539506 537572 535328 533213 531382 529364 526895 524543 522980 521972 520628
60890 520628 518586 516451 514963 514047 512988 511453 509951 509112 508736 507881 505844 502761 499289 496117 493803
60875 493803 492626 492322 492297 492378 493054 494776 497269 499811 501978 503933 506301 509946 515404 522205 529097 535451
60859 535451 542033 549896 558847 567739 576039 584222 592578 600521 607460 613667 619772 625783 631212 635946
60845 635946 640503 645398 650573 655492 659538 662269 663568 663759 663484 663262 663064 662391 660942 659211 658277 658923
60829 658923 661046 663989 667386 671600 677467 685668 696219 708435 721474 735013 749273 764396 780150
60816 780150 796376 813331 831171 849379 867201 884431 901242 917335 932031 945291 957875
60805 957875 970017 980489 987668 991312 992663 992834 991637 988142 981944 973559 963738 952720 940216
60792 940216 926013 910444 894177 877574 860472 842717 824737 807328 790910 775280 760101
60781 760101 745334 731034 716986 702968 689275 676672 665590 655558 645584 635037 624049 613175
60769 613175 602946 593746 585748 578678 571794 564438 556721 549415 543063 537366 531579 525339 518858 512440
60755 512440 506152 500034 494338 489309 484818 480405 475699 470718 465754 461101 456877 453058 449614 446598
60741 446598 444080 441993 440112 438210 436135 433698 430616 426780 422576 418781 416025 414337 413154 411790
60727 411790 409963 408005 406548 405950 406030 406387 406813 407312 407862 408331 408549 408308 407457 406180 404941 403801 402032
60710 402032 398943 394981 391310 388240 384778 380158 375064 370674 366952 362786 357728 352762 349092 346740
60696 346740 344718 342276 339633 337594 336678 336693 337057 337417 337851 338496 339249 339928 340500 340951 341215 341466 342185 343640
60678 343640 345475 347157 348610 350058 351541 353112 355307 358690 362921 366917 370062 372707 375281 377520
60664 377520 378971 379801 380700 382212 384417 386987 389262 390597 391017 391405 392754 395284 398505 401978 405803
60649 405803 410420 416058 422328 428315 433255 437206 440884 444714 448227 450438 450608 448561 444573 439220
60635 439220 433185 427026 421137 415807 411099 406657 402037 397324 393071 389536 386333 383050 379809 377002
60621 377002 374788 373139 372077 371527 371171 370720 370171 369587 368911 368222 367839 367816 367607 366670 365244 364113 363684
60604 363684 363657 363582 363401 363416 363934 364933 365911 366167 365379 363862 362219 360915 360202 360119 360385 360595 360744 361234 362213
60585 362213 363367 364650 366635 369635 372913 375400 376881 377821 378388 378513 378773 380250 383299 387193 391192
60570 391192 395338 399935 404932 410256 416249 423263 431084 439177 447309 455613 464166 472781 481093 488607
60556 488607 494690 498727 500346 499515 496527 491887 486159 479915 473921 469135 466280 465435 466274 468545 472088
60541 472088 476642 482143 489087 497978 508366 519031 529339 539836 551181 562970 573961 583033
60529 583033 589495 592887 593133 590794 586710 581429 575279 568879 563062 558204 553971 549857 545782 542094
60515 542094 539148 536986 535279 533589 531814 530463 530372 532044 535227 539211 543558 548559 554932 563097 572907
60500 572907 584220 597510 613570 632695 654573 679052 706570 737584 771946 809088 848442
60489 848442 889141 929525 967488 1001274 1029524 1050589 1062509 1063999 1055054 1036311 1008250 971536
60477 971536 927938 880331 831669 784201 739552 698851 662462 629947 600794 575056 553012
60466 553012 534435 518621 505067 493644 484059 475619 467754 460434 453861 448035 442849 438274 434178
60453 434178 430214 426233 422608 419731 417312 414567 411092 407241 403656 400741 398578 396985 395597 394130
60439 394130 392666 391485 390681 390177 389990 390096 390030 389168 387600 386309 386186 387109 388250 389022 389399 389457 389098 388303
60421 388303 387418 386924 386966 387214 387247 387002 386791 386914 387459 388469 389984 391764 393268 394245 395138 396518 398325
60404 398325 400109 401845 403924 406367 408705 410818 413255 416457 420157 423819 427148 429820 431334 431732
60390 431732 432028 433256 435350 437576 439826 442641 445996 448924 450746 452059 453985 456761 459558 461560
60376 461560 462787 463817 465054 466462 467890 469454 471510 474301 477675 481135 484119 486325 487925 489442
60362 489442 491201 492862 493675 493361 492512 491977 492058 492537 493220 494048 494794 495179 495410 496182 497896 500199 502629
60345 502629 505496 509696 515620 522528 529136 534636 539003 542473 545030 546426 546500 545318 543077 540105 536937
60330 536937 534190 532129 530325 527956 524558 520474 516419 512639 508675 504053 499003 494242 490116 486364
60316 486364 482804 479855 478100 477565 477803 478552 479946 482170 485346 489742 495693 503178 511830 521544 532769
60301 532769 546015 561285 578144 596054 614407 632336 648789 662759 673390 679959 681876 678681
60289 678681 670127 656599 639483 620799 602207 584534 568226 553815 541628 531408 522689 515384
60277 515384 509602 504985 500630 495767 490323 484878 480189 476618 473779 470865 467575 464555 462633 461777
60263 461777 461208 460380 459355 458277 457041 455606 454144 452629 450729 448383 446113 444429 443244 442246 441548
60248 441548 441461 441808 442002 441833 441670 441763 441821 441601 441493 442084 443279 444262 444352 443619 442696 442313 442998 444818 447168
60229 447168 449107 450253 451231 452996 455859 459365 462991 466594 470234 473907 477568 481157 484576 487828
60215 487828 491174 494919 499064 503442 508177 513611 519708 525942 531935 537796 543634 549196 554378 559729
60201 559729 565962 573124 580637 587998 595000 601410 606893 611264 614425 616101 616139 615164 614468 614952 616335
60186 616335 617492 617375 615618 612614 609206 606081 603241 600127 596274 591671 586524 580980 575210 569465
60172 569465 563892 558564 553883 550526 548647 547352 545438 542601 539540 536932 534774 532873 531519 531249
60158 531249 532085 533372 534370 534731 534401 533362 531785 530276 529625 530160 531490 533031 534681 536783 539479 542401
60142 542401 545152 547878 551037 554659 558169 561154 564078 567905 573045 578918 584639 589906 595059 600414
60128 600414 605759 610486 614095 616558 618265 619640 620769 621481 621798 622145 622949 624169 625463 626733 628226
60113 628226 630031 631776 633005 633712 634326 635163 636034 636437 636127 635356 634437 633128 630708 626804 621906 616878
60097 616878 612180 607780 603552 599334 594762 589667 584739 581322 580293 581349 583481 585836 588085 590329
60083 590329 592839 595630 598188 599899 600791 601475 602329 603210 604034 605035 606076 606271 604724 601318 596491 590716
60067 590716 584536 578520 572577 565803 557704 549255 542023 536438 531623 526720 521600 516383 511176 506434
60053 506434 502840 500498 498807 497283 496031 495219 494687 494349 494549 495686 497850 500984 505043 509772 514728
60038 514728 519741 525040 530763 536727 542832 549180 555483 560760 564091 565452 565495 564711 563079 560338 556320
60023 556320 551086 544936 538135 530607 522118 512840 503373 494114 485026 476229 468310 461658 455850 450218
60009 450218 444800 440311 437307 435740 435217 435317 435715 436347 437422 439088 441170 443396 445694 447978 449863
59994 449863 450943 451301 451470 451979 453119 454983 457492 460568 464424 469350 474931 479963 483728 486999 491047
59979 491047 495843 500070 502906 504884 506681 507896 507656 505877 503262 500316 497028 493513 490457 488672
59965 488672 488359 488938 489602 490064 490687 491878 493560 495536 498063 501467 505179 507881 508891 508809 508435 507699
59949 507699 506244 504481 503235 502657 502329 502257 502840 503751 503810 502284 499669 496844 494063 491136 487987 484580
59933 484580 480834 477138 474400 473012 472180 471006 469820 469583 470202 470471 469821 469238 470032 472348 475306 478094
59917 478094 480496 482764 485439 489038 493454 497851 501486 504563 507960 512262 517334 522687 527901 532681
59903 532681 536827 540317 543366 546308 549296 552005 553668 553659 552070 549565 546692 543686 540929 539020 538110
59888 538110 537585 536834 536066 536022 537126 539331 542564 546820 551850 557149 562327 567298 572204 577322 582843
59873 582843 588480 593515 597470 600449 602465 602956 601576 599145 596889 594798 591619 586674 580884 575645
59859 575645 571359 567602 564187 561408 559451 558104 557089 556435 556491 557661 559969 562860 565736 568808 573067
59844 573067 579181 586764 594910 603029 610735 617243 621530 623181 622676 620816 618187 615295 612852 611521
59830 611521 611243 610921 608969 604427 597672 589998 582547 575748 569626 564231 559502 555040 550377 545427 540472
59815 540472 535813 531656 528291 526001 524662 523651 522367 520796 519386 518350 517320 515807 513821 511764
59801 511764 509824 507831 505804 504146 502985 501671 499390 496082 492320 488413 484211 479791 475789 472810
59787 472810 470777 469037 466887 464046 460932 458481 457294 456894 456201 454772 453200 452254 452111 452491 453023 453304
59771 453304 453139 452926 453349 454437 455533 456449 457975 460744 464208 467397 470238 473355 476879 480227 482976
59756 482976 485252 487275 489177 491377 494521 498830 503851 509012 514081 519039 523895 528810 534095 539871
59742 539871 545814 551312 555826 559198 561773 564153 566639 568976 570761 571880 572414 572377 571891 571413 571365 571710
59726 571710 572262 573202 574770 576552 577693 577877 577624 577576 578010 579042 580706 582617 584168 585342 586800 588822
59710 588822 590702 591719 592291 593532 595865 598707 601427 604010 606654 609264 611621 613717 615622 617210
59696 617210 618340 619253 620518 622493 624951 627343 629374 631260 633395 635773 637810 638751 638221 636389 633692
59681 633692 630573 627502 624982 623242 621891 620122 617401 613878 610038 606149 602164 597955 593390 588356
59667 588356 583021 577958 573646 569836 565915 561951 558892 557380 556851 556210 555150 554250 553960 554050 554164 554433
59651 554433 555259 556773 558749 560911 563065 565016 566582 567772 568743 569372 569006 566907 563078 558395 553722
59636 553722 549127 544299 539487 535473 532574 530281 528077 526096 524638 523540 522526 521759 521452 521126 519927
59621 519927 517669 514977 512331 509539 506394 503379 501232 499978 498809 496966 494547 492315 490837 489984
59607 489984 489287 488558 487963 487627 487524 487732 488414 489453 490456 491275 492113 492908 493104 492454 491606 491368 491631 491601
59589 491601 490901 489844 488747 487628 486628 486133 486281 486772 487258 487454 486829 484848 481767 478653 476185 473884
59573 473884 471015 467864 465456 464153 463187 461750 460019 458703 457857 456626 454234 450928 447765 445663 444887
59558 444887 445263 446487 448121 449681 451037 452512 454386 456408 458074 459253 460325 461810 464069 467223
59544 467223 471038 474984 478774 482939 488555 496280 505793 516243 527114 538597 551259 565503 581302
59531 581302 598243 615365 630667 641146 644300 640187 631786 622949 616046 611536 609137 608706 610169
59518 610169 613257 617393 621612 624731 626009 625517 623534 619805 613891 606080 597318 588220 578675 568514
59504 568514 558065 547859 538168 529053 520621 513102 506792 501869 498070 494727 491420 488482 486485 485412
59490 485412 484764 484311 484180 484310 484461 484833 486048 488310 491038 493580 495960 498754 502492 507226 512402 517212
59474 517212 521383 525560 530529 536233 541997 547505 552897 557933 561779 563786 563977 562823 561175 560270 560921
59459 560921 562577 563996 565036 566945 570755 576317 583260 591793 601898 612685 623418 634544 646770
59446 646770 659538 671218 680553 687321 691897 694752 696082 695410 691820 685062 676080 666013 655235
59433 655235 643924 632955 623333 615104 607677 600963 595351 590802 586921 583861 582272 582307 583528 585894
59419 585894 590042 596411 604823 615119 627547 642232 658961 677746 698819 721634 744476 765778
59407 765778 785455 804159 821195 833674 837916 831749 815918 793980 770879 750927 736277 726877
59395 726877 721703 719979 721147 723759 724727 720133 707248 686175 659808 632275 607000 585560 567840
59382 567840 553137 541123 531822 524971 519873 515927 512976 510973 509693 509016 509234 510742 513527 517100
59368 517100 520847 524367 527691 531299 535624 540382 544665 547890 550404 553019 556302 560557 566062 572883
59354 572883 580658 588996 597982 608025 619420 632356 647072 663610 681531 700237 719443 739038
59342 739038 758661 777771 796090 813662 830540 846611 861578 874851 885576 893009 896769 896725
59330 896725 892970 886054 876749 865332 851536 835544 818468 801318 784060 766352 748731 732250
59318 732250 717253 703365 690512 679065 669078 660260 652691 646671 641774 637025 632320 628767 627187
59305 627187 627040 627376 628218 630387 634439 640400 648259 658019 669331 681572 694345 707582 720951 733219
59291 733219 742218 745634 742244 732723 719221 704106 689142 675598 664593 656960 652847 651590 651973
59278 651973 652851 653888 655761 659358 664735 671083 677666 684456 691911 700532 710650 722125 734100 745432
59264 745432 755587 764776 773108 780026 784725 786708 785697 781489 774292 764894 754062 741981 728614
59251 728614 714312 699695 685159 671018 657956 646823 637890 630735 624921 620398 617113 614698 612870
59238 612870 611899 612327 614274 617329 621042 625191 629514 633521 636869 639720 642474 645181 647394 648484 647937
59223 647937 645493 641328 635994 629844 622560 613657 603450 593035 583211 573933 565021 556826 549839 544099
59209 544099 539510 536301 534709 534436 534927 535971 537621 539782 542340 545432 549020 552472 555099 556996 558850
59194 558850 561147 564127 568190 573534 579451 584768 589047 592706 596000 598754 601226 604372 608804 614120
59180 614120 619644 625241 630973 636452 641061 644627 647555 650480 653869 657658 661209 664069 666860 670872
59166 670872 676567 683061 689355 695480 701983 708804 715265 720835 725364 728820 731303 733108 734261 734073
59152 734073 731675 726979 720694 713428 705236 696188 686927 678271 670436 662962 655454 648134 641500 635681
59138 635681 630416 625582 621327 617643 614299 611397 609504 608857 608924 609234 610151 612152 614768 617087 619081
59123 619081 621530 624761 628423 632512 637588 643770 650517 657720 666046 675751 686040 696130 706087 716130
59109 716130 725975 735553 745477 755889 765632 773587 780269 786902 793349 798180 800709 801743 802178 801889
59095 801889 800441 798041 795270 792339 789059 785283 781072 776621 772213 768100 764358 760896 757562 754092
59081 754092 750113 745421 740034 733772 726131 717010 707304 698184 689789 681215 671834 662095 652900 644613
59067 644613 636953 629511 622141 615015 608504 602901 598220 594341 591270 588984 586998 584415 580627 575885
59053 575885 571061 566858 563285 559857 556284 552887 550210 548284 546573 544710 542933 541596 540637 539925 539829
59038 539829 540876 542885 545001 546722 548459 550833 553757 556575 559055 561874 565926 571291 577153 582859
59024 582859 588815 596075 605153 615607 626778 638482 650798 663596 676618 689745 702826 715324
59012 715324 726421 735324 741343 744008 743490 740805 737189 733252 728974 724409 720156 717148 716192 717624
58998 717624 721156 726049 731561 737275 742993 748521 753707 758442 762385 764809 765000 762831 758876 754067
58984 754067 749253 744800 740414 735508 729885 723954 718300 713350 709528 707301 706834 707956 710699 715460
58970 715460 722295 730500 739280 748470 758210 768355 778760 789784 801761 814190 826133 837334
58958 837334 848215 858732 867954 874906 879229 880773 879172 874229 866372 856294 844342 830600 815407
58945 815407 799498 783602 768037 752780 737967 724299 712777 703827 696814 690712 685225 680929
58933 680929 678229 676525 674627 671873 668558 665264 662015 658361 654259 650472 647781 645954 643964 641229
58919 641229 638185 635531 633419 631683 630344 629414 628557 627518 626672 626603 627263 628179 629487 632102 636623 642534
58903 642534 648889 655475 662930 671893 682495 694711 708702 724351 740725 756558 771449 786119
58891 786119 801256 816654 831979 847737 864600 882076 899072 915852 934194 954998 976669
58880 976669 996591 1013390 1026916 1036780 1042183 1043127 1040674 1035725 1028104 1017070 1002340 984522 964822
58867 964822 944414 923932 903666 884179 866394 850878 837389 825343 814280 803691 793059
58856 793059 782525 772939 764686 756940 748679 739914 731358 723354 715884 709107 703041 696993 690175 682712
58842 682712 675388 668632 662390 656556 650756 644135 636347 628417 621623 615812 609871 603605 597883 593048
58828 593048 588567 584446 581680 580806 581097 581673 582491 583779 585345 587000 588924 591172 593531 596257 600143
58813 600143 605317 610659 614991 618257 621000 623326 625077 626618 628637 631256 633733 635024 634479 632250
58799 632250 629227 626328 623684 620731 617114 613108 609145 605354 601627 597735 593427 588857 584838 582092
58785 582092 580374 579033 578248 578799 580655 582946 585553 589488 595095 600951 605397 608443 611337 614760 618193
58770 618193 620689 621591 620734 618410 615000 610445 604533 597797 591443 586073 581189 576357 572039 568756 566198
58755 566198 563906 562147 561333 561182 561308 562154 564374 567610 570855 573838 577182 581204 585433 589478 593772
58740 593772 599177 606246 614924 624669 634766 644737 654498 664166 673876 683804 693923 703598 711950 718903
58726 718903 725298 731621 737172 740989 743036 743775 743070 740383 735949 730945 726434 722702 719708 717680 717015
58711 717015 717802 719596 721717 723868 726399 729632 732987 735256 735789 734744 732010 726722 718334 707484
58697 707484 695155 681566 666559 650545 634279 618066 602002 586732 573175 561629 551778 543418
58685 543418 536519 530729 525535 520911 517238 514630 512776 511306 509808 507718 504865 502041 500428 500428 501539
58670 501539 503240 505415 507952 510628 513614 517651 523512 531493 541322 552237 563217 573492 582826
58657 582826 591131 597957 602693 605083 605252 603417 599924 595361 590282 584975 579679 574676 569905 564981
58643 564981 559986 555681 552399 549296 545481 541405 538225 536145 534392 532706 531837 532418 534180 536435 538708
58628 538708 540723 542415 544083 546051 548147 549999 551723 553737 556017 558284 560831 564342 568830 573538
58614 573538 578037 582585 587253 591582 595530 599946 605591 612129 618476 623611 626760 627521 626375 624602
58600 624602 623084 621510 619246 616548 614255 612548 610764 608504 606299 604946 604577 604665 604739 604835 605346 606769
58584 606769 609736 614996 622930 633018 644128 655470 666964 678506 689291 698365 705660 711978 718029
58571 718029 723942 729711 735685 742462 750575 760353 771910 785230 800444 817913 837858 860022 883960
58558 883960 909463 936250 963390 989575 1014012 1036632 1057237 1074860 1088237 1096727 1100584 1100472
58546 1100472 1096961 1090561 1082091 1072742 1063393 1053837 1043014 1030164 1015430 999129 980889 960015
58534 960015 936584 911746 886907 862886 839872 818010 797995 780917 767237 756097 746245 737692
58522 737692 731666 728629 727252 726009 725011 725335 727118 729376 731426 733410 735459 737288 738758 740071 741268
58507 741268 742135 742657 742943 742638 741030 737859 733608 728954 724374 720147 716204 712131 707874 704268 702157
58492 702157 701171 700205 699068 698732 699883 702154 705141 709269 715093 722329 730180 738388 747553 758537 771757
58477 771757 786914 803349 820684 838923 857675 875681 891618 905012 915695 922693 924697 921699
58465 921699 915284 907103 897752 887344 876321 865345 855057 846364 840363 837487 837116 838437 841456
58452 841456 846783 854627 864174 873875 882396 889474 895702 901162 904482 903780 898473 889706 879219 868373
58438 868373 858054 848667 840150 832624 827073 824611 825001 826696 828549 830800 834200 838955 844882 851923
58424 851923 860014 868968 878868 890140 902817 916090 928855 940444 950529 958638 964090 966283 965018
58411 965018 960640 953908 945532 935984 925829 915872 906592 897782 889207 881258 874397 868385 862760 857737
58397 857737 853847 851027 848954 847980 848723 850978 854116 858358 864366 871457 877582 881474 883825 885898 888026
58382 888026 889897 891422 892650 893487 894020 894692 895918 897957 901221 906076 912232 918989 926171 934183 943206
58367 943206 953060 963820 975707 988367 1001156 1014164 1028028 1042763 1057767 1072989 1088992 1105714
58355 1105714 1122212 1137771 1152186 1164856 1174838 1182050 1187338 1191174 1193478 1194805 1196383 1198655 1201148
58342 1201148 1204114 1208866 1215995 1224624 1234004 1244513 1256482 1269451 1283312 1298831 1316204 1334242
58330 1334242 1351790 1368838 1385556 1401517 1416645 1431664 1446683 1460465 1472028 1481825 1490502 1497767
58318 1497767 1503520 1508909 1515035 1521544 1527635 1533600 1540285 1547901 1556490 1566779 1579440 1594089 1610001
58305 1610001 1627230 1646146 1666469 1687557 1709127 1731069 1753165 1775528 1798607 1822298 1845854
58294 1845854 1869013 1892258 1915635 1938591 1961406 1985433 2011272 2038076 2065372 2094089 2124933
58283 2124933 2157184 2190047 2223830 2258775 2294110 2329391 2365610 2403941 2444458 2486873 2531255
58272 2531255 2577181 2623661 2670825 2720267 2772913 2828065 2885339 2945682 3009439 3075416 3143128
58261 3143128 3214070 3289346 3367845 3448200 3530708 3615727 3702030 3788417 3875197 3962529 4049188
58250 4049188 4134746 4221199 4310710 4403511 4499677 4600945 4708907 4823273 4943729 5071588
58240 5071588 5207909 5352165 5504550 5667170 5841036 6024423 6216372 6419143 6635033
58231 6635033 6863702 7105157 7362259 7637362 7929603 8238705 8568475 8923305 9304366
58222 9304366 9712805 10153409 10631314 11148408 11707092 12314366 12978090 13702953 14494820
58213 14494820 15365556 16329022 17396644 18582577 19909572 21404894 23096131 25018542
58205 25018542 27222999 29771198 32729168 36172478 40190450 44876379 50322305 56636545
58197 56636545 63962730 72477373 82389152 93963784 107536394 123466758 142073342
58190 142073342 163599076 188157016 215577905 245257284 276211414 307311542 337330512
58183 337330512 364564485 386393825 399494927 400954599 389667212 367024748 336411437
58176 336411437 301877599 266838538 233446167 202708558 174975290 150348583 128840532
58169 128840532 110366449 94725150 81620815 70704479 61616402 54025768 47654941
58162 47654941 42278547 37711821 33806518 30449572 27552860 25041281 22851633 20935833
58154 20935833 19255743 17774622 16457656 15277998 14216249 13254894 12377714 11573433
58146 11573433 10835306 10157477 9534740 8964330 8444010 7968943 7533229 7133325 6767155
58137 6767155 6431148 6121032 5834183 5568353 5319334 5082726 4857016 4642514 4438662
58128 4438662 4245004 4063241 3895297 3740231 3595625 3460948 3336893 3222414 3115109
58119 3115109 3013871 2918744 2828900 2743103 2661404 2584169 2510231 2438218 2368873 2303827 2242876
58108 2242876 2184661 2129134 2076989 2027432 1978990 1931982 1887793 1846099 1805074 1764001 1723533
58097 1723533 1683744 1644115 1605236 1568327 1533214 1498710 1464863 1432915 1403153 1374780 1347801
58086 1347801 1323140 1300901 1280282 1261203 1244240 1228928 1213802 1198167 1182221 1165545 1147203
58075 1147203 1127447 1107663 1088468 1069337 1050089 1031133 1012187 992462 972416 953698 936980
58064 936980 921315 906059 891993 879987 869719 860308 851208 842101 832788 823549 814730 805821 795811
58051 795811 784635 773359 762830 753000 743729 735288 727865 721369 715868 711485 707773 703959 699792
58038 699792 695480 690945 685927 680625 675320 669560 662722 655201 648003 641282 634331 626884 619238 611145
58024 611145 601943 591950 582514 574376 567055 560123 553935 548757 544220 540099 536717 534153 531914 529807
58010 529807 528308 527631 527164 526286 525096 523943 522896 521987 521383 520961 520262 519138 517966 517047 516358 516033 516443
57993 516443 517553 518812 519898 521046 522476 524072 525692 527208 528155 528082 527374 526955 526921 526252 524192 521152
57977 521152 517814 514109 509680 504837 500359 496582 493207 489869 486542 483403 480559 477939 475519 473687
57963 473687 473098 473824 474898 475232 474877 474808 475576 476842 478242 479903 481817 483364 483922 483634 483257 483466 484471
57946 484471 486084 488033 490337 493297 496945 500771 504366 508088 512582 517821 523216 528498 533882 539488
57932 539488 545290 551598 558798 566499 573556 579043 582655 584159 583275 580265 575916 570596 563912 555597
57918 555597 546182 536439 526602 516502 506197 496149 486999 479247 472993 467924 463770 460648 458704
57905 458704 457638 457046 456961 457489 458141 458271 458000 457948 458112 457904 457335 457185 457740 458271 458211 458059 458570 459679 460770
57886 460770 461583 462303 463115 464037 465003 465775 466020 465654 464842 463538 461355 458086 454051 449796 445645 441553
57870 441553 437153 432070 426517 421432 417602 414899 412852 411573 411299 411353 410695 409497 409019 409797 411107 412640
57854 412640 415464 420588 427371 434151 439867 444468 448319 451853 455361 458608 461054 462827 464900 467848
57840 467848 471012 473393 474796 475609 476020 476130 476330 476899 477494 477616 477291 476909 476764 477176 478557 480862 483438
57823 483438 485948 489008 493310 498498 503469 507496 510590 513150 515755 518857 522168 524727 526048 526686
57809 526686 527047 526234 522813 516371 507591 497348 486625 476893 469382 463915 459313 454971 451217 448186
57795 448186 445286 442030 438657 435585 432861 430386 428234 426466 425038 424101 424055 425197 427531 430937 435217
57780 435217 440053 445359 451582 459166 467771 476558 485284 494519 504562 514645 523556 530700 536277 540678
57766 540678 543989 545985 546395 545174 542537 538677 533633 527597 521160 514964 509222 503904 499208 495374
57752 495374 492057 488469 484321 480261 477180 475341 474349 473673 473078 472741 473082 474281 475894 477198 477938 478465
57736 478465 479061 479517 479556 479397 479525 480124 481025 482196 483903 486326 489200 492055 494747 497578 500852 504377
57720 504377 507520 509737 511026 511846 512642 513430 513859 513783 513655 514146 515255 516246 516780 517664 519786 522498 523978
57703 523978 523385 521850 520939 520899 521109 521575 522973 525380 527942 530000 531905 534434 537831 541623 545001 547205
57687 547205 547885 547451 546878 546964 547820 549257 551483 555131 560587 567592 575751 585284 596998 611644 629769
57672 629769 652303 680562 715107 755066 799384 848466 903583 964514 1028656 1092466 1152479
57661 1152479 1204155 1240838 1255461 1243835 1206564 1148795 1078870 1006099 937838 877670 826270
57650 826270 783491 749051 721861 700068 682174 667565 655932 646858 640073 635469 632697 631155
57638 631155 630401 630160 630032 629832 630131 631771 634774 638280 641600 644668 647476 649896 652208 655014 658270
57623 658270 661113 663013 664408 665791 666857 667165 667084 667368 668102 668737 669031 669404 670408 672253 674826 677802
57607 677802 680708 683167 685145 686856 688527 690333 692448 695008 698033 701415 704857 707934 710446 712720
57593 712720 715177 717580 719107 719317 718690 718053 717872 718281 719367 721049 722931 724650 726176 727564 728719
57578 728719 729667 730845 732728 735368 738546 742082 745601 748265 749339 749080 748635 748980 750245 752074 754264
57563 754264 756847 759863 763290 767046 770908 774533 777825 781184 785180 789935 795031 800191 805804 812442
57549 812442 819889 827092 833260 838699 844272 850297 856372 862093 867519 872899 878369 883960 889614 895223
57535 895223 900979 907653 916019 925817 935637 944034 950589 955901 960985 966726 973452 980768 988129 995687
57521 995687 1004122 1013434 1022516 1030391 1037393 1044575 1052313 1060209 1068152 1076619 1085757 1094867 1103141 1110489
57507 1110489 1117209 1123180 1127956 1131631 1135101 1139176 1143654 1147635 1150700 1153419 1156557 1160118 1163536 1166619
57493 1166619 1169812 1173506 1177539 1181583 1185671 1190029 1194630 1199239 1203912 1209170 1215531 1222887 1230414 1237195
57479 1237195 1243035 1248637 1254836 1261803 1269090 1276290 1283362 1290403 1297537 1305039 1313217 1322019 1331035 1339955
57465 1339955 1348771 1357569 1366502 1375920 1386033 1396409 1406384 1416101 1426491 1437933 1449638 1460841
57453 1460841 1471859 1483212 1494208 1503506 1511030 1518384 1527160 1537487 1548506 1559623 1570818 1582116
57441 1582116 1593324 1604254 1614981 1625847 1637329 1649829 1663364 1677444 1691315 1704481 1717045
57430 1717045 1729562 1742506 1755879 1769363 1782767 1796120 1809396 1822379 1834883 1846892 1858504
57419 1858504 1870012 1882018 1895072 1909005 1922980 1936443 1949721 1963460 1977824 1992553 2007510
57408 2007510 2022745 2038277 2054157 2070562 2087400 2104022 2119727 2134462 2148662 2162595 2176332
57397 2176332 2190152 2204471 2219390 2234799 2250864 2267865 2285537 2303131 2320353 2337777 2356102
57386 2356102 2375329 2394852 2414044 2432606 2450684 2468915 2488074 2508340 2529017 2549149 2568366
57375 2568366 2587039 2605774 2624845 2643977 2662572 2680345 2697840 2716132 2735770 2756093 2775785
57364 2775785 2794157 2811841 2830261 2850449 2872284 2894768 2916943 2938600 2960214 2982383 3005342
57353 3005342 3028853 3052457 3075912 3099421 3123244 3147061 3170087 3192071 3213907 3236880 3261399
57342 3261399 3286780 3312125 3337021 3361464 3385620 3409834 3434541 3459998 3486189 3512989 3540190
57331 3540190 3567382 3594161 3620551 3646967 3673654 3700349 3726553 3751947 3776546 3800709 3825044
57320 3825044 3850005 3875474 3900990 3926479 3952421 3979148 4006285 4033184 4059724 4086381 4113574
57309 4113574 4141208 4168894 4196402 4223789 4251155 4278414 4305349 4331830 4357893 4383666 4409395
57298 4409395 4435593 4462877 4491411 4520596 4549491 4577488 4604556 4631072 4657677 4685083 4713600
57287 4713600 4742816 4772021 4800905 4829628 4858331 4886910 4915226 4943251 4970961 4998373 5025648
57276 5025648 5052874 5079823 5106255 5132404 5158804 5185622 5212561 5239406 5266306 5293464 5320936
57265 5320936 5348741 5376766 5404491 5431261 5456956 5482018 5506797 5531310 5555689 5580190 5604539
57254 5604539 5627871 5649711 5670514 5690824 5710422 5728858 5746440 5764007 5781853 5799448 5816212
57243 5816212 5832129 5847560 5862793 5877893 5892885 5908045 5923980 5941144 5959201 5977175 5994412
57232 5994412 6011063 6027460 6043485 6058912 6073941 6088826 6103260 6116641 6128694 6139291 6147898
57221 6147898 6154020 6158143 6161550 6164961 6167909 6169613 6169954 6169337 6168075 6166265 6163942 6161019 6157314 6152938
57207 6152938 6148503 6144691 6141773 6139684 6138322 6137489 6136759 6135856 6135135 6135318 6136645 6138524 6140162 6141309 6142185
57192 6142185 6142838 6142901 6142034 6140291 6137846 6134566 6130225 6125155 6120322 6116514 6113582 6110642 6106826 6101597 6094501
57177 6094501 6085134 6073606 6060779 6047604 6034109 6019246 6001932 5982185 5960969 5938888 5915382
57166 5915382 5889493 5861247 5831863 5802557 5773558 5744444 5715152 5686347 5658911 5633291 5609306
57155 5609306 5586395 5564136 5542608 5522256 5503317 5485483 5468137 5450830 5433482 5416258 5399235
57144 5399235 5381950 5363194 5341573 5316412 5287857 5255905 5219674 5178117 5131378 5081089 5029328
57133 5029328 4977602 4926906 4878389 4833606 4794045 4760501 4732983 4711164 4694728 4683186 4675486
57122 4675486 4670139 4665752 4661310 4656080 4649703 4642586 4636070 4632202 4633634 4643690 4665903 4703042 4756613
57109 4756613 4827373 4916041 5023578 5151668 5303878 5486712 5709672 5984646 6325343 6746817
57099 6746817 7265235 7898487 8667466 9596670 10713407 12046497 13624943 15475596 17619632
57090 17619632 20069770 22829457 25892481 29241646 32847941 36671194 40658652 44737029
57082 44737029 48800559 52705639 56282711 59366800 61834766 63627308 64737619 65171341
57074 65171341 64909247 63906308 62129732 59603621 56425231 52746732 48742621 44583300
57066 44583300 40420056 36377412 32549733 29001359 25769187 22866524 20288075 18015785
57058 18015785 16024244 14284631 12767451 11444646 10290975 9284451 8406069 7639127
57050 7639127 6968444 6380081 5861861 5403910 4998250 4637779 4315849 4026652 3765527
57041 3765527 3528749 3313287 3116776 2937347 2773299 2623143 2485961 2361372 2249053
57032 2249053 2148653 2060304 1984823 1923036 1875099 1840641 1819211 1810089 1811932 1823321 1843685
57021 1843685 1872540 1906351 1935728 1946610 1925925 1867944 1776803 1663947 1542893 1424742 1316275
57010 1316275 1220425 1137711 1067313 1007503 956101 911283 872097 838055 808402 782168 758786
56999 758786 738162 719982 703373 687446 671902 656928 642839 630020 618901 609683 602274 596747
56987 596747 593643 593498 596171 600918 607037 614164 621963 629704 636079 639274 637451 629513 615642 597089
56973 597089 575638 553316 532241 514148 499807 488983 481013 475432 472177 471431 473278 477467 483626
56960 483626 491782 502419 515757 531117 547298 563468 579252 593770 604871 609677 606061 593784
56948 593784 574529 551062 526261 502434 481061 462821 447926 436462 428463 423774 422223 424163
56936 424163 430473 441607 456793 474627 494329 515893 539125 563182 586941 608791 625700 633586
56924 633586 629706 614478 590503 560410 526416 491355 458563 430206 406319 385787 367776 352088
56912 352088 338724 327573 318316 310417 303366 297037 291601 287109 283470 280792 279337 279043 279376 279780
56898 279780 280077 280451 281358 283404 287002 292119 298699 307208 318288 331852 347040 363176 380238 398215
56884 398215 416481 434074 450120 463585 472947 476666 474074 465814 453616 439679 425881 413340
56872 413340 402753 395042 391204 391523 395500 402782 413688 428619 447639 471129 500207 535561 575961
56859 575961 618602 660957 701734 739828 772811 796796 807817 803585 784559 753847 716154 676494
56847 676494 639238 607541 583082 566276 556949 554965 560426 573639 595023 624766 662473 707428
56835 707428 759242 817707 881694 948615 1015239 1078323 1133604 1174617 1193919 1186442 1151996 1095132
56823 1095132 1023327 945048 867992 797641 736879 686747 647371 618410 599366 589962 590050 599074
56811 599074 616067 640434 672205 710953 754703 800513 845971 889375 928139 957529 971700
56800 971700 966383 940821 897681 841757 778859 715037 655489 603383 559658 524152 496661 476782
56788 476782 463402 455215 451851 453885 461620 474388 491176 511302 534008 557845 580880 601141
56776 601141 616336 623550 620099 605001 579389 545684 506800 466013 426654 391203 360605 334548
56764 334548 312285 293132 276534 262024 249256 238074 228531 220691 214330 208912 204028 199719 196151
56751 196151 193098 190103 187056 184193 181504 178558 175111 171509 168241 165418 162883 160577 158515 156616
56737 156616 154836 153334 152309 151834 151983 152822 154026 154851 154884 154607 154787 155463 155918 155582 154520 153148 151968
56720 151968 151558 152282 153793 155204 155972 156325 156712 157184 157533 157746 158067 158736 159843 161272 162690 163783 164614
56703 164614 165512 166571 167507 168064 168203 167814 166693 165090 163840 163484 163567 163261 162496 161976 162155 162765 163349 163765
56685 163765 163961 163711 162919 162020 161733 162368 163448 164127 164076 164011 165148 167945 171482 174300 175807 176598 177534
56668 177534 178852 180259 181490 182533 183503 184572 185877 187320 188508 189074 189068 188904 188935 189130 189161 188750 187984
56651 187984 187387 187618 188998 191316 194117 197121 200253 203363 206134 208367 210153 211660 212905 213951 215137
56636 215137 216790 218722 220369 221495 222363 223121 223458 223249 223130 223878 225423 226975 228039 228790 229462 229954
56620 229954 230129 230003 229466 228234 226275 223923 221463 218930 216362 213776 210870 207393 203980 201854 201276
56605 201276 200978 199692 197720 196301 195896 195834 195442 194754 194131 193763 193608 193454 193118 192840 193226 194429 195721
56588 195721 196330 196380 196487 196771 196918 196976 197401 198461 200160 202477 204964 206439 206025 204463 203475 203806 204745
56571 204745 205616 206721 208552 211000 213765 216821 220093 223347 226754 230911 235958 241359 246935 253376
56557 253376 261266 270213 279448 288573 297116 304001 308320 310255 310604 309727 307681 305081 302940 301589 300389
56542 300389 298595 296153 293562 291288 289417 287688 285844 283929 282110 280257 278122 275943 274357 273432
56528 273432 272317 270258 267557 265123 263403 262200 261206 260246 259136 257694 255785 253265 250182 247185 245211
56513 245211 244418 243916 242903 241575 240495 239656 238759 237907 237301 236574 235267 233720 232812 232899 233604 234496 235317
56496 235317 235695 235353 234637 234249 234412 234738 234852 234678 234196 233448 232737 232314 231924 231112 229867 228476 226969 225316
56478 225316 224018 223736 224366 225206 226066 227439 229397 231158 232093 232516 233056 233793 234451 235055 235871 236952 238074
56461 238074 239021 239689 240041 240149 240145 240067 239897 239775 239906 240193 240255 239896 239360 239044 239175 239749 240539 241151 241353 241400
56441 241400 241751 242452 243079 243339 243423 243726 244450 245521 246605 247248 247253 246944 246814 246959 247111 247093 246857 246186 244861
56422 244861 243143 241623 240532 239681 239135 239370 240501 241853 242669 242943 243204 243677 244022 243902 243561 243754 245069
56405 245069 247335 249763 251708 253106 254142 254874 255483 256467 258033 259564 260269 260269 260437 261247 262384 263536
56389 263536 264836 266330 267619 268366 268754 269205 270004 271336 273235 275344 277151 278657 280405 282613 284753
56374 284753 286211 286958 287242 287045 286219 284897 283424 282069 281017 280441 280378 280720 281441 282604 283997 285059
56358 285059 285392 285094 284493 283804 283220 283026 283418 284337 285637 287211 288924 290659 292504 294607 296762 298451
56342 298451 299440 300073 300901 302233 304049 306060 307809 309007 309830 310601 311334 311987 312987 314889 317511 320093
56326 320093 322484 325473 329632 334435 338874 342438 345122 346988 348172 349007 349682 350039 350004 349929 350184 350730
56310 350730 351341 351984 352716 353495 354362 355560 357244 359350 361865 364804 367827 370378 372544 375245 379191
56295 379191 384034 388924 393482 397800 401870 405578 409012 412345 415542 418538 421523 424764 428311 432158
56281 432158 436476 441473 447203 453718 461001 468593 475757 482417 489520 498088 508234 519489 531627
56268 531627 544603 557981 571112 583819 596500 609715 624066 640300 658976 680099 703531
56257 703531 729673 759312 792845 830100 870992 916019 966023 1021767 1083802 1152497 1228006
56246 1228006 1310294 1399179 1494358 1595379 1701538 1811663 1924014 2036671 2148007 2256486
56236 2256486 2359932 2455316 2539491 2609941 2664752 2702273 2721160 2720734 2701258 2664096 2611576
56225 2611576 2546292 2470321 2385235 2292826 2195428 2095443 1994913 1895565 1798852 1705815 1617197
56214 1617197 1533703 1455713 1382799 1314145 1249550 1189528 1134326 1083484 1036509 993379 954172
56203 954172 918807 887295 859599 835041 812581 791953 773817 758446 744974 732281 719940
56192 719940 707991 696565 686164 677490 670506 664347 658586 653752 650175 647275 644599 642591 641572
56179 641572 640913 640111 639742 640329 641095 641075 640814 641667 643879 646590 649423 652784 656726 660694 664482 668513
56163 668513 673101 678270 684224 691238 699065 707112 715125 723224 731531 740494 751211 764588 780347
56150 780347 797591 816183 836804 859968 885857 914968 948114 985919 1029040 1078736 1136316
56139 1136316 1202129 1275859 1357605 1447767 1545806 1649851 1757469 1866086 1972641 2073597
56129 2073597 2165601 2246041 2313538 2368697 2414181 2453230 2487960 2519096 2546375 2568144 2581175
56118 2581175 2582366 2570922 2548325 2516473 2476741 2430328 2377975 2318847 2250645 2171391 2081034
56107 2081034 1981717 1877404 1773225 1674164 1583671 1503417 1433985 1375369 1327126 1288580 1258799
56096 1258799 1236245 1219088 1206285 1197741 1193002 1190744 1190105 1191361 1194347 1197384 1199124 1200537 1203608
56083 1203608 1208784 1215149 1222229 1229896 1237189 1243215 1248979 1256477 1266093 1276598 1287504 1299606 1313164
56070 1313164 1327447 1342290 1358387 1375765 1393568 1411704 1431161 1452309 1474338 1496778 1520151
56059 1520151 1544711 1569798 1594860 1619927 1644772 1668763 1691800 1714301 1736184 1757108 1777767
56048 1777767 1799569 1822805 1846409 1869726 1893299 1917820 1943541 1970762 1999636 2029519 2059798
56037 2059798 2091227 2125020 2160838 2197249 2234082 2272574 2313270 2355581 2399447 2445585 2493993
56026 2493993 2544024 2596032 2651039 2708645 2767255 2826580 2887929 2951833 3017495 3084893 3155235
56015 3155235 3228809 3304492 3381988 3462608 3547366 3636202 3729475 3828161 3932111 4040107 4152114
56004 4152114 4269548 4393076 4522213 4657298 4799577 4949195 5105483 5269421 5443226
55995 5443226 5627243 5819912 6021140 6232952 6456527 6691580 6939171 7202207 7482624
55986 7482624 7780935 8098873 8439520 8804739 9195794 9616553 10072433 10566251 11099225
55977 11099225 11676172 12305466 12993886 13746523 14572249 15484326 16495487 17618185 18870765
55968 18870765 20278425 21868887 23674759 25741811 28129268 30902730 34134503 37909972
55960 37909972 42324220 47473978 53466272 60438153 68560977 78034988 89104145 102075880
55952 102075880 117294594 135075885 155662319 179186954 205553863 234266435 264407331
55945 264407331 294838708 324320397 351216233 373014268 386386003 388193494 376934292
55938 376934292 353601286 321378316 284470861 246832129 211357828 179679744 152381664
55931 152381664 129375110 110232749 94402126 81323167 70491705 61483820 53950543
55924 53950543 47606350 42224919 37632407 33691815 30290838 27340727 24774680 22537960
55916 22537960 20580186 18857848 17337707 15992705 14797390 13729792 12773418 11913690
55908 11913690 11135204 10425118 9776135 9183271 8640100 8140246 7679668 7254924 6861334
55899 6861334 6494920 6154057 5837424 5542418 5267144 5011664 4775612 4556568 4352316
55890 4352316 4162645 3987437 3825004 3673801 3533947 3405631 3287737 3179254 3080140 2989566
55880 2989566 2905185 2825473 2751008 2681967 2615899 2549369 2480537 2409142 2335535 2261012 2187821
55869 2187821 2117545 2050197 1985353 1922871 1862082 1801946 1742815 1686612 1634588 1586313 1541353
55858 1541353 1500190 1462746 1427700 1394086 1361985 1331002 1299854 1268328 1237846 1209138 1181110
55847 1181110 1152973 1125577 1099417 1073203 1046001 1019190 994660 972306 950897 930237 910855
55836 910855 892463 874346 856644 839952 824243 809308 795601 783533 772557 762014 752288 744021
55824 744021 736707 729093 720673 711967 703547 695367 686712 676543 664463 651599 639766 629470 619669
55811 619669 609826 601000 594299 589344 585060 581065 577561 574706 572798 572282 572929 573902 575190 577938 582655
55796 582655 588125 592880 596725 599901 601798 601625 599633 596623 592827 588186 583172 578412 573916 569395
55782 569395 564891 560541 556280 552238 548664 544856 538976 529721 517668 504589 492250 482314 476192
55769 476192 474021 474502 476489 479954 484707 489224 491713 491556 488905 483835 476874 469364 462090 454297 445223
55754 445223 435774 427374 419853 411914 403245 394782 387105 379895 372877 366202 359889 353831 348211 343128
55740 343128 338073 332601 327218 322745 319147 315901 313135 311308 309999 308098 305156 301614 297852 293957
55726 293957 290286 287216 284339 280896 277025 273612 270841 267836 263946 259519 255226 251450 248634 247389
55712 247389 247823 249302 251260 253768 257016 260786 264817 269331 274594 280026 284138 285607 284297 281120
55698 281120 276928 271892 266070 260078 254533 249102 242966 236297 230400 226217 223545 222032 221874 222943
55684 222943 224247 225138 226329 228707 231812 234497 236592 238799 241298 243631 245831 248525 251707 254374
55670 254374 255663 255729 255263 254611 253541 251588 248648 245456 243251 242618 242929 243308 243800 245049 247161 249510
55654 249510 251517 253100 254505 256084 257978 259674 260274 259558 258307 257093 255427 252731 249480 246462 243479
55639 243479 239816 235593 231530 227654 223338 218541 213902 209609 205215 200687 196680 193570 191126 189280
55625 189280 188311 187967 187260 185624 183659 182373 182105 182449 182801 182704 182051 181114 180154 179016 177404 175343 172915
55608 172915 169788 165701 161345 158006 156199 155242 154272 153095 151905 150766 149621 148416 147076 145712 144796
55593 144796 144662 144852 144436 143030 141166 139673 139128 139737 141248 142971 144362 145568 147102 149195 151808
55578 151808 154889 158040 160409 161722 163147 166183 170854 175875 180521 185332 190871 196753 202201 206817
55564 206817 210614 213878 217086 220287 222574 222948 221684 219940 217943 214618 209248 202564 195797 189528
55550 189528 183907 179114 175006 170919 166377 161588 156987 152841 149544 147602 146993 147175 147938 149499 151477
55535 151477 152736 152860 152930 154132 156196 157931 158717 158729 158179 157194 156201 155641 155357 154707 153249 150947 147942
55518 147942 144469 140825 137129 133273 129232 125127 120925 116609 112742 110188 108936 107936 106573 105568
55504 105568 105821 107014 108160 109009 110005 111193 112141 112825 113681 114698 115185 114677 113486 112194 111094 110351
55488 110351 110271 111036 112339 113547 114278 114761 115567 116880 118077 118221 116994 114958 112929 111464 110951 111594
55472 111594 112990 114154 114406 114015 113645 113458 113122 112445 111587 110757 109966 109039 107764 106270 105249 105353 106242
55455 106242 106807 106624 106532 107286 108323 108662 108493 108882 110082 111182 111505 111430 111553 111818 111956 112159 112767 113577
55437 113577 114007 113775 113002 111744 109854 107445 105252 104265 104917 106683 108543 109821 110532 110956 111104 110758
55421 110758 109974 109326 109565 110988 113135 115132 116427 117196 117997 119120 120405 121603 122658 123650 124690 125855
55405 125855 126926 127212 126021 123427 120310 117574 115566 114253 113466 112804 111829 110682 110128 110593 111454 111708
55389 111708 111073 109982 108751 107376 106104 105602 106235 107496 108459 108773 108983 109832 111322 112611 112900 112204
55373 112204 111139 110095 109000 107800 106731 105993 105513 105169 104890 104395 103262 101562 100103 99677 100231 101065
55357 101065 101631 101886 102040 102330 102972 104050 105359 106464 106894 106375 105067 103638 102842 102873 103250 103387 103091
55340 103091 102569 102263 102650 103867 105424 106638 107316 107660 107549 106588 104950 103483 102684 102169 101557 101239 101664
55323 101664 102390 102534 102003 101712 102667 105063 108102 110403 110956 110009 108750 107888 106994 105511 103754 102414
55307 102414 101697 101600 102500 104504 106578 107327 106613 105607 105233 105347 105526 105849 106584 107683 108900 110014 110763
55290 110763 110883 110418 109788 109469 109732 110542 111445 111789 111477 111368 112401 114355 115991 116430 115950 115390 115248 115447
55272 115447 115596 115332 114650 113986 113771 114014 114538 115364 116435 117195 117053 116278 115847 116269 116990 117119 116421 115462
55254 115462 115000 115272 115688 115355 114094 112702 111907 111433 110629 109695 109539 110530 112126 113696 115026 115950 116219
55237 116219 115898 115306 114408 112859 110769 108785 107229 105850 104657 104240 104862 105805 106172 105919 105666 105827 106342
55220 106342 107010 107685 108289 108831 109223 109099 108184 106944 106269 106367 106528 106307 106277 107143 108647 109986 110885 111610
55202 111610 112172 112271 112001 111951 112432 113004 112987 112253 111331 110839 110881 111042 110959 110717 110512 110127 109200 107999 107386 107832
55182 107832 108892 109889 110687 111458 112112 112385 112273 112035 111886 111977 112428 113145 113804 114279 114824 115677 116713 117714
55164 117714 118578 119049 118738 117881 117584 118695 120649 122018 122041 121053 119601 117825 115778 113750 112071 111012
55148 111012 110871 111668 112678 112892 112227 111811 112657 114399 115794 116242 116271 116542 116959 117064 116951 117273 118311 119442
55130 119442 119792 119203 118314 117787 117731 117831 117734 117244 116403 115471 114724 114290 114313 115052 116420 117603 117743 117084 116767
55111 116767 117304 117876 117578 116737 116396 116927 117832 118648 119322 119812 120005 120090 120494 121286 122066 122524 122746 122909 123089
55092 123089 123432 124129 125040 125731 126016 126157 126291 126014 124874 123139 121719 121302 121740 122381 122842 123307 124005 124664
55074 124664 124747 124219 123664 123475 123302 122630 121621 120910 120691 120558 120313 120457 121611 123643 125651 126780 126951
55057 126951 126768 126726 126665 126158 125351 124935 125147 125248 124456 123018 121858 121429 121516 121894 122432 122628 121958 120850 120441
55038 120441 121012 121432 120737 119542 119118 119595 119929 119479 118707 118293 118376 118872 119888 121344 122625 123062 122628 121857
55020 121857 121257 120978 120919 120863 120625 120265 120114 120390 120930 121493 122213 123343 124626 125344 125227 124929 125277 126238 127038
55001 127038 127188 127010 127114 127708 128546 129230 129386 128825 127799 126957 126869 127631 129016 130724 132324 133271 133377 133117
54983 133117 133123 133478 133863 134265 135014 136115 137041 137422 137566 137998 138719 139189 138896 137770 136154 134582 133473 132931
54965 132931 132892 133469 134866 136837 138605 139608 140100 140625 141137 141124 140526 139995 140018 140256 140075 139487 139170 139602
54947 139602 140464 140919 140351 138891 137353 136634 136966 137713 138039 137715 137176 136876 136888 137142 137689 138504 139306 139867
54929 139867 140398 141349 142926 145009 147432 150003 152350 154246 156160 159101 163632 169328 175410 181601 188075
54914 188075 194825 201470 207630 213143 217915 221813 224626 225918 224960 221179 214769 206729 198309 190523
54900 190523 183963 178621 173843 168864 163687 159226 156355 154948 154024 152754 151173 149928 149530 149928 150734
54885 150734 151695 152738 153687 154280 154671 155603 157731 160937 164668 168792 173596 178976 184295 189299 194631
54870 194631 200926 207686 213587 217824 220668 222634 223479 222294 218527 212689 206008 199440 193162 187040
54856 187040 181268 176199 171707 167238 162647 158482 155168 152332 149377 146444 144290 143289 142979 142587 141674
54841 141674 140280 138813 137815 137508 137458 136966 135852 134589 133640 132990 132485 132309 132823 134032 135417 136283 136272
54824 136272 135627 135056 135221 136214 137469 138134 137553 135669 133187 131255 130622 131095 131992 133041 134467 136210
54808 136210 137578 137915 137289 136261 135292 134687 134804 135807 137265 138418 138922 139074 139277 139557 139723 139787 140077
54791 140077 140927 142277 143523 143873 143017 141434 139969 139133 138969 139448 140700 142733 145130 147214 148538 149173
54775 149173 149537 149977 150562 151297 152480 154668 158222 162972 168377 173863 179032 183847 188805 194661 201676
54760 201676 209257 216644 223731 230822 237648 243168 246397 247054 245322 241450 235836 229059 221468 213056
54746 213056 204062 195433 188239 182746 178377 174499 170940 167823 165298 163444 162143 160997 159705 158543
54732 158543 158191 158957 160411 161905 163159 164211 165111 165988 167263 169471 172806 177013 181699 186643 191873
54717 191873 197577 203844 210354 216427 221567 225832 229320 231425 231098 228029 223011 216879 209591 200982
54703 200982 192017 184408 178909 174715 170798 167135 164219 161985 159904 157837 156097 154774 153550 152174
54689 152174 150599 148665 146199 143545 141509 140561 140391 140409 140328 140171 140033 140032 140219 140363 140111 139417 138591 137860
54671 137860 137233 136851 136988 137573 138138 138480 138927 139638 140130 139873 139016 138096 137349 136722 136250 135963 135648 135189 134973
54652 134973 135514 136760 138118 139002 139125 138547 137910 138244 139949 142149 143600 144059 144127 144026 143362 142171 141326
54635 141326 141596 142801 144162 145015 145053 144409 143765 143861 144577 144848 143826 141880 140215 139751 140485 141635 142215
54618 142215 141715 140439 139084 138061 137482 137608 138697 140357 141677 142262 142596 143178 143812 144118 144201 144344 144436
54601 144436 144274 144182 144776 146105 147440 147982 147603 146850 146304 145975 145417 144483 143728 143729 144284 144805 145311 146255 147383
54582 147383 147673 146722 145384 144645 144585 144888 145566 146482 146880 146259 145218 144636 144422 143980 143529 143965 145433 146974
54564 146974 147651 147365 146563 145853 145889 146919 148322 149204 149550 150149 151303 152321 152514 152066 151639 151619 152046 152773
54546 152773 153422 153585 153381 153442 154126 155092 155886 156559 157403 158385 159161 159491 159421 159258 159502 160600 162535 164762
54528 164762 166620 167717 168003 167770 167575 167821 168314 168486 168073 167267 166242 165019 163896 163456 163836 164331 164054
54511 164054 162760 160849 158896 157426 156806 156950 157277 157262 156941 156673 156616 156666 156754 156871 156862 156490 155800 155209 155120 155470
54491 155470 155750 155595 155315 155658 156940 158636 160026 160965 161605 161699 160855 159471 158650 158928 159637 159863 159549 159286
54473 159286 159535 160504 162324 164742 166897 168076 168631 169604 171398 173318 174519 174989 175381 176197 177384 178530
54457 178530 179212 179186 178415 177061 175431 173941 172998 172824 173278 173810 173686 172536 170849 169720 169778 170455 170601
54440 170601 169753 168404 167188 166381 166236 166990 168208 168772 168171 167292 167230 167707 167494 166266 165107 165006 165681
54423 165681 166257 166459 166601 166840 167067 167362 167971 168828 169532 169880 170107 170466 170844 170987 170908 170845 170894 170916 170791 170617
54403 170617 170641 171060 171851 172668 173010 172736 172406 172770 173874 175032 175838 176769 178418 180508 182248 183409 184370
54386 184370 185138 185141 184226 183220 183047 183735 184666 185420 185887 185932 185555 185182 185197 185196 184311 182363 180282 179187 179420
54367 179420 180546 181946 183121 183737 183728 183337 182906 182661 182766 183391 184525 185798 186703 186986 186752 186238 185651 185157
54349 185157 184776 184254 183274 181895 180626 179916 179772 179985 180506 181309 182135 182794 183624 185135 187183 189088 190688
54332 190688 192647 195370 198261 200572 202503 204712 207087 208775 209273 208731 207250 204759 201682 198878 196578
54317 196578 194043 190711 187139 184411 182954 182283 181553 180129 178017 176012 175006 174889 174605 173601 172579
54302 172579 172391 172761 172794 172316 171856 171568 171004 170010 169071 168567 168231 167690 167153 167232 168162 169432 170198 170051 169424
54283 169424 169181 169772 170868 171804 172148 171829 171091 170487 170565 171276 171929 171999 171657 171357 171289 171556 172380 173658 174726
54264 174726 175121 175254 175699 176119 175688 174475 173596 173922 175270 177014 178854 180746 182595 184321 185925 187301
54248 187301 188253 188792 189143 189455 189785 190306 191081 191644 191292 189891 187982 186030 184070 182207 180846 180145 179676
54231 179676 178982 178142 177489 177088 176797 176539 176180 175381 173986 172457 171589 171756 172605 173427 173729 173482 172970 172439
54213 172439 171936 171527 171507 172119 173107 173859 174003 173647 173029 172248 171401 170626 169935 169277 168854 169060 169983 171280 172647
54194 172647 174091 175628 177084 178402 179790 181258 182303 182365 181482 180264 179366 179095 179272 179279 178511 177033 175628
54177 175628 174942 174805 174627 174236 174000 174240 174857 175475 175716 175377 174612 173898 173596 173547 173256 172475 171461 170710 170563
54158 170563 171018 171754 172332 172469 172162 171544 170702 169692 168621 167651 167024 167068 167940 169251 170210 170321 169823 169309
54140 169309 169113 169228 169575 170045 170442 170730 171236 172263 173555 174528 175083 175769 176919 178014 178275 177722 177244
54123 177244 177558 178485 179315 179584 179249 178397 177227 176250 176111 177015 178549 180144 181532 182691 183668 184623 185811
54106 185811 187287 188800 190056 190816 190660 189194 186833 184844 184041 183778 182919 181507 180623 180706 181000 180884 180807
54089 180807 181383 182286 182710 182512 182235 182278 182708 183735 185692 188338 190641 191540 190899 189610 188815 188980 189660
54072 189660 190177 190458 191007 192104 193310 194019 194309 194957 196507 198445 199494 198961 197721 197472 198801 200429
54056 200429 200808 200025 199418 199641 200088 200324 200982 202762 205343 207967 210503 213328 216579 220180 224320 229283
54040 229283 234956 240977 247185 253552 259944 266443 273661 282233 292136 302925 314446 326843 339983
54027 339983 353403 366745 379792 392101 402937 411518 417086 418947 416811 411063 402534 392292 381785
54014 381785 372543 365129 358706 352238 345756 339860 334403 328611 322299 316008 309921 303564 296710 289765
54000 289765 283072 276659 270900 266572 263774 261481 258692 255516 252660 250277 247891 245224 242638 240815
53986 240815 240111 240042 239451 237652 235400 234194 234459 235099 235029 234370 233678 232831 231386 229522 227810 226364 224932
53969 224932 223549 222453 221610 220982 220974 221909 223246 224142 224622 225352 226312 226730 226502 226639 227843 229552 231036
53952 231036 232651 235137 238190 240759 242573 244434 246983 249989 253048 256226 259615 262835 265524 267984
53938 267984 270885 274545 278928 284059 289917 295966 301419 306141 310840 316115 321618 326457 330179 333060
53924 333060 335608 338155 340906 344043 347669 351838 356691 362417 369020 376246 383768 391314 398660 405698
53910 405698 412616 419809 427446 435170 442386 448792 454512 459673 463982 466851 467948 467550 466263 464488
53896 464488 462307 459844 457474 455473 453615 451395 448600 445458 442173 438549 434241 429275 424134 419326
53882 419326 414965 410840 406748 402598 398197 393213 387625 382177 378076 376058 375895 376886 378617 381086 384313
53867 384313 388138 392312 396408 399517 400231 397142 389499 377531 362358 345675 329300 314731 302743
53854 302743 293146 285023 277547 270735 265211 261185 257998 254895 251840 249229 247089 245168 243630 243009
53840 243009 243301 243606 242954 241222 239055 237157 235848 235075 234595 234225 233999 233996 234074 234048 234102 234665 235746 236790
53822 236790 237423 237943 238728 239502 239703 239445 239543 240527 242109 243790 245600 247837 250322 252396 253741 254899
53806 254899 256732 259504 262700 265755 268758 272353 277079 282892 289276 295651 301698 307377 312759 317887
53792 317887 322748 327251 331129 334057 336057 337679 339440 341117 342007 341924 341468 341140 340715 339896 339017 338439
53776 338439 337577 335352 331612 327447 323892 320844 317426 312985 307548 301662 296017 291001 286510 282351
53762 282351 278670 275612 272720 269338 265612 262376 259869 257296 254038 250553 247566 244988 242362 239905
53748 239905 238278 237526 237011 236355 235767 235449 235285 235172 235129 234958 234363 233567 233314 234015 235258 236325 236823 236594
53730 236594 235544 233997 232878 232975 234126 235560 237055 239288 242871 247406 251746 255006 257020 257943 257806
53715 257806 256685 255082 253832 253574 254386 255938 257875 260021 262335 264802 267427 270294 273541 277176 280956
53700 280956 284609 288228 292226 296765 301447 305810 309923 314095 318128 321388 323708 325719 328039 330533
53686 330533 332646 334127 334994 335025 333830 331439 328453 325508 322851 320505 318545 317043 315890 314874 313892
53671 313892 312974 312131 311353 310798 310844 311678 312841 313428 312988 312066 311591 311767 311795 310693 308237 305114 302383 300794
53653 300794 300334 300395 300466 300597 301042 301681 302174 302550 303141 303981 304870 306025 307904 310182 311645 311686 311302 311956
53635 311956 313840 315949 317581 318982 320543 322135 323474 324654 326018 327704 329547 331310 332947 334624
53621 334624 336494 338488 340539 342920 345961 349372 352400 354905 357761 361755 366570 371377 375903 380181
53607 380181 383740 386070 387828 390524 394762 399473 403158 405298 406389 407315 409018 412098 416182 420001
53593 420001 422515 423694 424052 423886 423344 422852 422901 423499 424173 424427 423996 422888 421426 420122 419262 418633 417842
53576 417842 416798 415808 415320 415604 416523 417582 418466 419533 421466 424359 427484 430068 431916 433134 433713 433673
53560 433673 433161 432028 429677 425840 421307 417416 414923 413682 413221 413155 413142 413008 413026 413680 414983 416326 417122
53543 417122 417416 417758 418676 420416 423019 426502 430910 436208 442131 448244 454278 460312 466577 473186 480225
53528 480225 488008 496996 507426 519139 531713 544664 557605 570424 583359 596793 610949 625802
53516 625802 641240 657210 673843 691572 711034 732628 756193 781210 807216 833787 860352
53505 860352 886445 912281 938656 965956 993452 1019897 1044756 1068588 1092218 1115867 1139190
53494 1139190 1161864 1183829 1205110 1225721 1245838 1265755 1285581 1305211 1324699 1344402 1364499
53483 1364499 1384592 1404112 1422941 1441251 1458826 1475069 1489797 1503623 1517329 1531135 1544723
53472 1544723 1557527 1568655 1576887 1581357 1582332 1580930 1577931 1573061 1565530 1555120 1542593 1529018 1514814
53459 1514814 1499574 1482888 1465123 1447060 1428896 1410072 1390271 1370093 1350334 1330940 1311203
53448 1311203 1290791 1270023 1249133 1227950 1206571 1185834 1166669 1149173 1132710 1116862 1101981
53437 1101981 1088829 1077938 1069333 1062612 1057137 1052341 1048074 1044725 1042898 1042881 1044407 1046952 1050256 1054578
53423 1054578 1060477 1068337 1078087 1089340 1101847 1115783 1131538 1149236 1168539 1188984 1210404 1232899
53411 1232899 1256516 1281186 1306986 1334303 1363659 1395383 1429451 1465525 1503151 1542079 1582403
53400 1582403 1624379 1668175 1713933 1761847 1811955 1863909 1917292 1972132 2028731 2086911 2145829
53389 2145829 2204668 2263204 2321504 2379455 2436808 2493351 2548662 2601987 2652764 2701032 2746919
53378 2746919 2789841 2828742 2863148 2893612 2921000 2945556 2966666 2983309 2994722 3000830 3002023 2998368
53366 2998368 2989186 2973659 2951602 2923243 2888482 2847053 2799564 2747764 2693486 2637694 2580807
53355 2580807 2523435 2466296 2409677 2353504 2297904 2243320 2190138 2138521 2088648 2040759 1994843
53344 1994843 1950421 1906736 1863052 1818910 1774373 1730157 1687269 1646369 1607572 1570909 1536739
53333 1536739 1505472 1477042 1450947 1426855 1404902 1385341 1368072 1352611 1338262 1324181 1309601
53322 1309601 1294407 1279358 1265283 1252049 1238728 1224874 1211145 1198516 1187373 1177748 1169911 1164086
53310 1164086 1159872 1156707 1154859 1155255 1158155 1162637 1167727 1173561 1180983 1190388 1201439 1213751 1227324
53297 1227324 1242309 1258666 1276184 1294681 1314193 1335121 1358132 1383732 1411784 1441424 1471449
53286 1471449 1500857 1529219 1556618 1583122 1608379 1631845 1653317 1672829 1689996 1703991 1714493
53275 1714493 1722199 1727906 1731439 1732050 1729633 1724814 1717822 1708033 1694915 1678882 1660827 1641197 1619875
53262 1619875 1596637 1571388 1544237 1515713 1486692 1457704 1428485 1398579 1368106 1337458 1306540
53251 1306540 1275050 1243538 1213345 1185128 1158061 1130953 1103717 1077138 1051540 1026373 1001055
53240 1001055 975587 950202 924992 900134 876095 853254 831545 810799 791287 773601 758009
53229 758009 744163 731484 719673 708777 698898 689908 681432 673039 664389 655209 645180 633993 621553
53216 621553 608062 593845 579138 564050 548687 533338 518597 505203 493587 483541 474516 466261
53204 466261 458978 452774 447195 441460 435077 428130 421084 414363 407926 401121 393177 384068 374780 366556
53190 366556 359976 354881 350923 347827 345226 342626 339665 336238 332456 328699 325656 323887 323198 322590 321035
53175 321035 318269 314876 311735 309374 307683 306202 304728 303564 303062 303146 303490 303978 304597 304984 304615 303487
53159 303487 302169 301024 299763 297996 295849 293800 292238 291417 291466 292079 292466 292013 290864 289533 288190 286685
53143 286685 285055 283523 282124 280827 279940 279851 280271 280325 279624 278792 278660 279304 280231 281193 282291 283362 283760
53126 283760 282917 280960 278711 277156 276848 277624 278869 280142 281495 283038 284365 284757 284057 282988 282382 282307
53110 282307 282231 281903 281660 281813 282027 281571 280057 277815 275572 273846 272578 271258 269477 267465 266058 265965
53094 265965 267076 268473 269132 268610 267225 265683 264484 263601 262787 262173 262282 263285 264500 264995 264551 263700
53078 263700 262922 262300 261961 262252 263173 264042 264153 263619 263221 263547 264548 265798 266918 267759 268391 268937 269319 269290
53060 269290 268819 268303 268201 268597 269251 269921 270427 270576 270345 270031 269950 270043 270035 269869 269731 269691 269621 269396 268921 268014 266637
53039 266637 265216 264415 264456 264941 265309 265244 264632 263474 261953 260355 258895 257792 257378 257776 258479 258688 258125
53022 258125 257173 256264 255593 255436 256088 257263 258175 258545 258959 259849 260740 261047 261118 261748 262971 264056 264506 264407
53004 264407 263920 263186 262749 263333 264948 266770 268055 268735 269049 269204 269611 270786 272572 273884 273766 272478
52988 272478 271182 270735 271125 271858 272500 272952 273550 274855 276999 279249 280496 280299 279339 278827 279547 281405 283756
52971 283756 286099 288467 291104 293919 296544 298892 301254 303664 305496 306067 305419 304214 303032 302112 301632
52956 301632 301652 301796 301443 300433 299271 298427 297703 296517 294612 292228 289741 287437 285587 284409 283789 283218
52940 283218 282187 280614 278801 277044 275450 274135 273347 273189 273348 273338 273075 272931 273188 273639 273900 273939 274030 274274
52922 274274 274439 274283 273834 273289 272818 272566 272719 273396 274439 275420 275931 275948 275886 276246 277173 278320 279101 279051 278094
52903 278094 276601 275132 273940 272777 271388 270074 269415 269412 269375 268835 268143 267879 268083 268504 269270 270695 272557
52886 272557 274163 275182 275929 276715 277378 277632 277524 277312 277158 277081 276991 276670 275957 275071 274493 274429 274613 274733 274712
52867 274712 274439 273671 272523 271785 272282 273981 276035 277663 278804 279946 281559 283661 285751 287186 287721
52852 287721 287686 287503 287140 286169 284256 281430 277914 273909 269621 265393 261695 258838 256658 254548 252032
52837 252032 249305 246994 245351 243939 242270 240523 239412 239465 240596 242271 243929 245261 246180 246565 246210
52822 246210 245262 244543 244952 246436 247972 248734 248824 248612 248058 247223 246921 247937 249746 250952 251138 251488 253187
52805 253187 255865 258172 259493 260403 261544 262683 263126 262615 261454 259824 257427 254059 250347 247506 246222
52790 246222 246016 245873 245317 244626 244190 244021 243921 243821 243806 243864 243785 243419 243102 243629 245401 247600 248788 248588 248234
52771 248234 248998 250548 251604 251851 252248 253394 254587 254837 254152 253287 252734 252394 251917 250930 249244 247211 245629
52754 245629 244921 244674 244321 244019 244372 245431 246475 246849 246657 246532 246929 247775 248715 249622 250783 252505 254637
52737 254637 256744 258699 260735 262863 264725 266214 267761 269609 271245 272035 272089 272004 272035 272139 272617 273923
52721 273923 275845 277539 278503 278915 278899 278183 276795 275421 274546 273724 272295 270468 269057 268315 267700 266802 265909
52704 265909 265447 265349 265300 265242 265312 265451 265418 265138 264762 264394 263981 263546 263354 263696 264531 265447 266021 266247 266580 267495
52684 267495 268950 270412 271459 272265 273303 274663 275913 276619 276717 276276 275261 273780 272326 271405 271031 270871
52668 270871 270799 270921 271112 270996 270543 270225 270331 270476 270152 269619 269798 271263 273564 275623 276682 276885 277027 277793
52650 277793 279188 280791 282495 284727 287736 290842 292721 292493 290388 287443 284743 282885 281851 281200 280449
52635 280449 279385 278068 276633 275215 274040 273387 273391 273980 275040 276542 278410 280360 282039 283358 284520
52620 284520 285545 285888 284905 282825 280914 280306 280769 281110 280704 280090 279915 279942 279565 278902 278701 279247 279920 279980
52602 279980 279402 278779 278701 279430 280982 283229 285848 288221 289637 289868 289573 289799 290814 291765 291838 291488 291937
52585 291937 293524 295172 295681 295033 294134 293646 293506 293378 293149 292987 293120 293630 294325 294844 294945 294664 294159 293551
52567 293551 292957 292467 291957 291111 289846 288630 288130 288493 289132 289253 288597 287649 287122 287183 287234 286568 285277 284282
52549 284282 284390 285472 286685 287283 287059 286223 285242 284772 285326 286729 288068 288400 287583 286370 285664 285712 285960
52532 285960 285642 284544 283197 282368 282321 282633 282766 282811 283532 285519 288349 290755 291744 291458 290805 290439 290352 290389
52514 290389 290709 291470 292302 292579 292290 292364 293890 297028 300895 304480 307533 310432 313342 315794 317128 317113
52498 317113 315968 313952 311208 307992 304752 301900 299607 297859 296576 295581 294655 293727 292899 292201 291437 290455
52482 290455 289443 288795 288676 288881 289160 289587 290527 292291 294772 297383 299354 300229 300176 299841 299877 300578 301944
52465 301944 303930 306471 309294 311978 314443 317240 321007 325547 329670 332113 332456 331133 328867 326349
52451 326349 324051 321850 318944 314683 309557 304914 301576 299168 296978 294991 293658 293023 292601 292000 291201
52436 291201 290265 289193 288196 287718 287956 288529 288785 288395 287577 286818 286481 286583 286912 287269 287605 287959 288415 289188
52418 289188 290560 292555 294770 296716 298257 299645 301230 303390 306554 310912 316073 321371 326619 332257
52404 332257 338646 345574 352713 360222 368433 377048 385007 391140 394650 394989 391825 385451 377078 368334
52390 368334 360351 353303 346766 340487 334805 330375 327513 325935 325216 325300 326283 327859 329464 331031 333156
52375 333156 336211 339733 343030 346116 349529 353458 357597 361790 366198 370730 374908 378521 381899 385181
52361 385181 387774 388985 388893 388142 387103 385753 384225 382913 381983 381284 380894 381374 383271 386521 390418 393972
52345 393972 396385 397602 398553 400447 403591 407136 410190 412940 416375 421114 426899 433183 439836 447111
52331 447111 455217 464169 473976 484783 496761 509991 524500 540257 557019 574282 591717 609716
52319 609716 629175 650454 672746 694754 715910 736579 757167 777467 796996 815627 833645
52308 833645 851389 869045 886667 904252 921848 939563 957282 974402 990208 1004566 1017961
52297 1017961 1030699 1042500 1053091 1062714 1071562 1078914 1083445 1084424 1082294 1078040 1072345 1065382 1057142
52284 1057142 1047819 1038037 1028668 1020250 1012638 1005493 999039 994011 990834 989318 989209 990648 993801 998397
52270 998397 1004027 1010732 1018955 1028964 1040540 1053205 1066564 1080475 1095050 1110407 1126299 1142106
52258 1142106 1157428 1172510 1187806 1203225 1218129 1232059 1245106 1257544 1269501 1281003 1291919
52247 1291919 1301647 1309305 1314499 1317501 1318328 1316213 1310603 1302365 1293210 1283990 1274308 1263773 1252768 1241709
52233 1241709 1230420 1218771 1207295 1196488 1185999 1175274 1164705 1155338 1147506 1140518 1133707 1127170
52221 1127170 1121368 1116568 1112862 1110194 1108200 1106472 1105197 1105115 1106633 1109335 1112544 1115980 1119670 1123691
52207 1123691 1128315 1134034 1141069 1149017 1157216 1165190 1172551 1178890 1184153 1188824 1193390 1197896 1202341 1207174
52193 1207174 1212852 1219113 1225183 1230652 1235682 1240437 1244834 1248940 1253141 1257659 1262095 1265615 1267491 1267481
52179 1267481 1265848 1262981 1258872 1253010 1244970 1235005 1223912 1212472 1201247 1190813 1181785 1174595 1169409
52166 1169409 1166167 1164437 1163374 1162191 1160737 1159442 1158814 1159265 1161174 1164598 1168925 1173261 1177166 1180602
52152 1180602 1183205 1184261 1183530 1181575 1179071 1176325 1173715 1172019 1171808 1172873 1174602 1176495 1177953 1178187 1177093
52137 1177093 1175849 1175735 1176507 1176767 1176021 1175466 1176582 1179819 1185130 1192888 1203403 1216059 1229888 1244927
52123 1244927 1262220 1282413 1305022 1329221 1354642 1381149 1408434 1436353 1465200 1495113 1525383
52112 1525383 1554760 1582323 1607769 1631100 1652451 1672089 1690102 1706155 1719862 1731307 1740820
52101 1740820 1748381 1753802 1757440 1760153 1762435 1764172 1765312 1766152 1766575 1765583 1762136 1756142 1748165 1738372 1726252
52086 1726252 1711301 1693726 1674542 1655177 1636803 1619834 1604176 1589994 1577858 1568052 1560298 1554520
52074 1554520 1551336 1551203 1553491 1557128 1561949 1568746 1578050 1589523 1602562 1616846 1632171 1648288 1665089
52061 1665089 1682559 1700369 1717848 1734419 1749779 1763657 1775805 1786252 1795198 1802670 1808657 1813422
52049 1813422 1817079 1818899 1817765 1813509 1807114 1799250 1789278 1776164 1759867 1741232 1720858 1698740 1675017
52036 1675017 1650574 1626760 1604587 1584135 1564666 1545477 1526711 1509096 1492923 1477754 1463312
52025 1463312 1450087 1438549 1428096 1417356 1405477 1392714 1379842 1367373 1355352 1343544 1331660
52014 1331660 1319538 1307221 1294853 1282592 1270615 1258985 1247406 1235281 1222211 1208258 1193613
52003 1193613 1178139 1161479 1143491 1124434 1104793 1084971 1064953 1044222 1022313 999618 977393
51992 977393 956796 938128 921158 905820 892276 880471 869971 860091 849964 838780 826333 813231
51980 813231 800254 787573 774841 761856 748809 735923 723215 710576 697860 684961 672072
51969 672072 659822 648983 640045 633234 628696 626408 626003 627030 629356 633090 638203 644406 651283 658269
51955 658269 664618 669734 673479 675878 676631 675243 671600 666088 659179 651287 643124 635841 630550 627793
51941 627793 627546 629614 633897 640305 648470 657695 667402 677593 688582 700182 711510 721708 730328
51928 730328 736662 739341 737420 731623 723709 714569 703625 690182 674590 657786 640390 622828 605911
51915 605911 590595 577172 565075 553565 542502 532472 524243 518080 513550 510126 507939 507724 509942
51902 509942 514232 519866 526487 534128 542634 551405 559877 568110 576567 585155 592653 597487 599162 598614
51888 598614 597003 594640 591482 588291 586629 587789 592176 599631 609695 621457 633715 645503 656108
51875 656108 664546 669608 670723 668396 663633 657344 650440 643866 638064 632704 627243 621435 615070 607712
51861 607712 599166 589839 580230 570433 560601 551519 544038 538174 533436 529900 528137 528078 528768 529528 530643
51846 530643 532407 534029 534137 532138 528496 523815 518256 511941 505386 499165 493469 488309 483940 480690
51832 480690 478451 476771 475543 475231 476253 478449 481306 484400 487314 489438 490309 490039 489025 487358 484969
51817 484969 482167 479421 476582 473063 469020 465685 464112 464130 465024 466721 469539 473009 475866 477362 477985
51802 477985 478573 479144 478880 477087 473877 470017 466386 463566 461844 461351 462007 463285 464326 464501 463813 462579
51786 462579 460822 458260 454872 451289 448469 447008 446693 446658 446044 444618 442733 440843 439269 438385 438602 439931
51770 439931 441929 444373 447699 452386 458141 464211 470416 477398 485787 495488 505743 515494 523681 529667
51756 529667 533572 535830 536263 533947 528242 519714 509862 500108 491125 482802 474569 465942 457077 448810
51742 448810 442049 437208 434259 433059 433453 435226 438205 442347 447634 453970 461271 469513 478556 488047
51728 488047 497527 506427 513916 519139 521951 523172 523850 524431 524979 525903 527739 530138 531608 530689 527141
51713 527141 521778 515508 508997 503044 498620 496124 494842 493477 491294 488619 486214 484382 482855 481515
51699 481515 480984 482266 485686 490227 494076 495932 495796 494497 492664 490413 487938 485936 485172 485784 487231
51684 487231 488671 489098 487391 482899 476124 468445 461056 454498 449213 445855 444614 444735 445322 446398 448633
51669 448633 452233 456657 461311 465865 469881 472927 475318 478164 482261 487306 492475 497275 501328 503780
51655 503780 503613 500565 495326 488979 482640 477428 474134 472725 472633 473651 476208 480635 486371 491885 495157
51640 495157 494414 489092 480439 470767 461780 453714 446083 438742 431985 426110 421341 417899 415724 414334
51626 414334 413366 413005 413459 414291 414819 415071 415707 417031 418648 420195 421790 423589 425446 427304 429447 431886
51610 431886 433879 434525 433650 431786 429482 427040 424740 422792 421064 419258 417477 416340 416501 418281 421709
51595 421709 426588 432491 439087 446652 455874 466823 478382 489056 498218 506130 512685 516728 517015 513719
51581 513719 508617 503815 500580 499411 500707 504838 511637 520322 530205 541319 554157 568989 585607
51568 585607 603631 622713 642383 662054 681442 700924 721265 742913 765688 789125 813001
51557 813001 837567 863488 891671 922827 956817 992342 1027382 1059855 1087653 1108237 1118925
51546 1118925 1118039 1105770 1083767 1054044 1018337 978043 934295 888128 840869 794298 750165 709604
51534 709604 673134 640990 613088 588962 568243 551138 537921 528008 520071 513065 506601 500393
51522 500393 494159 488282 483678 480500 477609 473987 470029 466713 463958 460804 457025 453520 450947 448835
51508 448835 446440 443836 441640 439999 438333 435940 432615 428729 424883 421438 418425 415913 414283 413857
51494 413857 414386 415285 416393 418009 420165 422381 424397 426678 429761 433384 436714 439364 441833 444871 448681
51479 448681 452762 456347 458908 460310 460612 459782 457693 454381 450216 445763 441431 437202 432635 427264 421152
51464 421152 414902 409021 403429 397858 392518 387964 384420 381652 379531 378190 377570 377315 377302 377808 378902
51449 378902 380191 381545 383599 387103 392110 398263 405520 414005 423435 433411 444236 456799 471513
51436 471513 487736 504148 519141 530896 537972 540293 539197 536255 532328 527856 523300 518721 513297
51423 513297 505984 496635 486115 475482 465508 456840 450003 445032 441473 438902 437210 436316 435914 435650
51409 435650 435277 434541 433283 431827 430946 431116 431957 432742 433254 433867 434925 436459 438468 441036 444085 447346
51393 447346 450736 454502 458910 464098 470368 478237 487952 499327 512379 527756 546065 567035 590045
51380 590045 615465 644832 679523 719715 764838 814382 867741 923627 980255 1036080 1089885
51369 1089885 1140046 1183986 1218466 1240475 1248206 1241695 1222578 1192996 1154604 1108678 1056867 1001326
51357 1001326 944024 886310 829330 774609 723924 678608 639001 604438 573800 546349 522181
51346 522181 501756 485037 471376 460226 451481 444802 439058 433011 426480 420386 415634 412313 409996
51333 409996 408313 406996 405734 404423 403402 403069 403244 403158 402197 400458 398535 396932 395828 395264 395245 395610
51317 395610 395981 395969 395384 394179 392409 390390 388717 387800 387358 386711 385639 384646 384198 384069 383730 383095 382465
51300 382465 381895 381161 380299 379673 379412 379260 379125 379270 379640 379529 378411 376774 375599 375171 375061 375225 376410
51283 376410 379182 383070 387163 391291 396147 402254 409174 415851 421511 426032 429531 431868 432722 432056 430243
51268 430243 427640 424254 420097 415738 412188 410152 409554 409806 410387 411052 411671 412027 411840 411064 410095 409472 409122
51251 409122 408113 405579 401831 398154 395434 393440 391582 389849 388594 387794 387075 386364 386015 386233 386762 387254
51235 387254 387672 388164 388765 389317 389621 389584 389311 389093 389213 389713 390334 390687 390562 390188 390199 391128 392818 394563 395967
51216 395967 397401 399364 401683 403755 405387 406851 408117 408668 408320 407695 407441 407370 406938 406396 406830 408926
51200 408926 412201 415729 419165 422611 425773 427886 428637 428635 428689 428882 428688 427800 426477 425106 423781 422372
51184 422372 420842 419475 418883 419622 421540 423683 425273 426611 428488 430702 431943 431344 429457 427263 424861
51169 424861 421853 418520 415713 413696 411924 410033 408378 407449 407320 407911 409259 411245 413440 415485 417323
51154 417323 418899 420013 420735 421590 422982 424577 425600 425643 424970 424082 423243 422423 421544 420705 420145 419942 419830
51137 419830 419431 418659 417761 416987 416370 415797 415140 414378 413729 413581 414051 414765 415400 416280 417999 420502 423111 425530
51119 425530 428216 431436 434497 436401 436957 436856 436830 437167 437905 439033 440434 441896 443322 444789 446397 448110
51103 448110 449782 451315 452817 454527 456529 458619 460661 462902 465612 468475 470728 472023 472748 473435 474188
51088 474188 474908 475721 476893 478526 480502 482552 484346 485744 486982 488242 489083 488811 487532 486182 485297
51073 485297 484437 483206 482145 481976 482550 483291 484246 485899 488202 490634 493106 496040 499621 503782 509010
51058 509010 516310 526013 537213 548721 560105 571405 582242 591695 599042 604479 609229 615007 623130
51045 623130 633862 646499 659955 673180 685325 695884 704670 711396 715472 716615 715492 713228 710272
51032 710272 706208 700681 693848 685670 675350 662034 645948 628554 611600 596168 582499 570493
51020 570493 560346 552637 547740 545302 544538 544911 546284 548543 551511 555250 560044 565947 572650 579866
51006 579866 587574 595815 604492 613408 622245 630606 638436 646359 655169 665014 675493 686500 698403
50993 698403 711319 724898 739072 754382 771172 788921 806766 824324 841628 858637 875113
50982 875113 890693 904791 916942 927667 938556 950876 964319 977602 990042 1001977 1013846
50971 1013846 1025629 1037346 1049638 1063631 1080567 1101635 1127854 1159871 1197919 1241910 1291445
50960 1291445 1345808 1404199 1465955 1530468 1597012 1664870 1733471 1802113 1869606 1934447 1995322
50949 1995322 2051277 2101488 2145154 2181697 2211046 2233866 2251529 2265572 2276906 2285685 2292110 2297040
50937 2297040 2301487 2305686 2308936 2310106 2307962 2301341 2289716 2273709 2254651 2233495 2210346 2184827
50925 2184827 2156399 2124298 2087661 2046021 1999449 1948232 1892674 1833325 1771105 1707088 1642363
50914 1642363 1578087 1515404 1455250 1398424 1345757 1297837 1254586 1215467 1180131 1148483 1120147
50903 1120147 1094411 1070906 1049844 1031343 1014975 1000250 987111 975501 964862 954635 945078
50892 945078 937026 930844 926081 922182 919118 917126 916101 915466 914587 913332 912307 912491 914454 917909 922159
50877 922159 926936 932526 939106 946286 953559 961011 969345 979193 990636 1003407 1017422 1032877 1049875
50864 1049875 1068164 1087396 1107633 1129540 1154072 1181961 1213400 1248100 1285843 1327128 1373221
50853 1373221 1425322 1483770 1548342 1619310 1697756 1784713 1880424 1984741 2097885 2220248 2351516
50842 2351516 2490407 2635283 2784724 2937502 3092340 3247748 3401716 3551409 3693415
50833 3693415 3824481 3941926 4043397 4126663 4190026 4232938 4256243 4262073 4253605 4234487 4208039
50822 4208039 4176954 4143870 4111894 4084107 4062566 4047992 4040254 4038588 4041184 4044984 4046241 4041178
50810 4041178 4026126 3997496 3952288 3888884 3807328 3708850 3595274 3468758 3331746 3186852
50800 3186852 3036753 2884316 2732806 2585738 2446192 2316238 2197095 2089781 1995202 1913462
50790 1913462 1843523 1784024 1734266 1693924 1662023 1636987 1617864 1604703 1597209 1593595 1591484 1589645
50778 1589645 1588085 1586603 1584120 1579687 1573422 1565987 1557547 1547711 1536243 1523316 1509087 1493404 1476032
50765 1476032 1456917 1436152 1413825 1390052 1365092 1339310 1313077 1286745 1260711 1235386 1211113
50754 1211113 1188283 1167648 1150352 1137275 1128290 1122403 1118703 1116953 1117319 1120030 1125595 1134813 1148046
50741 1148046 1164729 1184106 1206280 1232036 1261858 1295837 1334461 1378638 1428640 1483709 1543102
50730 1543102 1606943 1675600 1748693 1825277 1904693 1986654 2070669 2155860 2241301 2326022 2408652
50719 2408652 2487486 2561065 2628465 2688878 2741001 2782928 2812679 2828928 2831341 2820303 2796680
50708 2796680 2762311 2720701 2676531 2633967 2595545 2562732 2536885 2519007 2508880 2505139 2506259 2510991
50696 2510991 2517888 2524948 2529826 2529973 2522441 2504176 2473058 2428729 2372365 2305858 2231324 2151194
50684 2151194 2068351 1985920 1906717 1832717 1765049 1704508 1651997 1608394 1574107 1548972 1532458
50673 1532458 1523908 1522688 1528388 1540862 1559908 1584880 1614721 1648268 1684358 1721730 1759011 1794857
50661 1794857 1828122 1858109 1884761 1908366 1928883 1945845 1959237 1970189 1980327 1990543 2000770
50650 2000770 2010703 2020129 2028607 2035595 2041338 2047233 2054971 2065457 2078770 2094895 2114205 2137361 2165026
50637 2165026 2197627 2235140 2276919 2321750 2368203 2415164 2462156 2509082 2555579 2600790 2643798
50626 2643798 2684003 2720807 2753304 2780729 2802948 2819698 2829071 2827187 2809883 2775074 2724058 2661342
50614 2661342 2593421 2527001 2467421 2417934 2379886 2353123 2336394 2327843 2325427 2326929 2329929 2332262
50602 2332262 2332383 2328838 2319551 2302309 2276059 2241080 2197699 2145565 2084661 2016591 1944307 1870763
50590 1870763 1798079 1727554 1659952 1595840 1536034 1481557 1432939 1389767 1351190 1316663 1285957
50579 1285957 1258861 1235389 1216084 1201505 1191366 1184544 1179932 1176978 1175397 1174861 1175137 1176293 1178542
50566 1178542 1182046 1186919 1193310 1201331 1210989 1222296 1235358 1250292 1267032 1285374 1305340 1327541
50554 1327541 1352939 1382067 1414568 1449670 1486926 1526184 1566959 1608395 1649896 1691300 1732156
50543 1732156 1771245 1807240 1839733 1869443 1897742 1926250 1956610 1990199 2027998 2070850 2119576
50532 2119576 2174591 2235621 2302108 2373823 2450875 2533349 2621237 2714622 2813627 2918269 3028459
50521 3028459 3143821 3263166 3384359 3505091 3623612 3738295 3846736 3945840 4032832 4105626
50511 4105626 4162202 4200309 4218265 4215757 4193479 4152191 4092540 4015811 3924536 3822279 3712920
50500 3712920 3600240 3487938 3379687 3278914 3188592 3111354 3049643 3005388 2979350 2970842 2978077
50489 2978077 2998527 3028939 3065393 3103670 3139554 3168688 3186394 3188018 3169721 3129418 3067449
50478 3067449 2986459 2890185 2782056 2665030 2542579 2419031 2298384 2182977 2073539 1970169
50468 1970169 1872977 1782280 1698731 1623085 1555403 1494758 1440079 1390977 1347263 1308127 1272619
50457 1272619 1240893 1214168 1193265 1177659 1165993 1157066 1150267 1145591 1143336 1143474 1145336 1148302 1152640
50444 1152640 1159067 1167497 1176935 1186697 1197086 1208639 1221343 1234898 1249143 1263753 1277923 1290768
50432 1290768 1301931 1311665 1320690 1330051 1340544 1351902 1363009 1373270 1383381 1394364 1406353 1418976
50420 1418976 1432568 1448247 1466799 1488136 1512080 1539221 1570695 1607305 1649065 1695573 1746594
50409 1746594 1802116 1861882 1925105 1990915 2058854 2128489 2198571 2267069 2332173 2392805 2448008
50398 2448008 2496483 2537171 2569791 2594178 2609429 2614274 2608117 2591046 2562941 2523335 2472418 2411694
50386 2411694 2343408 2269702 2192589 2114432 2038019 1966173 1901325 1845251 1798972 1762917 1737184
50375 1737184 1721490 1714896 1715924 1723165 1735555 1751771 1769530 1785869 1798169 1804624 1803775 1794154 1774833
50362 1774833 1746111 1709208 1665319 1615419 1561025 1504600 1448715 1394920 1343662 1295085 1249538
50351 1249538 1207321 1168244 1131619 1096712 1063364 1032190 1003974 978782 956025 935513 917910
50340 917910 903702 892223 882432 874313 868650 865514 863884 862915 862737 863689 865561 868010 871067 874743
50326 874743 878709 882880 887838 894157 901744 910341 920187 931568 944122 957243 970868 985227 1000165
50313 1000165 1015453 1031444 1048579 1066327 1083433 1099206 1113683 1126454 1136234 1141942 1143524 1141390
50301 1141390 1135782 1127292 1117526 1108479 1101253 1095705 1091294 1087976 1086305 1086826 1089363 1093011 1097039 1101800
50287 1101800 1108343 1117075 1127209 1137772 1148786 1161090 1175309 1191387 1209042 1228156 1248398 1268393
50275 1268393 1285272 1295301 1295512 1285279 1266602 1243029 1218331 1195592 1176531 1161125 1148224 1136977
50263 1136977 1127508 1120066 1114020 1108280 1102459 1096994 1092210 1087896 1083958 1080909 1079346 1079287 1080290 1081948
50249 1081948 1083884 1085469 1086034 1085485 1084519 1084112 1084852 1086745 1089482 1092854 1096946 1102039 1108335 1115816 1124309
50234 1124309 1133611 1143558 1154154 1165694 1178525 1192516 1207002 1221548 1236675 1253482 1272647 1294223
50222 1294223 1318367 1345618 1376036 1408538 1441539 1473991 1505334 1534775 1561361 1584804 1605563
50211 1605563 1623986 1639982 1653747 1666139 1677783 1688079 1695486 1698444 1695531 1685048 1665256 1635378
50199 1635378 1596242 1549960 1499225 1446688 1394472 1343984 1296257 1252490 1214010 1181647 1155258
50188 1155258 1133898 1116263 1100973 1086578 1071424 1053629 1031548 1004680 974285 942914 913140
50177 913140 886536 863515 843744 826601 811459 797805 785334 774132 764704 757460 751959 746929
50165 746929 741378 735565 730585 727103 724829 723175 722078 722073 723745 727095 731308 735296 738728 742429 747513
50150 747513 754232 762006 770345 779200 788422 797438 805638 812713 818492 822856 825907 827879 828769 828507 827557
50135 827557 826809 826632 826602 826584 827571 830832 836494 843513 850958 858841 867699 877840 889098 901066 913484
50120 913484 926546 940819 956771 974456 993813 1015080 1038723 1065146 1094753 1128065 1165459
50109 1165459 1206951 1252648 1303311 1359922 1422631 1490538 1562607 1638356 1717382 1798522 1879863
50098 1879863 1959424 2035666 2107618 2174934 2237923 2297195 2353071 2405303 2453341 2496586 2534058
50087 2534058 2563613 2581773 2584801 2570409 2538586 2490937 2429580 2356870 2275824 2190113 2103215
50076 2103215 2017598 1934751 1855803 1781829 1713613 1651294 1594476 1542804 1496457 1455847 1420693
50065 1420693 1389485 1360219 1331770 1304354 1278576 1254285 1230652 1207178 1184262 1162696 1142929
50054 1142929 1124949 1108661 1094070 1081089 1069431 1058826 1049308 1041212 1034890 1030415 1027489 1025654
50042 1025654 1024693 1024885 1026736 1030391 1035422 1041282 1047838 1055272 1063602 1072526 1081747 1091166 1100718 1110179
50028 1110179 1119196 1127322 1134023 1138946 1142265 1144467 1145619 1145130 1142446 1137704 1131415 1123813 1114923 1105054
50014 1105054 1094633 1083618 1071676 1059074 1046753 1035156 1023583 1011254 998666 987247 977867
50003 977867 970423 964902 961967 962071 964673 968966 975090 983976 996217 1011854 1031184 1054905 1083046
49990 1083046 1114367 1147369 1181534 1217191 1254617 1293895 1335272 1378800 1423566 1467971 1510881
49979 1510881 1551849 1590061 1623895 1652132 1675165 1694416 1710811 1724363 1735043 1743396 1750111 1755238
49967 1755238 1757730 1755307 1744765 1723026 1688462 1641505 1584217 1519494 1450424 1379870 1310320 1244125
49955 1244125 1183614 1130511 1085149 1046733 1014590 988845 969631 956063 946536 939952 936195 935279
49943 935279 936444 938274 939496 939491 938153 935573 931841 927029 921262 914729 907506 899228 889067 876220
49929 876220 860427 841898 820902 797843 773867 750946 730861 714108 700057 688076 678171 670594
49917 670594 665319 662066 660480 660053 660135 660406 661120 662645 664918 667642 670842 674790 679479 684612 690237
49902 690237 696965 705322 715132 725797 737012 748918 761685 775244 789460 804154 818669 831545
49890 831545 841055 846344 847977 847196 844640 839989 832808 823362 812401 800372 787273 773198 758581
49877 758581 743729 728476 712616 696533 681048 666690 653456 641387 630970 622652 616156 610786
49865 610786 606424 603763 603287 604432 606236 608594 612279 617741 624452 631684 639458 648319 658503 669762
49851 669762 681861 694780 708438 722519 736647 750470 763510 775079 784402 790790 793847 793791 791543
49838 791543 788274 784681 780678 775608 768644 759221 747475 734340 721034 708422 696958 687052 679138
49825 679138 673377 669660 667960 668341 670471 673459 676508 679671 683785 689693 697612 707172 717871 729492
49811 729492 742080 755583 769550 783288 796266 808234 818983 828160 835381 840450 843465 844826
49799 844826 845012 844166 841844 837366 830476 821505 810948 799184 786677 774141 762151 750620 738902
49786 738902 726555 713961 702158 691988 683509 676356 670564 666648 664659 663546 661966 659591 657124
49773 657124 655123 653442 651977 651364 652431 655282 659355 664204 669885 676659 684682 693905 703943 713952
49759 713952 722853 729874 734940 738646 741796 744713 746863 747290 745536 741937 736876 729990 720549 708575
49745 708575 695317 682506 671252 661674 653450 646542 641305 637894 635777 634081 632404 631013 630194 629732
49731 629732 629221 628574 627980 627594 627580 628377 630558 634357 639446 645128 650719 655980 661453 668245 677215 688320
49715 688320 700823 713890 726836 739128 750546 761160 770674 777849 781108 779887 775132 768452 761095
49702 761095 753695 746487 739386 732152 724794 717689 711199 705363 700093 695368 690949 686175 680505 674313
49688 674313 668823 665145 663513 663479 664658 667108 671075 676589 683412 691299 700247 710459 722202 735727
49674 735727 751148 768232 786367 804950 823733 842444 859940 874091 882953 886141 884954 881277
49662 881277 876603 871978 868284 866134 865554 866127 867496 869553 871983 873662 872529 866116 852638 832128
49648 832128 806784 779954 754433 731598 711850 695314 681874 670996 662117 655123 650046 646544
49636 646544 644166 642986 643324 644827 646483 647643 648298 648103 646030 641653 636162 631236 627156 622784 617246
49621 617246 610867 604428 598262 592392 587077 582799 579807 577823 576142 574209 572260 571193 571483 572467 573148
49606 573148 573475 574230 575815 577889 580244 583243 587044 591002 594287 596651 598213 598925 598736 598099 597836 598484
49590 598484 599878 601300 602014 601913 601766 602523 604320 606519 608709 611103 613803 616359 618492 620688 623501
49575 623501 626719 629802 632797 636132 639788 643420 647218 651935 658012 665305 673738 683549 694635 706205
49561 706205 717478 728372 739105 749331 758018 764208 767695 768869 767993 764825 759173 751771 744157
49548 744157 737469 731692 726468 722186 719618 718686 718401 718120 718199 719150 720805 722684 724696 727017 729658 732610
49532 732610 736142 740572 745890 752031 759337 768325 779053 791075 804019 817913 832952 849322 867245
49519 867245 886857 907744 928739 948338 965312 978943 988886 995073 997855 998167 997398 996968 997906 1000665
49505 1000665 1005053 1010232 1014977 1018187 1019127 1017070 1010941 999826 983974 964903 944356 923370 902552
49492 902552 882832 865443 851128 839590 829775 820586 811501 802727 794843 788262 783055 779230 776863
49479 776863 775795 775463 775268 774986 774671 774427 774490 775275 776928 778934 780519 781444 782146 783298 785463 788997 793778
49462 793778 799111 804279 809126 813737 817719 820452 822058 823359 824649 825134 823920 820981 816792 811704
49448 811704 806195 801125 796875 792574 787070 780489 774079 768614 763835 759497 755954 753357 751170 749102
49434 749102 747915 748597 751162 754887 759393 764785 770992 777798 785523 794923 806201 818698 831872 846118
49420 846118 862191 880048 898624 916636 933439 949101 963715 976448 985266 987999 984128 975637
49408 975637 966035 958545 955044 956204 962089 972450 986646 1003462 1021308 1038977 1056329 1074013
49396 1074013 1092364 1110822 1128571 1145377 1161488 1176931 1191299 1204044 1214619 1222476 1227388 1229682
49384 1229682 1229690 1226986 1220739 1210907 1198518 1184543 1169101 1152197 1134716 1118013 1102726 1088702 1076075
49371 1076075 1065729 1058393 1053717 1050691 1048720 1047939 1048494 1050004 1051927 1054151 1056780 1059315 1060521 1059404
49357 1059404 1056099 1051359 1045381 1037765 1028729 1019673 1012024 1005927 1000510 995111 989702 984438 979565 975805
49343 975805 973973 973943 974570 974999 975554 976892 978722 979972 979970 978921 977251 975042 972202 968743 964669 959899
49327 959899 954574 949346 945162 942657 941716 941578 941461 941249 941543 942934 945320 948081 950769 953386 956058
49312 956058 958817 961781 965183 969055 973053 976760 980021 982903 985576 988325 991377 994529 997246 999491
49298 999491 1002194 1006467 1012398 1019056 1025699 1032529 1040209 1049119 1059333 1070883 1083559 1096599 1109052
49285 1109052 1120520 1131309 1141834 1152128 1161989 1171325 1180163 1188482 1196254 1203676 1211233 1219427 1228400
49272 1228400 1237739 1246646 1254229 1259632 1261941 1260299 1254421 1244985 1233286 1220419 1206989 1193638 1181505
49259 1181505 1171801 1164984 1160680 1158505 1158734 1162040 1168796 1178942 1192484 1209724 1230668 1254257 1278411
49246 1278411 1300936 1320263 1335300 1344806 1347272 1341556 1327676 1307051 1282037 1255116 1228212 1202605
49234 1202605 1179386 1159794 1144878 1134867 1129141 1126909 1127774 1131587 1138045 1146594 1156562 1167101 1177188
49221 1177188 1185938 1192890 1197835 1200604 1201414 1201379 1202126 1204624 1208556 1213052 1217828 1223369 1230142 1237871 1245677
49206 1245677 1252799 1259225 1265714 1273238 1282399 1293303 1305893 1320142 1335874 1352567 1369590 1386612
49194 1386612 1403708 1421048 1438537 1455705 1471916 1486719 1500109 1512381 1523752 1534196 1543726
49183 1543726 1552672 1561588 1570957 1581117 1592410 1605194 1619686 1635898 1653743 1673198 1694477 1718208
49171 1718208 1745391 1776979 1813312 1853894 1897609 1943045 1988598 2032348 2071790 2103773 2125057
49160 2125057 2133591 2129747 2116501 2098412 2080075 2064884 2054442 2048769 2047175 2049060 2053901 2060707 2068054
49147 2068054 2074988 2081620 2088486 2095500 2102009 2107850 2113914 2121473 2131291 2143576 2158350 2175318 2193496
49134 2193496 2211579 2228938 2245964 2263300 2281087 2299202 2317803 2337077 2356630 2375739 2394299
49123 2394299 2412956 2432079 2451176 2469719 2488132 2507370 2527769 2548971 2570899 2594112 2619040
49112 2619040 2645601 2674072 2705917 2743134 2786849 2837026 2893523 2957008 3028760 3109980 3201413
49101 3201413 3302792 3411457 3521172 3623341 3711179 3783764 3845650 3901141 3947722 3974879
49091 3974879 3970139 3927851 3853674 3761360 3664522 3569819 3476350 3380536 3281457 3182317 3088255
49080 3088255 3003777 2931733 2873189 2827337 2791916 2764496 2743403 2727345 2714653 2703502 2692776
49069 2692776 2682216 2671759 2661135 2650158 2638966 2627884 2617259 2607452 2598614 2590379 2582066 2573270
49057 2573270 2564077 2554704 2545276 2536077 2527697 2520697 2515275 2511369 2508869 2507517 2506785 2506138 2505393 2504694 2504186
49042 2504186 2503897 2503980 2504962 2507596 2512337 2518980 2526990 2536221 2547118 2560066 2574779 2590611 2607124 2623826
49028 2623826 2639438 2652121 2660722 2665324 2666380 2663802 2657401 2647872 2636764 2625454 2614511 2604052
49016 2604052 2594399 2586248 2580297 2576744 2575115 2574712 2575240 2576875 2579734 2583623 2588427 2594381 2601621 2609720
49002 2609720 2617984 2625998 2633647 2640858 2647642 2654136 2660229 2665393 2669298 2672318 2674906 2676697 2676890 2675407
48988 2675407 2672989 2670165 2666829 2662956 2658904 2654690 2649659 2643370 2636419 2629882 2624318 2619605 2615463 2611722
48974 2611722 2608395 2605804 2604305 2603654 2603010 2601957 2601042 2600808 2600756 2599958 2598422 2597142 2596865 2597517 2598849 2600988
48958 2600988 2604172 2608397 2613575 2619783 2627275 2636437 2647587 2660467 2674166 2688080 2702838 2719685
48946 2719685 2738962 2759818 2781472 2804072 2828187 2854133 2882003 2911613 2942100 2972306 3002113
48935 3002113 3032836 3065836 3101327 3139025 3179246 3222511 3268637 3317146 3368281 3422641 3479988
48924 3479988 3539422 3600727 3664452 3730395 3796994 3862797 3927853 3993094 4058832 4124455 4189186
48913 4189186 4252486 4313823 4372549 4428092 4480129 4528786 4574825 4619363 4663030 4705491 4745960
48902 4745960 4783926 4819172 4851438 4880550 4906765 4930584 4952273 4971846 4989470 5005443 5019739
48891 5019739 5031834 5041184 5047745 5052014 5054583 5055568 5054392 5050255 5042902 5032678 5019671 5003139 4982205
48878 4982205 4956873 4927888 4895713 4860263 4821734 4781031 4738986 4695428 4649357 4599846 4546591
48867 4546591 4489840 4430193 4368394 4305101 4240787 4175980 4111551 4048616 3988152 3930698 3876361
48856 3876361 3825014 3776576 3731138 3688819 3649555 3613226 3579977 3550241 3524382 3502408 3483967
48845 3483967 3468374 3454701 3442303 3431440 3423084 3417854 3415427 3415240 3417433 3422726 3431520 3443516 3458091
48832 3458091 3474648 3492652 3511747 3531857 3552939 3574664 3596659 3618956 3641821 3665196 3688794
48821 3688794 3712686 3737193 3762065 3786438 3810015 3833740 3858734 3884890 3911102 3936637 3961648
48810 3961648 3986442 4010977 4035276 4059784 4084912 4110513 4136127 4161594 4187184 4213269 4240031
48799 4240031 4267463 4295469 4323965 4352925 4382334 4412119 4442128 4472109 4501582 4529856 4556373
48788 4556373 4580988 4603637 4623840 4640886 4654622 4665670 4674616 4681221 4684588 4683835 4678386 4667853
48776 4667853 4652080 4631229 4605534 4574998 4539627 4499936 4456985 4411804 4364918 4316411 4266354
48765 4266354 4215134 4163422 4111689 4059772 4007123 3953623 3899851 3846433 3793537 3741424 3691094
48754 3691094 3643744 3599759 3558887 3521248 3487355 3457018 3429163 3403176 3379722 3359702 3342973
48743 3342973 3328705 3316421 3305879 3296335 3287020 3278435 3272305 3269897 3270900 3274160 3278890 3284764 3291254
48730 3291254 3297486 3302729 3306760 3309763 3312025 3313691 3314754 3315366 3316099 3317684 3320405 3323929 3327712 3331278
48716 3331278 3334097 3335608 3335672 3334788 3333652 3332663 3332015 3331983 3332812 3334466 3336734 3339490 3342623 3345850 3348896 3351771
48700 3351771 3354621 3357423 3360085 3362754 3365655 3368679 3371511 3374265 3377589 3381946 3387099 3392522 3398056 3403805
48686 3403805 3409545 3414640 3418594 3421422 3423359 3424427 3424465 3423481 3421791 3419833 3417933 3416225 3414594 3412583 3409470
48671 3409470 3404611 3397736 3388773 3377401 3362969 3345089 3324254 3301661 3278383 3254812 3230853 3206334
48659 3206334 3180990 3154291 3125717 3095362 3064001 3032354 3000299 2966911 2931223 2892960 2852711
48648 2852711 2811668 2771252 2732801 2697323 2665272 2636416 2610002 2585241 2561691 2539064 2516775
48637 2516775 2494030 2470478 2446384 2421926 2396729 2370600 2344441 2319770 2297235 2276151 2255582
48626 2255582 2235239 2215104 2194787 2173859 2152433 2130923 2109464 2088122 2067489 2048492 2031573
48615 2031573 2016502 2003116 1991830 1983289 1977753 1974946 1974305 1975302 1977621 1981051 1985171 1989333 1993081 1996364
48601 1996364 1999009 2000299 1999528 1996931 1993621 1990701 1988814 1988416 1989747 1992345 1995043 1996667 1996456 1993820 1988263
48586 1988263 1979767 1968829 1955934 1941355 1925605 1909568 1893912 1878843 1864652 1851956 1840951
48575 1840951 1830937 1821117 1811658 1803524 1797533 1793984 1792880 1793985 1796824 1801067 1806782 1813997 1822215 1830719
48561 1830719 1839161 1847470 1855391 1862496 1868299 1871896 1871867 1867250 1858569 1847322 1834607 1820861 1806706
48548 1806706 1793153 1780790 1769528 1759297 1750217 1741732 1732349 1720839 1707281 1692436 1676595 1659686
48536 1659686 1642197 1625289 1609980 1596716 1585646 1576787 1569801 1564148 1559753 1557212 1557060 1559090 1562797
48523 1562797 1568385 1576714 1587994 1600873 1613496 1625364 1637433 1649780 1659595 1662212 1654458 1636938
48511 1636938 1613288 1587726 1563311 1541703 1523738 1510006 1501138 1497712 1499901 1507246 1518822 1533607
48499 1533607 1550729 1569419 1588797 1607759 1625207 1640483 1653381 1663423 1669066 1667905 1657992 1639158
48487 1639158 1613254 1583302 1552368 1522859 1496337 1473426 1453637 1435535 1417596 1399310 1381455
48476 1381455 1365311 1351675 1340475 1330980 1322302 1314075 1306822 1301404 1297987 1295867 1294365 1293465 1293385 1294126
48462 1294126 1295804 1298843 1303307 1308514 1313951 1320135 1327870 1336988 1346618 1356362 1366280 1375838 1383909 1389921
48448 1389921 1394132 1396620 1396878 1394772 1391126 1386973 1382777 1378727 1375151 1372218 1369676 1367164 1364305 1360309
48434 1360309 1354131 1345435 1334932 1323565 1311870 1300418 1290120 1281467 1273900 1266394 1258362 1249704 1240551
48421 1240551 1231433 1223158 1215896 1208701 1200459 1191088 1181387 1172046 1163205 1154651 1145991 1136939 1127818 1119427
48407 1119427 1112029 1104963 1097766 1091158 1086145 1082468 1078772 1074176 1068975 1063853 1059138 1054943 1051386 1048365
48393 1048365 1045437 1042137 1038239 1033687 1028472 1022647 1016405 1010149 1004437 999575 995303 991242 987666 985203
48379 985203 983643 981753 978760 975387 972874 971465 970468 969307 967847 966030 963836 961359 958415 954543
48365 954543 949978 946045 943751 942453 940844 938849 937472 937040 936776 936135 935377 934629 933438 931645 929810
48350 929810 928334 926909 925264 923802 922946 922308 921034 918821 916273 914379 913680 913789 913782 913287 913020 913912 915966
48333 915966 918441 920912 923541 926469 929663 933349 937937 943495 949820 956909 964716 972694 980424 988635
48319 988635 998606 1010426 1022810 1034871 1047159 1060541 1074907 1089434 1103494 1116820 1129416 1141753
48307 1141753 1154426 1167009 1177647 1184399 1186978 1186986 1186743 1188079 1191892 1198336 1207358 1219119 1234066 1252794
48293 1252794 1275871 1303435 1334925 1369813 1408829 1453706 1505181 1562128 1623442 1690049 1764233
48282 1764233 1847963 1943073 2052373 2179298 2327150 2499831 2702439 2939826 3215793 3535435
48272 3535435 3907220 4341510 4849713 5447964 6159202 7007472 8012031 9190042 10556943
48263 10556943 12109281 13805424 15577390 17366255 19123126 20746923 22022993 22658612
48255 22658612 22421504 21275635 19406586 17130626 14767455 12553224 10615517 8991879
48247 8991879 7665022 6594392 5734743 5043919 4486129 4033008 3662100 3354991 3097491
48238 3097491 2880082 2695977 2538721 2402539 2284035 2181716 2093840 2017786 1951129 1892087
48228 1892087 1839017 1790457 1745540 1703546 1663292 1623744 1584956 1547634 1512020 1477863 1445054
48217 1445054 1413503 1382737 1352450 1323193 1295855 1270744 1247783 1227157 1208935 1192417 1176718
48206 1176718 1161859 1148514 1136766 1125629 1113475 1098369 1078535 1053555 1025112 995809 967268
48195 967268 939853 913875 890114 869119 850743 834515 820032 807008 795382 785323 776777 769227
48183 769227 762353 756534 752129 748567 744831 740636 736435 732541 729035 726348 724998 724679 724407 723666 722768
48168 722768 722085 721607 721352 721419 721499 720996 719927 719101 719172 720035 721295 722724 724064 724996 725618 726413 727468 728280
48150 728280 728679 729423 731398 734562 738110 741332 743902 745650 746559 746925 747157 747457 747889 748596 749694 751025
48134 751025 752294 753367 754295 755163 756188 757874 760762 764878 769518 773721 776985 779499 781710 783796 785752
48119 785752 787886 790814 794784 799378 804256 809898 817033 825442 833937 841699 849130 857194 866300 876058
48105 876058 885814 895139 904094 913295 923546 935161 947786 960938 974504 988523 1002871 1017507
48093 1017507 1032799 1049108 1066087 1082833 1098844 1114466 1130303 1146476 1162731 1178954 1195118
48082 1195118 1210788 1225189 1238008 1249794 1261237 1272251 1282207 1290972 1299165 1307266 1315070 1322344
48070 1322344 1329531 1337224 1345168 1352470 1358796 1364890 1371800 1379985 1389237 1398973 1408385 1416739 1423933 1430495
48056 1430495 1436641 1441488 1443611 1442368 1438373 1432645 1425680 1417541 1408406 1398484 1387410 1374307 1358805
48043 1358805 1341731 1324370 1307189 1289695 1271488 1252860 1234166 1215188 1195491 1175072 1154186
48032 1154186 1132862 1111130 1089628 1069345 1050621 1032842 1015276 997918 981241 965319 949478
48021 949478 932899 915584 898685 883658 870962 859701 848653 837372 826122 815155 804511
48010 804511 794333 784789 775721 766898 758641 751718 746481 742479 739004 735630 732172 728720 725895 724559
47996 724559 724897 726064 727071 727710 728338 729135 729961 730762 731653 732652 733602 734368 734853 734859 734174 732856 731347 730253
47978 730253 729928 730142 730129 729151 727116 724599 722294 720615 719673 719201 718465 716770 714330 712233 711146 710329
47962 710329 708366 704734 700261 696134 692908 690520 688878 688105 688312 689325 690776 692559 695126 699121 704593
47947 704593 710719 716424 721261 725662 730531 736615 744042 752265 760605 768928 777621 786855 796245 805415
47933 805415 814520 823898 833481 842912 852007 860589 868082 873806 877695 880291 881968 882563 881847 879928 876997
47918 876997 873009 867860 861671 854679 847026 838832 830385 822088 814228 806819 799577 792094 784264 776620
47904 776620 770075 765189 761747 759104 756822 754945 753797 753589 754172 755145 756265 757703 759726 762311 765342
47889 765342 769079 774049 780368 787600 795406 803891 813070 822390 831224 839492 847380 854740 861334 867459
47875 867459 873605 879513 884299 887689 890469 893358 895997 897527 897639 896447 893724 889046 882572 874981
47861 874981 866599 857284 847254 837296 827841 818471 808822 799443 791153 783822 776465 768512 760386 752764
47847 752764 745797 739355 733649 729267 726617 725572 725644 726359 727457 728857 730615 732884 735778 739099 742362
47832 742362 745364 748577 752617 757299 761746 765530 769119 772872 776263 778708 780719 783384 786914 790492
47818 790492 793504 796179 798978 802152 806108 811445 818334 826452 835813 846945 859953 874163 889300
47805 889300 906278 926057 948196 971399 995094 1019486 1044108 1067351 1087665 1104546 1118059
47794 1118059 1128039 1134210 1136685 1135883 1132113 1125543 1116408 1105084 1091963 1077471 1062176 1046810 1032183
47781 1032183 1019020 1007757 998477 991048 985200 980446 976221 972387 969350 967335 965778 963848 961457
47768 961457 959149 956983 954156 949994 944832 939550 934556 929648 924651 919796 915447 911738 908514 905544
47754 905544 902825 900732 899774 900144 901574 903559 905580 907179 908268 909436 911571 914905 918724 922282 925713
47739 925713 929726 934709 940580 947306 954980 963416 972221 981423 991567 1002929 1015014 1027159 1039337
47726 1039337 1051896 1064605 1076357 1085984 1093168 1098450 1102521 1105559 1107147 1106649 1103701 1098434 1091251
47713 1091251 1082401 1071816 1059422 1045541 1030844 1015820 1000430 984406 967945 951980 937612
47702 937612 925226 914169 903406 892553 882312 873855 867784 863736 860974 859194 858622 859457 861550
47689 861550 864770 869445 876173 885195 896075 907995 920298 932863 946184 960978 977360 994294
47677 994294 1010216 1024431 1037721 1051296 1065393 1079209 1091951 1103377 1113263 1120998 1126082 1128656
47665 1128656 1129139 1127587 1123751 1117595 1109348 1099133 1086933 1072915 1057492 1041075 1024038 1006855
47653 1006855 989903 973171 956565 940568 926149 913901 903637 895019 888133 883196 880034 878208
47641 878208 877389 877321 877777 878944 881579 886261 892636 899837 907480 915766 924779 934419 945085 957703 972722
47626 972722 989650 1008044 1028477 1051903 1078232 1106221 1134797 1163956 1194184 1225389 1256693
47615 1256693 1286959 1315137 1340198 1361160 1377276 1388077 1393157 1392053 1384330 1369701 1348106 1319976
47603 1319976 1286505 1249335 1209735 1168227 1125172 1081486 1038428 996879 957221 919901 885611
47592 885611 854829 827539 803557 782696 764447 747907 732454 718309 706099 695997 687515 679933
47580 679933 672738 665818 659480 654092 649487 644987 640267 635874 632491 629985 627710 625466 623525 621846
47566 621846 620038 618183 616941 616544 616339 615732 615068 615097 615985 617367 619049 621001 622797 623734 623683 623363 623504
47549 623504 624044 624413 624418 624516 625170 626225 627105 627532 627817 628393 629257 630071 630679 631245 631814 632018 631375 629864 628040
47530 628040 626605 625858 625504 624931 623707 621875 619859 618137 616975 616312 615756 614874 613619 612385 611486 610698
47514 610698 609535 607874 606102 604699 603937 603879 604365 604948 605173 605012 604860 605061 605614 606322 606966 607289 607059 606213
47496 606213 604733 602527 599753 597219 595932 595996 596334 595743 594019 591878 590094 589003 588593 588747 589424 590788
47480 590788 593032 596046 599418 602864 606415 610093 613684 617048 620357 623798 627249 630461 633368 636011
47466 636011 638363 640395 642145 643532 644383 644831 645335 646061 646585 646489 645954 645397 644852 644184 643634 643654 644375 645719
47448 645719 647869 651142 655505 660765 667110 674861 683782 693305 703513 715223 728955 744505 761746
47435 761746 781127 802913 826531 851267 877134 904350 932217 959252 984451 1007788 1029400
47424 1029400 1048777 1065034 1077624 1086536 1092038 1094429 1093878 1090237 1083140 1072514 1059043 1043946 1028246
47411 1028246 1012312 996075 979555 963080 947064 931715 916984 902735 888929 875713 863369
47400 863369 852172 842229 833496 825929 819544 814275 809894 806213 803358 801730 801597 802754 804639 806782
47386 806782 809173 812224 816378 821766 828193 835392 843192 851516 860295 869379 878443 886995 894616 901221
47372 901221 906916 911622 914940 916397 915735 913091 909090 904555 899697 893579 884939 873662 860988 848016
47358 848016 834658 820479 805895 791732 777907 763494 748151 732701 718162 704828 692530
47347 692530 681161 670599 660627 651356 643337 636842 631344 626135 621156 616803 613137 609858 606979 604998
47333 604998 604238 604401 604959 605759 607089 609265 612256 615657 618988 622134 625536 629789 634940 640265 644829
47318 644829 648267 650934 653406 655993 658737 661553 664069 665426 664706 661854 658030 654754 652713 651485
47304 651485 650254 648550 646378 644046 642043 640831 640500 640693 640971 641336 642383 644895 649148 654551 660174
47289 660174 665742 671862 679082 687034 694982 702991 711901 722036 732555 742372 751269 759801 768512 777622
47275 777622 787139 796784 805923 814014 821116 827697 834009 839907 845119 849377 852323 853684 853642 852803 851695
47260 851695 850441 848852 846679 843763 840071 835589 830120 823356 815392 807045 799384 792906 787380 782401
47246 782401 777825 773703 770178 767571 766245 766203 767086 768713 771411 775558 781007 787306 794413 802876 813244
47231 813244 825584 839649 855244 872199 890133 908475 926621 943742 958453 969144 975053 976997
47219 976997 976815 976078 975474 975209 975517 976537 977914 978840 978566 976867 974042 970468 966097 960451 953194 944609
47203 944609 935307 925521 915069 904038 893150 883205 874450 866702 859862 854006 849155 845277 842472
47190 842472 840943 840883 842532 846159 851673 858403 865656 873470 882564 893589 906704 921797 938685 956967
47176 956967 976006 995277 1014663 1034378 1054722 1075867 1097628 1119336 1140134 1159435 1176970
47165 1176970 1192461 1205598 1216372 1225112 1231982 1236624 1238488 1237389 1233650 1227820 1220378 1211567 1201428
47152 1201428 1190050 1177810 1165241 1152664 1140103 1127571 1115333 1103858 1093684 1085207 1078330 1072354
47140 1072354 1066588 1061110 1056580 1053314 1051048 1049820 1050494 1053902 1059754 1066882 1074335 1081809 1089192 1096224
47126 1096224 1102632 1108146 1112345 1114817 1115539 1114740 1112438 1108385 1102495 1094921 1085671 1074648 1062262 1049591
47112 1049591 1037516 1025862 1013693 1000416 986428 972726 960041 948344 937181 926459 916717
47101 916717 908315 900486 891778 881668 871305 862297 855061 848812 842880 837420 832822 829028 825692 822704
47087 822704 820272 818674 818095 818569 819918 821852 824259 827281 831021 835292 839817 844564 849663 855018 860195
47072 860195 864752 868619 872076 875405 878579 881265 883072 883799 883536 882547 881062 879163 876950 874895 873859
47057 873859 874425 876168 877956 879209 880570 883043 886798 891287 896325 902336 909433 916913 924043 930884
47043 930884 937986 945624 953767 962423 971478 980358 988443 995826 1003241 1011224 1019700 1028343 1036937 1045307
47029 1045307 1053357 1061276 1069405 1077724 1085819 1093450 1100800 1107956 1114590 1120400 1125594 1130511 1134890 1137784
47015 1137784 1138241 1135968 1131547 1126127 1120689 1115347 1109502 1102830 1095885 1089564 1084215 1079560 1075275 1071208
47001 1071208 1067198 1063147 1059303 1056135 1053905 1052577 1052094 1052400 1053280 1054609 1056789 1060504 1065845 1072085 1078485
46986 1078485 1084968 1091836 1099155 1106862 1115183 1124474 1134681 1145339 1156223 1167784 1180778 1195468
46974 1195468 1211156 1226547 1240682 1253630 1266138 1278638 1290842 1302411 1313601 1324851 1335931
46963 1335931 1345973 1354337 1361028 1366213 1369784 1371640 1372131 1371922 1371500 1370946 1370128 1369041 1368143 1368367 1370496
46948 1370496 1374340 1378749 1382706 1386240 1390051 1394464 1399177 1403952 1409137 1415394 1423191 1432563 1443011 1453580
46934 1453580 1463475 1472831 1482535 1493053 1503774 1513863 1523379 1533010 1542871 1552207 1560366 1567475 1573845
46921 1573845 1579104 1582297 1582619 1579730 1573546 1564154 1551988 1537841 1522541 1506642 1490411 1474022 1457753
46908 1457753 1442074 1427497 1414283 1402364 1391689 1382625 1375875 1371979 1370981 1372584 1376504 1382626 1390907
46895 1390907 1401326 1414004 1429269 1447405 1468234 1491039 1515031 1539838 1565367 1591288 1616906
46884 1616906 1641606 1665247 1687977 1709795 1730314 1748836 1764647 1777460 1787718 1796254 1803538 1809392
46872 1809392 1813591 1816494 1818892 1821422 1824393 1828016 1832481 1837855 1844168 1851525 1859937 1869222 1879455 1891385
46858 1891385 1905926 1923065 1941640 1960342 1978613 1996393 2013325 2028691 2042002 2053358 2063124
46847 2063124 2071387 2077799 2081875 2083388 2082431 2079117 2073394 2065399 2055954 2046386 2037647 2029701 2021878 2013719
46833 2013719 2005427 1997687 1991274 1986826 1984772 1985295 1988214 1992972 1999021 2006436 2015978 2028200 2042547 2057732
46819 2057732 2073027 2088727 2105170 2121780 2137428 2151402 2163548 2173688 2181456 2186732 2189790 2190870
46807 2190870 2189940 2187041 2182599 2177156 2170889 2163552 2154842 2144779 2133750 2122249 2110595 2098896 2087292
46794 2087292 2076051 2065346 2055061 2045056 2035566 2027143 2020211 2014843 2010983 2008614 2007715 2008179 2009820
46781 2009820 2012293 2015107 2017971 2021135 2025020 2029437 2033629 2037285 2041059 2045608 2050427 2054310 2056917 2059257
46767 2059257 2062499 2066873 2072080 2078229 2085791 2094892 2105246 2116711 2129354 2142935 2156942 2171395
46755 2171395 2187082 2204575 2223375 2242473 2261457 2280485 2299361 2317369 2334195 2350306 2366013
46744 2366013 2380602 2392952 2402866 2411287 2419185 2426576 2432717 2436975 2439406 2440632 2441284 2441566 2441373 2440861
46730 2440861 2440705 2441603 2443589 2446105 2448721 2451562 2455068 2459583 2465239 2471950 2479369 2486961 2494238 2500855
46716 2500855 2506498 2510881 2513869 2515358 2515003 2512350 2507384 2500582 2492137 2481359 2467263 2449688 2429534
46703 2429534 2407953 2385573 2362405 2338036 2311846 2283461 2253255 2222183 2190992 2159806 2128649
46692 2128649 2098011 2068586 2040634 2013936 1988300 1963726 1940166 1917511 1895919 1875840 1857567
46681 1857567 1840941 1825646 1811597 1798869 1787365 1776750 1766711 1757198 1748466 1740904 1734708 1729657
46669 1729657 1725376 1721935 1720022 1720287 1722575 1726027 1729942 1734363 1739821 1746714 1755054 1764652 1775302 1786696
46655 1786696 1798220 1809060 1818680 1827240 1835335 1843160 1850069 1855155 1858206 1859877 1860922 1861507 1861346 1860303
46641 1860303 1858715 1857257 1856674 1857560 1860232 1864789 1871354 1880229 1891717 1905808 1922157 1940430 1960628
46628 1960628 1982980 2007459 2033349 2059316 2083947 2106323 2126176 2143596 2158512 2170370 2178285
46617 2178285 2181653 2180658 2176058 2168387 2157541 2143223 2125598 2105264 2082807 2058668 2033352 2007428
46605 2007428 1981284 1955206 1929684 1905352 1882582 1861413 1841925 1824306 1808486 1794072 1780788
46594 1780788 1768666 1757591 1747078 1736786 1726979 1718141 1710316 1703091 1695967 1688460 1680132 1670970 1661607
46581 1661607 1652751 1644437 1636237 1628043 1620188 1612863 1605920 1599317 1593381 1588484 1584757 1582164 1580506 1579315
46567 1579315 1578145 1577088 1576663 1577134 1578295 1579982 1582267 1585005 1587702 1590170 1592840 1596059 1599499 1602755
46553 1602755 1606191 1610571 1616014 1621903 1627749 1633645 1639815 1646255 1652996 1660370 1668824 1678645 1689908 1702376
46539 1702376 1715453 1728555 1741725 1755661 1771051 1788048 1806402 1825832 1846207 1867691 1890807
46528 1890807 1916105 1943569 1972542 2002365 2032863 2064119 2096075 2128607 2161708 2195287 2228884
46517 2228884 2261825 2293565 2323651 2351562 2376853 2399407 2419336 2436701 2451504 2463796 2473499
46506 2473499 2480233 2483718 2484354 2483131 2480876 2477840 2474014 2469552 2464758 2459840 2454770 2449255 2442804 2435109
46492 2435109 2426399 2417234 2407841 2397803 2386467 2373473 2358819 2342586 2324718 2304880 2282466 2257001
46480 2257001 2228716 2198555 2167410 2135465 2102370 2067849 2032034 1995447 1958944 1923447 1889427
46469 1889427 1856654 1824709 1793746 1764647 1738510 1716115 1697667 1682834 1671129 1662511 1657499 1656413
$$ [...]
##END NTUPLES=NMR SPECTRUM
##END=
