
##TITLE=AC1340_BRARH12161_6528807_sgsL3tRXkp
##JCAMPDX= 6.0         $$ Bruker NMR JCAMP-DX V2.0
##DATA TYPE= NMR SPECTRUM
##DATA CLASS= NTUPLES
##ORIGIN= BRUKER
##OWNER= Administrator
$$ 1.72 TOPSPIN		Version 2.1
$$ 2012-07-15 17:54:00.359 -0500  Administrator@TOPSPIN
$$ Compression mode = diff/dup
##.OBSERVE FREQUENCY= 400.02188249412
##.OBSERVE NUCLEUS= ^1H
##.ACQUISITION MODE= SIMULTANEOUS (DQD)
##.ACQUISITION SCHEME= undefined
##.AVERAGES= 8
##.DIGITISER RES= 22
##SPECTROMETER/DATA SYSTEM= spect
##.PULSE SEQUENCE= zg30
##.SOLVENT NAME= COFFEE_meoh
##.SHIFT REFERENCE= INTERNAL, COFFEE_meoh, 1, 14.98509
##AUDIT TRAIL= $$ (NUMBER, WHEN, WHO, WHERE, PROCESS, VERSION, WHAT)
$$ ##TITLE= Audit trail, TOPSPIN		Version 2.1
$$ ##JCAMPDX= 5.01
$$ ##ORIGIN= Bruker BioSpin GmbH
$$ ##OWNER= Administrator
$$ $$ C:\Bruker\TOPSPIN/data/COFFEE/nmr/AC1340_BRARH12161_6528807_sgsL3tRXkp/10/pdata/1/auditp.txt
$$ ##AUDIT TRAIL=  $$ (NUMBER, WHEN, WHO, WHERE, PROCESS, VERSION, WHAT)
(   1,<2012-07-15 17:53:51.875 -0500>,<Administrator>,<TOPSPIN>,<go>,<TOPSPIN 2.1>,
      <created by zg
	started at 2012-07-15 17:52:45.359 -0500,
	POWCHK enabled, PULCHK disabled,
       configuration hash MD5:
       6B 1B 68 BB D9 2E 58 E2 7F 35 AD 54 07 DF 0E 41
       data hash MD5: 64K
       FE D3 57 0A 55 46 5E 60 F4 B6 D4 DB A3 D3 8B D4>)
(   2,<2012-07-15 17:53:55.968 -0500>,<Administrator>,<TOPSPIN>,<proc1d>,<TOPSPIN 2.1>,
      <Start of raw data processing
       efp LB = 0 FT_mod = 6 PKNL = 1 PHC0 = 0 PHC1 = 0 SI = 32K 
       data hash MD5: 32K
       C5 71 18 B3 21 52 C0 0B 5A 19 43 9D F9 41 BE FE>)
(   3,<2012-07-15 17:53:56.250 -0500>,<Administrator>,<TOPSPIN>,<proc1d>,<TOPSPIN 2.1>,
      <pk PHC0 = 174.8694 PHC1 = 0 
       data hash MD5: 32K
       E5 D8 13 40 5D F4 AA A0 A0 42 D4 7D 26 CF 41 B9>)
(   4,<2012-07-15 17:53:56.343 -0500>,<Administrator>,<TOPSPIN>,<proc1d>,<TOPSPIN 2.1>,
      <abs ABSG = 1 
       data hash MD5: 32K
       BB 39 9B F0 D3 0A A8 26 F0 69 D7 03 F8 BD E5 9F>)
(   5,<2012-07-15 17:53:56.375 -0500>,<Administrator>,<TOPSPIN>,<proc1d>,<TOPSPIN 2.1>,
      <abs ABSG = 2 
       data hash MD5: 32K
       BE 0A 09 D2 3E 76 37 8C BA DE 0C 2E C0 32 FD 13>)
(   6,<2012-07-15 17:53:56.406 -0500>,<Administrator>,<TOPSPIN>,<proc1d>,<TOPSPIN 2.1>,
      <abs ABSG = 3 
       data hash MD5: 32K
       44 63 49 E1 BC 87 8B 9F DA 98 94 8F 8D 9E 63 17>)
(   7,<2012-07-15 17:53:56.437 -0500>,<Administrator>,<TOPSPIN>,<proc1d>,<TOPSPIN 2.1>,
      <abs ABSG = 4 
       data hash MD5: 32K
       8B 02 70 82 DE E2 F1 D9 5E 2E EF 77 13 D4 F4 BD>)
(   8,<2012-07-15 17:53:56.453 -0500>,<Administrator>,<TOPSPIN>,<proc1d>,<TOPSPIN 2.1>,
      <abs ABSG = 5 
       data hash MD5: 32K
       54 1A 8E 09 47 26 AA C2 D0 9B 7D 82 10 5D AC CD>)
$$ ##END=
$$ 
$$ $$ hash MD5
$$ $$ EE 32 38 D0 BA 5A E7 A1 AF B0 A5 01 EC C4 A3 A3
##$RELAX= 
##$RELAX= 
##$RELAX= 
##$RELAX= 
##$RELAX= 
##$RELAX= 
##$RELAX= 
$$ Bruker specific parameters
$$ --------------------------
$$ [...]
150 150 150 150 150 150 150 150
##$TP07= 0
##$TPNAME0= <>
##$TPNAME1= <>
##$TPNAME2= <>
##$TPNAME3= <>
##$TPNAME4= <>
##$TPNAME5= <>
##$TPNAME6= <>
##$TPNAME7= <>
##$TPOAL= (0..7)
0.5 0.5 0.5 0.5 0.5 0.5 0.5 0.5
##$TPOFFS= (0..7)
0 0 0 0 0 0 0 0
##$TUNHIN= 0
##$TUNHOUT= 0
##$TUNXOUT= 0
##$USERA1= <user>
##$USERA2= <user>
##$USERA3= <user>
##$USERA4= <user>
##$USERA5= <user>
##$V9= 5
##$VALIST= <valist>
##$VCLIST= <CCCCCCCCCCCCCCC>
##$VD= 0
##$VDLIST= <DDDDDDDDDDDDDDD>
##$VPLIST= <PPPPPPPPPPPPPPP>
##$VTLIST= <TTTTTTTTTTTTTTT>
##$WBST= 2048
##$WBSW= 25
##$XGAIN= (0..3)
0 0 0 0
##$XL= 0
##$YL= 0
##$YMAX_a= 507606
##$YMIN_a= -640933
##$ZGOPTNS= <>
##$ZL1= 120
##$ZL2= 120
##$ZL3= 120
##$ZL4= 120
##$ABSF1= 14.98509
##$ABSF2= -5.573092
##$ABSG= 5
##$ABSL= 3
##$ALPHA= 0
##$AQORDER= 0
##$ASSFAC= 0
##$ASSFACI= 0
##$ASSFACX= 0
##$ASSWID= 0
##$AUNMP= <proc_prof1d_extract_pilot.lims>
##$AXLEFT= 0
##$AXNAME= <>
##$AXNUC= <1H>
##$AXRIGHT= 0
##$AXTYPE= 0
##$AXUNIT= <>
##$AZFE= 0.1
##$AZFW= 0.1
##$BCFW= 0
##$BC_mod= 0
##$BYTORDP= 0
##$COROFFS= 0
##$CY= 15
##$DATMOD= 1
##$DC= 0
##$DFILT= <>
##$DTYPP= 0
##$F1P= 0
##$F2P= 0
##$FCOR= 0.5
##$FTSIZE= 32768
##$FT_mod= 6
##$GAMMA= 0
##$GB= 0
##$INTBC= 1
##$INTSCL= 1
##$ISEN= 128
##$LB= 0
##$LEV0= 0
##$LPBIN= 0
##$MAXI= 10000
##$MC2= 0
##$MEAN= 0
##$ME_mod= 0
##$MI= 0
##$NCOEF= 0
##$NC_proc= -8
##$NLEV= 6
##$NOISF1= 0
##$NOISF2= 0
##$NSP= 0
##$NTH_PI= 0
##$NZP= 0
##$OFFSET= 14.98509
##$PC= 1
##$PHC0= 174.8694
##$PHC1= 0
##$PH_mod= 1
##$PKNL= yes
##$PPARMOD= 0
##$PPDIAG= 0
##$PPIPTYP= 0
##$PPMPNUM= 2147483647
##$PPRESOL= 1
##$PSCAL= 4
##$PSIGN= 0
##$PYNMP= <proc.py>
##$REVERSE= no
##$SF= 400.02
##$SI= 32768
##$SIGF1= 0
##$SIGF2= 0
##$SINO= 400
##$SIOLD= 32768
##$SPECTYP= <>
##$SREGLST= <1H.CDCl3>
##$SSB= 0
##$STSI= 32768
##$STSR= 0
##$SW_p= 8223.68421052631
##$SYMM= 0
##$S_DEV= 0
##$TDeff= 65536
##$TDoff= 0
##$TI= <>
##$TILT= no
##$TM1= 0
##$TM2= 0
##$TOPLEV= 0
##$USERP1= <user>
##$USERP2= <user>
##$USERP3= <user>
##$USERP4= <user>
##$USERP5= <user>
##$WDW= 1
##$XDIM= 32768
##$YMAX_p= 468845091
##$YMIN_p= -660606
##$CURPLOT= <Network HP LaserJet P1505>
##$CURPRIN= <$Network HP LaserJet P1505>
##$DFORMAT= <normdp>
##$LAYOUT= <+/1D_H.xwp>
##$LFORMAT= <normlp>
##$PFORMAT= <normpl>
##$SURQMSG= 1
$$ End of Bruker specific parameters
$$ ---------------------------------
##NTUPLES= NMR SPECTRUM
##VAR_NAME=  FREQUENCY,     SPECTRUM/REAL,   SPECTRUM/IMAG
##SYMBOL=    X,             R,               I
##VAR_TYPE=  INDEPENDENT,   DEPENDENT,       DEPENDENT
##VAR_FORM=  AFFN,          ASDF,            ASDF
##VAR_DIM=   32768,         32768,           32768
##UNITS=     HZ,            ARBITRARY UNITS, ARBITRARY UNITS
##FACTOR=    0.250966925370066, 1,           1
##FIRST=     8223.43324360094, -132422,      -39232
##LAST=      0,             -256615,         -223639
##MIN=       0,             -660606,         0
##MAX=       8223.43324360094, 468845091,    0
$$ Real data points
##PAGE= N=1
##DATA TABLE= (X++(R..R)), XYDATA
$$ [...]
23855 -176454 112363 -794 -6801 148261 56637 -259330 33913 -143276 -254166 263630 164157
23844 164157 -26510 -221131 202222 30729 155617 299532 267974 -130144 53084 -132399
23833 -94265 -31534 110617 189850 34131 63803 -13233 24134 48681 152246 254733 -308597
23821 390020 33367 -155747 -15854 -408934 288480 -195086 82132 -14302 -187907 -61135
23810 -19290 373097 334766 88596 -392522 -234640 -142108 104540 17979 -16098 -42239 -216737
23799 -216737 4031 -51434 -107322 30634 -68376 -244315 -18218 -564363 79810 -201832 -118517
23788 -118517 -179834 56171 -161665 -91013 -106928 -87333 -84252 340399 -55791 -44499 -190742
23777 -190742 -87026 85435 129928 -418393 3382 72951 -277365 3801 -206781 -58442 109765
23765 -160253 25276 216990 -33238 96610 -67710 -12554 -232675 357211 8754 218375 -199383
23753 45026 -358575 -49581 -30259 170987 -18541 150375 200231 330754 87945 67207 53916
23742 53916 33480 -93285 -111927 -134434 -182361 110851 22588 -30564 -12574 -262109 -384978
23731 -384978 -41831 -121485 -19675 -200756 -50809 -38539 269010 -45783 -221681 3545 65275
23720 65275 -338461 -62493 -272800 -10519 142683 -39714 150289 276223 -289628 290587
23709 27485 178241 37155 53763 -24060 -266873 81341 -30389 2219 -119009 -104879 -209225
23698 -209225 -51141 -77756 51540 -271935 295670 41017 -162611 -138337 93049 148152 168515
23687 168515 44157 163750 67607 50117 150638 -254298 -40957 162709 -50655 97445 -50441
23675 -23227 -297362 12137 82409 27664 -182767 35238 -225514 -28676 -236437 -92805 -281933
23664 -281933 -330285 -1225 -138255 -178993 205648 304262 138736 4991 148915 170750 32569
23652 36388 -111287 137384 199336 12980 170920 2283 234593 141226 -83294 522293 -91051
23640 6242 109756 8327 -49570 -194794 37813 164087 -171081 39930 26858 118162 -26463
23628 134383 78172 9687 -233508 171051 -151143 -291623 125449 48505 42809 52762 126549
23617 126549 56268 -101983 194552 118913 -63524 169858 221671 -254493 -188943 -65088 -36656
23606 -36656 366585 199917 -71172 -226200 209001 -83086 40084 83846 15924 -141752 65611
23594 -142753 143674 -67956 166929 -4789 -90079 104673 266242 163165 -19620 62646 -40315
23582 29152 44817 -61601 -122929 -9012 -111576 -156928 -266489 327994 220294 -175866 -131249
23571 -131249 -27783 -25374 -48980 -61509 60390 -223001 68829 459202 52625 154978 -172010
23559 94880 70833 -194643 146849 346297 -1118 116061 187469 112421 51209 -16848 100632
23547 -116913 334763 147004 -228704 143533 284241 -197342 -87032 250091 -7810 -156360
23537 -156360 -129080 -174215 -250325 212083 -35840 94914 169571 -264879 -171225 113254 -295003
23525 20886 -46948 -71738 148597 94679 294232 -255910 98795 203367 -253052 -131668
23515 -131668 100938 -96240 82048 -148481 -167279 -64953 50728 -61557 -186599 216926 48070
23503 -468539 -57824 26103 -153970 19632 -90634 -83426 99340 87355 -188374 261490 -244009
23491 -294320 24225 -130055 19493 462512 184030 148915 -278659 102238 17991 121905
23481 121905 -17763 168751 38928 96326 55558 -71840 -134826 -247367 395081 -82265 415740
23469 108521 16189 -248725 -186463 84459 139373 19566 171053 345220 -198582 -102581 130992
23457 -312821 -89952 282764 -151835 -99191 165385 -149307 61668 178163 31661 57201
23447 57201 -18978 -344667 -32881 31635 -57235 57165 -413550 -400858 -2984 -173791 106186
23435 83218 67229 238298 -209179 229477 259409 -51559 136776 124087 129718 -280885 -129938
23423 56934 -85407 24559 211011 -45840 -108223 -99735 -125744 -260726 107060 -24755 -57024
23412 -57024 15258 131892 -157910 4682 172548 -187484 -10205 28975 -357694 113708 16122
23400 70424 -97487 165677 -130532 87313 -46323 -183388 -8837 -226118 -328451 -127405 -243584
23389 -243584 4406 -59015 86688 -172124 -82748 199147 88531 -73208 268842 112385 -309341
23377 86265 -4409 -11346 562863 -86756 83660 -92042 7425 -88219 -49358 -212285 -142787 -254257
23365 -254257 -87896 137182 -10630 -147322 206298 -180176 -177476 239541 116788 39434
23354 47535 -209870 -52167 49677 262738 106379 41982 -158705 144806 -258276 -18120
23343 -177198 -15772 74686 72338 -30497 -121291 -11308 -51389 -140392 -59650 -306146 293049
23331 93230 -91298 1837 184535 146245 -364159 388837 79673 225071 447590 -4780 -68971
23320 -68971 -146934 -106997 114257 -77264 88623 -2780 -16098 84815 104584 113387 -180957 14831
23307 150140 118678 12861 -306366 95915 116710 -222403 86415 -311656 123108 -20329 -293170
23296 -293170 -291954 66220 32261 -164816 -47614 156359 93636 -80875 394928 -111149 -119207
23285 -119207 -148755 -224586 51841 16938 260088 83170 333818 -259560 -121232 76267 -248630
23273 -96818 146055 28091 -359992 2281 -98995 150610 -30082 -190509 213921 111321 107678
23262 107678 -127589 47758 167604 -318112 125698 274776 -38886 -66402 -74647 -29224 -113116
23251 -113116 -277970 -137956 -62352 107893 269407 -93944 -306391 170908 8722 66714
23241 66714 35229 -157609 31456 -10968 -86198 -27609 -369548 -61083 -195163 -244984 -357203
23230 -357203 -165546 117453 185724 -165182 12038 -81791 41829 -248712 -96017 -114953 -100560
23219 -100560 -5390 58467 -208955 56649 -157722 182706 -146695 -74545 32332 80833 128200
23208 128200 -338403 256676 -11811 -100254 -35279 45935 5585 -267947 161445 42256 209599
23197 209599 59053 -46380 150307 105696 -322721 -9659 369008 11320 137712 35164 -80988
23185 143715 -9610 -242664 -182937 -16744 -56304 134122 -157787 170759 -20424 249545 8108
23173 252254 37051 -107797 313138 -185334 -71506 259229 -81590 -24943 -85494 -117275 -225349
23162 -225349 202031 76075 -340389 -101933 -68426 41106 195690 125288 -93106 132993
23151 -90342 -3144 317251 -168187 181576 -28197 -165042 -156963 72581 151732 -37848 -36370
23140 -36370 -333343 5770 -60564 383905 -153899 -75454 34485 -58928 -160113 200769 -37871
23128 -156258 -40680 117011 -25235 -56935 12614 -8323 -90537 206870 -7992 82103 -394408
23116 -325502 -37466 196147 -402121 -191647 -9195 -168091 150384 53627 -288193 36696
23105 -22902 -176079 -137713 110927 282876 28934 259265 260243 -22596 -150846 -332077 190909
23093 114675 316352 230385 60594 209799 -6103 -113140 -89334 77513 -59083 -90454 -384761
23082 -384761 -39064 100346 -240657 -221131 -43229 -26311 -119827 -55739 140096 -409 4742
23070 98317 38002 -3648 48607 -315101 -85328 99672 -40657 -199604 -149956 157064 122607
23059 122607 -193636 -27882 299842 -111524 -168259 -187493 -45642 122474 -108591 65586
23048 -265728 -199223 -334043 172440 -159194 118787 283299 -190038 514165 145431 73298
23038 73298 82381 -58344 94259 -355711 200964 91356 -120884 -213367 187333 159828 -33388
23026 212149 -95964 124755 232690 362713 251705 -246140 -275511 -71575 41635 -402341
23015 -69869 -279049 -190108 287858 -154509 174472 -32261 96433 -166934 -112852 -118877 -332099
23004 -332099 24624 -228560 -2653 191966 351603 -44260 -191412 2215 16987 -57002 -10489
22992 223473 -80328 -318737 -31361 4660 233306 -102870 -157659 -59038 -344720 356600 17508
22980 -323830 109751 -164155 89932 123913 48167 -123389 264498 -25826 -128321 148453
22969 218358 -148424 -276871 -14276 116376 -137049 38071 8403 421927 -184189 -257243
22959 -257243 -97508 109802 -71955 -409484 -117425 -150125 28166 -75448 238422 59027 219775
22948 219775 71957 -198388 10995 -209101 49220 10194 -259227 -116842 -46016 -177525
22938 -177525 -483837 98147 -364445 188834 22337 -199429 -58583 88798 214208 -352718
22927 -311360 -225015 -90401 270029 162049 -55340 -80924 227723 -267915 -50344 145067
22916 -306070 -54923 -209379 28770 122884 100324 -262940 106461 134567 -116108 -5615 72118
22904 -145817 143788 -83351 -95619 59301 -158564 22709 -287609 -83727 -382385 55094 -135213
22892 109852 2489 32538 211834 45098 220723 83503 -82952 -195306 -136987 -248870 -31911
22880 -323234 61809 31040 -192387 6379 12561 349362 120050 129229 -98098 103562 158650
22869 158650 233954 -154878 119203 -23220 -244683 -100107 -306795 14263 231155 179315
22859 179315 105215 271698 131143 -94358 24628 209100 107351 37107 10590 155391
22849 155391 -21818 -54214 -64691 -133888 426221 -274225 42460 -125003 -232588 139793
22838 -238996 210581 -12128 -301682 -349608 -30124 4282 61594 -159825 57446 -109243 -41016
22826 -148966 -317819 -53412 -12437 -438157 -247081 227166 -147455 -25174 -187477 -51397
22815 15832 48568 24868 270462 -369118 -77075 116547 -351152 -304606 50822 161329 112205
22804 112205 85811 -178386 -119580 95975 139062 183269 72357 -160575 -100475 101417 24670
22792 138439 -143290 -136958 -335115 52253 12617 -431197 67541 244374 -74913 -385750 -80852
22780 73762 50774 17453 17228 141877 50882 -156431 307069 -313007 48033 -13035 -52618
22769 -52618 -115301 -73844 -256885 -143576 -443228 -22345 71868 293649 3598 71107 124022
22758 124022 -130792 152052 -250533 -153525 -52450 190525 17861 63743 190169 213748
22748 213748 7929 102365 292314 2973 -22596 29571 98724 -244015 94486 -76108 -244724
22737 -244724 -363739 -207105 96658 -248030 163019 90709 -80658 417251 36856 74491
22727 74491 125422 6998 -30892 -166440 -99987 -246400 352 344134 -90761 -39810 421531
22715 -156505 -1231 -5109 -102300 212338 87761 -201092 -13437 123006 -127161 -137437 -20994
22703 156669 -9967 63050 76725 239228 -129509 44310 -288903 -240300 134715 146817 -336961
22691 310609 -164392 -204366 -129301 -226971 70154 -127024 -57940 156319 18641 -50007 151592
22679 135115 -397780 -28685 26635 -109302 -117371 -176828 -68830 -25711 -31383 39376 33197 291847
22667 291847 14649 173044 -401688 -60954 -202754 -43432 -224982 92668 -278804 61134
22656 -1220 154593 73928 -296322 76881 111690 -326491 -193456 65175 -181735 -116215 58080
22644 44539 53982 68845 -311381 -77509 -133079 40466 -263305 -32074 -106067 -160274 -252676
22633 -252676 -171569 70853 -153639 -174588 272798 465330 -289870 -163256 210425 31943
22622 -9592 94686 -208987 -189353 -257785 -25812 -259441 106982 -30369 -70366 50562 98405
22611 98405 -10104 159441 -18156 102423 197382 -153661 -499235 228272 -250056 -32700
22600 -181594 -156968 -64614 100924 -179529 -147651 202506 -314119 16114 -81874 105098
22589 -21810 44624 -155930 77082 -294490 -11795 29102 -229780 -63597 -98203 125342 -65776
22577 -3330 231308 9798 207411 59534 -52616 -292860 102103 267544 181994 -145875 -269121
22566 -269121 131349 -29225 -447257 136405 47354 56831 189853 -252902 -12524 -57682 7963
22554 145695 100122 58119 -74685 -51527 163190 -192495 10555 -117251 -203832 185190 208214
22543 208214 -211756 310084 83218 405529 -7558 -41392 86644 338478 3575 -159647 164633
22531 75461 418277 -37420 24797 156855 55031 134509 -208775 -94561 264361 -139149 -75648
22520 -75648 -150260 -13828 -477878 -120876 -57257 -122540 144362 112638 -219560 -70023 -249992
22509 -249992 -5 -42183 -71262 -5701 -60418 68039 -101474 261566 -241414 15604 -40338 -148499
22497 -148499 -94375 -11969 127800 202695 -46992 -25505 6802 189494 -551 -56531 -64345 6901
22484 -77804 -86008 -178065 68382 -200075 192262 54621 102982 121130 147648 60153 -43547
22472 113678 -43011 -63049 -204635 -282384 10440 -51433 -104540 -37513 -197097 347470 70196
22460 -150795 108333 -98007 -4374 112506 -154350 -176438 53783 236417 -163966 -103720 129883
22448 74857 68787 -314746 50200 -320794 43310 -428652 73030 108496 -129608 47656 -358048
22436 63707 -133732 61073 -55975 -70104 -56885 -95202 23140 106865 222278 49274 -234094
22424 -41629 -111475 -1307 -220726 93508 -239591 -107842 -44872 -156466 159018 84474 111460
22413 111460 53366 150797 -84344 -40460 -222457 -51475 375328 -25095 -194544 -169511 105348
22401 -117397 -4204 3738 20206 225289 -132098 -236946 94176 232493 -124162 -83053 -3173
22389 61166 179057 -203973 -28559 -273762 -48278 255185 -40977 -79839 -18731 -169406 18715
22377 188901 8360 -131023 -26252 36827 181362 123987 -98751 -105326 -112595 -104063 98326 274570
22365 274570 146837 -70332 -117401 50232 -10186 33897 -54285 32833 74505 175432 392482
22354 392482 257251 -24042 -231667 34265 121239 -168722 -55207 -60176 -450668 -136640 -166913
22343 -166913 201718 -59012 168054 124813 101840 -84081 -295688 68819 -100269 107942
22332 -118357 146362 52436 19021 -87422 149969 12396 -325118 -187655 269375 231039
22322 231039 -147205 389 -363729 -202208 258359 137035 -288045 184159 -27999 44465
22311 -88041 505161 136565 -37802 56885 -282365 -424532 421730 292419 -70850 -259857
22301 -259857 -122233 -386586 114643 -9522 -137703 -419869 64424 -283500 -138880 -114647
22291 -114647 -85717 -169092 117313 -337312 -300258 -205021 30360 -130405 95671 -120996 -413529
22280 -413529 24327 -392831 43002 98839 -161304 104675 -166401 -192534 75447 49964 -313141
22268 -58158 -139921 172491 -103681 191234 95488 158035 -190036 -89799 55331 183841 1278
22256 -158084 -109097 -145385 -19243 -97463 256420 -13651 -146 -55712 -151097 -79458 -27033 -205797
22244 -205797 72819 -164435 34100 -16018 359795 13467 -270768 -306728 228884 65322 26040
22232 -278589 -247452 -55652 -86943 -146118 -277215 -186242 31124 -66733 86359 29786 -330549
22220 -212144 15469 -283730 358141 -76586 -218250 -111284 -79975 -303809 -229048 72100
22209 31228 -230003 -20516 -9151 -116905 245809 -154751 -194757 117023 -82650 -141340 62423
22197 58025 -37695 -595820 19189 124365 -232850 -49150 -171108 -80508 23719 29516 89706
22186 89706 -24627 99089 -56904 460504 53010 4929 -125876 -136561 -14430 72103 163224
22175 163224 -74005 -171487 71084 90196 80619 -361401 53548 -11750 47389 38441 -227198
22163 232078 72959 287500 144112 88671 -68596 12257 137172 61254 -69573 -72621 -142167
22152 -142167 157798 239578 -70186 -188999 63001 -302897 24319 34056 -76220 239373 -173353
22140 -123115 171297 173515 4569 165314 140100 -16687 256265 -58025 -32449 264551 -228529
22128 165786 -24559 -7460 162924 358935 324606 -160933 43132 -164276 -20435 217940 -30019
22116 77534 19683 -266221 -31425 219241 -303607 -164263 -191019 -126271 -323336 -94448 6965
22104 1004 -144889 -310057 293673 -106800 45397 -171128 12976 8660 58245 8219 -140199
22092 -141566 -128585 147471 -15139 -245283 159874 -217777 71052 5773 -65873 25654 -315593
22080 -178794 -175752 -26933 -50253 78406 -201875 81981 -178822 -222096 49714 43440 -238264
22068 7112 -145796 239905 -274358 -281229 340126 -298128 -99886 -115976 -84398 -223302 12363
22056 53927 -92686 177431 -145078 -239399 -71524 -248182 -381824 76584 -242592 -1805 -260143
22045 -260143 131897 -66815 -183866 127301 227439 -156119 -11329 -111844 -29643 -458640
22035 -458640 -139263 -105970 -279448 287774 -302342 23672 -160935 -105837 -202055 -77360
22024 -230851 108469 63 -189896 -104196 60853 125728 -138765 -326968 232824 -79029 -102366
22013 -102366 -252468 -16009 57740 -10462 -198762 -191537 -110646 43045 -109280 54160 61341
22002 61341 -18928 -35248 355982 -186554 214740 187713 122894 -145668 -75259 16186 19749
21991 19749 -182818 124528 -169996 -140125 138667 -451 -82433 7953 -222888 -6963 -103091
21980 -103091 51468 -50221 171678 -60517 407572 346311 83386 20796 63546 -349655 -66863
21968 -14659 -225218 -284919 -84370 151841 -326193 54808 44614 138000 -116669 -226973 -231272
21957 -231272 -368491 4751 10009 119145 -38406 -250009 -379793 -99839 -27877 241450 -126914
21945 -224011 198910 223358 151245 115565 86974 186997 -273627 -129299 -154255 -276398
21935 -276398 -151652 127370 -262079 60018 -91607 102659 -138559 191969 -171367 -83464
21924 71846 54019 40085 -232764 -32683 -19251 61008 143264 -15932 184193 182116 197940
21913 197940 -11054 -360663 44172 -188115 51574 -204050 -9204 23023 75015 36859 70001
21902 70001 3698 -253866 -218923 -202718 -199301 -242556 -158266 -39345 372046 32403 179579
21891 179579 -117279 -138130 109009 203484 -178728 423 -162523 -317053 -224113 342354 -87128
21879 -126571 187803 -186283 22975 -374936 -356034 -40172 -77610 -15539 -199612 -272408 324105
21867 -142719 137970 5963 -113711 185451 -88868 -163385 206 -66564 -390227 397014 -148312
21855 176499 290620 254243 -260918 166772 -144984 -188240 27881 3100 -50233 113117 56915
21844 56915 -208755 -51138 174409 177137 292971 86021 78086 -110877 99521 -45092 -298852
21833 -298852 12721 103640 219682 -826 -227812 533775 279221 -190221 -268337 -193245 -289272
21822 -289272 -42926 95671 -17630 241347 -175634 62135 -137050 143468 200939 -78982 -158749
21811 -158749 -48905 126194 71994 64856 -93372 50453 61432 41163 462677 -75726 -366201
21800 -366201 -146692 -267324 -16097 14917 32617 22382 -353926 360511 251978 74046
21789 -64120 -260111 -67412 -347670 -144883 -222459 -103026 -70374 8605 -15235 -257689 -364379
21778 -364379 -62633 -475530 297480 73126 33615 -179532 90250 92423 -133019 -125859 140936
21766 -373721 -246635 -30703 41217 141781 4186 230070 223006 107577 -51185 287136 -57515
21754 -153851 -127901 -20319 88838 -157429 13615 -84066 -242358 -107076 26301 -31549 113265
21742 -2639 -89393 -213775 -184963 48855 104307 -123950 -126061 7922 268135 49455 45178 -146276
21729 242608 132111 -128595 160145 104492 82396 75253 51146 7439 -150483 3787 70714
21718 70714 75074 53955 -108307 -202252 232975 55628 12083 -17084 -64742 -266824 37548
21706 -51132 180370 -114522 7597 -325417 684 -127414 -92472 -52602 54993 -192639 -127506
21695 -127506 17777 44645 -191483 -207480 -349092 -456061 31529 170279 -215766 216010
21684 -352849 -293430 -133704 -124968 67533 -330788 -15245 -138117 -86249 198089 116049 106681
21673 106681 -243652 321452 82985 378383 -205699 -102018 -211864 158913 93543 59238
21663 59238 -21210 -2471 56402 -108696 -41715 -232046 -251458 -202939 107954 -198106 -395238
21652 -395238 33224 132931 169450 36189 55762 -74453 -156054 79604 -308705 251970 95698
21640 255325 -188752 179127 -122867 -251980 -155377 -46801 -194769 -131576 211823 249556
21630 249556 -212088 26903 -155887 370204 -29682 299878 165619 116926 93526 -61404
21619 101849 -116254 -9420 -140941 213686 -139716 -31463 -393606 1844 109320 -11097 -62380
21608 -62380 -42068 -208616 -158583 -118345 211552 -167106 -198158 -136876 108906 134094 -145068
21596 -333297 -36173 -46071 -315891 27744 -212980 -163374 -625 -69665 -30983 15674 46912 -65917
21583 -166183 137786 -370296 79610 -72220 -66235 -107743 11436 -222349 8647 -309258 61501
21571 -68000 102800 -195264 -30516 58755 -1881 -92391 -21652 182510 10264 -495946 206097
21559 -92311 148745 95352 59166 22869 -162652 -246724 -69127 -325790 21299 31944 27990
21548 27990 138920 -173623 -96428 83745 -100151 -36023 200328 -407766 -351671 -246080
21538 -246080 -36329 -69230 232812 -382072 -70041 -11945 -104207 58664 143694 124291 41296
21526 140265 191250 92580 256567 70085 -48618 -5322 63638 9310 208141 -20344 -21264 -177622
21514 -177622 19585 26645 494420 184577 -122007 -73766 -93243 -206330 -62080 238995 117221
21502 65788 -51653 -154311 -99572 132674 127680 74396 174335 86524 -89784 -174661 98365
21490 -80486 -52740 -245242 165779 -88725 -89871 80794 -97339 -20644 -12641 -290283 87763
21478 -234569 17590 10873 -156798 -106111 193575 -28577 -78474 -33667 -80034 -156666 134721
21466 -281325 -234312 -135385 174590 -197006 -29093 -254966 57447 25568 235463 93030 19945
21454 -424726 -143667 -5337 120666 15334 -78882 -197914 -77550 116006 -33443 31224 -50386
21442 145522 -236486 192823 7087 111909 217281 451525 330546 291222 400154 481620
21432 481620 493149 246962 -4195 362821 176094 88843 99190 -135429 35311 -403061 6233
21420 45321 12898 110370 -89945 -50168 42190 -82369 350775 -20787 228903 -160262 30483
21408 38222 40448 144588 -112539 -334444 -268669 -223211 -371032 -188753 -74826 101168 347387
21397 347387 164403 122039 132618 -189657 -168375 -35831 -170335 -180399 -218582 -60657 185852
21385 -338174 -82300 -81302 115658 -169052 -231378 -93583 -222602 646 -341003 -87758 218027
21373 100296 -36790 -116505 -246376 320580 72327 89135 -297735 418149 -88482 156267
21362 -138551 -290512 122533 -275597 -213650 274532 -275171 -186557 97312 -374176 -90156
21351 -105969 92966 -90580 -330340 200778 309530 -176132 167686 3928 40882 -63251 -70338
21340 -70338 70763 -313794 -232719 -126433 -61348 338864 -27224 -309487 -145158 -111199 -45958
21328 -94383 -79947 -153090 -90965 -361018 115535 287506 135537 -311702 -316410 12829 -133865
21316 -266491 -275421 -23196 -192119 68649 62981 11975 -99425 113435 109965 -160748 149061
21304 51720 -50211 -15580 -306177 -137557 209494 231419 -65050 -5516 -373290 140747 -139679
21292 -104232 -126223 30449 349764 -136074 -197923 -48019 -286761 -165649 -172639 -110420 59600
21280 -237388 -164213 45278 -178090 -303421 -210177 80113 -256422 -221499 3447 -137421 72040
21268 183388 14141 -160649 -42656 4136 127256 61332 -52888 -162619 -16597 192339 76928
21256 -110659 215020 -62784 -281371 -196199 -71164 -107743 -183442 -201790 -220967 -105160 -67693
21245 -67693 -468233 116505 94443 -150675 142976 -124717 50471 -334416 -141913 63277
21234 30714 -130809 -159671 147110 -246415 -66388 156353 -136830 199264 -133136 88362
21223 -96814 -3769 120412 205949 240681 133173 97417 -120974 178854 -406892 -217811 -155659
21212 -155659 217061 -84706 71036 -238127 -261393 42110 -199202 18375 -239558 -270832 -47845
21200 2054 25525 -93325 232399 -110653 36043 -161830 -71250 115741 34661 -18030 -41563
21189 -41563 -193820 407020 126764 75083 -261561 -204531 14875 -213594 -44164 -451379
21179 -451379 -87448 156319 219991 -52269 -66427 -85758 -29678 394826 -95215 330731 -141916
21167 -161315 -8795 -191949 152428 209397 177096 109626 -42581 14672 -198551 -56355 -125300
21156 -125300 -150513 8345 119931 -117450 235872 -71269 -87611 84066 -70154 132233 101712
21145 101712 45075 2558 -76985 33867 -230390 -57496 -165226 -74785 -222990 22830 -381506
21133 -70580 -273636 -325412 -43178 358509 -158410 28601 28935 -38200 -8350 -325984 149515
21121 -88600 27589 -160053 151197 -9849 340157 -17338 19862 -98891 -159123 -438693 -51067
21109 -451747 226411 -143840 -319891 -175110 -199825 44157 99494 125893 52942 -266685
21098 -107098 121963 167680 -51937 66834 -318003 -125679 -28887 385219 -311828 -363761
21088 -363761 -208137 -361464 65080 38297 -163821 109070 20061 -41764 145224 -265130
21077 -167099 14778 236680 -87711 -341502 -212013 107729 -34747 91420 -101634 79832
21066 -242008 -154571 -294202 -72043 280927 -55712 255513 -369297 122835 -46406 40349
21055 -282461 167746 -106460 101673 30269 -48775 -91779 136991 -77623 -10871 90154 43366
21043 -233430 -149384 129994 274980 -71298 -234654 -3315 -307955 -139972 423886 -290322
21032 35231 315111 -310377 -89215 59755 -37217 102699 173634 -28966 -31563 -292916 464294
21020 -96928 -157892 148604 -239007 -229179 142487 199940 -174900 340017 25426 -79369 64832
21008 -326419 -111956 -205123 -141590 -368521 10190 -162263 -248548 134390 144176 -120606 186522
20996 175038 10287 55052 -147384 927 -170046 -101966 140215 -182218 -275911 -75384 -252508
20985 -252508 26980 72783 -123690 -122516 -131279 -391262 63474 -135772 424382 136400 -316224
20973 15360 135688 46990 132577 36645 -171009 -246452 229203 274792 -290304 230417 -15067
20961 71074 123150 69658 73033 -17772 -129200 -216009 -504106 88377 -145420 53236 -32497
20949 137044 123135 -104438 61272 30453 -64475 -147619 -134618 -32062 71924 172102 278559
20938 278559 160234 -33387 -19062 233698 -205740 41668 -121296 -179857 -25177 -213122
20928 -213122 -155620 -318731 -291502 -215426 -210288 270838 296903 -80401 335187 -493429 -74073
20916 -150389 119090 250342 -81325 -106141 131016 -56477 3289 266215 -11109 -458503 51767
20904 355727 -124402 -170744 159224 19117 -102307 -55734 120700 -223975 141951 -29614
20893 26858 1632 -217798 259517 -158615 37930 -214615 -118922 99895 407683 -123007 -102557
20882 -102557 -14091 -193353 -173073 -77733 -39231 -164259 -132842 -14356 176646 -281772 256973
20870 112661 -131676 256101 -258413 188393 -137674 -89456 -191563 64488 -46435 -113865
20860 -113865 -173152 150850 -39293 -286036 29371 -51214 -181907 -66953 176537 -236444
20849 -68105 27223 31721 -131960 -262093 -124410 -79624 -194818 -154844 -396409 -120521 -20599
20837 -207923 -224473 105634 -117358 -332261 132384 -81435 -163557 -33447 293257 10406
20826 -87168 89474 76367 298504 -141477 -17667 -246517 -139232 314037 186278 -66621
20815 210124 -137474 -397020 24140 7491 -144483 182747 243643 20823 35898 44292 -145086
20803 -261139 1934 -367702 -70450 -37539 51835 -16386 -7959 -31715 262598 -115038 -287241
20792 -287241 -87162 236561 91931 192031 -403630 46890 81385 -101877 -137628 -49227 263283
20780 -388504 -63710 117005 -66847 -167756 306150 82747 282775 -82147 -202356 392153
20769 -18270 49960 -14474 209608 -133838 -39525 64793 -514395 -258703 146255 -286243
20758 306336 12825 -280957 -56217 -274731 -240918 309659 57975 -47121 -235110 290881
20747 -77587 9403 27778 406288 487 147022 -16976 -195510 -198714 183387 -50422 358977
20735 -32870 40922 -185476 -355886 -124127 -82597 -195698 -98378 74732 -152686 161892
20724 -100701 224383 -278559 -109887 -42215 105507 12552 2024 -345371 16543 -122447
20713 -90318 991 162427 -279256 -67981 15862 -31434 -209662 -61546 6183 43508 -295674
20701 282977 -96959 75906 182488 -196606 -14131 -230820 -211167 11043 211293 -193261
20690 -49943 -4468 -217942 -250582 200999 83100 58091 51544 -183426 -82223 -208799 156984
20678 -132750 -12692 63637 -280100 -212150 -115470 -110347 37032 25546 -33898 -254466 -170475
20667 -170475 -89820 70898 -249933 123928 31058 -116592 -224524 46562 193611 -20914
20656 -394446 -209088 -287928 -152561 15532 -343693 -69274 182690 86026 89123 -108090 170851
20644 -25238 -210848 -85439 307622 38919 -80030 63816 -166811 -157092 350429 -316987 -119561
20632 172070 -10885 -227507 60479 91162 -61356 4046 -185848 -177130 131942 119379 -29644
20620 120911 -4304 74968 -73350 157177 -186742 81194 -126819 -47518 232122 -25448 156147
20608 -95575 -84984 -128042 14108 -230147 -92802 59952 -170630 91184 -114369 256055 -3408
20596 59742 -32116 -151382 50919 166431 48232 232505 -43288 -393294 -6556 -284995 -100034
20584 -146708 -206719 182322 38821 -147179 285574 32017 -117713 25522 -396732 77224
20573 -81232 -563565 -235184 -434 -144927 87928 -182635 159084 -133 117704 25258 -196838
20561 -150372 44786 -76286 108918 -244942 -495503 -60217 -166506 -215121 -196703 -184894 -288122
20550 -288122 -74306 14180 111684 -183846 -218515 -96011 -240709 -287379 180879 -138127 34742
20538 -56886 1919 -326691 -213078 -5633 135912 -259316 -84020 -219829 71423 -174357 -335434
20527 -335434 108520 77469 -380338 76780 -131540 19580 -164935 -177711 -158768 -3239 31085
20515 -166586 -162394 -333396 -45616 -52069 -335186 -44460 -146593 10303 83756 -416207 326783
20503 -216276 -278040 44011 -129360 -70465 -181706 74705 -126673 40964 41805 -29800 -209346
20492 -209346 -44583 -210818 -72530 -23543 -2264 225197 118922 -279463 85523 298736 -16270
20480 -254413 64784 -104951 -256743 -81226 -15880 348652 -340966 44097 -44870 -33059 129715
20468 387203 -20279 -121188 -201967 259179 44360 -179187 149710 -31830 17699 -129292
20457 -180590 341505 -126056 31508 45229 188036 6689 180185 51628 -7326 -40516 46187
20445 -99055 -169030 -121369 -244130 -80315 -108206 -177649 -359226 -52640 -2624 -204519 53712
20433 -75660 -16539 61123 -226250 -117814 -105522 -4405 -426289 -47755 185393 -204206 -65069
20421 -183819 -80086 39921 28701 -355876 189639 40175 -183015 364269 218565 -138247
20410 -87420 2971 29516 189307 -222092 130377 101527 -114820 144469 -27654 -192333 -256565
20399 -256565 -9250 -37774 -318317 18918 -126975 -7293 -162342 -71722 -358052 -43367 4 -177005
20386 -195413 201055 -182975 -15201 -313270 103985 5919 135758 -239620 -168246 -15052
20375 -285354 -73972 -206707 6471 197805 -34676 -90590 104377 -69295 -38791 127813 -201067
20363 -25339 -45127 143343 -125738 40136 -115746 -133002 -261824 77674 -226549 -44456 -316869
20352 -316869 -182258 -178355 -66855 -235291 408 14427 84605 -408178 102943 -15909 97159
20340 179974 35252 -317648 88882 -95000 -80301 -205054 -125819 -77059 -82352 -354507 237062
20328 103248 -105870 -235605 213003 -183258 -155044 -153579 42729 -52504 -186978 11244 77531
20317 77531 -165448 280345 -52724 -124194 -116054 -254896 -345451 -216012 -147516 87890 -144258
20305 -89225 -187160 -13055 221883 71016 -94121 -19989 -236315 28447 -424430 -84420 172414
20293 -75690 -64846 -28275 97563 100117 -93615 174488 121372 -24104 -8383 -12210 -128158 -49434
20280 233179 1985 -38087 224407 -314571 -116153 -57960 -146362 79239 -136808 -52955 -66914
20269 -66914 -87173 81164 -369469 -128746 -199365 89353 50066 -237064 -49617 -99729 -79458
20258 -79458 -270482 56498 47250 58199 -149068 -240513 103239 -281013 39417 106077 -51255
20246 192112 -186800 -181168 -398155 -66870 156500 -27134 18429 138161 111366 -64489 91115
20234 113637 -414835 175106 -401487 31283 -66182 -329360 247243 143274 133593 -133555
20223 54319 50440 -55091 -186239 -10933 76079 65523 6089 34056 -245599 146329 9409 144796
20211 144796 -158282 -64597 -33525 -229445 -92115 -116133 220741 2380 31736 107848 -47112
20199 31582 -352353 -114457 12504 -411181 -64088 54216 -154574 -15620 -67633 151911 -53695
20187 -93010 338255 -12475 45238 -248310 -300297 81048 109276 -378763 -355238 -30412 180083
20175 -72325 13046 -155743 79615 -243547 90456 17505 99949 199519 -75022 -107048 -201461
20164 -201461 -145543 -36047 136929 -54990 -107474 135020 222644 165203 -110859 71230 -20181
20152 331481 -259679 489976 -111318 -177398 -13907 -118398 -212259 -15953 -76122 93478 146191
20141 146191 -72614 -117885 -26320 -210842 -153172 -100534 -399976 -219383 101141 -135023
20130 9426 128719 62496 -193463 -101444 105679 268508 -142081 106482 -108652 117513
20119 144092 -128090 67993 -273342 -12469 44999 81120 -164891 -172179 17528 219472 154212
20108 154212 -356757 -88715 25935 -181508 -53137 -184041 -210494 -54869 79647 -22625 136119
20096 -40547 -171332 -61824 -80353 -359859 -88005 -149919 188668 -12425 32411 -189952 71645
20084 -6315 -65166 -238746 -233020 -252873 113137 67574 13218 -185299 -222470 -107144 -68957
20073 -68957 71857 -78220 290949 -249150 -128477 115884 -151915 -29682 120870 -68501
20062 59557 -199389 65714 230298 69566 114199 43739 160175 -37313 -66573 170655 -482355
20050 244962 143772 412634 105057 -234491 -154794 -131483 114361 230178 -232004 387917
20039 -47665 74186 -32446 -97072 -16755 -294610 -202229 -17259 151789 -43553 -227545 183946
20027 147171 -456616 14499 -315880 272648 -164167 -59951 105323 89251 -194507 230002
20016 -225716 -66602 -270930 -23613 -164179 -314871 270290 -234617 -300533 77219 164341
20006 164341 -252266 -54360 -210764 -50929 149951 -90973 250331 75421 -390733 133821
19995 -205184 -43223 17774 -59685 -276307 -203793 -475745 -19764 32286 122590 -134678 59801
19983 -54668 -141547 -450731 -159374 104148 -171713 -90261 24563 66884 161750 -383122 126642
19971 -19855 48924 13418 -39239 -280192 -257163 183495 311844 239742 -100665 -170900 115531
19959 297384 70170 114847 43826 41873 -140444 -167516 -192877 171534 -71451 -86146 -272438
19948 -272438 -195614 155969 140982 1561 -9396 14769 40783 107760 -36694 97035 139475 -237033
19935 240209 -154236 -65070 -93140 -114111 4934 73715 -60210 60007 -43554 -18814 -26046 -333922
19923 -333922 -221307 35717 -447358 259420 6543 353603 9988 -134142 72352 70393 -46392
19911 -15454 -321927 -473123 -167553 109680 241937 347693 48887 -70484 -62446 -309096
19901 -309096 -7755 121132 -177744 -86658 -124298 108979 -399910 -253286 -246868 32454 -175646
19889 23739 -69299 120370 -281986 -4807 -186254 150926 -129741 333063 -118966 100671
19878 -208187 -183700 -259754 103934 57198 -8492 -250427 105672 256529 -565712 -17994 136544
19866 -251684 -294075 79328 77288 221421 -139014 -149693 -110535 -219888 -450831 262005 134549
19855 134549 245965 83592 18644 255399 -345033 -477163 -50909 202223 259009 -35884
19844 -398245 -61311 -17238 -146670 -217730 -111152 -101889 -31645 235145 161431 116193 173933
19833 173933 -161645 70161 -344731 -21155 -162065 41295 143826 -41549 -126931 175613
19822 -138248 -25050 -98763 446933 -179434 -293744 -267639 -374035 -83624 -139293 -90405 28704
19810 247426 35691 31514 -439559 -254166 -59758 -72780 -140321 -197920 -132460 117165 -56058
19798 193012 217000 -117464 -255112 75604 103254 -24830 -119483 155874 -113032 101760
19787 -18376 -49414 40083 73833 -68334 -266837 -145840 235982 -45052 67013 245935 -6504
19775 98607 -96630 176398 -203270 -145800 -73866 -267275 120542 -29616 21063 -131209 -153591
19764 -153591 93492 -161205 -46649 124017 43904 -32842 102300 -268599 74114 -97941 -68221
19753 -68221 -173179 121520 -15071 -218173 -250038 -80751 99092 -30677 -270154 -126949 91266
19741 -12510 -192009 -131831 142101 -259689 -60294 141212 11923 -229504 66189 64122 -144313
19729 -86665 153398 -27880 -149006 204931 -289960 -411531 -217025 -372330 -20150 126801
19718 125263 -311220 181867 -266527 387211 -146878 60279 -254108 -22876 -131121 349652
19707 -512773 -31893 -42477 145567 224115 14009 -79067 -137838 10052 -33004 178089 -319556
19695 -158105 162818 -109812 -45099 -100501 -193672 147482 -213077 -22353 -99131 1849 -11227
19683 275272 -198973 73051 40073 -277182 112263 -128246 -106098 163507 -111946 280589
19672 109283 -133211 229585 249542 10217 -211660 -225349 -1700 90591 -267395 -92622 15739
19660 122958 -81272 218521 66124 6145 312585 -41699 205828 82675 -267480 -172864 -80477
19648 -13040 -37939 -216389 -5304 238459 60362 34675 -184493 -7745 -201168 -14139 -337813
19637 -337813 -427021 -196681 -6975 191168 -147097 481199 21104 42340 108798 -100795 18254
19625 -88596 -231672 -328038 104405 -374319 -1591 44081 99663 -61932 -96740 -266675 73029
19613 -25165 -91793 -150124 234987 -238062 116885 -67683 46669 143294 -357168 107353 -85365
19601 -62048 160413 -16707 -218965 -127106 -240799 -22599 178323 -64135 -283560 -256351 -232893
19590 -232893 -33727 65812 -221188 36328 -219907 -233602 -415040 -414656 124421 -243631 -227194
19579 -227194 269642 361302 -162182 -170616 -123386 -187438 -360321 -126132 45502 -158699 63157
19567 188356 121150 -238762 152536 -6692 274004 -140388 186030 79914 -335153 168776
19556 -203027 -120127 -1593 20523 1916 176710 152093 -41850 -55870 342886 212588 -214322
19544 -65007 69009 -89824 -256769 -249653 -41404 -91495 -115941 83788 100863 -3996 -27649 65084
19531 19897 156032 -139573 -208077 -17042 -101787 -10539 211199 78771 -121645 -355805 67479
19519 -232832 -274758 -173683 -201217 -23398 275109 173088 208194 -66787 7570 329418 259293
19508 259293 -137231 -224976 -8911 182377 269053 -151091 174352 -144074 -240685 108093
19497 37793 -131841 -84997 104248 -191073 357939 95995 -53978 347525 195258 -78001
19486 109345 19893 -256858 38419 -31965 -343934 16784 -48454 171163 -34277 -280926 -298024
19475 -298024 177194 295789 61158 -62979 84931 -106033 33054 226190 -289184 -24089
19464 -142364 60353 -135906 -27523 -9797 105506 115660 80153 -358695 -377021 44930 76441
19453 76441 -190860 42042 260707 -55261 -21890 -12358 -289109 -58508 -32295 -64119 21917
19441 -137196 246338 -681 130967 120455 77296 54089 63911 -203417 208479 -359600 -133388
19429 -341163 -369769 -89175 60450 -48126 -149577 -412182 -44838 -120405 -166634 124405 -109258
19417 -252382 12352 162493 -71143 149430 -85330 -185473 131303 -156558 -57310 -20627
19406 -192467 43024 206075 -3657 448780 212158 -144503 -230526 127170 3471 -165273 -383436
19395 -383436 -266970 -85727 -179174 -103268 -180445 -103070 84591 -237210 -7608 61055 127918
19384 127918 -390148 -242152 -230595 398771 162613 -343969 38326 -94900 114434 -111082
19373 -76286 193483 -17289 -334910 -32462 150195 -433820 34556 -264141 -110281 -81444
19363 -81444 -239015 -124412 -55851 -258539 -329191 -150998 -117619 -88676 265108 128345
19352 -291090 -163258 -218048 -217840 -208141 495202 139436 111393 64852 -258022 130028 18960
19340 -82233 83991 -16177 73971 302616 -175183 -91148 -260701 82325 -172235 -5789 -347228
19329 -347228 -17898 -170124 274450 219875 9950 -76381 234157 11974 59267 -134176 254070
19317 -255706 -50740 -188347 200984 -38191 -91713 155529 50654 3441 -505491 -233158 -251524
19306 -251524 -166599 115876 -137508 -54792 -104901 -13478 -30708 128030 -277985 274013
19295 243715 143838 -462828 274913 -472136 -187532 111972 -212318 290870 -78117 305365
19284 -141665 -89744 173897 116816 -81249 45365 -153129 -65630 -174777 -108819 -228449 -267611
19273 -267611 143473 -102974 95727 38522 -179934 -98929 -142562 -56964 24483 17659 -149723
19261 -169104 -119572 -117554 72332 -140518 -33487 -20826 -417642 -124923 138916 -45984 -331111
19250 -331111 -51081 161708 10748 -218017 41624 57505 -54538 15870 -226665 114257 5205
19238 19559 -266724 -112424 -133472 -110480 -118684 -246204 -68038 -66467 34443 -178564 -238729
19227 -238729 -144984 -60509 -81627 -73799 -58454 128306 -107429 292744 102996 130614 44436
19215 27230 16623 -214313 -7449 -102525 -162176 -290307 340150 56790 52964 -199395 14621
19203 73409 -211647 -135995 207521 -3657 264527 -203168 -119970 3106 -18473 -239828 -333581
19192 -333581 317506 -98946 -342491 -213296 -84153 -182177 -145143 -74405 32863 -181059 -202737
19181 -202737 77146 44475 123002 -23315 -164053 -191295 -270569 -133604 -60156 77932 -108089
19169 -49666 -65541 16483 -116112 -223689 99198 -195679 210600 127467 44646 306013 93454
19157 14413 -67269 -207857 -179332 28418 -342154 -51848 -373078 -202252 -76915 150958 -179896
19145 -55915 144358 121576 421982 188789 279751 -139255 109742 -34126 -169427 18726
19134 -7200 -253696 148909 49785 -25308 227930 -344995 -174037 91048 52229 83164 -294530
19122 -150108 -202512 89034 -55476 -215616 65655 -98261 297184 -110129 -10573 -200152 65818
19110 99329 119058 49091 -183759 -261355 -327203 56047 39134 -246825 155762 -15693 -78845
19099 -78845 -214626 -3461 193936 -96461 130265 -554784 -57603 49575 289775 -7534 90715
19087 -65306 -87590 -257416 -211710 58805 -99727 166143 -119908 -30893 246769 -58331 26845
19075 -288925 -180054 -404275 -461549 137901 -13593 129091 -20002 -8978 -105954 -42360 105498
19063 79568 99982 -171853 -20459 343314 -93428 -473338 -335986 -177053 -221629 295036
19052 165778 -6726 -180771 218396 -288712 146394 -170389 -88079 35811 190241 -42931
19041 -36020 -30986 47980 -23504 -142929 -55631 -49093 -46337 -42663 147770 208685 -182656 46217
19028 288664 -327695 -70735 69980 61114 23122 -195333 -5198 -94960 -2347 -69308 135984
19016 -331414 -60709 110682 178589 -419832 -117559 -120077 -102897 -259806 -22516 -84728 -91184
19005 -91184 -200078 214167 46345 -176870 -56295 279864 -63050 203405 234152 -46780 267095
18993 -94650 -90735 220607 -66935 -170761 186847 -459196 -127886 -239059 -164908 61797 61226
18982 61226 473965 70388 115752 -318972 64874 331533 -798 -274973 -93508 36531 271049
18971 271049 18813 365822 234319 -180704 -102155 100217 257710 -90604 216010 -177925
18960 -707 -255884 258451 164730 113075 -136086 -36564 -196386 66668 -54103 -197878 -91042
18948 80298 -74922 95516 -29244 -218576 -318095 79239 235188 -213280 -377727 258738 -36274
18936 104588 161442 103452 173099 -187852 -23640 -94248 72611 -60658 171747 -118530 -34022
18924 -85975 -54060 5894 -32935 55296 -80747 65195 -358713 -29963 73123 -153598 -284893
18913 -284893 90475 -257748 -19770 -315555 -481771 -248997 -187491 108324 -218124 132650
18902 -361063 -28 -141765 -123683 -69104 6055 70551 71957 -218424 88332 -159255 -418958 12
18889 124598 -341600 -31188 47530 -20955 216371 228583 -35428 13300 -167436 24669 -115494
18877 -149278 -59294 -55186 -286030 -114860 -74544 -275114 -129909 168944 9849 -287274 -263601
18866 -263601 14934 -212655 -4591 156522 -263401 -170096 -345738 -178797 51851 -87935 -25359
18854 120512 -156054 -355998 -164612 71920 -262849 -183670 91603 120399 -318769 -19700
18843 -2082 -333537 -151029 -2669 -172697 209054 -251084 106927 -137533 45556 -171621
18832 -117425 -138712 -9782 84662 -190932 -31556 -43184 -74465 -364355 21943 52151 -260610
18820 -6656 21683 117498 -102656 236789 2245 15876 -109618 -46968 -78192 -40357 -64523
18809 -64523 -155980 -59750 -281979 -76567 36941 -52108 -77937 177347 -374518 -186298 -67365
18797 -93249 -200808 325462 26785 -88728 -41118 284954 -124464 -210183 -96103 -59337 162638
18785 191043 134924 193970 -29537 -122039 -193131 -163911 157289 130325 -100490 262409 162029
18774 162029 -246575 -27891 -325732 88604 62437 -193039 272792 124631 679 -51945 -81660
18763 -81660 -223520 -32563 -553081 97092 241761 -9199 -106024 91776 -120769 189067 24610
18751 -514259 154147 -421360 222383 148657 146187 -131240 9903 -45992 46516 -85988 -147054
18740 -147054 -369059 7086 333942 -49121 185290 195179 27654 -244282 -251492 -144287 -85346
18729 -85346 -583389 -143077 179393 121268 -161633 234279 -119006 226639 361142 -169199
18718 221492 -317354 -274788 -117049 -88091 75341 -268243 -151554 -60020 88157 6048 -60
18706 -34451 -1659 308837 -217390 -74629 28668 226116 97239 -118721 95191 80246 -9247
18694 185382 -304658 -208741 43269 272771 -78158 -326752 -5319 -118255 -134704 2388 -474823
18682 -40542 -104130 -31275 -219047 -27552 113059 -188016 -133395 -409166 545612 -43935 67909
18670 -246411 -3443 9659 89071 -67207 8210 -303767 17542 -98473 7576 -28112 37840 42293
18658 42293 334116 -42132 -150301 -253577 -14678 -276333 -28462 -87507 -335115 181900
18647 -3086 -451774 196966 -200905 -30413 -96186 -53599 79784 -187504 -180833 124227 113187
18636 113187 78595 -342099 231531 -568713 -182001 137301 220362 -155761 -35932 -275591
18626 -275591 -144167 -128740 50977 -353321 -76103 -258768 -318525 -234532 -210891 304797 -195207
18614 55041 172492 -211483 -196078 -191108 42493 141624 66470 -83734 -203229 -121876 64000
18602 -144726 -71577 80105 -87762 -258465 159211 -181486 272030 205209 45101 63960 -183544
18590 -173263 10708 205676 -69951 25088 -24385 -263763 -18864 -313610 -154939 86155 -38730
18578 166758 -143257 -194097 -59621 -59430 -98548 278111 -244494 331145 -84640 108140 82781
18567 82781 -337217 -401945 -40742 18280 112017 -74000 -172849 -325106 6580 -39691 -187065
18556 -187065 -144084 179198 -965 273208 -217899 -38342 155602 -84012 228358 77314 -131228
18544 -341268 -30456 -15585 -344428 -271727 -28718 -10081 -63224 199305 -161925 -118773 -117523
18533 -117523 50996 -6318 -31034 216344 190099 -169688 -153647 -80683 -313642 -22992 31454
18521 -149411 -96602 3709 -294072 79386 -14373 -321243 208678 88 -103713 186930 -424107
18509 -91087 8755 -51410 -123310 -359323 -138894 -25734 26830 -150494 225409 152329 81218
18498 81218 -223919 -242201 155296 -23536 -197819 -110757 252368 -53255 -140513 -50416 328155
18486 -63025 -54357 -58451 -68406 83210 148004 -73647 99457 32230 -101716 34182 431492 -21862
18473 122793 33158 153302 -102344 -176554 -69514 -189864 -304498 278372 -45335 10803
18462 -431503 228941 -158919 -343101 523283 4858 -148531 -279963 11589 22524 13885 -95528
18450 -330364 27283 212935 -470631 293188 74354 -195078 -73058 241706 -34921 9773 83034
18439 83034 77065 109425 -99988 111871 -5681 -251594 -139464 -139160 -179282 -139695 38761 108815
18427 108815 221173 111982 -194021 20221 -48146 -232819 -51257 -203744 -176386 -107899
18417 -107899 -191116 19480 -75928 152671 -274095 47822 -76925 180116 -107493 52474 -168049
18405 -1066 -99238 7519 -241578 -146148 -142175 -101319 94013 -16065 -160768 -70595 273598 -76999
18392 210183 -268694 -41344 148306 -300461 88655 -339060 86 -565064 -151627 -158791 267763
18380 -314964 -363186 -47890 246467 -293973 -105468 -243660 125630 -143828 -295675 -361728
18370 -361728 -63239 -242481 -112653 -243151 -99986 38716 -196975 19352 -121557 -248923
18360 -248923 -56101 -320864 -41749 -12426 -120171 -262 -72770 -106895 208600 205179 -156085
18348 -306049 -228619 -130746 14516 -204531 168055 -30919 8665 -91423 -95975 -296958 -210218
18337 -210218 206698 -101368 -78370 10190 -327667 240440 -89284 -181034 9479 -114694 -125474
18326 -125474 -178758 40339 135095 -155998 112054 -320342 -138965 -137502 -92937 -250269 -225469
18315 -225469 -165135 -137393 -19985 205271 147857 212366 -2099 117453 -176535 -89344 34169
18303 144397 -286164 81385 276710 -187345 -88123 -85653 84597 208743 28679 42603 351991
18292 351991 -340789 -93195 133869 -96040 -77139 54761 18627 -158481 218359 -10130 -248313
18281 -248313 -137977 -152158 308854 -15165 176407 -232932 -191046 74704 -129998 -4068 7650
18269 168591 -65610 106730 33320 -217718 -131817 -356932 -143934 -220600 62715 456586
18259 456586 -71311 62860 -234512 -227408 37230 -98809 -300641 267738 -129687 61544 -178516
18247 31371 189759 -97725 201836 44406 -34507 -190527 206148 -151819 -257524 -170040
18237 -170040 -104333 -215399 87861 82996 -184135 -189417 -198834 -119308 -113654 -31733 172060 -182900
18224 -10942 28298 34131 191802 101295 63787 -4533 -310276 -77386 106600 25086 -23442
18212 114018 -281970 -75649 62470 -80703 -78268 66378 37130 70689 93627 -99229 32530
18200 -5775 -176160 75749 51114 -106629 104194 94684 -34066 50876 -289993 103059 281122
18189 281122 -189830 2531 -139794 30192 -23258 67643 64273 -394310 19902 361056 122118
18177 -55561 -64132 -270289 -232059 -130057 221905 -19713 223243 -171899 242 -98052 226346
18165 -212288 75140 -38719 -96242 32380 -2928 -34640 -109264 -31994 274113 -191446 -154209
18154 -154209 -132854 -254187 314978 -192501 -160960 168593 81928 -182213 -132751 -214519
18144 -214519 -76886 8327 -89646 38891 3021 -79352 -79365 -305098 -55295 -143124 86890 173821
18132 173821 70267 191361 56647 39157 -192442 -43632 52455 -74642 -69268 44272 157047
18121 157047 304703 373583 3786 -226236 -14990 -126876 20682 653 266505 -271477 -148576
18110 -148576 -252315 33393 -204365 38741 81546 -85711 -203077 217824 -76049 4920 -7050
18098 -20045 162813 -105661 -297 -223608 -262396 -82467 -279289 -294595 -90991 152684 138291
18087 138291 30934 -10129 -99065 -266510 -201288 -226373 91166 -222673 84237 -323192 13973
18075 58465 24941 -117485 -56171 -202010 -21684 40962 110770 -153269 -305068 124939 -201659
18063 -36564 358529 45862 -131694 71981 53471 174037 427791 65205 57844 159928 -4697
18051 3935 77856 177201 -473703 -106436 -150492 167907 -137907 85215 -31490 -249234 -74079
18039 -75842 128190 -67636 50028 -530644 -187309 5621 -53522 -10361 72218 -273133 -178181
18028 -178181 156367 307169 -43935 -303630 -191564 223861 256715 37300 -91430 -7548 -95668
18017 -95668 -51192 -156782 -126449 156291 -116327 -104302 -205382 247217 -148555 -179769
18007 -179769 24167 264729 -28085 495610 364281 30080 43931 31186 377400 11132 -230850
17995 -226554 -48393 -117085 124045 -123286 53199 3670 -215477 -84577 75191 -53999 259818
17983 -73787 -48353 -145679 265407 276751 -97743 228884 -243051 107061 -70480 -7200 -268487
17972 -268487 -22048 210206 136552 5197 47330 188166 240207 -81496 101252 -194216 -291332
17961 -291332 56988 191575 323571 59077 -352364 103460 71940 203760 -243543 74141
17950 -89301 345122 -19009 -117179 -69595 169794 -114236 -115762 52280 20313 -103377 -424184
17939 -424184 -82464 305133 227234 59263 74325 -22233 -169911 68453 181054 -88938 269340
17927 103517 147337 250257 -34827 -377814 -32027 19357 6295 -215842 -167914 -282296 -79196
17915 59217 -86510 157117 -333231 221530 25967 -86310 -190107 -165477 -274119 -79469 -7409
17903 -10999 187966 -446610 -107033 -413584 119812 248003 -128130 -149635 37064 -363262
17892 99993 -396815 70828 -336446 -87998 65726 46511 -378 229698 19091 -87283 -234387
17881 -234387 202915 137282 464759 67316 -221586 1680 58997 -12705 115470 87236 339032
17870 339032 49989 -45125 -95489 -176748 -32388 -36706 113255 -85852 14673 1989 -156508
17858 -207678 -208228 141318 -43532 -165221 -58059 -49965 -110703 213643 420102 3080 -45087
17846 42578 96388 195734 -359548 2134 -43864 80115 -193124 -52740 97278 -12136 43186
17834 -118927 185002 -86393 122821 -192023 332649 186088 193908 286951 26475 296682
17824 296682 61875 99804 170501 156842 9523 -195896 329132 231966 198034 365075 223245
17813 223245 -77558 165898 -209978 235785 110993 -316414 55813 573 -33197 -109969 -187082
17802 -187082 164545 -140282 -242542 29329 106148 131915 -19210 214253 -167002 217306
17791 -68536 207729 21181 -294381 245800 -44984 -89567 365497 29089 -406687 -63855 87881
17779 168030 -194442 -198269 -126607 71305 -79563 220493 12824 257473 45195 96386 531295
17768 531295 -61332 203578 -283644 -80616 78633 303127 318143 -55576 354214 -38304 -185042
17757 -185042 279526 -62712 -242561 124046 30880 -66269 -156965 -98454 -329530 162341
17746 -61969 89742 16440 219806 77119 -160907 293128 115073 159327 -270836 -182220 96322
17734 78524 217442 -74889 103912 -640 -187626 -79622 -131309 -115494 197971 -239685 196277
17722 189342 -52493 -264055 152929 -258791 -68603 148564 -192071 -26692 167934 -337647
17711 -71947 135736 145 -151665 -90060 176133 -123214 -185445 9942 164139 53342 32350
17700 32350 -63613 -101816 -21755 106742 -5687 -18771 330915 134960 -101018 136970 39522
17688 116053 123701 -10127 -23178 -136484 179539 68964 -92256 -4400 -69729 210827 85833
17676 -96062 6347 435381 -124256 30549 344997 33 164524 15719 22901 69180 -166482 13073
17663 -141556 122105 33646 65659 215957 249793 -53820 57892 175216 6284 -150402 104706
17651 -186871 466 -148431 172499 240911 -127565 199150 43720 82588 -187066 -109304 78721
17639 171841 72889 241034 296459 194143 87372 138982 170864 -19411 3462 257719 -293455
17627 58121 199932 -41259 -42470 271273 239221 78903 120367 161222 -82142 273617 132324
17615 97471 126597 24312 -66543 -108609 -77174 55348 -29835 -56962 30755 454686 74569
17603 36178 217600 -116796 55657 80472 -40561 -18076 89054 249758 28194 -19007 -76782
17592 -76782 183000 -43191 14859 69489 -11151 -154581 76538 -46093 -275855 5334 -138507
17580 109477 100641 21129 -126507 -84788 73577 53885 281795 -138715 -146173 16729 48376
17569 48376 235972 -316673 -116027 -18017 252606 25609 381982 178677 135798 282787
17559 282787 144915 124640 -378430 -43563 -45002 76388 -152154 -251489 -121508 99360 156995
17548 156995 -91927 67810 265750 19863 -33273 135961 72478 25669 11303 -13697 17898
17536 97456 -6325 60267 152912 -43446 -40996 292098 -239066 328767 -2501 173248 534033
17525 534033 117360 -199322 -26699 210542 93653 -96298 25044 311764 94559 92935 238583
17514 238583 38587 -127933 -19753 97819 84398 -20749 217184 -262610 4652 -18641 185495
17502 156388 -54815 -83788 282571 -63675 2313 157491 230613 251385 256965 1912 22122 273133
17490 273133 76882 32888 41117 2608 -75563 309002 -56027 67586 253702 -2882 -79037 215587
17477 137036 81374 300554 18376 77011 -77571 280883 -12101 106847 212046 -93008 -271801
17466 -271801 69095 -106126 259452 74041 391526 181464 153666 -109719 76682 105983
17456 105983 280908 337757 610822 32852 5485 339506 286655 213167 329674 71414 27720
17444 137242 344334 432761 484816 287768 138750 527405 572055 201397 66998 243396
17434 243396 345357 406465 186535 92588 110172 64244 172952 74423 55404 384737 232209
17423 232209 213780 540981 63246 139677 -49530 392186 240691 161780 -28209 612806 245231
17411 60596 -168827 380405 -42019 183341 -83064 466303 312717 275565 271057 26665 296894
17400 296894 -49050 105285 387418 -182337 178866 -140287 31563 244037 387713 177647
17389 300885 290914 167984 107535 353203 497859 221241 85954 209807 -80804 229789
17378 434000 55317 156079 187973 -108320 -259581 227651 13970 357936 78898 384186
17368 384186 217682 131987 -18096 279610 -45729 184596 -153789 52352 246356 70272
17357 53402 -37219 187366 191928 109186 360801 419945 -28748 241528 -86837 290438 29128
17345 97966 262050 -291028 -1266 361807 219960 -40312 58068 189144 163692 -2162 78206
17333 150475 -192035 -83248 119055 25768 228316 253958 232027 -189667 148313 292590
17323 292590 128240 21244 228948 98113 416239 167460 269597 594856 284022 382604
17313 382604 125367 219754 163497 -282170 291215 295875 183151 426085 226067 315465
17303 315465 126921 31121 135324 193 108088 370828 309787 234187 93077 94273 -35726
17291 160779 331882 -81750 160587 368356 185599 -257413 375776 -138211 311895 4508
17280 180732 294959 396890 278990 319085 257792 392063 500953 204176 156691 82039
17270 82039 306332 486821 408410 93374 359899 -3630 215404 5057 428244 159913 193489
17259 193489 -40375 88575 2144 28831 27053 177817 103356 44649 135284 227943 475069
17248 475069 -146373 -207930 165890 95352 478027 316687 260290 155156 137690 536204
17238 536204 517128 165104 535849 335177 388069 292482 130534 26097 175513 65588
17227 178367 149857 251901 82875 303097 136513 300069 533253 321467 393669 152873
17216 358375 13094 392675 497534 417313 420416 163528 212661 391789 411765 431193 20917
17204 443118 114433 261614 148636 373390 119413 502977 165033 306047 -287047 129946
17193 474377 473508 698726 206344 454919 495158 104079 363672 185635 184156 253169 251912
17182 251912 354456 -163488 210181 120819 -97881 -117951 711753 267114 248639 172563
17172 172563 350408 88310 353088 350561 27367 349417 325684 427985 358605 -12754 56517
17160 249425 343193 309202 381702 434838 288986 404050 486433 195089 649361 297536
17149 21406 337424 -30572 147706 318815 -24336 268111 398458 434033 121340 464024
17139 464024 573017 173874 71098 398905 110289 385401 261314 292221 275771 376615
17129 376615 55156 606383 115391 82680 742517 189887 368879 399300 829005 467593
17119 467593 283912 490807 455818 491851 590585 307671 494020 441016 154364 314239
17109 314239 311482 293836 -104125 235715 462837 278601 471857 380111 399411 341683 51684
17097 323950 729673 302125 270980 350479 592028 553921 505190 240110 564012 485858
17087 485858 44119 510915 205970 323497 605453 902141 406796 165296 234774 512835
17077 512835 351526 302705 461486 421371 887551 254157 275054 341659 231965 464999
17067 464999 399352 770194 645926 774764 -4300 720104 579637 538303 425301 354985
17057 354985 449801 370582 538760 397872 431771 379337 539503 557802 411997 564904
17047 564904 273561 172422 214943 269527 187365 355512 472649 598181 243111 406349
17037 406349 717062 427244 617890 532986 502114 541982 578348 451777 597639 735156
17027 735156 595720 331742 607151 820488 618769 864662 690846 790109 765382 329194
17016 422194 737741 664092 613226 581082 476747 864773 769493 826827 665977 1021598
17006 1021598 575019 407189 500355 944894 700565 555718 576778 711057 583400 671401
16996 671401 644476 531187 830753 929557 730496 736844 612708 512670 905844 800093
16986 800093 749493 820856 841920 1097036 681375 739977 1021592 1053034 599835 882946
16976 882946 416528 996577 875744 487297 875583 1067246 918420 827277 1404173 951373
16966 951373 916190 946518 1104699 708505 920059 786879 901505 1321310 900631 886462
16956 886462 1040478 1081520 828926 1171267 1100323 867065 1336842 1037581 1361873 1259661
16946 1259661 828270 1143027 905792 1025832 1103114 1069614 1035855 1050720 1188796 810389
16936 810389 871155 1109140 1395792 1045919 1036461 1431636 1110668 1210307 1143608 1482201
16926 1482201 1071373 1256475 1556125 1272906 1316442 1288188 1342686 1308711 1210475 1640194
16916 1640194 1346815 1259276 1405435 1386492 1473394 1553994 1397155 1657023 1602419 1989487
16906 1989487 1801627 1687238 1915233 1366331 1435601 1523229 1836728 1863904 1746458 1528994
16896 1528994 1375724 1437840 1652281 2097641 1686346 1834102 1933975 1794410 2013745 1772872
16886 1772872 2051586 1875810 1920279 2068039 2090987 2213482 2083360 2414524 2136450 1997369
16876 1997369 2312787 2246024 2296542 2121742 2813765 2366869 2322574 2343627 2729913 2854071
16866 2854071 2605127 2762069 2418060 2678607 2735723 2581527 2634862 2793030 2866474 2951259
16856 2951259 2970729 2689807 3244923 3092268 2908892 3336017 3285857 3342420 3334697 3443114
16846 3443114 3459934 3370557 3399993 3703716 3769835 3621467 3520343 4120122 3866447 3637328
16836 3637328 4017318 3970993 4045226 4025928 4393620 4442273 4396335 4454916 4684178 4281314
16826 4281314 4641423 4703413 5080022 5184219 5040192 5190012 5151224 5165962 5570807 5702712
16816 5702712 5666767 5575918 5899097 5883865 6039986 6365109 6528004 6708341 6865231 6958916
16806 6958916 7103609 7289682 7433574 7439240 7563675 7999267 8459902 8220407 8393570 8513602
16796 8513602 9158921 8835451 9266675 9687945 9656125 10047761 10205292 10605933 10763867 11033779
16786 11033779 11406073 11973641 12112412 12322858 12955592 13398984 13748955 14193980 14354892
16777 14354892 14847634 15153353 16261229 16190811 17063913 17638703 18256892 18633496 19451642
16768 19451642 19911282 20821064 21728792 22290141 23272445 24148894 25269005 26331008 27355400
16759 27355400 28277967 29438746 30560718 32152541 33367238 35028379 36724345 38204400
16751 38204400 40073802 41719431 44167497 46062389 48231801 51397627 53824478 56769995
16743 56769995 60053170 63457986 67095309 70290256 74752288 79580072 83954055 88830893
16735 88830893 94437986 100027394 105941913 112801057 119566554 126835441 134509978 142454142
16727 142454142 149996301 158239069 166469651 173781320 181275945 188083550 194295104 199285122
16719 199285122 203102464 205666928 206763402 206494997 204698619 201962322 197371425 191935204
16711 191935204 185285216 178296082 170188659 162278413 154030834 145401731 137603827 129325143
16703 129325143 121792804 114331968 107500644 100814713 94780485 89341294 83610905 78965309
16695 78965309 74211549 69478484 65834922 61926740 58615169 55389699 52169108 49760668
16687 49760668 47155628 44546243 42519513 40107972 38233104 36135872 34696622 33034891
16679 33034891 31671827 30246665 28832683 27419536 26326974 25175752 24270680 23337364
16671 23337364 22338918 21456772 20528725 20133324 19339519 18313622 18089830 17224218 16551807
16662 16551807 15991332 15336287 14930488 14345564 14169946 13501160 13051839 12859875 12118373
16653 12118373 11961977 11512416 11085690 10967511 10560949 9837870 10549057 9805780 9293272
16644 9293272 8958782 8803810 8765821 8417179 8417814 7848372 7720642 7984093 7486133 7163902
16634 7163902 7299779 6930292 6750829 6403717 6360556 5963671 6287663 6038943 5720519 5465559
16624 5465559 5741826 5309850 5708744 4848191 5230587 4881557 5039651 4659839 4697907 4849361
16614 4849361 4728866 4455841 4498859 4372847 4236240 4224446 4184743 4080808 3864972 3818010
16604 3818010 3276826 3674392 3622567 3465647 3733961 3553887 3859498 3466551 3297177 3287053
16594 3287053 2695038 3049605 3041154 3173782 3267823 2932021 2639798 2641410 2878421 2708012
16584 2708012 3190886 2717618 2584303 2287824 2426857 2533948 2470808 2018642 2590530 2363809
16574 2363809 2490905 2669139 2325462 2098347 1995439 2002589 2349693 2341561 2131607 1842623
16564 1842623 2156321 1901942 1924380 1986166 1799756 1950218 1881732 1921364 1747844 1900179
16554 1900179 1528667 1815014 1612644 1621777 1291921 1498176 1698871 1850772 1764301 1572862
16544 1572862 1497519 1181001 1530646 1359670 1487655 1216944 1330020 1294722 1498736 988414
16534 988414 1519652 1627896 1100070 1270562 1381979 1479098 1125740 1532440 1140527 1416223
16524 1416223 1032027 1360773 1364877 1304945 1004216 1134919 953275 1094704 1055892 1321306
16514 1321306 1303123 1475687 1004474 1076481 1113736 827583 1142660 646725 1130887 1061358
16504 1061358 1165695 898957 839323 1010576 776788 919446 1019009 962801 1093382 817459
16494 817459 1056397 976058 857459 1020521 998430 696949 865489 659266 688792 967257
16484 967257 980068 693977 770379 991025 861968 740275 972039 830658 863816 929419
16474 929419 682874 745209 876826 917798 848514 1065892 696274 917147 837920 623936
16464 623936 859193 1070296 561106 846306 587691 750430 987812 409372 613279 786030
16454 786030 1067293 697319 375446 647141 227598 716213 849295 671601 841379 566766
16444 566766 405155 481648 639454 790564 894367 689039 613675 704169 431197 561421
16434 561421 555918 504667 306426 432366 732604 604256 565277 649911 718028 391883 820247
16423 820247 672099 726579 544471 485061 572606 792812 560175 689975 534286 503969
16413 503969 724276 757265 655380 325449 538571 448996 487138 496786 327080 651180
16403 651180 680259 732190 585908 640717 337116 783614 254749 626938 393784 557305
16393 557305 425603 413001 349967 523463 494867 279749 405575 621447 291365 576241
16383 576241 541748 616199 512585 492131 433721 446600 502867 303637 340397 594238 340791
16372 340791 60171 303276 276200 281420 384735 666341 295097 260407 596602 691954 376995
16361 376995 323511 286508 404987 543684 565601 323477 306101 210856 363195 457198 378104
16350 378104 525645 472955 598672 295129 475883 474088 230831 437438 80205 429372
16340 429372 338500 232273 315852 295386 525498 246676 235795 274921 359875 463845 62048
16328 497196 157943 135740 66374 424209 203553 300215 52212 177733 211517 168134 306435
16317 306435 186282 131732 416981 737499 278663 223792 269472 143336 98783 501293
16307 501293 609115 15416 318940 312165 476872 627699 178851 207852 294051 -41464 156811
16295 74355 658361 217841 516407 281044 386761 500149 236712 267525 467574 117886
16284 292963 378215 4293 451389 14893 166148 470668 242901 394976 581270 207409
16273 650052 244602 537173 308132 237827 -39951 385680 139297 438890 83806 497141
16263 497141 -76590 137146 176123 278787 13517 133339 342852 524857 462145 -34731
16252 55453 572213 74197 351688 -73809 -83454 409494 522314 29290 431756 313627 321459
16241 321459 340778 319115 19178 -59303 301629 117380 290548 283270 102647 357405 12580
16229 304170 193104 89868 530708 403650 142783 362781 233383 286060 163508 355708
16219 355708 -1517 -61017 314758 355062 201333 363786 185975 100958 234199 154949 287749
16208 287749 304110 45097 -46939 425142 280129 199033 -208337 118027 299566 -1497 125808
16196 -138719 145801 189561 218179 145250 129249 306663 72086 209552 102406 129920 39748
16184 478450 304085 140330 39669 265450 126997 234699 224825 -128712 259255 342071
16174 342071 134699 201004 181081 427913 -41176 -298829 190319 227611 179524 178241 -114352
16162 -79243 15880 284478 224260 16843 247687 239097 286518 -126587 213244 74925 -4084
16150 146689 183372 255146 203988 30372 -167449 142370 -224301 -22867 28837 159184 71266
16138 -314485 -210249 8540 137626 398087 314010 336439 72176 102385 237342 66298 99336
16127 99336 192480 214780 174714 43007 211039 165729 -3661 145810 22615 296412 42788
16115 46567 213905 -317487 -168903 367957 -168727 92637 5141 46985 49395 75267 138237
16104 138237 400049 -79165 -36646 63669 44633 316078 -17804 288751 -102683 296630
16093 185061 60341 203339 210417 208769 302937 241502 -238300 -228170 51796 -152464 23858
16081 -138505 148862 270158 182356 -149531 319341 -138573 -84005 112235 74296 -168531
16070 50708 219502 -221487 -170449 130594 370133 -193297 -226459 -201545 -140377 178219
16059 5800 97845 -90715 -62691 -62049 -20012 229234 262914 60738 -374932 66710 -54397 58828
16046 -132730 144365 -156728 -181360 -160915 7629 -239582 -51737 -286610 -310319 -300387 -33281
16034 94425 -110090 -6653 91074 19558 -263176 -55139 -202973 530699 35355 30849 -358126
16022 50185 -131507 -55854 -106208 162235 -224855 -150964 -47932 141551 89299 -13045 54813
16010 -323477 -178801 -51224 -229664 -65750 -41926 127193 -74557 158877 -232793 -281426
16000 -281426 -137701 87857 135973 7464 -173796 105022 28489 40828 -173779 -218524 -239758
15989 -239758 148286 -175666 -70876 -88630 63389 50938 82226 191365 296035 106368
15978 73539 -46184 309373 290191 -15509 210352 -350182 -8234 -282009 109441 77231 -87243
15966 -198109 370724 -140467 154639 -166964 250636 -33736 22826 -24640 -104659 -94484
15956 -94484 177685 -74061 173942 -26378 -247674 -212640 -103742 31715 80167 -67405 -160310
15945 -160310 26040 -173434 -452762 24128 95035 -90632 -48147 18550 597 33231 61876
15934 61876 37841 13342 -121735 -245176 76718 -29466 40345 -405141 -335984 23735 -254692
15922 65751 28578 -212183 -32753 -22095 -108242 143779 -228201 -14534 -50851 380033 -121673
15910 -293440 101681 358207 -69349 109209 -173300 -203799 152619 472063 -78789 -105201
15900 -105201 288536 -23756 27028 23372 -323144 -302024 194011 189330 -157913 -110680 -276377
15889 -276377 -391859 27307 -73790 -65931 -142915 2149 20097 119442 -105137 -66437 -17810
15877 108337 -81495 163710 -34041 -268717 -329926 42897 -146552 -127037 -283556 -58642 -308672
15866 -308672 9554 154835 -19324 -266800 166905 -240153 326480 -206216 183808 144122
15856 144122 109934 -22665 -155122 -224964 114565 -14129 -170725 23697 -315884 -85448 -5
15844 84844 -136768 88457 76513 -167751 -447573 -48388 63920 84891 -292171 -416758 267108
15832 233961 134923 183634 -330169 -256990 203987 -462743 -96601 -51750 -6925 42359 -200240
15820 -198387 -6368 -6702 58818 -310905 -79212 -189905 42728 -246371 -80717 100551 -353792
15808 82199 -35596 -219394 23650 -14891 -226330 -147833 72695 23330 146536 18211 -125806
15796 85119 -113129 -232735 -66410 14600 -97757 95970 199241 -42694 -339902 6590 -64048
15784 -26950 160772 -288212 -54713 181083 248 88201 352696 175129 -359981 -70576 35495
15772 174933 -289357 -29672 44324 18778 -99485 143100 -153943 -177401 -69259 -51162 -19895
15760 -133 -142487 39394 -231637 -205534 -217503 -16625 -32050 -95518 -240051 -151145 137798
15748 -151198 41097 -122001 375253 212810 -47994 -199809 151898 -71625 -116071 -187642
15738 -187642 -55279 -223438 -115263 -154971 -169222 -19076 -205168 31724 88372 -361906 96622
15726 82700 121713 -35368 -509974 7858 -117959 101627 81559 -156973 -95137 -195945 -314022
15715 -314022 -58124 -204475 -282972 -392577 -233601 -212979 282393 -108654 -285903 394907
15704 -264579 -24657 -58553 162649 58979 82531 -146758 -265190 -40877 43272 -56959 48402
15692 -373147 57902 -342457 233743 253262 87499 -28044 -80210 -184876 -181797 -3981 -32188
15681 -32188 -182080 -5821 -12256 -137538 -387183 -243040 13020 -43157 -247232 77010 10347
15669 34685 96481 185014 -30504 -1778 98168 -117520 134006 117119 -235333 -395011 49966
15657 -265247 3867 39511 65221 -157354 -113577 79289 -56177 -271231 -55172 -161254 -210483
15646 -210483 55805 -163903 -76906 -11666 230826 160724 102725 48043 146897 -302405 4982
15634 -77747 115257 -131383 125779 289965 -181890 -250651 394400 -489679 145242 -210736
15623 171682 535997 -290284 293317 188549 277063 135804 -33293 -187576 -53807 95581
15612 -108054 -125277 -215681 -118141 131592 -296859 44601 77939 -69263 104815 -178787 151247
15600 -88695 69172 166996 -349346 174060 229401 -128270 -105901 -91847 204202 11478 183478
15589 183478 -277317 -234874 15958 95432 -7969 415646 300268 6488 -211687 -70232 325873
15577 -97606 -265443 -12229 -304161 176551 -96523 9845 -94316 193228 -216756 -16546 -6120
15565 -105917 -99928 -88604 132551 169807 65915 229194 -133195 256244 -241615 -66456 53391
15553 183410 109713 -27296 -61873 -403899 95985 -359401 145672 -30071 139716 -212046
15542 149798 106495 102898 -36555 39877 73006 46136 -290457 -64941 -83469 41148 -237914
15530 177290 92096 8283 -147972 332148 230761 -34543 154838 -312215 22622 358521
15520 358521 -263515 -215557 2288 143528 20830 -75199 8351 16531 366067 -77003 -84688 112762
15507 127158 -98967 -18871 -95987 -156428 269571 -129655 -42262 -170491 139120 -84100 75547
15495 117569 -75081 96349 -61097 480575 242607 -43033 -218550 57351 -30963 -403115 -160962
15483 84403 19891 184775 132 -144812 103990 100606 283439 -33815 -59250 -212283 124 6609
15471 6609 -172282 209373 -169851 86064 -99908 2483 -1119 173522 86325 -78455 -35923
15459 76706 -276020 244156 182686 14007 211745 -108234 -6250 -38067 37994 -9442 34124
15447 60934 -27273 91575 48841 -30170 306539 196314 -47630 317573 -88353 13258 -84350
15435 116737 78226 29615 -119656 -15024 -200611 -179645 -304638 47292 334149 -199274
15424 215635 -172140 70042 -56978 343713 -12958 141118 239473 129557 -166584 -8997 354980
15412 -132635 -54531 -64704 253177 40275 5350 -140722 173380 199631 131380 -18746 62435
15400 -246976 239534 125987 73214 -415574 94571 -18211 -48532 111473 -231828 119762
15389 -73581 171200 286781 -334043 -52496 -255073 -73901 -94566 46688 -83187 66430 177324
15378 177324 279971 -68963 -24403 87586 79440 110577 -34223 -110308 194118 157776 216756
15367 216756 121841 116254 -93112 -352894 45800 41240 36551 -235713 -348814 -166455 -5097
15355 -268717 -196779 132179 340059 -181482 402948 -230480 188400 -280861 -69595 -47148
15345 -47148 -11108 -263612 -89502 5477 616434 -60825 -462204 -109624 107698 328923 -181425
15333 -113403 -14006 241252 -200619 -177602 -186955 -117642 -57228 110597 -113763 -84994 83845
15321 69892 150918 80149 107762 240043 182132 -25928 -91373 94372 72584 207097 117040
15310 117040 463029 135745 14276 -21742 -88097 78494 86674 -120135 155280 336616 96027
15298 48385 -92860 -194437 34028 236061 39442 43173 -138696 163522 46497 21344 -144800
15286 -65187 -329821 -62568 102884 272636 -173325 -165517 285213 63344 -203572 55251 -235286
15274 74200 48063 7933 170031 29066 45127 58757 97310 73893 56522 178935 443031
15263 443031 290162 102230 -148022 327810 222137 -125564 -231180 21781 223069 -36916
15252 152559 119361 557839 157343 563972 537536 1124236 2065197 2011733 1852781 1894524
15242 1894524 815519 171540 11543 133051 564739 488551 8980 57789 302207 425891
15232 425891 -186342 177024 79626 78173 174832 -47501 109957 211773 310280 -58563 87413
15220 -99485 69302 -162345 313571 -187508 -78784 -141563 206950 -87048 59951 98465 -67759
15208 -8087 89324 -178882 244169 -21064 59749 207087 105563 169325 36294 42524 365202
15197 365202 183629 132118 -101231 -41914 60852 284023 -39504 198077 -149718 227999
15186 -138728 367139 -68135 -33498 117644 13688 -106157 55149 -17220 -38680 341263 105895
15174 359895 223218 57642 97313 -58400 222763 331766 58601 213666 67835 187056
15164 187056 -78853 8686 57174 346655 363976 194171 -66052 331917 -79274 161812 247750
15153 247750 -160693 235864 203889 76311 72871 163807 95337 43940 71710 352572 305872
15142 305872 -135497 13835 81720 189146 304685 25535 224273 320232 346574 91800 -117389
15130 63993 194522 307310 25578 503432 404834 295325 -11714 156873 396360 455344
15120 455344 360211 285774 366527 67339 411421 187056 344836 427394 326505 64493 -18749
15108 477721 309817 -107026 27811 -425814 -25801 338062 -178682 -201971 262837 99424
15097 -12057 418434 301379 437836 134761 38139 459256 335219 227021 -92486 178113
15086 29395 570197 125694 241292 176591 -2087 558922 94721 227820 128213 91844 55513
15075 55513 364988 170368 397440 -13104 -118249 -257777 146924 -243624 152107 203510
15065 203510 248695 335513 68378 -53684 -88685 164235 39205 336743 317224 -183139 92050
15053 235781 501452 300301 275820 269665 272843 325138 332927 271353 338898 -20822 243251
15041 80650 -146890 367157 78568 117700 386884 71781 -310316 211856 131204 117173 677258
15030 677258 58979 66098 92804 342782 204015 174727 6236 -130100 28114 40940 74786
15019 74786 183536 398798 272292 216501 300504 199130 402180 399508 414371 222675 399483
15008 399483 603150 149580 182013 7819 28551 99257 321529 364755 404151 316629 46178
14996 141863 190708 315117 145495 223410 366255 148760 -184510 -48893 277033 289317
14986 289317 200267 488577 248166 267548 273902 87180 -33017 484272 115138 277207 176007
14975 176007 232676 114849 382816 286401 295971 336247 508600 526193 218106 342977 252248
14964 252248 84562 37543 88784 157519 194140 316359 339789 180394 448589 129227 485591
14953 485591 261647 329133 417128 363245 348842 144267 384411 357187 497229 337542
14943 337542 235587 65713 227984 415987 47421 582873 252340 381514 396139 385244
14933 385244 188515 428940 447629 49347 454073 517256 331254 -26558 366428 292641
14923 292641 452765 418088 87292 274763 305972 -68866 305572 420987 400952 266965
14913 266965 -21944 358366 459128 623557 218943 213642 505862 264181 430009 347358
14903 347358 665400 413974 141572 494610 620961 201725 493573 455784 625297 397800
14893 397800 476373 594547 565394 479744 275145 576310 85276 439230 592425 291859
14882 468369 505573 242487 57082 483436 403377 328804 217916 434674 140178 13014
14871 140112 482924 187045 194830 511208 565427 336377 235681 203899 318961 270396
14861 270396 394474 410053 545176 718279 504219 378504 533946 291324 896578 337663
14850 434846 716762 678223 766352 509663 582408 775828 299236 261986 395956 451030
14840 451030 416607 524938 112978 651604 444910 707399 434737 540431 467234 621087
14830 621087 442850 525299 667333 729889 568167 760145 459593 427245 592389 396644
14820 396644 446744 562624 164978 604099 640906 279576 617900 623794 426756 488650
14810 488650 469956 436119 736634 712972 488212 321724 556660 469118 609655 546059
14800 546059 706773 513457 767726 450323 869297 590676 517620 717186 824511 717184
14790 717184 726980 574188 882819 754673 771728 589039 358949 561009 855460 399205
14779 674857 793087 541167 597584 649843 619144 586333 703217 431551 918150 366556
14768 951114 492672 625516 459597 526272 446330 284522 483489 652141 1180905 547280
14757 694612 479574 777138 853616 748873 565561 664711 988041 611595 670508 525810
14747 525810 719014 741972 935717 862179 830221 728491 776957 925561 661546 715000
14737 715000 797619 771424 1057867 820923 669725 714022 1044537 839136 763111 696933
14727 696933 573807 660249 526023 1101265 1117616 778069 909675 589359 948246 1020626
14717 1020626 1073711 1154051 959491 958553 937714 800774 860592 1038273 732494 968697 934153
14706 934153 1001082 790436 603781 1188012 882815 1184000 871420 614027 832207 1211003
14696 1211003 897873 1039826 646862 768075 959801 862532 900836 1368062 980685 1004183
14686 1004183 781462 853711 1441956 1193019 1067198 1023874 1222800 1161154 882606 1368982
14676 1368982 1250613 1319957 838327 1140224 1237636 1264226 1324408 1032610 1059046 1272702
14666 1272702 871151 987885 1221943 1207305 1332461 1017854 1242122 1543356 1366109 1111951
14656 1111951 1078330 1518745 1391398 1403399 1238587 1450859 1142168 1504613 1106557 1097126
14646 1097126 1241890 1193167 1227810 1366188 1144096 1141075 1680274 1472422 1425416 1630709
14636 1630709 1249135 1612200 1389211 1239822 1494049 1339654 1582185 1671671 1451793 1783761
14626 1783761 1897026 1246636 1232818 1724065 1366239 1617978 1447785 1372899 1592472 1530909
14616 1530909 1448298 1766376 1476880 1476780 1750431 1589049 1637749 1438432 1428200 1628362
14606 1628362 1510997 1835965 1745430 1649488 1810532 1614432 1882106 1806515 1781860 2070420
14596 2070420 1817041 1890429 2090497 2005046 1812418 1752015 1923577 2142112 2034420 1897151
14586 1897151 2019084 2021103 2318708 2139570 2268100 2252620 2226067 2418486 2457797 2638488
14576 2638488 2193846 2253713 2485587 2365508 2211360 2677513 2437850 2420103 2622575 2579552
14566 2579552 2877200 2899535 2391758 2917553 2854750 2890040 3037147 3218543 3472561 3515274
14556 3515274 3488740 3708761 4160171 4307575 4954336 5846488 7115849 10074886 15648665
14547 15648665 23608409 32570843 37269283 23285351 12035890 9122551 6647240 3533505
14539 3533505 2510613 2452173 2675714 2406935 2316612 2476567 2179582 2643970 2304065 2153932
14529 2153932 2542375 2159674 2537627 2690672 2666221 2465219 2988289 2801148 2869121 2781303
14519 2781303 2897271 2593039 2710755 3077659 2870380 2649026 3060964 3264866 3130485
14510 3130485 3089465 3209358 3260372 3433952 3260005 3357634 3171852 3399786 3278368 3286317
14500 3286317 3465230 3652866 3257637 3370334 3554186 3911358 3596927 3745892 3831638 3679124
14490 3679124 3902428 3979175 4116499 3976868 3952187 3962835 4205431 4148202 4118378 4131352
14480 4131352 4140252 4294459 4090020 4405015 4444510 4615577 4876872 4603898 4523783 4749344
14470 4749344 4931763 5080130 4842137 5078718 5109481 4938677 5332124 5151785 5396815 5259893
14460 5259893 5251496 5305504 5300106 5522277 5683572 5616609 6085006 5924161 5980433 5970350 6068157
14449 6068157 5941092 5892395 6265457 6267701 6309946 6550340 6261475 6340340 6530383 6711118
14439 6711118 6847142 7144979 7123018 7094012 7027323 7291457 7311528 7496744 7786031 7649465
14429 7649465 8002426 8224125 7820400 7935040 8460757 8201497 8741047 8496067 8470913 8705183
14419 8705183 9126875 8728124 9310924 9418922 9534838 9783731 9592270 9955975 9754078
14410 9754078 10367837 10552842 10508427 10375252 10939555 10983437 11269488 11377161 11622639 11743369
14400 11743369 11773705 11648170 12492221 12125695 12537239 12515554 13048250 13387886 13372782 13542165
14390 13542165 13619054 14404124 14538062 14695111 15076380 15061205 15319025 16046341 16099159 16186455
14380 16186455 16635554 17042493 17131487 17772711 17920485 18046400 18530523 19099145 19432245
14371 19432245 19969044 20150767 20203988 20539935 21836300 22228585 22340593 22940835 23188972
14362 23188972 23742808 24223870 25026220 25727571 26022618 26828659 27381043 27853424 28517397
14353 28517397 29154322 29782019 30692477 31809132 32238442 33128819 34137247 34919558 35357763
14344 35357763 36706261 37696396 38622941 39225403 40636987 41770525 42809170 43793468 45394170
14335 45394170 46654825 48217126 49966050 51272777 52543684 54294251 55856786 57722242
14327 57722242 59380017 61388543 63490764 65524843 67729206 70088433 72320553 75004226
14319 75004226 77990335 80718434 83859578 86596853 89977838 93257594 97145052 100885867
14311 100885867 105014111 109044102 113716676 118568998 123498788 128854586 134304044 140232871
14303 140232871 146617489 153230222 160195218 167754329 175096326 183594378 192040696 201244195
14295 201244195 211309401 221207609 231391850 242943752 254473455 266561942 279216031
14288 279216031 292515617 305954004 319813949 334039636 348762924 363084072 377490157
14281 377490157 391826785 405613535 418902330 431528327 442931648 452914745 461365451
14274 461365451 467048466 468845091 465150731 461175499 461222723 460586555 457870170 452141264
14266 452141264 443770248 432993447 421174128 407990666 393769441 378598468 363746234
14259 363746234 348205553 332935684 317805684 302694390 288490673 274535602 261787915
14252 261787915 250066949 238006656 226393799 215015048 204815202 195144090 185553315
14245 185553315 177072456 168861351 161069779 153739687 146814268 140334677 134392853 128608929
14237 128608929 123099945 117787718 112896565 108187123 103912257 99850816 96318545 92485614
14229 92485614 88787463 85257767 82183372 78861637 76555331 73537379 71155959 68663506
14221 68663506 65786420 63981346 62012165 60005401 57701683 56240020 54426312 53058032
14213 53058032 51366253 49729537 48303617 46377907 45301726 44573244 43325287 42374999
14205 42374999 41121788 39806778 38510328 37394360 36651074 35978855 34975813 33938244
14197 33938244 32909335 32348729 31356630 30755074 30144967 29093000 28393905 27449049 26974240
14188 26974240 26468898 25952956 25030621 25010528 24115819 23439585 23163847 22664087 22414801
14179 22414801 21797087 21474152 20822129 20599965 20161853 19474169 18870872 18612143 18584490
14170 18584490 18162430 17923512 17554555 17038616 16979065 16571817 16436974 15995926 15854255
14161 15854255 15480662 15130085 14874849 14526334 14073647 14122670 13843112 13873327 13439800 13500270
14151 13500270 13049132 12682320 12859621 12567147 12293387 12067278 11845654 11758581 11527452
14142 11527452 11378267 11196780 11349891 10674922 10509003 10327359 10366747 9914831 9965459 9890133
14132 9890133 9550220 9659892 9727033 9129520 9188437 9120818 8752105 8896080 8854205 8364099
14122 8364099 8435194 8481339 8321035 8082817 7836750 8375649 7741822 7770104 7779467 7606904
14112 7606904 7366050 7448757 6917484 7363370 7047222 6976180 7000359 6999328 6450855 6449962 6755640
14101 6755640 6676323 6444736 6186574 6483065 6148242 6348327 5800492 5805073 5738772 5784731
14091 5784731 5659391 5756385 5469341 5724751 5942446 5639179 5396900 5502465 5445445 5357712
14081 5357712 5455469 4847905 5460556 4758522 5106638 4995489 4935682 4868056 4846077 4774039
14071 4774039 4622177 4342326 4581439 4471266 4455711 4432720 4637476 3982460 4276126 4173803
14061 4173803 4203212 4253017 4226438 4050695 3804145 4200499 4162339 4181554 3795875 3992696
14051 3992696 3929414 3851634 3656211 3429160 3867434 3447807 3481183 3733157 3309691 3606956
14041 3606956 3445760 3055847 3589571 3187829 3511112 3205721 2895834 3240986 2653419
14032 2653419 3290429 3218690 3488488 3240855 3418625 3035613 3380715 3298950 3003035 3054909
14022 3054909 2908614 2861885 2948493 2871944 2661661 2660715 2680007 2710525 2948749 2707622 2860595
14011 2860595 2192543 2705762 2498966 2542732 2743807 2660222 2519501 2557597 2327598 2360248
14001 2360248 2055589 2367139 2269454 2305289 2152092 2303872 2411002 2315550 2864171 2851581
13991 2851581 2875161 4125546 5631883 10407007 17656028 27600871 36820182 26790896
13983 26790896 14777137 9004353 6407488 5301725 4418885 4061355 3911859 3615224
13975 3615224 3121515 2802509 3090679 2609604 2429867 2835117 2570298 2433663 2551870
13966 2551870 2588134 2992256 2362955 2067070 2536500 2460605 2220522 2158494 2295988 2396386
13956 2396386 2191759 2057533 2115394 2027020 1706359 1866265 2183022 2065698 2211772 2192699
13946 2192699 1889289 1896534 1945982 2170650 1824103 1775481 1999311 1966974 1877413 1850432 2234414
13935 2234414 1819208 1791861 1633387 1569946 2025232 1870591 1827789 1649318 1579224 1845748
13925 1845748 1690668 1471655 1459140 1432619 1438744 1349749 1718304 1943601 1714301 1673506
13915 1673506 1636036 2020354 1442216 1737059 1284957 1370996 1442556 1338807 1400353 1477997
13905 1477997 1347125 1372523 1003038 1767000 1554131 1436687 1425371 1506426 1362054 1490460
13895 1490460 1350515 1114092 1445327 1410122 1531916 1201356 1121507 1021637 1383796 1428133
13885 1428133 1331267 1605715 1258844 1370942 1459023 1136827 1355806 1135617 956747 1279456
13875 1279456 1234119 1221562 1045586 1269096 972420 1144306 1000804 783320 1170589 981925
13865 981925 819491 1448574 1153990 1320810 1280887 1171694 1366900 1025959 1056800 1034375
13855 1034375 770707 1052469 1040267 1241287 926828 1062654 1076770 814694 936533 1075443
13845 1075443 1371861 1297253 1159602 1053543 963015 857297 1375000 1143482 1045832 960178
13835 960178 1191547 1303321 1210651 696184 1177765 805825 1187024 902167 783727 789090
13825 789090 1078998 1078202 712903 809726 862146 1264239 963961 914235 1136063 1044743 898252
13814 898252 929629 842975 1010925 800157 961337 1095383 969705 694086 721856 880804
13804 880804 869765 1146276 984717 1134662 732438 685377 848995 606486 1028489 824769
13794 824769 1014652 700761 1072403 657419 520534 944619 1010689 1032708 685563 927131
13784 927131 776695 908969 815765 687103 741796 433393 795766 793067 977980 409737
13773 520327 669392 644010 558255 628993 455261 629016 861680 557354 731252 428064
13763 428064 660497 1033995 821627 508910 852210 725850 918064 111497 994876 715675
13753 715675 606285 491648 646402 773991 435915 597160 680659 710294 682307 704743
13743 704743 846269 788436 877041 623825 557011 549138 602382 525897 711519 517013 435530
13732 435530 429220 563073 363825 513093 458933 569857 681983 365506 416054 403757
13722 403757 520990 489033 193750 343644 830863 325046 574567 175246 566764 593688
13712 593688 537415 592433 683603 538836 563516 704847 800145 794605 629600 598916 386607
13701 386607 352350 336558 811520 846581 388883 431633 203460 340635 803689 525051
13691 525051 745415 316242 677159 698959 565857 591473 432329 444590 513228 302984
13681 302984 727929 54629 493891 826420 522974 630672 397591 469826 491226 476931
13671 476931 448014 565345 228212 333082 199189 594543 340741 479392 437640 535457
13661 535457 445668 225241 331047 279239 466531 130159 601516 230482 653625 466221
13651 466221 322095 446626 587570 562092 260182 397328 457813 761302 490502 415710
13641 415710 318481 154525 256741 639458 623643 185785 489641 326446 287372 492630
13631 492630 885901 372492 544677 562211 279791 403881 348506 573036 60206 680505
13621 680505 435124 295512 386449 478503 309713 576415 257768 241331 373656 441167
13611 441167 392039 -9525 530684 718493 278875 362693 639559 251578 135208 426448
13601 426448 250901 398891 599805 217395 469065 257872 488520 643250 88565 157200
13591 157200 570126 328975 414395 336476 32157 295868 339527 114060 -4508 446488 130485
13579 176940 516314 354575 571962 155726 527904 485608 277308 29862 303873 371570
13569 371570 5249 273432 422492 487789 283428 354617 351127 588578 344280 380668 119069
13557 385912 74961 230330 355903 608448 436091 215172 140586 297155 20739 145347
13547 145347 377012 224003 236859 699511 90977 715115 382901 519113 457595 283900
13537 283900 463936 541028 182695 276943 123571 224687 160169 452662 136859 181170
13527 181170 174965 342785 447689 253566 516775 386229 211833 161649 347614 -128779
13516 212829 286736 405385 506460 244315 447463 338816 290682 -83411 458455 217566
13505 432692 477022 130716 296038 115507 256656 548962 574025 182525 95894 173532
13495 173532 55198 105522 616199 -6329 298915 415391 104611 310524 419412 -150012
13484 454859 404880 485397 -37091 345786 93130 373334 157886 101418 401628 -32157 292618
13472 -118711 380558 427192 645317 438981 376383 281484 236795 370969 464991 378910 288641
13461 288641 220254 -1265 104403 569062 -19510 68192 283720 293543 671185 7237 187624
13450 187624 265347 174373 90401 102033 487473 280465 171945 163639 304808 278456 237861
13439 237861 460391 168779 386987 245772 512691 144182 109446 410360 -7592 261710
13428 -45425 307162 123551 149135 322806 485018 -20986 203834 -85719 330837 -56842
13417 369655 277327 337149 28743 346251 -12596 186084 -229829 174450 361828 -132554
13406 348852 662868 -84159 356137 26673 193534 103074 403719 343550 216015 114108
13396 114108 156764 274997 249391 434336 82125 184463 159986 202679 392580 138744
13385 80004 198889 232136 385624 -35486 3551 290215 162322 302682 -179679 383956
13374 -6720 176921 94513 400153 138802 182998 226313 195627 617512 420592 293730 169540
13363 169540 -83875 419078 121177 183687 69702 280747 208768 164786 137242 379810 247891
13352 247891 132080 305610 186943 197199 66215 204444 400122 443692 125500 110523
13342 110523 306887 20925 55595 323662 336915 242945 423443 -1130 84827 77406 -81209
13330 48590 36305 150020 408147 257517 -50475 278556 -48480 283905 466267 -165984
13319 21084 44048 246864 2780 424454 302229 280023 47383 148811 79404 43977 499706
13308 499706 -83162 57846 230767 399613 61059 -15089 42590 -38937 -200584 210849 215596
13297 215596 -378 500208 -45555 85785 290173 -35691 226876 19223 229949 219986 225765
13286 225765 79732 132729 52862 -19441 137325 -97493 202940 39534 -223317 284617 539814
13275 539814 -18303 11289 -198288 181565 -55346 197332 114035 -47845 252974 342116 -39993
13263 357972 32536 521620 106355 125945 173339 99340 99128 379738 -134835 89664 37698
13251 249598 134133 256928 96209 -106843 -163637 -60341 339456 267302 -127478 195579
13240 256415 132820 367287 40669 154066 67080 -64840 -16621 241063 62342 304275
13230 304275 180118 241924 267915 86384 -72964 174990 144675 302815 -13620 81307 267813
13219 267813 54515 260141 192441 177619 323401 -178130 -44983 235894 12731 100838 -168689
13207 -31135 41164 -124770 11457 -93967 419232 82294 227789 -134458 -136000 190860 413742
13196 413742 -122622 -7417 -92974 180789 377577 50788 258736 68619 15619 227888 239578
13185 239578 244685 2516 282591 -35490 360498 -85095 125884 -81173 182094 123105 272632
13174 272632 -155515 -256113 184486 231867 46720 -48763 345513 137385 -120238 -184841
13164 -184841 87274 -94081 195486 447384 -6386 -179120 272542 152273 308209 -162355
13153 -147595 -37775 70596 54601 276293 199727 -170811 -114792 181132 -19476 -140014 -29340
13141 62165 104773 297383 -145162 5163 118065 60982 162689 140045 129471 269740 184762
13130 184762 19560 439189 -78593 364778 218099 38770 -77810 30060 97233 91464 235191
13119 235191 453273 167154 -25268 125400 271846 -160215 259656 101676 -76530 139281
13108 393891 -75329 102673 -31932 26370 386660 -37680 202607 40926 -263371 74418 184169
13097 184169 -143776 270609 126630 22453 -154050 17100 20111 158635 -123537 -3302 -221536
13086 -221536 88719 3721 -203635 -172151 239853 258761 74123 145834 -211227 7557 215150
13075 215150 136523 91400 154813 200235 268160 24247 47116 -78520 81313 194385 280838
13064 280838 294149 -131217 237662 201698 239204 246723 63052 108593 -70002 321656 100234
13052 385891 -118806 -115031 199284 418425 148822 76628 109324 178587 74100 -90517 22647
13040 79514 366809 180809 -60200 166333 270979 -209295 305559 436866 379193 124190
13029 187279 97386 -44387 216179 209878 109434 -80320 226458 -42932 111797 103192 -217593
13017 281920 -147356 25240 31721 -421724 168453 108612 -21391 91698 197894 28572 200214
13006 200214 174279 -10381 79430 -206724 113000 120109 -45056 77254 25546 59993 60520 330
12993 242462 -83456 -56955 215568 452662 -118369 155355 78122 210593 -80599 342484
12982 -248182 414610 19460 28094 130515 -254598 -72441 27582 -100193 148576 27660 -239689
12970 -308568 88980 166030 81721 197389 -150524 88710 231993 446264 -359532 49490
12959 125961 78145 87388 11073 23599 91066 151056 -239626 260389 50828 242765 99231
12947 9154 402127 82941 183452 -143069 -162039 -114673 77161 201478 179710 -48523 -197206
12936 -197206 -27137 149395 -314101 344768 370344 -92264 611 -119222 -50320 -137927 -56347
12924 178099 37541 152939 234444 173411 17184 -213684 -15344 54778 721453 189806 93275
12912 -90647 185675 192151 66069 18066 206149 39022 -281364 -216316 162254 -8167 79089
12900 243940 25109 193448 -21212 148732 -200901 272119 -259893 -263127 19968 -225853
12889 -129848 88876 -122161 338141 64550 -42714 424010 42294 189374 1756 -110832 8126
12877 83131 -117917 -44279 338706 142009 -185962 203443 145388 191666 -196584 169311
12866 155190 -348416 -367168 290542 -40350 68166 81456 137276 118014 53923 -104736 -118999
12855 -118999 155461 -55359 -107224 124704 -44864 -276472 151450 -75777 71271 95855 -173345
12843 235330 36304 -233019 -201133 202075 -86498 -27604 -23107 -180502 423945 -15449 -206751
12832 -206751 67165 -121574 -53136 -11018 -378249 183358 199254 322243 266625 278735 -53538
12820 110477 -291734 -81497 -114543 105808 -64792 34654 172742 -193363 -38778 -19409 211837
12808 89470 -39926 -201103 128502 -291130 -75090 299213 -101549 -48384 -5719 93631 -144100
12796 238812 -55921 273494 -42122 -65571 228315 -111314 -63381 -271362 82221 -176975
12785 249194 -33872 -66343 -2975 -10563 -183532 -6977 203671 141088 154763 49181 -280133
12773 106127 -219851 151184 15492 119155 -19660 -119961 -78964 -32192 -33755 291346 -91107
12761 3457 -25799 288320 107767 -43849 -347689 30913 -50206 -56187 265961 173219 221444
12750 221444 123048 236313 -98305 211137 -30416 -153017 110524 -465757 -59506 -105107
12740 -105107 -55778 -372622 -162311 283887 204202 133315 -185842 77631 11222 96009 74403
12729 74403 -359961 163136 3809 286728 -320800 -36160 54168 -121613 218501 -220257
12718 406994 402423 118959 41582 218521 76500 129454 -67452 81760 -130694 -169385 5355
12706 345994 18779 375400 370128 215825 139653 112565 -19016 297458 -117246 75956 56522
12695 56522 87370 56579 109169 -86837 344155 182198 -405655 35631 18325 -152024 -49609
12683 81616 123725 -44499 191181 203565 231741 174667 -91745 -456 183842 392904 22998
12671 -133480 26573 -96264 163492 -85507 44898 -19009 -143516 228570 72106 96033 -76359
12659 132216 272760 355960 140739 355269 362808 -229150 37293 -133525 222007 83676
12648 328639 294582 40753 109902 -18494 -302108 -59356 146190 -100679 -1364 -162787 84036
12636 -283028 109523 -245706 136756 -109093 -111574 131244 134134 -69988 345529 151221
12625 249254 143215 -18011 206582 -111958 103651 40957 -210950 56537 15441 182190
12615 182190 84972 300881 52592 5717 -178964 -20737 164150 51249 -122070 227729 -181922
12603 -312266 34116 -171472 260394 -7750 204119 137829 227112 -116723 268873 -12780 -249649
12592 -249649 -206894 210408 -103030 -104212 124884 -66969 -175956 150661 90998 -113921
12581 16813 -169933 -47318 -115082 109164 4203 -13844 -288896 34058 245366 -136737 -22531
12569 109733 -436814 -99510 -129127 -63592 59444 -34895 88718 203580 161074 -56238 250646
12557 191378 167150 -67045 -75737 101076 -179534 -65208 -286681 295455 257797 145933 62898
12545 57869 105287 23647 -132038 138109 -107533 269688 -24378 -166644 194808 -221763
12534 332964 -376944 -189181 -143434 43761 -163743 93347 -19115 95813 -107914 54919 113445
12523 113445 -162697 162681 -235964 230908 207939 -99839 -174567 -12448 -89191 55607 87438
12512 87438 -53763 389 177781 -93036 -162864 80955 108011 -132 293845 60732 -121384 291184
12499 8921 -20695 -144462 -261861 82595 39142 268311 -322308 92321 46676 -11690 437213
12487 117385 -158591 100502 -27778 -265100 -7911 136253 33795 -518251 158690 -45340
12476 125124 272991 334952 166377 -103183 -63822 -280275 302866 11589 196571 132719
12466 132719 -174502 -109087 138689 105251 194909 -215994 152343 230794 -61098 -20224 -2281
12454 5303 126965 -311446 165975 17034 -146075 134293 -36143 69479 -3268 -14342 -7311
12443 -7311 387591 -261642 -96280 -110556 -85649 198204 342526 60432 11363 -46071 -67866
12432 -67866 29083 108437 -90392 48238 23366 -129412 -179488 -145879 -231916 135219 24435
12420 -46059 14594 118169 -268874 -14794 2403 183904 58344 36754 -244032 94426 -205782
12408 -78464 -263018 -24794 -222321 -250289 -208852 343982 -184356 -231792 68895 -33348 -20246
12397 -20246 112714 -38488 129831 -172088 68177 -388472 -26592 169351 228257 16712 -306347
12385 -85390 16686 -297639 144058 362253 235193 27761 -218413 -123 -175742 -151713 87444
12373 41773 45979 48042 -134518 151177 -367155 180886 -119559 263771 -110396 193369
12362 -44942 -179026 -194927 -111798 -69729 -18920 165912 -211822 -346031 212684 -133473
12351 -229271 -216625 148014 -141406 27485 -25685 -184215 -98394 -37091 16162 -332853 98489
12339 -246728 -125432 -9363 -183702 -59809 -42142 246055 307603 209671 -453819 123936 25259
12327 -93028 127675 -107425 126798 -9079 88175 98456 -23047 -170760 35606 307871 -80087
12315 157415 -248920 145193 -195365 11582 13133 -211708 -119807 109553 -168962 73303
12304 -61025 377270 183494 66174 213110 -100362 32065 53294 -375841 -54154 290661
12293 -10609 -130389 -80259 -106735 -35389 -172448 18057 -6421 -77475 155274 67896 4902
12281 47683 166396 -859 -275015 -334695 54580 41787 117242 -286901 251684 247099 308653
12270 308653 59496 -175251 38722 -7463 -35403 237355 -201800 251694 64564 -342470 75823
12258 -26668 -46898 26765 -197776 195130 230975 333668 17249 41019 -136200 33487 202778
12247 202778 42863 187889 -209262 27109 -64928 271555 -6019 -25558 -96378 73552 76594
12236 76594 -252442 13607 258753 182773 -39589 -12204 -223712 308460 130457 115612 352752
12225 352752 463858 -253601 67367 304232 220381 85416 108457 -90494 239972 -47454 -115863
12214 -115863 -132369 120124 95094 141742 66962 95731 162850 246421 80115 139716 -100131
12202 552472 180114 332874 194837 89619 242427 222725 98930 1560 -93420 -56831 98988
12190 131598 343050 76078 -300808 199950 -32438 -150418 -133387 275007 183793 139177
12180 139177 -121856 -98553 147342 495480 -139473 247893 -130421 387164 202173 196099
12170 196099 237877 57011 267496 316740 -154533 403437 97924 191818 328347 159985
12159 501266 20912 -78770 151761 98237 -184305 85172 -1312 -190951 210214 -8385 318067
12147 67085 -119908 -146768 92928 -96121 7484 170260 244819 98286 11295 115766 -59968
12135 -288073 129858 -195219 -44431 66503 351351 -67278 165321 -157113 82384 -237387
12124 -179042 119463 -89454 50132 298716 -140713 56004 159275 480597 -8018 68992 -177231
12112 182661 -382776 -183175 -213868 218112 -38872 186777 20201 -43682 -168932 215152
12101 -135629 -243142 95188 381260 182315 -87320 -76391 3072 -27007 315931 43707 391289
12090 391289 168430 -175630 21177 -108842 253928 127528 -7066 -51770 -19629 70407 15931
12078 -195417 -69067 43287 -184466 -80889 -194615 105759 -94872 56595 -87697 41461 -220079
12066 -105846 194188 -74403 -89408 159145 13636 -70231 -39369 -137082 266305 -78812 209054
12054 -65708 42968 198771 400741 330942 14490 -276789 -146594 146663 -246154 292828
12043 342276 29383 -133577 150557 -125115 4627 -16704 10632 797764 634314 115579
12032 -127457 210584 157378 -139337 115498 -218526 -3651 235797 -164167 -108237 -110639 -69995
12021 -69995 11468 1963 -791 50840 94469 -183102 184550 -160318 106061 125451 86874
12010 86874 18564 -297235 -30691 -72979 212299 -289154 -222413 4380 99969 -129657 171850
11998 160144 -71988 -46940 -44640 88830 -114535 -148582 -150756 3775 -499829 255304 -247450
11986 93487 159865 56987 30732 -419768 2478 -187764 -164065 -249300 -110785 -149344 -64504
11974 56885 189680 19575 46289 24584 11361 85454 -9874 262026 147778 60679 -28492
11962 -198468 -289657 22024 21628 -204721 198903 23783 53890 -241800 -231835 -318663 -61843
11950 386280 -314387 81179 -398789 -92111 164293 322086 -146345 372917 -273031 125616
11939 -426926 84187 88032 89171 103352 -185452 -59723 141803 58679 -306317 108062 256033
11928 256033 41770 414324 -105151 50107 -130323 -141138 -27457 105973 -78113 -50580 -135502
11917 -135502 -154135 -233082 198072 39286 -322196 304384 -135592 131135 -7739 -303634
11907 -303634 -194574 -20467 -44908 -123514 -47557 -171152 -8642 -99590 -332792 -99869 -314213
11896 -314213 423321 -352524 -145366 -88491 55227 19010 88088 176283 -339003 62466 199614
11885 199614 50015 -345097 -196261 132228 -119134 -151698 -32565 -179743 88573 225837
11875 225837 82062 -38173 -75704 -238854 180684 -114540 229673 324364 -98705 32420 79544
11864 79544 14385 187210 -173616 -19627 -151247 25115 -137243 -100526 -115975 2446 -138083
11852 114670 172778 132117 -24994 115077 -91597 203143 -156591 -343573 166581 4937 -146906
11840 -47301 37557 186596 71182 -506498 22654 19797 -307107 271290 175888 -64104 38561
11828 95674 -135225 -239793 -582 -266054 -156873 -207891 47590 3627 139531 23140 -133249
11816 -258205 -36284 -48486 204027 -181163 168456 329425 -121859 -89599 -36545 148177
11805 -91265 -46731 180780 -52382 -31688 -232019 98674 -372738 43859 34703 -265808 170608
11793 97945 4292 -366405 -120060 -327681 451181 75123 68105 177068 36255 68588 197296
11782 197296 95427 310304 -80177 -198154 214822 -31464 44605 -50076 -163501 -79863 -233169
11771 -233169 14591 137858 16446 153331 149175 -95959 -4642 -223220 309482 -142566 -32895
11759 -14517 353827 -277976 -278997 -395781 106735 -123511 -193546 -151591 -74955 161490 119875
11748 119875 -167720 150756 -228828 287498 187443 -249089 -94222 -186962 -69568 -3233
11737 24621 312391 19781 -381675 212510 3672 -56358 -155462 -229268 -19515 73832 -202899
11725 100101 60070 -112906 130787 -35666 13804 -422931 -73979 149801 -106414 -39538
11714 -27024 100050 95172 62909 -95805 -85655 -97693 129336 -196455 49008 146730 -39073
11702 -1338 -110352 105565 -148654 55823 -233360 -91177 -84639 -167457 418081 -94654 -82739
11691 -82739 81381 -8024 37051 -125454 -133080 459363 6075 16752 51955 -144942 -146237 73406
11678 -49777 -23663 249269 -37907 124841 46073 -74280 18613 211667 -4294 -110625 -69358
11667 -69358 -78404 75462 -57743 89794 -421054 271132 -162584 -292563 -28768 -146271 110791
11655 -119114 -24236 -60560 -289671 32072 -161179 -86342 -308339 -209529 -80542 35255 10081
11643 167527 -242613 -123911 98887 328477 74552 -137529 -53845 6682 -47074 -91602 -208171
11632 -208171 100854 59854 96894 -18163 -61090 327739 103687 271629 -84125 96893 -102927
11620 -78122 119395 378693 -284546 47323 -48450 -207393 75129 -84876 371868 6686 -95473
11608 214430 -221138 154188 98394 156158 22920 65635 127602 289041 114715 -59250 211587
11596 97537 175801 129967 -102311 -60486 210655 6361 -37091 -185185 -52465 143172 -9279
11584 58255 279660 251592 -2401 258098 271639 103829 -111758 152255 85878 130781 9400
11572 131547 -224222 74829 -32238 -314636 -213861 18827 -334956 -88038 -19905 -52010 17872
11560 -282364 118520 81393 82278 27623 68913 384147 -2387 -241582 -26342 203794 257760
11549 257760 278577 117642 120707 45499 130917 75157 8606 27810 -514252 -314338 -169083
11538 -169083 -31053 -80558 120210 -232702 -21932 -3890 393392 -60166 132751 199914 -8989
11526 -32409 -40345 178921 39754 61455 -66242 305635 -37596 144188 -95206 -22177 58633
11514 -97712 -30943 38875 -104110 75103 -209949 119313 -166993 92889 -186350 94757 95770
11503 95770 -185633 246936 -276981 -62181 -21094 319685 -89271 -34799 134336 158485 85116
11492 85116 133667 316030 167033 1911 224447 5195 -311291 -39003 144952 230702 267790
11481 267790 259265 35544 4342 217255 -156939 92499 -17825 -41547 322805 36028 -419214
11469 38718 289104 207990 58458 183203 142454 261296 42707 26318 9417 201317 74922
11457 111618 -3784 176441 438676 -94241 -54295 21368 39762 289194 -43795 -98928 235176
11445 107073 57942 -95171 39026 -43124 91573 158381 145995 84832 131461 86209 -24811
11433 -897 -26290 210509 282633 24276 -67325 -81380 -234525 -102022 -310918 71803 65521
11422 65521 230566 305853 -253682 66062 -7657 8362 15421 1528 90817 -206619 201972 -127030
11409 -33666 14850 -229339 -240448 -74758 29035 188808 7526 384302 45554 -184303 199647
11397 75568 140137 216653 -80432 -264472 -68579 -111744 22207 -372951 136370 -186480 50870
11385 159328 -213892 121397 -149958 93801 178914 -98687 -78352 -176881 127142 170372 118046
11374 118046 267800 374530 -160072 279523 -100973 -67593 177094 231338 -35004 -56932
11364 -56932 51235 -107409 -255930 301274 179325 46827 -115563 -56440 8074 -10895 -148532
11353 -148532 170786 -409982 187064 100424 -75505 -29936 961 67786 -140484 -39027 -4087
11341 -575 -269379 -135920 23613 137520 38003 56411 -62222 -197419 -274778 -39304 -6703
11329 113212 -48700 193391 81069 120617 50996 98269 -217425 366066 -138825 -193185 -77663
11317 15766 37751 127624 196739 96532 53627 46064 -203444 148819 36005 -82322 -127010
11306 -127010 39424 -23616 -188827 -166033 38006 69507 -382650 269567 -164154 181383
11295 116048 246727 127817 -291146 -311127 -134471 -153431 30296 -422482 -10436 -12396 20774
11283 159652 43736 -409402 88672 -230930 -167925 -113279 -178062 -59429 101192 -70278 -291702
11272 -291702 104381 235283 115372 -7448 282065 20707 95281 -45467 -409136 55794 29057
11261 29057 43922 -25635 -202167 73814 18817 -4373 -3611 293715 104599 81130 -319638
11249 91252 -152806 2722 81116 89594 -415757 -20790 -154517 1579 -114929 6932 -219775
11237 36072 97415 115027 -181482 -161069 304224 -158173 -298365 227571 -100489 -308645
11227 -308645 -34298 -92317 -170709 97307 -305270 5294 82216 -94146 -343093 -211013 65985
11215 -62525 -49238 -409843 22501 -72291 -27723 103889 31635 -24628 16830 313398 7065
11203 -202447 -42568 176913 -248464 -88102 335396 91097 114031 -87818 -453 -4792 98020
11191 -125057 24892 -23845 -180204 -126301 28193 -154713 -208367 -343889 -53140 -362712 77129
11179 3880 -54390 -112832 -157877 87020 -381128 84637 -168565 -204967 -267251 307244 -280734
11167 -145598 167627 79790 57969 167432 -109864 17835 -89213 53035 -106707 -97091 -175222
11156 -175222 -90120 14080 10288 -193837 -416927 40288 -248389 -80759 -9889 125522 -189277
11144 -220734 -275241 -163179 -272304 -97887 -16544 -58512 -151998 24360 -245195 -53116 37519
11132 -40652 -63067 300931 -154291 32999 68414 149971 -188272 -369612 -51227 -35741 153658
11120 142124 116994 135849 145586 20735 -267650 -283214 168580 -28944 -3522 -193879 62955
11108 295499 92506 215768 336108 350633 70190 313310 31485 260902 280220 57300 82437
11097 82437 -100182 -80418 264504 -325544 44661 61121 -4959 -50894 133266 181877 -284459
11085 -40993 29393 273209 55833 29601 177126 -100624 141536 643566 -142000 106246
11074 158058 -162852 372010 62847 161424 107132 388910 -66003 366932 410397 102403
11063 272620 251292 381992 242914 219569 628009 275737 85058 511650 518298 293760
11053 293760 321330 581536 248878 604049 344823 546441 365624 528553 241171 553277
11043 553277 260965 560427 417306 413233 531450 541115 472147 839569 663165 717677 424373
11032 424373 307485 577963 621020 484519 375764 423236 328721 457113 943329 338797
11021 377007 694491 582180 580793 521202 323329 493882 220461 361212 516452 446105
11011 446105 277799 -3591 221220 481496 257203 453852 633177 7591 634583 544220
11001 544220 496931 208949 583587 354434 442746 271600 265484 545993 681159 579258
10991 579258 248481 751668 506544 900844 712530 641548 567505 814522 460674 598954
10981 598954 732233 1156567 809024 1304510 1160693 1438921 1535779 1871847 2110162 1866488
10971 1866488 2006767 2124568 1993789 1999074 1482479 1576497 1285971 1272499 1015054 1083765
10961 1083765 1032509 1355823 1420166 1294061 1408480 1272860 744136 760828 655249 393218
10951 393218 523726 541126 282336 231714 544415 54972 370733 409114 337612 93471 64303
10940 64303 -9081 122448 234387 305426 52650 -17270 -206613 323536 -143864 10863 335473
10929 335473 -177681 275821 206123 125286 -113798 61090 -91835 42438 367388 -125323
10918 -137350 -94412 -301261 -24515 -404060 201067 22105 284339 35702 12798 25328 -367943
10906 11745 -27628 -181761 80451 -97557 -154705 -155195 -91426 -44892 -137561 -137719 -350687 -43588
10893 26548 24023 -351757 -187992 -127294 143947 1063 -27530 356535 -174750 -155094 66863
10881 244167 -52405 239512 183770 -117325 -100837 136000 303470 213271 -240554 -30244
10870 74750 60910 184491 106366 23020 -67156 -16859 -96756 -124245 207294 -207931 193083
10858 55489 114022 -48211 2744 30885 -92072 264081 -137689 -162984 -61796 135030 422025
10847 422025 -37157 173313 263706 -178535 7429 -51184 -287785 -77861 -83275 50444 105676
10836 105676 -125893 -485863 -138658 88143 -306244 -37205 23318 18445 -253490 172619
10825 94232 203920 -304226 -159558 263515 567426 -93368 -543324 -282096 123812 -254515
10814 144312 305262 67607 -137020 -215426 216303 -271240 120026 -247193 -148499 -56900
10803 3983 -448061 60337 -143874 122693 -318078 -50033 -142378 72194 113106 -162523 -279968
10792 -279968 -124676 -79029 -115836 41435 -6229 -134491 -90136 -178632 54988 -205910 188581
10780 136670 75364 -68914 -171079 -53821 52551 -127266 -178718 -25653 342137 272124 -242768
10768 -65813 -323782 -100549 8104 -5983 177273 -32285 315736 136081 -156901 -355439 -76018
10756 -22329 -276511 -347620 33459 200666 -105217 -392660 -143419 -148748 49673 -7896 -179260
10745 -179260 307883 133934 -178828 -300994 93344 -130308 -106462 87468 196622 -306361
10734 -49403 -293329 126336 -140728 81450 -48446 -305486 -60077 221596 -201805 39544
10723 63155 -268293 -125472 -106188 -197741 -11231 -147583 105747 -50303 -105442 -143975 -111797
10712 -111797 -235969 9594 254568 -34606 -408661 -124822 270751 -62685 82208 -180801
10701 155921 -202604 -64853 -126718 -30653 54784 -13110 306523 16426 43353 101571 -90164
10689 -38391 -516880 108222 -298037 67865 -43696 -495839 195877 -49451 147866 289451
10679 289451 -14362 -162818 -259902 32440 -157045 -7821 -48627 214149 -7929 -125307 -60514
10667 198201 -34796 -284060 -128982 -36539 161001 -198301 -88060 -5396 34868 96524 -94449
10655 18440 167829 -286615 -62671 -190175 -159759 -13266 -32369 -43730 86915 123405 -26326
10643 2040 -94590 -95865 159676 111966 183132 55433 23104 113952 -62907 34220 -17358 -365498
10631 -365498 -105340 -380461 -147352 -122125 -292204 -436432 46548 -1657 15896 -16257 158642
10619 -110281 290738 -238771 -155209 342828 136802 60690 58342 -66052 -151218 155139 44669
10607 -59571 -98328 160 -347760 325709 -104124 -8887 -60075 -128291 -191435 202745 102205
10596 102205 -208209 -84925 -110289 68844 235995 -36793 -185534 44557 -140117 -335886
10586 -335886 -325841 -190659 -80962 325623 -306819 -289083 190450 -172806 -30881 94798
10575 -247382 87611 -103585 -138279 177685 167044 -18873 -16204 -82571 -88095 -173807 -32620
10563 -168589 -189927 -269071 -318118 117684 -129706 -301312 -173076 38846 -67932 496926
10552 133933 -209692 219142 -123637 698 -53941 98955 325571 421110 144611 -261282 -203665
10541 -203665 304954 -264430 -152363 -228489 -56817 -52857 -17077 -180225 -324069 1980 61276
10530 61276 33164 -41431 322207 97994 -212452 -55998 150515 -51030 -173732 -40367 411785
10518 -309476 -107105 -91129 93979 -40375 -319841 349511 140345 -296848 202602 209330
10508 209330 115897 53848 37461 -55867 -121401 157697 -35075 -43251 173232 -210295 -326551
10497 -326551 -47338 7022 -189593 -21761 18287 -244202 -159740 -252076 -34896 -112342 218782
10485 -57164 -84558 103883 -100180 -108208 -213642 -265185 107351 121612 -24209 -105206 170326
10473 50823 -92694 69813 -145081 -97942 137425 72252 309833 45721 -60087 65980 193483
10462 193483 6697 241409 -289151 -263608 37995 241644 -144318 -13869 -20527 297270 -50431
10450 200467 -181144 198922 -294825 -136007 121703 -173151 140282 61644 -99211 -104617
10440 -104617 -78359 61565 111466 -220575 -415549 -113206 -172043 -61837 -88297 41866 295436
10429 295436 98094 -221078 -254446 31500 -28795 -44889 -46706 -302667 413063 121883 -191412
10417 -377069 140599 -115046 -193173 158587 244134 -35807 21617 -236687 -187421 -86109 215708
10405 27574 -187717 22408 -84860 36879 12591 6060 381061 -150909 96989 -14501 63187
10393 144015 97364 -117207 11119 264991 15611 -283604 140169 117367 127849 59656 -31999
10381 168014 429995 202225 -8140 167339 494059 2581 319557 195106 274787 326649 -122811
10369 -54915 77701 51511 314003 372914 413129 370411 -8275 122820 275613 117676 80370
10358 80370 252884 360600 -179345 63043 218252 290808 99854 124893 545024 345888
10348 345888 342514 393099 -106217 311702 192486 145169 412303 343704 205488 182365 -85156
10336 346077 -9462 -29750 233583 -20493 -257617 98635 42675 -321400 -127849 -73083 155163
10324 100724 102269 98025 93771 132577 42806 43390 31679 6852 53362 149086 -77636 -185113
10312 -185113 -203298 -225306 190901 -334481 -156753 67882 -116148 -194804 144975 388079
10302 388079 -12167 -94231 30677 192587 490995 -138040 -277354 163979 -40680 -66591
10292 -66591 107109 183957 95716 84366 -142093 -311984 311486 -33092 167358 163326 -313081
10280 266253 127984 -202130 178346 -17644 -154246 54416 -106571 92051 45529 -102635
10269 -458560 -384678 -142186 149370 58231 -364354 -171969 -75643 139049 165237 -97515
10258 -112904 407621 342554 182928 430150 256251 491432 89739 -131144 142607 -10902
10247 -57205 351467 132633 164684 157621 18378 -15856 21243 38211 5496 59556 -93660 -147355
10235 -147355 131649 134420 -23924 81118 -136075 -168423 123720 -185012 77261 -74835 78141
10223 51322 40218 -66149 36425 145807 -352049 63389 -57236 -68791 -229582 -137585 -350319
10212 -350319 -286024 92816 142051 -190419 -237272 -160960 -166684 306712 -147718 -274201 -170171
10201 -170171 -163941 171486 58365 -34219 147125 201734 63092 -54016 26808 -1460 137055
10189 -135547 -6333 66964 -205850 -166423 112374 -120445 -126801 151969 -194713 114929 -320633
10177 55447 -373994 11075 21999 -14979 -55799 63168 153904 86539 178192 -161103 -115805
10166 -115805 -38075 -79987 -323718 152695 -171741 12151 -88896 163165 -103687 -66655
10156 -66655 -88817 -199931 38022 58876 353633 -272860 -171802 52646 56917 -177158 -174530
10145 -174530 -138278 -16538 84339 -310492 216955 108099 90084 -126246 -71585 -6755 -65988
10134 -65988 10734 145200 -68275 227651 53175 162242 -158181 -92543 -346450 -184690
10124 -184690 -113839 55177 -7387 -72647 192051 -396506 127810 -5594 103624 30444 -50808
10112 -230192 -159211 -30633 -9178 259976 -99628 -151382 -132889 35506 409427 126184 121414
10101 121414 -189671 66997 113219 -145551 -140022 -180919 -308327 282796 -72290 -265247 -342320
10090 -342320 -67154 91380 75616 -29476 -41622 20868 -60481 -23822 -52321 -172665 -212886
10079 -212886 -207469 339290 -111800 -101092 234811 -218283 -183182 -24703 28890 -96295 -5461
10067 -85777 -262974 175439 214606 -44238 33172 85856 -97098 -188380 -12411 -212845 -12722
10055 -353702 2376 3282 243113 332583 83272 10073 -72961 -110194 -83685 4890 36374 43975
10043 43975 -154138 -44806 -286472 -246641 -158814 34384 -208310 82497 -227792 171703 -532380
10031 -208768 -165407 -276019 36384 -90218 -2628 -394411 122233 -232086 -193373 -158608 29770
10019 -238682 -54433 -228112 -271983 -130674 -81133 183384 -74665 -143844 311925 -359492
10008 -90347 79461 -378062 145691 -558145 -253849 -18368 -159167 -137330 68345 11480 153522
9997 153522 -162260 -89111 -170075 -183612 -4116 -263563 -326139 -171043 120030 46478 -262229
9985 72155 -181060 -166950 -276785 304730 94515 205295 155032 -334999 15753 -7879 10962
9973 -302107 -374653 -298827 -81765 -226506 -120604 -285161 -151088 283422 -17766 -189452
9963 -189452 -7978 -128010 -18852 -83832 -385743 -32038 -39246 -130224 -250368 -110108 161250
9951 -46746 115946 -8903 -108385 85304 105196 -291438 61358 -164944 147313 -114181 -163563
9940 -163563 -23076 -3295 -191319 -215790 -184673 234082 -270069 718 -30516 -396871 -225764
9929 -225764 -161673 -64614 27115 225854 58816 -285340 39550 43783 -11484 23842 -133365
9917 -73575 -413593 4526 -472228 38818 124950 166871 -196797 -136533 -9026 -288387 -240852
9906 -240852 302945 -117687 23634 -202371 -224627 -8978 145829 -81967 -53806 51552 -23384
9894 -169148 -31964 266243 90414 126479 -23631 -479986 76851 -105170 362785 -285312 -51555
9882 38689 -221126 -47206 -134440 -155035 28791 24487 -84612 -85792 -91575 61588 -136039 69132
9869 -146080 -139516 220280 -6539 403528 3202 -179415 59091 -216402 -203821 -43283 -238350
9858 -238350 82013 -37497 -270319 -223887 -95795 83931 -97931 -196359 3287 -47348 -312765
9847 -312765 176045 -127908 -11160 135248 116905 -146444 -177326 261105 -52029 -68639 88446
9835 -244307 -24223 -611622 6743 5733 -117906 -145614 -172724 -48884 -18850 136090 359283
9824 359283 -14543 -195017 136432 -86201 -448644 143414 -71677 -360265 -125862 22340
9813 395326 95513 -122367 -22858 128448 -212090 -307905 -131625 -224408 -18080 -161973 165683
9801 -131558 -200962 -32544 205559 -288084 -159513 -56926 -216547 -60827 95670 25902 44255
9790 44255 -174873 -468528 -231212 35524 16286 -94485 -111338 -256139 377 171246 -56316
9778 -338279 -52600 -464257 211516 95530 83854 170142 -56151 -309911 105977 -154657 -210823
9767 -210823 128100 -182293 288699 134597 -238566 -147336 -145900 -10475 -150105 236721
9756 -93196 54511 364091 135062 189612 230999 -81101 -34853 -61198 111681 156445 108247
9745 108247 270917 -119212 6031 -19221 -60976 -134002 112493 -134230 -215456 -81800 29009
9733 37119 70660 258732 -238802 -209076 -30171 -48171 148555 -193794 -252709 -83137 -315706
9722 -315706 64897 -33841 -88896 42432 -100384 337382 -56797 265373 225193 -195141 43565
9710 -155915 -73941 -82910 -336264 -85766 -129748 -438512 -220791 -292408 271939 73410 -135736
9698 -199192 145942 5108 -111169 182625 269913 -41204 -282097 -216702 -253419 249162 148164
9687 148164 -524237 -505260 59997 -409995 55761 3521 -33609 17861 -182874 -14694 -248866
9676 -248866 -160561 416281 129774 295434 -444345 -116205 -149220 208577 -76975 -238174
9666 -238174 -14292 -327665 -98182 10906 17747 -111019 75353 -178399 220755 185151 7019
9654 -11806 -261602 -113289 -236291 57163 -71367 -129014 -261347 38240 -136395 -375776 -95492
9642 -207029 -24842 70550 243448 -48009 -119668 -349280 -170934 -215434 16269 -215810 92913
9630 -105374 -218526 -65896 -113648 159106 174898 69300 -90630 -53713 242499 -224617 311338
9618 -129463 -175542 -32786 -73339 145097 -84475 -210292 67290 -111551 57365 12308 199417
9607 199417 79529 -76262 -42962 4077 -80754 109466 -43462 84178 302804 -95200 -423453
9596 -423453 64876 133819 -85153 -36765 -399235 -100991 -103061 194083 206063 -123578 -252449
9585 -252449 39932 27166 -10411 -261116 128377 -43041 185258 -14485 -291172 -201887 240109
9573 130362 203129 -364395 -133429 -25853 8356 121598 198488 -122577 -143758 -112953 -223886
9562 -223886 -153916 -226538 -34934 -129125 93760 145737 -190477 -164077 54948 107546 -166156
9550 -381587 -26020 -175693 -21627 -296946 -73626 -116010 89116 211037 103504 -74211 -284304
9539 -284304 -142649 -251176 -148056 -177409 -356224 -15202 -162446 -122201 -101354 -200899 -13232
9527 -155920 -33928 -129321 -50902 -107868 -4423 -217372 148759 -95771 173844 -236432 -19680
9515 -300920 15518 -188257 -120122 -279942 166747 -35611 27550 96254 122658 100894 79184
9504 79184 -23365 -121948 -324796 -334426 -65934 23452 -258796 51623 83430 -116726 -66475
9493 -66475 -135161 80917 -356962 95658 1720 31754 8245 155243 343277 -115403 -323644
9482 -323644 -180927 -42404 -165865 -83723 -201885 -372411 -271820 32375 -183034 64501
9471 -369786 -41266 91910 -102110 -5980 256740 -22380 70997 -179620 -86939 76482 52701
9460 52701 -14131 332412 -238396 -59910 -204340 58521 -46388 2045 97258 -323023 79 -293721
9447 16819 193022 197338 -78134 -44978 -233407 -271692 139625 -71282 -135347 -16776 -182415
9436 -182415 76760 -82799 19630 -147283 -213271 -36933 -34748 -351095 4836 356203 -4456 -316647
9424 -316647 55045 -114940 96509 128583 -180420 -113855 -138463 -110429 -70617 221678 4061
9412 -279803 118131 -354045 87324 -44110 -299707 66966 47967 137111 96575 123649 -57807
9400 274066 -129300 90767 -182724 -398900 -223621 -89884 -356465 93677 -189959 221121
9389 81927 -48968 -203016 -355396 21649 -251439 45618 175744 -81717 -203456 120205 -62817
9377 94161 -33089 6244 191371 -105048 -98524 -146770 65379 47700 61622 227820 -180003
9365 -86889 220355 257143 -62807 64504 141456 58023 -189431 -194238 140478 -61483 -263215
9354 -263215 296264 -291779 277180 -151897 -174117 139827 -173658 -10600 -117319 82623
9343 -244032 -6257 -300004 180398 -367649 -18065 -67138 6334 111819 69072 -274390 120896
9331 11247 279028 -264885 -356112 33433 43501 262471 -68710 -53403 -318484 -151984 305450
9319 -448004 -124325 -48436 -98007 -160226 -214885 11415 279431 -94935 5078 -109154 50539
9307 -187259 -430463 19077 76221 -33495 -84665 57254 -158663 162399 -130038 -41034 -228243
9296 -228243 229394 74329 -89668 21855 -231735 163613 -55987 34678 14044 179938 -25774
9284 315351 -299777 124914 81395 -39133 -54025 54732 21678 -143090 142119 -189661 202009
9272 -5 133626 267685 143356 55061 -154354 184043 -47417 109562 -38289 -170137 -122459
9261 -122459 102248 -17072 -29438 -15917 -472493 -161778 -139303 -81227 44679 55946 92484
9250 92484 -15843 1834 -232277 -153693 235179 106294 -431366 140739 -46715 -341027 -281363
9239 -281363 -69666 -230114 -98201 -74291 -253593 -79473 -41184 -10774 -82669 254772 -110094
9227 232012 -260205 59515 -168006 -168944 285528 -216640 100479 157348 -289469 30122 -203547
9215 -251327 6711 -147675 -279549 -82422 -2825 -127826 148359 -348574 -21172 -287316 -44161
9203 -295312 -28106 49996 26272 49568 -144799 -62204 -1281 -317312 215012 -53362 -308293
9192 -308293 -116857 -181764 90004 323599 228622 -291081 -350039 -24929 242635 48344 -450051
9180 -82096 -22071 -72354 222261 -304858 70910 -58470 -81262 -225996 -227079 -248282 121364
9168 259160 -68379 -18238 106522 -154856 -3088 -158094 -142320 30527 -72923 -142171 -42629
9156 37205 -22021 -61854 359824 -38289 -163521 -1764 -246260 110936 -29878 -263898 -10035
9144 -71280 6232 -10286 -103322 -118471 -221147 -282334 -337826 41327 -69059 69740 -18716 -126805
9132 -126805 8445 -28780 -181280 -72657 56080 -222884 -76268 -189879 96524 86643 259879
9121 259879 296158 -253888 -10255 -8102 150734 -120696 187658 113185 65493 -143131 107000
9109 -97507 -102703 -108733 -133338 -263588 -140075 89187 23141 -127638 -460876 -124936 43345
9097 -227337 -91926 -35450 75262 -2033 -112269 -110053 -47229 -27540 -5045 -73386 -190586 442957
9084 215449 -70981 250545 29807 -160578 -66495 60223 -161331 289954 -270544 21969 -268479
9072 11303 -25044 35775 146661 82924 -10950 -381581 -299125 40007 -284207 -122095 16478
9060 -150874 391317 89563 -229758 -249832 -28693 -125371 217981 205042 -50431 -150791 -2101
9048 162025 -92063 -195482 -49829 234821 517525 110513 -107853 91277 75910 -32593 121951
9036 65352 -294445 228336 53168 -86274 -178312 -78646 -84939 -74288 -238195 -92777 18417
9024 70349 -97111 -82227 -160968 -126047 -37915 37572 -248287 -269649 299788 9386 -130322
9012 61935 106828 70213 31265 135157 4172 -61724 -55474 106531 -161318 298877 118125
9000 254335 27992 -247044 -7843 -320471 -271636 62573 -65830 17304 -256559 -227417 -165003
8989 -165003 -107857 77251 220466 -299780 141197 261795 308762 23166 -111950 89559 556707
8978 556707 63649 -139938 -43773 -154682 168472 -94090 -197272 179212 -208353 -86795
8967 -88624 -261773 -8904 -39865 -68798 128339 16292 -96688 126381 -393908 27628 -201518
8955 -168597 193685 118071 150226 9129 -57914 -58737 -196337 -162124 158944 50814 183789
8944 183789 149267 28453 30920 -223311 -100638 -60291 -113757 105153 -84600 199219 246315
8933 246315 -66147 24756 -26516 38076 307648 1662 -150477 1601 526648 1831937 3129838
8922 3129838 6663642 8187837 2221614 688901 179452 54379 16428 183057 13594 17510
8912 17510 -152207 -223652 -50977 124749 308626 -232024 -33807 -340697 160729 159263 -316924
8900 258711 -179904 2884 -385104 95855 91683 128341 -96258 82508 214669 160581 169703 -248293
8887 -115828 114746 -49614 -21621 -106252 -120460 226604 119731 95305 -175526 -1065 -49903
8876 -49903 -33254 113526 -178587 116747 -19320 -65656 127419 -147581 79000 159573 82061
8865 82061 -58685 -84928 -108490 18652 -93747 31030 352725 -38995 -160426 -201188 -89763
8853 -315656 81208 188443 -244428 -106336 -202327 39134 -45298 -1235 -375343 -37289 -372902
8842 -372902 -125855 -154569 387836 125878 -183508 -570653 58174 26589 -12117 -153680
8832 -153680 -81464 -132067 376868 33327 -93641 134448 -148615 -89227 -268623 181029 -66858
8820 -61529 124705 110469 437637 -101402 95667 32850 -290118 -292453 -211824 -74732 -311628
8809 -311628 -181052 -221308 -139523 41985 -397919 -254757 90917 -156908 47298 147987 8351
8797 38595 -169488 -367519 131603 -4714 -330342 -60407 -80103 -201846 27848 -203061 -239402
8786 -239402 -236237 -273320 -102944 118063 -67920 -221791 9300 50272 -399622 -82427 78016
8774 -163030 128636 -406125 -145971 -181530 -63381 -364916 -134457 -140905 -277573 -135840
8763 -21047 -101367 10418 -6017 -167254 -159853 233550 87396 -59798 29629 1808 -258724 -81293
8750 -30457 -20087 -194693 11918 181182 13906 -184088 -85885 -389795 95786 -27126 -87115
8739 -87115 34154 -45647 251560 96176 -186500 -233489 -227315 287223 93091 195153 -253274
8727 3047 -133515 -2641 -1371 -5804 94425 -13504 73334 36304 297429 56279 198159 -257933
8714 -544797 -432187 -206641 -157714 -187165 -144736 -180845 52561 157028 -131224 -4954 -247913
8703 -247913 -60531 -49845 80106 -11224 -64553 -214397 -135214 5075 -254128 -368305 -362076
8692 -362076 -59125 20045 -157505 -44025 -235473 -112478 -297745 -62396 95910 -37549 -143117
8681 -143117 164225 86358 368283 -193700 30263 136519 -6176 -123234 -15953 -131880 -64640
8669 -41967 -178780 -46461 -17823 -155235 -76612 83977 43954 -86958 -89855 6285 -95611 45763
8656 -76201 -178718 -115435 9698 -87262 -92870 -98077 -3233 -120139 -114457 94180 66190 -185383
8643 -31970 -87050 190162 128753 -32160 -110075 -41613 -135407 41866 28418 -10165 -38707 -147330
8631 -147330 17238 162736 253437 -89092 196464 200330 -191726 -96117 218025 437258 -70879
8619 23962 -88803 191468 -48747 -111806 -259288 -77403 240390 -75040 -163160 152362 282795
8608 282795 335988 -44606 108906 -199152 -54042 -157730 -29262 -76569 91548 288477 133646
8596 -228081 234229 -68960 -262280 57403 -144707 94470 -273397 -306365 -64042 37848 86978
8585 86978 -332683 -201236 -283495 -266991 87261 75445 -35605 65721 37506 -51166 -113176
8574 -113176 -58183 96977 74899 -7134 107480 -113940 91911 210905 31838 -57418 -19647
8562 -530697 46890 -101924 -16420 64651 15289 79697 -173478 51047 12691 -9219 230657
8550 -36619 34583 -288751 -249138 -179385 -94377 -150792 -378243 -258479 80647 -2309 24256
8538 -44353 205572 -45434 94204 -256069 15465 265444 -63670 -153395 141 -584284 -183879
8526 -65269 -189624 237550 36954 -281327 -122260 -42877 282672 181035 -150538 12390
8515 -160916 -115466 -6689 184057 -229986 -115210 107264 351892 -34180 336883 -19018 32841
8503 -41881 -58460 158270 63926 -257379 -89175 -100413 309305 -68690 -148631 -293060 196169
8491 -39509 224362 206550 -319321 11938 -25768 -272109 52781 -118298 131464 202210 -156760
8479 -242788 136633 -394840 -355287 -162472 -119908 -202367 -212643 -94014 -155877 -222263 178211
8467 347453 -328817 180260 150027 -374352 -67466 -17935 -189465 -151642 171924 -25509 26124
8455 -48982 -161055 199613 11679 -52895 -179233 -6698 71781 -190979 -248106 4880 -110196
8443 30392 78441 58969 182373 73477 -138788 23167 226097 -17636 -60593 -457085 -138148
8431 -44923 -159416 188920 268424 54474 -41658 212476 -262983 77417 -188160 -143026 304549
8419 146017 -104373 58023 -123704 79909 289853 95107 -254154 37424 57688 -253801 27692
8407 -152317 -177153 -420827 -26093 -32299 -419 -92232 -140469 71033 177797 50675 -254085 122181
8394 -346215 -491635 -49168 187449 -219719 3140 -183353 -110569 -101748 23066 -60977 27391
8382 -58820 69732 -10661 11566 -100566 -31188 -138596 -22680 17886 -110388 69490 -44510
8370 -87470 -116280 396035 -204551 -155649 190959 -362473 -329056 56718 -280217 186486 51217
8358 -244234 -191023 27080 -178097 -17617 -297493 -146622 -46594 -49908 38464 -72101 -154397
8347 -154397 17193 170629 -180130 -22426 110252 84100 152817 275616 35573 125152 -132576
8335 220895 -177426 -209924 -41476 45449 31996 14139 21898 -224943 202222 206599 -91978
8323 -93055 -22087 -24815 118276 40332 -129183 -371753 331234 27551 253224 355996 56088
8311 -288635 -169191 -191266 -24890 -140418 -151438 -147048 -113649 -312280 -299709 -542 226476
8299 -131753 141334 -171294 -85514 -236806 -189040 -357276 -87221 46153 167812 91722 63368
8288 63368 -93671 -448950 24528 -390260 189016 171305 228993 124477 96001 -115589 -247007
8277 -247007 -5640 -60993 -250239 29474 69420 93457 -200838 -260177 94524 -110700 -125673
8266 -125673 -242523 -58432 176331 -163945 122990 202448 -134511 95021 155039 -109934
8255 35111 33553 -47351 143434 -236217 205239 -21224 -245926 90465 17269 177899 -169159
8243 -13361 18171 -290479 -87216 -36102 123196 -59879 -160979 19479 -57062 194581 -136423
8231 88913 -6874 -138517 -171298 153116 -3130 95773 -502920 -176995 -4284 189124 -212043
8219 -133429 58548 -239900 -31752 200029 -121577 -356723 129906 -169566 193929 133596
8209 133596 -99790 -197468 -228528 -156087 91655 -125641 46061 -292043 -23143 -83407 169352
8197 -114767 228594 -441699 47042 -143309 -332192 180154 -165343 47463 -130848 -159766
8187 -159766 45320 -83820 -356821 131501 -132970 -83524 -237540 244255 90316 -309177
8176 117004 103355 119060 -132824 52232 -34752 83812 -155052 -101919 -49130 251124 -80657
8164 -374516 77832 -169458 41252 -97510 -2508 52218 -235697 -118297 -122351 -18213 -251707
8153 -251707 -188647 -39591 41364 -44425 -236481 -172460 109165 130923 91150 -42379 -21320
8142 -21320 -24247 173493 4717 -46049 -556902 -158511 -154836 -190642 47633 -131492 -60472 256851
8129 72249 240172 189038 156272 13140 -52958 -208747 -112620 72664 -8699 107288 -97836
8117 -306431 175166 -70683 -23038 -66818 -253890 6607 -177295 1736 -34561 -436598 -69063
8105 -189566 -249862 74296 -236307 -7825 -269811 -286367 -111307 -111301 -32752 40725 -226002 -295621
8093 -295621 193167 338142 2320 -5975 113910 560685 -21318 -332326 -92161 -103396 -107795
8082 -107795 388671 -89019 72204 -204933 -151444 35949 34445 -15475 -87982 163420 228130
8071 228130 61371 12479 214236 -119152 337644 270311 250967 -183019 -50140 139710 30687
8059 -6198 186839 310281 211513 285949 240873 -205000 -111717 -154138 -68710 -238912 -179611
8048 -179611 -140528 -57192 -156429 -10622 -6467 -57561 -35899 -39656 -196779 -130686 194508 -372271
8035 -118298 -13075 -248274 -203834 1288 18678 30763 266260 -36017 -111210 -235289 -151835
8024 -151835 -313762 95370 27089 290849 -135267 -501493 -5439 -200327 209160 184055 164584
8013 164584 4188 -64588 -296569 -90602 -177049 144460 -186517 100258 4002 -10424 -211849
8002 -211849 -44516 -295393 -38756 53640 -166020 -21617 36542 -76959 212444 -6656 -35567
7991 -35567 -340828 -360646 -82018 -40323 -103274 29937 -262621 -18917 -36212 -133977 -55046
7979 -127382 -155083 -31885 80087 157442 -50448 -190364 -69499 303173 96093 -223497 -215774
7968 -215774 -7194 -80273 -45587 -85031 -77548 -41072 69046 -97712 42533 155810 -14009 -253930
7956 -253930 -109128 34017 279122 74476 -56775 110510 53622 104071 78777 175727 -212808
7944 171516 106592 56743 57499 209934 -138388 -76497 -241044 202151 3242 -163365 -189642
7933 -189642 55330 280262 -55764 114318 -197395 -257547 72437 90968 -269537 -112973 -157536
7922 -157536 -227882 -155125 -55765 -274028 -57050 -22265 210724 37985 72195 26702 271773
7911 271773 305044 -105817 -130670 259994 268000 -40918 -65714 -33413 -264522 -29739 325844
7899 -21398 -332016 -67154 -25860 117778 -321502 62245 -1681 -229908 -32988 -91169 -12891
7887 -201140 -129875 -269902 114582 74864 -89453 -40925 125714 -126513 101452 602675
7877 602675 -78571 42683 -175420 45751 -139307 14303 -47324 3185 65633 168656 -395169
7865 -33079 -131613 -244649 -159263 96881 -10695 43490 -44767 -201817 -106998 261768 -243164
7853 8672 24254 -104051 -287270 -199137 -335119 -70267 -40502 -116942 -514420 111870 -75504
7841 -137849 73267 -409754 180591 -323000 -34167 93722 -90420 130953 -56227 138147 -229761
7829 282284 74433 103062 -58191 -28005 -176955 -323151 -222306 -134928 -102979 47068 -173723
7817 -41022 -100152 109561 204011 -24732 -66339 -24961 -200737 -117798 -92868 43988 191506
7806 191506 54582 -155582 -214023 -59992 113750 292936 -108508 -336973 -149491 -74685
7795 -69647 4323 -209144 -153534 -312403 94254 -83893 98544 -405353 82531 -107614 -296031
7784 -296031 126553 61330 -194547 -163658 -40095 61588 -330803 34385 -131583 38275 -141095
7772 163623 330982 349914 -226450 69347 214601 138737 7464 -336922 -90577 -322850 -165389
7761 -165389 74779 238115 28383 -12677 -33744 -11188 315756 -337712 -133724 -12931 -61353
7750 -61353 -188784 132402 9291 -39342 -33810 -199354 56047 34242 -66489 141436 -185998
7738 -121548 -242941 -69422 93446 -34192 187114 -216054 -23444 -197889 -71585 -151779 -159422
7727 -159422 -55776 -78872 52790 172539 177619 -248655 53246 -110483 109341 21809 180848
7716 180848 -22309 -196727 222903 -138484 -80333 106488 -214635 -179649 -243102 175445
7705 -50234 31015 29379 -119171 402788 233191 -219870 81603 20391 189038 -49431 178605
7693 -130432 241353 -271736 -40570 -22664 -131141 -154487 376747 242277 144786 -83085 265794
7681 -222825 -185888 52509 -172353 222985 -34062 -182782 -113398 -366734 -99523 -146339 179436
7669 -189132 -11838 -197190 15734 -121117 -57785 67434 -134234 63317 90185 -176946 93647
7657 235471 79437 -258975 -392073 217653 -188889 -184672 349751 86036 5053 -362322 -99176
7645 -6913 242513 -128139 -119678 -99504 -301110 -410301 22360 -49623 -72428 -13461 -6509 -71992
7633 -71992 129381 -316553 -123405 184870 -499044 11451 -169802 79213 -162931 153186
7622 -232256 112344 38116 -19528 -140672 -92385 7634 -12966 -133686 -94803 26761 312776
7611 312776 -46049 -326019 126060 10474 -189953 45275 495415 -45990 -186095 -20943 -202071
7600 -202071 -42285 -28158 -53878 -150516 12335 159569 -308708 105546 -160518 -107067 87029
7588 261512 -277334 -80640 -270594 83275 -64280 -177314 157920 -23059 -239635 277726
7577 130840 112239 48087 78610 8627 -152622 133016 122226 -252091 -14481 157857 -102561
7565 -35891 -84039 -240407 130330 -290320 -73782 -9580 184742 -81750 36240 52204 -105491
7553 93202 160168 -128722 97689 -55803 -69311 -63389 -49541 -172555 155768 199667 144060
7542 144060 55218 144296 115817 317177 125357 -6928 -218598 -34840 -330204 -156379 152805
7530 105730 -161060 79089 -273908 -87712 -116724 191094 92593 -360302 -121360 -75430 -103861
7519 -103861 184581 65772 194536 96387 -11380 84570 -131507 -42899 -108568 -251335 -163232
7508 -163232 147828 162120 -7696 -54702 -405240 -174293 45661 -439668 -89896 -21821 -141037
7497 -141037 311942 -207148 -170348 -97611 135501 8542 -319286 -30526 -87116 260673 -104667
7485 77860 -323424 27896 -127688 -218202 127336 158350 252151 51976 -170624 -123602 79019
7473 276854 -61524 58037 -162410 221674 69118 138682 40836 -74360 -10440 -10532 170362 125454
7461 125454 -249989 261990 95009 136546 -257639 -32583 -206411 -273858 6756 -236575 284116
7449 -16211 -78034 -15741 -306663 24335 189801 -157949 452620 122774 -301217 -7663 158702
7437 -186173 -27270 -131800 231186 137341 123141 25430 -331428 -123495 95996 -103759 121587
7425 -117942 680 51991 -464904 -245524 135744 -71750 -122941 -221921 -235247 39479 35595 -245153
7412 -81988 173449 126167 11220 -106909 30654 -87296 425275 -27982 128899 -256395 -225822
7401 -225822 -62919 512 -10789 -58965 -89503 -208815 -247518 -145277 -413806 176841 -112365
7389 -300474 -340037 143378 47849 106257 -243104 230642 267530 -67436 133176 -52672 248059
7377 -26871 -280746 -9792 -201605 111964 140424 -70916 157143 57303 149235 295661 166187
7366 166187 136638 -171640 345138 -60777 150982 140099 40060 120858 -138801 -64465 43469
7354 113588 -265925 205899 -115692 -300923 -63999 -153687 -154439 -231550 201847 216787 366267
7343 366267 -123734 -174664 178470 353606 67985 149547 205335 -37938 374734 202363 43844
7331 -24724 -91963 -107450 294382 -3875 268730 -266296 -35853 175749 -47257 -303344 -125186
7319 -149045 24462 -51990 -286545 28812 178283 -107386 -32475 -68728 139938 -48873 269081
7307 -11156 -196221 107457 171923 141484 -393765 -23048 -49185 -283095 -183587 -230653 50252
7295 -97092 124241 -151743 51062 -81742 77150 -64967 -380208 -149176 -183576 52362 68769
7284 68769 18076 76699 -33353 -65511 -197029 314572 175572 57224 -193729 -220334 34491
7272 107213 146513 71334 275911 -236693 2188 351422 2698 -137990 -171477 -319317 -52320
7260 -7035 234959 -258765 105029 -103752 -13004 -84710 -208652 -224910 184688 21178 -127595
7248 132378 394705 119235 95525 -108948 -731 111120 -307913 -156559 -89195 112042 -225538
7236 121844 -79875 -140561 103889 -180454 -22860 17964 -229697 392944 112216 63112 -164038
7224 41122 -234805 178287 -170883 -117984 -251194 -68096 7632 -286652 -163059 47549 141456
7213 141456 -148768 41986 -356505 -176549 326499 123868 15878 -100091 46925 -12272
7202 159929 -137200 -68580 -30992 172153 59629 269156 6067 51912 -110804 -160499 -124471
7191 -124471 -279021 -28294 31582 -58373 -237768 6952 8414 -3609 72807 -360014 228251
7179 11444 141798 -309717 -115150 -253507 -359178 -79529 -283807 -10462 -5487 51510 -111142
7167 -188875 -694 -41044 -345054 -152400 -72728 94056 95310 -264017 8897 205 -138293 171594
7154 221061 -397649 -217061 245914 169049 -274770 -180726 53101 -124103 147212 -31661
7143 -61912 -168884 51831 -358411 154714 105280 -68485 239120 -107188 83727 -35405 -281475
7132 -281475 -188640 49486 64879 141408 -197460 25911 -166777 -50690 -210067 -130609 233370
7120 279223 -50491 150930 -159365 -17910 81133 12903 -125505 -83648 315412 24305 71047
7109 71047 -155822 57155 225980 -119385 157257 129949 -170429 -3125 -259763 -204314 -244998
7098 -244998 -31043 -91937 -181801 143144 -267127 178707 181847 -92811 79384 16823 -58466
7086 -77208 274113 350044 202900 377509 -53409 131748 429258 -143187 -121644 173413
7075 251123 272284 90875 84902 -132119 102146 -278192 103738 12774 12522 -67320 -41620
7064 -41620 206470 -90169 184470 100755 49559 79388 -235038 -290422 -235240 10992 130923
7053 130923 115723 15935 -45484 -170341 169011 -153383 49162 111955 -147033 -18411 -93404
7042 -93404 -155874 -155130 264398 -849 -355477 180798 -84867 -26906 121273 -199889 -131094 -221857
7030 -221857 263508 -87374 48059 -241748 -429312 21214 206026 25351 -25645 32843 93985
7019 93985 113899 1666 -79575 19508 -169722 -42083 -149130 32807 -54470 178496 -119928
7007 31467 5825 -252450 5108 -173872 26530 127534 247949 57001 -11322 77284 359680
6996 359680 25345 332747 -10795 -165830 -59022 1063 55304 -154190 118246 -97690 129843
6984 350828 158743 79178 217461 47537 -21849 127455 47421 -69010 162643 86506 -36985
6972 123933 -124130 -6410 -250031 63274 -14521 -217008 14108 90231 -257608 312743 31485
6960 -58509 -58787 -279227 29008 -71851 72971 -488832 -146797 -102190 -209852 55115 -212969
6948 39423 127452 146258 62600 2306 -186403 -13281 -379425 -224241 -59750 -295735 -90519
6936 -45682 -47325 -420286 -296077 -42246 -89608 -350757 -216217 -275740 80660 -31081 55052
6924 -34361 469946 148938 -12062 -265059 -141966 -51365 -318523 -141603 41085 -259150
6913 143931 97220 -118034 60439 244920 100884 134370 -36943 4035 422612 -50228 73282
6901 -344295 -60686 91858 -119012 -196996 -51341 -174711 -148637 8377 -322042 -61551 161696
6889 88696 179895 -193205 -173862 -77935 7800 -194835 -50178 32033 -75102 119115 98178
6878 98178 -134255 39865 81002 -274968 368897 -44654 -60972 -39936 -236700 189219 -114891
6866 -214440 -91739 93983 -134806 -74288 240978 89741 106147 -24806 159986 82882 -374859
6854 -198804 127739 -349369 199221 57809 -181534 -190664 3271 -197305 67600 -48141 -166794
6843 -166794 -165793 -250654 8926 -741 -70812 9013 53060 -28777 -43662 -175705 43171 -48103
6830 93023 -128568 -76146 146848 118824 -88459 107894 -257292 -154623 -55407 -238766 -291942
6819 -291942 -113669 73102 -122352 414113 -258725 -85061 -14133 21630 -63902 -195127 98956
6807 -90771 -184557 73832 136789 -71138 -175294 96594 48737 -273365 21451 -93409 -265431
6796 -265431 -303597 -127324 198667 54177 -28844 291564 -115118 72162 79229 -148509 397290
6784 19221 66720 -50472 98835 133693 -15007 -209393 85151 -157057 -235570 -35908 433025
6772 203925 -33597 270 376 -2246 -184702 -114167 -335457 -77945 289006 -30442 167909 -28951
6759 -321679 -126380 -120684 -124366 -101341 -110845 -296751 74764 -78788 -116167 9575 -312799 -130137
6746 90300 -96210 -233762 28896 202747 -91202 9052 420414 92114 -201748 -76087 68889
6734 163558 123906 -37972 263210 184105 -272011 -126338 76323 41300 -111754 -18045 -222328
6723 -222328 115103 -31271 -109381 -192701 112903 1579 246872 10476 -20776 -308292 214579
6711 38818 -163769 -128169 -46059 -101283 -193885 116975 151167 164257 -208193 192712 98017
6700 98017 53681 -118500 217096 32133 -129037 102534 148716 14299 59645 66847 75134
6689 75134 -27505 -91216 -109465 408979 -181677 57813 58883 15470 -257381 162224 -117090
6677 -83813 4203 -69894 -361577 -21933 174079 125905 1380 11478 65695 54612 -76922 -148216
6665 -148216 67250 -70185 64646 133618 24458 -2100 -49164 -58498 75298 -183603 62476 -76645
6652 -134958 17281 109921 -80092 -92695 -283685 40936 -113677 -102566 -194767 -43283 200953
6640 -24973 -16457 212929 -159 294581 -70435 -42928 -197131 -9220 -233319 161853 -105750
6628 8314 62087 341044 -149576 -434001 74777 110878 79877 18381 -106199 279614 -162714
6616 -483128 145307 272476 -52226 70575 114196 -175009 159921 157804 -8616 -181541 -132883
6605 -132883 148503 173949 -108529 208213 -173615 -145858 -22977 38657 66071 -162343 -107825
6594 -107825 246859 213382 -194400 -88395 66009 -244384 -82645 -151874 129085 52 158600
6583 158600 -878 -253351 -52268 56721 22223 197201 -277742 -115340 83464 235718 76265
6571 102089 -199866 -241409 291112 -72097 -45166 29002 -61252 104288 1308 205629 64106
6559 -39388 -172877 -258382 109444 -15437 237794 229514 -79155 212324 -69765 -6844 -15403 -152072
6547 -152072 -352877 95063 291849 -33734 22661 -85371 37295 -37027 -224143 -124527 -150454
6536 -150454 -162028 -228977 48998 85507 305283 -133461 79640 192324 -108269 -7564 -29276
6525 -29276 94166 161868 279685 -150536 81351 -72989 -951 -17359 -169173 -283068 266532
6513 -174287 -85827 -25740 40752 327732 -57802 133483 -216460 80549 77752 12329 357091
6502 357091 73358 100057 -137125 -61915 5117 202868 203350 39258 -173069 -56074 -334565
6491 -334565 182467 398536 56787 -59785 11747 -442957 -192801 111235 -193669 69989
6480 372064 23262 64661 13135 30649 -44920 -60527 49623 -102183 -190443 137159 -155709
6468 -204144 134484 -201556 -70048 -117904 -352418 305131 63715 -245880 -288429 255416
6457 -254609 137843 -104034 -169806 321487 -104898 -13586 -171690 115415 57281 -101961
6446 -109374 -213326 -125131 6878 34288 73908 51110 -136415 142410 129232 -3417 -251500
6435 -251500 1071 -89568 -154099 260385 64412 59492 453944 18974 -99583 -274904 205088
6423 -100738 -121604 58685 -127910 22081 -40312 -95804 87358 61847 144862 -32559 189967
6411 -169031 -87965 115069 199246 -50832 4341 233552 -48321 132173 157646 41804 -205097
6399 -84946 -3453 -362433 -81306 50831 -326463 -18629 -328221 31084 -52543 126652 -192350
6387 -29256 -50046 -73793 -79855 60985 -80448 -29594 -209193 -244443 -22005 14827 -229079 -87869
6374 78111 239387 -11111 949 158144 -202623 -152670 195693 -367958 -454519 147377 -6692
6362 -260348 -69603 -113472 490916 -68583 66751 -77059 -277692 -337581 -150181 -83958 -87691
6351 -87691 209610 -10939 154610 40932 -248143 -116581 135363 -196101 1933 171862 -246973
6339 4422 14502 -250174 237661 106867 106682 -190824 10804 -50012 -364952 115650 158688
6328 158688 68081 45873 76721 -79429 -41407 -13396 23909 201580 163692 110796 -425 214894
6315 -127952 92171 -61662 188757 -118402 -157779 291034 78151 -448186 -88554 -62228 230028
6303 -122067 -81073 236122 -259286 192683 -131762 116035 -69315 -272078 100101 72158
6293 72158 120572 -62848 235702 122401 187962 138553 -384026 58128 -20811 53439 -121216
6281 -125167 -59414 -136294 213218 -233741 225109 -61019 86188 272447 156973 147804 -94789
6269 -198571 -19 -233970 -43729 -8600 26756 -125390 112445 -41126 102796 -171070 -111286
6258 -111286 99110 -53855 91970 29112 -282933 -99265 -244348 44299 -101308 -26012 4556
6246 227888 -31625 -191385 147356 59581 -23235 -48363 -168161 187769 -347 -335782 -127207
6234 -60092 374032 -44132 -62268 -81054 269620 101561 -162620 -226558 -188914 -226227 143343
6222 262018 44407 -131365 -140334 45739 -18945 157622 -17468 285716 -281913 -92546 -101058
6211 -101058 124924 172502 51358 456395 -73590 -24312 66917 63420 147847 17612 25489 97708
6199 97708 25468 -259559 9896 -63728 -149432 110611 487963 194723 -78359 -295704 -488978
6188 -488978 -99591 -148641 -27471 545441 246642 -248678 23073 38343 212213 496797 -52447
6176 -472580 -124882 103386 -92810 442301 -39677 -143645 126454 -154701 280385 -149165
6165 -125159 -16034 -173977 -149844 -87854 -23740 64870 -49214 -123938 128001 -149726 4928
6153 -70665 37670 41587 -109970 -101549 -64537 -98767 279135 -284497 -126030 -62318 76935
6141 181015 27168 87614 -61172 -132548 -85220 -45640 116974 -441958 -128987 -269866 -53969
6129 67012 -192732 440848 20986 295780 101441 -229044 -208985 348328 64110 -146191
6118 22961 -292138 165047 55919 -150349 126222 2944 -117898 147905 32406 -60815 -244226
6107 -244226 -133288 322374 303869 56583 78134 194271 -77524 -274345 -249250 32489 -149466
6095 146184 -152565 -254071 -496320 208490 134681 101494 -1345 -14589 -241359 86982 -249995
6083 -220616 167892 249924 183122 178117 -41114 20430 -82120 -146163 16420 98022 79218 183107
6071 183107 -151327 -10600 177945 218541 -27021 -28796 63623 64845 161368 112640 -159347
6059 -4266 86464 -247520 140502 -124985 -125737 -46345 85002 -61641 74393 -290488 132519
6047 81017 109734 -111362 -265853 192709 81355 -95338 163048 -308424 -168163 174149
6036 -86507 286653 380380 241562 27261 -162395 52627 277648 -11130 -210916 188748 62678
6024 199254 -40877 -15542 212663 -92975 -260415 -157494 -46127 -163538 -149237 -80755 297083
6012 -153323 36666 67745 -84308 133143 480522 -51396 60893 -263793 278304 159872 81690
6001 81690 -120081 -140510 31574 -98838 186356 -279674 -131416 -4861 -181635 50684 -81762
5989 -43390 43476 -189410 -183725 125084 875 -311126 372033 -174246 -37823 -168113 -90170
5978 -90170 85512 -8069 -215483 -254326 -74940 -157268 161761 282588 -32288 241589 440228
5967 440228 162866 -18728 -109593 -86014 144307 -246639 -143345 -3918 33002 -158795 -5876
5955 71152 -142190 -95198 -230845 -9060 172572 -162664 266728 137092 156517 -38061 38970
5943 258665 373597 -161063 123344 37656 -113841 -196162 752 132555 -73499 -68882 -8159
5931 670 -216136 -81564 13009 -361283 255098 138437 -190833 128282 312476 198977 -224415
5919 -53554 -113631 -56611 -67968 -37218 143691 42587 292642 199887 -34074 27192 -51936
5907 -205934 -17792 26825 175758 -39566 -146063 116794 222269 248740 -164008 187121
5896 -14733 -8430 -234029 -127721 -409785 9492 136923 -205063 -224889 61622 -62796 198759
5884 -138074 -2240 -263377 89633 99664 -84325 -104010 -31602 145695 222013 31550 -150246
5872 22297 -99597 155987 -35240 210237 10843 17377 295586 -37770 -316516 49531 -139778
5860 -171807 379294 58100 28226 373511 189234 -127724 297044 -112812 -228341 52679
5849 -296945 -46257 -232944 -74613 -75491 47257 -34563 281427 153411 -225196 411171 -111629
5837 168768 -168587 404991 -292114 160762 151087 -263456 42293 35083 -328734 -91585 77352
5825 -101138 217140 -17221 -31177 -350322 -305706 138529 256898 -420608 -268423 -111080
5814 -153665 -74271 -16731 64494 -98396 -5502 160859 40661 -369103 -15990 -368150 95353
5802 -334782 -319530 233778 79543 -119741 -11045 -64601 -171252 -296390 263890 -190924
5791 139366 -21047 -49098 205405 225601 178033 84397 -8718 -84671 -152456 175362 97135
5780 97135 278256 54301 263245 147269 39680 348307 38144 275486 52015 -388608 231057
5768 31431 -36546 33191 -118440 186899 -34031 18187 59874 73153 22468 -71616 -106948
5757 -106948 -53958 89604 -56636 250204 -50749 79187 303102 -75417 4927 -39506 138432
5745 -315347 92481 60322 331310 -84846 249052 -182 -16225 307488 -26499 -232116 -351681
5734 -351681 -36796 233870 -112375 31285 -4174 -204834 233573 -138040 274665 -16322 338943
5722 200555 139882 322173 99677 -56991 -192040 102265 -65930 1633 145949 78133 -195823
5710 68922 5938 -68816 57539 67752 94160 206204 76641 -174767 239855 243644 -349679
5698 -84668 343236 57373 243598 -270202 -118374 -168876 214598 59497 -94073 130907 -135240
5686 44289 -30859 -38116 -90717 -196369 -60615 -106582 196296 153483 85829 3919 -297127 121578
5673 70734 -102556 -246432 151971 -9188 128479 -222047 -70695 -313433 187661 36792 35523
5662 35523 221960 188272 92155 120896 185656 181267 92132 -300435 -254789 -57574 -177629
5651 -177629 -425467 100877 53311 299041 -9150 -66068 -214462 -49746 -351770 181056 -210288
5639 -208441 -194101 91725 -23550 -255291 -175251 57333 -151946 -60345 -79649 -163091 -247584
5628 -247584 -157456 -269951 -34133 -152071 248835 207595 -65360 38270 27655 -337714 -261741
5617 -261741 491836 159994 -234812 23460 -29073 -197416 224090 218229 212567 311595 -23975
5605 -55000 -138849 -122001 3038 34270 -131846 10829 243970 -43759 171873 16017 -106962
5593 144069 -175090 -124866 -173849 -8844 -377469 -124223 130391 165022 -110655 -316463 129127
5581 -46552 96136 3080 -71601 -85957 -99332 -341739 13712 66728 214389 105947 -89711
5569 -397207 329163 358472 -81008 -19938 -441215 -116695 136196 136836 81542 -16374 -15317
5558 -15317 6491 -68280 -21810 -9255 36101 183288 -15768 209326 -24612 60847 113149 -151488
5545 -6155 -138911 130449 27423 -172484 -79417 84839 -147453 -331238 -133861 -4675 -221574
5534 -221574 -98075 -122927 129661 231443 -131353 140163 79853 51510 -169145 -62114 122309
5522 -45838 -142096 6564 123350 -93231 -61186 -115882 178070 76905 -62621 272150 1181 120404
5510 120404 137582 103322 -196560 17584 121097 19292 375610 1393 -94338 49463 -137609
5498 364553 -250544 -201082 -135213 253355 -213025 -217199 7553 -8718 -34160 -141919 90238
5486 275007 94989 -212696 250291 170453 -8922 193361 -147940 56371 38108 6867 -281121
5474 17080 -168971 -210334 -139852 -106298 138466 207564 209258 41585 84184 80475 86466 -9470
5461 3536 1616 -61726 -278046 109298 -242106 -103266 -106061 153853 204478 200982 -253725
5449 -58172 -98859 14759 -313378 -11175 179646 174460 114270 24369 -40022 -571340 94458
5437 643329 -58167 98472 120492 96086 -4086 -97700 34006 172106 -136254 255707 -280898
5425 -264983 -24293 55426 -105257 7292 204811 24768 148364 -395723 -13435 -86449 46893
5413 76608 -100711 141609 -216798 -97610 272603 -52142 -105330 -48535 -94421 -98602 -121393
5402 -121393 126642 -191095 5142 -14335 224490 -274075 -70808 -406901 -126273 77977 236910
5391 236910 56640 -166090 166415 126991 -34812 -272893 134065 40215 39165 95782 71492
5380 71492 81108 398769 -18158 -58835 -95531 147795 56248 -202260 168205 185829 -51979
5368 122929 9055 327755 -357908 120021 -36620 14288 13364 123040 -33297 -73404 -82532 -107489
5356 -107489 18024 16362 -247813 239812 96347 236203 34168 41960 -115567 -127322 -206259
5345 -206259 -43058 92362 289891 -136662 39623 -92946 -35539 269902 -122025 143059 57506
5333 103649 -323237 68055 214729 22604 -137205 170090 -463866 42766 31170 84886 103214
5322 103214 140748 103307 66696 -269562 -118136 -472728 -218319 212156 -190968 262684
5311 46959 111580 -138206 -231523 132552 -57477 24481 15146 -371949 -11288 -332941 -261 144516
5298 18403 41499 -73618 -97835 64260 -136513 309013 -75161 15217 102195 84397 -90110
5286 -916 -31859 47303 210188 -55677 -165627 200937 -70399 -312431 470968 -261237 -168348
5275 -168348 36513 322800 44299 15910 124621 188229 -136344 158636 11629 -161276 -43520
5263 308212 -18483 32731 -216118 71096 -297712 62526 -199113 290726 -80806 103954 -2884
5251 187105 95828 -39681 142828 -19617 133655 -153011 68250 -37550 -100567 90990 -98142
5239 -302085 166934 -171166 -40805 398101 25836 204291 121397 99579 -503786 85474 118114
5228 118114 -26707 19314 143387 15031 -115404 -288460 -4358 184347 22092 -271139 25246
5216 -387531 -250122 38392 287638 -660606 164270 63959 141892 -131597 -202704 -167242 -197005
5205 -197005 327451 -174922 -108901 -241061 -264289 86433 72073 -99801 227059 -106823 251062
5193 76666 -311258 -328028 25713 -63371 -281180 133625 115506 -90002 -289076 -22655 -15082
5182 -15082 -38148 213058 162603 3326 -287227 25838 186515 334662 23719 227724 20221
5170 152533 218274 263403 16464 193474 103994 -3987 -248084 -59219 -297134 317643 227320
5159 227320 -122373 -149957 291776 -34796 20437 29508 326640 -239499 -120337 124662 -164644
5147 83187 155484 282279 -261594 -185082 -52823 234223 -150740 83137 40702 -123722 91983
5135 10978 295021 78833 253923 198521 21275 -185392 216412 286804 32303 -44844 -202866
5124 -202866 58019 -108782 72066 75331 -159667 -14939 159959 54082 82890 127923 -176661
5112 65038 -183570 237770 135806 -91928 251620 -41244 -17933 -129745 38921 -1206 101809
5100 103232 -28246 -9356 -118960 -53877 -62730 139212 176561 -31689 60812 -89159 258154
5088 1716 284284 265683 -219423 124192 278397 26763 -101287 -92612 50546 28205 40785
5077 40785 308703 -114859 -82152 94453 87289 354439 180812 240748 -302674 83201 -344092
5065 160668 -279987 -79642 10733 -55418 -16184 -72675 125730 157261 -190049 183927 204684
5054 204684 -84047 80744 101539 146843 118806 -4730 -182838 -71784 -89065 210002 115360
5043 115360 -135307 -111715 -126737 219908 143904 -106435 123287 -280160 46875 294765
5033 294765 -69821 253710 -13180 -130686 -49944 -85507 -86382 -164724 9208 -20613 109638 -14328
5020 113282 45016 23333 68246 -68329 43560 124571 179762 133252 53444 -61156 38093 52569
5008 52569 -98881 169165 -105688 13199 -102502 -47336 151974 118241 -92018 213900 -253932
4996 -88353 47292 -29348 122931 -198421 5287 158069 177852 -285350 37813 -33150 -146273
4985 -146273 117062 415548 184353 179471 58160 -230273 -78796 -170358 422394 -12049 -88044
4974 -88044 -96327 233874 123432 69742 43053 -42699 -272193 -548069 -140103 -272765 46538
4962 -204517 -50445 -76768 177979 191527 -80122 -49627 116487 15799 37169 -145193 168108
4950 -170874 35673 230630 -150201 -165489 16104 36669 -36079 283389 -120477 128011 139049
4939 139049 140589 2803 -191098 4388 -193985 -38334 251066 -201612 192639 3952 -410016
4927 -517870 -81265 132607 180999 176746 9322 -80884 176572 -204870 -74285 -227650 131310
4915 -275653 125072 211094 121309 -7928 246127 178879 -34303 -242571 -125931 -63644 2139
4903 -124691 184047 41558 62118 309780 78301 44676 121591 321829 3905 118220 40669
4891 50260 -42101 113196 39609 46690 73603 38112 -23017 -183885 142593 -119141 -114354
4880 -114354 81152 193522 140702 -309215 53948 209390 40282 -171520 -262775 -50876 -123342
4869 -123342 -147797 13655 -286705 233660 338572 -55567 -216495 210431 -194965 88090
4858 203900 320468 108394 178962 138376 272024 76691 28393 205004 330177 -447485
4847 -6218 -299524 196339 -303063 31163 53832 22670 -113012 160389 -62018 -56421 -8653
4835 103717 -134183 -63188 -320681 -247854 153594 -51391 166446 98467 188251 267683 205123
4824 205123 -150492 114575 126045 10457 -128274 -14345 20877 -926 100659 159859 204807
4813 204807 -145123 328574 126906 -140907 44767 74397 296264 75197 -30945 157139
4802 -238687 -127732 244379 -125155 395441 161090 59876 117707 2399 233818 154949 -130997
4790 -33816 -268046 -75731 -154774 97576 -179542 106849 -106828 143169 90262 -49515 -13309
4778 -27178 -9314 -75752 292601 315425 -37828 130114 -110197 136501 65870 61235 -34518
4766 192879 -143030 132354 134743 97909 -167985 -146357 -46164 -112452 -44875 230599 55213
4754 425110 -2640 -127370 -64460 158348 -196426 -96232 384867 -219726 -53270 249334 -84453
4742 188343 -173037 -16519 45347 115756 -13738 75599 138234 271745 -104238 -42253 -142600
4731 -142600 -5057 -3425 159840 258319 345117 3068 147342 217392 61659 -112860 61839 -82138
4718 320643 258258 -139743 -165691 194850 266103 -204562 -116190 75407 20356 -179423 -155897
4707 -155897 36856 -35201 28054 296163 -66447 -87484 88839 59195 143882 -118175 55103
4695 82320 7894 166204 -45694 -141989 -120337 21083 -50209 -147470 -255683 32365 72408 86314
4683 86314 -90356 130453 235958 -33456 551246 51015 -89425 26219 141020 -347621 -53229
4671 -50374 55893 -247679 225840 7105 -183890 96788 84282 24494 -345972 -98313 183838
4659 32943 -162605 160762 9865 -225453 107002 -477620 205718 225841 64645 -334009 64705
4647 303849 144550 -101246 -107366 70019 360169 17920 28236 422616 457732 176742 -81918
4635 178952 31357 -239682 436772 -69489 79750 -7439 -131426 -384731 145303 -338873 241780
4623 -90020 -161491 -142196 -94944 68504 82792 71160 286164 94828 -231590 19290 24727 96969
4611 96969 -115904 14845 -283307 214751 43261 -324181 8924 104527 -175719 199011 -58419
4599 672 -17407 39369 125265 -163516 149488 -294446 140829 25001 195066 58429 -49699
4587 114759 15771 -206507 -109461 -215252 -8358 36699 -260720 105475 41578 -153272 -222896
4576 -222896 250349 -275152 68879 263417 200380 -17283 20318 202906 -19223 68180 -282009
4564 111966 -45146 356657 -292490 -14353 -107799 165808 203520 192216 -163313 62990 50336
4553 50336 24589 192491 -245457 131167 57078 184815 -131093 62155 -58879 -161341 -181942
4542 -181942 -184661 -32480 439239 44811 -5448 -59936 323950 -62653 -45950 -323554 113876
4530 272147 -69522 -230803 -64775 -79543 190972 183764 -85341 -99634 -45452 -58467 110544
4518 3697 138869 -203681 -167183 48968 -222327 235590 166768 -238355 256453 148658 29428
4506 -14110 55170 -200481 204212 -273111 192179 -96086 190625 -38569 46402 -319935 -54019
4494 -40341 56820 253984 69467 -12000 244925 78183 176584 -182422 -144496 -227178 65141
4482 -81949 201255 -286052 -165009 -49151 -10602 160360 -185884 194190 307347 -163036
4471 17400 -30775 2886 128604 42983 33597 -239394 218948 -105373 300803 -149109 -93700
$$ [...]
##END NTUPLES=NMR SPECTRUM
##END=
