
##TITLE=AC1340_BRARH12161_6528807_sgsL3tRXkp
##JCAMPDX= 6.0         $$ Bruker NMR JCAMP-DX V2.0
##DATA TYPE= NMR SPECTRUM
##DATA CLASS= NTUPLES
##ORIGIN= BRUKER
##OWNER= Administrator
$$ 1.72 TOPSPIN		Version 2.1
$$ 2012-07-15 18:07:04.000 -0500  Administrator@TOPSPIN
$$ Compression mode = diff/dup
##.OBSERVE FREQUENCY= 400.02188249412
##.OBSERVE NUCLEUS= ^1H
##.ACQUISITION MODE= SIMULTANEOUS (DQD)
##.ACQUISITION SCHEME= undefined
##.AVERAGES= 64
##.DIGITISER RES= 22
##SPECTROMETER/DATA SYSTEM= spect
##.PULSE SEQUENCE= noesygpps1d.comp
##.SOLVENT NAME= COFFEE_meoh
##.SHIFT REFERENCE= INTERNAL, COFFEE_meoh, 1, 14.96093
##AUDIT TRAIL= $$ (NUMBER, WHEN, WHO, WHERE, PROCESS, VERSION, WHAT)
$$ ##TITLE= Audit trail, TOPSPIN		Version 2.1
$$ ##JCAMPDX= 5.01
$$ ##ORIGIN= Bruker BioSpin GmbH
$$ ##OWNER= Administrator
$$ $$ C:\Bruker\TOPSPIN/data/COFFEE/nmr/AC1340_BRARH12161_6528807_sgsL3tRXkp/12/pdata/1/auditp.txt
$$ ##AUDIT TRAIL=  $$ (NUMBER, WHEN, WHO, WHERE, PROCESS, VERSION, WHAT)
(   1,<2012-07-15 18:06:58.812 -0500>,<Administrator>,<TOPSPIN>,<go>,<TOPSPIN 2.1>,
      <created by zg
	started at 2012-07-15 17:55:28.625 -0500,
	POWCHK enabled, PULCHK disabled,
       configuration hash MD5:
       6B 1B 68 BB D9 2E 58 E2 7F 35 AD 54 07 DF 0E 41
       data hash MD5: 64K
       9F E0 78 84 B4 78 9E A3 63 F2 8D BE FF A1 4A F3>)
(   2,<2012-07-15 18:07:01.734 -0500>,<Administrator>,<TOPSPIN>,<proc1d>,<TOPSPIN 2.1>,
      <Start of raw data processing
       efp LB = 0.3 FT_mod = 6 PKNL = 1 PHC0 = 0 PHC1 = 0 SI = 128K 
       data hash MD5: 128K
       96 08 D3 AD 61 73 A4 B1 84 79 59 47 05 60 6D 52>)
(   3,<2012-07-15 18:07:02.906 -0500>,<Administrator>,<TOPSPIN>,<proc1d>,<TOPSPIN 2.1>,
      <pk PHC0 = -2.856445 PHC1 = 0 
       data hash MD5: 128K
       82 C5 FF 8B CB 36 41 DA 2C 2B 34 B9 A4 0C 3F 98>)
(   4,<2012-07-15 18:07:03.656 -0500>,<Administrator>,<TOPSPIN>,<proc1d>,<TOPSPIN 2.1>,
      <abs ABSG = 1 
       data hash MD5: 128K
       85 F1 20 00 D5 87 8B 3F 40 E9 61 30 1F DF 8D EA>)
(   5,<2012-07-15 18:07:03.718 -0500>,<Administrator>,<TOPSPIN>,<proc1d>,<TOPSPIN 2.1>,
      <abs ABSG = 2 
       data hash MD5: 128K
       EB F1 D8 1C 3B 11 50 5D 84 8B 4A 31 1A AA C6 50>)
(   6,<2012-07-15 18:07:03.781 -0500>,<Administrator>,<TOPSPIN>,<proc1d>,<TOPSPIN 2.1>,
      <abs ABSG = 3 
       data hash MD5: 128K
       39 FE F3 5D 4C B6 28 9F 70 14 39 B2 57 F2 D0 80>)
(   7,<2012-07-15 18:07:03.843 -0500>,<Administrator>,<TOPSPIN>,<proc1d>,<TOPSPIN 2.1>,
      <abs ABSG = 4 
       data hash MD5: 128K
       5A 5E 6C 3E 0E C1 9E 8E 9D 67 28 F2 89 23 95 B2>)
(   8,<2012-07-15 18:07:03.906 -0500>,<Administrator>,<TOPSPIN>,<proc1d>,<TOPSPIN 2.1>,
      <abs ABSG = 5 
       data hash MD5: 128K
       45 9E 38 23 24 A0 BF 57 C5 78 1F 3C D5 E9 23 ED>)
$$ ##END=
$$ 
$$ $$ hash MD5
$$ $$ 42 CA 18 DC 40 C4 11 EE 72 91 E5 23 C3 00 DD 10
##$RELAX= 
##$RELAX= 
##$RELAX= 
##$RELAX= 
##$RELAX= 
##$RELAX= 
##$RELAX= 
##$RELAX= 
$$ Bruker specific parameters
$$ [...]
##$TP07= 0
##$TPNAME0= <>
##$TPNAME1= <>
##$TPNAME2= <>
##$TPNAME3= <>
##$TPNAME4= <>
##$TPNAME5= <>
##$TPNAME6= <>
##$TPNAME7= <>
##$TPOAL= (0..7)
0.5 0.5 0.5 0.5 0.5 0.5 0.5 0.5
##$TPOFFS= (0..7)
0 0 0 0 0 0 0 0
##$TUNHIN= 0
##$TUNHOUT= 0
##$TUNXOUT= 0
##$USERA1= <user>
##$USERA2= <user>
##$USERA3= <user>
##$USERA4= <user>
##$USERA5= <user>
##$V9= 5
##$VALIST= <valist>
##$VCLIST= <CCCCCCCCCCCCCCC>
##$VD= 0
##$VDLIST= <DDDDDDDDDDDDDDD>
##$VPLIST= <PPPPPPPPPPPPPPP>
##$VTLIST= <TTTTTTTTTTTTTTT>
##$WBST= 2048
##$WBSW= 25
##$XGAIN= (0..3)
0 0 0 0
##$XL= 0
##$YL= 0
##$YMAX_a= 10416990
##$YMIN_a= -7799672
##$ZGOPTNS= <>
##$ZL1= 120
##$ZL2= 120
##$ZL3= 120
##$ZL4= 120
##$ABSF1= 14.96093
##$ABSF2= -5.597252
##$ABSG= 5
##$ABSL= 3
##$ALPHA= 0
##$AQORDER= 0
##$ASSFAC= 0
##$ASSFACI= 0
##$ASSFACX= 0
##$ASSWID= 0
##$AUNMP= <proc_prof1d_extract.lims>
##$AXLEFT= 0
##$AXNAME= <>
##$AXNUC= <1H>
##$AXRIGHT= 0
##$AXTYPE= 0
##$AXUNIT= <>
##$AZFE= 0.1
##$AZFW= 0.1
##$BCFW= 0
##$BC_mod= 0
##$BYTORDP= 0
##$COROFFS= 0
##$CY= 15
##$DATMOD= 1
##$DC= 0
##$DFILT= <>
##$DTYPP= 0
##$F1P= 0
##$F2P= 0
##$FCOR= 0.5
##$FTSIZE= 131072
##$FT_mod= 6
##$GAMMA= 0
##$GB= 0
##$INTBC= 1
##$INTSCL= 1
##$ISEN= 128
##$LB= 0.3
##$LEV0= 0
##$LPBIN= 0
##$MAXI= 10000
##$MC2= 0
##$MEAN= 0
##$ME_mod= 0
##$MI= 0
##$NCOEF= 0
##$NC_proc= -2
##$NLEV= 6
##$NOISF1= 0
##$NOISF2= 0
##$NSP= 0
##$NTH_PI= 0
##$NZP= 0
##$OFFSET= 14.96093
##$PC= 1
##$PHC0= -2.856445
##$PHC1= 0
##$PH_mod= 1
##$PKNL= yes
##$PPARMOD= 0
##$PPDIAG= 0
##$PPIPTYP= 0
##$PPMPNUM= 2147483647
##$PPRESOL= 1
##$PSCAL= 4
##$PSIGN= 0
##$PYNMP= <proc.py>
##$REVERSE= no
##$SF= 400.020009663203
##$SI= 131072
##$SIGF1= 0
##$SIGF2= 0
##$SINO= 400
##$SIOLD= 131072
##$SPECTYP= <>
##$SREGLST= <1H.CDCl3>
##$SSB= 0
##$STSI= 131072
##$STSR= 0
##$SW_p= 8223.68421052631
##$SYMM= 0
##$S_DEV= 0
##$TDeff= 65536
##$TDoff= 0
##$TI= <>
##$TILT= no
##$TM1= 0
##$TM2= 0
##$TOPLEV= 0
##$USERP1= <user>
##$USERP2= <user>
##$USERP3= <user>
##$USERP4= <user>
##$USERP5= <user>
##$WDW= 1
##$XDIM= 131072
##$YMAX_p= 364368967
##$YMIN_p= -12264
##$CURPLOT= <Network HP LaserJet P1505>
##$CURPRIN= <$Network HP LaserJet P1505>
##$DFORMAT= <normdp>
##$LAYOUT= <+/1D_H.xwp>
##$LFORMAT= <normlp>
##$PFORMAT= <normpl>
##$SURQMSG= 1
$$ End of Bruker specific parameters
$$ ---------------------------------
##NTUPLES= NMR SPECTRUM
##VAR_NAME=  FREQUENCY,     SPECTRUM/REAL,   SPECTRUM/IMAG
##SYMBOL=    X,             R,               I
##VAR_TYPE=  INDEPENDENT,   DEPENDENT,       DEPENDENT
##VAR_FORM=  AFFN,          ASDF,            ASDF
##VAR_DIM=   131072,        131072,          131072
##UNITS=     HZ,            ARBITRARY UNITS, ARBITRARY UNITS
##FACTOR=    0.0627417313425164, 1,          1
##FIRST=     8223.62146879497, 1090,         -45537
##LAST=      0,             1429,            -45762
##MIN=       0,             -12264,          0
##MAX=       8223.62146879497, 364368967,    0
$$ Real data points
##PAGE= N=1
##DATA TABLE= (X++(R..R)), XYDATA
$$ [...]
63920C206922R1917O8634M4568K0549l231k7107n1130p4636r6797j17189j35291
63909B927209j49848j59481j64056j64851j63207j59466j53439j45463j36524
63900A530874j27402j18048j07919r6849q5478p4813o5393n7006m9250m2189l6200
63889F70327l1357k7275k3654k0660j8628j7443j6415j4806j2574j0481r335r045
63877D58654q741p880o867o290n880m823k909q22P30J635K115K402K821L710N017
63862D32872O399P846R698J1820J3417J4152J4866J6595J9252K1951K4351K6874
63850F20093K9673L2221L4133L5821L7911M0399M2677M4236M5107M5707M6349
63839A054327M6765M6178M4045M0673L6892L3102K8995K4131J8464J2204N603
$$ y = [3206922, 3298839, 3367473, 3412041, 3432590, 3429359, 3402252, 3351122, 3276486, 3179689, 3062500, 2927209, 2777361, 2617880, 2453824, 2288973, 2125766, 1966300, 1812861, 1667398, 1530874, 1403472, 1285424, 1177505, 1080656, 995178, 920365, 854972, 797966, 748716, 706527, 670327, 638970, 611695, 588041, 567381, 548753, 531310, 514895, 500089, 487515, 477034, 467699, 458654, 449913, 442033, 435166, 428876, 422996, 418173, 415264, 414442, 415172, 416807, 418922, 421324, 424145, 427855, 432872, 439271, 447117, 456815, 468635, 482052, 496204, 511070, 527665, 546917, 568868, 593219, 620093, 649766, 681987, 716120, 751941, 789852, 830251, 872928, 917164, 962271, 1007978, 1054327, 1101092, 1147270, 1191315, 1231988, 1268880, 1301982, 1330977, 1355108, 1373572, 1385776, 1391379]
63828A391379r95p221j3047j8805k4674l0383l5541l9926m3335m5562m6819m7701
63816A037370m8395m8304m6946m4865m3104m1931m0731l9015l6889l4479l1623
63805E81088k8388k5346k2932k0921j8839j6646j4673j3148j2067j1340j0829
63794C85959j0312r674r019q490q064p608p008o190n227m426m033l814l313k595
63780B96186k220k254j908o61P57J144L68n94j011j107j381j867k367k865l428
63765B76792l913m063l783l286l007l287l916m185l680k832k319k113j706j109
63751B33593q74j106j173o50O3M15M16L49K53O0j15j83k43k71J6O90J421J976
63733B34637K440K712K420J678J353J925K698K769K359K399L155M086M790N255
$$ y = [1391379, 1390384, 1383163, 1370116, 1351311, 1326637, 1296254, 1260713, 1220787, 1177452, 1131890, 1085071, 1037370, 988975, 940671, 893725, 848860, 805756, 763825, 723094, 684079, 647190, 612711, 581088, 552700, 527354, 504422, 483501, 464662, 448016, 433343, 420195, 408128, 396788, 385959, 375647, 365973, 356954, 348464, 340400, 332792, 325784, 319594, 314367, 309941, 305908, 302094, 298781, 296186, 293966, 291712, 289804, 289143, 289900, 291044, 291412, 290818, 289807, 288700, 287319, 285452, 283085, 280220, 276792, 272879, 268816, 265033, 261747, 258740, 255453, 251537, 247352, 243672, 240840, 238521, 236408, 234702, 233593, 232719, 231613, 230440, 229790, 229853, 230268, 230684, 231033, 231286, 231346, 231231, 231048, 230805, 230534, 230550, 231240, 232661, 234637, 237077, 239789, 242209, 243887, 245240, 247165, 249863, 252632, 254991, 257390, 260545, 264631, 269421, 274676]
63719B74676N278M580L547L002L067K946K095R73L07J41l3n58j394k265k802k775
63703B90785k366k064k052j987j468o28j5Ok42Q0J453L233M084L492K416K002
63687B96729K077J629N18k51k8O44R83R98J054J046O46K1k64M9O69J130J179R40
63669C09769Q15J179J937K622K926K961K936K800K414J752Q89q5j024j783k365
63654C27743k877l364l831m232m306l655k457j680j981k699k610j593o32k79r9
63639B91448K45M58N73J330K970M512M970M594M241M137M052M107M517N014N257
63624C42425N495O035O540O599O642P335Q415R036R150R580J0743J2245J3795
63611D54035J5599J7665J9506K0783K1700K2582K3585K4868K6414K7597K7595
$$ y = [274676, 279954, 284534, 288081, 291083, 294150, 297096, 299191, 300164, 300471, 300612, 300579, 300021, 298627, 296362, 293560, 290785, 288419, 286355, 284303, 282316, 280848, 280220, 280205, 280211, 279969, 280049, 281502, 284735, 288819, 292311, 294727, 296729, 298806, 300435, 300953, 300702, 300674, 301318, 302301, 303299, 304353, 305399, 306045, 306066, 305802, 305851, 306520, 307650, 308829, 309769, 310584, 311763, 313700, 316322, 319248, 322209, 325145, 327945, 330359, 332111, 333000, 332915, 331891, 330108, 327743, 324866, 321502, 317671, 313439, 309133, 305478, 303021, 301341, 299360, 296661, 294051, 292458, 291826, 291547, 291448, 291693, 292151, 292724, 294054, 297024, 301536, 306506, 311100, 315341, 319478, 323530, 327637, 332154, 337168, 342425, 347920, 353955, 360495, 367094, 373736, 381071, 389486, 398522, 407672, 417252, 427995, 440240, 454035, 469634, 487299, 506805, 527588, 549288, 571870, 595455, 620323, 646737, 674334, 701929]
63600G01929K6370K4605K2497J9412J5034J0220O168L240J038p38k033k819l358
63587H21565m202o011r040j2668j5827j8108k0035k2003k3466k3702k2931k2020
63575F21552k1184j9761j7324j4451j2001j0068q116n956m036k679j465K13K219
63562E06943L808M612N058N602O105O230O099O097O367O950Q148J0152J2471J4362
63548F09004J5941J8183K1633K5612K9039L1700L4289L7310M0110M0961L8169
63537I41951L1305K1591J1041J342o406j1425j3402j2907j1200r386q035p552
63525I26917q403j0792j4390j8536k2587k6102k9013l1514l3550l4506l3935l2276
63513F31313l0314k8066k4990k1362j8392j6720j5637j4260j2672j1292r940q295
$$ y = [701929, 728299, 752904, 775401, 794813, 809847, 820067, 826235, 829475, 830513, 829775, 827742, 824923, 821565, 817363, 811352, 802312, 789644, 773817, 755709, 735674, 713671, 690205, 666503, 643572, 621552, 600368, 580607, 563283, 548832, 536831, 526763, 518647, 512691, 508655, 505976, 504511, 504724, 506943, 510751, 515363, 520421, 526023, 532128, 538358, 544457, 550554, 556921, 563871, 572019, 582171, 594642, 609004, 624945, 643128, 664761, 690373, 719412, 751112, 785401, 822711, 862821, 903782, 941951, 973256, 994847, 1005888, 1007230, 1000824, 989399, 975997, 963090, 951890, 942504, 934469, 926917, 918514, 907722, 893332, 874796, 852209, 826107, 797094, 765580, 732030, 697524, 663589, 631313, 600999, 572933, 547943, 526581, 508189, 491469, 475832, 461572, 448900, 437608, 427668, 419373]
63501D19373o751n879n500n129n020n725o756o772n291l319j996j295o00J77O19
63486C60136O51O47P88P84M10m1l6N58J370K062K806L927N194N789N186L756K265
63469C96252J065J59k57L7N39J58j549l639m743m492l613k738j747m11Q21J175
63453C77017N67k00l39J57P63J174J494J905K475L274M277N222N865O465P602
63438D17718R361J1168J2643J4288J6812K0073K3259K6108K9288L3231L6923L8265
63426F89137L5720K9477K1177J2761N579K25l111m324l338l14M148R119J3749
63413H10005J7618K0691K3060K4849K6143K6684K5656K2267J6767J0608N243J117
63401A030708j941l849m450m345m746o353q949j2281j6590k1947k7471l1822l4266
$$ y = [419373, 412622, 406743, 401243, 396114, 391094, 385369, 378613, 371841, 366550, 363231, 361235, 359940, 359340, 359517, 360136, 360787, 361434, 362222, 363006, 363416, 363375, 363339, 363897, 365267, 367329, 370135, 374062, 379256, 385045, 390231, 393987, 396252, 397317, 397476, 397219, 397256, 397795, 397953, 396404, 392765, 388022, 383530, 379917, 377179, 375432, 375021, 375842, 377017, 377584, 377384, 377045, 377202, 377965, 379139, 380633, 382538, 385013, 388287, 392564, 397786, 403651, 410116, 417718, 427079, 438247, 450890, 465178, 481990, 502063, 525322, 551430, 580718, 613949, 650872, 689137, 724857, 754334, 775511, 788272, 793851, 794076, 790965, 786641, 783303, 782989, 787137, 796256, 810005, 827623, 848314, 871374, 896223, 922366, 949050, 974706, 996973, 1013740, 1024348, 1029591, 1030708, 1028767, 1024918, 1020468, 1016123, 1011377, 1005024, 996075, 983794, 967204, 945257, 917786, 885964, 851698]
63388H51698l5046l4893l4372l3562l2132k9873k7143k4551k2192j9629j6741
63377E41564j4028j1835r787p464n132l266j714O0K070L810N103O394Q099J0110
63363E23984J2063J3801J5455J7271J9385K1664K3780K5561K7137K8592K9727
63352G58420L0429L0981L1648L2115L1609K9533K5733K0481J4549R118N019K118
63340A021753k85k494m236n286n904o675q229j0995j4860j9178k3406k7511l1400
63327H61294l4315l5351l4472l2452k9944k7121k4005k0586j6720j2515q514m986
63315E80313j535J613K433j150q305j5537k0290k2873k4381k4512k2619j9549
63303D23608j6809j4661j2469j0334q930q104p099n955n341n171m733m159m308
$$ y = [851698, 816652, 781759, 747387, 713825, 681693, 651820, 624677, 600126, 577934, 558305, 541564, 527536, 515701, 505914, 498450, 493318, 490052, 488338, 488398, 490468, 494278, 499381, 505775, 513874, 523984, 536047, 549848, 565303, 582574, 601959, 623623, 647403, 672964, 700101, 728693, 758420, 788849, 819830, 851478, 883593, 915202, 944735, 970468, 990949, 1005498, 1014616, 1019635, 1021753, 1021468, 1018974, 1014738, 1009452, 1003548, 996873, 988644, 977649, 962789, 943611, 920205, 892694, 861294, 826979, 791628, 757156, 724704, 694760, 667639, 643634, 623048, 606328, 593813, 585299, 580313, 578778, 580391, 582824, 581674, 573369, 557832, 537542, 514669, 490288, 465776, 443157, 423608, 406799, 392138, 379669, 369335, 360405, 352301, 345202, 339247, 333906, 328735, 324002, 319843, 315535]
63290C15535n004m942l715k487k100j919j347j132j977k957k647j198P4O40J006
63275B85830J306J037J97n24q75j287j740j538n93Q0k59r99j174p96n00l79n9
63258B77727M39P43Q75J166J527J539J319J492K182K691K493J920J492J116M88
63243B99209j33j50N13J338J879K092K020J667J198Q85P65P15Q39J324J872J794
63227C17827J005L66N95J228J292P74O96J695L155M011L927L371K886K680K731
63212C48239K867K845K565K233K198K604L287L846L826L134K377K383L137L617
63198C89158L147K482K894M382N642N900N850O475P634Q548R113J0029J1708J3773
63184D86735J5619J6998J7973J8663J9230J9857K0635K1510K2254K2455K1752
$$ y = [315535, 310531, 305589, 301874, 299387, 297287, 295368, 294021, 292889, 290912, 287955, 285308, 284110, 284184, 284824, 285830, 287136, 288173, 288370, 287846, 286971, 285684, 283944, 282406, 281813, 281893, 281634, 280635, 279461, 278665, 278165, 277786, 277727, 278166, 278909, 279784, 280950, 282477, 284016, 285335, 286827, 289009, 291700, 294193, 296113, 297605, 298721, 299209, 299076, 298926, 299439, 300777, 302656, 304748, 306768, 308435, 309633, 310518, 311283, 311998, 312837, 314161, 316033, 317827, 318832, 319198, 319793, 321021, 322313, 323087, 323783, 325478, 328633, 332644, 336571, 339942, 342828, 345508, 348239, 351106, 353951, 356516, 358749, 360947, 363551, 366838, 370684, 374510, 377644, 380021, 382404, 385541, 389158, 392305, 394787, 397681, 402063, 407705, 413605, 419455, 425930, 433564, 442112, 451225, 461254, 472962, 486735, 502354, 519352, 537325, 555988, 575218, 595075, 615710, 637220, 659474, 681929, 703681]
63173G03681K0352J9028J8240J7483J5958J3755J1752J0385R183P604N673L495
63161H56589P11l020p389j1801j6029k0050k3482k5827k7221k8332k9412k9877
63149F34860k9062k7053k4580k2292k0355j8577j6691j4552j2281j0229q759p946
63137D22483p493o931n960m664l330k107r46Q7O35M05k88o02J02J619L064L687
63121C99761L518L218L318L738M103M331M636M992N013M592M283M735N787O514
63107D62539O220N154M169L847M144M692N215N567N550N024M306M157N035O379
63093E31998P070O670N891N620N862N955N504M678L645K239K48k245m891p251
63079E70993q853r414r082q409p946p904q087q046p422o295n173m424l882l233
$$ y = [703681, 724033, 743061, 761301, 778784, 794742, 808497, 820249, 830634, 839817, 847421, 853094, 856589, 857300, 854280, 846891, 835090, 819061, 799011, 775529, 749702, 722481, 694149, 664737, 634860, 605798, 578745, 554165, 531873, 511518, 492941, 476250, 461698, 449417, 439188, 430429, 422483, 414990, 408059, 402099, 397435, 394105, 391998, 391052, 391139, 391774, 392179, 391891, 391289, 391391, 393010, 396074, 399761, 403279, 406497, 409815, 413553, 417656, 421987, 426623, 431615, 436628, 441220, 445503, 450238, 456025, 462539, 468759, 473913, 478082, 481929, 486073, 490765, 495980, 501547, 507097, 512121, 516427, 520584, 525619, 531998, 539068, 545738, 551629, 557249, 563111, 569066, 574570, 579248, 582893, 585132, 585380, 583135, 578244, 570993, 562140, 552726, 543644, 535235, 527289, 519385, 511298, 503252, 495830, 489535, 484362, 479938, 476056, 472823]
63065D72823k521j962j422o25K11N47M42O82J683K857L407L394L528M249N455
63050D92748O862Q108Q693Q379P619P161P284P795Q574R545J0171R813Q758Q184
63036F09694Q705R548R689R279R215R666R810R020P547N950M503L398K850K608
63022G11482J886L32j247j730j124n99j077k203k878k387q17J400L961O727R509
63007G21235J2036J4192J6228J8567K1346K4281K7098K9842L2539L4748L5897
62996I88009L6053L5955L6169L6493L6339L5444L4028L2438L0885K9408K7955
62985A359176K6484K5003K3375K1170J7883J3357P782J307o030j3921k1717k8922
62973A424947l5508m1524m6638n0278n2100n2190n1007m9229m7413m5546m3171
$$ y = [472823, 470302, 468340, 466918, 466293, 466504, 467051, 467493, 468175, 469858, 472715, 476122, 479516, 483044, 487293, 492748, 499610, 507718, 516411, 524790, 532409, 539570, 546854, 554649, 563223, 572768, 582939, 592752, 601510, 609694, 618399, 627947, 637636, 646915, 656130, 665796, 675606, 684626, 692173, 698123, 702626, 706024, 708874, 711482, 713368, 713700, 712453, 710723, 709599, 709000, 707923, 705720, 702842, 700455, 699638, 701038, 704999, 711726, 721235, 733271, 747463, 763691, 782258, 803604, 827885, 854983, 884825, 917364, 952112, 988009, 1024062, 1060017, 1096186, 1132679, 1169018, 1204462, 1238490, 1270928, 1301813, 1331221, 1359176, 1385660, 1410663, 1434038, 1455208, 1473091, 1486448, 1494230, 1495537, 1489507, 1475586, 1453869, 1424947, 1389439, 1347915, 1301277, 1250999, 1198899, 1146709, 1095702, 1046473, 999060, 953514, 910343]
62962I10343m0053l6481l2800k9075k5467k2481k0417j8913j7453j6088j5197
62951F35918j4796j4582j4377j4049j3292j2149j1442j1856j2726j2668j1486
62940D92495j0444j0414j0700j0247r132q100p290o357n421n013n105n049m502
62927C94721l835l468l334l136k725k113j482j210j552k127k157j340j90O22R47
62912C67621R99Q92O28L68L34N15O52N11J25j77KO97J341J333Q92R66K033L365
62894C83097L942L706L382L329L328L380L850M532M460L169J468L86j27p22j458
62879D19722j909k177k799l685m134m005l933m174m114l409k727k731l044k995
62865C73886k744k840l102k973k692l038l865l946k628q21J34qn55j034j500j897
$$ y = [910343, 870290, 833809, 801009, 771934, 746467, 723986, 703569, 684656, 667203, 651115, 635918, 621122, 606540, 592163, 578114, 564822, 552673, 541231, 529375, 516649, 503981, 492495, 482051, 471637, 460937, 450690, 441558, 433458, 426168, 419811, 414390, 409377, 404272, 399223, 394721, 390886, 387418, 384084, 380948, 378223, 376110, 374628, 373418, 371866, 369739, 367582, 366242, 366052, 366674, 367621, 368620, 369512, 370140, 370508, 370842, 371357, 372009, 372520, 372645, 372468, 372470, 373167, 374508, 375841, 376733, 377699, 379732, 383097, 387039, 390745, 394127, 397456, 400784, 404164, 408014, 412546, 417006, 420175, 421643, 422029, 421902, 421180, 419722, 417813, 415636, 412837, 409152, 405018, 401013, 397080, 392906, 388792, 385383, 382656, 379925, 376881, 373886, 371142, 368302, 365200, 362227, 359535, 356497, 352632, 348686, 346058, 345237, 345371, 345363, 344808, 343774, 342274, 340377]
62849C40377j806j020M1P25Q35P33Q31J127J345J339J194R59N37p0n77o57k33
62832C45680M88J124J280Q53K73J40N13Q85R69J052J357J593J460J103O33k28
62816C59175j419k065j497m23j02n87p67q5P83J095Q92M79n0l88o8O46P58n7p53
62797C55567l49P02J287J243J242J444J329P62L76N93R86R59O02M84R03J691K634
62780C72455L698M792N577N798N730N997O838P734Q082P850P396O807N975N117
62766D59846M619M348L670K323P56n29j490k232k705k970l306l808m234m530n012
62751D44746n825o605o982p008o816o347n707n311n299n174m541l731l278l099
62737C69023k717k059j540j455j688j850j530n92N35J185J282J477K235L175L693
$$ y = [340377, 338571, 337551, 337592, 338317, 339152, 339885, 340716, 341843, 343188, 344527, 345721, 346680, 347217, 347147, 346570, 345913, 345680, 346168, 347292, 348572, 349425, 349698, 349838, 350351, 351236, 352205, 353257, 354614, 356207, 357667, 358770, 359403, 359175, 357756, 355691, 354194, 353771, 353669, 353082, 352315, 352230, 353013, 354108, 355000, 355479, 355429, 355041, 354973, 355619, 356377, 356320, 355567, 355218, 355920, 357207, 358450, 359692, 361136, 362465, 363227, 363603, 364196, 365182, 366141, 366743, 367227, 368130, 369821, 372455, 376153, 380945, 386522, 392320, 398050, 404047, 410885, 418619, 426701, 434551, 441947, 448754, 454729, 459846, 464465, 468813, 472483, 474806, 475562, 475033, 473543, 471311, 468606, 465636, 462330, 458522, 454288, 449758, 444746, 438921, 432316, 425334, 418326, 411510, 405163, 399456, 394145, 388846, 383672, 379131, 375400, 372122, 369023, 366306, 364247, 362707, 361252, 359564, 357714, 356184, 355592, 356127, 357312, 358594, 360071, 362306, 365481, 369174]
62722C69174L773L820M093M674N568O478O923O957P244Q057Q830R267J0099J1965
62708D66922J4204J5750J6789J8401K0897K3584K6133K9023L2535L6183L9438
62697G39859M2278M4886M7423N0171N3315N6459N8927O0475O1144O0631N8555
62686A334123N5193N0996M5456L7544K7384J6429N660n291j6764k7842l7310m5045
62674A440533n1637n7117o0893o2694o2944o2257o0979n9087n6276n2349m7714
62663H06586m3254l9448l6049l2716k9557k6750k4169k1734j9693j8138j6635
62652D98443j4744j2599j0690r306q552q437q587q289p358o527o498o820o390
62639C83646m901l184k115j717j510j249j070j106j248j247j026q22r46j392j815
$$ y = [369174, 372947, 376767, 380860, 385534, 391102, 397580, 404503, 411460, 418704, 426761, 435591, 444858, 454957, 466922, 481126, 496876, 513665, 532066, 552963, 576547, 602680, 631703, 664238, 700421, 739859, 782137, 827023, 874446, 924617, 977932, 1034391, 1093318, 1153793, 1214937, 1275568, 1334123, 1389316, 1440312, 1485768, 1523312, 1550696, 1567125, 1572785, 1567494, 1550730, 1522888, 1485578, 1440533, 1388896, 1331779, 1270886, 1208192, 1145248, 1082991, 1022012, 962925, 906649, 854300, 806586, 763332, 723884, 687835, 655119, 625562, 598812, 574643, 552909, 533216, 515078, 498443, 483699, 471100, 460410, 451104, 442552, 434115, 425528, 417239, 409881, 403354, 396856, 390036, 383646, 378745, 375561, 373446, 371729, 370219, 368970, 367900, 366794, 365546, 364299, 363273, 362451, 361505, 360113, 358298]
62624C58298j989k058k276k618k820k641k040j220o28o27j071j365j064k94M71
62609C36058Q42O70Q8m46m04K70J027J250Q31J39l28j94O17J744K590K838K682
62592C50274K527K614K920L164K987K357J861K146L015L484K888J587M13k30m65
62577C81542n36o22q52j256j759k348l040l638l776l357k730k419k732l596m448
62562C44433m436l206j465l09j5l5m2l03q59j193j019p23o19m83k00j93o14p38
62544C27981J17J492K281K102J571J429J853K535L019L157L394M256N400N714
62530C66301M729L331K588K494K507K667L417M680O044P557R548J1814J3715J5005
62516D56397J5979J6967J8296K0487K3761K7418L0400L2334L3481L4024L4063
$$ y = [358298, 356309, 354251, 351975, 349357, 346537, 343896, 341856, 340636, 340008, 339381, 338310, 336945, 335881, 335587, 336058, 336900, 337570, 337658, 337212, 336808, 337078, 338105, 339355, 340186, 340325, 339997, 339803, 340420, 342164, 344754, 347592, 350274, 352801, 355415, 358335, 361499, 364486, 366843, 368704, 370850, 373865, 377349, 380237, 381824, 382237, 382007, 381542, 381006, 380384, 379532, 378276, 376517, 374169, 371129, 367491, 363715, 360358, 357628, 355209, 352477, 348881, 344433, 339997, 336791, 335326, 335017, 335002, 334967, 334925, 334622, 333763, 332570, 331551, 330828, 330209, 329726, 329526, 329333, 328719, 327981, 328098, 329590, 331871, 333973, 335544, 336973, 338826, 341361, 344380, 347537, 350931, 355187, 360587, 366301, 371030, 374361, 376949, 379443, 381950, 384617, 388034, 392714, 398758, 406315, 415863, 427677, 441392, 456397, 472376, 489343, 507639, 528126, 551887, 579305, 609705, 642039, 675520, 709544, 743607]
62505G43607L4034L4183L3812L1875K8366K4257K0092J5519J0201M309j928q284
62493I70043j3961j7901j9938k0914k1347k0883j9246j6883j4206j1061p407l805
62481G82491p27J960M328N948O749P631R285J0889J0855Q673N326J978j007l850
62467H50529o876j0441j4775j9546k3865k6904k8480k9018k9063k8854k8305k7310
62455E77092k5980k4459k2628k0301j7676j5272j3349j1682r984q266o706n383
62443C95406m303l413k597j891j624j944k277j771m03R06J406J226P96K29l79
62428C79367o97p01r59j834k819l224l154l146l174k773k004j564j782k096j809
62413C47631r60k14m8k67k94J71Q10J081Q64N14K73jl95o07l91nJ59J43L62J094
$$ y = [743607, 777641, 811824, 845636, 877511, 905877, 930134, 950226, 965745, 975946, 980255, 978327, 970043, 956082, 938181, 918243, 897329, 875982, 855099, 835853, 818970, 804764, 793703, 786296, 782491, 781764, 783724, 788052, 794000, 800749, 808380, 817665, 828554, 839409, 848082, 853408, 855386, 854379, 850529, 843653, 833212, 818437, 798891, 775026, 748122, 719642, 690624, 661561, 632707, 604402, 577092, 551112, 526653, 504025, 483724, 466048, 450776, 437427, 425745, 415761, 407495, 400789, 395406, 391103, 387690, 385093, 383202, 381578, 379634, 377357, 375586, 375183, 376089, 377495, 378721, 379517, 379746, 379367, 378670, 377969, 377010, 375176, 372357, 369133, 365979, 362833, 359659, 356886, 354882, 353318, 351536, 349440, 347631, 346671, 346457, 346409, 346142, 345848, 346019, 346829, 347910, 348774, 349288, 349561, 349560, 349165, 348558, 348167, 348162, 348321, 348464, 348826, 349920]
62393C49920K294L672M720M917M317L706L804M411M729M380L746L414L651M298
62379D05979M936N222N317N773O739P596P791P695Q054Q876R545R972J0768J2227
62365E16490J3782J4853J5660J6822J8575K0726K3122K5786K8730L1916L5338
62354G61800L8958M2533M5617M7766M8808M8963M8462M6898M3292L7223K9676
62343A239996K2217J5470Q968K403l863r681j5603k1921k7903l2653l6306l9590
62331A101534m2428m3824m3144m0886l8035l5198l2562l0226k8183k6215k4126
62320G16707k1995k0119j8729j7911j7651j7745j7777j7343j6394j5289j4396
62309E21358j3687j2806j1541j0099q767p480n999m476l476l253l296k847j721
$$ y = [349920, 352214, 355886, 360606, 365523, 369840, 373546, 377350, 381761, 386490, 390870, 394616, 398030, 401681, 405979, 410915, 416137, 421454, 427227, 433966, 441562, 449353, 457048, 465102, 473978, 483523, 493495, 504263, 516490, 530272, 545125, 560785, 577607, 596182, 616908, 640030, 665816, 694546, 726462, 761800, 800758, 843291, 888908, 936674, 985482, 1034445, 1082907, 1129805, 1173097, 1210320, 1239996, 1262213, 1277683, 1286651, 1289054, 1285191, 1275510, 1259907, 1237986, 1210083, 1177430, 1141124, 1101534, 1059106, 1015282, 972138, 931252, 893217, 858019, 825457, 795231, 767048, 740833, 716707, 694712, 674593, 655864, 637953, 620302, 602557, 584780, 567437, 551043, 535754, 521358, 507671, 494865, 483324, 473225, 464458, 456978, 450979, 446503, 443027, 439774, 436478, 433631, 431910]
62296D31910m19M42N56K9o32p19K0J084J892K624L873N421O104N205L469K307
62280D63166K376L307M381M942M485L141J890J678K254K536K179K035K865M368
62266E05603N864P300Q997J0871J2623J4412J6652J9333K2148K5225K9039L3563
62254G11630L8090M2073M5608M8908N1678N3214N2844N0209M5485L9382L2604
62243A211725K5280J7314R157J613n275j2317j9868k7152l3429l9053m4622m9576
62231A033797n2631n3407n2659n0952m8016m3774l9056l4829l1179k7639k4137
62220E75518k1092j8655j6431j4008j1533r563q440p905p383o589n783n303n085
62207D37748m762m140l278k246j158m11m51j083j422q15M00J312J567J711K471
$$ y = [431910, 431491, 431933, 432489, 432518, 431886, 431167, 431187, 432271, 434163, 436787, 440660, 446081, 452185, 457390, 460859, 463166, 465542, 468849, 473230, 478172, 482657, 485798, 487688, 489366, 491620, 494156, 496335, 498370, 501235, 505603, 511467, 518767, 527764, 538635, 551258, 565670, 582322, 601655, 623803, 649028, 678067, 711630, 749720, 791793, 837401, 886309, 937987, 991201, 1044045, 1094254, 1139739, 1179121, 1211725, 1237005, 1254319, 1263476, 1265089, 1259814, 1247497, 1227629, 1200477, 1167048, 1127995, 1083373, 1033797, 981166, 927759, 875100, 824148, 776132, 732358, 693302, 658473, 627294, 599655, 575518, 554426, 535771, 519340, 505332, 493799, 484236, 475796, 467891, 460508, 453919, 448136, 442833, 437748, 432986, 428846, 425568, 423322, 422164, 421753, 421302, 420219, 418797, 417982, 418382, 419694, 421261, 422972, 425443]
62192D25443L878N173N611N290N112N849P306Q614R227R386R596R964J0246J0258
62178E30953R999R529Q938Q386P964P655P496P708Q489R811J1477J3349J5448
62165F57202J7955K1096K4832K8631L1827L4276L6306L7856L8099L6292L2715
62154I97087K8337K3760J8909J3577P814J867l885r076j3867j9135k5470l1972
62142I87946l6786l9032l9521l9324l8442l6415l3580l0788k8196k5235k1708
62131F18919j8184j5184j2669j0565r160q621q457p952o912n697m644l748k746
62118E04380j335O17K888M975O554P723Q724R637J0609J2098J4345J6543J7083
62105F14841J5029J1144P124L996J669J1l22J320M173O083N267J828k559o195
$$ y = [425443, 429321, 434494, 440105, 445395, 450507, 456356, 463662, 472276, 481503, 490889, 500485, 510449, 520695, 530953, 540952, 550481, 559419, 567805, 575769, 583424, 590920, 598628, 607117, 616928, 628405, 641754, 657202, 675157, 696253, 721085, 749716, 781543, 815819, 852125, 889981, 928080, 964372, 997087, 1025424, 1049184, 1068093, 1081670, 1089484, 1091351, 1087466, 1078390, 1064523, 1045388, 1019918, 987946, 951160, 912128, 872607, 833283, 794841, 758426, 724846, 694058, 665862, 640627, 618919, 600735, 585551, 572882, 562317, 553157, 544536, 536079, 528127, 521215, 515518, 510874, 507126, 504380, 503045, 503662, 506550, 511525, 518079, 525802, 534526, 544163, 554772, 566870, 581215, 597758, 614841, 629870, 641014, 648138, 652134, 653803, 653814, 653492, 654812, 658985, 665068, 670335, 672163, 669604, 663409]
62091F63409q341r015q416o719m160j035K333N604Q593J1368J4132J6896J9440
62078G04089K1635K3602K5567K7629K9735L1681L3098L3682L3565L3345L3544
62067A031172L4163L4727L4690L3768L2180L0643K9869K9883L0061K9851K9182
62056A380189K7966K5677K1942J7320J2996R591O609L058j663p451j3727j9880
62044A462627k5680l1313l6881m1920m5691m7886m8838m8964m8330m6773m4256
62033I96095m1030l7630l4718l2609l0870k8642k5558k2087j8962j6462j4483
62022F93044j2959j1914j1256j0810j0553j0514j0439r917q912p982p638p655
62010E72495p309o323n203m434l745k638j393q23r52o76Q07K830M116M420M580
$$ y = [663409, 655068, 646053, 637637, 630918, 626758, 625723, 628056, 633660, 642253, 653621, 667753, 684649, 704089, 725724, 749326, 774893, 802522, 832257, 863938, 897036, 930718, 964283, 997628, 1031172, 1065335, 1100062, 1134752, 1168520, 1200700, 1231343, 1261212, 1291095, 1321156, 1351007, 1380189, 1408155, 1433832, 1455774, 1473094, 1486090, 1495681, 1502290, 1505348, 1503685, 1496234, 1482507, 1462627, 1436947, 1405634, 1368753, 1326833, 1281142, 1233256, 1184418, 1135454, 1087124, 1040351, 996095, 955065, 917435, 882717, 850108, 819238, 790596, 765038, 742951, 723989, 707527, 693044, 680085, 668171, 656915, 646105, 635552, 625038, 614599, 604682, 595770, 587788, 580150, 572495, 565186, 558863, 553660, 549226, 545481, 542843, 541450, 540627, 539675, 538999, 539806, 542636, 546752, 551172, 555752]
61995E55752N124N625N515M847L969K969J793N35o65j789k853l793m618n478o457
61980E60476p443q212q513q145p255o392n983n748n164m318l760l522l043k198
61966D80780j642j754j934j470m94M25J138J728J935J476P04K71K49K23R3K06
61950D81934P31J470K306L304M387N298O014O745P526Q210Q841R651J0701J1863
61936E68981J3166J4692J6169J7091J7326J7185J6814J5986J4640J3142J1783
61925G36975J0347Q472O154L667J233j001k870m395n922p724r505j0456r982q257
61911G06736o091m126k234J72L190O081Q107R434J0776J2295J3279J3051J1714
61898G82384R803P530M685J117k898o747r893j2233j4007j5252j5614j4941j3931
$$ y = [555752, 560876, 566501, 572016, 576863, 580832, 583801, 585594, 586129, 585464, 583675, 580822, 577029, 572411, 566933, 560476, 553033, 544821, 536308, 528163, 520908, 514516, 508533, 502785, 497621, 493303, 489543, 486021, 482978, 480780, 479138, 477384, 475450, 473980, 473486, 473911, 475049, 476777, 478712, 480188, 480892, 481163, 481412, 481635, 481728, 481934, 482665, 484135, 486441, 489745, 494132, 499430, 505444, 512189, 519715, 527925, 536766, 546417, 557118, 568981, 582147, 596839, 613008, 630099, 647425, 664610, 681424, 697410, 712050, 725192, 736975, 747322, 755794, 761948, 765615, 766848, 765847, 762977, 758582, 752660, 744936, 735431, 724975, 714993, 706736, 700645, 696519, 694285, 694457, 697647, 703728, 711835, 721269, 732045, 744340, 757619, 770670, 782384, 792187, 799717, 804402, 805519, 802621, 795874, 785981, 773748, 759741, 744489, 728875, 713934, 700003]
61885G00003j3582j4002j4221j3451j2039j0868j0205r615q862q308q382q962
61873E67506r516r678r500r121q420p154n420l685k247q94N95J911K649L180M479
61858E14685O836R272J0647J1073J1745J3508J6076J8658K0977K3348K5916K8167
61846G10908K9320K9166K8329K7607K7171K6529K5110K2672J9186J4683R400L892
61834I73973j180n448q940j1773j3691j4070j2588r895p178m851k122J696N942
61821H89875R284J1347J2754J3566J2780R764N321O62m057r415j5396k1102k5624
61808H89759k8560k9899l0052k9835k9739k9266k7563k4785k2076k0127j8413
61797E99444j6180j3534j1148r379q182p494p160o700n723m496l612l154k664
$$ y = [700003, 686421, 672419, 658198, 644747, 632708, 621840, 611635, 602020, 593158, 584850, 576468, 567506, 557990, 548312, 538812, 529691, 521271, 514117, 508697, 505012, 502765, 501871, 502466, 504377, 507026, 510206, 514685, 521521, 530793, 541440, 552513, 564258, 577766, 593842, 612500, 633477, 656825, 682741, 710908, 740228, 769394, 797723, 825330, 852501, 879030, 904140, 926812, 945998, 960681, 970081, 973973, 972793, 967345, 958405, 946632, 932941, 918871, 906283, 896388, 889210, 884359, 882237, 883933, 889875, 899159, 910506, 923260, 936826, 949606, 959370, 964691, 965353, 961296, 951881, 936485, 915383, 889759, 861199, 831300, 801248, 771413, 741674, 712408, 684845, 660060, 637984, 617857, 599444, 583264, 569730, 558582, 549203, 541021, 533527, 526367, 519667, 513944, 509448, 505836, 502682, 500018]
61784E00018j962j408j209j020n21j5J5l31n27l60n3K81P76J385J811K086K729
61767E01695L929N010N121M330L541L445L956M581M921M743M051L276L075L588
61753E59262M148L961L005J963J363J034N22k25q45j183j649k660l980m907n139
61738E54670n015m788m103k564m84J317K362K741K728K620K793L401M020M098
61724E63796L835M041N009O012O179N474M609M276M683N465N871N423M518M034
61710F33225M146M067L190J889P38m27k042l747m668m648m433m534m593m184l636
61695F10343l620m153m455l834k496j409j350k148k918l024k633k269k097j929
61681E72008j755j798k035k023j467o88l26n77r50p90l1O77O63Kn14k84M26Q05
$$ y = [500018, 498056, 496648, 495439, 494419, 493898, 493883, 493898, 493567, 493040, 492680, 492627, 492908, 493684, 495069, 496880, 498966, 501695, 505624, 510634, 515755, 520085, 523626, 527071, 531027, 535608, 540529, 545272, 549323, 552599, 555674, 559262, 563410, 567371, 570376, 572339, 573702, 574736, 575258, 575033, 574188, 573005, 571356, 568696, 564716, 559809, 554670, 549655, 544867, 540764, 538200, 537716, 539033, 541395, 544136, 546864, 549484, 552277, 555678, 559698, 563796, 567631, 571672, 576681, 582693, 588872, 594346, 598955, 603231, 607914, 613379, 619250, 624673, 629191, 633225, 637371, 641438, 644628, 646517, 647255, 646828, 644786, 641039, 636371, 631723, 627290, 622756, 618163, 613979, 610343, 606723, 602570, 598115, 594281, 591785, 590376, 589026, 586878, 583960, 580936, 578303, 576034, 573937, 572008, 570253, 568455, 566420, 564397, 562930, 562242, 561916, 561339, 560389, 559599, 559568, 560245, 560908, 560910, 560396, 560112, 560538, 561343]
61663E61343L93n02j285j615j487r64j12Q29J429J468J242J290J760K233K278
61648E68300J938J540J283J285J768K744L668L941L696L606L901M113L890L468
61634F09141L104K664K045J540J322J098O97N28R29J462J526J284J309J480J114
61619F31243J65n07l39J43J08m94j015j082j029j444k516l867m953n568n945o406
61603E96494p018p614p950p789p090o238n819n881n817n170m283l726l461l105
61589E15533k704k643k903l047k931k830k822k747k727l092l611l548k787k203
61575D74938k448k963k755j751p47l15l24m65o46q68j195j840k851l659l395j883
61559D46833o8Q31M52n79j391j566j156m66Q6J75p8j31L28Q42O37l93j534k114
$$ y = [561343, 561736, 561234, 559949, 558334, 556847, 555883, 555771, 556600, 558029, 559497, 560739, 562029, 563789, 566022, 568300, 570238, 571778, 573061, 574346, 576114, 578858, 582526, 586467, 590163, 593769, 597670, 601783, 605673, 609141, 612245, 614909, 616954, 618494, 619816, 620914, 621611, 622139, 623068, 624530, 626056, 627340, 628649, 630129, 631243, 631408, 630901, 630562, 630705, 630813, 630319, 629304, 628222, 627193, 625749, 623233, 619366, 614413, 608845, 602900, 596494, 589476, 581862, 573912, 566123, 559033, 552795, 546976, 541095, 535278, 530108, 525825, 522099, 518638, 515533, 512829, 510186, 507283, 504236, 501305, 498475, 495653, 492906, 490179, 487087, 483476, 479928, 477141, 474938, 472490, 469527, 466772, 465021, 464274, 463959, 463635, 463170, 462524, 461656, 460461, 458621, 455770, 452111, 448716, 446833, 446765, 447596, 448048, 447469, 446078, 444512, 443356, 442890, 442976, 443151, 443073, 442942, 443270, 444112, 444749, 444356, 442822, 440708]
61541D40708k076j529m34R16J635J225M72N29J274J428L79r59j438j013l74R8
61525D40841L25M6r18k107k759k716k491k478k568k552k432k229j940j771k068
61510D12183k775l290l087k319j563j109p69l04K25N48M24k34j267k200k422j716
61494C90325n81J46M9n91j190j399j215q48n92o63r80j191j019n28k1K49J59k59
61476C79851p15q01l89K37P49J077J232J110P48M64M18L41K6j83N3L55J55k27
61458C84501Q7J075J540P24n41q56L1J153J670J617J422J267J053O78J95j93k59
61441C95164K9M78R03J326J836K368K775K986K985K758K435K279K395K551K485
61426D25753K244K026J754J168K69n03o96k91L56R44J457K019K569K765K290J276
$$ y = [440708, 438632, 437103, 436669, 437585, 439220, 440445, 440917, 441446, 442720, 444148, 444527, 443568, 442130, 441117, 440743, 440841, 441166, 441212, 440294, 438187, 435428, 432712, 430221, 427743, 425175, 422623, 420191, 417962, 416022, 414251, 412183, 409408, 406118, 403031, 400712, 399149, 398040, 397271, 396967, 397192, 397740, 398164, 397930, 396663, 394463, 392041, 390325, 389744, 389890, 389939, 389348, 388158, 386759, 385544, 384696, 384104, 383441, 382461, 381270, 380251, 379723, 379702, 379951, 380110, 379851, 379136, 378335, 377946, 378183, 378932, 380009, 381241, 382351, 383099, 383563, 383981, 384322, 384348, 384165, 384218, 384573, 384728, 384501, 384588, 385663, 387203, 387927, 387386, 386530, 386561, 387714, 389384, 391001, 392423, 393690, 394743, 395421, 395616, 395423, 395164, 395193, 395671, 396574, 397900, 399736, 402104, 404879, 407865, 410850, 413608, 416043, 418322, 420717, 423268, 425753, 427997, 430023, 431777, 432945, 433214, 432711, 432015, 431724, 432080, 433024, 434481, 436500, 439069, 441834, 444124, 445400]
61410D45400L16j7K51M97J77n47j071j212j517k397l308l358k620k165k571l140
61394D22718l007k348j886j708j386r44p85q52o66k24k4j64k46k70p49j618j920
61377D03921j092J62P90P10N46O39Q77J192J547J702J498J253J376J725J800J459
61361D20105J035P93O91O03N57O83J083J743K489L153L761M331M573M183L500
61346D53283L300L853M655N317O072P135Q212R098J0087J1181J1526J0414Q452
61333E52585O876N955M898L142R83j066k760l932m491m784n294n886n856m877
61319E35493l437k259j696j775k264k577k158j209n61o14q11m93J61M56K28J44
61303E16628R07K457M017M863M977M918N193N857O755P738Q517Q651P996O906
$$ y = [445400, 445716, 445699, 445950, 446447, 446624, 446077, 445006, 443794, 442277, 439880, 436572, 433214, 430594, 428429, 425858, 422718, 419711, 417363, 415477, 413769, 412383, 411439, 410654, 409802, 409136, 408912, 408888, 408724, 408478, 408208, 407459, 405841, 403921, 402829, 402991, 403781, 404491, 405037, 405676, 406553, 407745, 409292, 410994, 412492, 413745, 415121, 416846, 418646, 420105, 421140, 421933, 422624, 423227, 423784, 424467, 425550, 427293, 429782, 432935, 436696, 441027, 445600, 449783, 453283, 456583, 460436, 465091, 470408, 476480, 483615, 491827, 500925, 511012, 522193, 533719, 544133, 552585, 559461, 565416, 570314, 573456, 574439, 573373, 570613, 566681, 562190, 557406, 552112, 546226, 540370, 535493, 532056, 529797, 528101, 526326, 524062, 521485, 519327, 518118, 517557, 516943, 516132, 515639, 515800, 516256, 516484, 516628, 517535, 519992, 524009, 528872, 533849, 538767, 543960, 549817, 556572, 564310, 572827, 581478, 589474, 596380]
61289E96380N686M048J649j073l191m371n159o024o707o768o286n726n254m593
61275E52611l430j835k25R39J503J706J993K640L502M031L763K974K694L652N325
61260E81843O519O929P376Q307Q918Q422P414P121P740Q460Q906R538J0593J1521
61246F99607J1664J0827Q980O029K185j908n635q682j0851j2047j2432j2219j1358
61233F64160r906q457p578o840n308l021j168m65k62L25J186J676J746J904K372
61218F30364K892L185L276L430M010N074N989N861M659L381K747K261J141k47
61204F78023p38J6J089J614J895K750M160N209N311N007N291O469Q079R765J1664
61189G45604J3798J5657J6815J7579J8569J9915K1334K2671K3754K3971K2781
$$ y = [596380, 602066, 606114, 607763, 606690, 603499, 599128, 593969, 587945, 581238, 574470, 568184, 562458, 557204, 552611, 549181, 547346, 547121, 548060, 549563, 551269, 553262, 555902, 559404, 563435, 567198, 570172, 572866, 576518, 581843, 588362, 595291, 602667, 610974, 619892, 628314, 635728, 642849, 650589, 659049, 667955, 677493, 688086, 699607, 711271, 722098, 731078, 737107, 739292, 737384, 731749, 723067, 712216, 700169, 687737, 675518, 664160, 654254, 645797, 638219, 631379, 626071, 623050, 621882, 621417, 621155, 621480, 622666, 624342, 626088, 627992, 630364, 633256, 636441, 639717, 643147, 647157, 652231, 658220, 664081, 668740, 672121, 674868, 677129, 678270, 678023, 677285, 677301, 678390, 680004, 681899, 684649, 688809, 694018, 699329, 704336, 709627, 716096, 724175, 733940, 745604, 759402, 775059, 791874, 809453, 828022, 847937, 869271, 891942, 915696, 939667, 962448]
61178I62448K0583J8335J6247J3672J0415P296N014L224J318n11j696k440l659
61165A050246n859q571j1081j3315j5694j8225k0115k0689k0476k0772k1902k2651
61153H50896k1921k0241j8775j7511j5675j3482j1979j1123r628p061m620l152
61141F95728j911j60J344J708J632K309L402L614K833K104J683P12r80k155j803
61126G10060l96J077K516M438O861R215J1156J2927J4970J7437K0131K2668K4738
61113H57798K6267K7419K8445K9495L0501L1217L1419L1179L0732L0132K9175
61102A183779K7709K5822K3616K1050J8081J4827J1556Q579O065L712Q67k707
61090A342956o441r810j3201j7193k1254k4213k6033k7938l0490l2632l3138l2082
$$ y = [962448, 983031, 1001366, 1017613, 1031285, 1041700, 1048996, 1054010, 1057234, 1058552, 1058041, 1056345, 1053905, 1050246, 1044387, 1035816, 1024735, 1011420, 995726, 977501, 957386, 936697, 916221, 895449, 873547, 850896, 828975, 808734, 789959, 772448, 756773, 743291, 731312, 720189, 710561, 703500, 698880, 695728, 693817, 693657, 695001, 696709, 698341, 700650, 704052, 707666, 710499, 712603, 714286, 714998, 714018, 711863, 710060, 709664, 710741, 713257, 717695, 724556, 733771, 744927, 757854, 772824, 790261, 810392, 833060, 857798, 884065, 911484, 939929, 969424, 999925, 1031142, 1062561, 1093740, 1124472, 1154604, 1183779, 1211488, 1237310, 1260926, 1281976, 1300057, 1314884, 1326440, 1335019, 1341084, 1344796, 1345663, 1342956, 1336515, 1326705, 1313504, 1296311, 1275057, 1250844, 1224811, 1196873, 1166383, 1133751, 1100613, 1068531]
61078A068531l0263k8108k5837k3976k2778k1667j9926j7573j5095j2854j1161
61067H39293j0205r446p871n444l448k685k220q26J171K560L101L553M349N296
61053H17178O273P331Q350R385J0862J2758J4212J4757J5291J6859J9220K1614
61041I74090K4128K7056K9616L0809L1096L1815L3333L4998L6594L8416M0242
61030A332193M1578M2741M4396M6371M8151N0046N2547N5056N6812N8574O1640
61019A890105O5559O8594P0169P1102P1910P2829P5215Q0734Q9284R9790J12709
61008B768000J29360J49016J69427J90393K14422K44130K82075L32868M01485
60999D881176M88780N92477P13453Q57083J027310J223470J443254J683023J935895
$$ y = [1068531, 1038268, 1010160, 984323, 960347, 937569, 915902, 895976, 878403, 863308, 850454, 839293, 829088, 819642, 811771, 806327, 802879, 800194, 797974, 797148, 798319, 800879, 803980, 807533, 811882, 817178, 823451, 830782, 839132, 848517, 859379, 872137, 886349, 901106, 916397, 933256, 952476, 974090, 998218, 1025274, 1054890, 1085699, 1116795, 1148610, 1181943, 1216941, 1253535, 1291951, 1332193, 1373771, 1416512, 1460908, 1507279, 1555430, 1605476, 1658023, 1713079, 1769891, 1828465, 1890105, 1955664, 2024258, 2094427, 2165529, 2237439, 2310268, 2385483, 2466217, 2555501, 2655291, 2768000, 2897360, 3046376, 3215803, 3406196, 3620618, 3864748, 4146823, 4479691, 4881176, 5369956, 5962433, 6675886, 7532969, 8560279, 9783749, 11227003, 12910026, 14845921]
60990A4845921K199602K485883K797088L068119L143620K859910K187587J293143
60982C4880873M41582j68186m76734n10639l17615J2373K95291K96282j22022
60973C4331205q85858j754321k479054k929341l098272l038809k816193k497364
60965A4831993k145452j805594j499189j233781j012568q33681o88983n69996
60957E042749m73085l96875l37962k91816k55337k26182k01565j79750j60991
60948B519186j45252j30763j16178j02288r0096p9044o8849o1214n7656n6996
60938A610850n6880n6522n6158n5086n2377m8731m5580m2890l9677l6160l3575
60927A087214l2022l0298k7887k5639k4324k3743k3397k2987k2185k0828j9451
$$ y = [14845921, 17045523, 19531406, 22328494, 25396613, 28540233, 31400143, 33587730, 34880873, 35322455, 35154269, 34677535, 34166896, 33849281, 33861654, 34156945, 34453227, 34331205, 33445347, 31691026, 29211972, 26282631, 23184359, 20145550, 17329357, 14831993, 12686541, 10880947, 9381758, 8147977, 7135409, 6301728, 5612745, 5042749, 4569664, 4172789, 3834827, 3543011, 3287674, 3061492, 2859927, 2680177, 2519186, 2373934, 2243171, 2126993, 2024705, 1934609, 1855565, 1786716, 1725502, 1667846, 1610850, 1553970, 1497448, 1441290, 1386204, 1333827, 1285096, 1239516, 1196626, 1156949, 1120789, 1087214, 1055192, 1024894, 997007, 971368, 947044, 923301, 899904, 876917, 854732, 833904, 814453]
60916H14453j8696j8278j7357j5916j4799j4315j3737j2444j0818r635r014q428
60904F51016p461o325n634n688o113o308o187o020n730m973l974l483l658l886
60890E75576l998m690o085o976o384n024m186l905l444k929l135l903m202l788
60876E12927l486l645l545k733j944k007k592k699j974r78l38q0K32R74K091L267
60860D93470M357N462O478O926O585N972N755N867N600M549L008J524L92m08j035
60845E54502j588j994k283k873m111n490n942n315m797n362o446o917o706o530
60831D88148o476n976n049m361m047l515k551j674j177o47K00R86J428J934K977
60816D60200M379N595O296O420O051N552N379N487N410N100N148N820O377N947
$$ y = [814453, 795757, 777479, 760122, 744206, 729407, 715092, 701355, 688911, 678093, 668458, 659444, 651016, 643555, 637230, 631596, 625908, 619795, 613487, 607300, 601280, 595550, 590577, 586603, 583120, 579462, 575576, 571578, 566888, 560803, 553827, 547443, 542419, 538233, 534328, 530884, 527955, 524820, 520917, 516715, 512927, 509441, 505796, 502251, 499518, 497574, 495567, 492975, 490276, 488302, 487324, 486986, 486906, 487138, 488112, 490203, 493470, 497827, 503289, 509767, 516693, 523278, 529250, 535005, 540872, 546472, 551021, 554029, 555553, 555945, 555537, 554502, 552914, 550920, 548637, 545764, 541653, 536163, 530221, 524906, 520109, 514747, 508301, 501384, 494678, 488148, 481672, 475696, 470647, 466286, 462239, 458724, 456173, 454499, 453322, 452675, 452875, 453861, 455289, 457223, 460200, 464579, 470174, 476470, 482890, 488941, 494493, 499872, 505359, 510769, 515869, 521017, 526837, 533214, 539161]
60802E39161M652L399K731K395J997J554J290J195R64L96k82o25o28r46k112l725
60786E51416m872n327n722o469p143p298p284p653q131p944p012o176o091o426
60772D57868o384n618m429l344k802k971l536l755l143k086j397j257j007k02
60758D15937O31P78N15P41J573K082J744J367K012L470M537M551M126M250N178
60743D53492O343P029O997O567O227O156O175O093N845N325M425L380K679K501
60729E29234K507K421K339K325K101J548R95O31J18p16j341j302j077j399k108
60714E36276k495k524k806l474m036m364m904n803o658p323q084q770q563p191
60700D59281n618m911m962m815l975k865k191k201k473k244j140L41J330J626
$$ y = [539161, 543813, 547212, 549943, 552338, 554335, 555889, 557179, 558374, 559338, 559734, 559452, 558827, 558199, 557253, 555141, 551416, 546544, 541217, 535495, 529026, 521883, 514585, 507301, 499648, 491517, 483573, 476561, 470385, 464294, 457868, 451484, 445866, 441437, 438093, 435291, 432320, 428784, 425029, 421886, 419800, 418403, 417146, 416139, 415937, 416568, 417346, 417861, 418602, 420175, 422257, 424001, 425368, 427380, 430850, 435387, 439938, 444064, 448314, 453492, 459835, 466864, 473861, 480428, 486655, 492811, 498986, 505079, 510924, 516249, 520674, 524054, 526733, 529234, 531741, 534162, 536501, 538826, 540927, 542475, 543470, 544101, 544219, 543503, 542162, 540860, 539783, 538384, 536276, 533781, 531257, 528451, 524977, 520941, 516577, 511673, 505870, 499212, 491889, 483805, 475035, 466472, 459281, 453663, 448752, 443790, 438975, 435000, 432135, 429944, 427743, 425270, 423026, 421886, 422227, 423557, 425183]
60686D25183J814K358L061L637M246N057N751N865N471N101N147N602O226O772
60672D91291P037O915O384N460M251K958J675L23j043k087k654l116l803m393
60658E09198m422m220m605n650o483o384n533m481l566k975k794k756k399j624
60644D51306p26O7O06N65j47q59q55n20q27j737k171j669q69k22N30J220J105
60627D44797L72M58J950L543L946L647L647L743L368K979L159L295K751K479L684
60612D87818N546O193N553N260N880O337O174O384P398Q173Q017P742Q044Q114
60598E82633O976N093L565K610J804J114O99K78l59p36m57r0n16j658k711l286
60582E94959l562l482k686j296j41M0o39j275r16O25K510L685M098M709O217Q257
$$ y = [425183, 426997, 429355, 432416, 436053, 440299, 445356, 451107, 456972, 462443, 467544, 472691, 478293, 484519, 491291, 498328, 505243, 511627, 517087, 521338, 524296, 525971, 526294, 525251, 523164, 520510, 517394, 513591, 509198, 504776, 500556, 495951, 490301, 483818, 477434, 471901, 467420, 463854, 460879, 458085, 455329, 452930, 451306, 450580, 450647, 451253, 451818, 451671, 450812, 449957, 449437, 448610, 446873, 444702, 443033, 442164, 441942, 442472, 443692, 444797, 445169, 445627, 447577, 451120, 455066, 458713, 462360, 466103, 469471, 472450, 475609, 478904, 481655, 484134, 487818, 493364, 499557, 505110, 510370, 516250, 522587, 528761, 535145, 542543, 550716, 558733, 566475, 574519, 582633, 589609, 594702, 598267, 600877, 602681, 603795, 604494, 604772, 604413, 603677, 603220, 603130, 602614, 600956, 598245, 594959, 591397, 587915, 585229, 583933, 583792, 583832, 583193, 581918, 581002, 581627, 584137, 587822, 591920, 596629, 602846, 611103]
60566F11103J0189J2069J4297J6773J8995K0718K1905K2258K1406J9465J6825
60555H06003J3585R682N519J805j257l995o387p626o935m429r25K912O926J1122
60541H26000J5273J9007K2196K5144K8230L1361L3806L4612L3180K9596K4623
60530A123028J9326J4403R815N359J502q08j249n75M08J743L745N961P419P737
60516A197814P372O708N541L628J245j070l005m450n330n698n743n460m552k944
60502A184056j131M20K161N300J0574J7401K4559L1507L8752M6867N5426O3126
60490A479018O8875P2428P3899P2871O8338N9548M6619L0146J0479j2046l6021
60479A934154n8611p6883q9510r6984j00184r9372r4722q7308p8886p0746o3122
$$ y = [611103, 621292, 633361, 647658, 664431, 683426, 704144, 726049, 748307, 769713, 789178, 806003, 819588, 829270, 834789, 836594, 835337, 831342, 824955, 817329, 810394, 805965, 805040, 807952, 814878, 826000, 841273, 860280, 882476, 907620, 935850, 967211, 1001017, 1035629, 1068809, 1098405, 1123028, 1142354, 1156757, 1166572, 1171931, 1173433, 1172625, 1171376, 1170801, 1171209, 1172952, 1176697, 1182658, 1190077, 1197814, 1205186, 1211894, 1217435, 1221063, 1222308, 1221238, 1218233, 1213783, 1208453, 1202755, 1197012, 1191552, 1187000, 1184056, 1182925, 1183345, 1185506, 1190806, 1201380, 1218781, 1243340, 1274847, 1313599, 1360466, 1415892, 1479018, 1547893, 1620321, 1694220, 1767091, 1835429, 1894977, 1941596, 1971742, 1982221, 1970175, 1934154, 1875543, 1798660, 1709150, 1612166, 1511982, 1412610, 1317888, 1230580, 1151694, 1080948, 1017826]
60468A017826n5758m8572m1754l5578l0417k6581k3908k1629j9061j6410j4560
60457F83598j3860j3427j2012r523p194o150o211o429o308n898n077l709k490
60444E85310k548l821m754m260l159k853l259l170k206j142m48K18Q79Q30j28
60429E55489j060j149q00q68j358j652j562j414j347j186r23p86q24q74r50j289
60413E37447j944k494k231p35J554L407L775K867J891J639J741J485Q23J71l17
60398E49079p25r00o16j05P5k46o37o25k16J43lo37j166r16J19J245J866K024
60380E47759K076K202K440K771K863K251J091L28N64J253J527J418J511J741J500
60365E73295Q11N11J039J843K243K262K227K145J800J137J63j148k526l265k876
$$ y = [1017826, 962068, 913496, 871742, 836164, 805747, 779166, 755258, 733629, 714568, 698158, 683598, 669738, 656311, 644299, 634776, 627582, 621432, 615221, 608792, 602484, 596586, 591509, 587800, 585310, 582762, 578941, 574187, 569927, 566768, 563915, 560656, 557486, 555280, 554138, 553690, 553908, 554787, 555617, 555489, 554429, 553280, 552480, 551612, 550254, 548602, 547040, 545626, 544279, 543093, 542170, 541384, 540560, 539686, 538736, 537447, 535503, 533009, 530778, 530043, 531597, 535004, 538779, 541646, 543537, 545176, 546917, 548402, 549225, 549396, 549079, 548354, 547454, 546838, 546733, 546808, 546562, 545925, 545300, 545084, 545227, 545224, 544587, 543421, 542505, 542624, 543869, 545735, 547759, 549835, 552037, 554477, 557248, 560111, 562362, 563453, 563781, 564345, 565598, 567125, 568543, 570054, 571795, 573295, 574106, 574617, 575656, 577499, 579742, 582004, 584231, 586376, 588176, 589313, 589476, 588328, 585802, 582537, 579661]
60350E79661j772r47r96j599j988j794j367j297j632j711r08N89J987K685K715
60335E71626K444K231K302K610K753K378J735J451J739K119K044J478O67k20j008
60320E96349j371j176p96p31r82j064o44R0P43J222J831K968M741O856Q858J0533
60304F27427J2034J3632J5431J7421J9758K2608K5480K6897K5302K0585J4334
60293H40909Q225K353m282j1822j8827k3693k6069k6454k5095k2024j7873j3893
60281F61455j1026r366q435p636o511n101l949l418l127k488j603j047r13p73
60267E96062n46o22r77r84m60j31n85j349j638j504j554j843j793j118j93N18
60251E81283R20J007O29k08j107j549j389r56o78o75o75l55K40O88O63L35J84
$$ y = [579661, 577889, 576942, 575946, 574347, 572359, 570565, 569198, 567901, 566269, 564558, 563650, 564239, 566226, 568911, 571626, 574070, 576301, 578603, 581213, 583966, 586344, 588079, 589530, 591269, 593388, 595432, 596910, 597577, 597357, 596349, 594978, 593802, 593006, 592275, 591293, 590229, 589585, 589675, 590418, 591640, 593471, 596439, 601180, 608036, 616894, 627427, 639461, 653093, 668524, 685945, 705703, 728311, 753791, 780688, 805990, 826575, 840909, 849134, 851487, 847205, 835383, 816556, 792863, 766794, 740340, 715245, 693221, 675348, 661455, 650429, 641063, 632628, 624992, 618481, 613380, 609431, 606013, 602886, 600398, 598795, 597748, 596835, 596062, 595516, 594894, 593917, 592933, 592473, 592342, 591757, 590408, 588770, 587266, 585712, 583869, 582076, 580958, 580765, 581283, 582203, 583210, 583839, 583631, 582524, 580975, 579586, 578630, 577952, 577277, 576602, 576247, 576487, 577175, 577838, 578173, 578357]
60234E78357M54R01J062P98N63J033K337L770M475M387M129M023L707K945K303
60219F15244K387K670J913n0j603j060J188K952K759J432P52J116J356P90L59
60204F32205J228K960M024L772L080K952L296L313K613J545P41N75Q56R70N11
60189F64641k54p66r59j208j518j425q22l06l54o88q18p55q09j012j194j295j213
60172F49245p24M2M22M1n69p07n58q44j603k109j962j602j604k055k768l587m205
60155F24853m178l400k297j321m88L62J174J785K228K601K848K862K832L208M182
60140F37251N377O174O407O564P120P858Q222Q222Q428Q884Q670P081M710K694
60126G33662J145p81l386n803p052p034o256n195m166l289k292q47P29J640J767
$$ y = [578357, 578811, 579712, 580774, 581572, 582135, 583168, 585505, 589275, 593750, 598137, 602266, 606289, 609996, 612941, 615244, 617631, 620301, 622214, 622164, 620561, 619501, 620689, 623641, 626400, 627832, 628584, 629700, 631056, 631846, 632205, 633433, 636393, 640417, 644189, 647269, 650221, 653517, 656830, 659443, 660988, 661729, 662304, 663160, 664130, 664641, 664387, 663621, 662662, 661454, 659936, 658511, 657689, 657383, 657029, 656341, 655523, 654768, 653959, 652947, 651753, 650458, 649245, 648521, 648563, 648985, 649026, 648457, 647750, 647192, 646348, 644745, 642636, 640674, 639072, 637468, 635413, 632645, 629058, 624853, 620675, 617275, 614978, 613657, 613169, 613531, 614705, 616490, 618718, 621319, 624167, 627029, 629861, 633069, 637251, 642628, 648802, 655209, 661773, 668893, 676751, 684973, 693195, 701623, 710507, 719177, 726258, 730968, 733662, 734807, 734026, 730640, 724837, 717785, 710751, 704495, 699300, 695134, 691845, 689553, 688706, 689435, 691075, 692842]
60111F92842J904K476K764K188J542K035L438M323M121L787M215M930M911L990
60097G39466K796J745O85o25k130l498m247m009k924j635o13K46J160J909K235
60082G30561K498L291M448N048M575L523K623J979J335O95J21p87k485m620o205
60067G46600o770o827p038p418p670p789p906p814p250o447n872n521m973m185
60053F53120l580l302k908k148j413j042o27L03J291J437P78L99J006K088K809
60038F48211L073L239L274K873K114J396Q44L75K29P04J294Q57r16k907l884m015
60022F56761m379n347o298o819p317q155q886q883q223p458o764n917m975m327
60008E63013m063l808l315k726k167j504q02m99p04p73j29P91J045M77j59l07
$$ y = [692842, 694746, 697222, 699986, 702174, 703716, 705751, 709189, 713512, 717633, 721420, 725635, 730565, 735476, 739466, 742262, 744007, 744692, 744067, 741937, 738439, 734192, 730183, 727259, 725624, 725011, 725257, 726417, 728326, 730561, 733059, 736350, 740798, 745846, 750421, 753944, 756567, 758546, 759881, 760576, 760697, 759910, 757425, 752805, 746600, 739830, 733003, 725965, 718547, 710877, 703088, 695182, 687368, 680118, 673671, 667799, 662278, 657305, 653120, 649540, 646238, 643330, 641182, 639769, 638727, 638100, 638403, 639694, 641131, 641909, 642308, 643314, 645402, 648211, 651284, 654523, 657797, 660670, 662784, 664180, 665024, 665399, 665628, 666332, 667626, 668483, 667567, 664660, 660776, 656761, 652382, 647035, 640737, 633918, 626601, 618446, 609560, 600677, 592454, 584996, 578232, 572315, 567340, 563013, 558950, 555142, 551827, 549101, 546934, 545430, 544628, 544129, 543425, 542652, 542523, 543314, 544359, 544836, 544677, 544370]
59992E44370r0M32J573L124L949L206J632P73J195K107K634K666K426J950J325
59977E73272Q46O49N24K92k6n50j519k706l414l377l186l292l172k091l54R42
59961E52838J299J251J403J748K057K351K693K915K858K592K178J541Q07M60P58
59946E79749J128O21r24k473k824j883o99k30m15o14o35r03j660k531l033l129
59930E59545k994k602j872j039m92l43l85l23M2O78J227J334J229J493K011J885
59914E59394Q80K34J112K816L625L156K625K728K704J879R37Q70J487J878J713
59899E88038J337J053J020J486K364K850K207P92k83l99J67R22J691K441L116
59884F08802L685M079M143L938L936M509N371N913N923N599N033M208L342K710
$$ y = [544370, 544280, 544712, 546285, 549409, 553358, 556564, 558196, 558969, 560164, 562271, 564905, 567571, 569997, 571947, 573272, 574118, 574767, 575291, 575583, 575557, 575007, 573488, 570782, 567368, 563991, 560805, 557513, 554341, 552250, 551896, 552838, 554137, 555388, 556791, 558539, 560596, 562947, 565640, 568555, 571413, 574005, 576183, 577724, 578531, 578991, 579749, 580877, 581498, 580574, 578101, 575277, 573394, 572695, 572465, 572050, 571436, 570801, 569898, 568238, 565707, 562674, 559545, 556551, 553949, 552077, 551038, 550546, 550203, 549818, 549495, 549537, 550215, 551442, 552776, 554005, 555498, 557509, 559394, 560274, 560508, 561620, 564436, 568061, 571217, 573842, 576570, 579274, 581153, 582090, 582960, 584447, 586325, 588038, 589375, 590428, 591448, 592934, 595298, 598148, 600355, 601147, 600864, 600465, 600632, 601554, 603245, 605686, 608802, 612487, 616566, 620709, 624647, 628583, 633092, 638463, 644376, 650299, 655898, 660931, 665139, 668481, 671191]
59870F71191K162J344K97o73j691l211n090o454o813o741o994p365o936n307l092
59855F14627j258l22j42k09L6Q94K181L280L622L291L095L928N932Q389J0503
59840F57847J2116J3508J4633J4845J3531J0763P305M056J593J27l23J47J254
59827G51402K522L363L161J355k246p005j1508j4501j5799j6107j5990j5422j4293
59814F48932j2831j1284r580p660n859m601l898l385k805k221j905k071k546k704
59800E75582k095j234j239k387l571l610k684j902j813j963j791j309r56j178
59786E47850k103l156l261j964k71K40p77k160k685k210j301m06K38M17J29k95
59770E28285n51o87q84j025p94q5P75J241J054N06J56J89L44N47J190K391L385
$$ y = [671191, 673353, 674697, 674994, 674321, 672630, 669419, 664329, 657875, 651062, 644321, 637327, 629962, 623026, 617719, 614627, 613369, 613047, 612905, 612696, 612732, 613626, 615807, 619087, 622709, 626000, 629095, 633023, 638955, 647344, 657847, 669963, 683471, 698104, 712949, 726480, 737243, 744548, 748604, 750197, 750324, 750001, 750148, 751402, 753924, 757287, 760448, 761803, 759557, 752552, 741044, 726543, 710744, 694637, 678647, 663225, 648932, 636101, 624817, 615237, 607577, 601718, 597117, 593219, 589834, 587029, 584808, 582903, 580832, 578286, 575582, 573487, 572253, 571014, 568627, 565056, 561446, 558762, 556860, 555047, 553084, 551293, 549984, 549028, 547850, 545747, 542591, 539330, 537366, 537095, 537335, 536558, 534398, 531713, 529503, 528202, 527796, 528034, 528451, 528580, 528285, 527734, 527047, 526163, 525138, 524344, 524259, 525034, 526275, 527329, 527835, 527991, 528180, 528524, 529071, 530261, 532652, 536037]
59753E36037L308K396J755J987K666L221L683M257M751M740M005K649J053j68
59739E76340n50k75J3j8j39j49k05m48o81o49l78l5K69M44N04O44R40R74K62r39
59719E75924j786j898j661j381q64j25K04k23q13q26m01j53j44N3N28J003J499
59702E68936K294L179L425K753J867J659K198K797K979L042L553M481N082M740
59688F12985L687K682K060J462N10o47j523j772j327m07M72P61L78k33o04o70
59672F17814o61q49j399k175k659k435j784j363j319j248j014r28r69o20J55N90
59656E99136K55j99j04J72N4l6O81J856K335J884J441J577J729J288M78k97j242
59639F11008k586l813m190l834l565l818m194m156l647k908k075j209n08j28R2
$$ y = [536037, 539345, 541741, 543496, 545483, 548149, 551370, 555053, 559310, 564061, 568801, 572806, 575455, 576508, 576340, 575790, 575515, 575528, 575510, 575371, 575222, 575017, 574569, 573888, 573239, 572861, 572826, 573095, 573539, 574043, 574687, 575627, 576601, 576863, 575924, 574138, 572240, 570579, 569198, 568334, 568209, 568413, 568190, 567377, 566551, 566150, 565997, 565853, 565906, 566434, 567437, 568936, 571230, 574409, 577834, 580587, 582454, 584113, 586311, 589108, 592087, 595129, 598682, 603163, 608245, 612985, 616672, 619354, 621414, 622876, 623386, 622739, 621216, 619444, 618117, 617710, 618182, 618943, 619321, 619088, 618484, 617814, 617153, 616304, 614905, 612730, 610071, 607636, 605852, 604489, 603170, 601922, 600908, 599980, 599011, 598391, 598546, 599136, 599391, 599192, 599088, 599260, 599314, 599278, 599959, 601815, 604150, 606034, 607475, 609052, 610781, 612069, 612547, 612250, 611008, 608422, 604609, 600419, 596585, 593020, 589202, 585008, 580852, 577205, 574297, 572222, 571013, 570505, 570377, 570469]
59624E70469M57R83J365J498J676K144K668K835K529J736K30k024m224n200m615
59609E72527l226j880q54k38j65k91J47J203J836J276K70J36Q94J286N07p89j402
59592E71237q86K18J059J204Q39L60j61q12j241q94r2q2j426l038l601l360l516
59575E55808m246m488l654k446j798j891k407k939k956k142r69k84j74R8Q79J598
59559E27989J755J594J436J059K64n02o09N6J153K250K861K686K124J998K476
59544E48590K856K808L099M451O396P976R111J0397J1932J3281J4525J6242J8115
59531F69779J8330J5083Q539R86m967q145q875p812n256j705J648L762M878O017
59517F92262P328P848P097N929N249M695L413J430o36k731n138p399q593q708
$$ y = [570469, 570926, 571909, 573274, 574772, 576448, 578592, 581260, 584095, 586624, 588360, 588590, 586566, 582342, 577142, 572527, 569301, 567421, 566567, 566329, 566164, 565873, 566020, 567223, 569059, 570335, 570605, 570741, 571635, 572921, 573428, 572639, 571237, 570351, 570569, 571628, 572832, 573671, 574031, 573870, 573058, 571817, 570923, 570831, 570749, 569323, 566285, 562684, 559324, 555808, 551562, 547074, 543420, 540974, 539176, 537285, 534878, 531939, 528983, 526841, 525872, 525588, 525414, 525512, 526391, 527989, 529744, 531338, 532774, 533833, 534097, 533595, 532986, 533042, 534195, 536445, 539306, 541992, 544116, 546114, 548590, 551446, 554254, 557353, 561804, 568200, 576176, 585287, 595684, 607616, 620897, 635422, 651664, 669779, 688109, 703192, 711731, 712717, 707750, 699605, 690730, 682918, 677662, 675957, 677605, 681367, 686245, 692262, 699590, 707438, 714535, 720464, 725713, 730408, 733821, 735251, 734615, 731884, 726746, 719347, 710754, 702046]
59503G02046q731r187r493r129q586q618r129r358q805p510n763l955k535j686
59489E99561j161o65k25P4M81J350K592L780M702N552O517P513Q445R455J0658
59474F58629J1774J2327J2298J2275J2649J2754J1280P768L373k12k402l753m577
59461G44183m240k270N06K634L763N054P703J1587J5507J8437K0193K1234K2294
59448H66585K4045K6581K9089L0424L0130K8506K5551K0342J2067J430r583j9327
59436A065840k7293l3221l6230l5612l2232k8311k5566k3980k2621k1109j9791
59425G59874j8635j6751j3354q833m427r12K031N126Q553J1886J4758J7254J9669
59412G76239K2064K4244K6163K8057K9803L0065K6620J8266O492n171j3652j8011
$$ y = [702046, 693315, 684128, 674635, 665506, 656920, 648302, 639173, 629815, 621010, 613500, 607737, 603782, 601247, 599561, 598400, 597735, 597510, 597584, 598065, 599415, 602007, 605787, 610489, 616041, 622558, 630071, 638516, 647971, 658629, 670403, 682730, 695028, 707303, 719952, 732706, 743986, 751754, 755127, 754915, 752513, 748760, 744183, 739943, 737673, 738179, 740813, 744576, 749630, 757333, 768920, 784427, 802864, 823057, 844291, 866585, 890630, 917211, 946300, 976724, 1006854, 1035360, 1060911, 1081253, 1093320, 1094750, 1085167, 1065840, 1038547, 1005326, 969096, 933484, 901252, 872941, 847375, 823395, 800774, 779665, 759874, 741239, 724488, 711134, 702301, 697874, 696962, 698993, 704119, 712672, 724558, 739316, 756570, 776239, 798303, 822547, 848710, 876767, 906570, 936635, 963255, 981521, 988013, 982842, 969190, 951179]
59400I51179j9019j7794j5125j1352o469r15L382L471k108j1569k1288k8686l3015
59387G90692l4150l2117k7921k3404j9622j6227j2856j0130q648p881o875n506
59375E85355m234l158k119j281q60n47RM31J32n91p75m2J088K077K813L205L111
59358E84614K824K939L565M203M542M821N350O222P618R709J2047J3818J4959
59345F77231J6314J8299K0096K0779K0608K0480K0527K0067J8710J6761J4575
59334H84447J2231R810P413M828J709j791n122q087j0955j3683j5672j6595j6953
59321H31580j7333j7565j7167j6283j5566j5169j4506j3050j0945q705o768n471
59309F73052m992m993m661l468j738j86Q50J494J903K258L085M946P660J0213
$$ y = [951179, 932160, 914366, 899241, 887889, 881420, 880505, 883887, 887358, 885250, 873681, 852393, 823707, 790692, 756542, 724425, 696504, 673100, 653478, 637251, 624395, 614265, 605617, 597736, 590861, 585355, 581121, 577963, 575844, 574563, 573703, 573156, 573165, 573596, 573728, 573137, 572362, 572320, 573408, 575485, 578298, 581503, 584614, 587438, 590377, 593942, 598145, 602687, 607508, 612858, 619080, 626698, 636407, 648454, 662272, 677231, 693545, 711844, 731940, 752719, 773327, 793807, 814334, 834401, 853111, 869872, 884447, 896678, 906488, 913901, 918729, 920438, 918647, 913525, 905438, 894483, 880800, 865128, 848533, 831580, 814247, 796682, 779515, 763232, 747666, 732497, 717991, 704941, 693996, 685291, 678523, 673052, 668060, 663067, 658406, 654938, 653200, 653014, 653864, 655358, 657261, 659519, 662604, 667550, 675210, 685423]
59295F85423J1744J2397J3029J4300J6305J8830K1575K4056K5480K4754K0764
59284H88657J3075K807p384j4781j8368j8978j7794j5218j1438p370m249k243
59272G86716k29K775O383R363J1010J1642J1955J2419J3119J3669J3288J1466
59260I03576Q696O081M052J913j019m323o959q577r785j1199j2693j3636j3573
59247H42554j2606j1268j0010q752p069m985l189k191j539l72J436L130M011M070
59233G93220L846M032N085O732P947P977P173O252M994K546r66m206o241p499
59219H30892q754j0015j1025j1994j3159j4137j4446j4171j3566j2489j0878r378
59207F86880q666q499q110p278o341n497m782m445m606m721m138l072k259j867
$$ y = [685423, 697167, 709564, 722593, 736893, 753198, 772028, 793603, 817659, 843139, 867893, 888657, 901732, 904539, 897155, 882374, 864006, 845028, 827234, 812016, 800578, 793208, 788959, 786716, 786487, 789262, 795645, 805008, 816018, 827660, 839615, 852034, 865153, 878822, 892110, 903576, 912272, 918353, 922405, 924318, 923299, 918976, 912017, 903440, 893655, 882456, 869763, 856127, 842554, 829948, 818680, 808670, 799918, 792849, 787864, 784675, 782484, 780945, 780573, 782009, 785139, 789150, 793220, 797066, 801098, 806183, 812915, 820862, 828839, 836012, 842264, 847258, 849804, 848838, 844632, 838391, 830892, 822138, 812123, 801098, 789104, 775945, 761808, 747362, 733191, 719625, 707136, 696258, 686880, 678214, 669715, 661605, 654327, 647986, 642489, 637707, 633262, 628656, 623935, 619797, 616725, 614466, 612599]
59193F12599j496j085r23q49l55M42Q94R06J080J576J827J676J825K666L530L700
59177F28013L417L302L392L433L559L986M463M752N233O371P815Q784R169R574
59163G05263J0321J1080J1548J1908J2391J2748J2405J1052Q986O938N461M384
59151H24485L040J091j129l179m983o514p488p796p912q297q662q381p481o610
59137G50184o131n780n218m333k991j111Q24J903J771J206J366K625M279N262
59123G43856N115M396M160M839N735N969N747O160P668R419J0340J0376J0230
59110H34010J0300J0385J0203R620Q507O898N370M697M888M953L960K114M63l23
59096I16045n47q20j267j626j861k251k884l467l723l655l285k477j362o09q38
$$ y = [612599, 611103, 610018, 609095, 608246, 607891, 608333, 609227, 610133, 611213, 612789, 614616, 616292, 618117, 620783, 624313, 628013, 631430, 634732, 638124, 641557, 645116, 649102, 653565, 658317, 663550, 669921, 677736, 686520, 695689, 705263, 715584, 726664, 738212, 750120, 762511, 775259, 787664, 798716, 807702, 814640, 820101, 824485, 827525, 828616, 827487, 824308, 819325, 812811, 805323, 797527, 789615, 781318, 772656, 764275, 756794, 750184, 744053, 738273, 733055, 728722, 725731, 724620, 725444, 727347, 729118, 730324, 731690, 734315, 738594, 743856, 748971, 753367, 757527, 762366, 768101, 774070, 779817, 785977, 793645, 803064, 813404, 823780, 834010, 844310, 854695, 864898, 874518, 883025, 889923, 895293, 899990, 904878, 909831, 913791, 915905, 916368, 916045, 915498, 914678, 913411, 911785, 909924, 907673, 904789, 901322, 897599, 893944, 890659, 888182, 886820, 886211, 885373]
59081H85373j921l216m397n565o684p447p824q203q752r084q900q504q367q415
59067G88094q240p750p244o904o650o388o073n556m756l953l585l714m019m334
59053G08928m816n416n596m922l737k911k908l363l633l511l281l132k841k176
59039F56685j377r68j099j374j420j281j015k97J129K735L561L387L120L663M797
59024F70246N519N388N049N384O423P429P872P999Q280Q604Q412P544O497N654
59010G66300M699L173J288k48j092j448j464r65J09J449K726L814M641N175N678
58995G93835O529P622Q338Q321P856P250O356N113M031L608L467K669P69j840
58981H63924m522o887q782j0126j0805j0591r351p419n467l739j842L67K220L194
$$ y = [885373, 883452, 880236, 875839, 870274, 863590, 856143, 848319, 840116, 831364, 822280, 813380, 804876, 796509, 788094, 779854, 772104, 764860, 757956, 751306, 744918, 738845, 733289, 728533, 724580, 720995, 717281, 713262, 708928, 704112, 698696, 693100, 688178, 684441, 681530, 678622, 675259, 671626, 668115, 664834, 661702, 658861, 656685, 655308, 654340, 653241, 651867, 650447, 649166, 648151, 647854, 648983, 651718, 655279, 658666, 661786, 665449, 670246, 675765, 681153, 686202, 691586, 698009, 705438, 713310, 721309, 729589, 738193, 746605, 754149, 760646, 766300, 770999, 774172, 775460, 775212, 774120, 772672, 771208, 770243, 770352, 771801, 774527, 778341, 782982, 788157, 793835, 800364, 807986, 816324, 824645, 832501, 839751, 846107, 851220, 855251, 858859, 862326, 864995, 865764, 863924, 859402, 852515, 843733, 833607, 822802, 812211, 802860, 795441, 789974, 786235, 784393, 784760, 786980, 790174]
58967G90174L905N343P409R138J0197J1170J2281J2869J2476J1540J0535R224
58955I06261P310N145L123R20k009n531q953j1792j3868j5043j5366j5209j4768
58942H20220j3773j2212j0914j0634j0842j0259q519o539n172m395l954l992m582
58929G14433n238n482n426n376n167m467l505k929k997l319l394l046k337j451
58915F60299p14l41lR16K427L676L985L838M310N558O670P073P468Q794J0827
58900G24783J2500J3410J4252J5634J7118J7752J7118J5589J3912J2836J2819
58889H87723J3740J5076J6569J8546K1237K4108K6233K7193K7109K5921K3255
58878A126710J9197J4658J0557O850K788j981p013j1781j6272k0554k4124k6295
$$ y = [790174, 794079, 799422, 806831, 815969, 826166, 837336, 849617, 862486, 874962, 886502, 897037, 906261, 913571, 918716, 921839, 922759, 920750, 915219, 906266, 894474, 880606, 865563, 850197, 834988, 820220, 806447, 794235, 783321, 772687, 761845, 751586, 743067, 736528, 731356, 726961, 723007, 719015, 714433, 709195, 703713, 698287, 692911, 687744, 683277, 679772, 676843, 673846, 670527, 667133, 664087, 661750, 660299, 659585, 659244, 659241, 660157, 662584, 666260, 670245, 674083, 678393, 683951, 690621, 697694, 705162, 713956, 724783, 737283, 750693, 764945, 780579, 797697, 815449, 832567, 848156, 862068, 874904, 887723, 901463, 916539, 933108, 951654, 972891, 996999, 1023232, 1050425, 1077534, 1103455, 1126710, 1145907, 1160565, 1171122, 1177972, 1180760, 1178779, 1171766, 1159985, 1143713, 1123159, 1099035, 1072740]
58866A072740k7134k7417k7491k6817k4947k2499k0522j9231j8055j6741j5688
58855H26198j5117j4671j4058j3539j3404j3385j2964j1965j0600r213q172p719
58843F81391p653p398o617n554m661m170m082m231m208l641k745k224k396k866
58829F18945l204l516m013m464m513m215l821l373k777k109j444p11N9O52J048
58814E82544J571K345L041L326L235K859K241J796K122K992L263K382J210P28
58800F15655O16K9q38j118p20l83m55o55q68j166j096M1K028L768M571M706M720
58783F28835M945N645O845P972Q469Q736R600J0879J1487J1000J0039Q935P127
58770G40514M277R48k332n690r009j1300j1821j1175j0573j0412j0245r650q531
$$ y = [1072740, 1045606, 1018189, 990698, 963881, 938934, 916435, 895913, 876682, 858627, 841886, 826198, 811081, 796410, 782352, 768813, 755409, 742024, 729060, 717095, 706495, 697282, 689110, 681391, 673738, 666340, 659723, 654169, 649508, 645338, 641256, 637025, 632817, 629176, 626431, 624207, 621811, 618945, 615741, 612225, 608212, 603748, 599235, 595020, 591199, 587826, 585049, 582940, 581496, 580785, 580844, 581496, 582544, 584115, 586460, 589501, 592827, 596062, 598921, 601162, 602958, 605080, 608072, 611335, 613717, 614927, 615655, 616271, 616300, 615462, 614344, 613624, 613241, 612786, 612131, 611263, 610097, 609001, 609042, 611070, 614838, 619409, 624115, 628835, 633780, 639425, 646270, 654242, 662711, 671447, 681047, 691926, 703413, 714413, 724452, 733387, 740514, 744791, 745739, 743407, 737717, 728708, 717408, 705587, 694412, 683839, 673427, 663182, 653532, 645001]
58757F45001o909n054l562k813k444j762n19R74K231K944L199L482M189N129N772
58742F49858O018O146O238O287O736P955R140Q928P367O070N920N868M900L926
58728G41357M379N791O293N179L541K463J830J240R46J391K434L469M018L980
58714G88311L696L812M717O002O791O631N824M900M050L120J862J71j803l806
58700H34278n756p783r892j1912j3768j5492j6842j7398j7208j6892j6744j6268
58688F68323j4966j3088j1131r185p315o092n943o310o256n665n102m701m029
58675E68540l042k311k096j870j026M33K154L868N387O527P342Q263R807J2136
58661F14112J4749J6467J6023J3167R033N096J885r45l569n686p125q062q583
$$ y = [645001, 638092, 633038, 629476, 626663, 624219, 622457, 621938, 622912, 625143, 628087, 631286, 634768, 638957, 644086, 649858, 655876, 662022, 668260, 674547, 681283, 689238, 698378, 707306, 714673, 720743, 726663, 732531, 737431, 741357, 745736, 751527, 757820, 762999, 766540, 769003, 770833, 772073, 773019, 774410, 776844, 780313, 784331, 788311, 792007, 795819, 800536, 806538, 813329, 819960, 825784, 830684, 834734, 837854, 839716, 839887, 838084, 834278, 828522, 820739, 810847, 798935, 785167, 769675, 752833, 735435, 718227, 701335, 684591, 668323, 653357, 640269, 629138, 619953, 612638, 606546, 600603, 594293, 588037, 582372, 577270, 572569, 568540, 565498, 563187, 561091, 559221, 558195, 558628, 560782, 564650, 570037, 576564, 583906, 592169, 601976, 614112, 628861, 645328, 661351, 674518, 683551, 688647, 690532, 689587, 686018, 680332, 673207, 665145, 656562]
58648F56562q562q141p753p503p066o391n911n768n387m280k881j987j634j126
58634E82172j07R49J503J682J942K350K561K403K030J517P16l23j142j377j135
58619E95741o11L32J802L335M312M784N332O146O832P196P483P774P741P288O710
58604F72197N939M373J930l49j348j128o05m24o96j415k382k960k558j354m1J003
58588F70182J905K749L418L893M399N213O464P968R213R781R954J0367J0957J0839
58574G67302R545P715O104M668L223K241K110K245J999K028L554O485R399J1349
58560H39967J2615J3590J4074J3965J3663J3292J2318J0391P958N571L149M23
58548I60976k329m535o071p353q709j0007j0851j1046j0804j0553j0543j0758
$$ y = [656562, 648000, 639859, 632106, 624603, 617537, 611146, 605235, 599467, 594080, 589800, 586919, 584932, 583298, 582172, 582065, 583014, 584517, 586199, 588141, 590491, 593052, 595455, 597485, 599002, 599718, 599395, 598253, 596876, 595741, 595130, 595462, 597264, 600599, 604911, 609695, 615027, 621173, 628005, 635201, 642684, 650458, 658199, 665487, 672197, 678136, 682509, 684439, 684090, 682742, 681614, 681009, 680585, 679889, 678474, 676092, 673132, 670574, 669220, 669179, 670182, 672087, 674836, 678254, 682147, 686546, 691759, 698223, 706191, 715404, 725185, 735139, 745506, 756463, 767302, 776847, 784562, 790666, 795334, 798557, 800798, 802908, 805153, 807152, 809180, 812734, 819219, 828618, 839967, 852582, 866172, 880246, 894211, 907874, 921166, 933484, 943875, 951833, 957404, 960553, 960976, 958647, 954112, 948041, 940688, 931979, 921972, 911121, 900075, 889271, 878718, 868175, 857417]
58536H57417j1202j1980j2949j3606j3595j3046j2219j1149r904q778p804o544
58524G24641m774k991j681n52Q47K201K836K817K801L045L257L259L044K407J358
58509G42515O59J072K159K719K387J920J952K385K984L660M024L640K889K699
58495G77664L254L816L971M081M238L839K640J341N93J22o04j522k242k587k435
58480G96169j637n06K01K11J16N42J484K768M405O026O699N905M214K443O80j309
58464H28411l235m493m924m771m185l278k378j792j389q29RJ017K029K784L022
58449H05998K896K962L466L930L765K985K002J057J44p16j413j813j768j285p06
58434H21504l98j92M54J674L022M147N147O037O461O258N858N809O224O944P842
$$ y = [857417, 846215, 834235, 821286, 807680, 794085, 781039, 768820, 757671, 747767, 738989, 731185, 724641, 719867, 716876, 715195, 714643, 715490, 717691, 720527, 723344, 726145, 729190, 732447, 735706, 738750, 741157, 742515, 743174, 744246, 746405, 749124, 751511, 753431, 755383, 757768, 760752, 764412, 768436, 772076, 774965, 777664, 780918, 784734, 788705, 792786, 797024, 800863, 803503, 804844, 805437, 805559, 804955, 803433, 801191, 798604, 796169, 794532, 794026, 794227, 794438, 794554, 795096, 796580, 799348, 803753, 809779, 816478, 822383, 826597, 829040, 829720, 828411, 825176, 820683, 815759, 810988, 806803, 803525, 801147, 799355, 797966, 797137, 797146, 798163, 800192, 802976, 805998, 808894, 811856, 815322, 819252, 823017, 826002, 828004, 829061, 829205, 828489, 827076, 825263, 823495, 822210, 821504, 821106, 820914, 821368, 823042, 826064, 830211, 835358, 841395, 847856, 854114, 859972, 865781, 872005, 878949, 886791]
58419H86791Q710R193R071Q398P350O179N238M570L569J697m69j699j749j695
58405I45154k377l360l842l839l874m110m305m203l517k040j28J412K307L127
58391I16405M172M725M078K770K056K390L078L243K622J532N63K45O79J457K081
58376I52096K434K769L388M309N046M953M146L796M822O566P591P704Q077R348
58362A027045J0794J1722J2440J3266J3707J3455J3247J3701J4153J3598J2197
58351A169325J0864R821Q669P460O712O469O273O035O177O941Q131R565J1138
58338A273580J2542J3436J3886J4239J4575J4736J4794J5121J5936J7085J8189
58327A438119J8876J8932J8470J7837J7282J6859J6563J6312J5763J4631J3194
$$ y = [886791, 895501, 904694, 913765, 922163, 929513, 935692, 940930, 945500, 949069, 950766, 950297, 948598, 946849, 945154, 942777, 939417, 935575, 931736, 927862, 923752, 919447, 915244, 911727, 909687, 909559, 910971, 913278, 916405, 920577, 925302, 929380, 932150, 934206, 936596, 939674, 942917, 945539, 947071, 947634, 947879, 948558, 950015, 952096, 954530, 957299, 960687, 964996, 970042, 974995, 979141, 982937, 987759, 994325, 1001916, 1009620, 1017697, 1027045, 1037839, 1049561, 1062001, 1075267, 1088974, 1102429, 1115676, 1129377, 1143530, 1157128, 1169325, 1180189, 1190010, 1198679, 1206139, 1212851, 1219320, 1225593, 1231628, 1237805, 1244746, 1252877, 1262442, 1273580, 1286122, 1299558, 1313444, 1327683, 1342258, 1356994, 1371788, 1386909, 1402845, 1419930, 1438119, 1456995, 1475927, 1494397, 1512234, 1529516, 1546375, 1562938, 1579250, 1595013, 1609644, 1622838]
58316A622838J2149J1860J2106J2514J2852J2980J3047J3611J4926J6358J7236
58305A772477J7986J9429K1099K1626K0841K0150K0517K1409K2188K3147K4449
58294B005318K5343K5387K5373K6164K7486K8708K9875L1170L2229L2947L4075
58283B324075L6099L8310L9844M0958M2305M3768M4898M5908M7292M8978N0675
58272B803110N2439N4240N5676N6759N8197O0207O2037O3393O5322O8639P2589
58261C472608P6106P9441Q3296Q7279R0604R3553R6824J00048J02361J04053J06267
58250D492440J09364J12757J16127J19756J23962J29127J35898J44411J53680
58241E637522J62642J71382J80539J90153J99950K10226K21430K33398K45954
$$ y = [1622838, 1634987, 1646847, 1658953, 1671467, 1684319, 1697299, 1710346, 1723957, 1738883, 1755241, 1772477, 1790463, 1809892, 1830991, 1852617, 1873458, 1893608, 1914125, 1935534, 1957722, 1980869, 2005318, 2030661, 2056048, 2081421, 2107585, 2135071, 2163779, 2193654, 2224824, 2257053, 2290000, 2324075, 2360174, 2398484, 2438328, 2479286, 2521591, 2565359, 2610257, 2656165, 2703457, 2752435, 2803110, 2855549, 2909789, 2965465, 3022224, 3080421, 3140628, 3202665, 3266058, 3331380, 3400019, 3472608, 3548714, 3628155, 3711451, 3798730, 3889334, 3982887, 4079711, 4179759, 4282120, 4386173, 4492440, 4601804, 4714561, 4830688, 4950444, 5074406, 5203533, 5339431, 5483842, 5637522, 5800164, 5971546, 6152085, 6342238, 6542188, 6752414, 6973844, 7207242, 7453196]
58232G453196K59690K75254K92395L10575L30002L51269L74593M00142M28323
58223A0475439M59066M91655N26191N64318O07589O56052P09418P68684Q35510
58214A6093922R10884R95548J091102J199779J323831J466184J631119J823581
58206B6535950K048629K312657K625074K998540L448465L992975M652879N450324
58198E4065493O405793P534849Q848154J0356483J2074000J4008802J6141396
58191A29434970J8408653K0709885K2932666K4973996K6712329K7891134K7961136
58184B99024769K6072480K1412795J3797778M061145o168228j5188568k1879679
58177C21132492k5871869k7336965k6742435k4687548k1746103j8359380j4914399
$$ y = [7453196, 7712886, 7988140, 8280535, 8591110, 8921112, 9272381, 9646974, 10047116, 10475439, 10934505, 11426160, 11952351, 12516669, 13124258, 13780310, 14489728, 15258412, 16093922, 17004806, 18000354, 19091456, 20291235, 21615066, 23081250, 24712369, 26535950, 28584579, 30897236, 33522310, 36520850, 39969315, 43962290, 48615169, 54065493, 60471286, 68006135, 76854289, 87210772, 99284772, 113293574, 129434970, 147843623, 168553508, 191486174, 216460170, 243172499, 271063633, 299024769, 325097249, 346510044, 360307822, 364368967, 358200739, 343012171, 321132492, 295260623, 267923658, 241181223, 216493675, 194747572, 176388192, 161473793]
58170A61473793j1911094r909941r193408r503300j0197059j0682893j0700621
58163H9375477j0267937r496941q507640p427941o374981n417848m579801l868779
58155C3433609l285739k814159k426688k104117j836806j612970j419612j252726
58147A6680792j114757j002748r07836q25006p54956o97030o47296o03027n63199
58138I564937n25303m86674m48211m12429l79087l46639l16144k89581k65981
58129F094888k43547k24126k11177k04287j99624j94882j90100j84500j76415
58120D266230j66176j55840j46189j36649j27608j20109j13690j06997j00138
58111C092834r4201q9008q3609p8364p4373p1428o8571o6039o4571o3524o1740
$$ y = [161473793, 149562699, 139652758, 130459350, 120956050, 110758991, 100076098, 89375477, 79107540, 69610599, 61102959, 53675018, 47300037, 41882189, 37302388, 33433609, 30147870, 27333711, 24907023, 22802906, 20966100, 19353130, 17933518, 16680792, 15566035, 14563287, 13655451, 12830445, 12075489, 11378459, 10731163, 10128136, 9564937, 9039634, 8552960, 8104749, 7692320, 7313233, 6966594, 6650450, 6360869, 6094888, 5851341, 5627215, 5416038, 5211751, 5012127, 4817245, 4627145, 4442645, 4266230, 4100054, 3944214, 3798025, 3661376, 3533768, 3413659, 3299969, 3192972, 3092834, 2998633, 2909625, 2826016, 2747652, 2673279, 2601851, 2533280, 2467241, 2402670, 2339146, 2277406]
58100B277406n9644n8423n7703n6073n3381n0544m7699m4460m1393l9291l7534
58089A731261l5051l2379l0805l0014k8709k7071k6466k6951k7165k6621k6140
58078A413889k5964k5351k4198k3247k2605k1651k0608k0430k0904k0592j9065
58067A169274j7683j7564j8088j8016j6991j5451j3897j2746j2123j1557j0514
58056A004644r362q992r570j0408j1081j1733j2298j2412j2167j2077j2125j1674
58044H70745j0505r135q029p207o767o945p564q100q441q877r215q797p560o388
58030G57215o002o216o607p268q382r403r389q157o690o185o756p340o928n685
58016F56207m470l560k416q34M94Q38L25m27j026j303j144p73p48j191j500j240
$$ y = [2277406, 2217762, 2159339, 2101636, 2045563, 1992182, 1941638, 1893939, 1849479, 1808086, 1768795, 1731261, 1696210, 1663831, 1633026, 1603012, 1574303, 1547232, 1520766, 1493815, 1466650, 1440029, 1413889, 1387925, 1362574, 1338376, 1315129, 1292524, 1270873, 1250265, 1229835, 1208931, 1188339, 1169274, 1151591, 1134027, 1115939, 1097923, 1080932, 1065481, 1051584, 1038838, 1026715, 1015158, 1004644, 995282, 986290, 976720, 966312, 955231, 943498, 931200, 918788, 906621, 894544, 882419, 870745, 860240, 851105, 843076, 835869, 829102, 822157, 814593, 806493, 798052, 789175, 779960, 771163, 763603, 757215, 751213, 744997, 738390, 731122, 722740, 713337, 703948, 695791, 689101, 682916, 676160, 668820, 661892, 656207, 651737, 648177, 645761, 644927, 645421, 646259, 646584, 646157, 645131, 643828, 642684, 641911, 641163, 639972, 638472, 637232]
58000F37232p67o21q04j146j737k430k599j965j158q09p30o24r72k207l693m427
57984F10543m384m226m080l614l057l022l467l753l738l875m240m338l978l556
57970E57215l344l154k827k492k204j800j210n31J81Q34J104P34j5n27m00K93
57954E41857J039J000l51k408l797l974l822m180m549m077l146k885l461l909
57940E03337l543k615j631q85n95p85j058j026q23o66k31P72J763J854J063K13
57924D95144k03k92j14L30O69N38K94N36J073J195Q20M51J85l76j261k053k662
57907D94274l289l773l784l649m025m839n485n930o634p398p429o579n536m629
57893D21295l576k436j688j180k47R05J170L45k62L82J714K643K896K696K083
$$ y = [637232, 636465, 635844, 635040, 633894, 632157, 629727, 627128, 625163, 624005, 623196, 622466, 621842, 620870, 618663, 614970, 610543, 606159, 601933, 597853, 594239, 591182, 588160, 584693, 580940, 577202, 573327, 569087, 564749, 560771, 557215, 553871, 550717, 547890, 545398, 543194, 541394, 540184, 539653, 539834, 540668, 541772, 542506, 542491, 541964, 541564, 541857, 542896, 543896, 543545, 541137, 537340, 533366, 529544, 525364, 520815, 516738, 513592, 510707, 507246, 503337, 499794, 497179, 495548, 494663, 494068, 493283, 492225, 491199, 490376, 489710, 489479, 490251, 492014, 493868, 494931, 495144, 494941, 494649, 494535, 494865, 495534, 496072, 496366, 496902, 497975, 499170, 499990, 500441, 500626, 500250, 498989, 496936, 494274, 490985, 487212, 483428, 479779, 475754, 470915, 465430, 459500, 452866, 445468, 438039, 431460, 425924, 421295, 417719, 415283, 413595, 412415, 412168, 413073, 414243, 414588, 414326, 414708, 416422, 419065, 421961, 424657, 426740]
57878D26740J331J145J654J971J470P42N56O39L35k61o21p38q61q43n99p01j652
57861D30307k946l712l916m115m374m248l603k641j342K43J431J532J043J252
57847D04911K568M064M853N114N502O182O915P551Q023Q134P700O719N293L613
57833D87142K114J312J228J206N77o41j919k919l741m524n141n463n712o229o946
57818D50344p301o886n944n040m337l548k478j292k22O52J218J256P97K38j38
57803D17319n58j457k797m029m655m722m623m574m418m034l762m112n039n804
57789C62735n814n271m736m301l694k947k405k122j766j219o86k34K75P01O15
57774C29131M4k65L34J630K866L453L306K878K996M163N834O810O660O161O026
$$ y = [426740, 428071, 429216, 430870, 432841, 434311, 435053, 435609, 436248, 436583, 436322, 435701, 434963, 434102, 433259, 432660, 431959, 430307, 427361, 423649, 419733, 415618, 411244, 406996, 403393, 400752, 399410, 399653, 401084, 402616, 403659, 404911, 407479, 411543, 416396, 421510, 427012, 433194, 440109, 447660, 455683, 463817, 471517, 478236, 483529, 487142, 489256, 490568, 491796, 493002, 493579, 492938, 491019, 488100, 484359, 479835, 474694, 469231, 463519, 457290, 450344, 443043, 436157, 430213, 425173, 420836, 417288, 414810, 413518, 413296, 413948, 415166, 416422, 417219, 417457, 417319, 416761, 415304, 412507, 408478, 403823, 399101, 394478, 389904, 385486, 381452, 377690, 373578, 368539, 362735, 356921, 351650, 346914, 342613, 338919, 335972, 333567, 331445, 329679, 328460, 327774, 327540, 327815, 328516, 329131, 329175, 328910, 329244, 330874, 333740, 337193, 340499, 343377, 346373, 350536, 356370, 363180, 369840, 376001, 382027]
57759C82027N866N006L712K847K519K016R99J1m48o46j087j678j867j416o75p4
57743C97112L36P65J282J676J731J354N10p20j831k023j057K68Q92O80L67M48
57727D01790O88P41O04L49K9M4R17K403L414L264K423J682J209R00R44J369J567
57710D24337J067L80K33L74J00l48o2R46J540J179P96J390K554L099K677K109
57694D42371K284L232M196M371L626K562J790J204L17p95j418j197n02L91J879
57679D64311M234O846Q938J0766J3428J7528K2671K8235L4070M0292M6817N3369
57667G51505N9762O5992P1946P6555P6877O8546M8515J8291j5726m5642o6269
57656A110352p6694p8856p5393o8511n9844n0627m1783l3929k7275k1727j7153
$$ y = [382027, 387893, 392899, 396611, 399458, 401977, 403993, 404992, 405003, 404555, 403909, 402822, 401144, 399277, 397861, 397186, 397112, 397448, 398213, 399495, 401171, 402902, 404256, 404766, 404046, 402215, 400192, 399135, 399403, 400295, 400975, 401342, 401790, 402478, 403219, 403823, 404172, 404201, 404245, 405162, 407565, 410979, 414243, 416666, 418348, 419557, 420457, 421401, 422770, 424337, 425404, 425784, 426017, 426391, 426491, 426143, 426081, 427027, 428567, 429746, 430542, 431932, 434486, 437585, 440262, 442371, 444655, 447887, 452083, 456454, 460080, 462642, 464432, 465636, 465953, 465158, 463740, 462543, 462041, 462432, 464311, 468545, 475391, 484329, 495095, 508523, 526051, 548722, 576957, 611027, 651319, 698136, 751505, 811267, 877259, 949205, 1025760, 1102637, 1171183, 1219698, 1237989, 1222263, 1176621, 1110352, 1033658, 954802, 879409, 810898, 751054, 700427, 658644, 624715, 597440, 575713, 558560]
57645E58560j3574j0999r168p630o036m331k724j493p57k99L15J327K524L440
57631E09155L746L410K684J999J723J830J893J571R85M84K12Q0j4j82n43j004
57615E28029j174q45l50j22j00K8K11K10K59Q41J751K097J505P22O36J178J636
57598E36512J619J299R26N92L44J27k44q03j238j268j036r14j003j091r79o56
57582E32187k96j15j16L6N75J123J065N35L71R09J454J401J147J284J551J333
57566E44444Q57Q86J514K045K077J943K062K487L129L845M262M104L668L508L667
57551E84498L791L884M276M832M986M688M584M980N230M579L180J927J557K104
57537F39096L042L765M091M301M573M575L998L168K609K284J852J519J803K612
$$ y = [558560, 544986, 533987, 524819, 517189, 511153, 506822, 504098, 502605, 501848, 501549, 501864, 503191, 505715, 509155, 512901, 516311, 518995, 520994, 522717, 524547, 526440, 528011, 528996, 529480, 529692, 529772, 529758, 529576, 529033, 528029, 526855, 526010, 525660, 525538, 525438, 525466, 525677, 525887, 526146, 526987, 528738, 530835, 532340, 533062, 533698, 534876, 536512, 538131, 539430, 540356, 540948, 541292, 541419, 541175, 540372, 539134, 537866, 536830, 535916, 534913, 533822, 532843, 532187, 531891, 531776, 531660, 531696, 532271, 533394, 534459, 534994, 535365, 536274, 537728, 539129, 540276, 541560, 543111, 544444, 545301, 546187, 547701, 549746, 551823, 553766, 555828, 558315, 561444, 565289, 569551, 573655, 577323, 580831, 584498, 588289, 592173, 596449, 601281, 606267, 610955, 615539, 620519, 625749, 630328, 633508, 635435, 636992, 639096, 642138, 645903, 649994, 654295, 658868, 663443, 667441, 670609, 673218, 675502, 677354, 678873, 680676, 683288]
57523F83288L306L704M115M423M167L647L785M563M739L760K835L274M649N600
57509G39855N781N881O153O066N337M410L795L632L878M412M940N241N437N640
57495H10458N484M565L226K386K573L449M290M593M347M020M176M822N382N538
57481H69309N687O158O405N691M302L333L392M149N112O034O610O540O206O460
57467I45388P406Q003P369O011N167N342O044O793P679Q803R735R850R004P684
57453A050278O571O134O457P226P886Q036P822P797Q320R180R835R902R355Q456
57439A163255P685P520Q058Q877R521R937J0257J0301R770Q841Q135Q032Q359
57426A278548Q754R055R248R412R759J0384J0979J1108J0812J0526J0414J0246
$$ y = [683288, 686594, 690298, 694413, 698836, 703003, 706650, 710435, 714998, 719737, 723497, 726332, 729606, 734255, 739855, 745636, 751517, 757670, 763736, 769073, 773483, 777278, 780910, 784788, 789200, 794140, 799381, 804818, 810458, 815942, 820507, 823733, 826119, 828692, 832141, 836431, 841024, 845371, 849391, 853567, 858389, 863771, 869309, 874996, 881154, 887559, 893250, 897552, 900885, 904277, 908426, 913538, 919572, 926182, 932722, 938928, 945388, 952794, 960797, 968166, 974177, 979344, 984686, 990730, 997523, 1005202, 1014005, 1023740, 1033590, 1042594, 1050278, 1056849, 1062983, 1069440, 1076666, 1084552, 1092588, 1100410, 1108207, 1116527, 1125707, 1135542, 1145444, 1154799, 1163255, 1170940, 1178460, 1186518, 1195395, 1204916, 1214853, 1225110, 1235411, 1245181, 1254022, 1262157, 1270189, 1278548, 1287302, 1296357, 1305605, 1315017, 1324776, 1335160, 1346139, 1357247, 1368059, 1378585, 1388999, 1399245]
57414A399245R932R661R523R454R649J0337J1082J1048J0229R651J0027J0887
57402A520725J1490J1836J2230J2514J2457J2419J2831J3424J3662J3526J3294
57391A660408J2861J2094J1483J1665J2417J2937J2947J2851J2908J3029J3352
57380A798952J4250J5565J6503J6457J5553J4304J3192J2609J2717J3189J3450
57369A956741J3277J2928J2802J3195J4178J5303J5705J5002J3936J3557J4002
57358B110626J4655J5328J6430J7935J9044J9147J8531J7860J7369J6916J6411
57347B300252J5972J5791J5965J6306J6464J6425J6654J7326J7819J7620J7351
57336B483945J8060J9539K0394J9947J9061J8777J9009J9138J9126J9319J9659
$$ y = [1399245, 1409177, 1418838, 1428361, 1437815, 1447464, 1457801, 1468883, 1479931, 1490160, 1499811, 1509838, 1520725, 1532215, 1544051, 1556281, 1568795, 1581252, 1593671, 1606502, 1619926, 1633588, 1647114, 1660408, 1673269, 1685363, 1696846, 1708511, 1720928, 1733865, 1746812, 1759663, 1772571, 1785600, 1798952, 1813202, 1828767, 1845270, 1861727, 1877280, 1891584, 1904776, 1917385, 1930102, 1943291, 1956741, 1970018, 1982946, 1995748, 2008943, 2023121, 2038424, 2054129, 2069131, 2083067, 2096624, 2110626, 2125281, 2140609, 2157039, 2174974, 2194018, 2213165, 2231696, 2249556, 2266925, 2283841, 2300252, 2316224, 2332015, 2347980, 2364286, 2380750, 2397175, 2413829, 2431155, 2448974, 2466594, 2483945, 2502005, 2521544, 2541938, 2561885, 2580946, 2599723, 2618732, 2637870, 2656996, 2676315, 2695974]
57325B695974J9805J9719J9561J9191J8434J7660J7626J8664K0262K1526K1900
57314B910322K1525K1013K0846K0983K1129K1232K1395K1391K0827J9816J9028
57303C139507J8848J8930J8820J8621J8716J9188J9841K0496K0996K1114K0792
57292C355869K0302J9967J9866J9899J9990K0063K0123K0387K1057K1847K2094
57281C581464K1519K0558J9832J9567J9663J9946K0206K0375K0750K1599K2454
57270C807933K2394K1277K0035J9447J9262J8985J8773J8855J8720J7817J6637
57259D020135J6114J6226J6160J5813J5985J6908J7646J7359J6422J5709J5408
57248D199885J5155J4876J4796J4867J4788J4549J4465J4631J4716J4355J3578
$$ y = [2695974, 2715779, 2735498, 2755059, 2774250, 2792684, 2810344, 2827970, 2846634, 2866896, 2888422, 2910322, 2931847, 2952860, 2973706, 2994689, 3015818, 3037050, 3058445, 3079836, 3100663, 3120479, 3139507, 3158355, 3177285, 3196105, 3214726, 3233442, 3252630, 3272471, 3292967, 3313963, 3335077, 3355869, 3376171, 3396138, 3416004, 3435903, 3455893, 3475956, 3496079, 3516466, 3537523, 3559370, 3581464, 3602983, 3623541, 3643373, 3662940, 3682603, 3702549, 3722755, 3743130, 3763880, 3785479, 3807933, 3830327, 3851604, 3871639, 3891086, 3910348, 3929333, 3948106, 3966961, 3985681, 4003498, 4020135, 4036249, 4052475, 4068635, 4084448, 4100433, 4117341, 4134987, 4152346, 4168768, 4184477, 4199885, 4215040, 4229916, 4244712, 4259579, 4274367, 4288916, 4303381, 4318012, 4332728, 4347083, 4360661]
57237D360661J2748J2235J2052J1837J1298J0787J1070J2282J3454J3591J2953
57226D494968J2686J3263J3976J4141J3981J4014J4176J4229J4560J5709J7361
57215D653064J8589J9120J9488J9934J9903J9051J7925J7180J6679J5946J5028
57204D851907J4261J3551J2566J1430J0591J0119R725R301Q945Q503P706O658
57192D975263N629M440K719P44p17j422j886k430k828l098l809n115o242o507
57178D954741o306o415o800o918o885p431q681r791j0045r777r839j0500j1270
57165D844083j1660j1725j1857j2284j2953j3810j4872j5993j6882j7604j8753
57154D685690k0749k3111k4922k5925k6639k7358k7752k7690k7747k8328k8751
$$ y = [4360661, 4373409, 4385644, 4397696, 4409533, 4420831, 4431618, 4442688, 4454970, 4468424, 4482015, 4494968, 4507654, 4520917, 4534893, 4549034, 4563015, 4577029, 4591205, 4605434, 4619994, 4635703, 4653064, 4671653, 4690773, 4710261, 4730195, 4750098, 4769149, 4787074, 4804254, 4820933, 4836879, 4851907, 4866168, 4879719, 4892285, 4903715, 4914306, 4924425, 4934150, 4943451, 4952396, 4960899, 4968605, 4975263, 4980892, 4985332, 4988051, 4988795, 4988078, 4986656, 4984770, 4982340, 4979512, 4976414, 4972605, 4967490, 4961248, 4954741, 4948435, 4942020, 4935220, 4928302, 4921417, 4913986, 4905305, 4895514, 4885469, 4875692, 4865853, 4855353, 4844083, 4832423, 4820698, 4808841, 4796557, 4783604, 4769794, 4754922, 4738929, 4722047, 4704443, 4685690, 4664941, 4641830, 4616908, 4590983, 4564344, 4536986, 4509234, 4481544, 4453797, 4425469, 4396718]
57143D396718k7946k5841k3419k1439j9725j7857j5975j4557j3703j3094j2591
57132D190571j2515j3282j4857j6879j9136k1586k3850k5078k4731k3259k1552
57121C973846j9786j7349j3893r835n605r91M306R941J5265K0196K5377L1611
57109D013083L9566M9832O2746P8144R5722J15727J39120J67062K00576K40802
57099E202380K89271L47720M17538M99345N92807O96597Q08427R25209J043527
57090A0822821J160112J271569J373236J458662J521050J555492J559055J528352
57082B2250349J457845J341746J177692R68219P19421M39602J39652j66903m66153
57073B7861470p46840j000922j221376j400368j530456j607751j633922j615345
$$ y = [4396718, 4368772, 4342931, 4319512, 4298073, 4278348, 4260491, 4244516, 4229959, 4216256, 4203162, 4190571, 4178056, 4164774, 4149917, 4133038, 4113902, 4092316, 4068466, 4043388, 4018657, 3995398, 3973846, 3954060, 3936711, 3922818, 3912983, 3907378, 3906387, 3910693, 3920634, 3935899, 3956095, 3981472, 4013083, 4052649, 4102481, 4165227, 4243371, 4339093, 4454820, 4593940, 4761002, 4961578, 5202380, 5491651, 5839371, 6256909, 6756254, 7349061, 8045658, 8854085, 9779294, 10822821, 11982933, 13254502, 14627738, 16086400, 17607450, 19162942, 20721997, 22250349, 23708194, 25049940, 26227632, 27195851, 27915272, 28354874, 28494526, 28327623, 27861470, 27114630, 26113708, 24892332, 23491964, 21961508, 20353757, 18719835, 17104490]
57065A7104490j560649j478681j377749j265619j149409j035018r26360q25185
57057G485820p32022o47414n72093n06042m48064l96747l51519l12281k78489
57048C241149k49240k24014k02573j84151j67530j52024j37732j24786j13001
57039A686098j02330r2896q4356p6021o7906o0831n5091m9831m4233l8555l3343
57028I80705k8258k2493j5783q318j25Q868J8544K8961M0261N1675O1731P0532
57016A186300Q0276R1081R6570Q6555N5941J0296l7949p7894j04793j18861j22293
57005A145229j17621j07329r3877p9718o6864n6070m6804l8526l1639k6765k3453
56994D56563k0406j6948j3607j1173r702q652p552o268m847l375j977q08pK71
$$ y = [17104490, 15543841, 14065160, 12687411, 11421792, 10272383, 9237365, 8311005, 7485820, 6753798, 6106384, 5534291, 5028249, 4580185, 4183438, 3831919, 3519638, 3241149, 2991909, 2767895, 2565322, 2381171, 2213641, 2061617, 1923885, 1799099, 1686098, 1583768, 1490872, 1406516, 1330495, 1262589, 1201758, 1146667, 1096836, 1052603, 1014048, 980705, 952447, 929954, 914171, 905853, 905728, 914596, 933140, 962101, 1002362, 1054037, 1115768, 1186300, 1266576, 1357657, 1454227, 1540782, 1596723, 1607019, 1569070, 1491176, 1386383, 1267522, 1145229, 1027608, 920279, 826402, 746684, 679820, 623750, 576946, 538420, 506781, 480016, 456563, 436157, 419209, 405602, 394429, 384727, 376075, 368523, 362255, 357408, 354033, 352056, 351248, 351241, 351512]
56980C51512j52j412l450n821p840r073r665r972r996r478q477p392o309m804
56966B57671k654l42J519K914M253N679O995Q055Q849R323R469R418Q964P226
56952C37339L519j428n808q572j0274j1808j2959j2874j1504r756q198o403l818
56939B37456p61J827L374M170N037O695R258J2174J4587J5931J6010J4633J1462
56926C51853O492M43n565j0661j4448j6844j7970j8120j7536j6259j4355j2186
56914B14844j0187q497p027n819n030m582m227l813l295k507j337j91K42j84q27
56899A57563r50l74P14K115L593M835N792O800Q030R101R588R764J0381J1723
56885B38675J3204J3936J3467J1901R465O207K194k054n587p729q578q555p666
$$ y = [351512, 351360, 349948, 346498, 340677, 332837, 323764, 314099, 304127, 294131, 284653, 276176, 268784, 262475, 257671, 255017, 254675, 256194, 259108, 263361, 269040, 276035, 284090, 292939, 302262, 311731, 321149, 330113, 337339, 340858, 339430, 333622, 325050, 314776, 302968, 290009, 277135, 265631, 255875, 247677, 241274, 237456, 236695, 238522, 241896, 246066, 251103, 257798, 267056, 279230, 293817, 309748, 325758, 340391, 351853, 358345, 358788, 353223, 342562, 328114, 311270, 293300, 275180, 257644, 241385, 227030, 214844, 204657, 196160, 189133, 183314, 178284, 173702, 169475, 165662, 162367, 159860, 158523, 158332, 158574, 158390, 157563, 156613, 156239, 156953, 159068, 162661, 167496, 173288, 180088, 188118, 197219, 206807, 216571, 226952, 238675, 251879, 265815, 279282, 291183, 300648, 306855, 309049, 306995, 301408, 293679, 285101, 276546, 268880]
56872B68880n688k995m66J636M051P416J1299J4897J8107K1328K4442K6797K8175
56859D17879K9093K9935L0118K8220K2910J4012L066p310j5065j9803k2164k2508
56847D88383k0731j7112j2545p791k970K080P346J2746J8307K4014K9757L5420
56835E56904M0835M5565M8966N0490M9510M4974L5673K1315L318j5474l1839m3395
56823H06842m9485n1136m9959m6903m2135l5864k8741k1380j4028o825k0O312
56811D66678J2428J8470K4106K8798L2259L4349L4632L2159K5856J5372J848j2259
56799G14696k4482l3623l9662m2742m2818m0317l6249l1397k5858j9789j4027
56788C63732r394n719k118J853N847R435J2555J5191J6972J7308J5773J2255O938
$$ y = [268880, 263192, 260197, 259731, 261367, 265418, 272834, 284133, 299030, 317137, 338465, 362907, 389704, 417879, 446972, 476907, 507025, 535245, 558155, 572167, 575233, 567923, 552858, 533055, 510891, 488383, 467652, 450540, 437995, 430204, 427234, 429314, 436660, 449406, 467713, 491727, 521484, 556904, 597739, 643304, 692270, 742760, 792270, 837244, 872917, 894232, 897550, 882076, 850237, 806842, 757357, 706221, 656262, 609359, 567224, 531360, 502619, 481239, 467211, 460386, 460366, 466678, 479106, 497576, 521682, 550480, 582739, 617088, 651720, 683879, 709735, 725107, 726955, 714696, 690214, 656591, 616929, 574187, 531369, 491052, 454803, 423406, 397548, 377759, 363732, 354338, 348619, 346501, 348354, 354201, 363636, 376191, 391382, 408354, 425662, 441435, 453690, 460628]
56775D60628K90p026j4226k0410k4743k6898k7247k6419k4772k2459j9877j7559
56763B29282j5580j3504j1136r008p761p295o942o327n646n058m379l527k883
56750A30236k764k860k693k421k598l131l131k111p36Kk1k18k80m25p13p91m32
56733A04913P2K96J22k92o67o22J14J237J914J544L94p15j213j051l67P58K093
56716A08530L029K888J597J3o89j00R71J330N85n97j312j228o10N4L30K8o06j055
56698A13158j051q25o82n50k19J57J30l99r46j024o80l07n7K27N84O93K54o08
56680A07855j418j754j481p55M7N09N01K65L8k66p63j161r94k98L68O66Q64J291
56662A03514J770J888J544R77M56J75K92P42J181J403J637K166K723K734K105
$$ y = [460628, 460918, 453892, 439666, 419256, 394513, 367615, 340368, 313949, 289177, 266718, 246841, 229282, 213702, 200198, 189062, 180054, 172293, 164998, 158056, 151729, 146083, 141025, 136646, 133119, 130236, 127472, 124612, 121919, 119498, 116900, 113769, 110638, 108527, 107791, 107793, 107772, 107554, 107274, 106849, 106136, 105345, 104913, 104985, 105281, 105403, 105111, 104444, 103822, 103936, 105173, 107087, 108631, 109025, 108310, 107097, 106046, 105679, 106437, 108530, 111559, 114447, 116044, 116057, 115368, 115268, 116239, 117569, 118154, 117557, 116245, 115017, 114407, 114461, 114791, 114819, 114213, 113158, 112107, 111282, 110600, 110050, 109831, 109988, 110118, 109719, 108773, 107749, 107069, 106762, 106705, 106932, 107516, 108209, 108463, 107855, 106437, 104683, 103202, 102447, 102494, 103003, 103504, 103769, 103807, 103541, 102778, 101617, 100623, 100325, 100693, 101359, 102223, 103514, 105284, 107172, 108716, 109693, 110149, 110324, 110616, 111358, 112539, 113942, 115579, 117745, 120468, 123202, 125307]
56647A25307J454J395J820K083J783J226J029J401J943K200K215K254K200J619
56633A49929M72o23j078r82q56r56j004n29N91J788K117J172l49j342j486j301
56617A45563j204j194j387j946k299j457M67J924J847J027Q09J197J227O65J56
56602A45395K2k0j4L97J211J922K183K016J498Q25N37R51J542J567J114Q28Q08
56585A62782O30L18K99N68P62J018J778K683K779J916J009P18Q16J009J328J491
56569A81904R49k2k77O37J806K345K561L126L994M780N469O108O380O219O170
56554B32149O523O607N683M000K404J311P01N88Q44R42N32J3j05k8l77j250k154
56537B58383k610k456j849j266j216j620j920k005k444l438m257m281l951l933
$$ y = [125307, 126761, 128156, 129976, 132059, 133842, 135068, 136097, 137498, 139441, 141641, 143856, 146110, 148310, 149929, 150401, 149778, 148700, 147718, 146862, 145906, 144902, 144373, 144964, 146752, 148869, 150041, 149692, 148350, 146864, 145563, 144359, 143165, 141778, 139832, 137533, 136076, 136543, 138467, 140314, 141341, 142150, 143347, 144574, 145239, 145395, 145417, 145397, 145383, 145780, 146991, 148913, 151096, 153112, 154610, 155435, 155972, 156923, 158465, 160032, 161146, 161974, 162782, 163412, 163730, 164029, 164597, 165359, 166377, 168155, 170838, 173617, 175533, 176542, 177260, 178076, 179085, 180413, 181904, 182853, 182831, 182554, 183191, 184997, 187342, 189903, 193029, 197023, 201803, 207272, 213380, 219760, 225979, 232149, 238672, 245279, 250962, 254962, 257366, 258677, 259378, 259966, 260810, 261752, 262284, 262297, 262192, 262164, 261787, 260537, 258383, 255773, 253317, 251468, 250202, 248986, 247366, 245446, 243441, 240997, 237559, 233302, 229021, 225070, 221137]
56523B21137l963l372k358j825k172k947l584l812l447k536j595j208j430j913
56509A84975k422k751k552j768j011q17q48n24j07l37j094j360o34M35J027J095
56493A71307R92Q01M23Nj98j97k34l85m80l56j39r2j75R1J034K182K629K054J039
56474A80301K56j56k59N9P55J352J418J077O78L48J97N03J267J935K041J821J785
56457A95378J988K202K400K577K393J578N02k02l76k78o1J98K13k14p54r40p86
56440B05818n85l12J74N23J44r26j891k008j255k01M73M24j34p66j379k141k758
56423A93200k473j139K87Q49P45P95J261J801K131K050J292M7p27l74M70O88J96
56406B01099j98j56n3o7P4M04O25P24Q85Q84L48m19o62k35L11O90J112J517J546
$$ y = [221137, 217174, 213802, 211444, 209619, 207447, 204500, 200916, 197104, 193657, 191121, 189526, 188318, 186888, 184975, 182553, 179802, 177250, 175482, 174471, 173654, 172806, 172282, 172175, 171838, 170744, 169384, 168750, 169185, 170212, 171307, 172299, 173100, 173523, 173528, 173330, 173133, 172899, 172514, 172034, 171678, 171539, 171447, 171272, 171363, 172397, 174579, 177208, 179262, 180301, 180557, 180401, 180142, 180201, 180956, 182308, 183726, 184803, 185481, 185829, 186026, 186529, 187796, 189731, 191772, 193593, 195378, 197366, 199568, 201968, 204545, 206938, 208516, 209018, 208816, 208440, 208162, 208101, 208299, 208512, 208298, 207544, 206604, 205818, 205233, 204921, 205095, 205618, 205762, 204836, 202945, 200937, 199682, 199481, 199954, 200378, 200244, 199478, 198099, 195958, 193200, 190727, 189588, 189875, 190724, 191469, 192264, 193525, 195326, 197457, 199507, 200799, 200846, 200119, 199745, 200215, 200903, 201099, 200901, 200745, 200692, 200625, 200699, 201103, 201728, 202452, 203337, 204221, 204569, 204150, 203488, 203253, 203564, 204254, 205366, 206883, 208429]
56387B08429J356J613K395K968K954K915L358L835L568K532J465J056J425K118
56373B41987K454K086J290N50J1k83J6J090K204K292J332L92J52J55j97o68o67
56356B54196j73L07M15K11K5K43R77J793K020J525Q28M15K09r9n73r90j104p99
56338B59426j66N42J146J706K319K874L190L192K894K388K021K156K551K518J952
56323B90709J608J861K013J467Q16Q53J149P95P8O2P61J036M05k98k74K50O81
56306C03972P87N84L04N43J623K756K820J956J452J939K736L081K905K232J057
56291C30747O9L14J569K252J498K68k09rJ60K41N72J146J869K846L776L807K792
56274C53708J958K419L693M515M650M932N832O946P731Q019P893P603P526P694
$$ y = [208429, 209785, 211398, 213793, 216761, 219715, 222630, 225988, 229823, 233391, 235923, 237388, 238444, 239869, 241987, 244441, 246527, 247817, 248367, 248378, 248095, 248111, 249201, 251405, 253697, 255029, 255421, 255573, 255728, 255531, 254863, 254196, 254023, 254330, 254745, 254956, 254981, 255224, 256201, 257994, 260014, 261539, 262367, 262782, 262991, 262892, 262319, 261329, 260225, 259426, 259260, 259802, 260948, 262654, 264973, 267847, 271037, 274229, 277123, 279511, 281532, 283688, 286239, 288757, 290709, 292317, 294178, 296191, 297658, 298474, 299327, 300476, 301271, 301349, 301411, 302172, 303208, 303613, 303315, 303041, 303291, 303972, 304759, 305343, 305647, 306190, 307813, 310569, 313389, 315345, 316797, 318736, 321472, 324553, 327458, 329690, 330747, 330816, 331130, 332699, 334951, 336449, 336717, 336508, 336499, 336659, 336900, 337472, 338618, 340487, 343333, 347109, 350916, 353708, 355666, 358085, 361778, 366293, 370943, 375875, 381707, 388653, 396384, 404403, 412296, 419899, 427425, 435119]
56260D35119P566O728N650N273N922P034P931Q523R257J0523J2178J3752J5150
56247E50606J6909J9418K2183K4459K6371K8679L1505L4142L6181L7957L9596
56236H68006M0522M0231L8908L6910L4305L1196K7771K3728J8376J1704M660j938
56224A174379q085j3879j8958k3130k6735k9834l1751l2029l1315l0654l0371
56213H97638l0116k9558k8534k6969k5092k3380k1966k0523j8893j7337j5933
56202F39337j4336j2401j0460q785p345o233n629n207m428l553l394l870l813
56189E49883k644j198l86n3L33P41J003J280J577J622J627K249L313L687K976
56174E66010K262K492L257L848M294M550L936K439J367J553K036J784J625K882
$$ y = [435119, 442685, 449413, 455063, 460336, 466258, 473292, 481223, 489746, 499003, 509526, 521704, 535456, 550606, 567515, 586933, 609116, 633575, 659946, 688625, 720130, 754272, 790453, 828410, 868006, 908528, 948759, 987667, 1024577, 1058882, 1090078, 1117849, 1141577, 1159953, 1171657, 1176317, 1174379, 1166294, 1152415, 1133457, 1110327, 1083592, 1053758, 1022007, 989978, 958663, 928009, 897638, 867522, 837964, 809430, 782461, 757369, 733989, 712023, 691500, 672607, 655270, 639337, 625001, 612600, 602140, 593355, 586010, 579777, 574148, 568941, 564513, 560960, 557566, 553696, 549883, 547239, 546041, 545655, 545602, 545935, 546676, 547679, 548959, 550536, 552158, 553785, 556034, 559347, 563034, 566010, 568272, 570764, 574021, 577869, 582163, 586713, 590649, 593088, 594455, 596008, 598044, 599828, 601453, 604335]
56160F04335N022O312O347O198O430O523O280O388P345Q758R853J0137R628R017
56146G08573R276J0567J1929J2586J2954J3736J4766J5529J6145J6885J7495J7947
56134H78388J9224K2204K6316L0499L4929M0647M7806N5488O3073P0720P8670
56123A367964Q6802R4586J00664J02961J00184R2959Q2849P0971N8417M7171L9103
56112B244631L4194L0764K7119K2129J4897N373m887j3627j9688k3342k5516k7678
56100B264369l1901l9655n0435o2220p2918q0795q4429q3499p9165p2771o4637
56089A541944n5006m5205l6608k9099k1913j5352j0281o492l097k4K253M020N894
56076A331034P516Q209Q522R582J1262J2515J3274J4409J5985J7199J7963J9023
$$ y = [604335, 609357, 615669, 622016, 628214, 634644, 641167, 647447, 653835, 661180, 669938, 679791, 689928, 699556, 708573, 717849, 728416, 740345, 752931, 765885, 779621, 794387, 809916, 826061, 842946, 860441, 878388, 897612, 919816, 946132, 976631, 1011560, 1052207, 1100013, 1155501, 1218574, 1289294, 1367964, 1454766, 1549352, 1650016, 1752977, 1853161, 1946120, 2028969, 2099940, 2158357, 2205528, 2244631, 2278825, 2309589, 2336708, 2358837, 2373734, 2379107, 2374220, 2360593, 2340905, 2317563, 2292047, 2264369, 2232468, 2192813, 2142378, 2080158, 2007240, 1926445, 1842016, 1758517, 1679352, 1606581, 1541944, 1486938, 1441733, 1405125, 1376026, 1354113, 1338761, 1328480, 1321988, 1318891, 1318867, 1321120, 1325140, 1331034, 1338550, 1346759, 1355281, 1364863, 1376125, 1388640, 1401914, 1416323, 1432308, 1449507, 1467470, 1486493]
56064A486493K0437K1523K2371K3912K6279K8347K9273K9347K9133K8745K8188
56053A774048K7548K6802K5985K5378K4989K4424K3852K4256K5884K7500K8269
56042B058935K9237L1555L4391L6259L7405L8998M0837M1945M2676M4224M6502
56031B482964M8448M9951N1532N2833N3454N4649N7876O2168O5244O6919O9013
56020C115051P2163P5132P7253P9256Q1593Q4095Q7239R1745R6856J01094J04619
56009D066096J08817J13867J18807J23728J29634J36373J42919J49425J56862
56000E246528J64992J72938J81268J91123K01809K11807K21566K32817K45721
55991G070569K59354K74177K91274L10025L29481L50959L76020M03177M30234
$$ y = [1486493, 1506930, 1528453, 1550824, 1574736, 1601015, 1629362, 1658635, 1687982, 1717115, 1745860, 1774048, 1801596, 1828398, 1854383, 1879761, 1904750, 1929174, 1953026, 1977282, 2003166, 2030666, 2058935, 2088172, 2119727, 2154118, 2190377, 2227782, 2266780, 2307617, 2349562, 2392238, 2436462, 2482964, 2531412, 2581363, 2632895, 2685728, 2739182, 2793831, 2851707, 2913875, 2979119, 3046038, 3115051, 3187214, 3262346, 3339599, 3418855, 3500448, 3584543, 3671782, 3763527, 3860383, 3961477, 4066096, 4174913, 4288780, 4407587, 4531315, 4660949, 4797322, 4940241, 5089666, 5246528, 5411520, 5584458, 5765726, 5956849, 6158658, 6370465, 6592031, 6824848, 7070569, 7329923, 7604100, 7895374, 8205399, 8534880, 8885839, 9261859, 9665036, 10095270]
55982A0095270M58671M91802N29761N70647O15425O66917P24948P87530Q56121
55973A5797092R34630J024107J123957J237577J370934J526452J704825J912215
55965B6631789K159091K453145K801362L218807L727450M346625N092673N985872
55957E6416814P046494Q284394R704514J1321853J3153891J5189885J7374227
55950A38492072J9619303K1824653K3884769K5672993K6957454K7246299K5729863
55943C09427406K1558361J4418592M971281n289409j4689046k2022879k6790133
55936B81584173k9053606k9206622k7802436k5424903k2578830j9635284j6837747
55929A11044745j4324992j2148324j0298939q744570p449378o373416n474931
$$ y = [10095270, 10553941, 11045743, 11575504, 12146151, 12761576, 13428493, 14153441, 14940971, 15797092, 16731722, 17755829, 18879786, 20117363, 21488297, 23014749, 24719574, 26631789, 28790880, 31244025, 34045387, 37264194, 40991644, 45338269, 50430942, 56416814, 63463308, 71747702, 81452216, 92774069, 105927960, 121117845, 138492072, 158111375, 179936028, 203820797, 229493790, 256451244, 283697543, 309427406, 330985767, 345404359, 350375640, 345086231, 330397185, 308374306, 281584173, 252530567, 223323945, 195521509, 170096606, 147517776, 127882492, 111044745, 96719753, 84571429, 74272490, 65527920, 58078542, 51705126, 46230195]
55922D6230195m721105m089684l559605l108981k722983k394765k116660j877538
55914B1638874j669591j490298j336145j200859j080961r76773q86632q05803
55906A2191812p32314o68163o13461n64613n19708m80430m47039m16275l86225
55897G363584l58752l35098l13136k91090k70327k52233k35379k17974k00642
55888D888953j84742j70109j55890j41866j27756j13048r8302q4841p2495n9628
55878C680276m5845l2764k1671j2579o067l977p690j7545l4057n7288q4331j09695
55866C246767j29171j41821j47981j47608j41453j31831j20952j09744r8792q8963
55856A988451q0456p2611o5190n8673n3102m7965m3364l9929l7527l5528l4190
$$ y = [46230195, 41509090, 37419406, 33859801, 30750820, 28027837, 25633072, 23516412, 21638874, 19969283, 18478985, 17142840, 15941981, 14861020, 13884247, 12997615, 12191812, 11459498, 10791335, 10177874, 9613261, 9093553, 8613123, 8166084, 7749809, 7363584, 7004832, 6669734, 6356598, 6065508, 5795181, 5542948, 5307569, 5089595, 4888953, 4704211, 4534102, 4378212, 4236346, 4108590, 3995542, 3897240, 3812399, 3739904, 3680276, 3634431, 3601667, 3579996, 3567417, 3561350, 3557373, 3549683, 3532138, 3498081, 3440793, 3356462, 3246767, 3117596, 2975775, 2827794, 2680186, 2538733, 2406902, 2285950, 2176206, 2077414, 1988451, 1907995, 1835384, 1770194, 1711521, 1658419, 1610454, 1567090, 1527161, 1489634, 1454106, 1419916]
55845A419916l4120l4474l3632l1622k9992k9189k8117k6484k5322k4759k3502
55834A098703k1263j9583j9349j9422j8644j7477j6653j5843j4775j4090j4066
55823I07538j3868j3039j2421j2658j3094j3148j3414j4322j4942j4405j3442
55812G58785j3275j3693j3506j2296j0666r141p730o381n201m295l741l422k831
55799F52607j516K03J465J833J484O26m60j078q14m53j142k685l856m279m673
55784F37262n212n135m226l341l173l832n741r365j3577j6028j5828j4432j3248
55771E24124j1927r766p232m975k706k06J659K045J375M99m41j474k136k325k839
55756D83675m079n149n237m964n305o123o824p594q706r476r175q412q203q263
$$ y = [1419916, 1385796, 1351322, 1317690, 1286068, 1256076, 1226887, 1198770, 1172286, 1146964, 1122205, 1098703, 1077440, 1057857, 1038508, 1019086, 1000442, 982965, 966312, 950469, 935694, 921604, 907538, 893670, 880631, 868210, 855552, 842458, 829310, 815896, 801574, 786632, 772227, 758785, 745510, 731817, 718311, 706015, 695349, 686208, 678478, 672097, 666896, 662601, 658860, 655438, 652607, 651091, 651294, 652759, 654592, 656076, 656702, 656242, 655164, 654350, 653897, 652755, 650070, 646214, 641935, 637262, 632050, 626915, 622689, 619348, 616175, 612343, 606602, 597237, 583660, 567632, 551804, 537372, 524124, 512197, 502431, 495199, 490224, 487518, 487312, 488971, 491016, 492391, 492890, 492449, 490975, 488839, 486514, 483675, 479596, 474447, 469210, 464246, 458941, 452818, 445994, 438400, 429694, 420218, 411043, 402631, 394428, 386165]
55742C86165p576o345n867o547p255o882n536m014k892k363k372k700l161l742
55728C18913m292m434m057l577l379l399l517l927m616n045m785m055l227k325
55714B64278j429r44r37p66n5O85R63J229K058L022L220K544J587O26m41j486
55698B74154k309l134m250n361o022o385o735o642n470l603k187j639j288o05
55684B18524M9J57j52m04m10k70n7K08L78K35k97j041j717k261k889l630l987
55667B02436l452k287j315r40q86r22j144j432j324o81J66J114K322L370L384
55652A98409K479J991K657L494L309K400J733J350O86r0l54k23l81r09j374j833
55636B13344k706l752m234m023l688l455l014k294j658j283j051j035j387j811
$$ y = [386165, 378589, 372244, 366377, 359830, 352575, 345693, 340157, 336143, 333251, 330888, 328516, 325816, 322655, 318913, 314621, 310187, 306130, 302553, 299174, 295775, 292258, 288331, 283715, 278670, 273885, 269830, 266603, 264278, 262849, 261905, 260968, 260202, 260147, 260832, 261795, 263024, 265082, 268104, 271324, 273868, 275455, 276081, 275640, 274154, 271845, 268711, 264461, 259100, 253078, 246693, 239958, 233316, 227846, 224243, 222056, 220417, 219129, 218524, 218573, 218730, 218578, 218174, 217764, 217494, 217437, 217645, 218023, 218258, 217961, 216920, 215203, 212942, 210053, 206423, 202436, 198984, 196697, 195382, 194442, 193556, 192634, 191490, 190058, 188734, 188053, 188219, 189333, 191655, 195025, 198409, 200888, 202879, 205536, 209030, 212339, 214739, 216472, 217822, 218508, 218418, 218064, 217841, 217460, 216551, 215177, 213344, 210638, 206886, 202652, 198629, 194941, 191486, 188472, 186178, 184520, 183237, 182186, 181151, 179764, 177953]
55622A77953j849j530j092l54Q63J909J857P97l72j195j837k161j849j374j640
55607A68126k471k674j898j256j620k379k534k096j687j472j274j153j192j162
55593A43258q98o24m75j64L92O34P6r14j581j658j354p98k4P56J316J701K021
55576A41664K129J877J475J326J680K580L884N162N901O038N956N755N000L502
55562A93929J856P33Kr22k178l390m289m883n111m908m563m508m737m824m611
55547A47596m441m579m721m347l380k260j420r01n02j96k43p95j560j998j846
55532A14407j282o36j77j58p12j552k061j932j526j380j530j554j231p68m18j42
55516I7348K18N75O42L42k2j35j09l53r52j434j305o19J71P81J231J526J557J374
$$ y = [177953, 176104, 174574, 173482, 173128, 173991, 175900, 177757, 178554, 178182, 176987, 175150, 172989, 171140, 169766, 168126, 165655, 162981, 161083, 159827, 158207, 155828, 153294, 151198, 149511, 148039, 146765, 145612, 144420, 143258, 142360, 141736, 141261, 141097, 141489, 142123, 142199, 141285, 139704, 138046, 136692, 135894, 135870, 136626, 137942, 139643, 141664, 143793, 145670, 147145, 148471, 150151, 152731, 156615, 161777, 167678, 173716, 179672, 185427, 190427, 193929, 195785, 196518, 196520, 195598, 193420, 190030, 185741, 180858, 175747, 170839, 166276, 161768, 157031, 152207, 147596, 143155, 138576, 133855, 129508, 126128, 123868, 122448, 121547, 121045, 120849, 120606, 119811, 118251, 116253, 114407, 113125, 112489, 112312, 112154, 111442, 109890, 107829, 105897, 104371, 102991, 101461, 99907, 98676, 97908, 97490, 97348, 97566, 98141, 98783, 99125, 99103, 98968, 98859, 98506, 97554, 96120, 94815, 94196, 94367, 95148, 96379, 97905, 99462, 100836]
55498A00836J200J219J444J782K000J747R77K69K51O72N49n54j880k395j958j210
55482A04949o85m30l03j14L87J235J912J741O97m49r44p59l34K1K33J94k29q56
55464A06266j188r12k74K56N88J013J561J691Q79n93j774k020j570j039o10o4
55448A02210N28O27jp29p33j07K49r8n01k49L17L80n7k08J97N19K86q6q3J02K2
55427A02585k22k67j45j25j52l6O3p6j72K32R89J519J706J962K405K575K095J156
55409A16092K28l95p09r39j369j912k009j428q11q63j237j006j60K91j48p75q43
55392A02007m91j42L01R64J365R77L0q06j260j436j359j012o49n66o90p88p92
55375I5653o29n8Q60J454J192M48ROq5n33j088j499j785j820j324l63N23Q79P48
$$ y = [100836, 102036, 103255, 104699, 106481, 108481, 110228, 111205, 111474, 111725, 112397, 112946, 112392, 110512, 108117, 106159, 104949, 104264, 103834, 103531, 103417, 103804, 105039, 106951, 108692, 109389, 108940, 107996, 107237, 106903, 106924, 107157, 107351, 107122, 106266, 105078, 104166, 103892, 104148, 104736, 105749, 107310, 109001, 109880, 109287, 107513, 105493, 103923, 102884, 102274, 102210, 102738, 103365, 103364, 102635, 101902, 101795, 102044, 101946, 101445, 101196, 101513, 101893, 101836, 101628, 101825, 102344, 102630, 102544, 102461, 102563, 102585, 102363, 102096, 101951, 101826, 101674, 101638, 101701, 101625, 101453, 101685, 102674, 104193, 105899, 107861, 110266, 112841, 114936, 116092, 116320, 115925, 115216, 114277, 112908, 110996, 108987, 107559, 106748, 105885, 104648, 103642, 103482, 103773, 103625, 102850, 102007, 101516, 101374, 101675, 102639, 104004, 104981, 105011, 104205, 102945, 101509, 100150, 99138, 98489, 97923, 97233, 96445, 95653, 95024, 94966, 95826, 97280, 98472, 98920, 98929, 98935, 98850, 98317, 97229, 95730, 93945, 92125, 90801, 90438, 90961, 91840, 92588]
55356I2588L83j11o68j070j068o18O0O26Q43P91P31P47O44L18l3k69n61r53r68
55337I1412j90R49J475J012J25m88o45m36N2N80P45M51Q1p2j24j68Q1P34J199
55318I6773P55l83j166q75J56J127J602J599J257P47K85p2n06j052j282p92J11
55301I8284O07L42k36n79o77o67l62M12J222J409R51M64L40L84L66L78M83M45
55283A03566J05l04n23o20p02o14k56O1l5l89m89k06J2k80r70j525j541j109o67
55264I3514n01m67l05p9n0j25J08P47J286J264Q61N90O55Q93J057Q88K22o95j180
55245I8683q73k70j52o19j118j208q94l21L35P32N96J16k49l45l22k12M3K37R5
55226I4254j66k8N31R38Q38M65J11k02l81j00O16J229J337J157J006P90L55j15
$$ y = [92588, 92971, 92860, 92192, 91122, 90054, 89436, 89496, 90122, 90965, 91756, 92487, 93234, 93878, 94196, 94163, 93894, 93333, 92380, 91412, 91222, 92171, 93646, 94658, 94783, 94295, 93650, 93214, 93266, 93846, 94591, 95042, 95123, 95051, 94927, 94759, 94840, 95574, 96773, 97528, 97145, 95979, 95104, 95260, 96387, 97989, 99588, 100845, 101592, 101877, 101805, 101299, 100247, 98965, 98173, 98284, 98891, 99233, 98997, 98418, 97741, 97074, 96712, 97124, 98346, 99755, 100706, 101170, 101510, 101894, 102260, 102638, 103121, 103566, 103671, 103367, 102844, 102224, 101522, 100908, 100652, 100713, 100678, 100289, 99800, 99594, 99606, 99326, 98356, 96831, 95290, 94181, 93514, 93013, 92546, 92241, 92162, 92112, 91987, 92095, 92842, 94128, 95392, 96253, 96843, 97498, 98391, 99448, 100336, 100558, 99863, 98683, 97810, 97540, 97388, 96769, 95651, 94443, 93549, 93228, 93563, 94295, 94891, 95007, 94758, 94413, 94091, 93879, 93922, 94159, 94254, 94088, 94060, 94591, 95529, 96367, 96832, 96943, 96741, 96360, 96260, 96876, 98105, 99442, 100599, 101605, 102395, 102750, 102635]
55208A02635l78m71l62K28J193J718J255M32K61O59O24k15j092j282r50n50q7
55191A03618N28R57Q74N05K77J70o9l27k62P5L00K75K11J38k35r73j657j805j339
55172A01261n18K70O13L62j4J88R60J421R07q7n91m08j34o0J86P92J239J010L57
55153A07754p4j35k71p71j298j267n07N44J215J184O52L2m81q43q63l20O03J256
55135A06410J163N08j29l49j74R6Q2m12j165j669j626j146m65K63Q29R54P29O43
55117A04542R23J100O52k11q12q66n87j08O26J370J609J205O19K79P3k48m93j63
55099A09510Q31J887K259J862J381J441J741J349rj369j588p22J05N3o89j414
55083A16628j618j199l74L55N06Q8l98m68J0Q21J488J416M38q28j544j571j423
$$ y = [102635, 102257, 101786, 101424, 101652, 102845, 104563, 105818, 106250, 106511, 107170, 107794, 107579, 106487, 105205, 104255, 103705, 103618, 104146, 105103, 105977, 106482, 106759, 106929, 106860, 106533, 106271, 106346, 106646, 106921, 107132, 107270, 107035, 106062, 104405, 102600, 101261, 100743, 101013, 101626, 101988, 101974, 102162, 103122, 104543, 105450, 105363, 104772, 104364, 104230, 104170, 104356, 105148, 106387, 107397, 107754, 107680, 107545, 107274, 106503, 105205, 103938, 103431, 103975, 105190, 106374, 107026, 107058, 106577, 105734, 104871, 104551, 105154, 106410, 107573, 108081, 107952, 107603, 107429, 107525, 107607, 107195, 106030, 104361, 102735, 101589, 101124, 101387, 102216, 103170, 103899, 104542, 105465, 106565, 107217, 107006, 106194, 105328, 104741, 104633, 105259, 106629, 108238, 109443, 110062, 110341, 110414, 110166, 109673, 109510, 110341, 112228, 114487, 116349, 117730, 119171, 120912, 122261, 122252, 120883, 119295, 118573, 118678, 118731, 118042, 116628, 115010, 113811, 113437, 113792, 114298, 114386, 113988, 113520, 113530, 114351, 115839, 117255, 117693, 116865, 115321, 113750, 112327]
55066A12327j356j082m30K74O75P45N21L9l34j24M11L63n44j335j046j5O94P40
55048A10523O02N18K00m29r36j030r46r79j060r78p12l69k0K68M45N47O37O51
55030A06932N05K99K40L59M98N08L23l5l71l73k3K18p7o64q86n52j76k73o91p96
55010A04965j73R51J850J905J176L58P0K71N07N61O01P57Q78P55L91J3j23M7L09
54991A16069M00L65M51O09M46j09m96k64K15K45k16n96n49k31J41N19Q27R97J148
54972A19971J305J109L57l38j85N79Q60K22o18r72j082j353j455p75O59K156K979
54955A23419K736J588L40j88j45m25j173j361l49Q96J076L61l9K92O53O04N37
54938A28822P91J109J189J034N82k98j201j296l72P81J299J095O08K40L35J148
$$ y = [112327, 110971, 109889, 109459, 109733, 110408, 111153, 111674, 111713, 111379, 111255, 111666, 112029, 111485, 110150, 109104, 109089, 109783, 110523, 111125, 111643, 111843, 111414, 110478, 109448, 108502, 107523, 106463, 105485, 104773, 104404, 104384, 104652, 105097, 105644, 106281, 106932, 107437, 107736, 107976, 108335, 108833, 109341, 109664, 109629, 109258, 108885, 108862, 109080, 109003, 108339, 107453, 106901, 106725, 106452, 105761, 104965, 104792, 105743, 107593, 109498, 110674, 111032, 111102, 111373, 111880, 112441, 113042, 113799, 114677, 115432, 115823, 115836, 115713, 115760, 116069, 116469, 116834, 117285, 117894, 118340, 118231, 117735, 117471, 117686, 117931, 117715, 117119, 116570, 116339, 116480, 116999, 117826, 118823, 119971, 121276, 122385, 122742, 122404, 122219, 122798, 123658, 123880, 123262, 122290, 121208, 119855, 118400, 117625, 118284, 120440, 123419, 126155, 127743, 128083, 127895, 127750, 127325, 126152, 124791, 124442, 125338, 126414, 126775, 126736, 127028, 127681, 128285, 128822, 129613, 130722, 131911, 132945, 133527, 133229, 132028, 130732, 130360, 131141, 132440, 133535, 134143, 134383, 134718, 135866]
54922A35866K484L762M732N710O848P679P743P270O877O858P097P229O620M643
54908B21418J424k004m713o621p896q245p494o358n763n603n038l914k965k649
54894A53579k613k507k437k332j734o50Q0j01n66l57N10J260J516J581J751K078
54878A49058K693L780N135O312P230Q128Q920R132Q536P422O066M444K627Q62
54864B30345r61l314o095q208q684p916p096o689o138n077m045l720l981m134
54850A54287l751k965k200j890k217k881l202k781j911j144o45k78o6j20k22j6
54834A27998L07P9q19j512j185j77M86M68L62O00P91M62j24l72k71l95j026j692
54816A23980j727r92KN84M78k1l34j69L15Q04J168J323J079M83O3L25R75J172
$$ y = [135866, 138350, 142112, 146844, 152554, 159402, 167081, 174824, 182094, 188971, 195829, 202926, 210155, 216775, 221418, 222842, 220838, 216125, 209504, 201608, 193363, 185869, 179511, 173748, 168145, 163107, 159193, 156228, 153579, 150966, 148459, 146022, 143690, 141956, 141306, 141386, 141285, 140719, 140362, 140872, 142132, 143648, 145229, 146980, 149058, 151751, 155531, 160666, 166978, 174208, 182336, 191256, 200388, 208924, 216346, 222412, 226856, 229483, 230345, 229384, 226070, 219975, 211767, 203083, 195167, 188071, 181382, 175244, 170167, 166122, 162402, 158421, 154287, 150536, 147571, 145371, 143481, 141264, 138383, 135181, 132400, 130489, 129345, 128700, 128422, 128356, 128236, 128014, 127998, 128305, 128384, 127565, 126053, 124868, 124691, 125177, 125645, 126007, 126607, 127398, 127860, 127736, 127364, 127093, 126698, 125672, 123980, 122253, 121261, 121263, 121847, 122325, 122304, 121970, 121801, 122116, 122920, 124088, 125411, 126490, 126973, 127036, 127361, 128336, 129508]
54798A29508N95j59m01j37J88L02J43l18q71r71k82P51J315J126O14L03L74P63
54780A32843J231J379R74L93L24R46J681J930J790J851K489L496M260M386M172
54765A64145M429N495O641O899O399O311P279Q557R010Q386P038M884J507k715
54751B44265o340q080q048p543p686q393q675p899o573n637n164m291k646j164
54737A56126r33j618j820q94L62R32P59M42L29L96N81Q43J071J242J550K142K902
54720A64412L691M576N568O390O757O769O628O184N057L187R27j328l346m941
54706B10531o014o741p362p746p469o406m999l834l179k982l013k945k511j823
54692A43507j259r78p89o15o72r56j033o81l77o34j132j198q88q36j129j146o43
$$ y = [129508, 130103, 129944, 129543, 129406, 129594, 129896, 130039, 129721, 128850, 127879, 127597, 128348, 129663, 130789, 131403, 131706, 132080, 132843, 134074, 135453, 136427, 136820, 137144, 138090, 139771, 141701, 143491, 145342, 147831, 151327, 155587, 159973, 164145, 168574, 174069, 180710, 187609, 194008, 200319, 207598, 216155, 225165, 233551, 240589, 245473, 246980, 244265, 237925, 229845, 221797, 214254, 206568, 198175, 189500, 181601, 175028, 169391, 164227, 159936, 157290, 156126, 155193, 153575, 151755, 150861, 151223, 152155, 152914, 153356, 153685, 154081, 154662, 155505, 156576, 157818, 159368, 161510, 164412, 168103, 172679, 178247, 184637, 191394, 198163, 204791, 210975, 216032, 219219, 220146, 218818, 215472, 210531, 204517, 197776, 190414, 182668, 175199, 168793, 163794, 159960, 156781, 153799, 150786, 147841, 145330, 143507, 142248, 141270, 140481, 139866, 139194, 138238, 137205, 136524, 136147, 135513, 134381, 133183, 132295, 131459, 130330, 129184, 128541]
54675A28541j78j19k8L86N53on81j61Q93J168J86r19j027m50j65l46l46K02R16
54656A28519J285J233J008P72M91J99J72O60J366J571R99L01J31J50m16j346j512
54639A35583n73M03M35p6j89J94N36P03R13J064R02O13M75K35m10r70p89k52l19
54620A38478r42j054l23K66k7o15o81m50o05j112j372j125n62J12P01R37Q16P14
54602A33156P21M50j49l95Q2N14Q3o74n88L16Q29L54l51m62j57K3O2J91K90J45
54582A34440q9j00J04L27M77M91J61n52j209j200m05N81Q90J19j212j973j472
54565A29378j76Q26J050R18Q78Q16N27K30K41M79O16N63M44L17J87P9q7n16j112
54546A35658j322p43L15J145J342R78L28j73m8O70J167O91m35j135q98k12K77
$$ y = [128541, 128363, 128244, 128216, 128602, 129155, 129149, 128568, 128407, 129300, 130468, 130654, 129735, 128708, 128258, 128093, 127747, 127401, 127603, 128519, 129804, 131037, 132045, 132817, 133308, 133507, 133679, 134339, 135705, 137276, 138275, 138576, 138707, 138857, 138441, 137095, 135583, 135010, 135413, 135848, 135772, 135583, 135777, 136313, 137016, 137929, 138993, 139895, 140508, 140983, 141218, 140808, 139838, 139049, 138797, 138478, 137536, 136482, 136159, 136425, 136398, 135783, 135102, 134652, 134047, 132935, 131563, 130438, 129876, 129988, 130689, 131626, 132442, 133156, 133877, 134327, 134178, 133783, 133865, 134379, 134462, 133788, 133200, 133516, 134345, 134699, 134348, 133886, 133729, 133752, 133814, 134005, 134295, 134440, 134351, 134251, 134355, 134682, 135159, 135650, 135811, 135259, 134050, 132850, 132445, 133026, 133916, 134035, 132823, 130850, 129378, 129202, 130028, 131078, 131996, 132874, 133690, 134217, 134447, 134688, 135167, 135783, 136346, 136790, 137107, 137294, 137373, 137286, 136770, 135658, 134336, 133593, 133908, 135053, 136395, 137373, 137701, 137528, 137480, 138150, 139317, 140008, 139573, 138438, 137540, 137328, 137605]
54529A37605M59M92M63N73J081J740J802R78nl24j37j61m70m56M2L73M9n12o69
54510A42923m94n49r63j226q83m7Q11J284J198O30q4n36n61l21l4J59Q3m31j169
54491A39790j514j136n54n18r35q87R0J222J436O45k71o31n31l46k10r8N1M61
54473A36064J272K003J809O85j06N58K120K949K354J240O68N69K60m02r71j136
54457A49936r51m99J12N74N92L02Q2j9k83p91j256j461j447j213o32J17N15L31
54439A44009O9L78J120J457Q91j11o55l99J75M23K48O8K14N85R06J048J005P12
54421A52143K19j54j36Q3R6j06j24J95N10N27L82K78J40q4j44J64N77P08O01N75
54401A56450O25M67P8k00j54L0P1q7k92l23k8N06Q90P65K35k10j17N61J373J498
$$ y = [137605, 138064, 138556, 139019, 139592, 140673, 142413, 144215, 145193, 145188, 144864, 144727, 144566, 144096, 143640, 143682, 144055, 144104, 143592, 142923, 142429, 141880, 140917, 139691, 138808, 138761, 139572, 140856, 142054, 142684, 142600, 142064, 141503, 141182, 141148, 141307, 141390, 140959, 139790, 138276, 137140, 136586, 136068, 135133, 134246, 134336, 135558, 136994, 137639, 137368, 136737, 136206, 135860, 135650, 135552, 135603, 136064, 137336, 139339, 141148, 141833, 141727, 142285, 144405, 147354, 149708, 150948, 151616, 152185, 152445, 152043, 151072, 149936, 148985, 148486, 148598, 149172, 149764, 150066, 150148, 150129, 149846, 149055, 147799, 146338, 144891, 143678, 143046, 143163, 143678, 144009, 144078, 144456, 145576, 147033, 147924, 147813, 147158, 146759, 146934, 147357, 147605, 147673, 147887, 148472, 149378, 150426, 151431, 152143, 152362, 152208, 152072, 152155, 152251, 152145, 152021, 152216, 152726, 153253, 153635, 153913, 154053, 153969, 153825, 153989, 154566, 155274, 155875, 156450, 157075, 157542, 157620, 157420, 157266, 157296, 157367, 157280, 156988, 156665, 156637, 157143, 158033, 158798, 159033, 158823, 158706, 159267, 160640, 162138]
54381A62138M03j314k111j150N12J083K06q73j256j393j775j807q70L35O34J36
54365A52898PO11J019N15m37j097j398j466r82J99J348J603J105O55M12j55j030
54348A53807j324o25J33j78j290j839j141M9O20L55j89m83m16m6M83Q57P75L29
54330A49877k5L8K91K13m03j115j191l87O74J071N92K8K49J129J621R51m90j565
54312A51558j564q30k64l53p68q97n71j30J71M82R38J190P11m64j598j965j485
54295A44161o53J01P01J196J364Q50k83j294j363m96M70Q42P52O72O52M46J83
54278A48301L06Q52J311J302J044R21R46Q41M85P5p0J86O20P79M41j07m50n05
54260A57278l81MO37R94N45l26o64l75m08j138j473l89J337J950J001k67p68p71
$$ y = [162138, 162541, 161227, 159116, 157966, 158478, 159561, 159767, 158894, 157638, 156245, 154470, 152663, 151793, 152128, 152762, 152898, 152905, 153516, 154535, 155050, 154613, 153516, 152118, 150652, 149670, 149869, 151217, 152820, 153925, 154580, 154992, 154837, 153807, 152483, 151858, 151991, 151813, 150523, 148684, 147543, 147592, 148212, 148567, 148378, 147895, 147479, 147433, 147916, 148773, 149548, 149877, 149852, 149890, 150181, 150394, 149991, 148876, 147685, 147298, 147972, 149043, 149635, 149663, 149912, 151041, 152662, 153613, 153123, 151558, 149994, 149164, 148900, 148547, 147779, 146882, 146311, 146181, 146352, 146834, 147772, 148962, 149673, 149209, 147611, 145646, 144161, 143508, 143609, 144310, 145506, 146870, 147720, 147437, 146143, 144780, 144284, 144754, 145596, 146348, 147020, 147672, 148118, 148301, 148607, 149459, 150770, 152072, 153116, 154037, 154983, 155824, 156309, 156384, 156314, 156500, 157120, 157899, 158340, 158233, 157783, 157278, 156897, 156901, 157538, 158532, 159077, 158751, 158087, 157712, 157304, 156166, 154693, 154304, 155641, 157591, 158592, 158325, 157557, 156786]
54242A56786j015j472j586j183n42J26P38J014O56q1m60p8O01Q37N69M97J137
54225A56544K114K606K230J293L67m1L72J339J828R41q65k055j802r44p58j377
54209A61792k025k269k285k152j737j185p97m97k2L91K39k87l42L78J145J197
54193A51544O63J73L3J51L42L78M4n41r69j095j242j623j943j831j275m28N85
54176A42966J370J333M65l58l85Ql9n64p23KJ163J918J794Q47m72j472j640j049
54158A45164k14M56Q19P26O9q13j206p52J22O82O50K97pj46k08k90m03m69l73
54139A44104n9L98Q06R74Q76O98O46P09P40O87N78L45j45p98j286j350r24l4J087
54120A48052J772J313q6j238j223m13J62N9l31n67n04p0P84J805K589K959K889
$$ y = [156786, 155771, 154299, 152713, 151530, 150988, 151114, 151852, 152866, 153522, 153441, 152981, 152903, 153504, 154341, 154910, 155407, 156544, 158658, 161264, 163494, 164787, 165154, 165113, 165485, 166824, 168652, 169593, 168728, 166673, 164871, 163927, 163169, 161792, 159767, 157498, 155213, 153061, 151324, 150139, 149342, 148845, 148823, 149214, 149453, 149166, 148824, 149202, 150347, 151544, 152207, 152380, 152413, 152564, 152906, 153284, 153328, 152787, 151818, 150723, 149481, 147858, 145915, 144084, 142809, 142381, 142966, 144336, 145669, 146134, 145776, 145391, 145399, 145360, 144796, 144073, 144075, 145238, 147156, 148950, 149797, 149325, 147853, 146213, 145164, 144950, 145406, 146225, 146951, 147020, 146207, 145001, 144249, 144371, 145053, 145703, 146000, 145993, 145847, 145639, 145349, 144946, 144477, 144104, 144045, 144443, 145249, 146223, 147099, 147797, 148443, 149152, 149892, 150579, 151157, 151502, 151357, 150559, 149273, 147923, 146999, 146965, 148052, 149824, 151137, 151051, 149813, 148590, 148177, 148339, 148398, 148067, 147500, 146996, 146926, 147710, 149515, 152104, 155063, 157952]
54103A57952K246J086L6k59o5k42r48j314p19L49J013J048P46K69k93o18m82k06
54085A59599k55n31n02M5P84J343J622J642J439J152R53Q49P88Q62J217J731K040
54068A74778J887J267L28o52j274j280q35l14J02M13M89J41m28o44k58K71L11
54051A74302j37m92l07K71Q68J419K097K832L192K990K722L026L829M441M544
54036B05597M527M723M877M799M982N815O633O418N391M902N575O403O207N201
54022B82050M456M317M175L632L032K734K501J877R04J15p2K04L77k9j000k144
54006C07129l153l986m633n001n138n259n354n075m321l595l370l375l081k691
53992B49097k901l711m201l782l016k711k779k566j958j472j359j286r77o25m95
$$ y = [157952, 160198, 161284, 161320, 161061, 160996, 160754, 159806, 158492, 157773, 158122, 159135, 160183, 160929, 161198, 160905, 160287, 159805, 159599, 159344, 158813, 158311, 158356, 159140, 160483, 162105, 163747, 165186, 166338, 167291, 168140, 168928, 169790, 171007, 172738, 174778, 176665, 177932, 178260, 177608, 176334, 175054, 174219, 173905, 174007, 174420, 174909, 175050, 174622, 173978, 173720, 173991, 174302, 174165, 173673, 173366, 173637, 174505, 175924, 178021, 180853, 184045, 187035, 189757, 192783, 196612, 201053, 205597, 210124, 214847, 219724, 224523, 229505, 235320, 241953, 248371, 253762, 258664, 264239, 270642, 276849, 282050, 286506, 290823, 294998, 298630, 301662, 304396, 306897, 308774, 309678, 309793, 309721, 309925, 310302, 310273, 309273, 307129, 303976, 299990, 295357, 290356, 285218, 279959, 274605, 269530, 265209, 261614, 258244, 254869, 251788, 249097, 246196, 242485, 238284, 234502, 231486, 228775, 225996, 223430, 221472, 220000, 218641, 217355, 216378, 215753, 215258]
53977B15258n27n89p45j053j349j500j644j854j782j077q6L66J7m37k41M74J000
53960B04231R98O89K95j02k20K64J024J193N80J77R04K222K700J790L85l95k35
53943B16500N33J481K189K401K350K515K843K702J884J096J076J635K081K179
53929B43465K183K268K502L118M202N260N664N466N233N213N264N537O458P875
53915C09708Q944R105Q696Q377Q390Q699R301J0002J0287R824Q846P687O323M714
53901D28903L304K581K311J719M52j092k347l076l267k980k506k370k838l609
53887D15185m176m493n028o146p533q436q476q040p773p745p453o600n575m949
53873C22762m743m547m153l769l647l818m193m689n138n279m975m323l487k636
$$ y = [215258, 214731, 214142, 213397, 212344, 210995, 209495, 207851, 205997, 204215, 203138, 203052, 203418, 203435, 202998, 202757, 203231, 204231, 205229, 205918, 206213, 206111, 205891, 206155, 207179, 208372, 208952, 209129, 210033, 212255, 214955, 216745, 217130, 216735, 216500, 217033, 218514, 220703, 223104, 225454, 227969, 230812, 233514, 235398, 236494, 237570, 239205, 241286, 243465, 245648, 247916, 250418, 253536, 257738, 262998, 268662, 274128, 279361, 284574, 289838, 295375, 301833, 309708, 318652, 327757, 336453, 344830, 353220, 361919, 371220, 381222, 391509, 401333, 410179, 417866, 424189, 428903, 432207, 434788, 437099, 438818, 439270, 438178, 435831, 432755, 429488, 426508, 424002, 421632, 418794, 415185, 411009, 406516, 401488, 395342, 387809, 379373, 370897, 362857, 355084, 347339, 339886, 333286, 327711, 322762, 318019, 313472, 309319, 305550, 301903, 298085, 293892, 289203, 284065, 278786, 273811, 269488, 266001, 263365]
53859B63365k086k206k929l540l318k482k072k716l766m006l115j938j313j147
53845B26731r92r49j434k233k543j989j094n16l44l28l30k50R1N96P55K96l11
53828B15156m15n8J46j12n44p02l33N70J646K162J693P86M05O84Q44M90K92R87
53810B23697K310L456M171M752N242N450N691O771Q902J1213J2784J3758J4939
53797C23136J6490J7574J7310J5580J2707Q860M231m23m035o136p201p946q547
53784C81600q746q380p553o455n307m414l959l744l411k956k759l028l488l765
53770C13635l866m044m343m509m436m406m715n167n246m778m216m027m069l877
53756B51936l399l037k930k721k185j656j518j623j556j248r24p63r02j518k394
$$ y = [263365, 261279, 259073, 256144, 252604, 249286, 246804, 244732, 242016, 238250, 234244, 231129, 229191, 227878, 226731, 225739, 224790, 223356, 221123, 218580, 216591, 215497, 214981, 214637, 214309, 213979, 213729, 213820, 214416, 215171, 215467, 215156, 214741, 214683, 214829, 214717, 214173, 213471, 213138, 213708, 215354, 217516, 219209, 219995, 220400, 221084, 221928, 222418, 222710, 223697, 226007, 229463, 233634, 238386, 243628, 249078, 254769, 261540, 270442, 281655, 294439, 308197, 323136, 339626, 357200, 374510, 390090, 402797, 411657, 415888, 415465, 411430, 405294, 398093, 390147, 381600, 372854, 364474, 356921, 350466, 345159, 340745, 336786, 333042, 329631, 326675, 323916, 320888, 317400, 313635, 309769, 305725, 301382, 296873, 292437, 288031, 283316, 278149, 272903, 268125, 263909, 259882, 255813, 251936, 248537, 245500, 242570, 239849, 237664, 236008, 234490, 232867, 231311, 230063, 229139, 228376, 227474, 225956, 223562]
53741B23562k767k163j189q41j139j196n52K84P96J031J030N30l23o73r3O69P13
53724B17679K86K85Q27J202J004N28J03k11k35K32Q55J001O42M35P54J317J908
53707B28612K662L335L192K135J163J068J290R61M21O50J540J952J506J099J359
53692B52945J697J436R39Q31Q85N50J05K66R14J138N59k50p17r26j135j362j592
53675B56283j876j933j319l29J5p13j583j495o32m8j61m44m44l30l31l45l76p41
53657B43198j500j992j414K53K038K772K068O31m13n54k19j4J1J05K09J00n7J52
53639B45374O93J041R33O72O20Q10J081J272J191Q91R59J908L218L649K800J670
53623B68782J329J684K077K412K937L371L184K605K481L049L562L338K696K536
$$ y = [223562, 220795, 218632, 217443, 216602, 215463, 214267, 213715, 213999, 214795, 215826, 216856, 217386, 217063, 216390, 216297, 216966, 217679, 217965, 218250, 219077, 220279, 221283, 221811, 221914, 221703, 221468, 221700, 222555, 223556, 224198, 224633, 225387, 226704, 228612, 231274, 234609, 237801, 239936, 241099, 242167, 243457, 244418, 244839, 245489, 247029, 248981, 250487, 251586, 252945, 254642, 256078, 257017, 257848, 258733, 259283, 259388, 259654, 260568, 261706, 262265, 262015, 261298, 260372, 259237, 257875, 256283, 254407, 252474, 251155, 250826, 250841, 250128, 248545, 247050, 246418, 246370, 246209, 245765, 245321, 244991, 244660, 244315, 243939, 243198, 241698, 239706, 238292, 238545, 240583, 243355, 245423, 246054, 245641, 245087, 244868, 244854, 244865, 244970, 245179, 245279, 245222, 245374, 246067, 247108, 248041, 248713, 249333, 250143, 251224, 252496, 253687, 254578, 255537, 257445, 260663, 264312, 267112, 268782, 270111, 271795, 273872, 276284, 279221, 282592, 285776, 288381, 290862, 293911, 297473, 300811, 303507, 306043]
53609C06043L262M415N199N238M860M648M804N039N177N429N971O556O951P416
53595C81008Q344R600J0659J1224J1218J0284P963M389M07l189o160q590j0524
53582D26633j1953j2823j2970j2265j0884r204p485n913m803m363m339m295m203
53569C21133m272m270l665k495j573j490j940k244k091j496n49M48R28O17r2n42
53553B96407m11K38J106J673J439N92M6M54J398K006K056K058K427L060L636L892
53537C22077L679L184L038L802N277O593P118P040P048P568Q376Q908Q980R179
53523D11867J0265J2071J3437J3489J2666J2104J2316J2981J3775J4813J6223
53512E56007J7804J9189K0019K0098J9694J9565K0170K1004K1289K1140K1296
$$ y = [306043, 309305, 313720, 318919, 324157, 329017, 333665, 338469, 343508, 348685, 354114, 360085, 366641, 373592, 381008, 389352, 398952, 409611, 420835, 432053, 442337, 450300, 454689, 455096, 451907, 445747, 437157, 426633, 414680, 401857, 388887, 376622, 365738, 356534, 349049, 343136, 338333, 333970, 329631, 325336, 321133, 316861, 312591, 308926, 306431, 304858, 303368, 301428, 299184, 297093, 295597, 295048, 295496, 296424, 297041, 296949, 296407, 295996, 296234, 297340, 299013, 300452, 301044, 301090, 301544, 302942, 304948, 307004, 309062, 311489, 314549, 318185, 322077, 325756, 328940, 331978, 335780, 341057, 347650, 354768, 361808, 368856, 376424, 384800, 393708, 402688, 411867, 422132, 434203, 447640, 461129, 473795, 485899, 498215, 511196, 524971, 539784, 556007, 573811, 593000, 613019, 633117, 652811, 672376, 692546, 713550, 734839, 755979, 777275]
53501G77275K1741K1490K0130J8563J7714J7212J6197J4838J4093J4178J4311
53490I67742J3994J3718J4135J5106J5993J6392J6272J5698J4823J3978J3438
53479A131289J3168J2888J2339J1330R731P578N154K780O31j216k758m169n789
53466A192956p730r667j1213j2422j3641j4938j6035j6846j7660j8617j9324j9350
53454A015513j8870j8508j8557j8812j9020j9182j9244j8924j8053j6830j5515
53443H13998j4154j2844j1922j1499j1049r975q460p136n999m375k149l04K91
53430G14423J28L84J476K932M504O444Q598J0150J0729J1115J2283J4204J6136
53417H13506J7757J9319K0886K2186K3229K4444K5982K7443K8527K9484L0649
$$ y = [777275, 799016, 820506, 840636, 859199, 876913, 894125, 910322, 925160, 939253, 953431, 967742, 981736, 995454, 1009589, 1024695, 1040688, 1057080, 1073352, 1089050, 1103873, 1117851, 1131289, 1144457, 1157345, 1169684, 1181014, 1190745, 1198323, 1203477, 1206257, 1206888, 1205672, 1202914, 1198745, 1192956, 1185226, 1175559, 1164346, 1151924, 1138283, 1123345, 1107310, 1090464, 1072804, 1054187, 1034863, 1015513, 996643, 978135, 959578, 940766, 921746, 902564, 883320, 864396, 846343, 829513, 813998, 799844, 787000, 775078, 763579, 752530, 742555, 734095, 726959, 720960, 716585, 714436, 714132, 714423, 714551, 714935, 716411, 719343, 723847, 730291, 738889, 749039, 759768, 770883, 783166, 797370, 813506, 831263, 850582, 871468, 893654, 916883, 941327, 967309, 994752, 1023279, 1052763, 1083412]
53406A083412L1977L3376L5031L6932L8503L9340M0097M1834M4462M6624M7402
53395A518990M7433M7893M8939M9823N0187N0420N0772N0861N0265M9083M7558
53384B062224M5588M2969L9816L6396L2736K8784K4794K1096J7545J3566Q866
53373B374380L773j152n564r329j2430j5135j8018k1545k5763l0481l5517m0479
53361B162740m4602m7260m8665m9603n0528n1175n1150n0482m9441m8193m6884
53350A624757m5766m4919m4053m2933m1840m1228m1025m0660l9867l8973l8246
53339A165247l7323l5679l3476l1516l0270k9241k7496k4760k1796j9631j8511
53328H55548j7752j6557j4768j2809j1085r724q697p867o940n651m133k807j792
$$ y = [1083412, 1115389, 1148765, 1183796, 1220728, 1259231, 1298571, 1338668, 1380502, 1424964, 1471588, 1518990, 1566423, 1614316, 1663255, 1713078, 1763265, 1813685, 1864457, 1915318, 1965583, 2014666, 2062224, 2107812, 2150781, 2190597, 2226993, 2259729, 2288513, 2313307, 2334403, 2351948, 2365514, 2374380, 2378153, 2377001, 2371437, 2362108, 2349678, 2334543, 2316525, 2294980, 2269217, 2238736, 2203219, 2162740, 2118138, 2070878, 2022213, 1972610, 1922082, 1870907, 1819757, 1769275, 1719834, 1671641, 1624757, 1578991, 1534072, 1490019, 1447086, 1405246, 1364018, 1322993, 1282333, 1242466, 1203493, 1165247, 1127924, 1092245, 1058769, 1027253, 996983, 967742, 940246, 915486, 893690, 874059, 855548, 837796, 821239, 806471, 793662, 782577, 772853, 764156, 756289, 749349, 743698, 739565, 736758, 734966]
53315G34966o90Q36K515L774M462M959N640O564P684R048J0649J2295J3798J5144
53301H31644J6413J7660J8978K0508K2158K3477K4059K4068K4110K4560K5208
53290A072843K5688K5997K6297K6313K5325K2950J9770J6935J5133J4108J3037
53279A304396J1216Q401M905J527r33k470m071o724j0159j2988j4244j4495j5138
53266A249223j6876j9202k1246k2596k3287k3495k3518k3766k4338k4862k5036
53255A001001k5229k6055k7410k8368k8243k7400k6739k6595k6487k5837k4625
53244G08013k3365k2591k2413k2443k2196k1554k0797k0070j9113j7659j5946
53233D79866j4487j3441j2530j1491j0307r037p831p071p042p340p105o144n378
$$ y = [734966, 734276, 735112, 737627, 741401, 745863, 750822, 756462, 763026, 770710, 779758, 790407, 802702, 816500, 831644, 848057, 865717, 884695, 905203, 927361, 950838, 974897, 998965, 1023075, 1047635, 1072843, 1098531, 1124528, 1150825, 1177138, 1202463, 1225413, 1245183, 1262118, 1277251, 1291359, 1304396, 1315612, 1324013, 1328918, 1330445, 1329512, 1327042, 1322971, 1316247, 1306088, 1293100, 1278856, 1264361, 1249223, 1232347, 1213145, 1191899, 1169303, 1146016, 1122521, 1099003, 1075237, 1050899, 1026037, 1001001, 975772, 949717, 922307, 893939, 865696, 838296, 811557, 784962, 758475, 732638, 708013, 684648, 662057, 639644, 617201, 595005, 573451, 552654, 532584, 513471, 495812, 479866, 465379, 451938, 439408, 427917, 417610, 408573, 400742, 393671, 386629, 379289, 372184, 366040, 360662]
53220C60662n720o826p473p038o132n724o064o579o604n990n161m596m297l845
53206B78613l062k414k474l151l757l780l261k492j768j407j565j909j854j353
53192B44366j002j163j427j271r33j044j632k060j925j491j149r96j065j491k076
53177B23641k148j391n63p60j912k671k053p38j38n25q09j85P62J044P38O83J024
53160B13999R59R7p62o95O0M41l7q15j109o89J38Q54J014N88J16K01P81J211J120
53141B17472P77N49M42L95N56R60J303J424J639K187K662K505J845J250P97N7
53125B36820r74j590j323o00q4J91N90J089J207O86j29n65j86Q27J667J537M61
53108B39624o77j169j223j412j674j466p47j53j26m42q08j299j863j926j121q0
$$ y = [360662, 354942, 348116, 340643, 333605, 327473, 321749, 315685, 309106, 302502, 296512, 291351, 286755, 282458, 278613, 275551, 273137, 270663, 267512, 263755, 259975, 256714, 254222, 252454, 251047, 249482, 247573, 245719, 244366, 243364, 242201, 240774, 239503, 238570, 237526, 235894, 233834, 231909, 230418, 229269, 228273, 227208, 225717, 223641, 221493, 220102, 219539, 218779, 216867, 214196, 212143, 211405, 211267, 210742, 209933, 209748, 210510, 211554, 212292, 212975, 213999, 214958, 215055, 214293, 213598, 213658, 214099, 214062, 213247, 212138, 211449, 211587, 212441, 213455, 214043, 214159, 214360, 215141, 216352, 217472, 218249, 218798, 219240, 219635, 220191, 221151, 222454, 223878, 225517, 227704, 230366, 232871, 234716, 235966, 236763, 236820, 235846, 234256, 232933, 232333, 232249, 232440, 233030, 234119, 235326, 236012, 235883, 235318, 235132, 235959, 237626, 239163, 239624, 238947, 237778, 236555, 235143, 233469, 232003, 231256, 231103, 230977, 230535, 229727, 228428, 226565, 224639, 223518, 223438]
53092B23438J60m85j028p99l20m58j115j372p94p2j30r75j707j539n56M70P97
53075B13515K40p74j601j865j683j357j009n41M4N25N92P1q92j745j863j290r01
53058A99466j283j714j035M57J021j60j697j892j039o82j109j139k40O03N85K75
53042A90417M83R55J005O38K24k31p28q10l22j06r01j987k018r59j16k52p02o15
53024A83975m7M94P68P19K62m12p72n60m2N08J070J475J334O91K31L94P66P34
53006A91588K98j49m71o87o07j09M45N36J55k66m09k78k8J12p0m74o75m79k12
52987A88220j01K31J116K029K030R53m36j413j849j828j338n67O7L88O31R05R40
52970A89978N94J93J12K60L28K92L48N11O13O15O46P58Q37P73N67K57j36n64r88
$$ y = [223438, 223598, 223113, 222085, 221286, 220966, 220508, 219393, 218021, 217227, 217155, 217025, 216050, 214343, 212804, 212248, 212718, 213515, 213755, 212981, 211380, 209515, 207832, 206475, 205466, 204925, 204969, 205494, 206086, 206157, 205265, 203520, 201657, 200367, 199466, 198183, 196469, 195434, 195891, 196912, 196752, 195055, 193163, 192124, 191442, 190333, 189194, 188954, 189557, 190142, 190417, 190900, 191855, 192860, 193498, 193722, 193491, 192763, 191953, 191631, 191525, 190624, 188637, 186619, 185660, 185544, 185292, 184590, 183975, 183928, 184422, 185190, 185909, 186171, 185759, 184987, 184427, 184385, 184893, 185963, 187438, 188772, 189463, 189694, 190088, 190854, 191588, 191886, 191737, 191266, 190579, 189972, 189863, 190308, 190844, 190999, 190733, 190324, 190046, 190018, 190130, 190060, 189586, 188911, 188432, 188220, 188119, 188350, 189466, 191495, 193525, 194478, 194042, 192629, 190780, 188952, 187614, 187047, 187114, 187502, 188133, 189038, 189978, 190572, 190765, 190877, 191137, 191465, 191757, 192105, 192616, 193229, 193844, 194490, 195248, 196085, 196858, 197425, 197682, 197546, 196982, 195994]
52951A95994j430j868k132k002j455p48j93P1O5j90o77j273j741j927j792j299
52935A77403m28N33J043Q34K78j01k95n52o60j33Q19J243O98r7l16j54k58n85
52917A79272o29m81p05j250j377q41k57k7L17J165J930J714N45o74j277j295r95
52900A75135m61K51R36J374J513J429J211R07M94r1q07j443j737j537q86l2O66
52883A76922R74J006J071J336J680J827J517P02k50p20m90r5j46n13n95k49J19
52866A84096K91M37N37L46N2K05P67R37L54k91k80J87O05R93J412J346N11k87
52848A92218p1Q59J384J206J015J149J225J112J155J241O97n17j409j247m78N6
52832A99595J60N9j53l40j65L89Q05Q25Q74J259J523J137L02n00j250k009k313
$$ y = [195994, 194564, 192696, 190564, 188562, 187107, 186359, 186166, 186237, 186302, 186112, 185435, 184162, 182421, 180494, 178702, 177403, 176975, 177508, 178551, 179385, 179663, 179562, 179267, 178715, 178055, 177922, 178741, 179984, 180682, 180585, 180269, 180115, 179857, 179272, 178643, 178162, 177457, 176207, 174830, 173989, 173732, 173705, 174022, 175187, 177117, 178831, 179376, 178702, 177425, 176130, 175135, 174674, 174925, 175861, 177235, 178748, 180177, 181388, 182295, 182789, 182698, 181891, 180448, 178711, 177174, 176288, 176256, 176922, 177896, 178902, 179973, 181309, 182989, 184816, 186333, 187035, 186785, 186065, 185575, 185480, 185334, 184821, 184226, 183977, 184096, 184387, 184824, 185361, 185707, 185759, 185964, 186731, 187668, 188022, 187731, 187451, 187638, 188243, 189236, 190648, 191994, 192505, 192218, 192147, 193006, 194390, 195596, 196611, 197760, 198985, 200097, 201252, 202493, 203190, 202673, 201264, 200017, 199539, 199595, 199755, 199814, 199661, 199321, 199156, 199545, 200350, 201175, 202049, 203308, 204831, 205968, 206270, 205770, 204520, 202511, 200198]
52815B00198j770r06n80p85p80k60M16J007J593K077K317K724L830N169N483M276
52799B24009K352M64j554l807n448n678m999m564m571m275l381k482k010j625
52785A82431r77l59j85l09l46l23n27r06j108j014q55q04q03p82o79k89N50J472
52767A74187J724J085L20K94Q93J266R84M67K28K53K80K43J78Q5R5L94P21M18
52749A84115n80j318r56NM24J45M7M97P88M26k3O3K95mn92p18m16l94p20n56N40
52728A81068J834K318J922J392J326J664J883J503N14n27j054j150j354j791j991
52713A87557j693j251r71o38k08l38j419k552k440j176j42n9j33M78J295J311
52697A77621N24j74k85j39j19j27O7M24P25Q09O54M14L18L88L98K34R5M8j30m24
$$ y = [200198, 198428, 197522, 196942, 196157, 195377, 195117, 195533, 196540, 198133, 200210, 202527, 205251, 209081, 214250, 219733, 224009, 226361, 226825, 225271, 221464, 216016, 210338, 205339, 200775, 196204, 191929, 188548, 186066, 184056, 182431, 181454, 181095, 180910, 180601, 180255, 179932, 179405, 178499, 177391, 176377, 175522, 174718, 173915, 173133, 172454, 172165, 172715, 174187, 175911, 176996, 177316, 177610, 178503, 179769, 180753, 181220, 181448, 181701, 181981, 182224, 182402, 182487, 182582, 182976, 183697, 184115, 183535, 182217, 181261, 181266, 181690, 181835, 181882, 182379, 183167, 183593, 183570, 183633, 183928, 183924, 183332, 182614, 182198, 181804, 181084, 180528, 181068, 182902, 185220, 187142, 188534, 189860, 191524, 193407, 194910, 195424, 194897, 193843, 192693, 191339, 189548, 187557, 185864, 184613, 183642, 183004, 182796, 182458, 181039, 178487, 176047, 174871, 174729, 174670, 174537, 175015, 176310, 177621, 178145, 177971, 177686, 177547, 177428, 177301, 177368, 177792, 178517, 179326, 179980, 180394, 180712, 181100, 181498, 181732, 181827, 181875, 181745, 181321]
52677A81321k31P71J792J749P46p8k05k37n55n50K73J306J721J700J893K154J762
52660A95332P35p0j87r2k43l28J55R95J474J218N88K76O74J595K433K672K224
52643B09451J302J49r47j585j517r89n22l96n49q49j190j320r55j25P87J383J437
52626B03565Q99J8o16n63q9J22k49r23j572k061k171j646p04N1M03P25J155J160
52608A97504L95n30p89m42k25l92n23l88l06m69n09n5O71J162J302J444J858K391
52590B02099K629K352J762J346J383J605J423N86m63r86o56J58P82Q44N06J71
52574B15541J02L31P41J054Q08k48j635k338j761m49M65M52l7l42m09o04j015
52557B10656j309j279j194j383j635j364l74Q10J513J596J412J307J292J152O95
$$ y = [181321, 181090, 181861, 183653, 185402, 186148, 186070, 185865, 185628, 185073, 184523, 184796, 186102, 187823, 189523, 191416, 193570, 195332, 196067, 195997, 195810, 195718, 195475, 195147, 195302, 196297, 197771, 198989, 199577, 199853, 200527, 202122, 204555, 207227, 209451, 210753, 210902, 209955, 208370, 206853, 205864, 205342, 204946, 204397, 203548, 202358, 201038, 200083, 199958, 200745, 202128, 203565, 204464, 204482, 203866, 203303, 203214, 203336, 203087, 202164, 200592, 198531, 196360, 194714, 194010, 194061, 194464, 195189, 196344, 197504, 197899, 197369, 196580, 196138, 195913, 195521, 194998, 194610, 194304, 193835, 193326, 193271, 193942, 195104, 196406, 197850, 199708, 202099, 204728, 207080, 208842, 210188, 211571, 213176, 214599, 215185, 214722, 213736, 213080, 213238, 214020, 214864, 215370, 215541, 215643, 215974, 216715, 217769, 218577, 218329, 216694, 214356, 212595, 212146, 212611, 213063, 213026, 212684, 212275, 211671, 210656, 209347, 208068, 206874, 205491, 203856, 202492, 202118, 202928, 204441, 206037, 207449, 208756, 210048, 211200, 211895]
52542B11895j7n27l68K62M87j98j159j389q44l48l21l35n1K43L46N78J037J081
52524B10372K95n71m55N18J140P39j02m34q8L95N13L28L57R71J837K185J821J467
52506B21288J724K128J858J071O64Q31O84l84j795k609k635k311j903j332n81
52491B16698J32N23L96j81p16o17J40R23J152Q58L93n3l77l77L3N50P71O47M68
52472B21363N41R78J667K304K596K549K336J930J186L82J79P61J413J357P15J91
52456B42448P1J5l09q18j260j494j501j405j432j610j617j281j053j520k462k872
52440B21900k156r29l06o17j108r38j17O36P95N72M19L38m8p63j281j227r05q37
52422B13428r86q77l94K7J2k19j54M09J162J633J675J579J738K198K621K690K434
$$ y = [211895, 211878, 211351, 210983, 211245, 211732, 211534, 210375, 208986, 208142, 207794, 207473, 207138, 207087, 207330, 207676, 208254, 209291, 210372, 210667, 210096, 209641, 210159, 211299, 212038, 211936, 211502, 211414, 211809, 212322, 212650, 213007, 213978, 215815, 218000, 219821, 221288, 223012, 225140, 226998, 228069, 228733, 229564, 230248, 229864, 228069, 225460, 222825, 220514, 218611, 217279, 216698, 216830, 217353, 217749, 217568, 216852, 216235, 216375, 217298, 218450, 219308, 219701, 219648, 219271, 218894, 218927, 219477, 220248, 220895, 221363, 221904, 222882, 224549, 226853, 229449, 231998, 234334, 236264, 237450, 237832, 238011, 238772, 240185, 241542, 242257, 242448, 242519, 242534, 242225, 241407, 240147, 238653, 237152, 235747, 234315, 232705, 231088, 229807, 228754, 227234, 224772, 221900, 219744, 218815, 218509, 217892, 216784, 215846, 215729, 216365, 217160, 217732, 218151, 218489, 218441, 217678, 216397, 215170, 214265, 213428, 212442, 211565, 211171, 211198, 211210, 210991, 210837, 211246, 212408, 214041, 215716, 217295, 219033, 221231, 223852, 226542, 228976]
52405B28976K140K137K660L686M760N291N169M833M537L898K538Q24n01j257j910
52390B67781k835l855m558m631l971k791j630q91m42lK62P6j84K59J425K350K304
52373B48666J702J415J693K176K585K912L055K775K025J108M68L86O76O95l6j145
52357B71156j744j640j618k219k757k208p20M65N45o9m91k96M50J493K390K655
52341B65392K208J585J376J597J801J711J509J546J954K625L426M331N293O086
52327C02440O403O193N812N774O355P448Q572R140Q871Q075P316O732O015N107
52313D00253M457M305M155L476K654K590L526M724N372N208M356L200K520K986
52299D53782M223M946M466L530L185L365L188K343J418Q93M73l49j549k598k994
$$ y = [228976, 231116, 233253, 235913, 239599, 244359, 249650, 254819, 259652, 264189, 268087, 270625, 271449, 270948, 269691, 267781, 264946, 261091, 256533, 251902, 247931, 245140, 243510, 242619, 242177, 242174, 242436, 242512, 242328, 242587, 244012, 246362, 248666, 250368, 251783, 253476, 255652, 258237, 261149, 264204, 266979, 269004, 270112, 270580, 270966, 271642, 272337, 272301, 271156, 269412, 267772, 266154, 263935, 261178, 258970, 258250, 258715, 259260, 259191, 258700, 258404, 258854, 260347, 262737, 265392, 267600, 269185, 270561, 272158, 273959, 275670, 277179, 278725, 280679, 283304, 286730, 291061, 296354, 302440, 308843, 315036, 320848, 326622, 332977, 340425, 348997, 358137, 367008, 375083, 382399, 389131, 395146, 400253, 404710, 409015, 413170, 416646, 419300, 421890, 425416, 430140, 435512, 440720, 445076, 448276, 450796, 453782, 458005, 462951, 467417, 470947, 474132, 477497, 480685, 483028, 484446, 485339, 485812, 485463, 483914, 481316, 478322]
52284D78322k630j827j105p30m61J28J040J769J881J538J335J702K518L266L616
52269D90362L751M067M592M918M796M476M293M217M104M140M598N356O047O630
52255E56347P326P981Q057P354O371N699N456N457N610N817N742N095M042L068
52241F39422K517K370K438K583K802L182L706M156M368M551N116O066O854P001
52227F97132O594O050N580N229N150N565O379P111P263O763O077N827O102O237
52213G83059N614M615M331N140O168O461O174O063O254O250N891N601N633N788
52199H63042N916O089O152N711M824M191M313M853N162N098M985N028N120N057
52185I35541M586L457J751R5q02q96q19j205k131l266m277n041n602o041o340
$$ y = [478322, 475692, 473865, 472760, 472030, 471569, 471697, 472737, 474506, 476387, 477925, 479260, 480962, 483480, 486746, 490362, 494113, 498180, 502772, 507690, 512486, 516962, 521255, 525472, 529576, 533716, 538314, 543670, 549717, 556347, 563673, 571654, 579711, 587065, 593436, 599135, 604591, 610048, 615658, 621475, 627217, 632312, 636354, 639422, 641939, 644309, 646747, 649330, 652132, 655314, 659020, 663176, 667544, 672095, 677211, 683277, 690131, 697132, 703726, 709776, 715356, 720585, 725735, 731300, 737679, 744790, 752053, 758816, 764893, 770720, 776822, 783059, 788673, 793288, 797619, 802759, 808927, 815388, 821562, 827625, 833879, 840129, 846020, 851621, 857254, 863042, 868958, 875047, 881199, 886910, 891734, 895925, 900238, 905091, 910253, 915351, 920336, 925364, 930484, 935541, 940127, 943584, 945335, 945430, 944628, 943732, 942913, 941708, 939577, 936311, 932034, 926993, 921391, 915350, 909010]
52170I09010o348n945n267m704m527m537m234l402k416j770j443r69j09R17J819
52155H66075K462K598J899N64n93j089j375j988k561k402j670j108p93j56P39
52140H60602R94K86m96n79m11q47j891k961l849m543m538l243j044Q43J726K086
52124H42135K798M130N673O895P707Q509R709J1076J1835J1576J0772J0088R512
52111I52415Q584P194N681M323L163K236J538Q86K30l0N18J706L006M150N098
52096A000698N672N766N802O306P140P676P635P157O135M299J907l72k386m484
52082A058951o399p081o090m455l463l154k575j179O14K032K634K592K531L003
52068A037961L877M505M621M653M904M942M280L275K712K696K476J362n29k424
$$ y = [909010, 902662, 896717, 891450, 886746, 882219, 877682, 873448, 870046, 867630, 865860, 864417, 863448, 863339, 864256, 866075, 868537, 871135, 873034, 873598, 873005, 871916, 870541, 868553, 865992, 863590, 861920, 860812, 860019, 859863, 860602, 861596, 861882, 861386, 860807, 860396, 859549, 857658, 854697, 850848, 846305, 841767, 838524, 837480, 838323, 840049, 842135, 844933, 849063, 854736, 861631, 869338, 877847, 887556, 898632, 910467, 922043, 932815, 942903, 952415, 960999, 968193, 973874, 978197, 981360, 983596, 985134, 986020, 986250, 986220, 986738, 988444, 991450, 995600, 1000698, 1006370, 1012136, 1017938, 1024244, 1031384, 1039060, 1046695, 1053852, 1059987, 1064286, 1066193, 1065821, 1063435, 1058951, 1052552, 1045471, 1039381, 1034926, 1031463, 1028309, 1025734, 1024555, 1025169, 1027201, 1029835, 1032427, 1034958, 1037961, 1041838, 1046343, 1050964, 1055617, 1060521, 1065463, 1069743, 1073018, 1075730, 1078426, 1080902, 1082264, 1081735, 1079311]
$$ [...]
##END NTUPLES=NMR SPECTRUM
##END=
