
##TITLE=AC1340_BRARH12161_6528807_sgsL3tRXkp
##JCAMPDX= 6.0         $$ Bruker NMR JCAMP-DX V2.0
##DATA TYPE= NMR SPECTRUM
##DATA CLASS= NTUPLES
##ORIGIN= BRUKER
##OWNER= Administrator
$$ 1.72 TOPSPIN		Version 2.1
$$ 2012-12-12 02:25:27.014 -0500  Administrator@X
$$ Compression mode = diff/dup
##.OBSERVE FREQUENCY= 400.02188249412
##.OBSERVE NUCLEUS= ^1H
##.ACQUISITION MODE= SIMULTANEOUS (DQD)
##.ACQUISITION SCHEME= undefined
##.AVERAGES= 8
##.DIGITISER RES= 22
##SPECTROMETER/DATA SYSTEM= spect
##.PULSE SEQUENCE= zg30
##.SOLVENT NAME= COFFEE_meoh
##.SHIFT REFERENCE= INTERNAL, COFFEE_meoh, 1, 14.98509
##AUDIT TRAIL= $$ (NUMBER, WHEN, WHO, WHERE, PROCESS, VERSION, WHAT)
$$ ##TITLE= Audit trail, TOPSPIN		Version 2.1
$$ ##JCAMPDX= 5.01
$$ ##ORIGIN= Bruker BioSpin GmbH
$$ ##OWNER= Administrator
$$ $$ E:\/data/COFFEE/nmr/AC1340_BRARH12161_6528807_sgsL3tRXkp/20/pdata/1/auditp.txt
$$ ##AUDIT TRAIL=  $$ (NUMBER, WHEN, WHO, WHERE, PROCESS, VERSION, WHAT)
(   1,<2012-12-12 02:25:18.118 -0500>,<Administrator>,<X>,<go>,<TOPSPIN 2.1>,
      <created by zg
	started at 2012-12-12 02:24:11.588 -0500,
	POWCHK enabled, PULCHK disabled,
       configuration hash MD5:
       86 BA 57 50 F2 9D 5C 9B 26 00 A9 28 5F 66 2E 89
       data hash MD5: 64K
       AC 65 B2 A2 0B 01 F5 8B 99 74 26 9F 98 B0 DE C4>)
(   2,<2012-12-12 02:25:21.258 -0500>,<Administrator>,<X>,<proc1d>,<TOPSPIN 2.1>,
      <Start of raw data processing
       efp LB = 0 FT_mod = 6 PKNL = 1 PHC0 = 0 PHC1 = 0 SI = 32K 
       data hash MD5: 32K
       68 B5 5C 74 BB CB EF D3 F6 B0 D6 74 75 76 9B DC>)
(   3,<2012-12-12 02:25:21.763 -0500>,<Administrator>,<X>,<proc1d>,<TOPSPIN 2.1>,
      <pk PHC0 = 96.89392 PHC1 = 0 
       data hash MD5: 32K
       0D 63 8D AD B0 13 05 9B 27 BA AD 5B D8 93 1E C9>)
(   4,<2012-12-12 02:25:22.028 -0500>,<Administrator>,<X>,<proc1d>,<TOPSPIN 2.1>,
      <abs ABSG = 1 
       data hash MD5: 32K
       BC 12 2A 2D 02 BF D1 F9 0D EC 25 BA 10 1B 26 0C>)
(   5,<2012-12-12 02:25:22.213 -0500>,<Administrator>,<X>,<proc1d>,<TOPSPIN 2.1>,
      <abs ABSG = 2 
       data hash MD5: 32K
       B5 3E 5E 6D BD B6 C5 32 F4 59 4B E3 8D 9E 59 A3>)
(   6,<2012-12-12 02:25:22.398 -0500>,<Administrator>,<X>,<proc1d>,<TOPSPIN 2.1>,
      <abs ABSG = 3 
       data hash MD5: 32K
       CB B6 4E AF FB BB CC B5 AB 9F AA 73 34 7A D5 45>)
(   7,<2012-12-12 02:25:22.567 -0500>,<Administrator>,<X>,<proc1d>,<TOPSPIN 2.1>,
      <abs ABSG = 4 
       data hash MD5: 32K
       9A DE 3C F4 3D 33 B3 81 4B AB E0 0E AE 49 C4 1D>)
(   8,<2012-12-12 02:25:22.752 -0500>,<Administrator>,<X>,<proc1d>,<TOPSPIN 2.1>,
      <abs ABSG = 5 
       data hash MD5: 32K
       C3 09 0D 6A B4 E6 0E 7B 37 A3 BF E5 5B 92 44 27>)
$$ ##END=
$$ 
$$ $$ hash MD5
$$ $$ 51 32 40 08 2E 44 0A 8F 6A 7D CF FF 02 EF 76 95
##$RELAX= 
##$RELAX= 
##$RELAX= 
##$RELAX= 
##$RELAX= 
##$RELAX= 
##$RELAX= 
##$RELAX= 
$$ Bruker specific parameters
$$ --------------------------
##$DU= <E:\>
##$EXPNO= 20
$$ [...]
150 150 150 150 150 150 150 150
##$TP07= 0
##$TPNAME0= <>
##$TPNAME1= <>
##$TPNAME2= <>
##$TPNAME3= <>
##$TPNAME4= <>
##$TPNAME5= <>
##$TPNAME6= <>
##$TPNAME7= <>
##$TPOAL= (0..7)
0.5 0.5 0.5 0.5 0.5 0.5 0.5 0.5
##$TPOFFS= (0..7)
0 0 0 0 0 0 0 0
##$TUNHIN= 0
##$TUNHOUT= 0
##$TUNXOUT= 0
##$USERA1= <user>
##$USERA2= <user>
##$USERA3= <user>
##$USERA4= <user>
##$USERA5= <user>
##$V9= 5
##$VALIST= <valist>
##$VCLIST= <CCCCCCCCCCCCCCC>
##$VD= 0
##$VDLIST= <DDDDDDDDDDDDDDD>
##$VPLIST= <PPPPPPPPPPPPPPP>
##$VTLIST= <TTTTTTTTTTTTTTT>
##$WBST= 2048
##$WBSW= 25
##$XGAIN= (0..3)
0 0 0 0
##$XL= 0
##$YL= 0
##$YMAX_a= 675566
##$YMIN_a= -574273
##$ZGOPTNS= <>
##$ZL1= 120
##$ZL2= 120
##$ZL3= 120
##$ZL4= 120
##$ABSF1= 14.98509
##$ABSF2= -5.573092
##$ABSG= 5
##$ABSL= 3
##$ALPHA= 0
##$AQORDER= 0
##$ASSFAC= 0
##$ASSFACI= 0
##$ASSFACX= 0
##$ASSWID= 0
##$AUNMP= <proc_prof1d_extract_pilot.lims>
##$AXLEFT= 0
##$AXNAME= <>
##$AXNUC= <1H>
##$AXRIGHT= 0
##$AXTYPE= 0
##$AXUNIT= <>
##$AZFE= 0.1
##$AZFW= 0.1
##$BCFW= 0
##$BC_mod= 0
##$BYTORDP= 0
##$COROFFS= 0
##$CY= 15
##$DATMOD= 1
##$DC= 0
##$DFILT= <>
##$DTYPP= 0
##$F1P= 0
##$F2P= 0
##$FCOR= 0.5
##$FTSIZE= 32768
##$FT_mod= 6
##$GAMMA= 0
##$GB= 0
##$INTBC= 1
##$INTSCL= 1
##$ISEN= 128
##$LB= 0
##$LEV0= 0
##$LPBIN= 0
##$MAXI= 10000
##$MC2= 0
##$MEAN= 0
##$ME_mod= 0
##$MI= 0
##$NCOEF= 0
##$NC_proc= -8
##$NLEV= 6
##$NOISF1= 0
##$NOISF2= 0
##$NSP= 0
##$NTH_PI= 0
##$NZP= 0
##$OFFSET= 14.98509
##$PC= 1
##$PHC0= 96.89392
##$PHC1= 0
##$PH_mod= 1
##$PKNL= yes
##$PPARMOD= 0
##$PPDIAG= 0
##$PPIPTYP= 0
##$PPMPNUM= 2147483647
##$PPRESOL= 1
##$PSCAL= 4
##$PSIGN= 0
##$PYNMP= <proc.py>
##$REVERSE= no
##$SF= 400.02
##$SI= 32768
##$SIGF1= 0
##$SIGF2= 0
##$SINO= 400
##$SIOLD= 32768
##$SPECTYP= <>
##$SREGLST= <1H.CDCl3>
##$SSB= 0
##$STSI= 32768
##$STSR= 0
##$SW_p= 8223.68421052631
##$SYMM= 0
##$S_DEV= 0
##$TDeff= 65536
##$TDoff= 0
##$TI= <>
##$TILT= no
##$TM1= 0
##$TM2= 0
##$TOPLEV= 0
##$USERP1= <user>
##$USERP2= <user>
##$USERP3= <user>
##$USERP4= <user>
##$USERP5= <user>
##$WDW= 1
##$XDIM= 32768
##$YMAX_p= 474924480
##$YMIN_p= -804726
##$CURPLOT= <Network HP LaserJet P1505>
##$CURPRIN= <$Network HP LaserJet P1505>
##$DFORMAT= <normdp>
##$LAYOUT= <+/1D_H.xwp>
##$LFORMAT= <normlp>
##$PFORMAT= <normpl>
##$SURQMSG= 1
$$ End of Bruker specific parameters
$$ ---------------------------------
##NTUPLES= NMR SPECTRUM
##VAR_NAME=  FREQUENCY,     SPECTRUM/REAL,   SPECTRUM/IMAG
##SYMBOL=    X,             R,               I
##VAR_TYPE=  INDEPENDENT,   DEPENDENT,       DEPENDENT
##VAR_FORM=  AFFN,          ASDF,            ASDF
##VAR_DIM=   32768,         32768,           32768
##UNITS=     HZ,            ARBITRARY UNITS, ARBITRARY UNITS
##FACTOR=    0.250966925370066, 1,           1
##FIRST=     8223.43324360094, -102690,      -191152
##LAST=      0,             11717,           -183855
##MIN=       0,             -804726,         0
##MAX=       8223.43324360094, 474924480,    0
$$ Real data points
##PAGE= N=1
##DATA TABLE= (X++(R..R)), XYDATA
$$ [...]
19523a01976j2144A5687a15765D8470e4318K7039H7749L8031c28613A42120l8958
19512A03162L5392c0808j20998C79621a71254j46572f8917B83236b08163B46212
19501a0154j31931A12645A8338g6857A14786c0240l219H9877a37534k5819a9732
19489a6360A12279L879a43241A93251H3897f5151p2824c4417k1879n500q8356
19478a50152P0269j92453R8556r70A3746n728b14195d1783n6536k33664a37179
19466a33365r7500D00766i7747j32894J06852A85171G2698b86704J42650r7481
19456b41535Q7548j49245J31493H6638c32006g8169B84510k0660b33011N6455
19446a76556D8341a65182j11011N544N6809H5316d49241d0560I3480b66799A37402
$$ plain form
19523 -101976 -114120 15687 -115765 48470 -54318 -27279 87749 125780 -328613 142120 103162
19512 103162 138554 -30808 -151806 379621 -171254 -317826 -68917 283236 -208163 246212
19501 -10154 -142085 112645 18338 -76857 114786 -30240 -33459 89877 -137534 -163353 -19732
19489 -16360 112279 116158 -143241 193251 83897 -65151 -137975 -34417 -56296 -61796 -150152
19478 -150152 -79883 -272336 -173780 -174750 13746 8018 -214195 -41783 -98319 -331983 -137179
19466 -133365 -230865 400766 -97747 -230641 -123789 185171 72698 -286704 -144054 -241535
19456 -241535 -153987 -303232 -171739 86638 -332006 -78169 284510 263850 -233011 -176556
19446 -176556 48341 -165182 -276193 -270649 -213840 85316 -449241 -40560 93480 -266799 137402
19434F0047b4769m46891g6278k82363f557l9267A29611a54289A74104b02585c2640
19422b5239B6916a61561p3945j06826J29951g4022I6778D272a19770k17499g415
19410E867c5550j11850j37166C4519d4006m7636c2729l56966J32798A9488c3296
19398d2251J7444A14615m3527c75995B73231b14567f7173j70167A57024F2132
19387A76421e307l8983r0692r0574g0820k60570f4366j69723B15715a8675m64511
19376d83186F4886b55268B34929a07703I6056L61804j61564a69020k7603M0075
19366a56548j70995B68037a34273B9284f600j69122m410b4279k87557D4894J00541
19355A45435g4017l6857A45479a51769N5925K691A38877j1054O2689a9863j20598
$$ plain form
19434 60047 -24769 -471660 -76278 -358641 -6557 -45824 129611 -154289 174104 -202585 -32640
19422 -25239 26916 -161561 -235506 -342332 -212381 -74022 96778 4272 -119770 -337269 -7415
19410 5867 -35550 -147400 -284566 34519 -44006 -91642 -32729 -389695 -256897 19488 -33296
19398 -42251 -24807 114615 71088 -375995 273231 -214567 -67173 -237340 157024 62132
19387 176421 -5307 -44290 -134982 -225556 -70820 -331390 -64366 -234089 215715 -18675 -483186
19376 -483186 64886 -255268 234929 -107703 96056 457860 296296 -169020 -196623 -156548
19366 -156548 -327543 268037 -134273 29284 -6600 -175722 -180132 -24279 -311836 44894 145435
19355 145435 -74017 -110874 145479 -151769 -95844 -93153 138877 127823 190512 -19863 -140461
19344a40461k5642A89081a51762j69620A46474c65458c9098k48614A65528a10717
19333g063j1198B48987b53659a04719D082a97510h8307j82115a17912a2025A23348
19321a23748B18202a47929M7754E3692O2263a61047A98316b70022A26312g4338
19310a63775B35559R660c14142h4148B676c0496C2705a60544J946K6538b6861
19298G0014J05814b46235e8733j34531c8120j85067g9122E3485b38379H7032K77442
19287C64474a88828d5612k62738A40359b13084a01927j5922j54754B4877N4401
19277G9278b98285A79402a86126B7452K3679P5891a86403k30678d0019j65783
19267b05802A5634b44525M1011A03970M9200d678p2121b1832k92114e671D3041
$$ plain form
19344 -140461 -166103 189081 -151762 -321382 146474 -365458 -39098 -287712 165528 -110717
19333 -7063 -18261 248987 -253659 -104719 4082 -197510 -88307 -270422 -117912 -12025 123348
19321 -123748 218202 -147929 -100175 53692 115955 -161047 198316 -270022 126312 -74338
19310 -163775 235559 245219 -314142 -84148 2676 -30496 32705 -160544 -158598 -132060 -26861
19298 70014 175828 -246235 -58733 -193264 -38120 -223187 -79122 53485 -238379 87032 364474
19287 364474 -188828 -45612 -308350 140359 -213084 -101927 -117849 -272603 24877 79278
19277 79278 -298285 179402 -186126 27452 51131 127022 -186403 -417081 -40019 -205802
19267 -205802 15634 -244525 -203514 103970 153170 -4678 -76799 -21832 -313946 -5671 43041
19255c44710J16122J02197j15979L4497i2370C05685b35767f0781b5484o2873
19245h8357k39911a21627F8722c6931k7911I6130a78076O7339B9254l091P05i911
19232H2436d8250l3377j74013M7385k08617A03696a61253a0228k32967Q5898A07793
19220a39232B54422h9105k33892H5175b56675A134K7803R4842h6935k94356J51253
19209b30038k6801h1429j12298A78721d0002I0820K093c1736A42460o6814b10556
19197b92744A46764D2088J57400e1113j05621m7585A65314q1357d0924a4335B34889
19185f5351k8776I8986B7467a26405J9501E37066b25396A28689b60035o8597A85771
19173b07692j82233p7492b4480A46277b5877I1601a56706k9517M7656c9612k94041
$$ plain form
19255 -344710 -228588 -126391 -242370 -207873 -92370 305685 -235767 -60781 -25484 -88357
19245 -88357 -328268 -121627 68722 -36931 -64842 96130 -178076 -110737 29254 26163 26868 -9911
19232 82436 -48250 -81627 -255640 -208255 -416872 103696 -161253 -10228 -243195 -157297 107793
19220 -139232 254422 -89105 -322997 85175 -256675 1134 28937 123779 -86935 -381291 -230038
19209 -230038 -256839 -81429 -193727 178721 -40002 90820 92913 -31736 142460 75646 -210556
19197 -292744 146764 42088 199488 -51113 -156734 -204319 165314 83957 -40924 -14335 234889
19185 -65351 -94127 98986 27467 -126405 -106904 537066 -225396 128689 -260035 -328632 185771
19173 -207692 -389925 -467417 -24480 146277 -25877 91601 -156706 -186223 -138567 -39612 -333653
19162c33653J20243K1791m06693c3477k85207i1332K6127H1659A667K13969r7446
19151A18190c64867f2816D271b61846F7455P4565C425K69894a51167e2895F0797
19139B7389h0022A78137a915D2483a76143B10668a938j82624Q1400B7481P1426
19128I8907a5179p2242D43553A73367d14365a90160A09850a3966C4240a81703
19117a97250j70562L6765I9214c48287C21405p4729a84817H1785d28884g3200
19106i1919B05222k2922J39524b96946E9890a51570l699a9471A54717n9626M1211
19095A36302c74566i5590I904L344K84L377f3780j43933N3128D22671a37379j43373
19083b80752C4620a18898d1740B5688c23222h4138G2232e1804k53622a610B00460
$$ plain form
19162 -333653 -213410 -191619 -598312 -33477 -318684 -91332 -65205 81659 1667 215636 118190
19151 118190 -364867 -62816 4271 -261846 67455 142020 3425 273319 -151167 -52895 60797
19139 27389 -80022 178137 -1915 42483 -176143 210668 -1938 -184562 -103162 27481 98907
19128 98907 -15179 -87421 443553 173367 -414365 -190160 109850 -13966 34240 -181703
19117 -197250 -367812 -331047 99214 -348287 321405 246676 -184817 81785 -428884 -73200
19106 -91919 205222 182300 321824 -296946 59890 -151570 -155269 -19471 154717 95091 136302
19095 136302 -374566 -95590 9904 13248 13532 16909 -63780 -207713 -154585 422671 -137379 -280752
19083 -280752 34620 -118898 -41740 25688 -323222 -84138 72232 -51804 -305426 -1610 200460
19071b72727N9608g5978j20622E2392b80238a03227L8826H9084M7636g993F6981
19059b09552L0738a1243R62B29358a26621r2460D1272M7221O4513b01022k0570
19048b21592i3053a5307j09413B02923d40886E9427L01405b4663k15848p9048
19038c19559i9294C77943b17606E4534K15195c04399i3990r1898B33488g1732
19027e3705k5916K7564A06330k0921b42634N9916E1834M1230d2287A30634e9482
19015B39543r8691b08715D558b0374A04244M5862d62679B263L1558h5233C00818
19003c30129J06859A24165J13367b30198i9507n1143I6802b05950B96279d9194
18992A9055d23044a6385H2169l5406a07477L0323E1238a48295q0997Q0838O0891
$$ plain form
19071 -272727 -213119 -75978 -196600 52392 -280238 -103227 -64401 89084 136720 -7993 66981
19059 -209552 -178814 -11243 -10281 229358 -126621 -219081 41272 88493 153006 -201022 -221592
19048 -221592 -93053 -15307 -124720 202923 -440886 59427 360832 -24663 -240511 -319559
19038 -319559 -99294 377943 -217606 54534 269729 -304399 -93990 -185888 233488 -71732
19027 -53705 -79621 -52057 106330 85409 -242634 -182718 51834 93064 -42287 130634 -59482
19015 239543 140852 -208715 4558 -20374 104244 150106 -462679 2263 33821 -85233 300818
19003 -330129 -223270 124165 237532 -230198 -99507 -150650 96802 -205950 296279 -49194
18992 19055 -423044 -16385 82169 46763 -107477 -77154 51238 -148295 -229292 -148454 -87563
18981h7563B76058q7772b27079B80778e8846a9170m4665j71650E6393b85421B20900
18969b9640k63913A67157a71650n3110C4362J60702r1854a43770A99334a84439
18958D4373a77475n7613i1114j40767E0156Q3982a95128j11215J08157F8594a11170
18946a07275c9945p2612k58095b6509E4230a59810D9892b73912I9975a70998C8812
18934I7032c68893f9793A3449J9773b31778I5364A518a09900j05477J5058i8299
18922d1380A26062b24766M7215J0555B96738O5092p0060F2063c5847C44863a60165
18910F8999M8733a0044j84925B51130a71918q803B970J67268a88322G303c24592
18898A38732j3176e2953q1619m6401Q2259b1634j72552A74699i9545l1340c8593
$$ plain form
18981 -87563 276058 188286 -227079 280778 -58846 -19170 -63835 -235485 56393 -285421 220900
18969 -29640 -293553 167157 -171650 -224760 34362 195064 103210 -143770 199334 -184439
18958 44373 -177475 -235088 -91114 -231881 50156 134138 -195128 -306343 -198186 68594 -111170
18946 -107275 -39945 -112557 -370652 -26509 54230 -159810 49892 -273912 99975 -170998 38812
18934 97032 -368893 -69793 13449 33222 -231778 95364 1518 -109900 -215377 -200319 -98299
18922 -41380 126062 -224766 -177551 -166996 296738 361830 291770 62063 -35847 344863 -160165
18910 68999 117732 -10044 -194969 251130 -171918 -180721 2970 170238 -188322 7303 -324592
18898 138732 125556 -52953 -134572 -180973 -98714 -21634 -194186 174699 -99545 -130885 -38593
18886f7346C1266g6471A58307c30566i1901B89996a19744k51451i1953k41465
18876c33418J08015g4033k7540J7991E3407d42383i9092b8638l72697A17928Q8850
18865B06778e985r2185a7938p8784B28032L2588b21903A53895m6826d6040j97776
18854b43816A75478B4138a25173A69968a72595e3173l9801r962n749I3157B1699
18842b474A08056J09322b60553a28830j3144F8865a75281g1141n6612j40j64705
18831b92598d1656k43844A26554C7415K3216b26261A34471m4310m4924b04687
18820d3344j44479h5258c9249A10506K8266L5004G2496r32b44165A51017b29119
18808a90327B950b90367a07918k3281b5719A2812J97950A2756K16554b56633A62067
$$ plain form
18886 -67346 31266 -76471 158307 -330566 -91901 289996 -119744 -371195 -91953 -333418
18876 -333418 -225403 -74033 -101573 -83582 53407 -442383 -99092 -28638 -401335 117928 206778
18865 206778 -5985 -98170 -17938 -96722 228032 260620 -221903 153895 107069 -46040 -243816
18854 -243816 175478 24138 -125173 169968 -172595 -53173 -92974 -102936 -108685 93157 21699
18842 -2474 108056 217378 -260553 -128830 -141974 68865 -175281 -71141 -127753 -127893 -292598
18831 -292598 -41656 -285500 126554 37415 60631 -226261 134471 90161 45237 -204687
18820 -43344 -187823 -85258 -39249 110506 138772 173776 72496 71564 -244165 151017 -229119
18808 -190327 2950 -290367 -107918 -131199 -25719 12812 210762 12756 229310 -256633 162067
18796a23622l79511i9141j7769B4632K8141a12145o235q6335C95556A14987c5423
18784C2515N9763f3299a3901p0953o8793j8329B80136I4361a54886A57842a12031
18772a75681B7310J6455b00592q393a00539A21748b17405C9670g4828Q486j70155
18761b36497j18249J65914j8075k17127b4991l70399a07620B8452a16085j48901
18751b64986C2660a58842I6542a09139j27193N8858B70199c07201A7144d2063
18740b69065A42974i203B72455A35042j1612a89386c4571k6435C0131R0719a9152
18728A8477b67535A7022K4275R9083g7267D4446b17416F5352b72989D9397a10166
18716b52524i9174p2461P2442j6690B2565J97801c9161j42858j12206J30657j08280
$$ plain form
18796 -123622 -503133 -99141 -116910 24632 52773 -112145 -118380 -204715 395556 114987 -35423
18784 32515 92278 -63299 -13901 -84854 -153647 -171976 280136 94361 -154886 157842 -112031
18772 -175681 27310 43765 -200592 -208985 -100539 121748 -217405 39670 -74828 -66342 -236497
18761 -236497 -354746 -188832 -206907 -424034 -24991 -395390 -107620 28452 -116085 -264986
18751 -264986 32660 -158842 96542 -109139 -236332 -177474 270199 -307201 17144 -42063
18740 -269065 142974 -9203 272455 135042 123430 -189386 -34571 -61006 30131 120850 -19152
18728 18477 -267535 17022 41297 140380 -77267 44446 -217416 65352 -272989 49397 -110166
18716 -252524 -99174 -171635 -99193 -115883 22565 220366 -39161 -182019 -294225 -163568 -271848
18705b71848C4156i9595d2735o8488j22733A73975B7467Q8203O5834c31866A40313
18693H6497a5238F8161b12656k54984B22732b5798B38859b62975g3552j58988
18683b32540j25834a49026k1337F0495b22789A39693b42874l0147H0962d1698
18672E4382a40947k1592K4824A13089l187b88306c5167r2884b3360j62655l36940
18661e22955h5333q0584A22645c65163J67653c1744I836M7803c099m888D7723
18649c48361I7032c39724e5414B68158A0666c73146I4093b83363K396A7454a2133
18637b19094L1761F6726a66925m1809Q8875L3003m9562e9664k45637a33954M7279
18626h6675H054J27351a94722c4651p287k4675C5570b74993A4942M880L37170
$$ plain form
18705 -271848 34156 -99595 -42735 -111223 -233956 173975 27467 115670 181504 -331866 140313
18693 86497 -15238 68161 -212656 -467640 222732 -25798 238859 -262975 -73552 -232540
18683 -232540 -358374 -149026 -170363 60495 -222789 139693 -242874 -273021 80962 -41698
18672 54382 -140947 -162539 -137715 113089 109902 -288306 -35167 -128051 -23360 -186015 -522955
18661 -522955 -85333 -165917 122645 -365163 -197510 -31744 9836 57639 -3099 -7987 47723
18649 -348361 97032 -339724 -55414 268158 10666 -373146 94093 -283363 -280967 17454 -12133
18637 -219094 -187333 66726 -166925 -208734 -119859 -86856 -136418 -59664 -305301 -133954 -86675
18626 -86675 8054 135405 -194722 -34651 -41938 -66613 35570 -274993 14942 19822 356992
18615C56992a7433A37773b40681J02050B4689d7214B09473K0039H6215f3025j99686
18604b62711A63014C7114j7252Q0359f7298l18957J80918A58393J42676N0680
18594C51749c89343a83130O8219j18886Q1416b2775B6253b71874B6144a51152
18583c64664F810Q7180a97196r7212j48951b9594I0375M2733a64387C61052g965
18571b0422j68872j25184B45631p6427a1740l8976F8498d74236K08350i0880k84039
18560c74919A79583a45739j6707F4851h5827C078L17196a46363C35293e2162j26500
18549a78662B92098B1961a76439M3496A36527K50959a99577B64032a89062l03458
18539d92520d9501A55255e9511k8718b6111j54308K2519nM5733r1124e6733j89295
$$ plain form
18615 356992 -17433 137773 -240681 -138631 24689 -47214 209473 229512 86215 -63025 -262711
18604 -262711 163014 37114 19862 100221 -67298 -386255 -205337 158393 301069 351749
18594 351749 -389343 -183130 -114911 -233797 -152381 -22775 26253 -271874 26144 -151152
18583 -364664 6810 93990 -197196 -294408 -443359 -29594 90375 133108 -164387 361052 -7965
18571 -20422 -189294 -314478 245631 169204 -11740 -50716 68498 -474236 -265886 -90880 -374919
18560 -374919 179583 -145739 -162446 64851 -85827 3078 320274 -146363 335293 -52162 -178662
18549 -178662 292098 21961 -176439 -132943 136527 387486 -199577 264032 -189062 -492520
18539 -492520 -49501 155255 -59511 -88229 -26111 -180419 -157900 -157905 -112172 -203296 -56733 -246028
18527b46028d1575O935B46671d26180e3744H9778e1941F1340J07624d6263I6879
18515A1051K70537f7859A7542c73670A34380b82887i4737m8864A0452O8165c2816
18503a35177o6033A36066K08703j24356a39619P408C04117c77335e3678F95J24974
18492A25669D1415e6793C6439l329R0532e8121B91899i9539l0967c8152j77374
18481b15526R3009D2399N56071a40383c2853j72093H3623f8388C10709d21966
18470B45555g4360j25330J7591A69124a21400b8014D6432a08844o0590K7952B46443
18458c41793e4222l6864A68542b35888A89347b12136M2287e5606k84620A40691
18447A30565m114C6307A6531c871F7377a29751N1099L5440m1679k07424A72116
$$ plain form
18527 -246028 -41575 -34640 246671 -426180 -53744 89778 -51941 61340 168964 -46263 96879
18515 11051 281588 -67859 17542 -373670 134380 -282887 -94737 -143601 10452 78617 -32816
18503 -135177 -201210 136066 344769 220413 -139619 -132211 304117 -377335 -53678 695 125669
18492 125669 41415 -56793 36439 33110 123642 -58121 291899 -99539 -130506 -38152 -215526
18481 -215526 -122517 42399 598470 -140383 -32853 -204946 83623 -68388 310709 -421966
18470 245555 -74360 -199690 -182099 169124 -121400 -28014 46432 -108844 -169434 -141482 246443
18458 -341793 -54222 -91086 168542 -235888 189347 -212136 -169849 -55606 -340226 140691
18447 130565 126451 36307 16531 -3871 67377 -129751 -78652 -43212 -84891 -292315 172116
18435h5395B76212j28971e5022J1901k60326f6944J0156k10606A24098f6905D6368
18423a5718r0452k61497A74933a61716C7602J1268K68014d048j97307j35997Q7129
18412b50223J08588C14558a15516k4778n9272B3864K7968K8352L3617a61622I6821
18400F3520A3888c19123i3875A58887m689a87294k1540M2569m0522i3312D4224
18388b69003A46950f4900l9975C30426K5461A4940a42937e0444j93908f7448j51106
18377b18554C7959b01178g4482A3599h6605A88171b40089R8089N4669B20001b12197
18365b21864A67913d4827m321k46409L7567j346h8461k0703B2191b54625h9482
18353c08729F1127a87090B529f9195A52387a09394d8129A1643d0051l08599J71763
$$ plain form
18435 -85395 276212 147241 -55022 -43121 -303447 -66944 -56788 -267394 124098 -66905 46368
18423 -15718 -106170 -367667 174933 -161716 37602 48870 316884 -4048 -201355 -337352 -250223
18412 -250223 -141635 314558 -115516 -140294 -199566 23864 51832 80184 113801 -161622 96821
18400 63520 13888 -319123 -93875 158887 154198 -187294 -208834 -166265 -206787 -93312 44224
18388 -269003 146950 -64900 -104875 330426 355887 14940 -142937 -50444 -244352 -67448 -218554
18377 -218554 37959 -201178 -74482 13599 -86605 188171 -240089 -142000 -87331 220001 -212197
18365 -221864 167913 -44827 -49148 -295557 -257990 -259336 -88461 -109164 22191 -254625 -89482
18353 -308729 61127 -187090 2529 -69195 152387 -109394 -48129 11643 -40051 -348650 -176887
18342a76887A4525g4503j04881Q8031F3426a08483B7782K52360C8359b1489H0470
18330b02081o373n4332C1264e259p3290A55965A5639J98599l9631A4889K279J36586
18318A53754c0063J524k46955m5698J43985p5403B20454m2666c27068O3621b1156
18306a15405A82024l1911b31018D3924b4802B246K14546J10718C286J35074e9257
18294a6519B82796h822k18645K8220h791l1911m7228p7353j9755A33062d53680
18282c64982A70756a04073j91037A81888D199N2380d5321j48324a7643m7625j59289
18271b24557C64255a49787A80324L5883b27880I4028b22440B8188Q6649E6269
18260b0485A70830A1723N2244O1179a35813C2762R4925b4609A54221f5039p9214
$$ plain form
18342 -176887 14525 -74503 -179384 -91353 63426 -108483 27782 280142 38359 -21489 80470
18330 -202081 -208454 -262786 31264 -5259 -78549 155965 15639 214238 174607 14889 17168 153754
18318 153754 -30063 -28539 -275494 -321192 -177207 -252610 220454 177788 -327068 -263447 -21156
18306 -115405 182024 150113 -231018 43924 -24802 2246 216792 327510 3286 138360 -59257
18294 -16519 282796 -8822 -227467 -199247 -8791 -40702 -87930 -165283 -185038 133062 -453680
18282 -364982 170756 -104073 -295110 181888 4199 56579 -45321 -193645 -17643 -65268 -224557
18271 -224557 364255 -149787 180324 216207 -227880 94028 -222440 28188 114837 56269
18260 -20485 170830 11723 63967 125146 -135813 32762 127687 -24609 154221 -65039 -144253
18249a44253C4204d58229K17056k6540a24507d019B50757F2104i1125j33265A14756
18237b22947j45382D5889a59091H3288b84461J23016A93717F3263i4283p0768
18227a65051A2742J84321n4685B8957e6229j64899B6133c56394B84655a71211
18216b24269j43393J32608h6058l15522h7329j94003j42198B045a96072R6824
18206i9248A21677J10868d61541G1240a4953k40801H2280a31750k9888l07059
18196d68697b2098j25948e4804k8579G7334K62990F6143B4782J51456b64134A57742
18184A89904n7739f4071B05454D5837a42001A1950d56816A32899j4145c20509
18173a05619C47368i2380A36368a06958A49528h1339r0579N687B0760e4496m0419
$$ plain form
18249 -144253 34204 -458229 -241173 -267713 -124507 -4019 250757 62104 -91125 -224390 114756
18237 -222947 -368329 45889 -159091 83288 -284461 -161445 193717 63263 -94283 -165051
18227 -165051 12742 197063 142378 28957 -56229 -221128 26133 -356394 284655 -171211
18216 -224269 -367662 -235054 -86058 -401580 -87329 -281332 -423530 2045 -196072 -99248
18206 -99248 121677 232545 -461541 71240 -14953 -255754 82280 -131750 -161638 -468697
18196 -468697 -22098 -148046 -54804 -83383 77334 340324 66143 24782 176238 -264134 157742
18184 189904 132165 -64071 205454 45837 -142001 11950 -456816 132899 118754 -320509
18173 -105619 347368 -92380 136368 -106958 149528 -81339 -171918 -166231 20760 -54496 -94915
18162i4915A04642B527J56945J77600F0574b23814o0534a39274G4626K70262j69578
18151A75310G7081b8861R168B19871a26260D3579h1398A08542b64270B12450a20793
18139D18848A12092a10762q7888N0698B6737L7436c295j13254A12034b92466a0399
18127a97675p2783h1764B0326a9397j24920A36816F5409a05747A04950b0517j81656
18116b02173H2490A0265P4542a13670j32007A50061M0782a33625A7040J17941
18106A34981c1502l8116k96436I3172n421a58225d3369B580L21992a44636J9174
18095a25462G0135L295f4563j90024n866p3474c8302B9684M050J71578d9827A54891
18082B1640c66935J44551B19561b7867q7041A02367c54232H8605A843R1671h236
$$ plain form
18162 -94915 104642 2527 159472 337072 60574 -223814 -284348 -139274 74626 344888 175310
18151 175310 77081 -28861 -19693 219871 -126260 43579 -81398 108542 -264270 212450 -120793
18139 418848 112092 -110762 -198650 -147952 26737 64173 -3295 -116549 112034 -292466 -10399
18127 -197675 -270458 -81764 20326 -19397 -144317 136816 65409 -105747 104950 -20517 -202173
18116 -202173 82490 10265 84807 -113670 -245677 150061 190843 -133625 17040 134981
18106 134981 -31502 -69618 -366054 93172 87751 -158225 -43369 2580 324572 -144636 -125462
18095 -125462 70135 73430 -64563 -254587 -260453 -333927 -38302 29684 33734 205312 -49827 154891
18082 21640 -366935 -222384 219561 -27867 -114908 102367 -354232 88605 1843 93514 -8236
18070b0188j7893j88891d7264k87026a41007a5834k4448B03779B3590a27372A82553
18058A95768G1339f4021r4354F9811l753b62198k18240I681R8208f968j51554
18047a58522f7335C1096h4262L1597A79344h6051l2802j37556I0225J38401h8588
18035b75953A06458f9089k61565c071j59062B31373d69351B81950a11858J8150
18025i3708A44014c28878d0960A79890B32a78603L0333J0057A66050f5208k2171
18014h7379C07607F5754G521g7352q3397f6018A92192i8925k36733A05808b95264
18002g1928B40959r6748q447c8801A28375K727a67713B87410a95190A30106m6742
17991H3364b62209C23546a77396K5663K1533D5896M3250g8235k3446I5239e1149
$$ plain form
18070 -20188 -38081 -226972 -47264 -334290 -141007 -15834 -40282 203779 23590 -127372 182553
18058 195768 71339 -64021 -158375 69811 66058 -262198 -480438 9681 107889 -6968 -158522
18047 -158522 -67335 31096 -84262 -52665 179344 -86051 -118853 -256409 90225 228626 -88588
18035 -275953 106458 -69089 -330654 -3071 -162133 231373 -469351 281950 -111858 -93708
18025 -93708 144014 -328878 -40960 179890 232 -178603 -148270 -138213 166050 -65208 -87379
18014 -87379 307607 65754 7521 -77352 -160749 -66018 192192 -98925 -335658 105808 -295264
18002 -71928 240959 144211 135764 -38801 128375 131102 -167713 287410 -195190 130106 83364
17991 83364 -262209 323546 -177396 -151733 -130200 45896 89146 -78235 -101681 95239 -51149
17979h8190K1498A99121a3177j10072A10361c9589B76244c23954J06369a1485
17968a64234A26465k1513K4145M09a18852a7296A30585a95535A60968B966L38583
17957C41549A60278E0572a83323A17377b75901E1319J81768o9962B7909c50104
17946c44258B67598E811h307j0542A01818b6099k11746b2702j90908J3985E1216
17934I2738A7402a08613A0512i5631j2983j67754C816b53603a9819m0836D3129
17922B82719I8707c1288m7491D25025g4334n5746A47760E5739K90494e4339F2753
17910B35459g1227A77657o9923C2013P9781M7700p5048a50164e2718j0930A54390
17898b30693n4161A10056a2423j37106A41571i1800k79343C58910A03990J7673
$$ plain form
17979 -88190 -66692 199121 -13177 -123249 110361 -39589 276244 -323954 -217585 -11485
17968 -164234 126465 104952 129097 129506 -118852 -17296 130585 -195535 160968 2966 341549
17957 341549 160278 50572 -183323 117377 -275901 51319 233087 163125 27909 -350104
17946 -344258 267598 5811 -8307 -18849 101818 -26099 -237845 -22702 -213610 -199625 51216
17934 92738 17402 -108613 10512 -95631 -108614 -276368 3816 -253603 -19819 -60655 43129
17922 282719 98707 -31288 -78779 425025 -74334 -130080 147760 55739 346233 -54339 62753
17910 235459 -71227 177657 107734 32013 111794 159494 84446 -150164 -52718 -63648 154390
17898 -230693 -284854 110056 -12423 -149529 141571 -91800 -371143 358910 103990 121663
17888A21663C4464g2993r7829C23672g8591j45458B68053d6963A75302c60007
17877a31697A64005a57980F1023b3043j47056A65526f3834k73875a26383d146
17866b3585j55113I29J00267k7794N4292f1188H7164a47410B54756A15661J59718
17855B75379A14834b89448A7003J66013b16464j47394L8609G735J49934b79485
17844B90418a37744a7189N690k8984k13171D5949K20142o3488a19790A37765c40761
17832A9346K03204b15723P4090j14523b7749B23318a04474l11379a70999A66951
17821A84497o3264R54J35921J89599a91420A4990J30515a57998K3361j3810j9405
17810a67852j7004C12361b93420J42721G3683b83177A96337c2206j13975M7844
$$ plain form
17888 121663 34464 -72993 -170822 323672 -78591 -224049 268053 -46963 175302 -360007
17877 -131697 164005 -157980 61023 -23043 -170099 165526 -63834 -337709 -126383 -4146
17866 -23585 -178698 929 101196 73402 127694 -61188 87164 -147410 254756 115661 275379
17855 275379 114834 -289448 17003 183016 -216464 -363858 -325249 7735 157669 -279485
17844 290418 -137744 -17189 -11499 -40483 -253654 45949 266091 202603 -119790 137765 -340761
17832 19346 222550 -215723 -141633 -256156 -27749 223318 -104474 -415853 -170999 166951
17821 184497 121233 122187 258108 447707 -191420 14990 145505 -157998 -134637 -148447 -167852
17810 -167852 -184856 312361 -293420 -150699 73683 -283177 196337 -32206 -146181 -98337
17800i8337o4453A40802g7130A17109B7713N6032a7078D6199d23619E7704K61989
17789C19693j55810a19301j67659A80254f9714C0247f14776i2177A54232E7200
17778c06023r668a6606E4438B4638L04990e7901E2350b49820h4238N525M113o3700
17766a38300H4133d432A5331q44J97248b35222A30579d6458p0878F1105M74123
17755E35228A66995C9516J15367d92669C3695J57947a61492O3150A34487O7414
17745B01901c3671R896P598m3837b6486D8459J49366O9884j19603a1573A0984
17733A35309a0640n9237j43813A86102a68100L4122A17135a10619m5755d7607
17722I3668e25876A31602c5864B440a95303B63844f0109H836a5585G4924c9926
$$ plain form
17800 -98337 -162790 140802 -77130 117109 27713 83745 -17078 46199 -423619 57704 319693
17789 319693 163883 -119301 -286960 180254 -69714 30247 -614776 -92177 154232 57200
17778 -306023 -315691 -16606 54438 24638 329628 -57901 52350 -249820 -84238 -78713 -74600 -138300
17766 -138300 84133 -4432 15331 14487 211735 -235222 130579 -46458 -117336 61105 535228
17755 535228 166995 39516 154883 -492669 33695 191642 -161492 -98342 134487 201901
17745 201901 -33671 -23775 -16177 -60014 -26486 48459 197825 267709 148106 -11573 10984
17733 135309 -10640 -69877 -213690 186102 -168100 -133978 117135 -110619 -156374 -47607
17722 93668 -525876 131602 -35864 2440 -195303 263844 -60109 8836 -15585 74924 -39926
17710d48464C6871J89505d1826B62712r0750o5547J80204b58521a16744D9860
17699D0789R1953f7695j57990Q3686A4178J44342F6778g4227r3920A34372g6570
17687F9596A7217a59224a4751k82147C97392a59467E7904k0939A1128N7437b45516
17675C5574b76694O5456D05201j24556e5738B34702e38276D9335a75113A4855
17664A98979b91796e041A14551R1999m5640K00442A75915a8559j15212j31806
17654b65577D48916i7267A89549b71445E29340A03260b3924D8041K00186H8514
17643b9688F2869O4113b56392N318g7359o9307j04448Q3548G1565i8730A51147
17631a78602A3787Q9199K55187A73791N5758g8013A2894e7263C05380a62664d2542
$$ plain form
17710 -448464 36871 226376 -41826 262712 171962 106415 286619 -258521 -116744 49860
17699 40789 132742 -67695 -225685 -141999 14178 158520 66778 -74227 -168147 134372 -76570
17687 69596 17217 -159224 -14751 -296898 397392 -159467 57904 36965 11128 68565 -245516
17675 35574 -276694 -211238 405201 280645 -55738 234702 -538276 49335 -175113 14855
17664 198979 -291796 -5041 114551 206550 160910 361352 175915 -18559 -133771 -265577
17654 -265577 448916 -97267 189549 -271445 529340 103260 -23924 48041 248227 88514
17643 -29688 62869 126982 -256392 -251074 -77359 -146666 -251114 -167566 71565 -98730 151147
17631 -178602 13787 102986 358173 173791 229549 -78013 12894 -57263 305380 -162664 -42542
17619a41B74421J14792j53731h3494A517K43416b04767R3816r0506C70914a97688
17607b4984k5629C16802j05940g4676A14688n3103R1877e6081j8204B20469k9652
17596A90817b16514B7221b20456B98120d774o4153j60221A25835a40556C4126
17585B02073p8093a20635B76722I4533a08800A54869j9725e767j31405D294L100
17574G394d6770A8222J25577F7997j242a75698C9696N3394i835j1685l97917J79342
17562b40095a8921j30093E7513a15162c328H8490B4822M4857b04853a02126A94407
17550G6386D859J82839F4437Q978O94B1481J16447m3810N7845k3812a09850A66519
17537b94818A6556J39135e1951A34310F6008K39697m036H8791c90128C06443m7095
$$ plain form
17619 -141 274421 389213 235482 -83494 1517 244933 -204767 -110951 -201457 370914 -197688
17607 -24984 -50613 316802 210862 -74676 114688 61585 153462 -56081 -74285 220469 190817
17596 190817 -216514 27221 -220456 298120 -4774 -68927 -229148 125835 -140556 34126
17585 202073 123980 -120635 276722 94533 -108800 154869 135144 -5767 -137172 4294 7394
17574 7394 -46770 18222 143799 67997 66755 -175698 39696 93090 -9835 -21520 -419437 -240095
17562 -240095 -18921 -149014 57513 -115162 -3328 88490 24822 69679 -204853 -102126 194407
17550 76386 4859 187698 64437 73415 74109 21481 137928 94118 151963 128151 -109850 166519
17537 -294818 16556 155691 -51951 134310 66008 305705 301669 88791 -390128 306443 259348
17526B59348H9471a78438G7933J34751b7009F1808K23735p5402M3894d2771A69779
17514a84435C49802A11489a68228E9868K98299b95442a25498B7572m050K18540
17504B42062b59958F8524K8187J24511K35758A01344k1423J50639k7828H0313
17493D1174a98583C86123j85244b04920G943N49452A18670R03M2245e7122I2205
17481A67082a55366B22006C3098b03431A62204i361j0058B32464a70442R715C20317
17469B23529d6585K1373j14832B41863o8678B7568b37329B9285L8350a70878k3599
17458a94477E0181J16735J30986B8634Q5343J76187n3784j9569k3644O2079O438
17447B61684q6518B6810K72560j30453N1295b61403H4430G983M5661J43463D1718
$$ plain form
17526 259348 89471 -178438 77933 212684 -27009 61808 285543 210141 254035 -42771 169779
17514 -184435 349802 111489 -168228 59868 358167 -295442 -125498 27572 23522 242062
17504 242062 -259958 68524 96711 221222 456980 101344 79921 230560 202732 80313
17493 41174 -198583 386123 200879 -204920 7943 557395 118670 119573 161818 -57122 92205
17481 167082 -155366 222006 33098 -203431 162204 -9361 -19419 232464 -170442 -160727 320317
17469 223529 -46585 -25212 -140044 241863 173185 27568 -237329 29285 67635 -170878 -194477
17458 -194477 50181 166916 297902 28634 113977 290164 236380 216811 193167 255246 261684
17447 261684 175166 26810 299370 168917 220212 -261403 84430 7983 53644 197107 41718
17435B07338l8145g798j6569A60882J75132G7508J17444L56085c2726A06900i4282
17423E21394B55893j27436g4167B84134c3687A46425R7701L6386I7420K20106
17413C17526J97512B22577H3229K40198A51340b1402A41831B5532K61394F7008
17402B3070a86077H8368b18907A89432I1594N7794P4711F7139J6131a06281B15308
17390d062B18405h5937D907g8544o9352C81860b3047G5291K95129g8046C04102
17378A50327n0541K78747r0313a25101G2355J8360R9868L12623j90012o4347j21126
17367A27721P8288a20123a1577K618E4492L40841H3258J59157A15008J63066H1885
17355B55148B5431L6204P418k4311c09538A32775b95153I772N2481M1836J96896
$$ plain form
17435 207338 169193 -7798 -24367 160882 336014 77508 194952 551037 -32726 106900 -94282
17423 521394 255893 128457 -74167 284134 -33687 146425 244126 280512 97420 317526
17413 317526 515038 222577 83229 323427 151340 -21402 141831 25532 286926 67008
17402 23070 -186077 88368 -218907 189432 91594 149388 224099 67139 83270 -106281 215308
17390 -4062 218405 -85937 4907 -78544 -147896 381860 -23047 75291 370420 -78046 304102
17378 150327 99786 378533 288220 -125101 72355 90715 190583 503206 313194 248847 127721
17367 127721 206009 -120123 -11577 -8959 54492 395333 83258 242415 115008 278074 81885
17355 255148 25431 61635 69053 44742 -309538 132775 -295153 9772 62253 104089 300985
17344C00985a12418A03634L43949A47543N4040N8645O1236O8472A17379K3797
17334A41176N2789R6116r1695E2353M1722a11165B25824H3968K88492A46113K35718
17323C81831a45967A02489l1140K61278g1803D22928j79675l405e7135B15992
17312a48A68147J40972A01866l1997J98859q3292F081i51k90288G8208L56975
17301D35183K2681C0305Q7268c6176q9558I8374K56660j9449j15302L47385a24415
17289D52590B04840i434B99881A14393J63051E7361P1922M2572J00182L7631A15328
17277B45055l3521I3398L1250P7328m0183N05055l25621a5474B15262b3131k24396
17266b47527C70554A8000K17069L55318A88594G1911L28566j41331M3715K6907
$$ plain form
17344 300985 -112418 103634 447583 147543 201583 260228 321464 389936 117379 141176
17334 141176 193965 290081 198386 52353 94075 -111165 225824 83968 372460 146113 381831
17323 381831 -145967 102489 71349 332627 -71803 422928 243253 239848 -57135 215992
17312 -148 168147 309119 101866 69869 268728 185436 6081 -951 -291239 78208 435183
17301 435183 457864 30305 117573 -36176 -125734 98374 355034 335585 220283 567668 -124415
17289 452590 204840 -9434 299881 114393 277444 57361 129283 171855 272037 309668 115328
17277 245055 211534 93398 124648 201976 161793 666848 341227 -15474 215262 -23131 -247527
17266 -247527 370554 18000 235069 590387 188594 71911 400477 259146 302861 329768
17256C29768j56484O7233l2986J6228J73403J3244j22738A20917J39191b8620
17245b528D9352L31418H7329e0761E45239A79222L01803I9281J66522J4517j22340
17234A57980n44A0082h8688C67663A34814J45870g7786B44008l6182a11904B70810
17222f4880A11377L2781b20626D21820j1279A85040H2838O7256J195K02245h3163
17210A05355K01045p4811H3753a3563A61667l0936M746N4717r4785J18577J59456
17199C73442d1415D75247j99156I9132Q5540b1052F5652h6096M25C19393d2925
17187I8920m324c36661B13238J78890A85760K82115j52770E6012K70771j36081
17177A90702q5415L10825Q3258B15695O6217M41730E7459K20715J32352H8220
$$ plain form
17256 329768 173284 240517 207531 223759 397162 410406 287668 120917 260108 -28620
17245 -2528 49352 380770 87329 -50761 545239 179222 481025 99281 265803 280320 157980
17234 157980 157436 10082 -88688 367663 134814 280684 -77786 244008 207826 -111904 270810
17222 -64880 111377 144158 -220626 421820 410541 185040 82838 150094 151289 353534 -83163
17210 105355 306400 231589 83753 -13563 161667 130731 135477 190194 95409 213986 373442
17199 373442 -41415 475247 276091 99132 184672 -21052 65652 -86096 -85671 319393 -42925
17187 98920 94596 -336661 213238 392128 185760 467875 315105 56012 326783 190702
17177 190702 105287 416112 499370 215695 281912 723642 57459 278174 410526 88220
17166C89051j50682R3384j47298O9377H4421K40157E5918M91497A25059L34479
17156D59538j63668F0777j5638K43394A42031R7486k6208J19173j03999D1677
17145C70695A15955J91068a0248E59149d3378C29603j46800R1399D0483P5879
17135A16362j2522P6396J53166f1194E3691M61581A89348J67428j25335K73009
17125E04450j18040j130m1131C7076K70904J01199o3274A09698L3205K84726A79892
17113C46989r3r6220K25474j04024K0486J31826k09156M968K13255j45751m7515
17102C40239J31043j05805K12558E2480L21209K03361A63650P3807L32794k82323
17092B87928R6887L84238C49615K33020j41333N0311Q9095k88056K57276k58026
$$ plain form
17166 389051 238369 331753 184455 253832 84421 324578 55918 547415 125059 459538
17156 459538 295870 60777 45139 288533 142031 239517 213309 332482 228483 41677
17145 370695 115955 307023 -10248 559149 -43378 329603 182803 274202 40483 116362
17135 116362 103840 180236 333402 -61194 53691 515272 189348 356776 231441 504450
17125 504450 386410 385280 344149 37076 307980 409179 345905 109698 142903 427629 179892
17113 346989 346896 250676 476150 372126 392612 524438 315282 320250 533505 387754 340239
17102 340239 471282 365477 578035 52480 373689 577050 163650 237457 570251 287928
17092 287928 384815 769053 349615 582635 441302 491613 580708 292652 549928 291902
17082B91902J57658A89555R9832K52640J71243j90993M6516j16937A71667M5243
17072B16910J07369J0765J48075A22386N52104k00034J42896K39428l3811g8039
17061E20704B26625A05323O76686A68322O32383l98123j72859J80522k9786J91195
17051E71654k43473j43095K43232J70948B01437M52794k02236J04745A12211M96920
17041F09131m312k26145L23643C32393J3106j58547L33677A96332L71275B02556
17030E96794q7041J40134k04822J18602K9319k36817O38066D78453q5643K36755
17020F29565J52708j32733K54028k02114k54027K01004k0057M4359J08554J5043
17010G96330l62846J05393J82199m409J67128m24858o618J32374k19224K44791
$$ plain form
17082 291902 449560 189555 289387 542027 713270 522277 568793 451856 171667 216910
17072 216910 324279 335044 483119 122386 674490 474456 617352 856780 822969 -78039
17061 520704 226625 105323 782009 168322 800705 402582 229723 410245 380459 571654
17051 571654 328181 185086 428318 599266 201437 654231 451995 556740 112211 609131
17041 609131 604819 378674 702317 332393 345499 186952 520629 196332 567607 202556
17030 596794 509753 649887 445065 563667 592986 356169 994235 478453 392810 629565
17020 629565 782273 649540 903568 701454 447427 648431 628374 672733 781287 796330
17010 796330 433484 538877 721076 716667 883795 458937 452319 584693 365469 610260
17000F10260J93375m4545n082K39255k33031J51752P2116k77751J97495k64632
16990F39212L9103K9397L50571k91162k04158J52753j12273J6053J77079k06190
16980E90385j91726N05454l05468L236N8783l4665K93483k70234J89164R317j27063
16969G20666B86354M94008J03360j05062J35931j14317R2874l10788L37284J16629
16959A036273j17375K98299m01812P1722L21389M9449j05497K4139K928k24380
16949I55135K72416j50098n27764M34079m1552l5674K31628r9583q1464l938M5479
16938I98664j41361N64841m14578M6672K35993m12689L14814N4292K77107o59711
16928H64044J58186O11237n73173N50749k17100l68321K25246j08617N45790o53555
$$ plain form
17000 610260 803635 759090 754008 993263 760232 911984 984100 706349 903844 639212
16990 639212 678315 707712 1058283 767121 562963 715716 603443 619496 796575 590385
16980 590385 398659 904113 598645 601881 660664 625999 919482 649248 838412 847729 720666
16969 720666 286354 780362 883722 778660 914591 800274 893148 582360 919644 1036273
16959 1036273 918898 1217197 815385 887107 1208496 1257945 1152448 1176587 1179515 955135
16949 955135 1227551 1077453 549689 983768 942216 906542 1138170 1038587 957123 953185 998664
16938 998664 857303 1422144 1007566 1054238 1290231 877542 1192356 1246648 1523755 864044
16928 864044 1022230 1633467 1060294 1611043 1393943 1025622 1250868 1142251 1688041 1034486
16918A034486L06503K77439j92645j22255R0518K68999o0369j10357m6934N2969
16908A498354J11744q3166L0351K10740m84168J19991K08436j39523M01328j84110
16898A689977J91399j14104m29305N06350l29278L62854j38520O0317M81650l81112
16888A900228l4719O7195L0295O6924M3042J63827o25460K80874k16936N44994
16878B220264j53697j08146J00147M72887j86418j91412q5160K98830o1107K79446
16868B585634k67297J81324j88192L48451j34595K88250j71437J18839j49774
16859B611203J82577n0002r8514L19767l51995O16753j21566k2346j60586M23950
16849C349241j59930q7620N96738n25749J14036K39483L6983L91023p28653M47385
$$ plain form
16918 1034486 1340989 1618428 1425783 1303528 1394046 1663045 1602676 1492319 1445385 1498354
16908 1498354 1610098 1526932 1557283 1768023 1283855 1403846 1612282 1472759 1874087 1689977
16898 1689977 1881376 1767272 1337967 1844317 1515039 1877893 1739373 1799690 2281340 1900228
16888 1900228 1865509 1932704 1962999 2029923 2072965 2236792 1611332 1892206 1675270 2220264
16878 2220264 2066567 1958421 2058568 2531455 2345037 2153625 2068465 2367295 2306188 2585634
16868 2585634 2318337 2499661 2311469 2659920 2525325 2813575 2642138 2760977 2611203
16859 2611203 2793780 2743778 2645264 2965031 2613036 3229789 3108223 3085877 2925291 3349241
16849 3349241 3189311 3101691 3698429 3172680 3286716 3526199 3563182 3954205 3225552 3672937
16839C672937J46672k00832J408O5566K18383K23337K36889l99457j7873L51879
16829D298909j0468R3402p284J4476M97673m34203O14684j909K1906r8749k26166
16818D762271P32992j00032J14614K33247J4260O2426k3179L69800K42572K098
16808F411069K2875L75938k30109J82743L82388j8637K23900L02791J35559q7970
16798G700547O3938O31817J29038M10587k3400M35499m1217N69450J32191J56554
16788A0165004L65780L302L56630L78897K38059K41061K76265M89638J15655N15079
16778A3145370P34841L06844N34775L92087J31500R09668M12985P46383N11391
16769A7825844N24026K81691J204503M05867Q03174Q67998R69912N34183J095776
$$ plain form
16839 3672937 3819609 3618777 3620185 3685751 3904134 4127471 4364360 3964903 3947030 4298909
16829 4298909 4288441 4381843 4374559 4389035 4886708 4452505 5067189 5065280 5087186 4988437 4762271
16818 4762271 5495263 5395231 5509845 5743092 5757352 5819778 5796599 6166399 6408971 6411069
16808 6411069 6433944 6809882 6579773 6762516 7144904 7126267 7350167 7652958 7788517 7700547
16798 7700547 7764485 8396302 8525340 8935927 8912527 9348026 9306809 9876259 10008450 10165004
16788 10165004 10530784 10534086 10890716 11269613 11507672 11748733 12024998 12514636 12630291 13145370
16778 13145370 13880211 14187055 14721830 15113917 15245417 16155085 16568070 17314453 17825844
16769 17825844 18349870 18631561 19836064 20241931 21045105 21913103 22883015 23417198 24512974
16760B4512974P58973P62105J649942J303254J133623J237908J272743J630945
16752C4262467J645055J792055J476077J600712K444057J936903K822980K113596
16744E0093902K633840K946033L270244K899619L584368L955167M021592M280080
16736G7684845M968242M489252N197782O084925N988308O357899O356040P322671
16728A24449964O945200P560863P830794P828149P598329P638290P079421O761253
16720A83692263N801172N291546L862314K729919J355986k2201j284523k659668
16712A98766808l777846m760171n926846o771012p146457p436180p800705p940527
16704A47207064p979144p583855p642879o815356o948977o479448o225924n664712
$$ plain form
16760 24512974 25271947 26034052 27683994 28987248 30120871 31358779 32631522 34262467
16752 34262467 35907522 37699577 39175654 40776366 43220423 45157326 47980306 50093902
16744 50093902 52727742 55673775 58944019 61843638 65428006 69383173 73404765 77684845
16736 77684845 82653087 87142339 92340121 98425046 104413354 110771253 117127293 124449964
16728 124449964 131395164 138956027 146786821 154614970 162213299 169851589 176931010 183692263
16720 183692263 189493435 194784981 198647295 201377214 202733200 202710999 201426476 198766808
16712 198766808 194988962 190228791 184301945 177530933 170384476 162948296 155147591 147207064
16704 147207064 139227920 131644065 124001186 117185830 110236853 103757405 97531481 91866769
16696I1866769n445596n019090m852220m453129l760232l929630l552117l415939
16688E7438816k526066l506754k484694k289646k242191k497544j586002j929674
16680C8376245k077612j754096j213781j467262j121183j601180j198092j440808
16672B6502231r33886q84382j005830j236958l94760j038344q69660l84636r51162
16663A8802613o32849o57667m64362l74400p66665l06125n74639l36476j124216
16654A3565214J74136o43592m65665l71022k54717l02120n53964l75617m93506
16645A0279147P5524n19898R326n16481P3798l70654l04223k38726m03691K60155
16635H344277k85966J4576n91255k52438m27216M51952n80198N1159k25680k21465
$$ plain form
16696 91866769 86421173 81402083 76549863 72096734 68336502 64406872 60854755 57438816
16688 57438816 54912750 51405996 48921302 46631656 44389465 41891921 40305919 38376245
16680 38376245 36298633 34544537 33330756 31863494 30742311 29141131 27943039 26502231
16672 26502231 25568345 24683963 23678133 22441175 22046415 21008071 20138411 19753775 18802613
16663 18802613 18169764 17512097 17047735 16673335 15906670 15600545 15025906 14689430 13565214
16654 13565214 13739350 13095758 12630093 12259071 12004354 11702234 11148270 10772653 10279147
16645 10279147 10354671 9834773 9844099 9327618 9401416 9030762 8726539 8487813 8084122 8344277
16635 8344277 8058311 8072887 7481632 7229194 6801978 7253930 6673732 6724891 6499211 6277746
16625F277746J27448L2623n44924J96304l73322N3757l28043j31434l4541l9534
16615E236080R2360j38537k56916k06661m23424O39453n59975J86064j11548J45417
16605D602313n10912k04280L33204j84868j21104j30007K03105j97485j36816
16596C653150J99606l24474k02567J22804l36032j64017L19551m75544K36458
16587C028935J43163J64201j22638l81231k99159L16320Q0565q2296p3003j93651
16577B581206N09454o31531k655J08382m12052O47370l90844K4290m3462P4134
16567B464292n6719m11856K48870N5498J73580n6011m06107q5654J55716p345
16557B074264P123k25951o5079p2764J85833P9744k49134Q7429N4270j20485M8014
$$ plain form
16625 6277746 6405194 6437817 5892893 6089197 5715875 5769632 5441589 5310155 5275614 5236080
16615 5236080 5328440 5189903 4932987 4726326 4302902 4942355 4382380 4568444 4456896 4602313
16605 4602313 4091401 3887121 4220325 4035457 3914353 3784346 3987451 3789966 3653150
16596 3653150 3852756 3528282 3325715 3448519 3112487 2948470 3268021 2792477 3028935
16587 3028935 3172098 3336299 3213661 2832430 2533271 2849591 2930156 2847860 2774857 2581206
16577 2581206 3090660 2459129 2456474 2564856 2152804 2800174 2409330 2433620 2390158 2464292
16567 2464292 2407573 1995717 2244587 2300085 2473665 2417654 2011547 1925893 2081609 2074264
16557 2074264 2081387 1855436 1790357 1717593 1903426 1983170 1734036 1821465 1875735 1755250 1803264
16546A803264P8214k12455J9324J54481m947k01849L64363l52835J76074q0132
16536A743502J8044l73951K33303n7283l66682J83643L64291j71626J7445l39948
16526A250738J37837K10567k80443o6457L4700K30601j80844k88549O85945l36369
16516A397726j79393j7848o50K18111L02136j40490l19154K76490m64939J61363
16506A233352l85478K77011J6383J79599p4007K40212n47055J0517K55218o1417
16496A144335m88484L85366J43245K7270k43924j36527K59892j97190L28872l02198
16486I20657q9627j50793L02494j7209K4856K23059m58927k5559J91575j29512
16476G91014J97277r3546p1552L99226m94975K46212k52597J99945j86735J31753
$$ plain form
16546 1803264 1881478 1669023 1688347 1842828 1837881 1636032 2000395 1647560 1823634 1743502
16536 1743502 1761546 1387595 1620898 1563615 1196933 1380576 1744867 1573241 1590686 1250738
16526 1250738 1388575 1599142 1318699 1252242 1286942 1517543 1336699 1048150 1734095 1397726
16516 1397726 1218333 1200485 1199835 1417946 1720082 1579592 1260438 1536928 1071989 1233352
16506 1233352 847874 1124885 1141268 1320867 1246860 1487072 940017 950534 1205752 1144335
16496 1144335 655851 1041217 1184462 1211732 967808 831281 1091173 893983 1222855 920657
16486 920657 831030 680237 982731 965522 990378 1213437 754510 728951 920526 791014
16476 791014 988291 894745 823193 1222419 727444 973656 721059 921004 734269 866022
16466H66022l30143L87538j06052r0919o4927k6521p619K8827j8430M47644k45771
16455H39649j89121J35938J13177o7357k5821l69246M52167j7271l64130J92909
16445G00894k87783M53142j43739K42279l59558p7427j0879J52244P8721J20622
16435H68516j35383L5751m8028M073J0531J91910C18475r2623N92416j09800k05968
16424E02500J4090K03734n2032k72418K5683J2751K07459C19406m6792K3374M91823
16413G87811J15128k69099j96932J68119K3974j73266p974k0960A63440K67223
16403D30663J7020r1462J25402L9618k45666P0954r9289N12115j50373k83681
16393C25301J65427J88847n735k2135J47432l49914J15442K1987J58891B47349
$$ plain form
16466 866022 535879 923417 817365 726446 661519 634998 627379 656206 637776 1085420 839649
16455 839649 650528 786466 899643 832286 806465 437219 889386 872115 507985 700894
16445 700894 413111 866253 722514 964793 605235 527808 516929 669173 747894 868516
16435 868516 733133 768884 720856 724929 735460 927370 318475 225852 818268 708468 502500
16424 502500 516590 720324 668292 395874 421557 434308 641767 319406 272614 295988 787811
16413 787811 902939 633840 436908 605027 629001 455735 447761 426801 163440 430663
16403 430663 447683 356221 481623 521241 275575 346529 247240 759355 608982 325301
16393 325301 490728 679575 673840 651705 799137 449223 564665 586652 745543 247349
16382C16049L13664j63317K28968j10609j17884K41630j50699B47646A5818M32319
16372D48137k11577K52916B29957K30231P899p4777L71422k36753j62269p5979
16362B89731K74941r5144j2359k21887K97662K5830k54031r8214J05614r634L3490
16351C35999K63838j17057R6708j17369L2261A74464J68517J1979R1444k06794
16341B39610K08976A58350J62037K33521C8885N87224B34033N04895B05560K56995
16331D62555n5795B969L0987K80922J21258J75715B07972Q2931M2063J72269j36880
16320C68355K15764K5513k65793k2843j24978P4626O1020J9584j72831L71808
16310E50225k43551H7992Q2541N9474L89386K27010C78422L7113j08306E3053
$$ plain form
16382 316049 629713 466396 695364 584755 466871 708501 557802 247646 15818 448137
16372 448137 236560 489476 229957 460188 468087 393310 764732 527979 365710 289731
16362 289731 564672 469528 457169 235282 532944 558774 304743 206529 312143 302509 335999
16351 335999 599837 482780 579488 462119 494380 174464 342981 354960 446404 239610
16341 239610 448586 158350 320387 553908 38885 626109 234033 738928 205560 462555
16331 462555 406760 2969 33956 314878 436136 611851 207972 290903 332966 505235 368355
16320 368355 584119 609632 343839 320996 196018 270644 331664 351248 178417 550225
16310 550225 306674 87992 170533 230007 619393 846403 378422 415535 307229 53053
16299B94929J31410j25212K10766A43331l0774K08102n3968J31328j83323K10295
16289D24991o7843l1687J03481m3263L00862l24912J35957A24023L12418R4183
16279E30624K7066H4751L53046O7622q1860b5975B06106R4673q1208K64151k19623
16268B64099M4600J01427D6026K41186j00004p4666J66137m1119A09936L40122
16258D50058q0383j41577M43226k24328j30527n3612L80075n04B04389O1924j01693
16247A64620k9387Q6186H4466L04816l9368F8308J81979Q9876H763K06589M8733
16236B64085J31702j29685H1346J28232K21595D018M05533f0709B57949e4976
16225i6366C53763r2317o671e207E78339k46997J24488f5279A47084b64344C57602
$$ plain form
16299 294929 426339 301127 511893 143331 112557 320659 266691 398019 214696 424991
16289 424991 357148 325461 428942 385679 686541 361629 497586 124023 436441 530624
16279 530624 557690 84751 437797 505419 423559 -25975 206106 300779 219571 483722 264099
16268 264099 308699 410126 46026 287212 187208 112542 278679 237560 109936 450058
16258 450058 369675 228098 671324 446996 316469 262857 642932 642428 204389 266313 164620
16247 164620 135233 221419 84466 389282 349914 68308 250287 340163 8763 215352 264085
16236 264085 395787 266102 81346 209578 431173 4018 409551 -60709 257949 -54976
16225 -96366 353763 261446 254775 -5207 578339 331342 455830 -65279 147084 -264344 357602
16213A13929F448M04275L12498B38102K00346D8608L3579K948J61309H63K7555
16202B8418a656k3590B38521F8510f5739A66072h5121D4158K93280j25046J09330
16191C21722N5506D2014K99320A39662C5249K09955d3035A035J91284R4658l2618
16180B54359a58106A52510J43445j02302K2801H3028K59464C5281K46033A31926
16169F9564J3633K0818J55722J52994k01576b8020A41031B3925L14359e7703B71207
16157A88333a38904D03991B0661K4736J74236a17576j04976F127b41654c2642
16146A4569R7316d6742D5184A7713L13315A16286J7158A7004H046c35067c72m9772
16134e0144D14405A51303o5921A7399J2083K212O5629L18135a02466C2627J65048
$$ plain form
16213 113929 6448 410723 723221 238102 438448 48608 82187 85135 246444 863 28418
16202 28418 -1656 -25246 238521 68510 -65739 166072 -85121 44158 337438 212392 321722
16191 321722 377228 42014 341334 139662 35249 245204 -43035 1035 192319 286977 254359
16180 254359 -158106 152510 295955 193653 216454 83028 342492 35281 281314 131926
16169 69564 83197 104015 259737 412731 211155 -28020 141031 23925 338284 -57703 271207
16157 188333 -138904 403991 20661 45397 219633 -117576 -222552 6127 -241654 -32642
16146 14569 111885 -46742 45184 17713 331028 116286 133444 17004 8046 -335067 -372 -50144
16134 -50144 414405 151303 85382 17399 29482 31694 97323 415458 -102466 32627 197675
16123A97675J70102e0651A11959k8576N1512d599j20464B02748R6621q9507d2479
16111B9695K0162J68376a4431A44046c129B12585J06425F8624J20726c05408A98410
16099i7591D06166k02000p7003i9010B35825J77845F0993J00158f0041A76476
16088B08210c07024D73553c76081C0526f4987C00442A43386C6906J24124d7136
16077f9165b9452D2176a23333H1430l2888K9314a18914k66403B30489K16005a3323
16065F2467J84337A18763i8016A52622k111b07546g2779A13391D3446R8494J70143
16054C12083I220a18464i660G0957c94511A42492a55003B6551a38463n3444C7560
16042a35295d7329q350D6239k145N46085b6680B19938j07986R5016a27520C23938
$$ plain form
16123 197675 367777 -50651 111959 83383 134895 -4599 -125063 202748 299369 209862 -42479
16111 29695 49857 218233 -14431 144046 -3129 212585 319010 68624 189350 -305408 198410
16099 -97591 406166 204166 127163 -99010 235825 413670 60993 161151 -60041 176476
16088 208210 -307024 473553 -376081 30526 -64987 300442 143386 36906 161030 -47136
16077 -69165 -29452 42176 -123333 81430 48542 77856 -118914 -385317 230489 446494 -13323
16065 62467 246804 118763 -98016 152622 150511 -207546 -72779 113391 43446 141940 312083
16054 312083 9220 -118464 -9660 70957 -394511 142492 -155003 26551 -138463 -191907 37560
16042 -135295 -47329 -55679 46239 44094 590179 -26680 219938 111952 206968 -127520 323938
16030D1271e6594A28735c63201E8699K00623H4603a81036B4099a49319B1078g6732
16018a8869j71533B9148g5658C1071J92609b48440j61700A7992K34866L675c24578
16006F1559N6325P2441a47319G3257A3939J43847G1634b40244g7069n9707P864
15995a28912n1811j23801Q7684b0188p3381A47387C1993a90920b9216B48045a63383
15983a11904F1474a10907c8145C66701J26151B00186I7882B9787a24674A50019
15972i7365l3521C05666j07851a77466k8637B46884D6224f4410k7222j42320J10470
15961a23482K5587b7300B11224G5195d088A25406b5236F861a19576E3263a25367
15949B4698N2800N9424a48712L3093e0064j61354G3334l0935b39651b8693o3261
$$ plain form
16030 41271 -56594 128735 -363201 58699 259322 84603 -181036 24099 -149319 21078 -76732
16018 -18869 -190402 29148 -75658 31071 223680 -248440 -410140 17992 252858 256533 -324578
16006 61559 117884 190325 -147319 73257 13939 157786 71634 -240244 -77069 -136776 -128912
15995 -128912 -180723 -304524 -216840 -20188 -93569 147387 31993 -190920 -29216 248045 -163383
15983 -111904 61474 -110907 -38145 366701 492852 200186 97882 29787 -124674 150019
15972 -97365 -130886 305666 197815 -177466 -206103 246884 46224 -64410 -91632 -233952 -123482
15961 -123482 -97895 -27300 211224 75195 -4088 125406 -25236 6861 -119576 53263 -125367
15949 24698 77498 136922 -148712 -115619 -50064 -211418 73334 42399 -239651 -28693 -91954
15938i1954H0729h5616J1952A45913b82127A14756B0707a8016m1277k04617B66527
15926B6057H047a30761B08231G9252d12284E2712Q7763b37132J08847l4216j86166
15915c48667C5976P4856i1132B15150G8649a73016N753L1402D004c2008j19039
15904a51047n739m4723D2846f0280D4805J65628f9028j20360A83773c2938o5831
15893i8769j32012N8288I5633a86172A05049o564a19527k05038F5018Q034c86994
15881A69946o5401c42655G8455O7375k8842e1130B58694k5428h5225A99762a32191
15869A06724c78596I9357a55790L0727L4393j59788A22839f6662b4508i234A91008
15857H3845d06986B81551B4875g7542b6241k95297E0031P9126K0738A2333J40918
$$ plain form
15938 -91954 80729 -85616 -73664 145913 -282127 114756 20707 -18016 -59293 -263910 266527
15926 26057 8047 -130761 208231 79252 -412284 52712 140475 -237132 -128285 -162501 -348667
15915 -348667 35976 110832 -91132 215150 78649 -173016 -167263 -135861 4004 -32008 -151047
15904 -151047 -156786 -201509 42846 -60280 44805 210433 -69028 -189388 183773 -32938 -98769
15893 -98769 -230781 -172493 95633 -186172 105049 98485 -119527 -324565 65018 73052 -386994
15881 169946 104545 -342655 78455 145830 116988 -51130 258694 233266 -85225 199762 -132191
15869 106724 -378596 99357 -155790 -125063 -90670 -250458 122839 -66662 -24508 -9234 191008
15857 83845 -406986 281551 24875 -77542 -26241 -321538 50031 129157 149895 12333 153251
15846A53251N66g0079r7167D6584a03424A67715a75491A73655E1556a9643D63188
15834H778a66794G2450b13431l9410A66789d9894k2666A75140G0407b05329e0582
15822a39959a1837j0708j18551k13702J42876G3454Q0068h2286D3190j8128L9626
15811F4688a26311k0806e3670p6050C88540f7418k4586b6158k53168l5145j09250
15800d23721c3958m9000b5846k53983J00631l3967B5082a43753A69660a94381
15789b94220B57636o4172C2046a30241N2884A06444J58007a73725g0715q9338
15779a60053K1371c8017B0856J12858b3947q3093A70071E0474Q7618J03578c42678
15767e9355G1955c836H583J4155K8394J80881h575k25316h1292b9479n6893F2884
$$ plain form
15846 153251 153817 -70079 -167246 46584 -103424 167715 -175491 173655 51556 -19643 463188
15834 8778 -166794 72450 -213431 -252841 166789 -49894 -72560 175140 70407 -205329 -50582
15822 -139959 -11837 -22545 -141096 -354798 -211922 73454 153522 -82286 43190 25062 64688
15811 64688 -126311 -147117 -53670 -129720 388540 -67418 -92004 -26158 -279326 -314471 -423721
15800 -423721 -33958 -82958 -25846 -279829 -179198 -213165 25082 -143753 169660 -194381
15789 -294220 257636 193464 32046 -130241 -77357 106444 264451 -173725 -70715 -160053
15779 -160053 -138682 -38017 20856 133714 -23947 -107040 170071 50474 138092 241670 -342678
15767 -59355 71955 -3836 8583 22738 51132 232013 -8575 -233891 -81292 -29479 -86372 62884
15754E8367Q61d64888C37759A592b26953i0545A1619K05150D6698i254j10173
15743a19427A61568k0484b17357j70964p6701N3962a52108B86420a09452b0799
15732b65012d3728k4998j3848b9699k20502D559e7019A35836J0007c3445r2003
15721a25448N8286E5567J7635a87847d8890m273B7540c27815f3648G0712Q5779
15710A56491k1033h5981n1979j5604P3946j77571Q0200d6200G1808a30758b9574
15698C7776E199b18905g2975A04173C8915j9215K24619f3355C8475h6216m8431
15687a34647f1777r6377Q115N1584m9254I2833C4017P385a7694r5617C9121i7364
15674e5508K2487C8587J14708C8013f5813A6176Q6514B0761b02695C0996K3528
$$ plain form
15754 58367 59228 -464888 337759 1592 -226953 -90545 11619 216769 46698 -9254 -119427
15743 -119427 161568 141084 -217357 -388321 -465022 -411060 -152108 286420 -109452 -20799
15732 -265012 -43728 -68726 -82574 -29699 -250201 4559 -57019 135836 145843 -33445 -125448
15721 -125448 -67162 55567 73202 -187847 -48890 -53163 27540 -327815 -63648 70712 156491
15710 156491 135458 -85981 -137960 -153564 -79618 -257189 -176989 -46200 71808 -130758 -29574
15698 37776 5199 -218905 -72975 104173 38915 19700 244319 -63355 38475 -86216 -134647
15687 -134647 -61777 -158154 -150039 -98455 -147709 92833 34017 41402 -17694 -113311 39121 -97364
15674 -55508 -33021 38587 153295 38013 -65813 16176 102690 20761 -202695 30996 54524
15663E4524a24485A75318n3577B3941J79410E4733N66H48b35263e5286p1071A0755
15650a36274p0507k22393a46076F712i8507d23k53114J12342B13696a70590A34511
15638a81531B7488L6118a03277C35408A33053J15266a47129E3059b47741B4458
15627a6565p2861o8605F9300N821B0084a32853F7427a9006I9980l2280a87340
15615g0980k60379A89628M1843a52269n9890k80682a35560C56h6573b5995n7013
15604h3008j18905j37972e8367q2775j27366N8746d0425k40863k706a32550B7964
15592B8801b89744D7370h4714H9804K7655i9837I5641l3410h8246p4345B99131
15580B1344b1821B43791A20147e2230A39730a14676j57030d3852J1702k54369
$$ plain form
15663 54524 -124485 175318 121741 23941 203351 54733 55299 848 -235263 -55286 -126357 10755
15650 -136274 -206781 -429174 -146076 6712 -98507 -423 -253537 -141195 213696 -170590 134511
15638 -181531 27488 63606 -103277 335408 133053 248319 -147129 53059 -247741 24458
15627 -16565 -89426 -158031 69300 75121 20084 -132853 67427 -19006 99980 67700 -187340
15615 -70980 -331359 189628 231471 -152269 -212159 -492841 -135560 356 -86573 -25995 -83008
15604 -83008 -201913 -339885 -58367 -141142 -268508 -209762 -40425 -281288 -283994 -132550 27964
15592 28801 -289744 47370 -84714 89804 117459 -99837 95641 62231 -88246 -162591 299131
15580 21344 -21821 243791 120147 -52230 139730 -114676 -271706 -43852 -32150 -286519
15570b86519J08831j15502A20128J25346M0612c16716e7364k5062J4531a6663
15559B39053e0550C609f9178A22015i486A75488a07317q1616H4890a68210a1381
15547a94815a0872j26971G8350a13100b8269B7503a58894A62706b7391j40745
15537a68136O7888K1997a567l2406B22083b18680g6167q4327k975C17568a42139
15525a17513k2479f0047r1195H9275i9714C35519a21425B13242K13562A32475
15514a40206A36021k7833J1893A2408J37609a79678F8806d59844H0239c4892A83070
15502a39193B72886a87318j86910I4776d31565D0075M0704B3664b0339l64193
15492c84532B50629c21908M3058B7472J04570a4377j19969O1950A26874P7987
$$ plain form
15570 -286519 -177688 -293190 120128 245474 286086 -316716 -57364 -82426 -67895 -16663
15559 239053 -50550 3609 -69178 122015 -9486 175488 -107317 -188933 84890 -168210 -11381
15547 -194815 -10872 -137843 78350 -113100 -28269 27503 -158894 162706 -27391 -168136
15537 -168136 -100248 -78251 -1567 -33973 222083 -218680 -76167 -160494 -163469 317568 -142139
15525 -117513 -139992 -60047 -151242 89275 -99714 335519 -121425 213242 426804 132475
15514 -140206 136021 108188 120081 12408 150017 -179678 68806 -459844 80239 -34892 183070
15502 -139193 272886 -187318 -374228 94776 -431565 40075 80779 23664 -20339 -384532
15492 -384532 250629 -321908 -278850 27472 132042 -14377 -134346 -72396 126874 204861
15482B04861g6238B50429F8968a08552A55661p5503Q6078C0956h3094a1632l9609
15471e1241i411B8092J46382C1454G896f0720o0309B32152J04801e4620G057P0045
15459G7102R2630N763j5360a22663H2086J77799a77113N2825F2845c9097j10746
15448a49843A14934a82563A15440a10967B5119a52378A14580c32263B41822b94009
15437A167a28360E1251e0307B1046a65551I4554m3483M8154a944k374C1357J84005
15425B15362G7421J263K5751a12517B85082a03049p5363A23612g5397C62389j22528
15414B39861l4084a34127C65647h9639m0802i472F0305J33897a63232E0071R4479
15403A44550M8265D159J2118J69549C5089M3706a2830j10200j73608A66937i4225
$$ plain form
15482 204861 -76238 250429 68968 -108552 155661 80158 166236 30956 -83094 -11632 -51241
15471 -51241 -9411 28092 174474 31454 7896 -60720 -121029 232152 336953 -54620 7057 77102
15459 77102 169732 175495 160135 -122663 82086 259885 -177113 -124288 62845 -39097 -149843
15448 -149843 114934 -182563 115440 -110967 25119 -152378 114580 -332263 241822 -294009
15437 1167 -128360 51251 -50307 21046 -165551 94554 51071 99225 -1944 -4318 31357 215362
15425 215362 77421 78684 104435 -112517 285082 -103049 -178412 123612 -75397 362389 239861
15414 239861 205777 -134127 365647 -89639 -130441 -9472 60305 194202 -163232 50071 144550
15403 144550 192815 4159 16277 185826 35089 78795 -12830 -123030 -296638 166937 -94225
15391c15328A34333a37902O4887D8399e6012k29976A48534f4140A98813A5666
15380I9689a62486e6417j98535A52815K6715j5228E321h7102C4826J20546b78451
15368A12851e5741F8091a96363A58133G8145a79269o8751P3251g1864A26303A6157
15356a70587A2574a43558e5214b3690B89413c6490k09229B25385j00385M1063
15346A66063a81278H4495a14989p9282k38428A53143a45622C75322j45188a43911
15335D9681P767g2591B26314f2778j19374d9894m4248D6916n789J00946d8884
15323B82932K7756d0674I0695L6471K32344j51171h6009l1611j69283a17563A37384
15311C45020j59158E511L5261N9098a52766n1121A88287p2572a0084A0896c3186
$$ plain form
15391 -315328 134333 -137902 -73015 48399 -56012 -285988 148534 -64140 198813 15666
15380 99689 -162486 -56417 -254952 152815 179530 164302 5321 -87102 34826 155372 -278451
15368 112851 -55741 68091 -196363 158133 78145 -179269 -248020 -174769 -71864 126303 16157
15356 -170587 12574 -143558 -55214 -23690 289413 -36490 -245719 225385 125000 166063
15346 166063 -181278 84495 -114989 -194271 -432699 153143 -145622 375322 230134 -143911
15335 49681 57448 -72591 226314 -62778 -182152 -49894 -94142 46916 41127 142073 -48884
15323 282932 310688 -40674 90695 127166 359510 208339 -86009 -117620 -286903 -117563 137384
15311 345020 185862 5511 40772 99870 -152766 -203887 188287 115715 -10084 10896 -33186
15299b90784B03809f3102B93329P494d2093C1860h3151C60385b1211A973c33824
15287a90154B09644A2927J09741L30713a77767B18894r3674D1209C808J91609
15277A95417E8364a32894B34188o4730l4544h4439L7582g96B53459Q3316j31755
15266B05020l4895A0945R8608g4834A90174b05777j4771h8917B07795g7513A98380
15254e2567B47873D5253a1849j27087O6275c2737D69455M75813J226025K40294
15244B411587o39421Q30826j060250D15158o1331i0616C15137I0461h807p7391
15234h6198H9797H999M77001A11340a0353B15612B5255a89564B8840a07512A27790
15222C1245J69659P1871E680J66880K9126p2876K6178a06690m0079e6271j83496
$$ plain form
15299 -290784 203809 -63102 293329 300823 -42093 31860 -83151 360385 -21211 1973 -333824
15287 -190154 209644 12927 122668 453381 -177767 218894 125220 41209 3808 195417
15277 195417 58364 -132894 234188 169458 134914 -84439 -46857 -796 253459 336775 205020
15266 205020 170125 10945 109553 -74834 190174 -205777 -220548 -88917 207795 -77513 198380
15254 -52567 247873 45253 -11849 -138936 -72661 -32737 469455 945268 2171293 2411587
15244 2411587 1772166 2602992 1542742 415158 353827 -90616 315137 90461 -8807 -86198
15234 -86198 89797 8999 486000 111340 -10353 215612 25255 -189564 28840 -107512 127790
15222 31245 200904 272775 5680 172560 201686 128810 154988 -106690 -146769 -56271 -239767
15211b39767B96131e7436B12153b6860E4036h0468j48672H590c9797l7052G0010
15199a69914b4349G1171R9821g2924B90474B3240J38263M7074K0280c02958a33661
15187C12690a18773I4784R2918K9316A06965K60234b15881O1803g547j5609F462
15175a16636A13987b3206H7303a25477e86C32245C3801a93469i4369H222b47071
15163C72522A27378b258A22786m8477c01535J40171c164A96926r3718g6945C66601
15151A58504G0561f7427A6921L87042A53233J7771O9577B6944J27615R8988J07270
15140C60817f2652K4671H8011J47639a11577C34007j31252I3962J05946K03418
15130D03326a33123K2987A61311L0554J09662b1131A4407L3145J08103L60246
$$ plain form
15211 -239767 296131 -57436 212153 -26860 54036 -80468 -229140 8590 -39797 -76849 70010
15199 -169914 -24349 71171 170992 -72924 290474 23240 161503 208577 228857 -302958 -133661
15187 312690 -118773 94784 187702 217018 106965 367199 -215881 -154078 -7547 -23156 6462
15175 -116636 113987 -23206 87303 -125477 -586 332245 33801 -193469 -94369 8222 -247071
15163 372522 127378 -2258 122786 74309 -301535 -161364 -3164 196926 103208 -76945 366601
15151 158504 70561 -67427 16921 403963 153233 171004 240581 26944 154559 253547 360817
15140 360817 -62652 -37981 88011 235650 -111577 334007 202755 93962 199908 403326
15130 403326 -133123 -110136 161311 191865 301527 -21131 14407 47552 155655 515901
15120E15901B31392f2185C38611d1647c083k6491J2119E4566p163b3693D21475
15108B17160a56529A13016J01968J19612I6412K07069f710k1877A35455Q5411
15098B20866j05854Q5210J57497j65105a40373I3625K7713Q8378I7839J59140
15088B56979N4487A44955j5593K35770j64850J264B7755M7734a27408F5458K92051
15077C57509d70682a87336A75291a6406E1335J32441j8743o6246K98616B0442
15066E24327A84929j5097p7704K84285A51454K75322o9956i3702A73037l8076
15056A34961K85128D0123K69069J12267A16650l0903c5421D74716B16663a87563
15045A10703n2104J29425f942C37820i8480C09300J75598A21277L9687o7513k985
$$ plain form
15120 515901 231392 -62185 338611 -41647 -3083 -29574 -17455 54566 47403 -23693 421475
15108 217160 -156529 113016 214984 334596 96412 303481 -6710 -28587 135455 220866
15098 220866 115012 200222 357719 192614 -140373 93625 121338 209716 97839 256979
15088 256979 311466 144955 129362 365132 200282 201546 27755 75489 -127408 65458 357509
15077 357509 -470682 -187336 175291 -16406 51335 183776 165033 98787 397403 20442
15066 524327 184929 169832 92128 376413 151454 426776 356820 -93702 173037 134961
15056 134961 420089 40123 309192 421459 116650 85747 -35421 474716 216663 -187563
15045 110703 58599 188024 -6942 337820 -98480 309300 484898 121277 160964 93451 90466
15034I0466L01266r2509k2427j07371K8904R582L01066A51274J09339f788o4807
15023g1595B43087j08618j0681a19111B28829r4217J00941G2857B5166e4376B39694
15011A28571O13835A77116C5746c6539j320A25484P2970a31125b8499B57606A09882
14999C50976D3323J60017L49182k15027A09255J44613a6716b232l4558A23078
14988D86698A54101K85624j38529j12929L2327o0769J6995O4028e2509A56488
14977A27840J9305K49252r6268O7478N0781j51463a40431C10820M6237l3879M8153
14966C71331j60535Q4849I3254J71074J86449p9777j26641L92645k61969q8484
14956B86551p7847q3033L2938a03583C67108K27656F4750J60918L48144j02940
$$ plain form
15034 90466 391732 299223 276796 169425 198329 207911 508977 151274 260613 -6788 -71595
15023 -71595 243087 134469 123788 -119111 228829 134612 235553 72857 25166 -54376 239694
15011 128571 742406 177116 35746 -36539 -37859 125484 198454 -131125 -28499 257606 109882
14999 350976 43323 203340 552522 337495 109255 253868 -16716 -2232 -36790 123078
14988 486698 154101 439725 301196 188267 220594 159825 176820 240848 -52509 156488
14977 127840 147145 396397 300129 367607 418388 266925 -140431 310820 357057 323178 371331
14966 371331 210796 295645 93254 264328 450777 371000 244359 637004 375035 286551
14956 286551 208704 125671 158609 -103583 367108 594764 64750 225668 573812 470872
14946D70872q8107j90279K70608N9165A62756K20031A48433J120Q7623J80458
14936D17634A07699Q6716O4001F1462M21827O9722A87127j0597C4162K53258q4550
14925B02870I2881K59688K55243A76465l1405L04450D2921K75258J22066n4882
14915C85363J98789c3889C77739j35264l7183P4050Q9091J29698k16166A24631
14904B46908J91553o5066A45820L76263N0206k04355K0457j13661Q9738M31808
14894G96276A35954K32356A58431K52756D4775L91838r3244M45313l57521A99669
14883C75604A87583L15752m2943d7567D80084j92402j30078K49009G5401L72701
14873D48102A67884c9138E93689B22913K55683J50263j08472j79322P4723j52454
$$ plain form
14946 470872 382765 192486 463094 522259 162756 382787 148433 149553 237176 417634
14936 417634 107699 194415 258416 61462 483289 553011 187127 176530 34162 287420 202870
14925 202870 92881 352569 607812 176465 145060 449510 42921 318179 440245 385363
14915 385363 584152 -33889 377739 242475 205292 279342 368433 498131 281965 124631
14904 246908 438461 373395 145820 522083 572289 367934 388391 274730 364468 796276
14894 796276 135954 368310 158431 411187 44775 436613 343369 788682 431161 199669
14883 375604 187583 503335 460392 -47567 480084 287682 157604 406613 75401 448102
14873 448102 167884 -39138 593689 222913 478596 628859 520387 341065 415788 263334
14863B63334p5893J88904m6732k6933r2821J4335O56656m39736A52397J25446
14853B77843L2473L21397j10641R1927k91744A52609P9517L25817k01512K02525
14843E58956c5438B27918n6330M14164B90499L26556A35304K62957K76668j62554
14833E12375O771j27945K6737P6413J67130k00702n3847p4055p0378K50711n9386
14822D53824K24268k89613J62450J72819B68193R6678M33000l00595j47571J89710
14812E39415J6483P0349B73410L12014j96016j14470J70952J53901k99845M00335
14802G00281K36040l62706o2609K27117l22059J73200j16262J26577K09688j52537
14792F56730k90849K67708j01349J47932j88699M7053m7817P0364N976J74368
$$ plain form
14863 263334 187441 376345 329613 302680 209859 224194 880850 441114 152397 277843
14853 277843 310316 631713 521072 612999 321255 152609 232126 557943 356431 558956
14843 558956 -35438 227918 171588 585752 290499 617055 135304 398261 674929 512375
14833 512375 519146 391201 417938 494351 661481 460779 406932 332877 262499 513210 453824
14822 453824 678092 388479 550929 723748 268193 364871 797871 497276 349705 539415
14812 539415 555898 626247 273410 585424 389408 274938 445890 599791 299946 700281
14802 700281 936321 573615 511006 738123 416064 589264 473002 599579 809267 656730
14792 656730 365881 633589 532240 680172 491473 538526 490709 561073 567049 741417
14782G41417q7809K55407m49868Q6807L86514k16364j5040p1483j6103M0069k3450
14771F30097j71969K09936m046K42320r1384k33975L42312m15662J44405J0545
14761F62579K77269D68829L53148k42404R3633J55848C03405N63735J50858D46441
14750A116266k73553N3703l61107J88484J62613C95237K88457K3197R3724K26983
14740A027598k03126K1744k12127J62656B99740P71781k71482J61622j97215J48324
14730I12770j27785j13706j84584N52415l04020J31957K4540q0033n618D02967
14719A143551j04380k83684M4607K27317j3602l91193K74479K78987j90831j49164
14709H36087l8847K43862l91181K3237K65040l23600J9188J34383J37673k65275
$$ plain form
14782 741417 653608 909015 459147 545954 932468 716104 701064 629581 613478 653547 630097
14771 630097 458128 668064 664018 906338 814954 580979 923291 507629 652034 662579
14761 662579 939848 468829 821977 579573 673206 829054 303405 867140 1017998 446441
14750 1116266 842713 896416 535309 723793 886406 395237 683694 706891 800615 1027598
14740 1027598 824472 846216 634089 796745 299740 1071521 800039 961661 764446 912770
14730 912770 784985 671279 486695 1039110 735090 867047 891587 811554 805936 402967
14719 1143551 1039171 755487 800094 1027411 1013809 622616 897095 1176082 985251 836087
14709 836087 797240 1041102 649921 673158 938198 614598 633786 768169 905842 640567
14699F40567L75736k65466K0523K11792j78701J41335O3785J12983k54920K8596
14689H96230O7299q3906R079j5139n3291K27177J44564k18767Q2045J76424n85228
14678F46487K44841R0388j13548J83624m6055j56364K01889J35140j03015k03141
14668H80246M48484k98196M30850m35883k79108J25846L45262j19732K15455j54206
14658A159018j03636l15564J23837K11458J43037l24607M72889l31456L30718
14649A365694p0196Q3072Q0484R163n56855J71742m8673L42042j41372k21094
14639A014007K37143L22181m56933M00168J36772k25888m05044Q9867M1635L88929
14629A542837r9964j51647N35114o56230L05253l93938L22401Q9660N0574R4515
$$ plain form
14699 640567 1016303 750837 771360 983152 804451 945786 1009571 1122554 867634 896230
14689 896230 963529 879623 888702 873563 820272 1047449 1192013 973246 1055291 1231715 646487
14678 646487 891328 981716 868168 1051792 1005737 849373 1051262 1186402 1083387 880246
14668 880246 1328730 1030534 1461384 1025501 746393 872239 1217501 1097769 1313224 1159018
14658 1159018 1055382 739818 863655 1075113 1218150 893543 1366432 1034976 1365694
14649 1365694 1295498 1378570 1459054 1468217 911362 1083104 1034431 1376473 1235101 1014007
14639 1014007 1251150 1573331 1116398 1516566 1653338 1427450 1022406 1112273 1153908 1542837
14629 1542837 1442873 1291226 1826340 1170110 1475363 1081425 1403826 1493486 1544060 1638575
14619A638575k78188L18391k36370k0454J44917J05898l1833J43975l93389N16653
14609A908175n48582p9054K72586K2032J16166J53893l56568P7696K17747K060
14599A786151l2318L18775j80418J391j5373j4418J28837N6478l98028N4606L33775
14588B039458k84484K90529J44083Q0105J16682p23034L04530J8145Q0198J75184
14578B241396k64893l7538K99633j37207j03915J27520O8107j7895o9539J79155
14568B284824k34498O41563l70918L02200j05254J33852J50297L1355J26409J76248
14558C136078k69648L23595j59162J64863K73228N73839L43506O91055J461091
14549F538445J958326M481761P932338J6086489M483282j7213419A1729348l242728
$$ plain form
14619 1638575 1360387 1678778 1442408 1421954 1566871 1672769 1640936 1784911 1391522 1908175
14609 1908175 1359593 1280539 1553125 1575157 1691323 1845216 1488648 1566344 1784091 1786151
14599 1786151 1753833 2072608 1892190 1893581 1878208 1863790 1992627 2049105 1651077 1705683 2039458
14588 2039458 1754974 2045503 2189586 2269691 2386373 1663339 1967869 1986014 2066212 2241396
14578 2241396 1976503 1938965 2238598 2101391 1997476 2124996 2193103 2175208 2105669 2284824
14568 2284824 2050326 2691889 2320971 2623171 2517917 2651769 2802066 2833421 2959830 3136078
14558 3136078 2866430 3190025 3030863 3195726 3468954 4042793 4386299 5077354 6538445
14549 6538445 8496771 12978532 20910870 36997359 41480641 24267222 11729348 8486620
14541H486620q43493k898706j852671k53190l74812l45034K47567k12624M3691
14532A997348J15944K36207K85612l04652k99540K70421R9544K64714j02456M7288
14522B610430r9841j6422M49309m70249r20M3156J80087j19030N28817l88076
14512B717261O6939J36213J9686J03248J8432j74687K06728r8735M295J91223
14502C190603K19709j20285k84628J32403K13622q2204L75120o56908M16982k89008
14492C115406M11527Q1649K5989J02168J65032l9727K9679J85501k43911K51490
14482D084803k97125K49615K08885k53413K26035j76900L76955o960J00411j40174
14472D372132J10919j46577k18548K31097K69738K27326k85426J19356J69159
$$ plain form
14541 8486620 7643127 4744421 2891750 2638560 2263748 1918714 2166281 1953657 1997348
14532 1997348 2113292 2349499 2635111 2330459 2030919 2301340 2400884 2665598 2563142 2610430
14522 2610430 2510589 2494167 2943476 2473227 2472307 2515463 2695550 2576520 3105337 2717261
14512 2717261 2784200 2920413 2940099 3043347 3061779 2887092 3093820 2995085 2999380 3190603
14502 3190603 3410312 3290027 3005399 3137802 3351424 3269220 3644340 2987432 3404414 3115406
14492 3115406 3526933 3608582 3634571 3736739 3901771 3862044 3891723 4077224 3833313 4084803
14482 4084803 3787678 4037293 4246178 3992765 4218800 4041900 4418855 4411895 4512306 4372132
14472 4372132 4483051 4336474 4117926 4349023 4618761 4846087 4560661 4680017 4849176
14463D849176K274j42500J23712K6084O38542K0086n8307m58176R1538N82374
14453E674803P3863l69357L26339j8620K18046l74067K21647K86583l40522N39252
14443F237967o0529K1590J40721M56791n14222J85050J77254j78636L11506K03666
14433F981158L57356K6457l8657K23315J19761m29763J51794K04931l7937O45832
14423H204247l76091P2434L83711K79127K31581j95901N9558M98433l11725M85675
14413I331049R8549J33877l62067O63893m2961j35271L54738N73011k0299O8575
14403A0663094O6466K86752n8302L74705J00120J98899K48784j57812M03036K17047
14393A2342789L87374J50622K4373L79764M43463J57142p6978M49846Q8259N59407
$$ plain form
14463 4849176 4851450 4708950 4832662 4858746 5497288 5517374 5459067 5000891 5092429 5674803
14453 5674803 5748666 5379309 5705648 5687028 5905074 5531007 5752654 6039237 5698715 6237967
14443 6237967 6177438 6199028 6339749 6796540 6282318 6467368 6644622 6465986 6777492 6981158
14433 6981158 7338514 7364971 7326314 7549629 7669390 7239627 7391421 7596352 7558415 8204247
14423 8204247 7828156 7900590 8284301 8563428 8795009 8599108 8658666 9157099 8845374 9331049
14413 9331049 9429598 9563475 9201408 9865301 9822340 9687069 10041807 10614818 10594519 10663094
14403 10663094 10729560 11016312 10958010 11332715 11432835 11631734 11880518 11722706 12125742 12342789
14393 12342789 12730163 12880785 12905158 13284922 13728385 13885527 13808549 14258395 14346654 14906061
14383A4906061L1676L52159q5578P92334j15580N10099O04358J17207J99391L61038
14373A7673165K62788K5062O81956O11422L89504j58N87763N21823K06538L92828
14363B1352691P69382M24982L06197M13847P33186N99224M36335N70086N29368
14354B6135298L71493N47612J227449M48230Q12914K72982J268049O54210Q53214
14345C2591451O49809J010514O74581J205040J098577R12369P02832J226771J165716
14336D1237660J002573J601633J178069J233464J503090J382102J506816J669561
14328E2314968J847508J474579J798934J879136J872292K467816J774600K749888
14320F8179721K330846K784582K498213K584261L063216L072403L232334L619763
$$ plain form
14383 14906061 14937737 15289896 15204318 15996652 15881072 16391171 16995529 17112736 17312127 17673165
14373 17673165 17935953 17961015 18642971 19254393 19643897 19643739 20231502 20753325 20959863 21352691
14363 21352691 22122073 22547055 22853252 23267099 24000285 24599509 25035844 25605930 26135298
14354 26135298 26506791 27054403 28281852 28730082 29542996 29815978 31084027 31738237 32591451
14345 32591451 33241260 34251774 34926355 36131395 37229972 38142341 38845173 40071944 41237660
14336 41237660 42240233 43841866 45019935 46253399 47756489 49138591 50645407 52314968
14328 52314968 54162476 55637055 57435989 59315125 61187417 63655233 65429833 68179721
14320 68179721 70510567 73295149 75793362 78377623 81440839 84513242 87745576 91365339
14312I1365339L527190L849214M277401M240320M440469M652157N214760N582653
14304A27149503N568800O256562O428251O263339P458025P732106Q057897Q464044
14296A83378527R003909R507372J0017673J0630460J1081890J1684482J2297270
14289B57601583J2731790J3560103J3794404J4017624J4536868J5503450J4829284
14282C56575106J5476013J4746403J4955284J4384535J3326025J3007031J0873397
14275D53343794R821627O812638L931168J015253l48628q24161k424607l618886
14267D67708198l951009p548755r546542j1373388j2991730j4197786j4130116
14260C93968872j5201003j5563016j6021124j5396898j5397989j5291405j4772185
$$ plain form
14312 91365339 94892529 98741743 103019144 107259464 111699933 116352090 121566850 127149503
14304 127149503 132718303 138974865 145403116 151666455 159124480 166856586 174914483 183378527
14296 183378527 192382436 201889808 211907481 222537941 233619831 245304313 257601583
14289 257601583 270333373 283893476 297687880 311705504 326242372 341745822 356575106
14282 356575106 372051119 386797522 401752806 416137341 429463366 442470397 453343794
14275 453343794 463165421 469978059 473909227 474924480 474575852 473751691 471327084 467708198
14267 467708198 463757189 456208434 446661892 435288504 422296774 408098988 393968872
14260 393968872 378767869 363204853 347183729 331786831 316388842 301097437 286325252
14253B86325252j4007233j1875155j1989144j2627392j1489538j1259885j0311101
14246B02765804r669526r024574q235042q212119p644272p404625o959075o221851
14238A39394720o083469n517833n423568n329722n115214m087333m524519l682250
14230I9630812l933978l931086l625991l189435k859975l313612k772256k835439
14222G3169040k549242k350603k052577k416611j900990k242603j940712j798194
14214E5917508j532455j661522j379846j804248j082641j919365j100283p24049
14206D4713099o94210j967825j108024j425447q33586q27210q00750j271006q82493
14197C4902548j130917r35787l64424j069375n28107j114369n31503p58209j081076
$$ plain form
14253 286325252 272318019 260442864 248453720 235826328 224336790 213076905 202765804
14246 202765804 193096278 184071704 175836662 167624543 159980271 152575646 145616571 139394720
14238 139394720 133311251 127793418 122369850 117040128 111924914 107837581 103313062 99630812
14230 99630812 95696834 91765748 88139757 84950322 82090347 78776735 76004479 73169040
14222 73169040 70619798 68269195 66216618 63800007 61899017 59656414 57715702 55917508
14214 55917508 54385053 52723531 51343685 49539437 48456796 46537431 45437148 44713099
14206 44713099 44018889 42051064 40943040 39517593 38684007 37856797 37056047 35785041 34902548
14197 34902548 33771631 32835844 32471420 31402045 30873938 29759569 29228066 28469857 27388781
14188B7388781m34346m24534l50484n27187r45048p73362l14449o60102R6792
14179B3056061r26279o36924l28425l78067n9946k93059o47600l38682o23675
14170A8823404m84914k68704l54671j9446l07254j026183M19650p08147k8830
14161A6044905o32464k73586j97555j79471o2085j44243n29082k15501M0788k45981
14151A3605725l84759k57869J22368o90377R5208m05618j48681j67320n53318
14142A1215359J52779j18018j77951J25450m06611o3877j19396l93919j90767
14133A0023049k8835m47487J87218K7k54647N1265j48489l82869K54007l26677
14123H926562j14346n1537k24599r0650k9900n04839L26609m25440K6764J40266
$$ plain form
14188 27388781 26954435 26529901 26179417 25652230 24707182 23933820 23619371 22959269 23056061
14179 23056061 22129782 21492858 21164433 20786366 20726420 20433361 19785761 19447079 18823404
14170 18823404 18338490 18069786 17715115 17695669 17388415 16362232 16781882 16073735 16044905
14161 16044905 15412441 15138855 14941300 14761829 14699744 14555501 14026419 13810918 13851706 13605725
14151 13605725 13220966 12963097 13085465 12395088 12490296 12084678 11935997 11768677 11215359
14142 11215359 11368138 11250120 11072169 11197619 10791008 10727131 10607735 10213816 10023049
14133 10023049 9994214 9546727 9733945 9733972 9479325 9530590 9382101 8999232 9253239 8926562
14123 8926562 8812216 8760679 8536080 8445430 8415530 7910691 8237300 7811860 7838624 7978890
14113G978890k24695k3921n18714L13282l75345K77648k34975k93747j55247J32334
14103F875510j56231j00673J43060k58643K43238J04226m37350K7885j46256p9507
14093F215259l57432J74416j25412L91858m54214l83117L52700l7012l07908m0260
14083E428878J5051L306k73582J78314j41652R5214j56949J83268j82514P2035
14073E221369n00808K21598l29876L20471J2146o10689R7159N57856o17622L11395
14063D682999m97379Q1715L3380Q3846M4818m46299L42147j48202k72729L30378
14053D234674K7172l77972n6625J98335p4314k22476j28132J33346L02180k24281
14043C811907j96351o8250J07757R7269m46551L5198j98045L38237n2365k14716
$$ plain form
14113 7978890 7754195 7730274 7211560 7524842 7149497 7427145 7192170 6898423 6743176 6875510
14103 6875510 6719279 6618606 6761666 6503023 6746261 6850487 6413137 6441022 6294766 6215259
14093 6215259 5857827 6032243 5906831 6298689 5844475 5461358 5814058 5777046 5469138 5428878
14083 5428878 5443929 5447235 5173653 5351967 5210315 5305529 5148580 5331848 5149334 5221369
14073 5221369 4720561 4942159 4612283 4932754 4944900 4334211 4431370 4989226 4371604 4682999
14063 4682999 4185620 4267335 4300715 4384561 4429379 3983080 4325227 4177025 3904296 4234674
14053 4234674 4261846 3883874 3827249 4025584 3951270 3728794 3600662 3734008 4036188 3811907
14043 3811907 3615556 3547306 3655063 3752332 3305781 3340979 3142934 3481171 3428806 3214090
14033C214090K27837j20452L419j84042K25730o9669p2537j16761l6810L617K92964
14022C367386l84496J41511M6039l39672l22497K41383L7955j90358R4723O7392
14012B759366m5178j44822K20191k33841K16928l18298j11065M33236j33923k30776
14002B411818J80231m6757j33594N1098j90334J37408j72527K63595k03848K24647
13992B521737n7073K36099N95138R69277L465127O831535J6043664J1412247j2553867
13983B9463884j3915544o100456k722090j182966r95915n47159k32711q8328o70255
13974C008460r0455M34513p58490L71971M5092m72121J84039R9614p4065n01134
13964B247424Q5195J85118o3970M0710j81431J76372m81672J22648j39103j13241
$$ plain form
14033 3214090 3441927 3321475 3324894 3140852 3366582 3296913 3224376 3107615 3070805 3074422 3367386
14022 3367386 2982890 3124401 3170440 2830768 2508271 2749654 2787609 2597251 2691974 2759366
14012 2759366 2714188 2569366 2789557 2555716 2772644 2454346 2343281 2776517 2642594 2411818
14002 2411818 2592049 2545292 2411698 2462796 2272462 2409870 2237343 2500938 2297090 2521737
13992 2521737 2464664 2700763 3295901 4265178 7730305 14561840 30605504 42017751 29463884
13983 29463884 15548340 9447884 6725794 5542828 4546913 3999754 3767043 3678715 3008460
13974 3008460 2918005 3352518 2594028 2965999 3011091 2538970 2723009 2822623 2748558 2247424
13964 2247424 2332619 2517737 2453767 2494477 2313046 2489418 2007746 2130394 1991291 1878050
13954A878050N33745j24813p4002J61233l33386N1258J74159Q1439R1690m24715
13944B014658K31691l65139q1081N58101n74502K098K07744n74555M76495k0059
13934A875451K98461o11681Q3457j13827M31095q1128k41361k8490J28642k97618
13924A443001L7480M61171m70987J08909K22544k65676M38555l73666M5438J45442
13914A792211m28055L47924k15422k5410J02309l689Q0419j31009J96477l32842
13904A382913l16214J47951L95646k72398K41473l56743K57424l93820M30697
13895A516929k72136J48905K57527m47388J23520K09510m6648j69498Q3600j80
13885A404141j29164N8139k7859j2179J01909j50420J32069k54244L38640j25620
$$ plain form
13954 1878050 2411795 2286982 2212980 2374213 2040827 2092085 2266244 2347683 2439373 2014658
13944 2014658 2246349 1881210 1800129 2358230 1783728 1785826 1993570 1419015 1895510 1875451
13934 1875451 2173912 1562231 1645688 1531861 1962956 1881828 1640467 1611977 1740619 1443001
13924 1443001 1480481 1941652 1470665 1579574 1802118 1536442 1974997 1601331 1646769 1792211
13914 1792211 1364156 1712080 1496658 1471248 1573557 1569868 1650287 1519278 1715755 1382913
13904 1382913 1066699 1214650 1610296 1337898 1579371 1222628 1480052 1086232 1516929
13895 1516929 1244793 1393698 1651225 1203837 1327357 1536867 1490219 1320721 1404321 1404141
13885 1404141 1274977 1333116 1305257 1293078 1394987 1244567 1376636 1122392 1461032 1335412
13875A335412j67829k41257K69688p378k16392K10166N745N8772j33320L0122
13865A143729j68057M17555j39599L4306o57J00459o09472K52261K8995J35924
13855A195444j21054r895K92166j49570r9654K24749k65584R4704k05092J63027
13845A119241m09884M63152k51789J3700K77100k85078J50714P9841J698k57411
13835I01284l9034K61435m36680L68592q4428k67813K68158K06971l78539k0164
13825G79782K11999q3561k50669M83127j03006r4440K64790j10383O145j27979
13815I75805l91363L12466R1351k25685K08152j42607Q6425j74536j5108L69844
13805A094744r9211k04986K13254k63382j7202M5843R6737J99106l01124M1704
$$ plain form
13875 1335412 1167583 926326 1196014 1188636 972244 1182410 1188155 1246927 1113607 1143729
13865 1143729 975672 1393227 1253628 1287934 1287277 1387736 778264 1030525 1059520 1195444
13855 1195444 1074390 1064495 1356661 1207091 1107437 1332186 1066602 1161306 956214 1119241
13845 1119241 709357 1172509 920720 934420 1211520 926442 1077156 1156997 1158695 901284
13835 901284 862250 1123685 687005 1055597 971169 703356 971514 1178485 799946 779782
13825 779782 991781 908220 657551 1140678 1037672 943232 1208022 1097639 1103784 975805
13815 975805 584442 896908 988259 762574 970726 828119 914544 740008 724900 1094744
13805 1094744 995533 790547 1003801 740419 723217 769060 865797 1064903 763779 805483
13795H05483J2299j0696L45188n43634J75135j45001L00677m07703N54541l76784
13785G09505K69491p1013p3894J03825n6994L26424k03062m08443J71878l42798
13775D24919M09385k16448J71576J72140m34675N6535j52021K35615J38540m82
13765H05084K37604n15928R6569K44681k28143j20611L81279l6028J11281k22343
13755G53445K07756l8426l57010K07606p5452J08757j4231j09025K55066l25431
13745F13055p8419o0992K18613j13797j3796J06193j15383K07025K95444m97128
13735E60815J98743p5194j25147K25603C21468M20038j84119n477N8982K41650
13725H52542j25755l59269J61055L34617l20434J51057o6361J0138L9159K15957
$$ plain form
13795 805483 817782 807086 1152274 608640 783775 638774 939451 531748 1086289 709505
13785 709505 978996 907983 834089 937914 880920 1207344 1004282 595839 767717 424919
13775 424919 834304 617856 789432 961572 526897 583432 431411 667026 805566 805084
13765 805084 1042688 526760 623329 868010 639867 519256 900535 864507 975788 753445
13755 753445 961201 922775 565765 773371 697919 806676 792445 683420 938486 613055
13745 613055 534636 473644 692257 578460 564664 670857 555474 762499 1057943 560815
13735 560815 759558 684364 559217 784820 321468 741506 557387 551910 610892 852542
13725 852542 726787 367518 528573 863190 542756 693813 627452 637590 676749 892706
13715H92706l49318J86284j82116J17494j79010N6165J22354A80615L96195j61732
13705D15078K33722j40671L16865k11837k20571j60434K00125P3442L52377l0714
13695H27382C25554L83426j83016J23011j30196K9295L6519j74545P6123L7969
13685E24140Q5872j10768o1172J12175k0032J77177K08976l95827J47103J03339
13675G70983r4534j59200l357J98509J27032F5425M72298k25821J72349J13719
13665E97970k36582J91124J6244k47994j27433L47071j22192K83029j15414j26579
13655D59244k3718l1538j11378K17615J07793O9191J53949l66107O2365P3159
13645F10575k70286O7105R5722m841j7492K06073k86151J59752B06316L58564
$$ plain form
13715 892706 543388 729672 547556 665050 486040 542205 664559 180615 576810 415078
13705 415078 648800 508129 824994 613157 392586 232152 432277 505719 858096 827382
13695 827382 325554 708980 525964 648975 518779 548074 584593 410048 486171 524140
13685 524140 610012 499244 438072 550247 530215 707392 916368 520541 667644 770983
13675 770983 676449 517249 513892 712401 839433 65425 537723 311902 484251 597970
13665 597970 361388 552512 568756 320762 193329 540400 418208 701237 585823 459244
13655 459244 435526 403988 292610 510225 618018 687209 841158 475051 537416 610575
13645 610575 340289 407394 503116 498275 480783 686856 400705 560457 206316 564880
13635E64880j2193P8383B09615K80160Q9427j06200P8706K67945C75087M0166
13625D15253J59987j16220k16779p0855P573M63297p204j52628K48032C24791
13614F67974j79925k41814J09911L33356l20710K22878o7074j37483K92301A91642
13603C72535K84838A59919N61338k72356N3672r3544L24892B62905K25840J07085
13593E95830B96776R1765o2636J91431M9377k03306K91481k39282q0094K93234
13583F28746O6331A48910L97191q1177j13347H5402K62988c3546E27644B63171
13572D58509o7786j46899J3666M7966I4283d951D86680m4274r8459G5399K66689
13561C42088J71633A64580M79791c6353C02644J6574k8820I6935R5480K52969
$$ plain form
13635 564880 552687 631070 209615 489775 579202 473002 551708 819653 375087 415253
13625 415253 575240 459020 242241 171386 178959 642256 635052 482424 730456 324791
13614 667974 488049 246235 356146 689502 368792 591670 524596 387113 679414 191642
13603 372535 657373 159919 721257 448901 502573 409029 733921 262905 488745 595830
13593 595830 296776 388541 325905 517336 566713 363407 654888 415606 335512 628746
13583 628746 695077 148910 546101 464924 351577 85402 348390 -33546 527644 263171
13572 458509 390723 243824 257490 305456 94283 -4951 486680 442406 343947 75399 342088
13561 342088 513721 164580 644371 -36353 302644 319218 290398 96935 192415 445384
13551D45384K65107C19769j49974J6057L26228a23368D70622K3764A91181O8014
13541B59195P1751J0549o9069J30890j86102J08277H745K71948M32670C10219
13530D98779A07146J72830j22047J98115J70629L09344m3049k45442B36174l1543
13520B04631N17358C47512J97j63285e7400C12444P6244A01306L52659G6444K65537
13509C41981o3470K17443k15271n4218K39921j17730m767A6872L35965J218J60947
13498E15002a20886B5836b2365A39423J85498m4966l4458O9597J77250B23145
13487D74967M2523k32518l3841K02498j06760A69367J11205k2572J42146F2306
13476B22257q5430J45263L47115B93894A13452J03807K6282a75296D74294K6724
$$ plain form
13551 445384 710491 319769 169795 185852 512080 -123368 470622 494386 191181 259195
13541 259195 330946 341495 272426 403316 217214 325491 8745 280693 713363 310219
13530 498779 107146 279976 157929 356044 526673 836017 792968 547526 236174 204631
13520 204631 721989 347512 347709 184424 -57400 312444 388688 101306 453965 76444 341981
13509 341981 278511 495954 280683 226465 466386 348656 343889 16872 352837 354055 515002
13498 515002 -120886 25836 -22365 139423 324921 279955 245497 315094 492344 223145
13487 474967 517490 284972 251131 453629 346869 169367 280572 258000 400146 62306
13476 222257 136827 282090 629205 293894 113452 217259 243541 -175296 474294 501018
13466E01018A69407f181C02662j13772J89374l0332M418J69832A91127K50041
13456D41168o1854j30220l4554K05602p8527A21864L35432C8163K13929J89467
13446D41559m5952j10969E993M58494L5064k12831H1553M0236J31402j22256g1943
13434C34778J29608B7844K41156J6884P31J12618F5011K90285M8594A38441L84020
13423E22461b9726F28794B22641J37985A74669L58862j81095j59630A9198K74472
13413B93670k1471N2559I4540K64247p1586A29610L4916G8715K76540A01285M56609
13402E57894I8888N2509l6869K23525B9071L24692A25549K02171H2050m354R4240
13391A71936K7791J9674J17407A50503K42219L8131m97j2243B2716H520L27003
$$ plain form
13466 501018 169407 -6181 302662 188890 378264 347932 352350 522182 191127 441168
13456 441168 379314 249094 214540 420142 341615 121864 457296 38163 252092 441559
13446 441559 395607 284638 5993 464487 499551 286720 81553 121789 253191 130935 -71943
13434 334778 464386 27844 269000 285884 286615 399233 65011 355296 403890 138441 522461
13423 522461 -29726 628794 222641 360626 174669 533531 352436 192806 19198 293670
13413 293670 272199 324758 94540 358787 287201 129610 164526 78715 355255 101285 557894
13402 557894 98888 151397 114528 338053 29071 353763 125549 327720 82050 77696 171936
13391 171936 199727 219401 336808 150503 392722 430853 430356 418113 22716 8520 335523
13380C35523A26060K50856A21323L4820J04620B5849J02087l7003M28196B07422
13369C60691j63244J00532K63904D7769K55460j42826p4926J12862k2034K1959
13359A98264e5713B99254j39149L21027A84602k7447o0120J51410G9284L08494
13349C87778O3410P0590B27593L39497k60244P1041j60551J77470e374B16250
13338C18594J7562A22081J67440K5795j28968L66782A79707D1206J38454J19590
13328B99250L88323b03033C1348N2638L08535A77490K3050L19967K9197j9618
13318E30086c2368B32214r7947l9584J71158k3698N9309A3771L9007J39378b7060
13306A12191Q7480A1255L04957f137D27835A62902j5707J27774H9847i106A18873
$$ plain form
13380 335523 126060 376916 121323 156143 260763 25849 127936 90933 519129 207422
13369 360691 197447 297979 561883 47769 303229 160403 85477 198339 176305 198264
13359 198264 -55713 299254 160105 481132 184602 157155 97035 248445 79284 387778
13349 387778 451188 521778 227593 567090 306846 377887 217336 394806 -5374 216250
13338 318594 336156 122081 289521 315316 186348 553130 179707 41206 179660 299250
13328 299250 687573 -203033 31348 83986 392521 177490 200540 520507 549704 530086
13318 530086 -32368 232214 134267 94683 265841 242143 301452 13771 52778 192156 -27060
13306 112191 199671 11255 316212 -6137 427835 162902 147195 274969 89847 -9106 118873
13294B88270B6907L53070a12246B7862K12746D1858L40846b1457l42070A33856
13283B88698n2547a9977B50991a50163H7472A429e7793A71477J72823j37899J37223
13272C43624n5001J47525j74847m5829a44757B29290m0944J32636A24338K33296
13262C57634k457A2617K36385k4403g7795E307Q1465N8036M1645J66071j66300
13251A86224c1022E9287c77546B85289m4750i594B42364N6562A2910L51229A39326
13239A97203C3336O7563K33429h853I9888d5442B50592J10102H1206b96735C248
13227A10175R5398P6810A18073J34343A07838f6988J9561p2329B07787a68307
13216E05459P792q2320j39441a85398C0162i7030D1255a933B80454A04231A266
$$ plain form
13294 288270 26907 379977 -112246 27862 240608 41858 382704 -21457 -363527 133856
13283 288698 236151 -19977 250991 -150163 87472 1429 -57793 171477 344300 206401 343624
13272 343624 288623 436148 261301 215472 -144757 229290 188346 320982 124338 357634
13262 357634 355177 12617 249002 224599 -77795 5307 86772 144808 186453 352524 186224
13251 186224 -31022 59287 -377546 285289 240539 -9594 242364 298926 12910 364139 139326
13239 197203 33336 100899 334328 -8853 99888 -45442 250592 360694 81206 -296735 3248
13227 110175 205573 282383 118073 252416 107838 -66988 -47427 -119756 207787 -168307
13216 505459 513251 430931 291490 -185398 30162 -97030 41255 -1933 280454 104231 1266
13204A29104J12137O7069c15711B62767O7418A39595i7379C41909c16518f1521
13193A11679K05098a25243B65842e9479B72372j16902m3849a5427C62001j36835
13183B25166k9786n7854b9437A03776C011Q0845K65739A0840b41581C18557n4315
13172B64242B8671c5234B46722f282C0147L65485A26739g4013F9673K0170J90601
13161B80444o0015D4050K43580b10495A81643b49839N2830D01286L9709D8584
13150F6534a83593B67440J76827q2415d7094A84671G3993J26015J9119C7310K03767
13139B41077A04750O3992a804B59196d02799C3991Q5274g2723J7669J7265j78338
13128b16127D14032a56026C6442a28172A99954e3128C74236e9358B93355c33391
$$ plain form
13204 129104 241241 308310 -315711 262767 330185 139595 -97379 341909 -316518 -61521
13193 111679 316777 -125243 265842 -59479 272372 155470 111621 -15427 362001 225166
13183 225166 195380 137526 -29437 103776 3011 83856 349595 10840 -241581 318557 264242
13172 264242 28671 -35234 246722 -6282 30147 395632 126739 -74013 69673 89843 280444
13161 280444 220429 44050 287630 -210495 181643 -249839 -197009 401286 440995 48584
13150 66534 -183593 267440 444267 361852 -47094 184671 73993 200008 219127 37310 241077
13139 241077 104750 168742 -1804 259196 -402799 33991 119265 -72723 -55054 -37789 -216127
13128 -216127 414032 -156026 36442 -128172 199954 -53128 374236 -59358 293355 -333391
13117C7994J57570E0137K12332r9636f6353B67186H9907J438N9408a1342F8304
13105b7180k31547D39K86981G3446L2764a03441a8238j19423B47801r7537J15141
13094B65405f991C06466d6528j00242k22690B52041g3106C904M3037a9538A51528
13082a07487p1412O6892C9690J95316D5205L78617b875E1504g1379F9672J93682
13071B63354a96021L8768D45664j75324j30376a42776B76911D4809j7237K99800
13061C27372C8972J32905A9531J8526J74735K86175b31701B65514c7146A4246
13050a91912B27459C6641O2435K72789a36745a3237A14059K52660j17566j02004
13040A47149F7379A0255d2958H1885K39552i9974G7375f4239B57981M7266A1831
$$ plain form
13117 37994 195564 50137 262469 162833 -66353 267186 89907 91345 150753 -11342 68304
13105 -27180 -258727 439 287420 73446 106210 -103441 -18238 -137661 247801 150264 265405
13094 265405 -6991 306466 -46528 -146770 -369460 252041 -73106 3904 46941 -19538 151528
13082 -107487 -178899 -112007 39690 235006 45205 423822 -2875 51504 -71379 69672 263354
13071 263354 -196021 -157253 445664 270340 139964 -142776 276911 44809 27572 327372
13061 327372 38972 171877 19531 38057 212792 498967 -231701 265514 -37146 14246
13050 -191912 227459 36641 99076 371865 -136745 -13237 114059 366719 249153 147149
13040 147149 67379 10255 -42958 81885 321437 -99974 77375 -64239 257981 305247 11831
13028C35155D0568a40638b6103A10944M6311b03182g858j39265K1916d6186A59274
13016A00768B7247j1882J0245M10222I1613k5387K14596A05125l340C0981M4411
13005G5392J19865N460M31160A01962C5032d3422D0858K07084b12360O6852a5241
12993A12321d56001B75613a5108A40369K54393A23412n2355R0774E7250c344A02786
12981A16106a30654A54453h7163G0540M1336g186n6273B9281O0710A3457J4890
12970B8347b6035A22349B9847D810J76190i6013A39334e7017C02292b095B77872
12958D533J32034J20951a27538r8023B56301P440j17714B6678L34054A71869J39430
12947C11299c5107C11740K068A44249l8815J50204A20495a79337Q3820q3717A60188
$$ plain form
13028 335155 40568 -140638 -26103 110944 157255 -203182 -7858 -147123 -125207 -46186 159274
13016 100768 27247 15365 25610 435832 91613 66226 280822 105125 101785 30981 75392
13005 75392 195257 200717 631877 101962 35032 -43422 40858 247942 -212360 -145508 -15241
12993 112321 -456001 275613 -15108 140369 394762 123412 71057 161831 57250 -3344 102786
12981 116106 -130654 154453 -87163 70540 111876 -7186 -63459 29281 89991 13457 28347
12970 28347 -26035 122349 29847 4810 181000 -96013 139334 -57017 302292 -2095 277872
12958 4533 136567 257518 -127538 -225561 256301 263741 146027 26678 360732 171869 311299
12947 311299 -35107 311740 313808 144249 105434 255638 120495 -179337 -95517 -179234 160188
12935A63170h5940o7155n0162J0678f653E7566a28195D83541A15247D2783J21886
12924A64669O9665f0061A61088a46250k26648G0706K96556F0141K00492A10666
12913A00398c83441a73946B37122D8025P5772K6011a38916B28547H8336O572Q3002
12902A77910b18436A39327J04170G5089J87449b15064F9533b8924k3061A88998
12891B46351q9921a98126R3055B47322a04062A0079J44111A8546b02295d541j53917
12880a58458A67296a82180M4557d8143m8542B87536G6253l5508Q7110J27840C4291
12868D8383K59278M944a64002p3509R9966F8989g7091A5126a37918A74993a98200
12856A60505K25401g7974b537G8313b57190f2552b2647A78485a32613A08403M0309
$$ plain form
12935 163170 -85940 -153095 -203257 -192579 -6653 57566 -128195 483541 115247 42783 164669
12924 164669 234334 -60061 161088 -146250 -372898 70706 367262 60141 260633 110666
12913 100398 -383441 -173946 237122 48025 123797 149808 -138916 228547 88336 94908 177910
12902 177910 -218436 139327 243497 75089 262538 -215064 69533 -28924 -51985 188998
12891 246351 156430 -198126 -105071 247322 -104062 10079 154190 18546 -202295 -4541 -158458
12880 -158458 167296 -182180 -137623 -48143 -96685 287536 76253 40745 127855 255695 34291
12868 48383 307661 312605 -164002 -237511 -137545 68989 -77091 15126 -137918 174993 -198200
12856 160505 385906 -77974 -2537 78313 -257190 -62552 -22647 178485 -132613 108403 148712
12845A48712b30714A31941K54834q2828e1419E27612B10266A3090J30933D4594
12834C60136G3874a04346A58038a85553e5330l1143A86493a17845D7751d26070
12823A02805J06795c3850A34605N32779d5046B03766P3599q2599d72863C0835
12812C11466F7727J26303b62486j10177c5555p1236M9390B81242o7523e31579
12801b73980H1107J25660A02114R841P3349B9135K03460j09822l2147L00851f6472
12789H1406a37174A47972c4061A59465a09439I9258b37887I0560Q5965a38443
12778i3525E7773K30366c15495A30836a931k9643j74719d5554k7995j88072D0060
12766b97622B15866a24913k11259C24741B4317a34736e0136o2249B4485M984a872
$$ plain form
12845 148712 -230714 131941 386775 303947 -51419 527612 210266 13090 144023 44594
12834 360136 73874 -104346 158038 -185553 -55330 -86473 186493 -117845 47751 -426070
12823 102805 209600 -33850 134605 667384 -45046 203766 277365 194766 -472863 30835
12812 311466 67727 194030 -262486 -372663 -35555 -106791 -57401 281242 213719 -531579
12801 -273980 81107 206767 102114 111955 185304 29135 232595 122773 90626 391477 -66472
12789 81406 -137174 147972 -34061 159465 -109439 99258 -237887 90560 176525 -138443
12778 -93525 57773 288139 -315495 130836 -1931 -31574 -206293 -45554 -73549 -261621 40060
12766 -297622 215866 -124913 -336172 324741 24317 -134736 -50136 -112385 24485 29469 -1872
12754a15349K6667K6203C40098a696A66024N9949r7633g4775C22181F3409P4984
12743A38393g168B5745a48528b3365F7586R4137e5743j7773C65804j73255p9829
12732A12720m8554J35358o3369J75251c4892q6165n4274A85526J43572a656G6092
12720a12351A98940n6728j2734k3742c31197d647j18928A39823H378a91608A35150
12708a22913A7459M509J60753M3506A05529Q0933k8643c6775B57087h6806H8925
12696i7383D4744b89802H081b15707A3832N8297g2408A5996M37755l2466A00085
12684B88192g247j07034A77128e7807k57440C27345E7800B4338L5899J10742R4686
12673B65665J80604b70739B78220a41016B36765o8600b4720A84005I0410b11026
$$ plain form
12754 -115349 -88682 -62479 340098 -1696 166024 225973 128340 -74775 322181 63409 138393
12743 138393 -7168 25745 -148528 -23365 67586 161723 -55743 -73516 365804 192549 112720
12732 112720 64166 199524 136155 311406 -34892 -121057 -175331 185526 329098 -1656 76092
12720 -112351 198940 142212 129478 105736 -331197 -4647 -123575 139823 8378 -191608 135150
12708 -122913 17459 21968 182721 226227 105529 186462 157819 -36775 257087 -86806 88925
12696 -97383 44744 -289802 8081 -215707 13832 72129 -72408 15996 453751 421285 100085
12684 288192 -7247 -114281 177128 -57807 -315247 327345 57800 24338 60237 170979 265665
12673 265665 446269 -270739 278220 -141016 236765 168165 -24720 184005 90410 -211026
12662A18484a15049j96248B25374J1510a16010d9112n1356j23857C44785a90130
12651C75828A62573n7881J19909O1847B4468g8633A66731k5061b01110b2068A17508
12639a47949C7217c62085a39400j29560B39400a30512E7496J15352a53709F0011
12628a06774B93091k9438q7801J29476F6214A3582P8986L78492a29205l3411A20970
12616C13949b51246h0198B80410j09925F2405Q9733J91146c1881B64075a08495
12605A11468i5690A83976o6572J88982J344k9632o9681J71523c38885N3869G6689
12593B45237c2613D16710j22378a615A51043i2446j36680j318f4197b4762H527
12581c09971A12123i4326A38790J58971j11768D9948g7453B39263a39169A66298
$$ plain form
12662 118484 -115049 -311297 225374 236884 -116010 -49112 -100468 -224325 344785 -190130
12651 375828 162573 104692 224601 286448 24468 -78633 166731 141670 -201110 -22068 117508
12639 -147949 37217 -362085 -139400 -268960 239400 -130512 57496 172848 -153709 60011
12628 -106774 293091 263653 175852 305328 66214 13582 92568 471060 -129205 -162616 120970
12616 313949 -251246 -80198 280410 170485 62405 152138 343284 -31881 264075 -108495
12605 111468 -95690 183976 117404 306386 307730 278098 208417 379940 -338885 -285016 76689
12593 245237 -32613 416710 294332 -1615 151043 -92446 -229126 -230444 -64197 -24762 8527
12581 -309971 112123 -94326 138790 297761 185993 49948 -77453 239263 -139169 166298
12570A69712F3050Q2375g134k04611M4770D41514r7475G0658J8872J48092c02971
12558G1921a80941A09476Q4669L5570m9739f0193D60544D1064a35249k33116a17702
12546E1630J03657M2304a16841K1880j87788J35018B81050b22060A88907J818
12536A90725G1275B1463d4916j04005r0555B15241f4732D6757J71754A01076a07588
12524G931a24326e0726D15358a63677A56795o4265a19F0703K02729e3510D09070
12512G8708I433N58209a06827j29409J08738B73903a34669G8251a40731I5992
12501f9602l1500B91070a28138H5798c1448j67828B43422P1131G020a08326B26469
12489b43878c5710p1475J2204J3529m6230M1696A15111b44021A39124o308b67762
$$ plain form
12570 169712 63050 145425 -7134 -211745 -166975 441514 344039 70658 89530 237622 -302971
12558 71921 -180941 109476 194145 229715 179976 -60193 460544 41064 -135249 -368365 -117702
12546 51630 155287 197591 -116841 -94961 -282749 -147731 281050 -222060 188907 190725
12536 190725 71275 21463 -44916 -148921 -239476 215241 -64732 46757 218511 101076 -107588
12524 7931 -124326 -50726 415358 -163677 156795 92530 -119 60703 263432 -53510 409070
12512 78708 9433 567642 -106827 -236236 -127498 273903 -134669 78251 -140731 95992
12501 -69602 -101102 291070 -128138 85798 -31448 -199276 243422 314553 7020 -108326 226469
12489 -243878 -35710 -107185 -94981 -81452 -127682 -85986 115111 -244021 139124 132816 -267762
12477a38111J247C19850h4206k8512A60094g0170A12501b76136A9765J69611b4053
12465b72773A12877b85176A41558m5213b54087d8517B80435C1933a84353H4112
12454e9966H8134p517H962d0688j01715A93973F3667f3217A46328b10313k5298
12443b35611D2660n220A8715L5665j6088a14A93853J8134k9818J25272j23940
12432A83501i0050j46844e0166j16297I4849a12584a417m8214n6040D1102a31731
12420b86572P4726D3858J00989k9674J58901Q7464b1177I5080K06459a39276j6201
12409a55477B53159G6886B3337J2391Q0462A3714L51388C1200a7086H5330J3663
12398I8993k3440c73383A9017C81h7814k83735D6805c5977D2399K2425A4476i2174
$$ plain form
12477 -138111 -136864 319850 -84206 -112718 160094 -70170 112501 -276136 19765 189376 -24053
12465 -272773 112877 -285176 141558 96345 -254087 -48517 280435 31933 -184353 84112
12454 -59966 88134 80617 8962 -40688 -142403 193973 63667 -63217 146328 -210313 -235611
12443 -235611 42660 37440 18715 54380 38292 -114 193853 211987 182169 307441 183501
12432 183501 -90050 -236894 -50166 -166463 94849 -112584 -1417 -49631 -105671 41102 -131731
12420 -286572 -211846 43858 144847 115173 274074 361538 -21177 95080 301539 -139276 -155477
12409 -155477 253159 76886 23337 35728 116190 13714 365102 31200 -17086 85330 98993
12398 98993 75553 -373383 19017 381 -87814 -371549 46805 -35977 42399 64824 14476 -92174
12385b05722A52433c26490E1269L8940a84889f7537b7590j75997A25885a46593
12374f10355i8977A49632b4119D7126a99268g2943K0586j07000k3062p3474A65545
12362G8178L18634c17532e1159G9802b04896B97273e1034j61554c822o8133A95691
12350a60716A2341J04968J27727C1100M6213a35441B70737G0714P5252i6020k15304
12339c11324F3386f9827l45277A81896J59199A7651J44457C729K56787a5522C51621
12327a68576k0523H1811c07024a26924C25798p5037d6189k46432G1447O2255J97037
12316C30739f5650k29925E7386O1468n5740c88056B25647K40426k31332D8933
12305a6709D5318J4255Q9463c1805A73856a86558K3517B23382p8686O6547A9279
$$ plain form
12385 -205722 152433 -326490 51269 90209 -184889 -67537 -27590 -203587 125885 -146593
12374 -610355 -98977 149632 -24119 47126 -199268 -72943 -52357 -159357 -182419 -255893 165545
12362 78178 396812 -317532 -51159 79802 -204896 297273 -51034 -212588 -3822 -71955 195691
12350 -160716 12341 117309 245036 31100 77313 -135441 270737 70714 145966 -96020 -311324
12339 -311324 63386 -69827 -415104 181896 341095 17651 162108 3729 260516 -15522 351621
12327 -168576 -189099 81811 -307024 -126924 325798 250761 -46189 -292621 71447 133702 330739
12316 330739 -65650 -295575 57386 118854 63114 -388056 225647 466073 234741 48933
12305 -16709 45318 59573 149036 -31805 173856 -186558 -163041 223382 144696 211243 19279
12293A58515a56747I791P3984a53255D1580Q9542J16999h799n6388C11144H4442
12281B03779c10373B89852L851j1264b2342l2765k6962j40634E16473d1009A67832
12269C68820a91625B7017f5750A12498b5512r7508j34173A28167J04577a44770
12258F6573a4586B44868k657e8695B42446a78710E6826K29603b26598B44204n8164
12247A86040g5182H8021f0075B75105i250F3789a4381A31722a08026D849h3853
12235B19395A00427m2237J93303E2955a13873j23594B02485J13043A34770a67415
12224B57916d7641F0887L32771a36269B11210K2973I9783g0131A69866L9761L2025
12213B41652g352j31048B51951I3457J94861E3651K8189j1856R4528J73126j02681
$$ plain form
12293 158515 -156747 9791 83775 -153255 41580 131122 248121 -8799 -65187 311144 84442
12281 203779 -310373 289852 293703 282439 -22342 -55107 -82069 -222703 516473 -41009 167832
12269 368820 -191625 27017 -65750 112498 -25512 -123020 -257193 128167 232744 -144770
12258 66573 -14586 244868 242211 -58695 242446 -178710 56826 286429 -226598 244204 186040
12247 186040 -75182 88021 -60075 275105 -9250 63789 -14381 131722 -108026 4849 -83853
12235 219395 100427 58190 251493 52955 -113873 -237467 202485 315528 134770 -167415
12224 257916 -47641 60887 393658 -136269 211210 234183 99783 -70131 169866 209627 241652
12213 241652 -7352 -138400 251951 93457 288318 53651 81840 69984 164512 337638 234957
12202B34957n1963R2625D3033A4773a99793B25267p8359J00723H1587a59105C34709
12190f522m3410E6804P0389a4402C25236A14616N6146a07078C3158J612J42554
12179A77324l6703h3865C1331R7786A401J34180P749O4516Q2761A18768K9029
12168A47797M33563A03621P8332j8834Q7592D1622J19073a40587A47813r740o3960
12157G4113K64405c69119H6954b23815E2646a3882l8919A33083J1388k2615J90727
12146C12583a61067B84203L0644c4190a0464j25602C69185B8686K43886a49208
12135B2399d0297j34213D09323D190d3546B84227a6533A29326M3989D0861J05923
12124A46784d7969B29021O3680m6153a01885C30235P8979G8501M5342a50196C47267
$$ plain form
12202 234957 182994 275619 43033 14773 -199793 225267 146908 247631 81587 -159105 334709
12190 -6522 -49932 56804 127193 -14402 325236 114616 170762 -107078 33158 34770 177324
12179 177324 140621 -83865 31331 129117 1401 135581 143330 207846 290607 118768 147797
12168 147797 581360 103621 181953 163119 250711 41622 160695 -140587 147813 138073 74113
12157 74113 338518 -369119 86954 -223815 52646 -13882 -52801 133083 144471 121856 312583
12146 312583 -161067 284203 314847 -34190 -10464 -136066 369185 28686 272572 -149208
12135 22399 -40297 -174510 409323 4190 -43546 284227 -16533 129326 173315 40861 146784
12124 146784 -47969 229021 292701 246548 -101885 330235 409214 78501 123843 -150196 347267
12112A6046b55981C9424f0940B777a54202J870A7006R6440b04257O5216A96732
12100A6765J12299J93447j17997F1347A2762b01425k6448f1193B31250A14638
12089a69727A22855K8258h8802j19023A63524B6727J27749b49374h5425j92964
12079b78389C7751a50038a1466j46272B67917b56022B01121I7159J36471b0568
12068a18221F8273J68393E2811g1302A95603l9850l3191h4929B64116C7124c07701
12056H0913e0860C0163A0210J32557E9090B8873J39243c72522e1904B10969J58133
12045C69102F7243K06085c25003C76303J78988L76717l7716j09759B24886f9428
12034a90890j20849A85640d9830k48667c3853l5855D2351Q136c01069R2925D3098
$$ plain form
12112 16046 -255981 39424 -60940 2777 -154202 -152332 17006 113446 -204257 -139041 196732
12100 16765 129064 322511 204514 61347 12762 -201425 -227873 -61193 231250 114638
12089 -169727 122855 151113 -88802 -207825 163524 26727 154476 -249374 -85425 -278389
12079 -278389 37751 -150038 -11466 -157738 267917 -256022 201121 97159 233630 -20568
12068 -118221 68273 236666 52811 -71302 195603 155753 122562 -84929 264116 37124 -307701
12056 80913 -50860 30163 10210 142767 59090 28873 168116 -372522 -51904 210969 369102
12045 369102 67243 273328 -325003 376303 555291 932008 894292 784533 224886 -69428
12034 -190890 -311739 185640 -49830 -298497 -33853 -69708 42351 50487 -301069 -208144 43098
12022A15947i9752P345j25654J00173I6589N3894i9993M320k11109A04885K1410
12011A26295d9917l7758B03687a45209b3619A2463a0293o7220j99995B26014a35076
11999A12470J41246j19080f1212F2421a50946n5410A15874B2905a19940n0244
11989a70184k1147b9548j01775G8886O4168K4594M4363a33432l9890A9857b30639
11977B11077g0278F9194J59354A05922h717q538n3207A07906O8598o4462b7531
11965B06995c5023B28749D588i6656g999l47172b1003p8692A39772d4637a2044
11953A12744e7893F2640h6760b1956o3862K3542j10039j70930a67229O71F8412
11941A69038c7183l41895F0654a25987j1830a5968p4803j60926a09852B96908
$$ plain form
12022 115947 -99752 -92407 -218061 -117888 96589 150483 -99993 -95673 -306782 104885 126295
12011 126295 -49917 -87675 203687 -145209 -23619 12463 -10293 -77513 -277508 226014 -135076
11999 112470 253716 134636 -61212 62421 -150946 -206356 115874 22905 -119940 -170184
11989 -170184 -191331 -29548 -131323 78886 143054 167648 212011 -133432 -173322 19857 -230639
11977 211077 -70278 69194 228548 105922 -8717 -17255 -70462 107906 176504 112042 -27531
11965 206995 -35023 228749 4588 -96656 -7999 -355171 -21003 -99695 139772 -44637 -12044
11953 112744 -57893 62640 -86760 -21956 -85818 -62276 -172315 -343245 -167229 -166558 68412
11941 169038 -37183 -379078 60654 -125987 -137817 -15968 -90771 -251697 -109852 296908
11930a08770M6556C6304R0253n0903M47432a4610r5196k84344A10559a37798k27531
11919c65329C44202a47882f3529J548j82067A15103b7960m0131B7603J76097e4896
11907g3737B80363a49357j8575c5788j85289K5607A39133k5686K1499C9017c7572
11895D8615r100a75317N6901C853K7056d3542o8313A13343l1322j1338k318B1177
11882a56232L6021a8658j01762j20675j09707g4157h427m5663B03335E4027R6864
11871A50891b29041l0581a0107j71973j6432H7190a7461o4730j99436I6306A4285
11859a5530j33561g2932c1064k89064g695q7804C40012j42033b18880d2810j95425
11848b38235F137a70006A4989c05631c6848k2270b7061D690e0922E4599h4226
$$ plain form
11930 -108770 -62214 36304 126557 75654 523086 -14610 -109806 -394150 110559 -137798 -365329
11919 -365329 344202 -147882 -63529 -61981 -244048 115103 -27960 -68091 27603 203700 -54896
11907 -73737 280363 -149357 -167932 -35788 -221077 -195470 139133 113447 134946 39017 -37572
11895 48615 39515 -175317 -118416 3853 30909 -43542 -111855 113343 82021 70683 68365 21177
11882 -156232 -120211 -18658 -120420 -241095 -350802 -74157 -8427 -54090 203335 54027 150891
11871 150891 -229041 -259622 -10107 -182080 -198512 87190 -17461 -82191 -281627 96306 14285
11859 -15530 -149091 -72932 -31064 -320128 -7695 -95499 340012 197979 -218880 -42810 -238235
11848 -238235 6137 -170006 14989 -305631 -36848 -59118 -27061 4690 -50922 54599 -84226
11836E1581e06183I6467D7873c1492n76929d2951A43445a49206j41694f308l06606
11825c12914e8680j75617B56232e28714b5357A37506k0457i472k64147D22118
11814a42467l7388N1147C7263a84404j12206B63612p6044b05983c7904n4788C1235
11802A64166J35394a15486B8843O0311J91320f2669B32204b60707i5994k836L6166
11791f2664F5956a49796C6736b30913j7469e7347E1323a09480C8443O0971b12901
11779C8954J66167c06219N3284A26505b84241D0683K22729b012l0529B72059e7972
11767b7746l5180B07087a46741B27341r216j5957e331r3019G6198L10097A05079
11755a6412I0110a85683p3323F3857h0376A10674C0193M7569J8378C2953a80569
$$ plain form
11836 51581 -506183 96467 47873 -31492 -608421 -42951 143445 -149206 -290900 -6308 -312914
11825 -312914 -58680 -234297 256232 -528714 -25357 137506 117049 -9472 -273619 422118
11814 -142467 -179855 -128708 37263 -184404 -296610 263612 187568 -205983 -37904 -92692 31235
11802 164166 299560 -115486 28843 89154 280474 -62669 232204 -260707 -95994 -98830 -62664
11791 -62664 65956 -149796 36736 -230913 -248382 -57347 51323 -109480 38443 99414 -212901
11779 38954 205121 -306219 -252935 126505 -284241 40683 263412 -2012 -32541 272059 -57972
11767 -27746 -62926 207087 -146741 227341 218125 202168 -5331 -98350 76198 386295 105079
11755 -16412 90110 -185683 -259006 63857 -80376 110674 30193 77762 96140 32953 -180569
11743B71445b49798J11297H4718J02488r3435a23454N0241A07894Q0940d41k97067
11732b97508A09626b83945B3558M9404i2314p8948j1341N6176D8566c924j74442
11721a78366g072C18i4480b5545A33236K7868i184E5034Q9272C0200g5331J3455
11709f1876F899a5281F8335J83620b20149B86532D8610B1820K6733M7655J7392
11698A13600a40326B13555r1143a28259p5758B0866R2437e1612H3156c29475C28366
11686A25973a10125A11612M3021Q4961c5674j63509h8757I008a21352A81183k6406
11675A54777j2143H770K921a65785c0185I0490a83958A20769a8651D8009d9315
11663B0153b73517e1113A37719c6627A66091R9973r7649a15095G3659g4717j48085
$$ plain form
11743 271445 -249798 -138501 84718 187206 93771 -123454 -73213 107894 188834 -441 -297508
11732 -297508 109626 -283945 23558 72962 -92314 -171262 -182603 -126427 48566 -3924 -178366
11721 -178366 -7072 318 -94480 -25545 133236 161104 -9184 55034 144306 30200 -75331 -61876
11709 -61876 6899 -15281 68335 251955 -220149 286532 48610 21820 48553 96208 113600
11698 113600 -140326 213555 122412 -128259 -204017 20866 113303 -51612 83156 -329475 328366
11686 125973 -110125 111612 154633 239594 -35674 -199183 -88757 9008 -121352 181183 154777
11675 154777 142634 8770 11691 -165785 -30185 90490 -183958 120769 -18651 48009 -49315
11663 20153 -273517 -51113 137719 -36627 166091 266064 168415 -115095 73659 -74717 -222802
11652b22802L6114j54375a16333I1507B1506J29942k9665k2041b41898B7001c9022
11640a29460n1572P1840A47998a50239A00455L02106b55213H0087a22695j96477
11630c19172A19820h6387H6270Q9684J56618L0350E0421b86425C22298r5922C9601
11618f4828A87536a23398C2235B244g0048C6228A1780b46921M8327I6779l1397
11607F5382a61271B76521b7919E8635K79723b6084A69692c83880J2639i8568B35489
11595G1626b58542n7088B17197d15903d5058C29008a21831L9923k71522B09735
11584C90472c0985q6300d5647q5317A07844J77901A25971d1850A922e0221m18879
11573d69100C8363a67577A31861B9966Q3400R1737J8054b00393j13576J32431
$$ plain form
11652 -222802 -186688 -341063 -116333 91507 21506 151448 121783 99742 -241898 27001 -39022
11640 -129460 -181032 -109192 147998 -150239 100455 402561 -255213 80087 -122695 -319172
11630 -319172 119820 -86387 86270 175954 332572 362922 50421 -286425 322298 226376 39601
11618 -64828 187536 -123398 32235 2244 -70048 36228 11780 -246921 -198594 96779 65382
11607 65382 -161271 276521 -27919 58635 338358 -26084 169692 -383880 -371241 -98568 235489
11595 71626 -258542 -315630 217197 -415903 -45058 329008 -121831 -81908 -353430 209735
11584 390472 -30985 -117285 -45647 -130964 107844 285745 125971 -41850 1922 -50221 -469100
11573 -469100 38363 -167577 131861 29966 113366 205103 223157 -200393 -313969 -181538
11563a81538f295k74266C1707J50529a22337q9041f4945k1572E7718a33214b3817
11551f4827A80734i0609C21853b7468C6328K05583I2643K89098a6490l1411A01480
11539C6624J3677a6117A60568K01552d3151A94915b0726B39236a56066B3883J04639
11528A28522J07164n0204b0755A3989N6734b53201M2304B46937I4137J6619M2444
11517A53200C0997L8408K12031a35738A13492f9758B564L26778q1901c7732p7741
11506a15473m3248C37709m5766A7451J6682K93775n311A47794k1417m0441e2787
11494A66247A6973O7304a70567A87858e13652B6012c33986I1131J10736p5222
11484A26645g716j78638c6936p6729A8617c18179A49581o4753J23247h7244j30044
$$ plain form
11563 -181538 -6295 -280561 31707 182236 -122337 -211378 -64945 -86517 57718 -133214 -23817
11551 -64827 180734 -90609 321853 -27468 36328 241911 92643 381741 -16490 -47901 101480
11539 36624 50301 -16117 160568 362120 -43151 194915 -20726 239236 -156066 23883 128522
11528 128522 235686 185482 -20755 13989 70723 -253201 -210897 246937 94137 110756 153200
11517 153200 30997 69405 281436 -135738 113492 -69758 2564 329342 247441 -37732 -115473
11506 -115473 -158721 337709 291943 17451 34133 327908 322597 147794 126377 85936 -52787
11494 166247 16973 84277 -170567 187858 -513652 26012 -333986 91131 201867 126645
11484 126645 -7716 -186354 -36936 -113665 18617 -318179 149581 84828 208075 -87244 -217288
11473b17288M7751d9541b1821A48564P4331K7510j6147e4677B67564K9265G3999
11461e0644B82847A2132b04742b0413m2175A26562I223J61574i1120b590j9644
11450b2234A46366j4750j5899J46517A25921J17625A2318Q673J91352k513d0535
11438A67980j9538L9879j120a54748B33329a75761n058Q7041I7472a12574k1625
11427a34199B39378E28e13659K01537J55071k00183A90944E6052a93124r3203
11417b86327C78759A53321a4011C53415d0522F6308J23457b21985A13566b3490
11406A77495F5084K03924D6630e6197k99535A33130a16859B39829b25170A75083
11395b60071f2386B37760m3558a73644B0997K10695b12312R6986L515F23528a42088
$$ plain form
11473 -217288 -169537 -49541 -21821 148564 222895 250405 234258 -54677 267564 296829 73999
11461 -50644 282847 12132 -204742 -20413 -62588 126562 9223 170797 -91120 -2590 -22234
11450 -22234 146366 131616 115717 262234 125921 243546 12318 20991 212343 209830 -40535
11438 167980 148442 188321 187201 -154748 233329 -175761 -180819 -93778 97472 -112574 -134199
11427 -134199 239378 528 -513659 -312122 -157051 -357234 190944 56052 -193124 -286327
11417 -286327 378759 153321 -14011 353415 -40522 66308 189765 -221985 113566 -23490
11406 177495 65084 269008 46630 -56197 -355732 133130 -116859 239829 -225170 175083
11395 -260071 -62386 237760 194202 -173644 20997 231692 -212312 -115326 -111811 623528 -142088
11383A60087c4783G9878M8641d97497a71630A23943J42875r5834b29737A2496
11372A90284m359l5149a07308B5668b93870C5269J45768F4470a59107I5353h4137
11360g43494c14508C99445d13908A1419b29992D7544g792E6525J53447D2280P2189
11349A14469c4440B62411B1332J16453L4731a96665i702l14048J12590A02858
11338b46784A86479n5018n3329g9419j3709J3110B24128a23566G7124a55494K0388
11327a35106D5708b57257A0996J23455c32299R0465D5155a12142A8755a39672
11316A99771e3150j71842B17030a55352E5351c9597k27050Q0036e4784q6943A7451
11304a21893F2567a68969k44396a09286A00194k3461Q43a99301D3410b49880R2829
$$ plain form
11383 160087 -34783 79878 128519 -497497 -171630 123943 266818 170984 -229737 12496
11372 190284 185925 150776 -107308 25668 -293870 35269 181037 64470 -159107 95353 -84137
11360 -743494 -314508 399445 -413908 11419 -229992 47544 -7792 56525 209972 42280 114469
11349 114469 -34440 262411 21332 137785 172516 -196665 -9702 -323750 -211160 102858
11338 -246784 186479 131461 78132 -79419 -93128 -80018 224128 -123566 77124 -155494 -135106
11327 -135106 45708 -257257 10996 134451 -332299 -241834 45155 -112142 18755 -139672
11316 199771 -53150 -224992 217030 -155352 55351 -39597 -266647 -186611 -54784 -141727 17451
11304 -121893 62567 -168969 -413365 -109286 100194 76733 77576 -199301 43410 -249880 -157051
11293a57051M8448A54205c9030C52369b02354p108B47200a03366q5159F8461h3981
11281A21190a4695C27326B6147b15515B88894r0197j3660E7770K74361A6566h3522
11269b37987M3958O474A30524B5445b58846f6755B79284A29606a18447A18268
11258a43851M7417H1419d8083E2637b50809A1773M31077b64291M5900M1019j52009
11247c29381h1291l5635A30472N4858a97005i905E5433a96825J5918B86156b45094
11235A27933b52746q49G5817c57124J67953c6389k62669a100o3356m20679A80943
11223b2285l16799B18115d10126b0171A19327e7621k17017c8971D9602L7175k7716
11212E9061d13396D0920n45a63444B34446D0841K41462o3500b05647G6893b70663
$$ plain form
11293 -157051 -108603 154205 -39030 352369 -202354 -209462 247200 -103366 -188525 68461 -83981
11281 121190 -14695 327326 26147 -215515 288894 198697 185037 57770 332131 16566 -83522
11269 -237987 -194029 -187555 130524 25445 -258846 -66755 279284 129606 -118447 118268
11258 -143851 -96434 81419 -48083 52637 -250809 11773 442850 -264291 -218391 -177372 -329381
11247 -329381 -81291 -116926 130472 185330 -197005 -9905 55433 -196825 -180907 286156 -245094
11235 127933 -252746 -253595 75817 -357124 -189171 -36389 -299058 -1100 -64456 -485135 180943
11223 -22285 -339084 218115 -410126 -20171 119327 -57621 -274638 -38971 49602 86777 59061
11212 59061 -413396 40920 40375 -163444 234446 40841 282303 218803 -205647 76893 -270663
11200H6371a00188p1709b8460j86559f1870D5404k698M1253L16487j63644q6114
11189A50688a94493B07231a70035A12979d40087a57771k03421a68543A45678a19778
11178d4380J2257A57117F0012a68099A73290b13128h2575B22288d41912A69464
11167B92575b49431A38436a29098D7540B1363b39915J17996A35404b20638q7410
11157c08048c5427j4572p872a6115F8468a4511M261C02015F5783L1994c57219
11145A63a65288f4308b6974l20198a51267k8940j69214B78792n5877m9117a49161
11133a43782A19447f621E3094O5915j1421j7907L53355H4537m1821M247a3034
11121a07680B5165L1498L4915i9479j96923a16816b5018k24845B4869J52636J3761
$$ plain form
11200 86371 -100188 -171897 -28460 -215019 -61870 45404 42706 83959 400446 236802 150688
11189 150688 -194493 207231 -170035 112979 -440087 -157771 -361192 -168543 145678 -119778
11178 -44380 -32123 157117 60012 -168099 173290 -213128 -82575 222288 -441912 169464
11167 292575 -249431 138436 -129098 47540 21363 -239915 -121919 135404 -220638 -308048
11157 -308048 -35427 -49999 -57871 -16115 68468 -14511 -10250 302015 65783 97777 -357219
11145 163 -165288 -64308 -26974 -347172 -151267 -180207 -349421 278792 222915 173798 -149161
11133 -143782 119447 -6621 53094 119009 107588 89681 443036 84537 42716 46963 -13034
11121 -107680 25165 56663 91578 -99479 -296402 -116816 -25018 -249863 24869 177505 191266
11110A91266E2644N5075J66579j18559O934b02053F6205K38835G4402M4615J3002
11099A32019K18564q7368J8217e8739a8062l8198E0085a21735L2301l1634a0376
11087I819L95567A00351e3029A6912i8119A154O98K13302b13693A17403j5019
11076A02384K98644f0715C45195o750r5090K0658J99055j73027j31784o4289K56127
11065C50095j62354n2950L54540H634J94594K25813R9006j19524J20775j46626
11055C82672J44884H5304M26473Q868O6646J10879k8369k33228m8776J68228L44658
11044I00683l62441K75454C69261K33671k76857K51006P8367l17076j28905J39345
11034C48812K8327K56442j85675N06315m73042K6042j6013L60126k45069L77936
$$ plain form
11110 191266 52644 107719 274298 155739 162673 -202053 66205 305040 74402 119017 132019
11099 132019 350583 263215 281432 -58739 -18062 -56260 50085 -121735 -89434 -121068 -10376
11087 9819 405386 100351 -53029 16912 -98119 1154 1852 215154 -213693 117403 102384
11076 102384 401028 -60715 345195 338445 243355 264013 463068 290041 158257 93968 350095
11065 350095 187741 134791 489331 8634 203228 429041 528047 408523 529298 382672
11055 382672 527556 85304 511777 520645 587291 698170 669801 436573 387797 556025 900683
11044 900683 538242 813696 369261 602932 326075 577081 655448 338372 209467 348812
11034 348812 377139 633581 447906 954221 481179 507221 491208 851334 606265 984201
11024I84201m22028j81086L4664K04622j12070j20148J52077P0354B43554L5303
11014B78857L38144M3453k03297r9420R3840j39822o2264m7327K58921j14176
11004C46909n7436Q8337J52703J13569A54749M10759O0975k88308J66553J10260
10994F14988r4047L55666D22582R5977A98896N13286j29099p9480J18629N6149
10984F78381J57943q4757p9054M22652m5402l96927L51421L14997O1420J99242
10974A579916K38507J82943M5984M47481m99412L66912q15239J66105K10414m51830
10964A471781k36101l40936M98072k36302J30951j07863K11159o4910l82589J72901
10954A116163j43093k26261l316C66540K09431M2953j16735j20271g168C15357
$$ plain form
11024 984201 562173 381087 415751 620373 508303 388155 540232 610586 243554 278857
11014 278857 617001 660454 457157 357737 451577 311755 249491 202164 461085 346909
11004 346909 289473 377810 530513 644082 154749 565508 626483 338175 504728 614988
10994 614988 520941 876607 422582 518559 198896 712182 583083 503603 622232 678381
10984 678381 836324 751567 672513 1095165 1049763 652836 1004257 1319254 1380674 1579916
10974 1579916 1818423 2001366 2047350 2494831 1995419 2362331 1547092 1713197 1923611 1471781
10964 1471781 1235680 894744 1392816 1156514 1287465 1179602 1390761 1325851 943262 1116163
10954 1116163 973070 746809 743493 366540 575971 618924 502189 381918 -7168 315357
10943A72169Q2573m3228b2366A8666J19476J20842h1438D4400K42930P5250a37435
10931A52428a0754l7157l19144A07904J42349j07429K0484i6302k9098L0907B32269
10919a60308B44425m7694b45661J12632I1036a67199C54470a71583E573b25959
10908b12231Q367C09272b58561i3114A5195J03757g0434A09278M887R9872b65243
10896a78745A17876c77740C33441a12269B5156a85982F9326c20888H7358f4411
10885B71598D7497h6661G5501a76612g6178H6057C328Q9794c34894I823a38337
10873c7638j36654r601A76678a24408A32967i2545H2958N7955a57273I0100J30774
10862B20874b06672A70124J24468A15225b40579l4041O4914r8811F2825J07900
$$ plain form
10943 172169 254742 211514 -22366 18666 138142 258984 -81438 44400 287330 362580 -137435
10931 152428 -10754 -47911 -367055 107904 250253 142824 163308 -96302 -125400 -94493 232269
10919 -160308 244425 196731 -245661 -133029 91036 -167199 354470 -171583 5573 -225959
10908 -212231 -203864 309272 -258561 -93114 15195 118952 -70434 109278 114165 214037 -265243
10896 -178745 117876 -377740 333441 -112269 25156 -185982 69326 -320888 87358 -64411
10885 271598 47497 -86661 75501 -176612 -76178 86057 3328 93122 -334894 9823 -138337
10873 -37638 -174292 -183893 176678 -124408 132967 -92545 82958 140913 -157273 90100 220874
10862 220874 -206672 170124 294592 115225 -240579 -274620 -209706 -308517 62825 170725
10852A70725a02822k19064c1706A16546M5067i2523n5866A37966K6525a7895j95548
10841b13443H6544f4211k97206J9286F7811L5250J63478B1652d0498k94634d0531
10829F5025a96553P3094j19696D7076b31012E2546h0830A33957b68827j10066
10819c78893F1190a91781e6335B56342e02514C08044C8708b04258B02386a47681
10808A74514i0637h007k33145I2753f6700j71697j82245D97225a99820B85757
10797a58980C7859a53469C1675g1182k4562j9189F6307P3362b71761A02791a65953
10785A1372a3600j60233A98822d34334a26751D137c8808k06166g9236r5188O2313
10774a12111k32650F0588k5530a04910A20025a4681j33726A21938Q3442G3608
$$ plain form
10852 170725 -102822 -321886 -31706 116546 161613 -92523 -148389 137966 164491 -17895 -213443
10841 -213443 86544 -64211 -361417 -342131 67811 103061 266539 21652 -40498 -335132 -40531
10829 65025 -196553 -123459 -243155 47076 -231012 52546 -80830 133957 -268827 -378893
10819 -378893 61190 -191781 -56335 256342 -502514 308044 38708 -204258 202386 -147681
10808 174514 -90637 -8007 -241152 92753 -66700 -238397 -420642 497225 -199820 285757
10797 -158980 37859 -153469 31675 -71182 -95744 -114933 66307 139669 -271761 102791 -165953
10785 11372 -13600 -173833 198822 -434334 -126751 4137 -38808 -244974 -79236 -174424 -112111
10774 -112111 -344761 60588 35058 -104910 120025 -14681 -148407 121938 205380 73608
10763a82749j1351K4964A29018K4411b71409E6398K7229N3429E1573a73293H6709
10751a05199j4425H7428L7447i5078B12354b8164k55006A16103b95960a07519
10740A37856g9381B46391a49398N1443M2637P078F1940J97932h9402j9317j04267
10729b12986C01521A1276c9123a4749m3959b6354j44677M0282d0889G1413b51418
10717a91856O9368G8066c55968B2689b63954B14385E3368a10601r2109K5947B15337
10705a47536C1481K5810a89926n744B08128b25009C04994j12678h9898N293F0508
10693A40738a92805B36091h5910A27108M9228e0464A16071K01041b89466M7740
10683b41726f0829p0602m10981b10553h9871b4860j37437F7115b01436R3568A03310
$$ plain form
10763 -182749 -194100 -169136 129018 153429 -271409 56398 83627 137056 51573 -173293 86709
10751 -105199 -119624 87428 124875 -95078 212354 -28164 -283170 116103 -295960 -107519
10740 137856 -79381 246391 -149398 -97955 -55318 -48240 61940 259872 -89402 -108719 -212986
10729 -212986 301521 11276 -39123 -14749 -58708 -26354 -171031 -130749 -40889 71413 -251418
10717 -191856 -122488 78066 -355968 22689 -263954 214385 53368 -110601 -202710 -176763 215337
10705 -147536 31481 57291 -189926 -195670 208128 -225009 304994 192316 -89898 -84605 60508
10693 140738 -192805 236091 -85910 127108 176336 -50464 116071 317112 -289466 -241726
10683 -241726 -60829 -131431 -542412 -210553 -89871 -24860 -162297 67115 -201436 -107868 103310
10671e73345b68583a09166G0350B9907c44873A6969b53331j76031a78383A15672
10660h448A39112a62817k4218A66352c02663I4994a02913M8236l76384a18083
10649b94930A07156J72096j11916b09305i9473a6190j14061C70190b14070m6336
10639b60406e1579n0153D0075a38943A09315E1455a58348A92192c7098D4998a2307
10627b5446G6118a89301A99220a59130B96322a30337L5649G5121g4754A7084Q0286
10616I7370c8272A61112D6932L5924K1490a55415O0264L5053D6471J35306F3417
10604E9025a09668J4771J1410A47939b10444N6611d7669l5730m1880j15295e4274
10592h8905j57818F9942j7348a7509j46115C02472b31961N9522N4938B36279a17343
$$ plain form
10671 -573345 -268583 -109166 70350 29907 -344873 16969 -253331 -429362 -178383 115672
10660 -8448 139112 -162817 -187035 166352 -302663 94994 -102913 -54677 -431061 -118083
10649 -294930 107156 279252 167336 -209305 -99473 -16190 -130251 370190 -214070 -260406
10639 -260406 -51579 -101732 40075 -138943 109315 51455 -158348 192192 -37098 44998 -12307
10627 -25446 76118 -189301 199220 -159130 296322 -130337 -94688 75121 -74754 17084 97370
10616 97370 -38272 161112 46932 82856 104346 -155415 -95151 -60098 46471 181777 63417
10604 59025 -109668 -94897 -83487 147939 -210444 -153833 -47669 -83399 -125279 -240574 -54274
10592 -88905 -246723 69942 52594 -17509 -163624 302472 -231961 -172439 -117501 236279 -117343
10580H6822c93938J69070a05645C0154e4082j18104B5494g9721H9427c9531J8280
10569b1251A4065a41166N6310j26318H0468b01232A45166b10127D1255d30925
10558a11025I8313a65422g0503A65279a2243d172A56889n0331A8089J22225f6937
10546a22265q3401e6274m4641k4169r6247Q0352I1784k1142i5224G8084a09520
10534e2606n0321G6330d3654H4362a98769B9114d9017A34842A8794c84658i9835
10522h3167H4451J0632p051L2910b9037B02488a81391A23889b35818I6963a94081
10510a83516B8071a97111a0976k76102b9277j28025M2728C4763K30451g90j22816
10499a23606A7800L3251R285O7651c5292l58507J34235i5390A55530D3684b06412
$$ plain form
10580 86822 -393938 -224868 -105645 30154 -54082 -172186 25494 -79721 89427 -39531 -21251
10569 -21251 14065 -141166 -84856 -211174 80468 -201232 145166 -210127 41255 -430925
10558 -111025 98313 -165422 -70503 165279 -12243 -4172 156889 106558 18089 140314 -66937
10546 -122265 -205666 -56274 -100915 -125084 -221331 -140979 91784 70642 -95224 78084 -109520
10534 -52606 -102927 76330 -43654 84362 -198769 29114 -49017 134842 18794 -384658 -99835
10522 -83167 84451 95083 88032 120942 -29037 202488 -181391 123889 -235818 96963 -194081
10510 -183516 28071 -197111 -10976 -287078 -29277 -157302 -114574 34763 265214 -790 -123606
10499 -123606 17800 51051 60336 127987 -35292 -393799 -259564 -95390 155530 43684 -206412
10487g2430B21684c6464B63053A12997k7479a08468A28114A4281b10110a04043
10476A94238A4513J86850A9231e4397C04475e0557I358J54927D8666A0823d04869
10464h3739b9098B4325a33204A40573b9184k6276b5705B41770G7545b12008H6761
10452b46169C2378J43861J72029B8551a36527l46731A04164d62694A05051h0817
10441C3626F801a26736j83984O4960e2713A91812l7604f4318k97496a16115H0985
10429d7946C1133d7527m7124a8404j24691H2050P8541a32000e1376c068l5806
10418c8874j24915J083B86786a68247C01731c8525k62417A0978f4245H79b22204
10406F4716J40549a26474A14269d58279d401j58961A9853K67721e218k95136c9161
$$ plain form
10487 -72430 221684 -36464 263053 112997 85518 -108468 128114 14281 -210110 -104043
10476 194238 14513 201363 19231 -54397 304475 -50557 9358 164285 48666 10823 -404869
10464 -83739 -29098 24325 -133204 140573 -29184 -55460 -25705 241770 77545 -212008 86761
10452 -246169 32378 176239 348268 28551 -136527 -483258 104164 -462694 105051 -80817
10441 33626 6801 -126736 -310720 -245760 -52713 191812 154208 -64318 -361814 -116115 80985
10429 -47946 31133 -47527 -94651 -18404 -143095 82050 160591 -132000 -51376 -3068 -38874
10418 -38874 -163789 -162706 286786 -168247 301731 -38525 -300942 10978 -64245 879 -222204
10406 64716 205265 -126474 114269 -458279 -4401 -163362 19853 287574 -5218 -300354 -39161
10394A1887N2952L36794j72875D2956J98896a18894N3050A0123J42800F140N9331
10383F5471j0255K61768g2686H5746g8129C05151j5135A41408a8586A72057F524
10371D33970q3063E7499K27886K2830m9876O8144f654E9637J45918J306E1983
10359G8144L42410g6672o9615H6086b540j6375B45324A12431J77977L19236o7823
10348E41821k47907j29163L04737b94268B99865n2922G1087P6831A9951i5501
10337A26048j7104K85369F2282a00724a8681j28509B107K09260J999r7288A3295
10325B36164K77259a65838I5086a26411A17665a81394E7215j8256e6676l42511
10315c99187d7100E234J32235a40754E2921a45450e8914l08809a2006B89006h5393
$$ plain form
10394 11887 64839 401633 228758 42956 241852 -118894 -65844 10123 152923 6140 65471
10383 65471 55216 316984 -72686 85746 -78129 305151 290016 141408 -18586 172057 6524
10371 433970 350907 57499 285385 308215 258339 326483 -6654 59637 205555 206861 51983
10359 78144 420554 -76672 -146287 86086 -2540 -18915 245324 112431 290408 609644 541821
10348 541821 293914 164751 469488 -294268 299865 246943 71087 147918 19951 -95501
10337 126048 108944 394313 62282 -100724 -18681 -147190 2107 211367 213366 116078 13295
10325 236164 513423 -165838 95086 -126411 117665 -181394 57215 38959 -56676 -399187
10315 -399187 -47100 5234 137469 -140754 52921 -145450 -58914 -367723 -12006 289006 -85393
10303B48794b50728I3881P6046d2641B36780C340a6085H7977a0368n528B18940
10291B3570a23086J7935D336K91219E2308c6339B50007D9076L0994b46183A05386
10279a17881o2023b0105j62372A29166F0772a33617q49K4319j30264B19598c73691
10267g3465j67071R8107C58818j03788r9356f0442H6574j8958J96874M0552J6700
10256C21742R8084l8029A54278a51402B37426a85320D15056g3504j49168N2690
10246a69982r8314F6233c72749A67946p4591a23321j2812k21166G2319b33964
10235B19295a50904L9403b3382E3816Q7957h0806j81340p596d2795j03101B27967
10223B6030a61721M9153B25416c30506E3265a1489m27469E9983a15998p5578C14330
$$ plain form
10303 248794 -250728 93881 169927 -42641 236780 3340 -16085 87977 -10368 -15896 218940
10291 23570 -123086 -105151 4336 295555 52308 -36339 250007 49076 80070 -246183 105386
10279 -117881 -179904 -20105 -182477 129166 60772 -133617 -134466 -110147 -240411 219598 -373691
10267 -73465 -240536 -142429 358818 255030 155674 -60442 86574 67616 264490 305042 321742
10256 321742 419826 381797 154278 -151402 237426 -185320 415056 -73504 -222672 -169982
10246 -169982 -268296 66233 -372749 167946 93355 -123321 -136133 -357299 72319 -233964
10235 219295 -150904 -111501 -23382 53816 141773 -80806 -262146 -269742 -42795 -145896 227967
10223 26030 -161721 -112568 225416 -330506 53265 -11489 -438958 59983 -115998 -191576 314330
10211a81380K4011j04950R1167E4133b3293q1024H5477Q7753A331h496k32936
10200b41432a08773j06554A41206m862a42327c1722j74847E4233a37253A70995
10189i5472A24477b20880c124l14787J17321M988E6300h3178I1890b79760j3175
10178b92935f2799O624l20478a44726N0297H819a22462b8394j29031m1145H6828
10166B40098e62235a71170P0879I9720J1279h3070n8761c2536j78920A17042a05145
10154b32542j48773a69347F4320a38446C18504j48990a24729b4032B4511J02525
10144A27036c2286B73790d4525F9323a66346e9443j48545a665k69532k4985e9153
10132a42384A44961l077E5935J57588b31054A4347c33250a54786l2970G8676b12653
$$ plain form
10211 -181380 -157369 -262319 -171152 54133 -23293 -104317 85477 173230 1331 -8496 -241432
10200 -241432 -108773 -215327 141206 136344 -142327 -31722 -206569 54233 -137253 170995
10189 -95472 124477 -220880 -3124 -317911 -200590 -195602 56300 -83178 91890 -279760 -292935
10178 -292935 -62799 -56175 -376653 -144726 -94429 8819 -122462 -28394 -157425 -198570 86828
10166 240098 -562235 -171170 -100291 99720 110999 -83070 -141831 -32536 -211456 117042 -105145
10154 -232542 -381315 -169347 64320 -138446 318504 169514 -124729 -24032 24511 127036
10144 127036 -32286 273790 -44525 69323 -166346 -59443 -207988 -1665 -271197 -296182 -59153
10132 -142384 144961 141884 55935 213523 -231054 14347 -333250 -154786 -187756 78676 -212653
10120A09600J95621j39627B7618K49920i3928B75641c9803C6928j3472D552h5419
10108A47511P891k792m4103m1805a4407l40193J53429N0941q780j98502A00652
10096A61133j0063c080k90536B77294b12222A57262c7456j43901K4030L7981A82244
10084a18547c6170A44245C1865O2326a91159f6885k74255A983d07524A13595n5307
10073E8288F315b52099R5426g4580j03865f7801G5454a85517d3749m51988B89052
10061c0271D32523F5798a33869j1450e0409A6909a83918L5702j3785f7799b4879
10049a03119j42286p7874A25926a87943A18551C9439B748R027J29432A8385f6550
10037A326a86188c0086F3033H444L0987O7511Q3106k7054D4976c42140A62601
$$ plain form
10120 109600 305221 165594 27618 277538 -93928 275641 -39803 36928 23456 4552 -85419
10108 147511 155402 152610 108507 66702 -14407 -354600 -201171 -150230 -159010 -357512 100652
10096 161133 151070 -3080 -293616 277294 -212222 157262 -37456 -181357 -157327 -119346 182244
10084 -118547 -36170 144245 31865 94191 -191159 -66885 -341140 1983 -407524 113595 58288
10073 58288 6315 -252099 -156673 -74580 -178445 -67801 75454 -185517 -43749 -495737 289052
10061 -30271 432523 65798 -133869 -145319 -50409 16909 -183918 -148216 -162001 -67799 -24879
10049 -103119 -245405 -323279 125926 -187943 118551 39439 2748 11775 141207 18385 -66550
10037 1326 -186188 -30086 63033 8444 39431 106942 190048 162994 44976 -342140 162601
10025C5227b89461J2907C23464b05290A14264N736a13642j09077b1438p38k30723
10014b52899A75051B9803a50154A10744a27103c2881I0600b65791D570b5637k30328
10003b55965Q5519o1715A4203a16286A4430K5626a65292j8594A31072i9410o2459
9992a61869B08159a3945k37616C95280c42194J54530Q222D8257a27521a6399n3584
9981f9983a6634j13944j4051b2062C146J10016l5796a97385F1022b36830C08089
9969E9763c56040B65558H2108b83735C0368J60245e5256k57048p854b4307j51753
9958a76060L3784j3557L7663m5335B19628c13474A75602a32114I7211d7891l008
9947e0899l04383J57835A98551E7771j4426a79362B72066g4291m8083p6764B16162
$$ plain form
10025 35227 -289461 -276554 323464 -205290 114264 120000 -113642 -222719 -21438 -22176 -252899
10014 -252899 175051 29803 -150154 110744 -127103 -32881 90600 -265791 4570 -25637 -255965
10003 -255965 -170446 -232161 14203 -116286 14430 40056 -165292 -183886 131072 -99410 -161869
9992 -161869 208159 -13945 -251561 395280 -342194 -187664 -179442 48257 -127521 -16399 -69983
9981 -69983 -16634 -130578 -144629 -22062 3146 113162 77366 -197385 61022 -236830 308089
9969 59763 -356040 265558 82108 -283735 30368 190613 -55256 -312304 -320158 -24307 -176060
9958 -176060 -142276 -155833 -118170 -163505 219628 -313474 175602 -132114 97211 -47891 -50899
9947 -50899 -355282 -197447 198551 57771 43345 -179362 272066 -74291 -122374 -199138 216162
9935c55219a2031A18024b3771m07926C6838h6318a7479B05107i9591C56K43688
9924B44044j18353A1562h4520A9172f5877j21543A87501A567b30727G6781h9463
9912i8288j2771j4408j64571g3780k63411f1613B8435N0800c68495A43430b52620
9900A04955i2866l7223k74982a39672C26331b36800a12488K3601c8028j1891j02410
9889a52329m59774A56430l1752L9724K23582a23390D6881A4168c97741a37675
9878C2464a64889Q0009A17674R1586r167b28154H3889i5990p4016B320K76577
9867B78897b47065j58556H0012d09326J7953g853G5313b98496a12346j98951F2110
9855A0182K49439d2211k8671B56218a31709A4928a68007d4400F3244a30657o6606
$$ plain form
9935 -355219 -12031 118024 -23771 -431697 36838 -86318 -17479 205107 -99591 356 244044
9924 244044 125691 11562 -84520 19172 -65877 -187420 187501 1567 -230727 76781 -89463
9912 -98288 -111059 -125467 -290038 -73780 -337191 -61613 28435 79235 -368495 143430 -252620
9900 104955 -92866 -130089 -405071 -139672 326331 -236800 -112488 -88887 -38028 -49919 -152329
9889 -152329 -612103 156430 124678 164402 387984 -123390 46881 14168 -397741 -137675
9878 32464 -164889 -84880 117674 209260 200093 -228154 83889 -95990 -170006 2320 278897
9867 278897 -247065 -405621 80012 -409326 -391373 -7853 75313 -298496 -112346 -311297 62110
9855 10182 259621 -42211 -70882 256218 -131709 14928 -168007 -44400 63244 -130657 -197263
9844a97263K0637A25429a09174A30461e8392C03474i1064l9418I677a46918A15247
9832A1433L45754C0893a00507B63097E3823a52478j28774A02809i9104L4367k3525
9821h8262a9315A37386b4305j47920J1917j55550i9077k81853k0271G201a4237
9809e4980k40992d924C4799M2313c25677b3436o6703A52547K02775b68356j6138
9798b84494A17458c50321h0903k82673B23704e1978A0452c73483a06758c6569
9787a48600b7425A22898a07475k84030g9188o1651E7210b30410h4527A65598n4688
9776A10910k4216P5872F4184P053a09496n1111I0229i5561B3666a10511C30710
9764b5013k11743l3109B13946i6331j36011R9554k1428G6303a47400m622M0687
$$ plain form
9844 -197263 -176626 125429 -109174 130461 -58392 303474 -91064 -130482 9677 -146918 115247
9832 11433 357187 30893 -100507 263097 53823 -152478 -281252 102809 -99104 -64737 -88262
9821 -88262 -19315 137386 -24305 -172225 -160308 -315858 -99077 -380930 -401201 7201 -14237
9809 -54980 -295972 -4924 34799 77112 -325677 -23436 -90139 152547 355322 -268356 -284494
9798 -284494 117458 -350321 -80903 -363576 223704 -51978 10452 -373483 -106758 -36569
9787 -148600 -27425 122898 -107475 -391505 -79188 -140839 57210 -230410 -84527 165598 110910
9776 110910 86694 162566 64184 71237 -109496 -160607 90229 -95561 23666 -110511 330710
9764 -25013 -236756 -269865 213946 -96331 -232342 -132788 -154216 76303 -147400 -152022 -111335
9753a11335A20466a30355G2448d5799l2257b6567A31396A0989L3621J55592q1823
9742A18379C638i6231q5567j22051C6434a0980F431a58394f4455D3806M5759b10045
9729c21086f8389l9751L480j6384A72225b32239B60350N052a65689c4139p5689
9718a09828j34469j1187k92802f9021A27280b01644a5062H0967J92051d9726H3874
9706a8966j98251L6952b8511O371j54905p778e4348E7482k1075a76903f4389F3880
9693H2841k7092g1480j25435P0608l7043b5663G9107g991k76042J36276I0114
9681a09207J0274A8231b52806d5714k68260a13889p6347j34083F6377j4451a04135
9669A42898b2011j09476B1406J20751A4621b46305F6754a67584j53556m0795K2440
$$ plain form
9753 -111335 120466 -130355 72448 -45799 -78056 -26567 131396 10989 44610 200202 118379
9742 118379 3638 -96231 -181798 -303849 36434 -10980 6431 -158394 -64455 43806 89565 -210045
9729 -321086 -68389 -108140 -104660 -121044 172225 -232239 260350 265402 -165689 -34139 -109828
9718 -109828 -244297 -255484 -548286 -69021 127280 -201644 -15062 80967 273018 -49726 83874
9706 -18966 -217217 -180265 -28511 -22140 -177045 -184823 -54348 57482 36407 -176903 -64389 63880
9693 82841 55749 -71480 -196915 -126307 -163350 -25663 79107 -7991 -284033 -147757 90114
9681 -109207 -98933 18231 -252806 -45714 -313974 -113889 -190236 -324319 66377 51926 -104135
9669 142898 -22011 -131487 21406 142157 14621 -246305 66754 -167584 -321140 -361935 -339495
9658c39495a45069J7231A45227g9208A09395g064o9477b2740l09646h1380r5631
9647a77011F5669h4823f75k84964G9011G331N9470e298A58274J711j2294a4406
9634d71019B3033a8480D0193a64215O4687A82314b47175O4571g4213j55377b2688
9622b81245A06443N5249a9447k0232j86043C11624a61264b4874L864k5918o51984
9611f98912c14034f780B6968e5229K688D1434P9425b69892J11170p3914f2606
9599g2660H123c90987g4743o0516k3152A81264D7361L8608c53225H8388a47062
9587I7987a67725A17109l5746e0254n75819i2131C3223c3519l5308k7365k49709
9576c45901C295a57067A40374a52782M8659H7114d8365j33765E3740Q8504a78953
$$ plain form
9658 -339495 -145069 -127838 145227 -79208 109395 -7064 -76541 -22740 -332386 -81380 -177011
9647 -177011 65669 -84823 -675 -285639 79011 7331 66801 -5298 158274 159985 147691 -14406
9634 -471019 23033 -18480 40193 -164215 -99528 182314 -247175 -182604 -74213 -229590 -22688
9622 -281245 106443 161692 -19447 -39679 -225722 311624 -161264 -24874 -21010 -46928 -698912
9611 -698912 -314034 -6780 26968 -55229 -52541 41434 120859 -269892 -158722 -232636 -62606
9599 -72660 8123 -390987 -74743 -135259 -158411 181264 47361 85969 -353225 88388 -147062
9587 97987 -167725 117109 81363 -50254 -626073 -92131 33223 -33519 -68827 -96192 -345901
9576 -345901 3295 -157067 140374 -152782 -104123 87114 -48365 -182130 53740 142244 -178953
9564D7166d1688A27870c061A7626a20546c6718B65899r7802b35776L3119j00459
9553c03116g8306j97157P0217B49801a98688A35021c74175d6314a7541l53944
9543c71485M7921b0362G9816K53049h3584H4159a58739A44009b455l1011m5752
9532g9218F6442i5010j1663I5118a76623B6689i0872j06439O3779K4737J9743
9521h9052l7390L0845j22415F2835Q9417E2820Q546c4176h416p0430C74893c07011
9508a00493r922m3439K1943j85106a20306p521k90020J16915A6099J37937N6088
9497B10124c30792A9622a04398D593g811j21834j20107m81994b31793d3619l19125
9486c62744a35383A20882b35047e5657j28693A01778N1919b98589f4915k9238
$$ plain form
9564 47166 -41688 127870 -3061 17626 -120546 -36718 265899 168097 -235776 -202657 -303116
9553 -303116 -78306 -275463 -205246 249801 -198688 135021 -374175 -46314 -17541 -371485
9543 -371485 -323564 -20362 79816 332865 -83584 84159 -158739 144009 -2455 -33466 -79218
9532 -79218 66442 -95010 -106673 95118 -176623 26689 -90872 -197311 -133532 -108795 -89052
9521 -89052 -126442 -95597 -218012 62835 152252 52820 61366 -34176 -8416 -78846 374893 -307011
9508 -100493 -110415 -153854 -131911 -317017 -120306 -127827 -417847 -300932 16099 154036 210124
9497 210124 -330792 19622 -104398 4593 -7811 -129645 -249752 -731746 -231793 -43619 -362744
9486 -362744 -135383 120882 -235047 -55657 -184350 101778 153697 -298589 -64915 -94153
9476i4153a9201A9769a96123O9460B74314c20732c257C321h5191D8201b49792
9464c24783K2967i4362j16152A96049b90417A43755a78178k3188Q5883d9085a7721
9452b3039p889D8672f9365j59854C9939i0717q9964P5368A37691J6722B3133a58670
9439c14316Q4696A43668o4560g8108l82196c0441A1452J11896c56439N4318N9925
9428b42196i6337B52813e6372F3883b78995p6990a54178e413k31104P1431j40825
9417c05911J28112j25487C0649a73026O7549k2031j93060e2323j25615Q8520r4628
9406a84046B446b33751B18394G9371a34119k06294H2415K59108G0544d1425I4859
9394B7618a50383m9903H7838b8164I0444a76203A23552e24890A9709m306J50922
$$ plain form
9476 -94153 -19201 19769 -196123 -126663 274314 -320732 -3257 3321 -85191 48201 -249792
9464 -324783 -301816 -94362 -210514 196049 -290417 143755 -178178 -201366 -115483 -49085 -17721
9452 -23039 -30928 48672 -69365 -229219 39939 -90717 -180681 -105313 137691 154413 23133 -158670
9439 -314316 -229620 143668 79108 -78108 -460304 -30441 11452 123348 -356439 -302121 -242196
9428 -242196 -96337 252813 -56372 63883 -278995 -355985 -154178 -5413 -236517 -165086 -305911
9417 -305911 -177799 -303286 30649 -173026 -105477 -127508 -320568 -52323 -177938 -89418 -184046
9406 -184046 2446 -233751 218394 79371 -134119 -340413 82415 341523 70544 -41425 94859
9394 27618 -150383 -200286 87838 -28164 90444 -176203 123552 -524890 19709 15403 166325
9383A66325h4706m6674k15992A79417G8499K6105E815a14436d0960Q470A66544
9371d1888B0473P3710P395m2330R809g48j5701j5288A93893I4870h8573j44585
9359b33158A46431b58876h0159E5594g6505k0113L6517A94548A5389a80923B5779
9347a22318e6168E0349c52355J73788h2039L1277j77443D9349c63277D7858b46702
9335A84135A0607d08303J66923g1944K7541H999e4194j30502J0518A23529g3040
9323A58042b6282l12678A38589L5280f6294A82181b56333D1258B582a31643j31271
9312b62914L1433f702j12907q1782A54856b87137Q9414P9041k37018N26J58134
9301a97040j93991F7161a64239M2163H0877i0017p1006c507C8344b16471B08199
$$ plain form
9383 166325 -84706 -131380 -347372 179417 78499 104604 5815 -114436 -40960 -32490 166544
9371 -41888 20473 94183 101578 59248 69057 -748 -16449 -31737 193893 94870 -88573 -233158
9359 -233158 146431 -258876 -80159 55594 -76505 -96618 -60101 194548 15389 -180923 25779
9347 -122318 -56168 50349 -352355 -178567 -82039 -50762 -228205 49349 -363277 47858 -246702
9335 184135 10607 -408303 -241380 -71944 -44403 8999 -54194 -184696 -174178 123529 -73040
9323 158042 -26282 -338960 138589 173869 -66294 182181 -256333 41258 2582 -131643 -262914
9312 -262914 -231481 -6702 -119609 -201391 154856 -287137 -197723 -118682 -355700 -355174 -197040
9301 -197040 -391031 67161 -164239 -122076 80877 -90017 -161023 -3507 38344 -216471 208199
9289B59550b62260L354a2953B20407C5009a26595j94377R9372H5432J33704q4387
9278A34749e1689q458m71350H6347L6180a57037H5655a75582h0106H2154P6691
9267A58845a9709B41461c07978H1644K54810d69636a55302n5433A62232b88181
9256c8656j85263f1392l22082A09024B5017P5462k6685B5283a90618L646B04379
9244A52412b18299O6999G5929O531R8658d81915B56417C9846h3488j2713B4130
9232b04526F2865K79928b67642h7495A76449B2062b4536A27636a13770C9374b65397
9220b08749j2848A3909g3332A92130q1598L601e45408c9965k44263O540h8554
9208a5718j73032E8597J16072G6471L6623a46111j79840c3737l02418A2842a70358
$$ plain form
9289 259550 -262260 -258906 -12953 220407 35009 -126595 -320972 -221600 85432 219136 134749
9278 134749 -51689 -60147 -531497 86347 122527 -157037 85655 -175582 -80106 82154 158845
9267 158845 -19709 241461 -307978 81644 336454 -469636 -155302 -210735 162232 -288181
9256 -38656 -223919 -61392 -383474 109024 25017 100479 73794 25283 -190618 -186972 204379
9244 152412 -218299 -151300 75929 82460 181118 -481915 256417 39846 -83488 -96201 24130
9232 -204526 62865 342793 -267642 -87495 176449 22062 -24536 127636 -113770 39374 -265397
9220 -208749 -221597 13909 -73332 192130 110532 114133 -545408 -39965 -284228 -277688 -88554
9208 -15718 -188750 58597 174669 76471 113094 -146111 -325951 -33737 -336155 12842 -170358
9196f0044k89816F6523a23553A18269g8807J6480k03034B14572b73486g9087j10528
9185a89615I3965g3314j57552O2478j907H065J0252a59665f1706j0473k68547
9174c40726I5663B0334e1125j5352p1096F2100J52378E317J02898k5844a7681
9162B5990L63309h0313D8671b02564d6258C5933a19433B12723O6448a85200e7822
9150a02285E7229J05130E6559a8347C22552c3306r9041j23965P7899j54284C22642
9138B777g3179B5692d5910j79261F5287b01867i0656p2339B73628a35114n8003
9127a93117A22506B5509l602f0644j83457h3887A34263c0665k20664B69304b95855
9115C8102b14858d1983m9359A17883e0603B0065J45030c63252J77470A49668a22483
$$ plain form
9196 -60044 -349860 66523 -123553 118269 -78807 -62327 -265361 214572 -273486 -79087 -189615
9185 -189615 93965 -73314 -230866 -168388 -170295 8065 18317 -159665 -61706 -72179 -340726
9174 -340726 95663 20334 -51125 -66477 -137573 62100 214478 5317 108215 82371 -17681
9162 25990 389299 -80313 48671 -202564 -46258 35933 -119433 212723 279171 -185200 -57822
9150 -102285 57229 162359 56559 -18347 322552 -33306 -132347 -256312 -178413 -332697 322642
9138 2777 -73179 25692 -45910 -225171 65287 -201867 -90656 -162995 273628 -135114 -193117
9127 -193117 122506 25509 21907 -60644 -244101 -83887 134263 -30665 -251329 269304 -295855
9115 38102 -214858 -41983 -91342 117883 -50603 20065 165095 -363252 -185782 149668 -122483
9103f843H2421J0133N0289g2177k29914K5732B26086k0799b87488J09995d9242
9091i2288B05961A2057a36445r6200k3577A76463a35455a8809j12805f4339A7801
9079b04418D8151a35670b7286k21919B06003f2339j73353N5617F0312b05449G5005
9067a55899I4183b42807f3499B45727E3218N7524A7961b49331B6714M9933A1491
9055A8533a78309f926K209j90799B39761E257J29219g4486D21621G6806b87055
9043C9574h6094B7949b03952K5289a8766G7165B4663h4769E2590e3281c378p6287
9031g9665l620p9214k32778n0615B89708h1377n7210F7240b50913d0967k2222
9020f3189A858J80066b59514H824f3122k59160J50945N5458o7777A161K76825
$$ plain form
9103 -6843 82421 92554 142843 -72177 -302091 -276359 226086 205287 -287488 -177493 -49242
9091 -92288 205961 12057 -136445 -232645 -256222 176463 -135455 -18809 -131614 -64339 17801
9079 -204418 48151 -135670 -27286 -249205 206003 -62339 -235692 -180075 60312 -205449 75005
9067 -155899 94183 -242807 -63499 245727 53218 110742 17961 -249331 26714 76647 11491
9055 18533 -178309 -6926 -4717 -195516 239761 5257 134476 -74486 421621 76806 -287055
9043 39574 -86094 27949 -203952 -178663 -18766 77165 24663 -84769 52590 -53281 -3378 -79665
9031 -79665 -83285 -162499 -395277 -445892 289708 -81377 -138587 67240 -250913 -40967 -63189
9020 -63189 1858 181924 -259514 8824 -63122 -322282 -171337 -115879 -183656 1161 277986
9009B77986c60873A35909N2478b46032j29113M7554f7594k42089c8816C3645a84396
8997A09573a82203k24749g2703n8057B8655a93311B1191q69M2460b07831a02319
8985A11919C7220J17404A9725J4496j5238a31457b7189r5640J2070A67820a73786
8973c8385A21941a96749h0836j32863G4554h1109A74344J9553a01135Q4B12514
8961I0499L06190c41390Q5302A50186P8306g1755J6431k44676J49231j66500g5820
8949b12699A163O0391J74088J46833F2046K00618a49287F5579d51697D0010d0832
8937g0504k3905A77828C8281i2571j78835J18743A52005h042B54934b99078B44907
8925B99585j22624N13001J174468M218180J457454B779484F11843j11429a8065
$$ plain form
9009 277986 -360873 135909 188387 -246032 -375145 -327591 -67594 -309683 -38816 33645 -184396
8997 109573 -182203 -406952 -72703 -130760 28655 -193311 21191 20322 62782 -207831 -102319
8985 111919 37220 154624 19725 34221 18983 -131457 -27189 -122829 -110759 167820 -173786
8973 -38385 121941 -196749 -80836 -213699 74554 -81109 174344 193897 -101135 -101051 212514
8961 90499 396689 -341390 -256088 150186 228492 -71755 -55324 -300000 -150769 -317269 -75820
8949 -212699 1163 61554 235642 382475 62046 262664 -149287 65579 -451697 40010 -40832
8937 -70504 -94409 177828 38281 -92571 -271406 -152663 152005 -8042 254934 -299078 244907
8925 299585 176961 689962 1864430 6082610 7540064 2779484 611843 500414 -18065
8915b39978e5010j81015M0593i114G6565c47749f0393F54790d4676A22635a73140
8903D3456J171c12277b3518A8832J23209P6090o1445J9040n9749D3280p59K34620
8891B77141G9729b44419B16557a16622n8560e0783k48394M3990b8867j21542J9469
8880a30940k26749A29916m3928a51172O7880l1832k23987a5799A20219g8809D33508
8868a3663j22957f431j34672B02704a36976L4179l08049J49867B04532a5940A67791
$$ plain form
8915 -239978 -55010 -236025 -195432 -9114 76565 -347749 -60393 654790 -44676 122635 -173140
8903 43456 44627 -312277 -23518 18832 142041 218131 156686 175726 115977 43280 42521 277141
8891 277141 79729 -244419 216557 -116622 -175182 -50783 -299177 -255187 -28867 -150409 -130940
8880 -130940 -357689 129916 85988 -151172 -83292 -115124 -339111 -15799 120219 -78809 433508
8868 -13663 -136620 -6431 -141103 202704 -136976 -102797 -410846 -260979 204532 -15940 167791
$$ [...]
##END NTUPLES=NMR SPECTRUM
##END=
