
##TITLE=AC1340_BRARH12161_6528807_sgsL3tRXkp
##JCAMPDX= 6.0         $$ Bruker NMR JCAMP-DX V2.0
##DATA TYPE= NMR SPECTRUM
##DATA CLASS= NTUPLES
##ORIGIN= BRUKER
##OWNER= Administrator
$$ 1.72 TOPSPIN		Version 2.1
$$ 2012-12-12 02:38:31.606 -0500  Administrator@X
$$ Compression mode = diff/dup
##.OBSERVE FREQUENCY= 400.02188249412
##.OBSERVE NUCLEUS= ^1H
##.ACQUISITION MODE= SIMULTANEOUS (DQD)
##.ACQUISITION SCHEME= undefined
##.AVERAGES= 64
##.DIGITISER RES= 22
##SPECTROMETER/DATA SYSTEM= spect
##.PULSE SEQUENCE= noesygpps1d.comp
##.SOLVENT NAME= COFFEE_meoh
##.SHIFT REFERENCE= INTERNAL, COFFEE_meoh, 1, 14.96099
##AUDIT TRAIL= $$ (NUMBER, WHEN, WHO, WHERE, PROCESS, VERSION, WHAT)
$$ ##TITLE= Audit trail, TOPSPIN		Version 2.1
$$ ##JCAMPDX= 5.01
$$ ##ORIGIN= Bruker BioSpin GmbH
$$ ##OWNER= Administrator
$$ $$ E:\/data/COFFEE/nmr/AC1340_BRARH12161_6528807_sgsL3tRXkp/22/pdata/1/auditp.txt
$$ ##AUDIT TRAIL=  $$ (NUMBER, WHEN, WHO, WHERE, PROCESS, VERSION, WHAT)
(   1,<2012-12-12 02:38:25.465 -0500>,<Administrator>,<X>,<go>,<TOPSPIN 2.1>,
      <created by zg
	started at 2012-12-12 02:26:54.528 -0500,
	POWCHK enabled, PULCHK disabled,
       configuration hash MD5:
       86 BA 57 50 F2 9D 5C 9B 26 00 A9 28 5F 66 2E 89
       data hash MD5: 64K
       4D 39 65 90 43 8B A8 44 B7 24 C1 6F 07 C5 52 75>)
(   2,<2012-12-12 02:38:28.668 -0500>,<Administrator>,<X>,<proc1d>,<TOPSPIN 2.1>,
      <Start of raw data processing
       efp LB = 0.3 FT_mod = 6 PKNL = 1 PHC0 = 0 PHC1 = 0 SI = 128K 
       data hash MD5: 128K
       87 44 DF 09 2D B1 31 B2 21 D1 AC A1 81 C6 88 2D>)
(   3,<2012-12-12 02:38:29.762 -0500>,<Administrator>,<X>,<proc1d>,<TOPSPIN 2.1>,
      <pk PHC0 = -81.11206 PHC1 = 0 
       data hash MD5: 128K
       3E 94 78 57 48 C4 B7 B9 16 1A 66 9C 39 B5 C3 25>)
(   4,<2012-12-12 02:38:30.512 -0500>,<Administrator>,<X>,<proc1d>,<TOPSPIN 2.1>,
      <abs ABSG = 1 
       data hash MD5: 128K
       7D A6 87 88 C2 42 4C C0 CC 88 A9 E6 D2 B8 52 1E>)
(   5,<2012-12-12 02:38:30.684 -0500>,<Administrator>,<X>,<proc1d>,<TOPSPIN 2.1>,
      <abs ABSG = 2 
       data hash MD5: 128K
       A5 E3 DF 9D 75 E4 AF 49 6D 32 42 1C F9 53 CE CD>)
(   6,<2012-12-12 02:38:30.856 -0500>,<Administrator>,<X>,<proc1d>,<TOPSPIN 2.1>,
      <abs ABSG = 3 
       data hash MD5: 128K
       9E EF 3D 79 D0 41 DF 0D 6E B1 80 FC 56 F0 22 BA>)
(   7,<2012-12-12 02:38:31.059 -0500>,<Administrator>,<X>,<proc1d>,<TOPSPIN 2.1>,
      <abs ABSG = 4 
       data hash MD5: 128K
       97 65 C9 A8 39 77 2A B2 D2 E6 62 7D 26 F0 48 3F>)
(   8,<2012-12-12 02:38:31.231 -0500>,<Administrator>,<X>,<proc1d>,<TOPSPIN 2.1>,
      <abs ABSG = 5 
       data hash MD5: 128K
       A9 C7 1E 0D EE 2B 67 7A 15 F4 81 32 D2 E8 FC 6E>)
$$ ##END=
$$ 
$$ $$ hash MD5
$$ $$ 69 4B AB F2 61 60 31 F0 53 73 4F ED 3A F5 27 BD
##$RELAX= 
##$RELAX= 
##$RELAX= 
##$RELAX= 
##$RELAX= 
##$RELAX= 
##$RELAX= 
##$RELAX= 
##$RELAX= 
$$ Bruker specific parameters
$$ --------------------------
##$DU= <E:\>
##$EXPNO= 22
$$ [...]
##$TP07= 0
##$TPNAME0= <>
##$TPNAME1= <>
##$TPNAME2= <>
##$TPNAME3= <>
##$TPNAME4= <>
##$TPNAME5= <>
##$TPNAME6= <>
##$TPNAME7= <>
##$TPOAL= (0..7)
0.5 0.5 0.5 0.5 0.5 0.5 0.5 0.5
##$TPOFFS= (0..7)
0 0 0 0 0 0 0 0
##$TUNHIN= 0
##$TUNHOUT= 0
##$TUNXOUT= 0
##$USERA1= <user>
##$USERA2= <user>
##$USERA3= <user>
##$USERA4= <user>
##$USERA5= <user>
##$V9= 5
##$VALIST= <valist>
##$VCLIST= <CCCCCCCCCCCCCCC>
##$VD= 0
##$VDLIST= <DDDDDDDDDDDDDDD>
##$VPLIST= <PPPPPPPPPPPPPPP>
##$VTLIST= <TTTTTTTTTTTTTTT>
##$WBST= 2048
##$WBSW= 25
##$XGAIN= (0..3)
0 0 0 0
##$XL= 0
##$YL= 0
##$YMAX_a= 5802703
##$YMIN_a= -11635561
##$ZGOPTNS= <>
##$ZL1= 120
##$ZL2= 120
##$ZL3= 120
##$ZL4= 120
##$ABSF1= 14.96099
##$ABSF2= -5.597192
##$ABSG= 5
##$ABSL= 3
##$ALPHA= 0
##$AQORDER= 0
##$ASSFAC= 0
##$ASSFACI= 0
##$ASSFACX= 0
##$ASSWID= 0
##$AUNMP= <proc_prof1d_extract.lims>
##$AXLEFT= 0
##$AXNAME= <>
##$AXNUC= <1H>
##$AXRIGHT= 0
##$AXTYPE= 0
##$AXUNIT= <>
##$AZFE= 0.1
##$AZFW= 0.1
##$BCFW= 0
##$BC_mod= 0
##$BYTORDP= 0
##$COROFFS= 0
##$CY= 15
##$DATMOD= 1
##$DC= 0
##$DFILT= <>
##$DTYPP= 0
##$F1P= 0
##$F2P= 0
##$FCOR= 0.5
##$FTSIZE= 131072
##$FT_mod= 6
##$GAMMA= 0
##$GB= 0
##$INTBC= 1
##$INTSCL= 1
##$ISEN= 128
##$LB= 0.3
##$LEV0= 0
##$LPBIN= 0
##$MAXI= 10000
##$MC2= 0
##$MEAN= 0
##$ME_mod= 0
##$MI= 0
##$NCOEF= 0
##$NC_proc= -2
##$NLEV= 6
##$NOISF1= 0
##$NOISF2= 0
##$NSP= 0
##$NTH_PI= 0
##$NZP= 0
##$OFFSET= 14.96099
##$PC= 1
##$PHC0= -81.11206
##$PHC1= 0
##$PH_mod= 1
##$PKNL= yes
##$PPARMOD= 0
##$PPDIAG= 0
##$PPIPTYP= 0
##$PPMPNUM= 2147483647
##$PPRESOL= 1
##$PSCAL= 4
##$PSIGN= 0
##$PYNMP= <proc.py>
##$REVERSE= no
##$SF= 400.020009642616
##$SI= 131072
##$SIGF1= 0
##$SIGF2= 0
##$SINO= 400
##$SIOLD= 131072
##$SPECTYP= <>
##$SREGLST= <1H.CDCl3>
##$SSB= 0
##$STSI= 131072
##$STSR= 0
##$SW_p= 8223.68421052631
##$SYMM= 0
##$S_DEV= 0
##$TDeff= 65536
##$TDoff= 0
##$TI= <>
##$TILT= no
##$TM1= 0
##$TM2= 0
##$TOPLEV= 0
##$USERP1= <user>
##$USERP2= <user>
##$USERP3= <user>
##$USERP4= <user>
##$USERP5= <user>
##$WDW= 1
##$XDIM= 131072
##$YMAX_p= 407285551
##$YMIN_p= -11564
##$CURPLOT= <Network HP LaserJet P1505>
##$CURPRIN= <$Network HP LaserJet P1505>
##$DFORMAT= <normdp>
##$LAYOUT= <+/1D_H.xwp>
##$LFORMAT= <normlp>
##$PFORMAT= <normpl>
##$SURQMSG= 1
$$ End of Bruker specific parameters
$$ ---------------------------------
##NTUPLES= NMR SPECTRUM
##VAR_NAME=  FREQUENCY,     SPECTRUM/REAL,   SPECTRUM/IMAG
##SYMBOL=    X,             R,               I
##VAR_TYPE=  INDEPENDENT,   DEPENDENT,       DEPENDENT
##VAR_FORM=  AFFN,          ASDF,            ASDF
##VAR_DIM=   131072,        131072,          131072
##UNITS=     HZ,            ARBITRARY UNITS, ARBITRARY UNITS
##FACTOR=    0.0627417313425164, 1,          1
##FIRST=     8223.62146879497, 5270,         -49247
##LAST=      0,             6451,            -48253
##MIN=       0,             -11564,          0
##MAX=       8223.62146879497, 407285551,    0
$$ Real data points
##PAGE= N=1
##DATA TABLE= (X++(R..R)), XYDATA
$$ [...]
63907B770006j76724j78526j77216j73133j66384j57569j47465j36402j24551
$$ 2770006 2593282 2414756 2237540 2064407 1898023 1740454 1592989 1456587 1332036
63898A332036j12363j00199q7948p5703o4465n5391m8495m2741l7331l2293k7915
$$ 1332036 1219673 1119474 1031526 955823 891358 835967 787472 744731 707400 675107 647192
63887F47192k4252k1327j9255j7892j6738j5331j3644j2032j0918j0457j0283
$$ 647192 622940 601613 582358 564466 547728 532397 518753 506721 495803 485346 475063
63876D75063r723q384o446m373k612j560j307j204l27J282K482K698K951M413
$$ 475063 465340 456956 450510 446137 443525 441965 440658 439454 439127 440409 442891 445589 448540 452953
63862D52953O588Q060Q714R868J2244J5042J7364J9372K1553K3770K5731K7708
$$ 452953 459541 467601 476315 486183 498427 513469 530833 550205 571758 595528 621259 648967
63850F48967L0145L2994L5981L9064M2139M4722M6465M7689M8871M9887N0239
$$ 648967 679112 712106 748087 787151 829290 874012 920477 968166 1017037 1066924 1117163
63839A117163M9765M8663M6968M4486M1220L7373L3027K8056K2362J5941Q790
$$ 1117163 1166928 1215591 1262559 1307045 1348265 1385638 1418665 1446721 1469083 1485024 1493814
63828A493814J075o715j4011k0587k6574l2129l7244m1763m5428m8040m9748n0995
$$ 1493814 1494889 1488174 1474163 1453576 1427002 1394873 1357629 1315866 1270438 1222398 1172650 1121655
63816A121655n1967n2299n1605n0106m8373m6552m4244m1221l7852l4699l1970
$$ 1121655 1069688 1017389 965784 915678 867305 820753 776509 735288 697436 662737 630767
63805F30767k9541k7312k5285k3371k1372j9245j7259j5721j4598j3477j2022
$$ 630767 601226 573914 548629 525258 503886 484641 467382 451661 437063 423586 411564
63794D11564j0387r044q241p760p235o562n894n346m856m314l732l210k752k150
$$ 411564 401177 392133 383892 376132 368897 362335 356441 351095 346239 341925 338193 334983 332231 330081
63780C30081j219j44N16L51m63j472k502l640m745n407n581n716o025n964m918
$$ 330081 328862 328718 329234 329585 329122 327650 325148 321508 316763 311356 305775 300059 294034 288070 283152
63765B83152l256k188k458l551m290m011k945j780j045q81j068j252j249j211
$$ 283152 279896 277708 275250 271699 267409 263398 260453 258673 257628 256747 255679 254427 253178 251967
63751B51967j394j785k073k038j710j144k25R47J765J599O19k57l13L49J168J734
$$ 251967 250573 248788 246715 244677 242967 241823 241598 242545 244310 245909 246528 246271 245958 246307 247475 249209
63735B49209J800J318P30Q48J880K935L091K634K545K977L136K795K852L938N232
$$ 249209 251009 252327 253057 253905 255785 258720 261811 264445 266990 269967 273103 275898 278750 282688 287920
63720B87920N437M461L408L131L447L732L645L201K554J843J038n5j430k599l057
$$ 287920 293357 297818 301226 304357 307804 311536 315181 318382 320936 322779 323817 323762 322332 319733 316676
63705C16676k941k844k952k845k281j692j596j839j817j233l09O64J585K379K871
$$ 316676 313735 310891 307939 305094 302813 301121 299525 297686 295869 294636 294327 294991 296576 298955 301826
63690C01826K954K715K333K023K030K413K776K509J482K52o01j085j431j439p28
$$ 301826 304780 307495 309828 311851 313881 316294 319070 321579 323061 323313 322712 321627 320196 318757 318029
63675C18029M67J370J652J766K025K001J293M80N87J796L261M119M158L535K481
$$ 318029 318496 319866 321518 323284 325309 327310 328603 329083 329670 331466 334727 338846 343004 346539 349020
63660C49020J393P37N06J94n57j570k507l269l887m360m741n064n047m345l202
$$ 349020 350413 351150 351656 351850 351293 349723 347216 343947 340060 335700 330959 325895 320848 316503 313301
63645C13301k400k273k218j500k07J005J675J703J183N60O51J843L493M585M834
$$ 313301 310901 308628 306410 304910 304703 305708 307383 309086 310269 310829 311480 313323 316816 321401 326235
63630C26235M692M469M134L846L966M493N099N740O666P745Q449Q731R282J0560
$$ 326235 330927 335396 339530 343376 347342 351835 356934 362674 369340 377085 385534 394265 403547 414107
63616D14107J2110J3220J3812J4312J4982J5824J6857J8125J9612K1381K3573
$$ 414107 426217 439437 453249 467561 482543 498367 515224 533349 552961 574342 597915
63605E97915K6022K8159K9563L0237L0124K8781K5947K2065J7736J3045Q003L353
$$ 597915 623937 652096 681659 711896 742020 770801 796748 818813 836549 849594 857597 860950
63593H60950K10j102j281j202j337j990l440n728q734j2484j6868k1115k4189
$$ 860950 861160 860058 858777 857575 856238 854248 850808 845080 836346 823862 806994 785879 761690
63580G61690k5797k6406k6207k4827k2366j9841j8022j6389j3977j0874q135o369
$$ 761690 735893 709487 683280 658453 636087 616246 598224 581835 567858 556984 548849 542480
63568E42480n048l284q43J644L232L469K907K661L279M223M755M920N320O131
$$ 542480 537432 534148 533305 534949 538181 541650 544557 547218 550497 554720 559475 564395 569715 575846
63554E75846O938P509Q215R656J2064J5137J8250K1034K3838K7409L1907L6698
$$ 575846 582784 590293 598508 608164 620228 635365 653615 674649 698487 725896 757803 794501
63542G94501M1192M5117M7392M5727L8570K7190J4766L600n746j2899j6924j7522
$$ 794501 835693 880810 928202 973929 1012499 1039689 1054455 1058055 1052309 1039410 1022486 1004964
63530A004964j5723j2793r450o606n681p288j0499j4237j8569k3713k8652l1946
$$ 1004964 989241 976448 966998 960392 954711 947423 936924 922687 904118 880405 851753 819807
63518H19807l3478l4234l4600l4028l2293l0046k7923k5967k3984k1887j9533
$$ 819807 786329 752095 717495 683467 651174 621128 593205 567238 543254 521367 501834
63507E01834j6849j4199j2094j0609r510q781q395p781o301m270k804k513l009
$$ 501834 484985 470786 458692 448083 438573 429792 421397 413616 407315 403045 400241 397728 394719
63494C94719l668m139m129l468k587k205k280j972r47O4L73L43P55J679K540K967
$$ 394719 391051 386912 382783 379315 376728 374523 372243 370271 369324 369388 369761 370104 370859 372538 375078 378045
63478C78045L102L215L423L583L346K546J688J527K062K381J819P44j61q20j528
$$ 378045 381147 384362 387785 391368 394714 397260 398948 400475 402537 404918 406737 407481 407320 406500 404972
63463D04972k233k669k882l094l226l048k651k314j999j492q87n24m22j93M25
$$ 404972 402739 400070 397188 394094 390868 387820 385169 382855 380856 379364 378477 377953 377531 377338 377763
63448C77763J295K123K758L231L752M608N908P442Q952J0419J1871J3161J4236
$$ 377763 379058 381181 383939 387170 390922 395530 401438 408880 417832 428251 440122 453283 467519
63435D67519J5555J7834K1360K5854L0947L6360M1363M4361M3524L8111K9188
$$ 467519 483074 500908 522268 548122 579069 615429 656792 701153 744677 782788 811976
63424H11976J8988R493J656m163p509p933n666j628L319Q785J4488J9861K4352
$$ 811976 830964 840457 842113 837950 830441 822508 816842 815214 818533 827318 841806 861667 886019
63411H86019K7729K9842L0296K8708K5158K0173J4459Q771L841M8k670m444n236
$$ 886019 913748 943590 973886 1002594 1027752 1047925 1062384 1071155 1074996 1075044 1072374 1067930 1062694
63398A062694n288n529p111j0440j4932j9769k4653k9666l4523l8213l9669l8839
$$ 1062694 1057406 1051877 1044766 1034326 1019394 999625 974972 945306 910783 872570 832901 794062
63386G94062l6876l4955l3113l0627k7310k3830k0738j7859j4895j2055r668p661
$$ 794062 757186 722231 689118 658491 631181 607351 586613 568754 553859 541804 532136 524475
63374E24475n790m089k694j513l60R29K679N247Q365J1088J2837J4053J5415J6948
$$ 524475 518685 514596 511902 510389 510029 510958 513637 518884 527249 538337 551174 565227 580642 597590
63360E97590J8345J9702K1246K2786K4181K5950K8602L1569L3621L4210L3687
$$ 597590 615935 635637 656883 679669 703850 729800 758402 789971 823592 857802 891489
63349H91489L2373L0218K7260K3599J8988J3360P688L427R07q43k543l923m736
$$ 891489 923862 954080 981340 1004939 1023927 1037287 1044975 1048402 1049309 1048466 1045923 1042000 1037264
63336A037264n542o987r162j2127j6289k1527k6692l0670l3483l5592l6732l6210
$$ 1037264 1031722 1024735 1015573 1003446 987157 965630 938938 908268 874785 839193 802461 766251
63324G66251l4072l1071k7597k3415j8454j3151p912k843J711M732M922J554m906
$$ 766251 732179 701108 673511 650096 631642 618491 610579 607736 609447 614179 619101 620655 615749
63311F15749j2794j9940k4806k7114k7369k6044k3451k0165j6972j4338j2189
$$ 615749 602955 583015 558209 531095 503726 477682 454231 434066 417094 402756 390567
63300C90567j0330q807p758p085o415n382m011k837k523l199m238m824m664m026
$$ 390567 380237 371430 363672 356587 350172 344790 340779 337942 335419 332220 327982 323158 318494 314468
63286C14468l319k818k648k687k526j814o93K50N48J74n58j285j680j511p83K06
$$ 314468 311149 308331 305683 302996 300470 298656 297963 298213 298761 298935 298377 297092 295412 293901 293118 293324
63270B93324R96J206P65Pn26m86P1Q21J372J365O50m28j135r98k45N43J120J581
$$ 293324 294320 295526 296291 296298 295772 295286 295357 296178 297550 298915 299565 299137 298002 297004 296759 297302 298422 300003
63252C00003J883J716J000J70k04j7L10K87j34m59p7J072K288K735K303J700J632
$$ 300003 301886 303602 304602 304772 304568 304551 304861 305148 305014 304555 304478 305550 307838 310573 312876 314576 316208
63235C16208K037K244J783Q83K01J41N38R45J176J476K143L044L652L558K883
$$ 316208 318245 320489 322272 323155 323356 323497 324035 324980 326156 327632 329775 332819 336471 340029 342912
63220C42912K141J737J655J615J458J315J415J843K599L655M795N497N282M282
$$ 342912 345053 346790 348445 350060 351518 352833 354248 356091 358690 362345 367140 372637 377919 382201
63206C82201L180K527K327K389K748L328L590L011J943J448K073L144L605L361
$$ 382201 385381 387908 390235 392624 395372 398700 402290 405301 407244 408692 410765 413909 417514 420875
63192D20875L420M649O730Q509R312R669J0641J2552J4719J6415J7737J9206K0806
$$ 420875 424295 428944 435674 444183 453495 463164 473805 486357 501076 517491 535228 554434 575240
63179E75240K1875K2026K1713K1642K1892K1900K1163J9732J8155J7078J6762
$$ 575240 597115 619141 640854 662496 684388 706288 727451 747183 765338 782416 799178
63168G99178J6780J6291J4798J2597J0303Q070N570K546r27m703q735j2907j6991
$$ 799178 815958 832249 847047 859644 869947 878017 883587 886133 885206 880503 871768 858861 841870
63155H41870k0871k4475k7445k9231k9715k9399k8804k7900k6401k4328k1979
$$ 841870 820999 796524 769079 739848 710133 680734 651930 624030 597629 573301 551322
63144E51322j9598j7391j5645j4413j3247j1622r602p678o110m832l837l147k487
$$ 551322 531724 514333 498688 484275 471028 459406 449804 442126 436016 431184 427347 424200 421713
63131D21713j582p72o46r92q13L47J802K815L561M383M844M413L677L773M790
$$ 421713 420131 419359 418713 417721 416908 417255 419057 421872 425433 429816 434660 439073 442750 446523 451313
63116D51313N686N871N878O137O139N387M490M452N264N998O097N844N547N039
$$ 451313 456999 462870 468748 474885 481024 486411 490901 495353 500617 506615 512712 518556 524103 529142
63102E29142M250L573L290L056K451J759J612K056K557K933L588M632N487N704
$$ 529142 533392 536965 540255 543311 545762 547521 549133 551189 553746 556679 560267 564899 570386 576090
63088E76090N631N632N193L660J540N3n85j435l207n287o852p913q669q700p747
$$ 576090 581721 587353 592546 596206 597746 597799 597214 595779 592572 587285 580433 572520 563851 555151 547404
63073E47404o628o335o573o259n214m296l875l329k284j310r53q64m38K76Q93
$$ 547404 540776 534441 527868 521609 516395 512099 508224 504895 502611 501301 500348 499484 499046 499322 500215
63058E00215J423K127K951L552L818M024M557N613O923P778P720P240P363Q369
$$ 500215 501638 503765 506716 510268 514086 518110 522667 528280 535203 542981 550701 557941 565304 573673
63044E73673R462R891R809R674R429Q820Q120P883Q234Q871R555J0146J0359J0053
$$ 573673 583135 593026 602835 612509 621938 630758 638878 646761 654995 663866 673421 683567 693926 703979
63030G03979R539R076Q254O536M337K866K685K973K577J330Qq18j452k518m025
$$ 703979 713518 722594 730848 737384 741721 744587 747272 750245 752822 754152 754160 753342 751890 749372 745347
63015G45347n143m987l558j645Q6J663L358N191P185R716J3071J6782J9974K2390
$$ 745347 740204 735217 731659 730014 730100 731763 735121 740312 747497 757213 770284 787066 807040 829430
63001H29430K4632K7268L0166L2807L4884L6343L7192L7515L7500L7283L6834
$$ 829430 854062 881330 911496 944303 979187 1015530 1052722 1090237 1127737 1165020 1201854
62990A201854L6115L5196L4140L2978L1817L0749K9542K7740K5145K1952J8153
$$ 1201854 1237969 1273165 1307305 1340283 1372100 1402849 1432391 1460131 1485276 1507228 1525381
62979A525381J3214O722q29q368j5340k2085k9095l6189m2655m7807n1251n2783
$$ 1525381 1538595 1545317 1544488 1536120 1520780 1498695 1469600 1433411 1390756 1342949 1291698 1238915
62967A238915n2492n0928m8917m7010m5170m2964m0003l6325l2423k8941k6125
$$ 1238915 1186423 1135495 1086578 1039568 994398 951434 911431 875106 842683 813742 787617
62956G87617k3715k1465j9621j8551j8007j7271j6107j5111j4856j5106j5242
$$ 787617 763902 742437 722816 704265 686258 668987 652880 637769 622913 607807 592565
62945E92565j5100j4913j4675j4089j3013j1605j0114q932q490q639q458p371
$$ 592565 577465 562552 547877 533788 520775 509170 499056 490124 481634 472995 464537 457166
62933D57166o152n915o301n890m500l695m419n416m995l371k012j413r21m36o60
$$ 457166 451014 445099 438798 432908 428408 424713 420294 414878 409883 406512 404500 403087 402166 401730 401070
62918D01070j583k074j507o40l54m23k46K4j38n91o95k75K84P40J114J279J059
$$ 401070 399487 397413 395906 395266 394912 394489 394243 394267 394129 393538 392843 392568 392852 393592 394706 395985 397044
62901C97044P50Q98J446J708J443J363K214L675M767N098N174N418N514N014M107
$$ 397044 397794 398692 400138 401846 403289 404652 406866 410541 415308 420406 425580 430998 436512 441526 445633
62886D45633L372K963K554J952J278M96o34j922k645k458k039k271l065l551l321
$$ 445633 449005 451968 454522 456474 457752 458248 457614 455692 453047 450589 448550 446279 443214 439663 436342
62871D36342k843k708l031l651m373m782m402l396k624k652l039l015k525k035
$$ 436342 433499 430791 427760 424109 419736 414954 410552 407156 404532 401880 398841 395826 393301 391266
62857C91266j671j177o68o69j266j830j867j601j386j034k77M93O42L27L32Q20
$$ 391266 389595 388418 387750 387081 385815 383985 382118 380517 379131 378097 377820 378313 378955 379282 379614 380434
62841C80434R76K94m17oJ403K406J973N53n70n97K71J249J691J582J458J704J957
$$ 380434 381410 381704 381287 381281 382684 385090 387063 387616 387046 386449 386720 387969 389660 391242 392700 394404 396361
62824C96361J537M88k74q7N77P60K48l09m10l00n08j090j615j729j516j297j216
$$ 396361 397898 398386 398112 398025 398602 399362 399610 399301 398891 398591 398083 396993 395378 393649 392133 390836 389620
62807C89620j156j009q42o79l38K67Q27J016J039J324J708J583R76P44J329J900
$$ 389620 388464 387455 386613 385934 385596 385863 386690 387706 388745 390069 391777 393360 394336 395080 396409 398309
62791C98309J427R1j084j611j706j370l02J162K058K089K147L042M311M963N012
$$ 398309 399736 399827 398743 397132 395426 394056 393754 394916 396974 399063 401210 404252 408563 413526 418538
62776D18538N487P007Q922J0054R920R052Q238P656O837N455L926K935K467J752
$$ 418538 424025 431032 439954 450008 459928 468980 477218 484874 491711 497166 501092 504027 506494 508246
62762E08246L40j231k193k578l025l710m182m262m548n606p104q147q329p945
$$ 508246 508586 507355 505162 502584 499559 495849 491667 487405 482857 477251 470147 462000 453671 445726
62748D45726p290o252m887l860l862m712n475n464m795l919l072k335j837j594
$$ 445726 438436 432184 427297 423437 419575 414863 409388 403924 399129 395210 392138 389803 387966 386372
62734C86372j393j152j116j395j469o93P66J972K297K094K123K678L480M183M623
$$ 386372 384979 383827 382711 381316 379847 379154 379920 381892 384189 386283 388406 391084 394564 398747 403370
62719D03370M737M576M472M867N903P224Q367R205R951J0783J1650J2571J3856
$$ 403370 408107 412683 417155 422022 427925 435149 443516 452721 462672 473455 485105 497676 511532
62706E11532J5830J8376K1007K3456K5944K8765L1779L4536L6845L9097M1947
$$ 511532 527362 545738 566745 590201 616145 644910 676689 711225 748070 787167 829114
62695H29114M5684M9861N3619N6502N8780O0865O2574O3290O2706O0811N7288
$$ 829114 874798 924659 978278 1034780 1093560 1154425 1216999 1280289 1342995 1403806 1461094
62684A461094N1521M3501L4018K3671J2262k96j3065k4751l4935m3947n1784n7900
$$ 1461094 1512615 1556116 1590134 1613805 1626067 1625771 1612706 1587955 1553020 1509073 1457289 1399389
62672A399389o2020o4434o5438o5086o3570o1254n8264n4553n0432m6509m2860
$$ 1399389 1337369 1272935 1207497 1142411 1078841 1017587 959323 904770 854338 807829 764969
62661G64969l8897l4276k9605k5920k3695k2496k1414j9693j7271j4759j2754
$$ 764969 726072 691796 662191 636271 612576 590080 568666 548973 531702 516943 504189
62650E04189j1204r746q443p714p594p602p457p324p220o773n780m595l645k904
$$ 504189 492985 483239 474796 467082 459488 451886 444429 437105 429885 423112 417332 412737 409092 406188
62636D06188k067r61L20J323J329R2j478k000j265m99p54j693k349k368j955j268
$$ 406188 404121 403160 403480 404803 406132 406224 404746 402746 401481 400982 400228 398535 396186 393818 391863 390595
62620C90595n72m67j197k063k240j925j862k075j937j402j158j429j483p42L47
$$ 390595 390023 389556 388359 386296 384056 382131 380269 378194 376257 374855 373697 372268 370785 370043 370390
62605C70390J010J178J291J438J321R44Q54J448K366K775K206J016L1j39O03J917
$$ 370390 371400 372578 373869 375307 376628 377572 378426 379874 382240 385015 387221 388237 388268 388129 388732 390649
62589C90649L202L770L319K368J941K473L277L343K480J418Q64Q49R19O32k52
$$ 390649 393851 397621 400940 403308 405249 407722 410999 414342 416822 418240 419104 419953 420872 421504 421252
62574D21252j712l379m592m795m038l050k723l315m234m653m334l661l029k526
$$ 421252 419540 416161 411569 406774 402736 399686 396963 393648 389414 384761 380427 376766 373737 371211
62560C71211k208k194k314k078j319n19j77j25J43O72J030R21M42j86p49r63o88
$$ 371211 369003 366809 364495 362417 361098 360579 360402 360277 360420 361092 362122 363043 363485 363299 362550 361587 360899
62543C60899k31k6nL71J290K193K422K085J962K567L532M023L694L022K634K553
$$ 360899 360668 360642 360637 361008 362298 364491 366913 368998 370960 373527 377059 381082 384776 387798 390432 392985
62527C92985K433K390L067M752O828Q388R125R395R745J0680J2518J5047J7501
$$ 392985 395418 397808 400875 405627 412455 420843 429968 439363 449108 459788 472306 487353 504854
62514E04854J9343K0938K3034K5726K8444L0784L2853L4729L6123L6763L6668
$$ 504854 524197 545135 568169 593895 622339 653123 685976 720705 756828 793591 830259
62503H30259L5875L4248L1755K8602K4873K0271J4566Q097J591m474j0025j4936
$$ 830259 866134 900382 932137 960739 985612 1005883 1020449 1028546 1030137 1025663 1015638 1000702
62491A000702j8677k0617k0637j9295j7323j5109j2673j0012p159m060o55K872
$$ 1000702 982025 961408 940771 921476 904153 889044 876371 866359 859200 855140 854485 857357
62479H57357O273R530J2570J4597J4458J1997Q539N459K708o91n055r741j4184
$$ 857357 863630 873160 885730 900327 914785 926782 935321 940780 943488 942797 937742 928001 913817
62466I13817j8357k2191k5336k7818l0167l2543l4232l4481l3438l1851l0109
$$ 913817 895460 873269 847933 820115 789948 757405 723173 688692 655254 623403 593294
62455E93294k8097k5691k3005k0163j7311j4751j2674j0780q599o283m703m405
$$ 593294 565197 539506 516501 496338 479027 464276 451602 440822 432223 425940 421237 416832
62443D16832m738m490l283j901j100o40J85J339K031J836J205P12L03l82j327
$$ 416832 412094 407604 404321 402420 401320 400680 400865 402204 404235 406071 407276 407988 408291 407909 406582
62428D06582k137k523k502k304k292k684l132k925j950r84o80o59k80J46j80j073
$$ 406582 404445 401922 399420 397116 394824 392140 389008 386083 384133 383149 382469 381810 381530 381676 381496 380423
62412C80423j381o80j7m40j509j915j196j52L03J10j46l4L40N65M13P6l1L12R97
$$ 380423 379042 378362 378345 377905 376396 374481 373285 373133 373436 373546 373400 373366 373706 374271 374684 374760 374729 375041 376038
62393C76038J765K411K866L192L506L805L927L812L663L676L791L956M408N298
$$ 376038 377803 380214 383080 386272 389778 393583 397510 401322 404985 408661 412452 416408 420816 426114
62379D26114O192O480O336O657P876R233R644R016Q377Q750J0192J1847J2851
$$ 426114 432306 438786 445122 451779 459655 468888 478532 487548 495925 504675 514867 526714 539565
62366E39565J3059J3058J3477J4483J5921J7678J9786K2290K5351K9244L3952
$$ 539565 552624 565682 579159 593642 609563 627241 647027 669317 694668 723912 757864
62355G57864L8905M3418M7266N0494N2863N3942N3629N1956M8565M3073L6064
$$ 757864 796769 840187 887453 937947 990810 1044752 1098381 1150337 1198902 1241975 1278039
62344A278039K9007K2810J7003J0646L538l823j1048j8136k5164l2012l8185m2796
$$ 1278039 1307046 1329856 1346859 1357505 1361043 1357220 1346172 1328036 1302872 1270860 1232675 1189879
62332A189879m5078m5169m4010m2344m0284l7948l5813l3981l1770k8806k5931
$$ 1189879 1144801 1099632 1055622 1013278 972994 935046 899233 865252 833482 804676 778745
62321G78745k4214k3394k2250k0404j8737j7946j7693j7510j7619j8131j8198
$$ 778745 754531 731137 708887 688483 669746 651800 634107 616597 598978 580847 562649
62310E62649j6838j4361j2083j0684r609q213o704n570m695l727k883k666k858
$$ 562649 545811 531450 519367 508683 499074 490861 484157 478587 473892 470165 467282 464616 461758
62297D61758k574j442o0R64J757K533K912K537J957K082K941L756M073M115M038
$$ 461758 459184 457742 457682 458646 460403 462936 465848 468385 470342 472424 475365 479121 483194 487309 491347
62282D91347L719L364L451L821L697K928K365K465K407J418K74M06J873L400M329
$$ 491347 495066 498430 501881 505702 509399 512327 514692 517157 519564 520982 521256 521662 523535 526935 531264
62267E31264N380P199R171J0368J1017J2229J4565J7576K0722K4089K7975L2241
$$ 531264 536644 543843 553014 563382 574399 586628 601193 618769 639491 663580 691555 723796
62255G23796L6480M0607M4796M8918N2394N4735N5847N5562N3278M8504M1633
$$ 723796 760276 800883 845679 894597 946991 1001726 1057573 1113135 1166413 1214917 1256550
62244A256550L3762K5778J7883R931J816o472j4815k2976l0815l8362m5343n0908
$$ 1256550 1290312 1316090 1333973 1343904 1345720 1339248 1324433 1301457 1270642 1232280 1186937 1136029
62232A136029n4367n5963n6289n5224n2318m8187m4342m1296l7927l3290k8157
$$ 1136029 1081662 1025699 969410 914186 861868 813681 769339 728043 690116 656826 628669
62221F28669k3909k0739j7893j5084j2636j0564q572o867o083o351p079p661p774
$$ 628669 604760 584021 566128 551044 538408 527844 519272 512405 506322 499971 492892 485231 477457
62208D77457p155n808m389l615l311k693j598o62k22J45P66J305J454J585K245
$$ 477457 470302 464494 460105 456490 453179 450486 448888 448226 448004 448149 448915 450220 451674 453259 455504
62193D55504L361M358M844M944N059N523O307P124P912R012J0509J1688J1793
$$ 455504 458865 463223 468067 473011 478070 483593 489900 497024 504936 513948 524457 536145 547938
62180E47938J1147J0830J1125J1154J0246Q852P780P225P056P420Q405R614J0757
$$ 547938 559085 569915 581040 592194 602440 611292 619072 626297 633353 640773 649178 658792 669549
62167F69549J2373J5237J9314K3806K8106L2069L5507L8048L9603M0402M0375
$$ 669549 681922 697159 716473 740279 768385 800454 835961 874009 913612 954014 994389
62156I94389L8892L5329K9782K3118J6462J0571N412L66n076j0855j6699k2662
$$ 994389 1033281 1068610 1098392 1121510 1137972 1148543 1153955 1154321 1149245 1138390 1121691 1099029
62144A099029k8883l4885l9622m2376m3277m2848m1347l8783l5265l1097k6689
$$ 1099029 1070146 1035261 995639 953263 909986 867138 825791 787008 751743 720646 693957
62133F93957k2627j9572j7734j6501j4983j2923j0835r156p740o301n096m632
$$ 693957 671330 651758 634024 617523 602540 589617 578782 569626 561886 555585 550489 545857
62121E45857m858m990m214k385kK175L575M259N096P075J0250J3609J6224J8143
$$ 545857 540999 536009 531795 529410 529408 531583 535158 539417 544513 551588 561838 575447 591671 609814
62107F09814J9839K1035K0684J8142J3877R017M512R64j111j258N17L334N620
$$ 609814 629653 650688 671372 689514 703391 712408 716920 717884 716773 715515 716032 719366 724986
62094G24986N979M167J092k158n047p253q134p092m321p03L023O580R847J2839
$$ 724986 730965 735132 736224 734066 729019 721766 713632 706540 702219 701516 704539 711119 720966 733805
62080G33805J5983J9747K3786K7065K9142L0799L3069L5993L8691M0317M0602
$$ 733805 749788 769535 793321 820386 849528 880327 913396 949389 988080 1028397 1068999
62069A068999L9879L8908L8340L7929L6638L3984L0952K8940K8047K7069K5179
$$ 1068999 1108878 1147786 1186126 1224055 1260693 1294677 1325629 1354569 1382616 1409685 1434864
62058A434864K2812K0699J8694J6026J2360Q152M124O76k243m991q016j1589j5712
$$ 1434864 1457676 1478375 1497069 1513095 1525455 1533607 1537731 1538407 1536164 1531173 1523157 1511568 1495856
62045A495856k0289k5315l0681l5803l9753m2008m3012m3774m4745m5328m4686
$$ 1495856 1475567 1450252 1419571 1383768 1344015 1302007 1258995 1215221 1170476 1125148 1080462
62034A080462m2832m0625l8719l6923l4690l1870k8745k5578k2460j9490j6838
$$ 1080462 1037630 997005 958286 921363 886673 854803 826058 800480 778020 758530 741692
62023G41692j4642j2999j1951j1357j0870j0291r767r472r221q739q175p941q043
$$ 741692 727050 714051 702100 690743 679873 669582 659815 650343 641122 632383 624208 616267 608224
62010F08224p927p170n971m814l836k792j484m5J159J818K010K239L038M380N632
$$ 608224 600297 593127 587156 582342 578506 575714 574230 574185 575344 577162 579172 581411 584449 588829 594461
61995E94461O254O265N927N168L695J601m80j929k629k914l205l788m684n632
$$ 594461 600715 606980 612907 618075 621770 623371 622891 620962 618333 615419 612214 608426 603742 598110
61981E98110o349o873p481q219q673q452p639o592n444m134k838j980j781k027
$$ 598110 591761 584888 577407 569188 560515 552063 544424 537832 532388 528254 525416 523436 521655 519628
61967E19628k370k602k634k452k158j854j357l30J122K251K323J420M32K21Q91
$$ 519628 517258 514656 512022 509570 507412 505558 504201 503871 504993 507244 509567 510987 511419 511640 512531
61952E12531J760K045J707J550K247L416M142M412N268P259R445J0621J0943J1520
$$ 512531 514291 516336 518043 519593 521840 525256 529398 533810 539078 546337 555782 566403 577346 588866
61938E88866J2799J4315J5861J7736J9709K0776K0417J9286J8190J7166J5998
$$ 588866 601665 615980 631841 649577 669286 690062 710479 729765 747955 765121 781119
61927G81119J4916J3961J2397R630O304L568J501q45l910p030r353j0616j0879
$$ 781119 796035 809996 822393 832023 838327 841895 843396 842551 838641 831611 822258 811642 800763
61914H00763j0326r482q874q147o238k798J180M597P401J0023J2315J3810J4600
$$ 800763 790437 780955 772081 763934 757696 754898 756078 760675 768076 778099 790414 804224 818824
61901H18824J4978J4573J2785R968P216M741J505l152q303j2490j5259j7006j7871
$$ 818824 833802 848375 861160 871128 878344 883085 884590 881438 873135 860645 845386 828380 810509
61888H10509j7737j7035j6597j6589j6398j5669j4761j3981j3096j1978j1067
$$ 810509 792772 775737 759140 742551 726153 710484 695723 681742 668646 656668 645601
61877F45601j0724j0615j0225r606r037q350p246n995n124m525l580k139o86N66
$$ 645601 634877 624262 614037 604431 595394 587044 579798 573803 568679 564154 560574 558435 557749 558315
61863E58315K015L891N769P188Q157Q809R091R271J0167J2295J5178J7931K0243
$$ 558315 560330 564221 569990 577178 585335 594144 603235 612506 622673 634968 650146 668077 688320
61850F88320K2263K4015K5555K7394K9861L2185L3066L2193L0423K8371K5746
$$ 688320 710583 734598 760153 787547 817408 849593 882659 914852 945275 973646 999392
61839I99392K2318J8659J5217J1381O265P4n987j0932j4430j6263j6236j4701
$$ 999392 1021710 1040369 1055586 1066967 1073232 1073306 1067319 1056387 1041957 1025694 1009458 994757
61827I94757j2434r735o195j650L190P419J0788J3442J5151J5380J3967J1176
$$ 994757 982323 972588 966393 964743 967933 975352 986140 999582 1014733 1030113 1044080 1055256
61815A055256P126J712m841j1704j7980k3187k7239l0287l2727l4875l6347l6160
$$ 1055256 1062382 1064094 1059253 1047549 1029569 1006382 979143 948856 916129 881254 844907 808747
61803H08747l3906l0546k7525k5247k2970k0096j6971j4217j1960j0061q628p754
$$ 808747 774841 744295 716770 691523 668553 648457 631486 617269 605309 595248 586620 578866
61791E78866p034n896m284k649j349m96k60p50j466j444k99J282K326K610K592
$$ 578866 571832 565936 561652 559003 557654 557158 556898 556148 554682 553238 552939 554221 556547 559157 561749
61776E61749K612K650K696K858L033K897K369J775J395J168R80J008J467K136
$$ 561749 564361 567011 569707 572565 575598 578495 580864 582639 584034 585202 586182 587190 588657 590793
61762E90793K474K211J610J085P65N62M61N55P85Q67O23K40j3k14o62j233j315
$$ 590793 593267 595478 597088 598173 598938 599500 599961 600516 601301 602168 602791 603031 603018 602804 602142 600909 599594
61745E99594o24J84K41l33n19K34J284J669J244N95K80N40J449K769L860M248
$$ 599594 598970 599154 599395 599062 598543 598777 600061 601730 602974 603569 603849 604389 605838 608607 612467 616715
61729F16715M207M306M545M439L956L656L879M318M655M941N156M920M136L387
$$ 616715 620922 625228 629773 634212 638168 641824 645703 650021 654676 659617 664773 669693 673829 677216
61715F77216L197L244K865K066J393R64L14p30j634j925j956k474l620m669m884
$$ 677216 680413 683657 686522 688588 689981 690945 691259 690529 688895 686970 685014 682540 678920 674251 669367
61700F69367m313l634l308l213l119l158l508l874l793l371l155l292l309k884
$$ 669367 665054 661420 658112 654899 651780 648622 645114 641240 637447 634076 630921 627629 624320 621436
61686F21436k235j550o58L58Q23L57m16o68m27k17l6M37Q72M97o37j503j387o91
$$ 621436 619201 617651 616993 617351 618174 618531 618115 617447 617020 616803 616767 617204 618076 618573 617936 616433 615046 614355
61668F14355k18k73o92j176j332q79p0M98O54P66R62Q67L84J08N04J163J384J165
$$ 614355 614137 613864 613172 611996 610664 609785 609715 610213 610867 611633 612595 613462 613846 613954 614458 615621 617005 618170
61650F18170J105J558K363L213L899M288M453M684N121N520N627N611N770O094
$$ 618170 619275 620833 623196 626409 630308 634596 639049 643733 648854 654374 660001 665612 671382 677476
61636F77476O357O445O227N359L687J747L21m54j083j833k387k534k689l324m202
$$ 677476 683833 690278 696505 701864 705551 707298 707619 707165 706082 704249 701862 699328 696639 693315 689113
61621F89113m630m338l703l159k846k841l303m010m216l513k613k685l865n062
$$ 689113 684483 680145 676442 673283 670437 667596 664293 660283 656067 652554 649941 647256 643391 638329
61607F38329n350m990m732m784n002n498o346o993o822o093n563n345m957m411
$$ 638329 632979 627989 623257 618473 613471 607973 601627 594634 587812 581719 576156 570811 565854 561443
61593E61443m315m768n035m625l887l272k690k025j521j315j132q61p85r03p64
$$ 561443 557128 552360 547325 542700 538813 535541 532851 530826 529305 527990 526858 525997 525212 524309 523545
61578E23545l62m40j240j847j474p07n95j122j533j625j713j692j265q45j113
$$ 523545 523183 522743 521503 519656 518182 517475 516880 515758 514225 512600 510887 509195 507930 507085 505972
61563E05972j801k029j817k023k723k915k201j558j770k144j692q01o07j183j470
$$ 505972 504171 502142 500325 498302 495579 492664 490463 488905 487135 484991 483299 482498 481891 480708 479238
61548D79238r39l49n12j079j110m50N8k39r50j225q79n20o22r16r15n87k17J08
$$ 479238 478299 477950 477438 476359 475249 474799 474857 474618 473668 472443 471564 471044 470422 469506 468591 468004 467787 467895
61530D67895M47O00K42o16j577k325k779k865k506j869j369j256j433j653j803
$$ 467895 468342 468942 469184 468568 466991 464666 461887 459022 456516 454647 453278 452022 450589 448936 447133
61515D47133j944k165k372k255j589o94k65o32j410k025k198j848j017j71p0q62
$$ 447133 445189 443024 440652 438397 436808 436114 435849 435217 433807 431782 429584 427736 426719 426548 426478 425616
61499D25616j761k080k024j952j511l26R11J114K85o07r91r88n88L00J051Q44
$$ 425616 423855 421775 419751 417799 416288 415962 416873 417987 418272 417665 416674 415686 415098 415398 416449 417293
61483D17293J02J79J291K088J706J001R53J052L34q11j124k70Q95J612J887J936
$$ 417293 417395 417574 418865 420953 422659 423660 424613 425665 425999 425188 424064 423794 424689 426301 428188 430124
61467D30124J809J547J239R62Q73J115J386J070J72m40j61N29R38J195J650J902
$$ 430124 431933 433480 434719 435681 436554 437669 439055 440125 440297 439857 439696 440225 441163 442358 444008 445910
61451D45910J333L04k78k76k67l41p6L91L46k31n13j89L5k42k83O42K030K786
$$ 445910 447243 447547 447269 446993 446726 446385 446309 446700 447046 446815 446302 446113 446148 445906 445623 446265 448295 451081
61433D51081K615K100J743J529J252P90K35n0K34P39P16J18j49M40J116R98N44
$$ 451081 453696 455796 457539 459068 460320 461110 461345 461295 461529 462268 462984 463102 462953 463393 464509 465507 466051
61416D66051Q06J637J877J248P74J025J195N72j65o9M44K11q88j897k332k631
$$ 466051 466857 468494 470371 471619 472393 473418 474613 475185 475020 474951 475395 475606 474718 472821 470489 467858
61400D67858k993k917k277j896k418l307l575l017k141j239k79N49Q08L65m25
$$ 467858 464865 461948 459671 457775 455357 452050 448475 445458 443317 442078 441799 442348 443156 443521 443096
61385D43096j063j154n58L19O99L32k1M36J332J613J037M43M94R50J403J833K146
$$ 443096 442033 440879 440321 440640 441339 441671 441650 442086 443418 445031 446068 446511 447005 447955 449358 451191 453337
61368D53337J895J048M61R05J947K415J823P91J70K25P15J315J807K158K501K945
$$ 453337 455232 456280 456741 457646 459593 462008 463831 464622 464792 465017 465732 467047 468854 471012 473513 476458
61352D76458L441L934M536N275N777N565M805M461N397P332R053R733R828J0337
$$ 476458 479899 483833 488369 493644 499421 504986 509791 514252 519649 526981 536034 545767 555595 565932
61338E65932J1382J1991J1361R776Q006O302M443K422M36j553l594n226n894n837
$$ 565932 577314 589305 600666 610442 618448 624750 629193 631615 632051 630498 626904 621678 615784 609947
61324F09947n860o155o184n762n444n423m971l595k025j374j701k126k032j492
$$ 609947 604087 597932 591748 585986 580542 575119 570148 566553 564528 563154 561453 559327 557295 555803
61310E55803p54N1P46J215J669K386L264L898M095M031M031M427N386O600P374
$$ 555803 555049 555100 555846 557061 558730 561116 564380 568278 572373 576404 580435 584862 590248 596848 604222
61295F04222P350O988P014P574Q176Q179P079M660J397j612l596m838o024p129
$$ 604222 611572 618560 625574 633148 641324 649503 656582 661242 662639 661027 657431 652593 646569 639440
61281F39440p526p037o207n552n003m274l282k154j059j92L79Q07J242J637K030
$$ 639440 631914 624877 618670 613118 608115 603841 600559 598405 597346 597154 597533 598340 599582 601219 603249
61266F03249K758M023N386O179O354O519P146Q147R123R598R162P919O863P196
$$ 603249 606007 610030 615416 621595 627949 634468 641614 649761 658884 668482 677644 685563 692426 699622
61252F99622R051J1266J2579J2763J2428J2074J1523J0185P693M311P16k602n563
$$ 699622 708673 719939 732518 745281 757709 769783 781306 791491 799184 803495 804211 801609 796046
61239G96046q129j0114j1565j2851j3967j4178j2889j0674q714p470o452n177
$$ 796046 787917 777803 766238 753387 739420 725242 712353 701679 692965 685495 679043 673866
61227F73866l625j809K76K126K924K566J966K025K785L791M775N583N934N731
$$ 673866 670241 668432 668708 670834 673758 676324 678290 680315 683100 686891 691666 697249 703183 708914
61213G08914N312N051M830M235L166K047J431J477J742J572Q92M45J046K599M242
$$ 708914 714226 719277 724107 728342 731508 733555 734986 736463 738205 739777 740669 741114 742160 744759 749001
61198G49001N299N802O128O585P344Q413R622J0887J2400J4253J6043J7373J8554
$$ 749001 754300 760102 766230 772815 780159 788572 798194 809081 821481 835734 851777 869150 887704
61185H87704K0231K2349K4167K5250K5823K6031K5449K3597K0427J6249J1717
$$ 887704 907935 930284 954451 979701 1005524 1031555 1057004 1080601 1101028 1117277 1128994
61174A128994P835N353L966K641Q06j337l619o140q663j0653j2237j4200j6751
$$ 1128994 1136829 1142182 1146148 1148789 1149595 1148258 1144639 1138499 1129836 1119183 1106946 1092746 1075995
61161A075995j9168k1078k3035k5249k6703k6447k4964k3426k2209k1022j9862
$$ 1075995 1056827 1035749 1012714 987465 960762 934315 909351 885925 863716 842694 822832
61150H22832j8815j7318j4771j1673r175p570o089m183k152m10J044K289L259
$$ 822832 804017 786699 771928 760255 751080 743510 737421 733238 731086 730676 731720 734009 737268
61137G37268M024M759N274N088M186L240K801K567J797L39r87j057M80K956N545
$$ 737268 741292 746051 751325 756413 760599 763839 766640 769207 771004 771343 770356 769299 769779 772735 778280
61122G78280Q148J1118J4341J7220J9571K1848K4289K6522K8306K9942L1545L2620
$$ 778280 786428 797546 811887 829107 848678 870526 894815 921337 949643 979585 1011130 1043750
61110A043750L2965L3284L4146L4932L4558L2869L0538K7957K5046K1959J9188
$$ 1043750 1076715 1109999 1144145 1179077 1213635 1246504 1277042 1304999 1330045 1352004 1371192
61099A371192J7009J5267J3529J1101P423K923j105m092o988j0800j5077j8863
$$ 1371192 1388201 1403468 1416997 1428098 1435521 1438444 1437339 1433247 1426259 1415459 1400382 1381519
61087A381519k2376k6415l0598l3587l4968l5550l5845l5567l4674l3661l2575
$$ 1381519 1359143 1332728 1302130 1268543 1233575 1198025 1162180 1126613 1091939 1058278 1025703
61076A025703l0880k8470k5897k3402k0758j8148j6170j4790j3244j1169q905
$$ 1025703 994823 966353 940456 917054 896296 878148 861978 847188 833944 822775 813870
61065H13870o673m426k538j454p39L77J524J732J422K171M229O004O566O969Q217
$$ 813870 807197 802771 800233 798779 798040 798417 799941 801673 803095 805266 809495 815499 822065 829034 837251
61050H37251R677J0562J1481J3240J5384J7118J8687K0606K2528K4045K5673K7929
$$ 837251 846928 857490 868971 882211 897595 914713 933400 954006 976534 1000579 1026252 1054181
61038A054181L0325L2265L4046L5940L7294L7661L7829L8659L9853M0919M2176
$$ 1054181 1084506 1116771 1150817 1186757 1224051 1261712 1299541 1338200 1378053 1418972 1461148
61027A461148M3665M4462M4452M5324M8094N1077N2395N3196N5959O0493O4211
$$ 1461148 1504813 1549275 1593727 1639051 1687145 1738222 1790617 1843813 1899772 1960265 2024476
61016B024476O5864O6514O7187O8052P0003P4660Q2577R3389J07555J25810J47053
$$ 2024476 2090340 2156854 2224041 2292093 2362096 2436756 2519333 2612722 2720277 2846087 2993140
61005B993140J69123J91863K17379K47808K85280L33600L96850M76187N70905
$$ 2993140 3162263 3354126 3571505 3819313 4104593 4438193 4835043 5311230 5882135
60996E882135O82190Q12811R64816J143198J361236J635032J971460K366918K810905
$$ 5882135 6564325 7377136 8341952 9485150 10846386 12481418 14452878 16819796 19630701
60987A9630701L264172L616460L690842L342398K585055J614716O91288l357m00138
$$ 19630701 22894873 26511333 30202175 33544573 36129628 37744344 38435632 38432275 38032137
60978C8032137m86142k81248J04847M37916M53156K4759p53126j650866k456395
$$ 38032137 37545995 37264747 37369594 37807510 38260666 38285425 37532299 35881433 33425038
60969C3425038l053982l401653l489274l337226l009666k597157k177215j793226
$$ 33425038 30371056 26969403 23480129 20142903 17133237 14536080 12358865 10565639
60961A0565639j462351j189034r69040p91905o47960n32433m42074l71765l16436
$$ 10565639 9103288 7914254 6945214 6153309 5505349 4972916 4530842 4159077 3842641
60952C842641k73293k40085k13543j91067j71983j55643j40266j24926j10661
$$ 3842641 3569348 3329263 3115720 2924653 2752670 2597027 2456761 2331835 2221174
60943B221174r8246q6813p6094o8061o4442o4021o4194o3955o3603o2759o0617
$$ 2221174 2122928 2036115 1960021 1891960 1827518 1763497 1699303 1635348 1571745 1508986 1448369
60932A448369n7564n4688n2069m8984m5423m2002l8754l5359l2293l0425k9517
$$ 1448369 1390805 1336117 1284048 1235064 1189641 1147639 1108885 1073526 1041233 1010808 981291
60921I81291k8398k6636k4921k3752k2737k1427k0013j8887j8100j7406j6487
$$ 981291 952893 926257 901336 877584 854847 833420 813407 794520 776420 759014 742527
60910G42527j5063j3110j0967q994p277n861m909m365l897l505l718m707n670
$$ 742527 727464 714354 703387 694393 687116 681255 676346 671981 668084 664579 660861 656154 650484
60897F50484n724n030m461m406m525m504m509m864n622o413o602n891m779m045
$$ 650484 644760 639730 635269 630863 626338 621834 617325 612461 606839 600426 593824 587933 583154 579109
60883E79109l762l415l037l303m198m692m199l392k933k361j239l47n41j171r72
$$ 579109 575347 571932 568895 565592 561394 556702 552503 549111 546178 543817 542578 542231 541690 540519 539547
60868E39547KO85Q74J390K422L140L113K973L334L967M333M234L745L084K644
$$ 539547 539549 540234 541108 542498 544920 548060 551173 554146 557480 561447 565780 570014 573759 576843 579487
60853E79487K537K232J234m6r11j553k660l941m264l300k047j448j509j997k954
$$ 579487 582024 584256 585490 585444 584533 582980 580320 576379 572115 568815 566768 565320 563811 561814 558860
60838E58860m161m975n245n625o523p445p771p512o862n643l773j696P3J421K399
$$ 558860 554699 549724 544479 538854 532331 524886 517115 509603 502741 497098 493325 491629 491702 493123 495522
60823D95522K965L322L953M994O008O621O888O877O495N956N714N689N285M446
$$ 495522 498487 501809 505762 510756 516764 523385 530273 537150 543645 549601 555315 561004 566289 570735
60809E70735L873L797L497K600J911K083K433K059J480J783K632K516R47q51j657
$$ 570735 574608 578405 581902 584502 586413 588496 590929 592988 594468 596251 598883 601399 602346 601495 599838
60794E99838j607j524j836k615l846n132n762n693n905p145q709r171q221p022
$$ 599838 598231 596707 594871 592256 588410 583278 577516 571823 565918 558773 550064 540893 532672 525650
60780E25650o731p264p714p495o731n852n204m936m945m966m884m796m624l895
$$ 525650 518919 511655 503941 496446 489715 483863 478659 473723 468778 463812 458928 454132 449508 445613
60766D45613k367o57K61K59K32R73K334L649M387M232L209K082J964K983L966
$$ 445613 443246 442589 442850 443109 443341 444314 446648 450297 454684 458916 462125 464207 466171 469154 473120
60751D73120M064L997M826O187O822O522O289O718P443Q190R065R632R025P431
$$ 473120 477184 481181 486007 492194 499016 505538 511827 518545 525988 534178 543243 552875 561900 569331
60737E69331O229O033N778M506K887J953J334O3j483j955j168m74q68j822k371
$$ 569331 575560 581593 587371 591877 594764 596717 598051 598114 596631 594676 593508 593034 592166 590344 587973
60722E87973k423k494k777l112l448l841m120m057l872m166n148o206o574o357
$$ 587973 585550 583056 580279 577167 573719 569878 565758 561701 557829 553663 548515 542309 535735 529378
60708E29378o439p213p946p841p236o977o900n986m092k512k293k866k982k316
$$ 529378 522939 515726 507780 499939 492703 485726 478826 472840 468748 466236 463943 461077 458095 455779
60694D55779j396n18L77J118J452J700K482L756M769N047M899M910N320O006O636
$$ 455779 454383 453865 454242 455360 456812 458512 460994 464750 469519 474566 479465 484375 489695 495701 502337
60679E02337O822O463O046O197O862P217O505M863L172K167J690Q68q13k739l821
$$ 502337 509159 515622 521668 527865 534727 541944 548449 553312 556484 558651 560341 561209 560396 557657 553836
60664E53836l948m210n329o529o531n273l970l574l908m316m470m378m050l510
$$ 553836 549888 545678 540349 533820 527289 522016 518046 514472 510564 506248 501778 497400 493350 489840
60650D89840k839k046j103j40N98J076J474J809J764J082O4n72m23P6J3r65k121
$$ 489840 487001 484955 483852 483712 484310 485386 486860 488669 490433 491515 491579 491007 490584 490660 490673 489708 487587
60633D87587k370j467j55P83J220J414J548J698J884K003K088K620M018N709O444
$$ 487587 485217 483750 483595 484378 485598 487012 488560 490258 492142 494145 496233 498853 502871 508580 515024
60618E15024N852M949M688M809M751M862N695O733O984O577O628P523Q453Q794
$$ 515024 520876 525825 530513 535322 540073 544935 550630 557363 564347 570924 577552 585075 593528 602322
60604F02322Q957R487J0142J0285R673Q440O800N041L494K203R53l24j505k652
$$ 602322 611279 620766 630908 641193 650866 659306 666106 671147 674641 676844 677797 677473 675968 673316
60590F73316l925n038n375m817l932l141k323j460j036j291j634j295k35J113
$$ 673316 669391 664353 658978 654161 650229 647088 644765 643305 642269 640978 639344 638049 637814 638927
60576F38927K685M637O605P820Q117Q295R200J0859J2761J4621J6505J8404K0157
$$ 638927 641612 646249 652854 660674 668791 677086 686286 697145 709906 724527 741032 759436 779593
60563G79593K1851K3931K6671K9688L2215L3733L4077L3137L0749K7034K2480
$$ 779593 801444 825375 852046 881734 913949 947682 981759 1014896 1045645 1072679 1095159
60552A095159J7645J2996R066O349M870M129L774M039N298P443R992J2643J5339
$$ 1095159 1112804 1125800 1134866 1141215 1146085 1150214 1153988 1158027 1163325 1170768 1180760 1193403 1208742
60539A208742J7924J9990K1115K1125K0197J8641J6417J2892P513P27o286j2900
$$ 1208742 1226666 1246656 1267771 1288896 1309093 1327734 1344151 1357043 1364556 1365283 1358997 1346097
60527A346097j9415k5862l1178l4166l4733l3489l0696k6446k1483j6920j3260
$$ 1346097 1326682 1300820 1269642 1235476 1200743 1167254 1136558 1110112 1088629 1071709 1058449
60516A058449j0465q685q016p661o458m398k665j881j248K22K413M590O474Q228
$$ 1058449 1047984 1039299 1031283 1023622 1017164 1012766 1010101 1008220 1006972 1007194 1009607 1014197 1020671 1028899
60502A028899R872J1383J3094J5561J9182K4179L0657L8366M6706N5276O4114
$$ 1028899 1038771 1050154 1063248 1078809 1097991 1122170 1152827 1191193 1237899 1293175 1357289
60491A357289P3098Q1428Q8019R2137R3198R0315Q2553O9671N2265L1199P344
$$ 1357289 1430387 1511815 1599834 1691971 1785169 1875484 1958037 2027708 2079973 2111172 2118516
60480B118516j8141m3568o6994q6681j01328j10127j12861j10006j02785r2986
$$ 2118516 2100375 2056807 1989813 1903132 1801804 1691677 1578816 1468810 1366025 1273039
60470A273039q2573p3017o4760n7266m9784m2260l5454l0141k6271k3132k0185
$$ 1273039 1190466 1117449 1052689 995423 945639 903379 867925 837784 811513 788381 768196
60459G68196j7480j5282j3633j2368j1309j0354r573r165r006q428o948n202m381
$$ 768196 750716 735434 721801 709433 698124 687770 678197 669032 660026 651598 644650 639448 635067
60446F35067m656m935m478l847l729l733l160k238j676j459j084o27n28o26l89
$$ 635067 630411 625476 620998 617151 613422 609689 606529 604291 602615 601156 600072 599445 598917 598291 597902
60431E97902M5L9m02o65o75j082k141l250l749l417k240m84R29J088L10j34L19
$$ 597902 597947 597986 597584 596919 596244 595162 593021 589771 586022 582605 580365 579881 580810 581898 582208 582074 582393
60414E82393R80J197J212J351J275O03k54m72L29J777K981L040J911O98M26O72
$$ 582393 583373 584570 585782 587133 588408 589011 588757 588285 588614 590391 593372 596412 598323 599021 599447 600119
60398F00119K92o90j051l55L52K05l71p64j179j778j936j291n99n47n69J90J351
$$ 600119 600411 599721 598670 598315 598667 598872 598501 597737 596558 594780 592844 591553 590954 590407 589838 590028 591379
60381E91379J862J558J145J022J081J383K004K400J882O46l91p60p19m87QO49
$$ 591379 593241 594799 595944 596966 598047 599430 601434 603834 605716 606362 605971 605211 604492 604005 604013 604662
60365F04662J077J278J612K165K529K347J739J081O28L59K8n76j258j497j094
$$ 604662 605739 607017 608629 610794 613323 615670 617409 618490 619118 619477 619505 618929 617671 616174 615080
60350F15080n11l45o58j091j363j431j277q65j99O03J199J162N52J60O37J502
$$ 615080 614569 614224 613566 612475 611112 609681 608404 607539 607340 607943 609142 610304 610856 611016 611653 613155
60334F13155J779J493J572K177K301J506Q66J404K551L057K670J987J230K74n20
$$ 613155 614934 616427 617999 620176 622477 623983 624849 626253 628804 631861 634531 636518 637748 638022 637502
60319F37502n47R3O77P68N25L15N25J431K748L708M101M693O152Q111R975J1935
$$ 637502 636955 637048 637725 638493 639018 639333 639858 641289 644037 647745 651846 656539 662691 670802 680777 692712
60303F92712J4360J6904J9191K1839K5593K9688L2180L1857K8969K4262J8080
$$ 692712 707072 723976 743167 765006 790599 820287 852467 884324 913293 937555 955635
60292I55635J0396J078r586k0067k7908l1730l2481l1768k9707k5588k0130j5350
$$ 955635 966031 967109 957523 937456 909548 877818 845337 813569 783862 758274 738144 722794
60280G22794j2353j0569r217q130p066n609m066l261l205l057k557k300k398k213
$$ 722794 710441 699872 690655 682525 675459 669850 665784 662523 659318 656261 653704 651404 649006 646793
60266F46793j674j558j994k009j169m22n70j055j042p15n79m44qL32J53j41k6
$$ 646793 645119 643561 641567 639558 638389 637967 637397 636342 635300 634585 634006 633562 633554 633886 634039 633898 633872
60249F33872J71q0n13n52l55m77p96o82j5P33J234J470J297N69m14j077j167p87
$$ 633872 634043 633963 633450 632898 632543 632066 631270 630588 630573 631306 632540 634010 635307 635876 635462 634385 633218 632431
60231F32431o7Q02J468J813K194K876L505L641L480L471L492L086K349J845J711
$$ 632431 632364 633166 634634 636447 638641 641517 645022 648663 652143 655614 659106 662192 664541 666386 668097
60216F68097J486R36M28L17N07Q12J332K144K941L342L420L597M098M692M964
$$ 668097 669583 670519 670947 671264 671771 672583 673915 676059 679000 682342 685762 689359 693457 698149 703113
60201G03113M716M050L223K506K090J979J978J871J667J434J010J54q98j479j293
$$ 703113 707829 711879 715102 717608 719698 721677 723655 725526 727193 728627 729637 729791 728893 727414 726121
60186G26121q72q71j294j783k331l068l665l637l164k874k827k440j485n04k5
$$ 726121 725249 724378 723084 721301 718970 715902 712237 708600 705436 702562 699735 697295 695810 695306 695281
60171F95281Mj82m76n99j71N62P21p3j075j391j141j073j417j711j613j355j345
$$ 695281 695285 695103 694627 694028 693857 694419 695140 695067 693992 692601 691460 690387 688970 687259 685646 684291 682946
60154F82946j605j705j232l80O0l82j078q75N11K216L360L890M216M605N232O241
$$ 682946 681341 679636 678404 678024 678084 677702 676624 675749 676260 678476 681836 685726 689942 694547 699779 706020
60138G06020P432Q380R094R962J0803J0746R502Q040P344P076O224M520K435J22
$$ 706020 713452 721832 730926 740888 751691 762437 771939 779979 787323 794399 800623 805143 807578 807700
60124H07700k611n414p424q285q429q122o976m771k205l40N36J068J854K619K654
$$ 807700 805089 799675 792251 783966 775537 767415 760439 755668 753463 753123 753659 754727 756581 759200 761854
60109G61854J932J439K084L443M117L379K020J340J707K414K651K248J576J042
$$ 761854 763786 765225 767309 770752 774869 778248 780268 781608 783315 785729 788380 790628 792204 793246
60095G93246O27j11j451k938l702l436k636j799q43M79K030L478M689N607O132
$$ 793246 793873 793762 792311 789373 785671 782235 779599 777800 776957 777436 779466 782944 787633 793240 799372
60080G99372O354O511O496N830M421K821J406j37k061l848m938n703o931q607
$$ 799372 805726 812237 818733 824563 828984 831805 833211 833074 831013 827165 822227 816524 809593 800986
60066H00986r875j0125r525q602p857p608p642p246o117n015m858n373n432m662
$$ 800986 791111 780986 771461 762859 755002 747394 739752 732506 726389 721374 716516 711143 705711 701049
60052G01049l845l661l833l749l178k109n59J058J932J719J024O79Q83J399K120
$$ 701049 697204 693543 689710 685961 682783 680674 680115 681173 683105 684824 685848 686527 687410 688809 690929
60037F90929K957L539L563L348L555M303M940M719L514J845M66j85l75r37k483
$$ 690929 693886 697425 700988 704336 707891 712194 717134 721853 725367 727212 727678 727493 727118 726181 723698
60022G23698m743o866q403r574j0600j1220j1137j0625j0166r771r089q124p227
$$ 723698 718955 712089 703686 694112 683512 672292 661155 650530 640364 630593 621504 613380 606153
60009F06153o419n365m159l458l472l489k893k021j407p24N14J663J524J96p61
$$ 606153 599734 594369 590210 586752 583280 579791 576898 574877 573470 572746 573260 574923 576447 576643 575882
59994E75882l02R50J888K373K886L504L896L962L872L670L360L109L032K992K827
$$ 575882 575580 576530 578418 580791 583677 587181 591077 595039 598911 602581 605941 609050 612082 615074 617901
59979F17901K535K087J423P19J72n17j827l326l780k803j604j456k122k559k509
$$ 617901 620436 622523 623946 624665 624837 624320 622493 619167 615387 612584 610980 609524 607402 604843 602334
59964F02334k388k147j289J23J410K235K795L166L211L138L318L533L111J946
$$ 602334 599946 597799 596510 596633 598043 600278 603073 606239 609450 612588 615906 619439 622550 624496
59950F24496P03q8n85j087j536j678j380o74J27M46M3n14n51k84m23r31j073q02
$$ 624496 625199 625111 624526 623439 621903 620225 618845 618171 618298 618744 618787 618273 617722 617438 617015 616084 615011 614209
59932F14209j003j966k581j840l82L09j02n78l34J93J82l85p65m02N29J359J503
$$ 614209 613206 611240 608659 606819 606437 606746 606644 606066 605732 605925 606107 605722 604957 604555 605084 606443 607946
59915F07946Q81Ql14M09J875L162L510K952K159J726J792K190K659K884K626J958
$$ 607946 608827 608835 608521 608930 610805 613967 617477 620429 622588 624314 626106 628296 630955 633839 636465 638423
59899F38423J148L20m66q44l33R14K063K536K583K613K596K526K929M143N502
$$ 638423 639571 639891 639425 638581 638248 639162 641225 643761 646344 648957 651553 654079 657008 661151 666653
59884F66653N970N456M804M617M772M985N179N225N010M779M851M922M348L121
$$ 666653 672623 678079 682883 687500 692272 697257 702436 707661 712671 717450 722301 727223 731571 734692
59870G34692J907R26l87k276l994m810n103n721o682p199o914o331n889n269l930
$$ 734692 736599 737525 737138 734862 730868 726058 720955 715234 708552 701353 694439 688108 682219 676950 673020
59855F73020k054m64K47J85k11o33q67o68j0Q21J709L059N192P529R155J0142
$$ 673020 670966 670502 670749 670934 670723 670090 669223 668555 668545 669366 671075 674134 679326 686855 696010 706152
59839G06152J1570J3911J6191J7160J6613J4958J2237Q445M385J304j65o3J453
$$ 706152 717722 731633 747824 764984 781597 796555 808792 817237 821622 822926 822761 822698 824151
59826H24151L864N725N373K382k341p724j2943j6975j8895j8983j8485j7973j6816
$$ 824151 828015 833740 839113 841495 839154 831430 818487 801512 782617 763634 745149 727176 710360
59813G10360j4652j2315j0670r337p480n298l845l573l839l846l445k933k557
$$ 710360 695708 683393 672723 663386 655906 650608 646763 643190 639351 635505 632060 629127 626570
59800F26570k327k134j931j908k369l260l963l801k710j321l62r5k89n99r11j323
$$ 626570 624243 622109 620178 618270 615901 612641 608678 604877 602167 600846 600484 600389 600100 599501 598590 597267
59784E97267j844k312k614k812k877k561j760q30k29o8k49p67j486j897j599q65
$$ 597267 595423 593111 590497 587685 584808 582247 580487 579657 579428 579360 579111 578344 576858 574961 573362 572497
59768E72497k41K06O72R35O26N7j9M90R49J109J353J700J548Q76P09J721L094
$$ 572497 572256 572462 573134 574069 574695 574752 574733 575223 576172 577281 578634 580334 581882 582758 583467 585188 588282
59751E88282L567L057K430K162K107K303K964L652L422K108P94O22J529K466K551
$$ 588282 591849 594906 597336 599498 601605 603908 606872 610524 613946 616054 616848 617470 618999 621465 624016
59736F24016J675L40p06q13M7J017J069J88m63O4J244J712J035J40j14l7l38r49
$$ 624016 625691 626031 625325 624512 624559 625576 626645 626833 626370 626434 627678 629390 630425 630565 630451 630414 630076 629127
59718F29127j290j293j359j560j617j575j724j910j634q92k39Q2L46O85Q74R42
$$ 629127 627837 626544 625185 623625 622008 620433 618709 616799 615165 614273 614034 614116 614462 615147 616021 616963
59702F16963J231J698J903J966K639M037N187N391N238N552N977N592M403L264
$$ 616963 618194 619892 621795 623761 626400 630437 635624 641015 646253 651805 657782 663374 667777 671041
59688F71041K535J797Q67J49j76n61j361k211k521k195j480m98O64J567J629P76
$$ 671041 673576 675373 676240 676389 676213 675652 674291 672080 669559 667364 665884 665386 666050 667617 669246 670022
59672F70022l56j045j189j252j659k335k829k714j909q06p1j01o19j040j201j373
$$ 670022 669666 668621 667432 666180 664521 662186 659357 656643 654734 653928 653857 653756 653137 652097 650896 649523
59656F49523j576j387o74J07O94J508K789L811L753K978K545K684K626J894P98
$$ 649523 647947 646560 645886 645993 646687 648195 650984 654795 658548 661526 664071 666755 669381 671275 672073
59641F72073l61j731l271m492n119n380n407m997m177l358k701j954j093m86k37
$$ 672073 671712 669981 666710 662218 657099 651719 646312 641315 637138 633780 631079 629125 628032 627546 627309
59626F27309o0P2n4o5P90K286L125K744K144K187K095P37j424k951l456l766m249
$$ 627309 627249 627321 627267 627202 627992 630278 633403 636147 638291 640478 642573 643310 641886 638935 635479 631713 627464
59609F27464m318l641k679j719m10J199K069J424Q9k98O46J604J440Q01J127K402
$$ 627464 623146 619505 616826 615107 614697 615896 617965 619389 619478 619180 619826 621430 622870 623671 624798 627200
59593F27200K890J437r00k226k114j571j204o66Q4L06k96j006j279j587k469l508
$$ 627200 630090 631527 630627 628401 626287 624716 623512 622846 622930 623236 622940 621934 620655 619068 616599 613091
59577F13091m018m065m117m222m199m152m117l654k499j203m77k66j09m4l45p08
$$ 613091 609073 605008 600891 596669 592470 588318 584201 580547 578048 576845 576368 576102 575993 575949 575604 574896
59561E74896m62M16J167J183O48K29M01J024J422J131N84O60J458K153K277K330
$$ 574896 574434 574850 576017 577200 577848 578077 578478 579502 580924 582055 582639 583299 584757 586910 589187 591517
59545E91517K803L404L791M286N127N864O254P065R107J2098J5412J9000K2400
$$ 591517 594320 597724 601515 605801 610928 616792 623046 630111 639218 651316 666728 685728 708128
59532G08128K3559K0436J3632O047q3m514p431q291o857m130j327J330M126O757
$$ 708128 731687 752123 765755 771802 771719 767205 759774 751483 744626 740496 739169 740499 744625 751382
59518G51382Q440Q842Q382P745P300O808N576L171k5l196n854p905r131r291q772
$$ 751382 759822 768664 777046 784791 792091 798899 804475 807646 807621 804425 798571 790666 781535 772244 763472
59503G63472q478q881r529r719r304q680q284q160p915p095n701m225l031k076
$$ 763472 754994 746113 736584 726865 717561 708881 700597 692437 684522 677427 671726 667501 664470 662394
59489F62394j340j035j037o44N32J955L038M080N621P346Q556R376J0497J2008
$$ 662394 661054 660019 658982 658338 658870 660825 663863 667943 673564 680910 689466 698842 709339 721347
59475G21347J3449J4815J6365J7519J7133J4999J2053Q867N081O21l497o170p198
$$ 721347 734796 749611 765976 783495 800628 815627 827680 836547 841628 842249 838752 832582 825384
59462H25384o881n404l131p83J295L612O799J0784J4961J8736K1554K3001K3348
$$ 825384 818503 813099 809968 809185 810480 814092 820891 831675 846636 865372 886926 909927 933275
59449I33275K3721K5199K7840L0752L2887L3603L2516K8982K1996J1130k194j4999
$$ 933275 956996 982195 1010035 1040787 1073674 1107277 1139793 1168775 1190771 1201901 1199707 1184708
59437A184708k4938l1857l6588l9046l8639l6039l3000l0373k7652k4670k2216
$$ 1184708 1159770 1127913 1091325 1052279 1013640 977601 944601 914228 886576 861906 839690
59426H39690k0572j8758j5960j2595r252n749j869J947N491R378J3819J7771K0325
$$ 839690 819118 800360 784400 771805 762553 756804 754935 756882 762373 771751 785570 803341 823666
59413H23666K2132K4552K8052L2270L6556L9149L6901K7889J4196N12j0053j7451
$$ 823666 845798 870350 898402 930672 967228 1006377 1043278 1071167 1085363 1085875 1075822 1058371
59401A058371k2279k3891k1622j6250r271j862M320O454K308p224j8423k7683
$$ 1058371 1036092 1012201 990579 974329 965058 963196 967516 973970 976278 969054 950631 922948
59389I22948l3628l6530l6789l4620l0615k5823k1223j7347j4352j2155j0424
$$ 922948 889320 852790 816001 781381 750766 724943 703720 686373 672021 659866 649442
59378F49442q710o832n022l620k679j996j387q38l90j12o6j42l2M40J001J257
$$ 649442 640732 633900 628878 625258 622579 620583 619196 618358 617968 617856 617790 617648 617616 618056 619057 620314
59362F20314J251J407J904K472K886L370M158N034N591N932O686Q266J0356J2326
$$ 620314 621565 622972 624876 627348 630234 633604 637762 642796 648387 654319 661005 669271 679627 691953
59348F91953J3969J5525J7007J8025J8508J9257K1037K3311K4547K4047K2682
$$ 691953 705922 721447 738454 756479 774987 794244 815281 838592 863139 887186 909868
59337I09868K1486K0256J8202J5361J2359R152N051K6m920q922j2074j4825j7214
$$ 909868 931354 951610 969812 985173 997532 1006684 1011735 1011761 1006841 997919 985845 971020 953806
59324I53806j9000k0057k0301j9668j8423j7180j6304j5563j4511j2990j1184
$$ 953806 934806 914749 894448 874780 856357 839177 822873 807310 792799 779809 768625
59313G68625r476q294p751p384o579n280l953k826j661l35Q50J614K097K630L357
$$ 768625 759149 750855 743104 735720 729141 723861 719908 717082 715421 715086 715936 717550 719647 722277 725634
59298G25634M260N266O326P543R115J0988J2822J4646J7108K0558K4257K7156
$$ 725634 729894 735160 741486 749029 758144 769132 781954 796600 813708 834266 858523 885679
59286H85679K8862K8942K5849J8224P329l300j1098j6186j9486k0746j9423j6267
$$ 885679 914541 943483 969332 987556 994885 991585 980487 964301 944815 924069 904646 888379
59274H88379j2685r138n199p93L657P843J1478J3994J5232J6038J7182J8027J7272
$$ 888379 875694 866556 861357 860564 864221 872064 883542 897536 912768 928806 945988 964015 981287
59261I81287J4875J2064R524O632K777j532n409q666j1645j4361j6393j7356j7159
$$ 981287 996162 1008226 1017750 1024382 1027159 1025627 1020218 1011552 999907 985546 969153 951797 934638
59248I34638j5941j4131j2341j0885r478p674n655m118l254k261k98K251M044
$$ 934638 918697 904566 892225 881340 871862 864188 858533 854415 851161 848900 848602 850853 854897
59235H54897M437M210M407N097N776O363O974P078N965L952K117P82q40l278o089
$$ 854897 859334 863544 867951 873048 878824 885187 892161 899239 905204 909156 911273 912055 911215 907937 901848
59220I01848q762j1370j3834j5467j5895j5724j5613j5264j4143j2628j1684j1627
$$ 901848 893086 881716 867882 852415 836520 820796 805183 789919 775776 763148 751464 739837
59208G39837j1836j1497j0204q169o272n527n961o372n715m320l204k617k035
$$ 739837 728001 716504 706300 698131 691859 686332 680371 673999 668284 663964 660760 658143 656108
59195F56108j284q20q94j137j059n17L69J347K089K403K495K743L269L843M153
$$ 656108 654824 654004 653110 651973 650914 650397 650766 652113 654202 656605 659100 661843 665112 668955 673108
59180F73108M060L744L670M098M668M796M556M580N032N346N319N645O829Q296
$$ 673108 677168 680912 684582 688680 693348 698144 702700 707280 712312 717658 722977 728622 735451 743747
59166G43747R287J0103J1560J3594J5274J6021J6040J5659J4972J4035J2784J0803
$$ 743747 753034 763137 774697 788291 803565 819586 835626 851285 866257 880292 893076 903879
59154I03879P841M513J787k05k171m352o006o522o481p014q398r783j0285r895
$$ 903879 911720 916233 918020 917815 915644 911292 905286 898764 892283 885269 876871 867088 856803 846908
59140H46908r187q425p386o021m808m158l802l186k285j479q76l81k60q67j768
$$ 846908 837721 829296 821910 815889 811081 806923 803121 799935 797650 796171 795295 794914 794654 793787 792019
59125G92019j952j083K61J699L448N320O432O621P089Q819J1077J2477J2843J3021
$$ 792019 790067 788984 789245 790944 794392 799712 806144 812765 819854 828673 839750 852227 865070 878091
59111H78091J3364J3450J3088J2528J1794J0645R187P778O421M855L180J780P80
$$ 878091 891455 904905 917993 930521 942315 952960 962147 969925 976346 981201 984381 986161 986941
59098I86941Q0k96m81j029k226l366l512k846k423k716l179l275l109k942k732
$$ 986941 987021 986725 986244 985215 982989 979623 976111 973265 970842 968126 964947 961672 958563 955621 952889
59083I52889k478k499l077m098n149n859o234o747p900r464j0568j0789j0668
$$ 952889 950411 947912 944835 940737 935588 929729 923495 916748 908848 899384 888816 878027 867359
59070H67359j0742j0677r930q833q220q225q166p463o125m602l593l669m491m877
$$ 867359 856617 845940 836010 827177 818957 810732 802566 795103 788978 784376 780783 777114 772623 767746
59056G67746m247l494l671m413m608m127l730l621l297k784k769l437m183m574
$$ 767746 763499 760005 756334 751921 747313 743186 739456 735835 732538 729754 726985 723548 719365 714791
59042G14791m664m291l109j453k30K52M54N61K47k77j54Q15J719J918J984K681
$$ 714791 710127 705836 702727 701274 701044 701296 701750 702311 702558 702281 702127 702942 704661 706579 708563 711244
59026G11244L751M431M626M887N596O719Q086R476J0553J1010J0715R663Q050
$$ 711244 714995 719426 724052 728939 734535 741254 749340 758816 769369 780379 791094 800757 808807
59013H08807O340M912L602K049M33o33r88j140j500j854j768j063J54J625K986
$$ 808807 815147 820059 823661 825710 826143 825510 824522 823382 821882 820028 818260 817197 817351 818976 821962
58998H21962M105N293O803Q267R138R507R848J0065R597Q443P224O165M793K887
$$ 821962 826067 831360 838163 846430 855568 865075 874923 884988 894585 903028 910252 916417 921210 924097
58984I24097R20p48k402m389o579q711j0645j1964j1939j0344p894n464l271j104
$$ 924097 925017 924269 921867 917478 910899 902188 891543 879579 867640 857296 849402 843938 840667 839563
58970H39563J065L069M835O362P627Q741R936J1211J2230J2725J2834J2919J3153
$$ 839563 840628 843697 848532 854894 862521 871262 881198 892409 904639 917364 930198 943117 956270
58957I56270J3230J2434J0223O951L679Q88k153o164j0471j3680j5440j6576j7573
$$ 956270 969500 981934 992157 999108 1002787 1003675 1001522 995358 984887 971207 955767 939191 921618
58944I21618j7928j7247j6007j4847j3761j2352j0467q357o658o137o911p898
$$ 921618 903690 886443 870436 855589 841828 829476 819009 810652 803994 797857 790946 783048
58932G83048p776o552n451n160n066m477l712l494l869m273m264l831l312l179
$$ 783048 775272 768720 763269 758109 753043 748566 744854 741360 737491 733218 728954 725123 721811 718632
58918G18632l553l821l176j627J7J203K125L006L572L562L326L560M635O313P916
$$ 718632 715079 711258 708082 706455 706472 707675 709800 712806 716378 719940 723266 726826 731461 737774 745690
58903G45690Q890R484J0637J2772J5086J6502J6996J7232J7298J6722J5559J4453
$$ 745690 754580 764064 774701 787473 802559 819061 836057 853289 870587 887309 902868 917321
58891I17321J3750J3493J4123J6140J9056K1775K4116K6769K9634L1371L0966
$$ 917321 931071 944564 958687 974827 993883 1015658 1039774 1066543 1096177 1127548 1158514
58880A158514K8733K5442K1448J7034J2573P937K582l440r400j4970k0367k5247
$$ 1158514 1187247 1212689 1234137 1251171 1263744 1271681 1274263 1270823 1261423 1246453 1226086 1200839
58868A200839k8683l0530l1579l1959l0745k7815k4669k2585k1123j9437j7870
$$ 1200839 1172156 1141626 1110047 1078088 1047343 1019528 994859 972274 951151 931714 913844
58857I13844j7089j6675j5774j4559j3740j3260j2583j1880j1756j2030j1804
$$ 913844 896755 880080 864306 849747 836007 822747 810164 798284 786528 774498 762694
58846G62694j0680r148p824o938o452o209n963n601n159m553l695k992l142m116
$$ 762694 752014 742866 735042 728104 721652 715443 709480 703879 698720 694167 690472 687480 684338 680222
58832F80222m973m955m209l259k492k436l516n114n710m635k903j761j254q35
$$ 680222 675249 670294 666085 662826 660334 657898 654382 649268 643558 638923 636020 634259 633005 632170
58818F32170m31r3O09J938L289L943M006L868L417K527J719J421J168L42o92j077
$$ 632170 631739 631646 632255 634193 637482 641425 645431 649299 652716 655243 656962 658383 659551 659893 659201 658124
58802F58124p47l58l12n19q76j330j653j704j593j302n66M57J023P80L56M74J149
$$ 658124 657377 657019 656707 656188 655312 653982 652329 650625 649032 647730 647164 647621 648644 649424 649780 650254 651403
58785F51403K175L602N210O290O680P217Q461R793J0459J0665J0716R994P924
$$ 651403 653578 657180 662390 668680 675360 682577 691038 700831 711290 721955 732671 742665 750589
58772G50589N242L109J492m64k874n050o627p753q411q511q400q454q388p750
$$ 750589 755831 758940 760432 759968 757094 752044 745417 737664 729253 720742 712342 703888 695500 687750
58758F87750o680n579m419l174k250j756r58O12K229L120L729M700N370M807L733
$$ 687750 681070 675491 671072 667898 665648 663892 662934 663546 665775 668895 672624 677324 682694 687501 691234
58743F91234L751M910N689N472N402O480Q190R472R967R796R010P786O633N994
$$ 691234 694985 699895 705584 711056 716458 722938 731128 740600 750567 760363 769373 777159 783792 789786
58729G89786N986O462O911O566N239L832L297L377L169K583K270K322K133J638
$$ 789786 795772 802234 809145 815711 820950 824782 828079 831456 834625 837208 839478 841800 843933 845571
58715H45571J549K248L307M366N636P196Q452Q644P564N611L408J325q55l543
$$ 845571 847120 849368 852675 857041 862677 869873 878325 886969 894533 900144 903552 904877 904022 900479
58701I00479o462q726j0186j1914j4584j7136j8124j7819j7700j8236j8511j7882
$$ 900479 894017 885291 875105 863191 848607 831471 813347 795528 777828 759592 741081 723199
58689G23199j6661j5050j2796j0187q211p292o763o075n657o094p093p816p746
$$ 723199 706538 691488 678692 668505 660294 653002 646239 640164 634507 628413 621320 613504 605758
58676F05758o908n637m423l638l146k417j037J009L432N725P343Q205Q866R839
$$ 605758 598850 593213 588790 585152 582006 579589 578552 579561 582993 588718 596061 604266 613132 622971
58662F22971J1002J1977J2613J2614J1235Q166M365J252p93k421m075n510o405
$$ 622971 633973 645950 658563 671177 682412 690578 694943 696195 695402 692981 688906 683396 676991
58649F76991o701o388n643n092n274n868o012n324m157l015k177j682j246m85
$$ 676991 670290 663902 658259 653167 647893 642025 636013 630689 626532 623517 621340 619658 618412 617927
58635F17927M72R80Q67Q72J508K148J934R57k33j687l656n608o659o653o011m822
$$ 617927 618399 619379 620246 621118 622626 624774 626708 627665 627432 625745 622089 616481 609822 603169 597158 592336
58619E92336k969q31J070K884N120P772J0367J2589J4212J4955J4947J4745J4277
$$ 592336 589367 588536 589606 592490 597610 605382 615749 628338 642550 657505 672452 687197 701474
58606G01474J2599R499O320M207K549M70j203j124Q4M38o69j956k369k160j890
$$ 701474 714073 723572 729892 734099 736648 737118 735915 734791 734875 735313 734644 732688 730319 728159 726269
58591G26269j733j723j588n35J704L978N132N781P339R654J1356J2101J2810J3717
$$ 726269 724536 722813 721225 720690 722394 726372 731504 737285 744624 754278 765634 777735 790545 804262
58577H04262J4037J3500J2601J1175Q508N054K399J181N22j55k74N81J954L616
$$ 804262 818299 831799 844400 855575 864083 869137 871536 872717 873239 873084 872810 873391 875345 878961
58563H78961N948Q766J1013J2172J2895J3715J4169J3693J2472J0920R081O803
$$ 878961 884909 893675 904688 916860 929755 943470 957639 971332 983804 994724 1003805 1010608
58551A010608M003P04k631n053o213p033q348r506r507q865q827r212q876q014
$$ 1010608 1014611 1015315 1012684 1007631 1001418 994385 986037 976531 967024 958159 949332 940120 931244 923230
58537I23230q153r788j1790j3269j4323j4794j4083j2532j1301j0540r226p125
$$ 923230 915077 905289 893499 880230 865907 851113 837030 824498 813197 802657 793431 786306
58525G86306n305m278l270j793m51L51J154K291L251L666L846M022M021L858L650
$$ 786306 781001 776723 773453 771660 771209 771560 772714 775005 778256 781922 785768 789790 793811 797669 801319
58510H01319L005J699O75R82K032K449K316K834L965M471M208M257M759M780M436
$$ 801319 804324 806023 806698 807680 809712 812161 814477 817311 821276 825747 829955 834212 838971 843751 848187
58495H48187M976O273O597N304L609K202L24k084l675m009m450n757o800o594
$$ 848187 853163 859436 866033 871337 874946 877148 877472 875388 871713 867704 863254 857497 850697 844103
58481H44103n751m868l431j345L05J083K100M003N766O449O525O420N480L365
$$ 844103 838352 833484 830053 828708 829013 830096 832196 836199 841965 848414 854939 861359 866839 870204
58467H70204R39j140l201n159o073n873n765o135n891m692l770l564k609l1K777
$$ 870204 871143 870003 866802 861643 855570 849697 843932 837797 831906 827214 823444 819880 817271 817240 820017
58452H20017M273M837N381N720N518N280N160M325K568J043L65l10j435k164k177
$$ 820017 824290 829127 834508 840228 845746 851026 856186 860511 863079 864122 864487 864177 862742 860578 858401
58437H58401k382k845k152k8J677J953K275L810N241N160M520M776N452N482N340
$$ 858401 856019 853174 851022 850994 852671 854624 856899 860709 865950 871110 875630 880406 885858 891340 896680
58422H96680N875O600O866P261Q191Q586P661O412N852N326M066K701J782N24
$$ 896680 902555 909155 916021 923282 931473 940059 947720 954132 959984 965310 969376 972077 973859 974383
58408I74383j371k592k561k905m796o718o877o010n769n870m973l030q64J260
$$ 974383 973012 970420 967859 964954 960158 953440 946563 940553 934784 928914 923941 920911 920047 921307
58394I21307L077L761L447L577M477M501L013J838K086K078N05r36n15M38R5m35
$$ 921307 924384 928145 931592 935169 939646 944147 947160 948998 951084 953162 953667 952731 952216 952654 952749 952314
58378I52314P04K506K795J915J732K323K595K949M372O037O481O287O992Q410
$$ 952314 953018 955524 958319 960234 961966 964289 966884 969833 974205 980242 986723 993010 1000002 1008412
58364A008412R328R820J0611J1311J1439J1855J3101J3859J3183J2513J3118J3451
$$ 1008412 1017740 1027560 1038171 1049482 1060921 1072776 1085877 1099736 1112919 1125432 1138550 1152001
58352A152001J1688R042P704P258O084M666M495N084N127N231O560Q097Q232P832
$$ 1152001 1163689 1172731 1180435 1187693 1193777 1198443 1202938 1208022 1213149 1218380 1224940 1233037 1241269 1249101
58338A249101Q710J0422J1405J1985J3280J4513J4419J4060J5167J7016J7807
$$ 1249101 1257811 1268233 1279638 1291623 1304903 1319416 1333835 1347895 1363062 1380078 1397885
58327A397885J7855J8429J8867J7859J6186J5271J4453J2661J1039J0936J1045
$$ 1397885 1415740 1434169 1453036 1470895 1487081 1502352 1516805 1529466 1540505 1551441 1562486
58316A562486R750Q365Q691R460Q748P877R084J1362J2548J3548J6239J9140J9683
$$ 1562486 1572236 1580601 1589292 1598752 1607500 1615377 1624461 1635823 1648371 1661919 1678158 1697298 1716981
58303A716981J8924J9478K0488J9470J7510J7583J9083J9110J8004J8417K0012
$$ 1716981 1735905 1755383 1775871 1795341 1812851 1830434 1849517 1868627 1886631 1905048 1925060
58292A925060K0302J9931K1692K4897K6121K5288K5695K8099K9877L0187L1062
$$ 1925060 1945362 1965293 1986985 2011882 2038003 2063291 2088986 2117085 2146962 2177149 2208211
58281B208211L3147L4854L5880L7370L8842L9072L9337M1508M3969M4040M3207
$$ 2208211 2241358 2276212 2312092 2349462 2388304 2427376 2466713 2508221 2552190 2596230 2639437
58270B639437M4981M8666N0667N0923N2492N5637N8071O0273O4676P0156P3345
$$ 2639437 2684418 2733084 2783751 2834674 2887166 2942803 3000874 3061147 3125823 3195979 3269324
58259C269324P4822P8056Q2739Q5322Q5704Q7120Q9756R0898R1039R3421R7737
$$ 3269324 3344146 3422202 3504941 3590263 3675967 3763087 3852843 3943741 4034780 4128201 4225938
58248D225938J00847J03314J08629J16252J22367J27186J34465J44127J52562
$$ 4225938 4326785 4430099 4538728 4654980 4777347 4904533 5038998 5183125 5335687
58239E335687J59886J69485J80772J90101J98504K10571K25970K40242K53599
$$ 5335687 5495573 5665058 5845830 6035931 6234435 6445006 6670976 6911218 7164817
58230G164817K70353K90045L08219L25675L47724L74365M00840M27681M60089
$$ 7164817 7435170 7725215 8033434 8359109 8706833 9081198 9482038 9909719 10369808
58221A0369808M97629N35100N73586O19696O73961P31649P94912Q71771R62966
$$ 10369808 10867437 11402537 11976123 12595819 13269780 14001429 14796341 15668112 16631078
58212A6631078J062975J174361J307404J465210J644082J849384K095540K389486
$$ 16631078 17694053 18868414 20175818 21641028 23285110 25134494 27230034 29619520
58204B9619520K730909L130331L609584M183278M858596N654148O597425P701486
$$ 29619520 32350429 35480760 39090344 43273622 48132218 53786366 60383791 68085277
58196F8085277Q967524J0414769J2086970J4031575J6300054J8960758K2059789
$$ 68085277 77052801 87467570 99554540 113586115 129886169 148846927 170906716
58189A70906716K5540740K9198713L2641170L5161906L5647280L2845561K6059874
$$ 170906716 196447456 225646169 258287339 293449245 329096525 361942086 388001960
58182C88001960J5760480L523111q681742j9233351k7150754l2004598l3789874
$$ 388001960 403762440 407285551 398603809 379370458 352219704 320215106 286425232
58175B86425232l2887295k9993625k5926745k1387581j6850628j2663997r226872
$$ 286425232 253537937 223544312 197617567 176229986 159379358 146715361 137488489
58168A37488489o987604o183570o591582p616448q664001r409739r749650r635547
$$ 137488489 130500885 124317315 117725733 110109285 101445284 92035545 82285895 72650348
58160G2650348r056378q118484p025617n954696m989251m158598l477968k937863
$$ 72650348 63593970 55475486 48449869 42495173 37505922 33347324 29869356 26931493
58152B6931493k502245k141803j848628j613227j414285j239718j094762r80762
$$ 26931493 24429248 22287445 20438817 18825590 17411305 16171587 15076825 14096063
58144A4096063q85312p99947p29249o75492o30279n87393n49412n16394m81583
$$ 14096063 13210751 12410804 11681555 11006063 10375784 9788391 9238979 8722585 8241002
58135H241002m43065m07048l75575l42954l07810k76728k52603k30799k10162
$$ 8241002 7797937 7390889 7015314 6672360 6364550 6087822 5835219 5604420 5394258
58126E394258j96433j91173j87983j83235j80259j79609j75411j65179j53882
$$ 5394258 5197825 5006652 4818669 4635434 4455175 4275566 4100155 3934976 3781094
58117C781094j44707j34739j23069j14093j09206j03708r5517q8789q5492q1514
$$ 3781094 3636387 3501648 3378579 3264486 3155280 3051572 2956055 2867266 2781774 2700260
58107B700260p4745o9211o7414o5964o2498n9871n9758n8891n5448n2754n2938
$$ 2700260 2625515 2556304 2488890 2422926 2360428 2300557 2240799 2181908 2126460 2073706 2020768
58096B020768n2991n0662m8356m7717m6085m1935l8252l7003l5549l1937k8676
$$ 2020768 1967777 1917115 1868759 1821042 1774957 1733022 1694770 1657767 1622218 1590281 1561605
58085A561605k7842k7317k5278k3721k4277k5021k4560k4842k6851k7893k6251
$$ 1561605 1533763 1506446 1481168 1457447 1433170 1408149 1383589 1358747 1331896 1304003 1277752
58074A277752k4387k4463k4791k3630k2470k2544k1956j9397j6997j6492j6085
$$ 1277752 1253365 1228902 1204111 1180481 1158011 1135467 1113511 1094114 1077117 1060625 1044540
58063A044540j4053j1985j1518j1203r573q203q802j0133j0533j0816j2051j3169
$$ 1044540 1030487 1018502 1006984 995781 986208 978005 969203 959070 948537 937721 925670 912501
58051I12501j3181j3155j3767j3476j1343r103q399q419q116q042q298p604o123
$$ 912501 899320 886165 872398 858922 847579 838476 830077 821658 813542 805500 797202 789598 783475
58038G83475o227q483j0046r057p549p723q440q002p478q427r783r738q799q440
$$ 783475 777248 768765 758719 749662 742113 734390 725950 717948 710470 702043 692260 682522 673723 665283
58024F65283q508q160p702p597p245o278n387m736l517k011j703k375j876Q3R72
$$ 665283 656775 648615 640913 633316 626071 619793 614406 609670 606153 604142 602439 600064 598188 598271 599243
58009E99243l14j476p87K02q3m23M68J327R24N15J307K088J785J768L052L792
$$ 599243 598929 597453 596666 596868 596785 596362 596830 598157 599081 599596 600903 602991 604776 606544 609596 613388
57993F13388K271O7n76l04q08j559j310r82k060l723m302m174m587n099m767m445
$$ 613388 615659 615726 615150 614846 614038 612479 611169 610187 608127 604404 600102 595928 591341 586242 581475 577030
57977E77030n289o300n916m816m612m978m525l542l326l681l461k842k854l290
$$ 577030 571741 565441 559525 554709 550097 545119 540594 537052 533726 530045 526584 523742 520888 517598
57963E17598l094k199j248k23J077K051K237K225K328J643j49j595j693j683k846
$$ 517598 514504 512305 511057 510834 511911 513962 516199 518424 520752 522395 522246 520651 518958 517275 514429
57948E14429m184m225l642l848m418m115l262k912k733j956j284j755k644k559
$$ 514429 510245 506020 502378 498530 494112 489997 486735 483823 481090 479134 477850 476095 473451 470892
57934D70892j700j063m80N19J080L10p63o74L7Pm12n5O53N45J34P39J850J832
$$ 470892 469192 468129 467649 468168 469248 469558 468795 468121 468158 468165 467753 467698 468351 468896 469030 469769 471619 473451
57916D73451P68K08M87M46l70j325k233l355m179m058l732m363n517n933n740
$$ 473451 474219 474427 474914 475360 474990 473665 471432 468077 463898 459840 456108 451745 446228 440295 434555
57901D34555o047o865p392p820q734r300q230o172m859m235k805o55L96j78p77
$$ 434555 428508 421643 414251 406431 397697 388397 380167 373995 369136 364901 362096 361441 361837 361659 360882
57886C60882k73O57J263J818K447K649K513K821L521L609K944K623L141L629L401
$$ 360882 360609 361266 362529 364347 366794 369443 371956 374777 378298 381907 384851 387474 390615 394244 397645
57871C97645K839K307J476J96j081k170l351m437m788m475m297m408m127l339
$$ 397645 400484 402791 404267 404463 403382 401212 397861 393424 388636 384161 379864 375456 371329 367990
57857C67990k913l324l925m032l731l249k420j186J04J259K457L714M744N452
$$ 367990 365077 361753 357828 353796 350065 346816 344396 343210 343314 344573 347030 350744 355488 360940
57843C60940O011O386O385O186O237O651P119P317O999O031M825M177M146L651
$$ 360940 366951 373337 379722 385908 392145 398796 405915 413232 420231 426262 431087 435264 439410 443061
57829D43061J935k17j556k139k956m360n816o885p488p544p225p105p282o925
$$ 443061 444996 444779 443223 441084 438128 433768 427952 421067 413579 406035 398810 391705 384423 377498
57815C77498n576m216l873l903k954j095L92R56J193J482J492R38j93j969m209
$$ 377498 371922 367706 363833 359930 356976 355881 356273 357229 358422 359904 361396 362334 362141 360172 355963
57800C55963o161p319q087q741q605p343o250o705q046q486p637o593n967n471
$$ 355963 349802 342483 334396 325655 317050 309707 303457 296752 288706 280220 272583 265990 260023 254552
57786B54552n112n096m789l398j562o74q00q11l92k20k76K40J208J550J050O35
$$ 254552 249440 244344 239555 236157 234595 233921 233121 232310 231918 231698 231422 231662 232870 234420 235470 236105
57770B36105O78O74P90J970M047N466N465N072N310N792N799N517N388N318N114
$$ 236105 236783 237457 238247 240217 244264 249730 255195 260267 265577 271369 277168 282685 288073 293391 298505
57755B98505M906M593L723K303R48n4r55j690j787j396j439k386l687m680n221
$$ 298505 303411 308004 311727 314030 314978 314924 313969 312279 310492 309096 307657 305271 301584 296904 291683
57740B91683n275m750l975l516l366l080k667k452k167j186K71J239J364J224
$$ 291683 286408 281658 277683 274167 270801 267721 265054 262602 260435 259249 259520 260759 262123 263347
57726B63347J283J520K030K924L631L408K536J971J871J640J272J292J401O76
$$ 263347 264630 266150 268180 271104 274735 278143 280679 282650 284521 286161 287433 288725 290126 290802
57712B90802o90j346p69L3K25J90M51P25O30L66K24K63O71J572K404K484K182
$$ 290802 290112 288766 287997 288030 288255 288445 288896 289621 290251 290617 290841 291104 291775 293347 295751 298235 300417
57695C00417K470L384M095M349M500M224K834Q54l85q89j922l601m384l533k081
$$ 300417 302887 306271 310366 314715 319215 323439 326273 327127 326742 325853 323931 320330 315946 312413 310332
57680C10332p32J369M820Q671J1986J5174J8754K2327K5907L0860L8199M7234
$$ 310332 309600 310969 315789 324460 336446 351620 370374 392701 418608 449468 487667 534901
57668E34901N7035O7913P9914R0695R6146R2526P7579N1189J6637j9673n1442
$$ 534901 591936 659849 739763 830458 926604 1019130 1096709 1147898 1164535 1144862 1093420
57657A093420p5336r0382r6121r2974q3523p1481n9370m8112l8353l0739k5086
$$ 1093420 1018084 927702 831581 738607 655084 583603 524233 476121 437768 407029 381943
57646C81943k0505j6467j3061j0369q291o796n746m733l603k781k567k576k318
$$ 381943 361438 344971 331910 321541 313250 306454 300708 295975 292372 289591 287024 284448 282130
57633B82130j828j205k39R26J472R92K44P8K04k03j201k203k930l393l356k631
$$ 282130 280302 279097 278858 279784 281256 282248 282492 282570 282774 282571 281370 279167 276237 272844 269488 266857
57617B66857j683j234j442j952k492k872k834k334j726j323j144j254j779k358
$$ 266857 265174 263940 262498 260546 258054 255182 252348 250014 248288 246965 245821 244567 242788 240430
57603B40430k320j697j262j220q24J99R43O84m7n58j140k137k876k668k174k508
$$ 240430 238110 236413 235151 233931 233107 233306 234249 234933 234886 234328 233188 231051 228175 225507 223333 220825
57587B20825l527m197m205m033l752k960j792r50o39m18j07p5n88j436k265k798
$$ 220825 217298 213101 208896 204863 201111 198151 196359 195409 194770 194352 194245 194170 193582 192146 189881 187083
57571A87083k848k560k416k594k567j859q28k75m74j095j710j953j583q76n90
$$ 187083 184235 181675 179259 176665 174098 172239 171411 171136 170662 169567 167857 165904 164321 163445 162855
57556A62855j086j788j916j332l76O57J469J818J996K590L327L064J448k58p56
$$ 162855 161769 159981 158065 156733 156357 157014 158483 160301 162297 164887 168214 171278 172726 172468 171712
57541A71712k83K25O77J462K254K391J989J651J400R49N54O01O48K4r52j388j217
$$ 171712 171429 171654 172331 173793 176047 178438 180427 182078 183478 184427 184981 185582 186230 186254 185302 183914 182697
57524A82697j067r71m05M07N40j07m05N24K219L622M156L804K842J791J215J248
$$ 182697 181630 180659 180254 180661 181201 181094 180689 181213 183432 187054 191210 195014 197856 199647 200862 202110
57508B02110J617K084K493K487J766O36k82q78j575k449k923k611j965j837k547
$$ 202110 203727 205811 208304 210791 212557 213193 212911 212033 210458 208009 205086 202475 200510 198673 196126
57493A96126l547l960l400k334j592j510j712j736j485j031l94K50N82N24K77
$$ 196126 192579 188619 185219 182885 181293 179783 178071 176335 174850 173819 173425 173675 174257 174781 175058
57478A75058j56r53j860k182j659p53Q8Q33J273R22j05q33o76j17K32N01Q88J009
$$ 175058 174902 173949 172089 169907 168248 167495 167583 168416 169689 170611 170506 169673 168997 168880 169112 169613 170501 171510
57460A71510O20K05J52R6j42Q8J120K037K001J621J858K347K129J455J337J711
$$ 171510 172130 172335 172487 172583 172441 172529 173649 175686 177687 179308 181166 183513 185642 187097 188434 190145
57444A90145J562P39J92L86P18P26O98Q82J059J158J418J790J945J882J851J689
$$ 190145 191707 192446 192638 193024 193742 194468 195166 196048 197107 198265 199683 201473 203418 205300 207151 208840
57428B08840J055K83J51P02J096P83Q5l97m19k6N40Q75Q11P30J002J390J549J688
$$ 208840 209895 210178 210329 211031 212127 212910 212995 212598 212179 212153 212693 213568 214379 215109 216111 217501 219050 220738
57410B20738K087K324J843R70N45P36J065J332J667J841J485Q61O14Q30J090J333
$$ 220738 222825 225149 226992 227962 228507 229243 230308 231640 233307 235148 236633 237494 238108 238938 240028 241361
57394B41361J816K388K571K246J585O06m33o98K63J583K152K167K463K802K251
$$ 241361 243177 245565 248136 250382 251967 252573 252140 251442 251705 253288 255440 257607 260070 262872 265123
57379B65123J089O80J374K042J917J495J172M60q34j778j464j90J109J936K213
$$ 265123 266212 266892 268266 270308 272225 273720 274892 275352 274518 272740 271276 271086 272195 274131 276344
57364B76344J914J260Q21J009J696K444K759K302J390J051J860K942K997K068
$$ 276344 278258 279518 280339 281348 283044 285488 288247 290549 291939 292990 294850 297792 300789 302857
57350C02857J408J656K275K726L110L517L792M048M506M745M132L065K701L286
$$ 302857 304265 305921 308196 310922 314032 317549 321341 325389 329895 334640 338772 341837 344538 347824
57336C47824L903M045M221M707M917M467L861L615L559L466L469L547L388L115
$$ 347824 351727 355772 359993 364700 369617 374084 377945 381560 385119 388585 392054 395601 398989 402104
57322D02104L270L885M335M384M384M325L776L018K990L739M089L430K689K823
$$ 402104 405374 409259 413594 417978 422362 426687 430463 433481 436471 440210 444299 447729 450418 453241
57308D53241L490L956M338N051N665N368M171K958K555L049L798L987L527L299
$$ 453241 456731 460687 465025 470076 475741 481109 485280 488238 490793 493842 497640 501627 505154 508453
57294E08453L995N032N440N420N890O664O650N864N664O622P732Q217Q580R213
$$ 508453 512448 517480 522920 528340 534230 540894 547544 553408 559072 565694 573426 581643 590223 599436
57280E99436R498R190R215J0123J0989J0951J0677J1221J2326J3002J2999J2728
$$ 599436 608934 618124 627339 637462 648451 659402 670079 681300 693626 706628 719627 732355
57268G32355J2318J1688J0932J0066R038Q371Q809R951J0399R871R713J0607J1269
$$ 732355 744673 756361 767293 777359 786397 794768 803577 813528 823927 833798 843511 854118 865387
57255H65387J0489R076Q475Q763R335J0287J1612J2202J1379J0444J1018J2556
$$ 865387 875876 884952 893427 902190 911525 921812 933424 945626 957005 967449 978467 991023
57243I91023J3314J3068J3065J3676J4007J3690J3417J3640J4150J4974J6343
$$ 991023 1004337 1017405 1030470 1044146 1058153 1071843 1085260 1098900 1113050 1128024 1144367
57232A144367J7766J8403J8311J8275J8450J8330J7980J8078J8760J9495K0089
$$ 1144367 1162133 1180536 1198847 1217122 1235572 1253902 1271882 1289960 1308720 1328215 1348304
57221A348304K0768K1287K1135K0613K0718K1735K2888K3432K3357K2989K2677
$$ 1348304 1369072 1390359 1411494 1432107 1452825 1474560 1497448 1520880 1544237 1567226 1589903
57210A589903K2846K3560K4214K4324K4346K4902K5560K5505K5049K5328K6555
$$ 1589903 1612749 1636309 1660523 1684847 1709193 1734095 1759655 1785160 1810209 1835537 1862092
57199A862092K7720K8098K7959K7713K7355K6886K6440K5867K4966K4108K3886
$$ 1862092 1889812 1917910 1945869 1973582 2000937 2027823 2054263 2080130 2105096 2129204 2153090
57188B153090K4224K4592K4909K5357K5579K5106K4432K4522K5297K5761K5538
$$ 2153090 2177314 2201906 2226815 2252172 2277751 2302857 2327289 2351811 2377108 2402869 2428407
57177B428407K5204K5038K4652K3986K3493K3159K2518K1835K2036K3108K3841
$$ 2428407 2453611 2478649 2503301 2527287 2550780 2573939 2596457 2618292 2640328 2663436 2687277
57166B687277K3658K3511K4277K5402K5912K5923K6111K6381K6033K4981K3919
$$ 2687277 2710935 2734446 2758723 2784125 2810037 2835960 2862071 2888452 2914485 2939466 2963385
57155B963385K3369K3095K2485K1172J9261J7108J4892J2475R870P620O284N696
$$ 2963385 2986754 3009849 3032334 3053506 3072767 3089875 3104767 3117242 3127112 3134732 3141016 3146712
57143C146712N140M309L573L374L702M181M309L810L030K741L125L322K557J300
$$ 3146712 3151852 3156161 3159734 3163108 3166810 3170991 3175300 3179110 3182140 3184881 3188006 3191328 3193885 3195185
57129C195185N95O66R69J254J639J869J652J631K896N549Q689J1918J5721K0325
$$ 3195185 3195780 3196446 3197415 3198669 3200308 3202177 3203829 3205460 3208356 3213905 3222594 3234512 3250233 3270558
57115C270558K5191K9914L4679L9582M4499M9941N7144O6939P9287R4158J12105
$$ 3270558 3295749 3325663 3360342 3399924 3444423 3494364 3551508 3618447 3697734 3791892 3903997
57104C903997J33680J59127J89006K24309K65581L12500L64541M21541M83430
$$ 3903997 4037677 4196804 4385810 4610119 4875700 5188200 5552741 5974282 6457712
57095F457712N50038O21040O95393P70755Q44224R13647R77557J034067J080670
$$ 6457712 7007750 7628790 8324183 9094938 9939162 10852809 11830366 12864433 13945103
57086A3945103J114683J132606J129395J099136J034961R26305P59404N28650
$$ 13945103 15059786 16192392 17321787 18420923 19455884 20382189 21141593 21670243
57078B1670243K52399k6116k61088m32056n51783o49497p48123q53839r59403
$$ 21670243 21922642 21896526 21635438 21203382 20651599 20002102 19253979 18400140 17440737
57069A7440737j052202j120595j157571j161950j137264j089351j024366r47952
$$ 17440737 16388535 15267940 14110369 12948419 11811155 10721804 9697438 8749486
57061H749486q65191p80603o97898o19554n46930m80805m21659l69439l23603
$$ 8749486 7884295 7103692 6405794 5786240 5239310 4758505 4336846 3967407 3643804
57052C643804k83717k49652k20955j96484j75122j56574j41055j28455j18241
$$ 3643804 3360087 3110435 2889480 2692996 2517874 2361300 2220245 2091790 1973549
57043A973549j09979j03381r7911r2813q7617q2460p7728p3522o9430o4842n9478
$$ 1973549 1863570 1760189 1662278 1569465 1481848 1399388 1321660 1248138 1178708 1113866 1054388
57032A054388n3597m7644m1868l6320l1000k5801k0454j4738q545j678N932J3830
$$ 1054388 1000791 953147 911279 874959 843959 818158 797704 782966 774421 772743 778675 792505
57020G92505K1682L0594M2706N8791P7282R6242J14227J27234J26831J05298O3503
$$ 792505 814187 844781 887487 946278 1023560 1119802 1234029 1361263 1488094 1593392 1656895
57009A656895J1337m0006q3963j17136j36370j40379j32289j17660j00606q3360
$$ 1656895 1668232 1628226 1544263 1427127 1290757 1150378 1018089 900429 799823 716463
56999G16463o8146n6685m8288m0683l3028k6444k1685j7939j4275j0859q298o699
$$ 716463 648317 591632 543344 502661 469633 443189 421504 403565 389290 378431 370133 363434
56987C63434n673m635l047r89O45J091O42q3j268l451o282q751j0426j1503j1911
$$ 363434 357761 353126 350079 349090 349735 350826 351468 351385 350117 346666 340384 331633 321207 309704 297793
56972B97793j1421j0433r637q878p389n183l173j877r19J38J418L298O240R815
$$ 297793 286372 275939 266302 257424 250035 244852 241679 239802 238883 239021 240439 243737 249977 259792
56958B59792J2751J4388J5195J5443J4270J0753N421p9m636q432j1977j4852j5866
$$ 259792 272543 286931 302126 317569 331839 342592 348013 347934 343298 334866 322889 308037 292171
56945B92171j4531j1931r678q113o333l935j719k21J360L906O926R434J1543J4019
$$ 292171 277640 265709 256031 247918 241585 237650 235931 235710 237070 240976 247902 257336 268879 282898
56931B82898J6702J8601J9159J8201J4943Q637K52p883j4322j9188k2587k3854
$$ 282898 299600 318201 337360 355561 370504 379141 379393 371510 357188 338000 315413 291559
56919B91559k2897k0895j8895j6664j3748j0734q685p834p540p044n873m104k640
$$ 291559 268662 247767 228872 212208 198460 187726 179041 171207 163667 156623 150750 146646 144006
56906A44006k540l563m140l304j914j282j364j157l08P19J744L079M645N825O453
$$ 144006 141466 137903 133763 130459 128545 127263 125899 124742 124434 125153 126897 129976 134621 140446 146899
56891A46899P218Q768J0844J2717J4222J5894J8011J9746J9608J6894J2461P858
$$ 146899 154117 162885 173729 186446 200668 216562 234573 254319 273927 290821 303282 311140
56879C11140L849J80l327o071p264o813n234l092p47J549L695N812Q132J0904
$$ 311140 314989 315169 311842 305771 298507 291694 286460 283368 282621 284170 287865 293677 301809 312713
56865C12713J4381J8642K3318K7807L1865L5728L9342M1748M1370L6907K8011
$$ 312713 327094 345736 369054 396861 428726 464454 503796 545544 586914 623821 651832
56854F51832J5553J528j1587k1861k8458l1339l0816k7556k2666j7227j1685n862
$$ 651832 667385 668913 657326 635465 607007 575668 544852 517296 494630 477403 465718 459856
56842D59856M49P057J3527J9641K5694L2329M0014M8532N6908O3703O7272O5869
$$ 459856 460305 467362 480889 500530 526224 558553 598567 647099 704007 767710 834982 900851
56830I00851N7917M2804K1784j908k4263m2348n5136o2692o4991o2073n5078m6238
$$ 900851 958768 1001572 1023356 1021448 997185 954837 899701 837009 772018 709945 654867 608629
56818F08629l7369k8889k0604j2815o026K9O307J3423K1168K8951L6197M2305
$$ 608629 571260 542371 521767 508952 502926 502955 509262 522685 543853 572804 609001 651306
56806F51306M6452M7465M3824L4362J9512J614j6338l2116m4282n1742n4191n2633
$$ 651306 697758 745223 789047 823409 842921 844535 828197 796081 751799 700057 645866 593233
56794E93233m8565m2788l5730k8485k2359j7426j2568p131j627L359P923J2247
$$ 593233 544668 501880 466150 437665 415306 397880 385312 378181 376554 379913 387836 400083
56782D00083J6036J9088K1554K3094K2365J8032J0127Q2j0216j9248k6203l0890
$$ 400083 416119 435207 456761 479855 502220 520252 530379 530461 520245 500997 474794 443904
56770D43904l3308l3340l1206k7966k4881k2287j9700j6961j4507j2493j0584
$$ 443904 410596 377256 346050 318084 293203 270916 251216 234255 219748 207255 196671
56759A96671q792p649p177o622n551m421l624k866k077j965k847l724l438k204
$$ 196671 187879 180230 173053 166431 160880 156459 152835 149969 147892 145927 143080 139356 135918 133714
56745A33714j106n41j17K82L71J96J68K76O3n90j248j504j354r83o15m99n93m08
$$ 133714 132608 132067 131950 132232 132603 132799 132967 133243 133306 132716 131468 129964 128610 127627 127012 126513 125920 125512
56727A25512L94J405J917J800J445J025L99l05o66n46k17R4L62M68L30K91P95
$$ 125512 125906 127311 129228 131028 132473 133498 133897 133592 132926 132380 132163 132257 132619 133087 133417 133708 134503
56710A34503J558J701R70K51M62J307J623P74p14j802j833q42O01J692J865J197
$$ 134503 136061 137762 138732 138983 139445 140752 142375 143149 142435 140633 138800 137958 138559 140251 142116 143313
56694A43313K74m26q84j167j020k37P32J114Q23N59O41M38m88j328j004J21N84
$$ 143313 143587 143161 142277 141110 140090 139853 140585 141699 142522 143081 143722 144160 143672 142344 141340 141461 142045
56677A42045p5o69j76P60P94k87j436j724j204n00j38k54o14q66q65p56o98p34
$$ 142045 141970 141301 141125 141885 142679 142392 140956 139232 138028 137528 137390 137136 136522 135656 134791 134035 133337 132603
56659A32603r24j299j557j264n11k1l10j091j698j814j578j283j178j277j221
$$ 132603 131679 130380 128823 127559 127048 127027 126717 125626 123928 122114 120536 119253 118075 116798 115577
56644A15577o75Q1M38L55L61N24K78l95m99N38J810K187J966K227K938K957J838
$$ 115577 114902 114983 115421 115776 116137 116661 116939 116544 116045 116583 118393 120580 122546 124773 127711 130668 132506
56627A32506N26m1p6l15q88j334j311q59j83N39J168J629J849J750J394R72N60
$$ 132506 133032 132991 132915 132600 131712 130378 129067 128208 128025 128564 129732 131361 133210 134960 136354 137326 137886
56610A37886Np04j121p42L54J590K519L109L535L872M028L733K771J402L54J08
$$ 137886 137891 137187 136066 135324 135678 137268 139787 142896 146431 150303 154331 158064 160835 162237 162591 162699
56594A62699L84O09O16N52M07J53J62Q52J912K446K040J200N79K27j20l91k52
$$ 162699 163083 163692 164308 164860 165267 165420 165582 166434 168346 170792 172832 174032 174611 174838 174718 174327 174075
56577A74075K67O66O42N56R13J529J623R52L48P00J796K710L072L247L378L221
$$ 174075 174342 175008 175650 176206 177119 178648 180271 181223 181571 182271 184067 186777 189849 193096 196474 199695
56561A99695K994L393M474N451N978O658P658P862O407M197K830K564K478K144
$$ 199695 202689 206082 210556 216007 221985 228643 236301 244163 250570 254767 257597 260161 262639 264783
56547B64783J909J778J277M85K0o1l65j006j382j251j126j312j425j253j216j618
$$ 264783 266692 268470 269747 270232 270252 270191 269826 268820 267438 266187 265061 263749 262324 261071 259855 258237
56531B58237k142k489k837l257l367k989k588k613k926l306l892m650m948m336
$$ 258237 256095 253606 250769 247512 244145 241156 238568 235955 233029 229723 225831 221181 216233 211897
56517B11897l336k831k938l055k821k481k383k575k891l121l054k650k113j642
$$ 211897 208561 205730 202792 199737 196916 194435 192052 189477 186586 183465 180411 177761 175648 174006
56503A74006j209o81o9N21R90J165Q14L7n86n17J55Q02R31N51L0k91l57m12o39
$$ 174006 172797 172116 172047 172568 173558 174723 175537 175574 174988 174471 174626 175428 176359 176910 176940 176649 176292 175880 175241
56484A75241q27n28L19J160J383R57L74L1m5P1M46J137J871K167J823J247J062
$$ 175241 174414 173886 174205 175365 176748 177705 178079 178110 178065 178136 178582 179719 181590 183757 185580 186827 187889
56467A87889J461K055K377K308J975J513J078Q78R29R73Q62Q31J112J490J540
$$ 187889 189350 191405 193782 196090 198065 199578 200656 201534 202463 203436 204298 205129 206241 207731 209271
56452B09271J250J012J049J151J038O82K61l1j22j27k46m42l88Q3O39P48K47n61
$$ 209271 210521 211533 212582 213733 214771 215453 215714 215683 215561 215434 215188 214746 214358 214441 215080 215828 216075 215514
56434B15514j254j503j198o42l80o41j025j096q97o10n2Q88J626J395L24n61n59
$$ 215514 214260 212757 211559 210917 210537 209896 208871 207775 206878 206268 206216 207104 208730 210125 210449 209888 209329
56417B09329k3K53m6n69p47k59O99J573J988K016J803J230K97m56m39J53N49L95
$$ 209329 209306 209559 209513 208944 208197 207938 208637 210210 212198 214214 216017 217247 217544 217088 216649 216802 217351 217746
56399B17746J05J66N47Q51P38J64m96o85k79J36k3o30j206j725k425l035k889
$$ 217746 217851 218017 218564 219415 220153 220317 219821 219136 218857 218993 218970 218340 217134 215409 212984 209949 207060
56382B07060j903q17k68j04L27J495L366N342O503O318N169L928L140K820K805
$$ 207060 205157 204340 204072 203968 204295 205790 209156 214498 221001 227319 232488 236416 239556 242376 245181
56367B45181K829K457J543N69J03M6j3L5O31J626K253K030J146P3p42r27n48j97
$$ 245181 248010 250467 252010 252579 252682 252728 252715 252750 253381 255007 257260 259290 260436 260509 259767 258840 258292 258095
56349B58095k29j81L58Q22N20j2L22J381J986J848J912K571K920K328J546J527
$$ 258095 257866 257685 258043 258865 259385 259373 259695 261076 263062 264910 266822 269393 272313 274641 276187 277714
56333B77714K085K411K218J726J129N89K77P9k43m09J31J179J831J797J767K157
$$ 277714 279799 282210 284428 286154 287283 287872 288149 288228 287985 287576 287707 288886 290717 292514 294281 296438
56317B96438K419K034J324P74L63j3k26l65p17r37l12Q08J078K22k75O30J900
$$ 296438 298857 300891 302215 302989 303352 303339 303113 302748 302031 301094 300782 301590 302668 302890 302615 303245 305145
56300C05145K167J921K514L746M137L217K089J686J736J606J156N10k57r33j185
$$ 305145 307312 309233 311747 315493 319630 322847 324936 326622 328358 329964 331120 331630 331373 330440 329255
56285C29255q70j9J268K652L482L487L227L407L961M316M328M355M638N044N337
$$ 329255 328385 328366 329634 332286 335768 339255 342482 345889 349850 354166 358494 362849 367487 372531 377868
56270C77868N312M846M148L764M100N046O156O934O919O154N542O042P336Q112
$$ 377868 383180 388026 392174 395938 400038 405084 411240 418174 425093 431247 436789 442831 450167 458279
56256D58279P887P586P975Q685R343J0515J2578J4735J6209J7635K0044K3175
$$ 458279 466166 473752 481727 490412 499755 510270 522848 537583 553792 571427 591471 614646
56244F14646K6003K8386L0953L3747L6202L8249M0226M1853M2454M2110M1545
$$ 614646 640649 669035 699988 733735 769937 808186 848412 890265 932719 974829 1016374
56233A016374M0788L8913L5251L0056K3891J7133J0179L395l245r973j6579k2447
$$ 1016374 1057162 1096075 1131326 1161382 1185273 1202406 1212585 1215980 1212735 1202762 1186183 1163736
56221A163736k7173l0696l2990l4178l4790l5281l5442l4820l3563l2256l1056
$$ 1163736 1136563 1105867 1072877 1038699 1003909 968628 933186 898366 864803 832547 801491
56210H01491k9589k7594k5178k2565k0031j7928j6349j4944j3459j2167j1337
$$ 801491 771902 744308 719130 696565 676534 658606 642257 627313 613854 601687 590350
56199E90350j0652r659q448p363o414n482m755m365l910k962j780j003q52j035
$$ 590350 579698 570039 561591 554228 547814 542332 537577 533212 529302 526340 524560 523557 522705 521670
56185E21670j146q46p5O30O39K62N13J461J876J081J17J42P23Q54P34J228K189
$$ 521670 520524 519678 519603 520233 520872 521134 521647 523108 524984 526065 526182 526324 527047 527901 528635 529863 532052
56168E32052K706K648K657K888K866K494K245K515L429M905O240O333N165M318
$$ 532052 534758 537406 540063 542951 545817 548311 550556 553071 556500 561405 567645 573978 579143 583461
56154E83461N036O555P389P453P601P984Q263Q829J0105J1280J1341J1003J1848
$$ 583461 588497 595052 602441 609894 617495 625479 633742 642571 652676 663956 675297 686300 698148
56141F98148J3895J5752J6948J8324K0115K1495K2251K3252K5034K7334L0283
$$ 698148 712043 727795 744743 763067 783182 804677 826928 850180 875214 902548 932831
56130I32831L4583M0204M6346N2987O1113P1067Q1847R2258J01445J08014J10110
$$ 932831 967414 1007618 1053964 1106951 1168064 1239131 1320978 1413236 1514681 1622695 1732805
56119A732805J06952R9418Q8804P6082O2654N0639M1685L5932L2201K8535K2891
$$ 1732805 1839757 1939175 2027979 2104061 2166715 2217354 2259039 2294971 2327172 2355707 2378598
56108B378598J4431M325n337j3333j9469k3739k6643k9928l5600m4277n5302o7810
$$ 2378598 2393029 2397354 2392017 2378684 2359215 2335476 2308833 2278905 2243305 2199028 2143726 2075916
56096B075916q0298q9965r4413r3807q9868q3238p3713o2540n2122m3331l5182
$$ 2075916 1995618 1905653 1811240 1717433 1627565 1544327 1470614 1408074 1355952 1312621 1277439
56085A277439k7328k0806j5978j1863p969m888k621j58K682M854O040P223Q741
$$ 1277439 1250111 1229305 1213327 1201464 1193495 1188607 1185986 1185828 1188510 1193364 1199404 1206627 1215368
56072A215368R644R705J0258J2171J4501J6070J6987J7830J8568J9110J9802K0793
$$ 1215368 1225012 1234717 1244975 1257146 1271647 1287717 1304704 1322534 1341102 1360212 1380014 1400807
56060A400807K1863K3059K4402K5010K3866K1556J9776J9041J8443J7582J7051
$$ 1400807 1422670 1445729 1470131 1495141 1519007 1540563 1560339 1579380 1597823 1615405 1632456
56049A632456J6933J6687J6645J7813J9991K1819K2826K3686K4595K5320K6549
$$ 1632456 1649389 1666076 1682721 1700534 1720525 1742344 1765170 1788856 1813451 1838771 1865320
56038A865320K9045L1659L2652L2701L4008L6540L8156L8427L9158M0866M2050
$$ 1865320 1894365 1926024 1958676 1991377 2025385 2061925 2100081 2138508 2177666 2218532 2260582
56027B260582M2612M4519M8146N1281N2938N4841N7915O0548O1881O3615O6858
$$ 2260582 2303194 2347713 2395859 2447140 2500078 2554919 2612834 2673382 2735263 2798878 2865736
56016B865736P0074P1977P3730P6574P9832Q2881Q6583R1267R5789R9877J04826
$$ 2865736 2935810 3007787 3081517 3158091 3237923 3320804 3407387 3498654 3594443 3694320 3799146
56005C799146J10732J15882J20024J25299J32647J40429J47724J55743J64804
$$ 3799146 3909878 4025760 4145784 4271083 4403730 4544159 4691883 4847626 5012430
55996E012430J73453J81892J92543K05817K19112K31492K45318K61713K78691
$$ 5012430 5185883 5367775 5560318 5766135 5985247 6216739 6462057 6723770 7002461
55987G002461K95487L14335L36167L59135L83195M11259M43896M78158N13798
$$ 7002461 7297948 7612283 7948450 8307585 8690780 9102039 9545935 10024093 10537891
55978A0537891N55041O03863O57582P15775P83256Q63115R53383J054065J170749
$$ 10537891 11092932 11696795 12354377 13070152 13853408 14716523 15669906 16723971 17894720
55969A7894720J307872J465847J648726J866976K128465K435179K793685L220201
$$ 17894720 19202592 20668439 22317165 24184141 26312606 28747785 31541470 34761671
55961C4761671L730698M335771N049973N894487O884012Q023601R326933J0827805
$$ 34761671 38492369 42828140 47878113 53772600 60656612 68680213 78007146 88834951
55953H8834951J2571025J4608824J7006464J9815201K3007317K6425523K9741802
$$ 88834951 101405976 116014800 133021264 152836465 175843782 202269305 232011107
55946B32011107L2349782L3255655L1251652K5515387J6263244M844101o869301
$$ 232011107 264360889 297616544 328868196 354383583 370646827 375490928 368621627
55939C68621627j7258758k5323541l0604942l3043187l2952291l0969801k7862038
$$ 368621627 351362869 326039328 295434386 262391199 229438908 198469107 170607069
55932A70607069k4298178k0746762j7487678j4650581j2253580j0256761q608940
$$ 170607069 146308891 125562129 108074451 93423870 81170290 70913529 62304589
55925F2304589p259463o153693n241357m487352l865534l348762k913541k547054
$$ 62304589 55045126 48891433 43650076 39162724 35297190 31948428 29034887 26487833
55917B6487833k240589j981285j757183j564112j400335j259447j134721j025187
$$ 26487833 24247244 22265959 20508776 18944664 17544329 16284882 15150161 14124974
55909A4124974r31260q48968p74045p07203o49861n98881n50575n06051m67594
$$ 14124974 13193714 12344746 11570701 10863498 10213637 9614756 9064181 8558130 8090536
55900H090536m33418m00598l69838l42833l18054k93382k70050k50106k32574
$$ 8090536 7657118 7256520 6886682 6543849 6225795 5932413 5662363 5412257 5179683
55891E179683k15666j99990j86298j72818j58187j44221j32681j21967j10061
$$ 5179683 4964017 4764027 4577729 4404911 4246724 4102503 3969822 3847855 3737794
55882C737794r7914q6758p4913o0526m5003l0632j7326m846M230P113M236l015
$$ 3737794 3639880 3553122 3478209 3417683 3372680 3342048 3324722 3319876 3324106 3331219 3335455 3332440
55870C332440j5725l5288n9581q4394j06997j25659j37733j41600j39129j33264
$$ 3332440 3316715 3281427 3221846 3137452 3030455 2904796 2767063 2625463 2486334 2353070
55860B353070j24565j12746r9941q9214q0859p3031o5268n8678n3457m8700m4225
$$ 2353070 2228505 2115759 2015818 1926604 1845745 1772714 1707446 1648768 1595311 1546611 1502386
55849A502386m0545l7558l4994l3304l2623l1898l0546k9609k9710k9462k7671
$$ 1502386 1461841 1424283 1389289 1355985 1323362 1291464 1260918 1231309 1201599 1172137 1144466
55838A144466k5550k4656k4259k2875k1042k0198j9982j9023j7395j6176j5396
$$ 1144466 1118916 1094260 1070001 1047126 1026084 1005886 985904 966881 949486 933310 917914
55827I17914j4471j3800j3958j4212j3726j3195j3461j3624j2610j1433j1708
$$ 917914 903443 889643 875685 861473 847747 834552 821091 807467 794857 783424 771716
55816G71716j2832j2946j1916j1072j0645r736q304p138o185m986m219m829n950
$$ 771716 758884 745938 734022 722950 712305 702569 694265 687127 680942 675956 671737 666908 660958
55803F60958n742m001k113p06O51J788J916J278J014J357J420P34m22k006m037
$$ 660958 655216 651215 649102 648396 649047 650835 652751 654029 655043 656400 657820 658554 658132 656126 652089
55788F52089n783o535o868p705q507q041o495n280n031n422o596q915j1545j3031
$$ 652089 646306 639771 632903 625198 616691 608650 602155 596875 591844 586422 579826 570911 559366 546335
55774E46335j3223j2917j1889r130n080j580P04K907N533P165O372L581K66k643
$$ 546335 533112 520195 508306 499176 494096 492516 493220 496127 501660 508825 515197 518778 519044 516401
55760E16401m922o573p790q744r131q599p676p428q034q585q454q053q049q522
$$ 516401 511479 504906 497116 488372 479241 470642 462966 455538 447504 438919 430465 422412 414363 405841
55746D05841r102r368r005q095p149o471n777m917m361m261l714k071l57j58j343
$$ 405841 396739 387371 378366 370271 363122 356651 350874 345957 341596 337335 333621 331550 331193 331035 329692
55731C29692k280k132j678j776k282k765l276m050n086o206o988o807n578m251
$$ 329692 327412 325280 323602 321826 319544 316779 313503 309453 304367 298161 291173 284366 278788 274537
55717B74537l837m152m200l524k417j156Q6R19J223J639K720L906M244L739L040
$$ 274537 270700 266548 262348 258824 256407 255251 255337 256256 257479 259118 261838 265744 269988 273727 276767
55702B76767K217R11o62j938k956m029m841n011n056n593o045n482m334l722l489
$$ 276767 278984 279895 279233 277295 274339 270310 265469 260458 255402 249809 243764 238282 233948 230226 226737
55687B26737k565j152o62j302j588o57N10Q69P93J082J655K000J986J541M13j229
$$ 226737 224172 223020 222358 221056 219468 218811 219321 220190 220983 222065 223720 225720 227706 229247 229660 228431
55671B28431k698l636m288m682m424l562k774k374j928j136l19J73K91l8p27r84
$$ 228431 225733 222097 217809 213127 208703 205141 202367 199993 198065 196929 196610 196783 197074 197036 196309 195325
55655A95325L4J909L293L714L922M353M392L643K677K023J408N59k06o85j242
$$ 195325 195359 197268 200561 204275 208197 212550 216942 220585 223262 225285 226693 227252 227046 226361 225119
55640B25119k018k573k744k993l470l622l281l136l572l914l533k862k538k333
$$ 225119 223101 220528 217784 214791 211321 207699 204418 201282 197710 193796 190263 187401 184863 182530
55626A82530j729j013q83j343j667j302l47O94J259J147P60N98M34l33j459j753
$$ 182530 180801 179788 178905 177562 175895 174593 174246 174940 176199 177346 178106 178704 179138 178805 177346 175593
55610A75593o85O52P74m63j887k491k387k414l075l830l599k141o22k51p50r24
$$ 175593 174908 175560 176334 175871 173984 171493 169106 166692 163617 159787 156188 154047 153425 153174 152424 151500
55594A51500m84j97l65l81nJ02m59j160j486j586j566j050%R32J345J683K342
$$ 151500 151016 150819 150454 150073 150068 150170 149711 148551 147065 145479 143913 142863 142863 143795 145140 146823 149165
55577A49165L039L473L819M113M074M029M969P032Q896R479R320R359R275Q146
$$ 149165 152204 155677 159496 163609 167683 171712 176681 183713 192609 202088 211408 220767 230042 238188
55563B38188O051L819J639q93l585n633o717p356q086q968r788j0226r958r091
$$ 238188 244239 248058 249697 248804 245219 239586 232869 225513 217427 208459 198671 188445 178487 169396
55549A69396q313q107q031p275n721l983k649j982j969k212k002j072k8L91K35
$$ 169396 161083 152976 144945 137670 131949 127966 125317 123335 121366 119154 117152 116080 116052 116443 116678
55534A16678K4j17l72n88l64J82M25np32j067o41K64R01P06j16q64j199j274r71
$$ 116678 116702 116585 116213 115625 115261 115443 115868 115863 115131 114064 113423 113687 114588 115294 115178 114314 113115 111841 110870
55515A10870K52K410M525N634N775N478M811L602K055M99j206l251n103n955n834
$$ 110870 111122 113532 118057 123691 129466 134944 139755 143357 145412 145911 144705 141454 136351 130396 124562
55500A24562n544n464n024l645j727l68k50r31j288o76M40J095R46M38L1k09k69
$$ 124562 119018 113554 108530 104885 103158 102790 102540 101609 100321 99645 100085 101180 102126 102564 102595 102386 102117
55483A02117o0K09J08k72l05J94O39O20M38L69J58j85L3J003J627R18l92p90j73
$$ 102117 102057 102266 102374 102102 101797 101991 102630 103250 103688 104057 104215 104030 104063 105066 106693 107611 107219 106429 106256
55464A06256J68l15o75j18P00P66L14N07J733K937K822J322l37r80o40k77n13
$$ 106256 106424 106109 105434 105316 106016 106782 107096 107603 109336 112273 115095 116417 116080 115100 114460 114183 113670
55447A13670r73q70L2J189J795J424L51o68j083j050j036j102r89o77m37l07j12
$$ 113670 112697 111827 111859 113048 114843 116267 116618 115950 114867 113817 112781 111679 110690 110013 109576 109269 109157
55430A09157K4j33k61K12J062J419J144J145J901K584K272J272N83O62J337K291
$$ 109157 109181 109048 108787 108999 110061 111480 112624 113769 115670 118254 120526 121798 122381 123043 124380 126671
55414A26671L063L185K905L113M020M568L859K388J096q8j711l426m308m251m005
$$ 126671 129734 132919 135824 138937 142957 147525 151384 153772 154868 154780 153069 149643 145335 141084 137079
55399A37079l967l842l418k879k410k092k087k353k435k075j691j668j679j333
$$ 137079 133112 129270 125852 122973 120563 118471 116384 114031 111596 109521 107830 106162 104483 103150
55385A03150r85j034r72j25J049J495J129Q07Q76Q83O40M72L29k96j324j927j693
$$ 103150 102165 101131 100159 100034 101083 102578 103707 104514 105390 106273 106913 107385 107714 107418 106094 104167 102474
55368A02474j158r52j054j108q72k79L97M89l04j206j110pJ116J628J675J355
$$ 102474 101316 100364 99310 98202 97330 97051 97448 97937 97633 96427 95317 95310 96426 98054 99729 101084
55352A01084N50l14m15K50O93L35k30k35K62P97J164J201O33m11j176j088m21
$$ 101084 101634 101320 100905 101155 101848 102183 101953 101718 101980 102777 103941 105142 105775 105364 104188 103100 102679
55335A02679J10J01m18j161j603j278k82P76J441J689J557J016L24n3L4K69L76
$$ 102679 102789 102890 102472 101311 99708 98430 98148 98924 100365 102054 103611 104627 104951 104898 104932 105201 105577
55318A05577L21J07j90k50M6J88l16r80q87j32K50r9l46J16P49Q34N40L65K23
$$ 105577 105898 106005 105815 105565 105611 105799 105483 104503 103616 103484 103734 103635 103289 103405 104154 104988 105528 105893 106116
55299A06116k04o91o90j19M76M27n29j864k424j491J71R76M04m60m34M47J463
$$ 106116 105912 105221 104531 104412 104888 105315 104786 102922 100498 99007 99178 100154 100558 100098 99664 100111 101574
55282A01574K189K440J938P02o11j298j228o18L08J102J191N81J0k0J58J22L0
$$ 101574 103763 106203 108141 108843 108232 106934 105706 105088 105396 106498 107689 108270 108280 108260 108418 108540 108570
55265A08570J17J42r4k32L8L52K45j36m31o98j001r09j16Q71J308J172Q65M27
$$ 108570 108687 108829 108735 108503 108541 108893 109138 109002 108571 107873 106872 105963 105847 106718 108026 109198 110063 110490
55247A10490k20n91r4R94J762J746J085j04j670k891k884j772o11r1N1K05K17
$$ 110490 110270 109679 109585 110579 112341 114087 115172 115068 113398 110507 107623 105851 105240 105149 105200 105405 105622
55230A05622j41o34q59p07l08J97O12P73Q16J015J275J119L87m11o62l31J48M56
$$ 105622 105481 104847 103988 103281 102973 103170 103782 104555 105371 106386 107661 108780 109167 108756 108094 107763 107911 108367
55212A08367O62R11J070P92J0p26o91J14Q30P57J49l30n73q21q12q4R20J031L3
$$ 108367 109029 109940 111010 111802 111812 111086 110395 110509 111339 112096 112245 111915 111342 110521 109709 109625 110545 111576 111609
55193A11609p50k73N91K37j261k100j246J68M59l99j036o77P7M02L25L32N47P13
$$ 111609 110859 110586 111177 111414 110153 108053 106807 106975 107434 107035 105999 105322 105399 105801 106126 106458 107005 107718
55175A07718P11O43O09O23O71O68M83J64n5n0J24M97J164J849J978J443Q02M22
$$ 107718 108429 109072 109681 110304 110975 111643 112126 112290 112235 112185 112309 112806 113970 115819 117797 119240 120042 120464
55157A20464Ko16q05j08P36O51j94p07n60m82q11r68n82j63j26j81j43n14j531
$$ 120464 120466 119850 119045 118937 119673 120324 120130 119423 118863 118381 117570 116602 116020 115857 115731 115550 115407 114893 113362
55138A13362k349j978o54M98P98N20K42K66M96N54J16o26j114j110q54m56K45
$$ 113362 111013 109035 108381 108879 109677 110197 110439 110705 111201 111755 111871 111245 110131 109021 108167 107711 107956
55121A07956R95J085M21o2L35R88Q59j6o81n89k5N87J090J408J491J373R84J75
$$ 107956 108951 110036 110457 110395 110730 111718 112577 112561 111880 111291 111266 111853 112943 114351 115842 117215 118199 118374
55103A18374p68j065m01N28R46J004J181J212N54m54q45l85K31N05O05O71N62
$$ 118374 117606 116541 116140 116668 117614 118618 119799 121011 121565 121111 120266 119881 120112 120617 121222 121893 122455
55086A22455L95N60R43Q82J38o70r14o81l62j19l7l50j013j469j222m92j1k39
$$ 122455 122850 123410 124353 125235 125373 124703 123789 123108 122746 122627 122590 122240 121227 119758 118536 118044 118033 117794
55068A17794r11j321r65m4P09Q33N95N06O22P03P58R18Q91K23q90j673j750j476
$$ 117794 116883 115562 114597 114553 115262 116095 116690 117196 117818 118521 119279 120197 121088 121311 120421 118748 116998 115522
55050A15522j193o88K10J068J245O40k44q16p96l56Jj6q1L47J155J543J047J58
$$ 115522 114329 113641 113851 114919 116164 116804 116560 115744 114948 114592 114593 114577 114496 114843 115998 117541 118588 118746
55032A18746l43k78k7R1L5j25l25m66n40o32o98n19n4L28K70j01l51k64M0M70
$$ 118746 118403 118125 118098 118189 118224 118099 117774 117308 116768 116136 115438 114919 114865 115193 115463 115362 115011 114747 114787 115257
55012A15257J064J683J924J570R40M94J51n31j428j609n22R79J480Q07J95M82
$$ 115257 116321 118004 119928 121498 122438 122932 123083 122552 121124 119515 118993 119972 121452 122259 122454 122936
54996A22936J020Q39R7l23j79L8P6J15J76Q8P8N89J476K044J974J603J182N47
$$ 122936 123956 124795 124892 124569 124390 124428 124504 124619 124795 124883 124961 125550 127026 129070 131044 132647 133829 134376
54978A34376l13r49r89n35J65R07J311J036M05J76M95O55K06m14p26r30j243j196
$$ 134376 134063 133114 132125 131590 131755 132662 133973 135009 135414 135590 136085 136740 136946 136532 135806 134876 133633 132437
54960A32437l67O35Q29K16k56n2M27O38O19O81R15J238J584J833J815J521J098
$$ 132437 132070 132705 133534 133750 133494 133442 133869 134507 135126 135807 136722 137960 139544 141377 143192 144713 145811
54943A45811O36J13m25q04r65j017j038r86q34n81j84L74Q95J076R11Q06J162
$$ 145811 146447 146560 146135 145331 144366 143349 142311 141325 140491 139910 139726 140100 140995 142071 142982 143788 144950
54926A44950J980K926L672M103M294M475M960N882P043Q093Q855R302R212Q178
$$ 144950 146930 149856 153528 157631 161925 166400 171360 177242 184285 192378 201233 210535 219747 227925
54912B27925O161L757J632k05k136m106n575o412p124p951q248p418o026n255
$$ 227925 234086 237843 239475 239270 237134 233028 227453 221041 213917 205966 197718 190300 184274 179019
54898A79019n368n490m939m053l433k948k036o58N04Q41N06K22M87J057J376J402
$$ 179019 173651 168161 163222 159169 155736 152788 150752 150094 150598 151439 151945 152167 152654 153711 155087 156489
54882A56489J714K604L531L856L781M006M649N269N794O656P886Q850R095Q725
$$ 156489 158203 160807 164338 168194 171975 175981 180630 185899 191693 198349 206235 215085 224180 232905
54868B32905P667N440K197q09k581l703n456p959r961j0414r392p569n573m019
$$ 232905 240572 246012 248209 247400 244819 241116 235660 227701 217740 207326 197934 190365 184792 180773
54854A80773l474l852m256l801k569j553j661k802l925m034l211k456k410k591
$$ 180773 177299 173447 169191 165390 162821 161268 159607 156805 152880 148846 145635 143179 140769 138178
54840A38178k213j387q90r16q12j87M68N59L01K85N14M97J49oL01O13L75k08m18
$$ 138178 135965 134578 133688 132772 131960 131773 132241 132800 133101 133386 133900 134397 134546 134540 134841 135454 135829 135621 135203
54821A35203J9O25Q25N83J98k04o45r31p29q1N02O28M56L43L09J38j24j86j7k4
$$ 135203 135222 135847 136672 137255 137453 137249 136604 135673 134944 134863 135365 135993 136449 136792 137101 137239 137115 136929 136912 136888
54801A36888m95j080j074k21R81J744J686R89J48l33j41O57J492J700J121K21
$$ 136888 136393 135313 134239 134018 134999 136743 138429 139418 139566 139233 139092 139749 141241 142941 144062 144283
54785A44283m28o19l97J68Q65J255J079O89P35J366K042K193J829J491J737K704
$$ 144283 143855 143236 142839 143007 143872 145127 146206 146895 147630 148996 151038 153231 155060 156551 158288 160992
54769A60992L972M930N380N708O296O978P434P839Q618R631J0158R802Q831P451
$$ 160992 164964 169894 175274 180982 187278 194256 201690 209529 218147 227778 237936 247738 256569 264020
54755B64020N301K114j588m866p244q846r801r943r121p609o088n209n094n265
$$ 264020 269321 271435 269847 264981 257737 248891 239090 229147 220026 212417 206329 201120 196026 190761
54741A90761n102m368l192j856q08o02j203j622r48K80N98l13j047m09R61J673
$$ 190761 185659 181291 178099 176243 175435 174833 173630 172008 171060 171340 171938 171625 170578 170169 171130 172803
54725A72803J570J680K631M099N615O974P872P978P514P067O733N994M499K330
$$ 172803 174373 176053 178684 182783 188398 195372 203244 211222 218736 225803 232536 238530 243029 245359
54711B45359m52l758o845q556q611q024p815p864p458o473n370m448l670l063
$$ 245359 244907 241149 234304 225748 217137 209113 201298 193434 185976 179503 174133 169685 166015 162952
54697A62952k679k310j716j111r71j280j504j281q44o05o73q97j087j030n81P2
$$ 162952 160273 157963 156247 155136 154165 152885 151381 150100 149256 148651 147978 147081 145994 144964 144383 144455
54681A44455L89L5o65j041q21l77k31m33n59k60K78N63M60M18Q16J260R47j96
$$ 144455 144844 144879 144214 143173 142352 141975 141744 141311 140752 140492 140770 141333 141793 142211 143027 144287 145234 145038
54663A45038j222j348r81j059j578j564n27P70J291R75N04L04K63K09J11o3k71
$$ 145038 143816 142468 141487 140428 138850 137286 136759 137529 138820 139795 140299 140603 140866 141075 141186 141123 140852
54646A40852k27K98J063J576J657J464J136Q34R28J533J986J476K82m11j00L83
$$ 140852 140625 140923 141986 143562 145219 146683 147819 148653 149581 151114 153100 154576 154858 154447 154347 154730
54630A54730K11j87O3P82R12L7j078j513j182o12k52k40n54j006j219r04k14K91
$$ 154730 154941 154754 154817 155599 156511 156548 155470 153957 152775 152163 151911 151671 151117 150111 148892 147988 147774 148065
54612A48065K05k82n48l13Qj05n06n54l8N15N40J23k24k03O1K50J34k43n49n23
$$ 148065 148270 147988 147440 147127 147135 147030 146524 145970 145932 146447 146987 147110 146886 146683 146744 146994 147128 146885 146336 145813
54592A45813k97j10J53P04J159P95l01j051p36Q5M84M34M69O12M65R7m9o6n61
$$ 145813 145516 145406 145559 146263 147422 148217 147916 146865 146129 146214 146698 147132 147601 148213 148678 148775 148726 148660 148099
54573A48099j556k183j762o42L32P36O70L54oj69p2J9j51m44n08l15k32m96p94
$$ 148099 146543 144360 142598 141956 142288 143024 143694 144048 144042 143873 143801 143820 143669 143225 142717 142402 142170 141674 140880
54554A40880n86J97J021J357J205Q79N19J43q2l6ol36p11m24N61J419J553J293
$$ 140880 140294 140491 141512 142869 144074 144953 145472 145615 145533 145497 145491 145155 144444 144020 144581 146000 147553 148846
54536A48846J140J010O35K45K70O46R52R20M99k63j022j202o96n4M12J079K063
$$ 148846 149986 150996 151631 151876 152146 152792 153744 154664 155163 154900 153878 152676 151980 151926 152338 153417 155480
54519A55480K521J719K76o09p57q11q51l82L83M95l17j218j517j368j049m92J33
$$ 155480 158001 159720 159996 159387 158630 157819 156968 156586 156969 157464 157147 155929 154412 153044 151995 151503 151636
54502A51636K52k40p00p32o84p99o29J32Q93Q62O9p69j045n59N02J462J490M97
$$ 151636 151888 151648 150948 150216 149532 148733 148104 148236 149129 149991 150060 149291 148246 147687 148189 149651 151141 151638
54484A51638o41j046o52Q9P86J118Q45K53L1L79P06N73L31L99N39L81J14K3j08
$$ 151638 150997 149951 149299 149388 150174 151292 152137 152390 152421 152800 153506 154079 154410 154809 155348 155729 155843 155866 155758
54465A55758m75o04K0J052J618J346M44p52j724j707n46P07R13K98p5j8k98j077
$$ 155758 155283 154679 154699 155751 157369 158715 159159 158407 156683 154976 154430 155137 156050 156348 156273 156255 155957 154880
54447A54880j440q67j02o3n71p73l58K02L40p2o57q22l25L17L40k40n55o6P19
$$ 154880 153440 152573 152471 152408 151837 151064 150706 150908 151248 151176 150519 149697 149372 149689 150029 149789 149234 149168 149887
54428A49887J020Q25O67O88N33J13p5L82J194J677J534J117R16R80J014R02Q71
$$ 149887 150907 151732 152399 153087 153620 153733 153658 154040 155234 156911 158445 159562 160478 161458 162472 163374 164245
54411A64245J084J300J176P02J13m90j106j496j314o27MJ25j60m19l36J39P47
$$ 164245 165329 166629 167805 168507 168620 168130 167024 165528 164214 163587 163591 163716 163556 163137 162801 162940 163687
54394A63687R86N18k71m84K50J200J414Q78M14N16Q20Q07M68O3l60p59p69m9J068
$$ 163687 164673 165191 164920 164436 164686 165886 167300 168178 168592 169108 169928 170735 171203 171266 170906 170147 169378 169329 170397
54375A70397J759J585Q23j15j091j893k002j197j16K83k14r51j339j437j535j675
$$ 170397 172156 173741 174564 174449 173358 171465 169463 168266 168150 168433 168219 167268 165929 164492 162957 161282
54359A61282j760j809j765j330l32Q38J480J264N49OR5P94J637K008J559M89o00
$$ 161282 159522 157713 155948 154618 154286 155124 156604 157868 158417 158423 158518 159312 160949 162957 164516 165005 164405
54342A64405j183j229j118j077q32%J129J612R68p6m28k4J85l65j112j244p66
$$ 164405 163222 161993 160875 159798 158966 158966 160095 161707 162675 162599 162171 162147 162332 161967 160855 159611 158845
54325A58845k77j07j21j83l30n59p05n96j95L62P97R10Q27Q28R16Q43O08N33O45
$$ 158845 158568 158461 158340 158157 157827 157268 156563 155967 155772 156134 156931 157841 158668 159496 160412 161255 161863 162396 163041
54306A63041M64k65j019j138p34m40m79m95l49m55j117j921k042j101M42J727
$$ 163041 163505 163240 162221 161083 160349 159909 159430 158935 158586 158131 157014 155093 153051 151950 152392 154119
54290A54119K215K002J469Q67L38J41M14P53N39k05p56o94m43m90n57o3Q81J582
$$ 154119 156334 158336 159805 160672 161010 161151 161565 162318 162857 162652 161896 161202 160759 160269 159712 159649 160530 162112
54272A62112J641J241P00J91j35k28k49l03j68K86O47M65O5K34J042J627J304
$$ 162112 163753 164994 165694 165885 165750 165522 165273 164970 164802 165088 165735 166200 166265 166499 167541 169168 170472
54255A70472M20j79j80M5O3j34j91J61P34J010O95Oo09p94k66J058K645L439K917
$$ 170472 170892 170713 170533 170578 170641 170507 170316 170477 171211 172221 172916 172922 172313 171519 171253 172311 174956 178395 181312
54236A81312J678N68l74j474k358k293j452q95j194j942k633l157l169k115l74
$$ 181312 182990 183558 183184 181710 179352 177059 175607 174712 173518 171576 168943 165786 162617 160502 160128
54221A60128O19J00r22j071m15Np4J7M71N99J9o17n27J68O92N31k59j318k185
$$ 160128 160747 160847 159925 158854 158439 158444 158370 158387 158858 159457 159476 158859 158332 158500 159192 159723 159464 158146 155961
54202A55961k415j854p96K30Q92J120R33L74l26p13m66K31Q40R79P44M49K50J52
$$ 155961 153546 151692 150896 151126 152018 153138 154071 154445 154119 153406 152940 153171 154011 154990 155734 156183 156433 156585
54184A56585J80L14L78K40N0K9J22R5j8N5M05Q22J079J080P09K7n07m20K6K2o61
$$ 156585 156765 157079 157457 157697 157747 157776 157898 157993 157975 158030 158435 159257 160336 161416 162125 162152 161645 161225 161251 161273 160612
54163A60612j272j137o72p53j382j561n76J064K075J679L09q50j006m23J11K35
$$ 160612 159340 158203 157531 156778 155396 153835 153259 154323 156398 158077 158386 157536 156530 156107 156218 156453
54147A56453J39o3n08r89q80%Q91R90M55J2q1o5R3P05J538J689O73q27j695j614
$$ 156453 156592 156529 156021 155032 154152 154152 155043 156033 156488 156500 156419 156354 156447 157152 158690 160379 161052 160225 158530 156916
54127A56916j230j138j088l99R47J987J834Q80M14R59J562J175K05r7N09R27L97
$$ 156916 155686 154548 153460 153061 154008 155995 157829 158709 159123 160082 161644 162819 163024 162927 163436 164363 164760
54110A64760m21m59L19J140J676K278K996L132K073K62j104j299p34l53n30p14
$$ 164760 164339 163880 164199 165339 167015 169293 172289 175421 177494 177756 176652 175353 174619 174266 173736 173022
54094A73022k20Q48J598J335K96o55r20n67M5P19J342J606J142L6j050j439j095
$$ 173022 172802 173650 175248 176583 176879 176224 175304 174737 174782 175501 176843 178449 179591 179627 178577 177138 176043
54077A76043n34j69N4L07N49O54P56J056J393J316O68o7k48K16Q36J100R31N49
$$ 176043 175509 175340 175394 175701 176250 176904 177660 178716 180109 181425 182093 182026 181778 181994 182830 183930 184861 185410
54059A85410J16l15p00r97j242j390j114l9J612K904K970J919O61p1k48j29K69
$$ 185410 185526 185211 184511 183514 182272 180882 179768 179729 181341 184245 187215 189134 189795 189724 189476 189347 189616
54042A89616J105K337L700M897N659N800N436N043N058N389N605N571N631O090
$$ 189616 190721 193058 196758 201655 207314 213114 218550 223593 228651 234040 239645 245216 250847 256937
54028B56937O711O936O489N645M963M809N111N408N247M553L677K957K323J501
$$ 256937 263648 270584 277073 282718 287681 292490 297601 303009 308256 312809 316486 319443 321766 323267
54014C23267N31j96n20p93j373j990k052j496j036j397k556l851m582m504l923
$$ 323267 323798 323602 323082 322289 320916 318926 316874 315378 314342 312945 310389 306538 301956 297452 293529
53999B93529l465l535l863l871l487l224l353l435l096k723k837l135k873k128
$$ 293529 290064 286529 282666 278795 275308 272084 268731 265296 262200 259477 256640 253505 250632 248504
53985B48504j884k704l908m388l826k791k009j800k032k267k058j313m25K1k67
$$ 248504 246620 243916 240008 235620 231794 229003 226994 225194 223162 220895 218837 217524 217099 217120 216853
53970B16853r94j457j230p47q33j468j527k77J389J987J397Q70J161J713J848
$$ 216853 215859 214402 213172 212425 211592 210124 208597 208320 209709 211696 213093 213963 215124 216837 218685
53955B18685J756J833J893J661J356J228J105R38J082J526J495O09k12O8J004
$$ 218685 220441 222274 224167 225828 227184 228412 229517 230455 231537 233063 234558 235167 234955 235023 236027
53940B36027J318Q61P82J713K844L068K318J370R52J265K014K598K661K563K953
$$ 236027 237345 238206 238988 240701 243545 246613 248931 250301 251253 252518 254532 257130 259791 262354 265307
53925B65307L864M628M784M593M552M843N445O348P378Q132Q361Q230Q069Q035
$$ 265307 269171 273799 278583 283176 287728 292571 298016 304364 311742 319874 328235 336465 344534 352569
53911C52569Q103Q196Q270Q422Q925R816J0555J0394R182P481N876M455L060J661
$$ 352569 360672 368868 377138 385560 394485 404301 414856 425250 434432 441913 447789 452244 455304 456965
53897D56965L42p75j485j661j571j739k339k984l299l464l980m996o124o866p187
$$ 456965 457307 456532 455047 453386 451815 450076 447737 444753 441454 437990 434010 429014 422890 416024 408837
53882D08837p519q187q851q813p912o799o113n738n213m528l992l610l175k853
$$ 408837 401318 393131 384280 375467 367555 360756 354643 348905 343692 339164 335172 331562 328387 325534
53868C25534k999l446l618l411l364l828m556n187n589n613n079m178l344k612
$$ 325534 322535 319089 315471 312060 308696 304868 300312 295125 289536 283923 278844 274666 271322 268710
53854B68710j662o62k47n19p36m35J6L28J009K425L915M661N009N970P724R466
$$ 268710 267048 266386 266139 265620 264884 264449 264465 264793 265802 268227 272142 276803 281812 287782 295506 304972
53838C04972J0593J1191J1353J0812R321O823L167j629o725j0663j2598j2958
$$ 304972 315565 326756 338109 348921 358242 365065 368232 366603 359878 349215 336617 323659
53826C23659j2676j2157j1197r677p919o402n337m568l902l387l110k813k094
$$ 323659 310983 298826 287629 277952 270033 263631 258294 253726 249824 246437 243327 240514 238420
53813B38420j072l96l55m00M0P39J136J199J217J156R41J163K510M549N908N944
$$ 238420 237348 236952 236597 236197 236237 236976 238112 239311 240528 241684 242625 243788 246298 250847 256755 262699
53797B62699N429N297N479N406N013M707M738N087N587N762M957L227J722J585
$$ 262699 268128 273425 278904 284310 289323 294030 298768 303855 309442 315204 320161 323388 325110 326695
53783C26695K568L385L282K693K224J694N53j092k467l046l076l072l119k989
$$ 326695 329263 332648 335930 338623 340847 342541 343094 342002 339535 336489 333413 330341 327222 324233
53769C24233k782k981l748m579m968n041n118m962m176l167k941l699m405m103
$$ 324233 321451 318470 314722 310143 305175 300134 295016 290054 285878 282711 279770 276071 271666 267563
53755B67563l065k186j799j716j946k568l108k893k035j415j538j999k257k342
$$ 267563 264498 262312 260513 258797 256851 254283 251175 248282 246247 244832 243294 241295 239038 236696
53741B36696k471k415j746n38N33Q06J71q74j638j711j108j07R30J529J291M13
$$ 236696 234225 231810 230064 229526 230059 230865 231036 230162 228524 226813 225705 225598 226528 228057 229348 229761
53725B29761k70k11J22J3k49K83J581K357J817Q33O91J353J790J564J126P62K24
$$ 229761 229491 229280 229402 229415 229166 229449 231030 233387 235204 236037 236728 238081 239871 241435 242561 243323 243547
53708B43547n08r06n89J85R47J483J762J869K078K546K897K643K093K141K988
$$ 243547 243039 242133 241544 241729 242676 244159 245921 247790 249868 252414 255311 257954 260047 262188 265176
53693B65176L715L472K485J465O63L4k62j84k16p54j372j376q89o48q71j069r30
$$ 265176 268891 272363 274848 276313 276976 277010 276748 276564 276348 275594 274222 272846 271957 271309 270438 269369 268439
53676B68439o75m91k54L3J69K47O20J205J425J113Q02Q24P30J05o30q48p13q69
$$ 268439 267764 267273 267019 267052 267221 267468 268088 269293 270718 271831 272633 273457 274187 274292 273662 272814 272101 271232
53658B71232j341j493r81j56N70J170J593J525R15M08Q17K235L967N331O249P041
$$ 271232 269891 268398 267417 267261 267831 269001 270594 272119 273034 273442 274259 276494 280461 285792 292041 299082
53642B99082P977R204J0828J2700J4131J4195J2495R410N503J006l775p949j0514
$$ 299082 307059 316263 327091 339791 353922 368117 380612 390022 395525 396531 392756 384807 374293
53629C74293j1361j1302j0989j0260q725o549m306k402r39M1N79Q83J136J279
$$ 374293 362932 351630 340641 330381 321656 315107 310801 308399 307460 307501 308080 308963 310099 311378
53615C11378J260J357J907K814L576L835L646L238K716K132J616J326J285J325
$$ 311378 312638 313995 315902 318716 322292 326127 329773 333011 335727 337859 339475 340801 342086 343411
53601C43411J254J084J013J090J018N62O9J67Q49J335J025J92n29r91j387j724
$$ 343411 344665 345749 346762 347852 348870 349432 349501 349668 350517 351852 352877 353069 352540 351549 350162 348438
53585C48438j935k295l021l630l342k255j469j758k630l038k562j603p42l86p62
$$ 348438 346503 344208 341187 337557 334215 331960 330491 328733 326103 323065 320503 318900 318158 317772 317010
53570C17010j712k530k458j521n85m50j050j696j845j490r48n26m31o33p20j39
$$ 317010 315298 312768 310310 308789 308204 307754 306704 305008 303163 301673 300725 300199 299768 299135 298415 298276
53554B98276J111K209K293J485P20N78P45Q03R45J533K317K753K767K692K562
$$ 298276 299387 301596 303889 305374 306094 306672 307417 308220 309165 310698 313015 315768 318535 321227 323789
53539C23789K162J787K178L498M945N755O116O692P592Q327Q564Q478Q427Q611
$$ 323789 325951 327738 329916 333414 338359 344114 350230 356922 364514 372841 381405 389883 398310 406921
53525D06921R038R496R622R354R268J0068J1674J3135J3677J3562J3707J4571
$$ 406921 415959 425455 435077 444431 453699 463767 475441 488576 502253 515815 529522 544093
53513E44093J5774J6732J7386J8168J9385K0863K2138K2883K3121K3148K3247
$$ 544093 559867 576599 593985 612153 631538 652401 674539 697422 720543 743691 766938
53502G66938K3412K3242K2302K0706J9259J8696J8808J8597J7463J5987J5285
$$ 766938 790350 813592 835894 856600 875859 894555 913363 931960 949423 965410 980695
53491I80695J5674J6349J6454J6117J6083J6571J6898J6405J5323J4466J4302
$$ 980695 996369 1012718 1029172 1045289 1061372 1077943 1094841 1111246 1126569 1141035 1155337
53480A155337J4589J4816J4633J3851J2470J0755R045P390N553L460J281r76l509
$$ 1155337 1169926 1184742 1199375 1213226 1225696 1236451 1245496 1252886 1258439 1261899 1263180 1262204 1258695
53467A258695o144q182r254j0012j1405j3414j5061j5687j5673j5796j6320j7020
$$ 1258695 1252551 1244369 1235115 1225103 1213698 1200284 1185223 1169536 1153863 1138067 1121747 1104727
53455A104727j7789j8817k0168k1396k1733k0766j8944j7327j6658j6757j6848
$$ 1104727 1086938 1068121 1047953 1026557 1004824 984058 965114 947787 931129 914372 897524
53444H97524j6310j5044j3364j1849j1050j0939j0755r803q301p043o346n820
$$ 897524 881214 866170 852806 840957 829907 818968 808213 798410 790109 783066 776720 770900
53432G70900n171m547l934k846r91J156K892M164N543P516J0109J2967J5503J7114
$$ 770900 765729 761182 757248 754402 753411 754567 757459 761623 767166 774682 784791 797758 813261 830375
53418H30375J7660J7722J8167J9385K1164K3139K5113K6917K8240K8845K8907
$$ 830375 848035 865757 883924 903309 924473 947612 972725 999642 1027882 1056727 1085634
53407A085634K8993K9609L0800L2302L3998L6000L8195M0085M1376M2497M4104
$$ 1085634 1114627 1144236 1175036 1207338 1241336 1277336 1315531 1355616 1396992 1439489 1483593
53396A483593M6248M8345M9934N0925N1270N0954N0404N0216N0305M9946M8873
$$ 1483593 1529841 1578186 1628120 1679045 1730315 1781269 1831673 1881889 1932194 1982140 2031013
53385B031013M7687M6739M5359M2864L9759L7070L4781L1878K7979K3958K0595
$$ 2031013 2078700 2125439 2170798 2213662 2253421 2290491 2325272 2357150 2385129 2409087 2429682
53374B429682J7297J2828P027J158l555p266j1081j5550k0151k4371k8711l3951
$$ 2429682 2446979 2459807 2466834 2467992 2464437 2457171 2446090 2430540 2410389 2386018 2357307 2323356
53362B323356l9730m4637m7864n0062n2293n4707n6641n7547n7345n6272n4839
$$ 2323356 2283626 2238989 2191125 2141063 2088770 2034063 1977422 1919875 1862530 1806258 1751419
53351A751419n3551n2317n0460m7785m5113m3308m2195m1125m0079l9405l8882
$$ 1751419 1697868 1645551 1595091 1547306 1502193 1458885 1416690 1375565 1335486 1296081 1257199
53340A257199l7974l6851l6112l5535l4136l1636k8990k7132k5952k4746k3094
$$ 1257199 1219225 1182374 1146262 1110727 1076591 1044955 1015965 988833 962881 938135 915041
53329I15041k0912j8345j5956j4373j3464j2389j0766r168q129p309o142m674
$$ 915041 894129 875784 859828 845455 831991 819602 808836 799668 791539 784230 778088 773414
53317G73414l291k091j085n24m42k69N24J829L379N375P923J0292J1625J2168
$$ 773414 770123 768032 766947 766423 765981 765712 766236 768065 771444 776819 784742 795034 806659 818827
53303H18827J2993J4536J6198J7474J8667K0216K1966K3434K4469K5283K6086
$$ 818827 831820 846356 862554 880028 898695 918911 940877 964311 988780 1014063 1040149
53292A040149K6851K7397K7602K7620K7783K8039K7752K6395K4274K2174K0360
$$ 1040149 1067000 1094397 1121999 1149619 1177402 1205441 1233193 1259588 1283862 1306036 1326396
53281A326396J8402J5947J3142J0240P296M377J684p81l257n878q533j1167j3762
$$ 1326396 1344798 1360745 1373887 1384127 1391423 1395800 1397484 1396703 1393446 1387568 1379035 1367868 1354106
53268A354106j5991j7424j8227j9176k0688k2310k3467k4242k4965k5516k5611
$$ 1354106 1338115 1320691 1302464 1283288 1262600 1240290 1216823 1192581 1167616 1142100 1116489
53257A116489k5505k5801k6614k7484k8043k8316k8392k8262k8048k7902k7585
$$ 1116489 1090984 1065183 1038569 1011085 983042 954726 926334 898072 870024 842122 814537
53246H14537k6627k5140k4014k3950k4540k4679k3819k2407k1193k0425j9867
$$ 814537 787910 762770 738756 714806 690266 665587 641768 619361 598168 577743 557876
53235E57876j9316j8723j7892j6406j4174j1893j0599j0501j0622r851q250o863
$$ 557876 538560 519837 501945 485539 471365 459472 448873 438372 427750 417899 409649 402786
53223D02786o308o090n508m770m673n450o453p011p108p035o772o115n191m490
$$ 402786 396478 390388 384880 380110 375437 369987 363534 356523 349415 342380 335608 329493 324302 319812
53209C19812m345m585m761m623m299m144m314m493m143l179k210j851j988k015
$$ 319812 315467 310882 306121 301498 297199 293055 288741 284248 280105 276926 274716 272865 270877 268862
53195B68862j804j888k585l354l447k878k334k227k270k013j382n95O8L18l1p53
$$ 268862 267058 265170 262585 259231 255784 252906 250572 248345 246075 244062 242680 242085 242153 242471 242440 241687
53179B41687j265j240r81r91j307j510j346r69o24l72k16k60n06p23o74m36k91
$$ 241687 240422 239182 238201 237210 235903 234393 233047 232078 231454 231082 230866 230606 230100 229377 228703 228267 227976
53162B27976k87j19M08R67R62K17p07j049o44m8J43q1k67j27J86L94M51M34K79
$$ 227976 227689 227570 227978 228945 229907 230124 229417 228368 227724 227676 227819 227738 227471 227344 227530 227924 228375 228809 229088
53143B29088j10n15m96R0Q26J217J255J307J482J462J001L63J05N13J299J861
$$ 229088 228978 228463 227967 228057 228883 230100 231355 232662 234144 235606 236607 236970 237075 237588 238887 240748
53127B40748J774J194P80J033J679J914J382O20L89P67J199J242R27M90J02j09
$$ 240748 242522 243716 244496 245529 247208 249122 250504 251124 251513 252280 253479 254721 255648 256138 256240 256131
53111B56131r5n1k42o30r10r44r07r89j196j488j800j873j455q54q45j699k647
$$ 256131 256036 255985 255743 255113 254203 253259 252352 251363 250167 248679 246879 245006 243551 242697 241852 240153 237506
53094B37506k689j835j042j046j620k044j953j526j119q60o18k65P2J67L9J6K78
$$ 237506 234817 232982 231940 230894 229274 227230 225277 223751 222632 221772 221154 220889 220961 221128 221167 221183 221461
53077B21461O10P70Q42R43P59j08j402k290k293j809j487j405j142m73K32M03
$$ 221461 222071 222841 223683 224626 225385 225277 223875 221585 219292 217483 215996 214591 213449 212976 213208 213611
53061B13611j21q67j148p62j64J22Q1K8J0j97n51o92n13l31k99q9N12J051R47
$$ 213611 213490 212623 211475 210713 210549 210671 210752 210780 210790 210593 210042 209350 208837 208506 208207 208118 208630 209681 210628
53042B10628K99k80n68q81j353j578j201n40k44n18r19r18m55R5L35R7n81j442
$$ 210628 210927 210647 210079 209198 207845 206267 205066 204526 204282 203764 202845 201927 201472 201567 201902 201999 201418 199976
53024A99976j928j417Q2J591J950J095J67J71Q50J249J004N88M23L58J27k02m24
$$ 199976 198048 196631 196713 198304 200254 201349 201516 201687 202537 203786 204790 205378 205801 206159 206286 206084 205660
53007B05660n28n50l47K37J018J516J328M75n61j121r04k89M2j99o77r48r45r19
$$ 205660 205132 204582 204235 204472 205490 207006 208334 208809 208248 207127 206223 205934 205976 205777 205100 204152 203207 202288
52989B02288j090j437j671j357l66P67J270J039P68R60J230R97M05L3q9m43j013
$$ 202288 201198 199761 198090 196733 196367 197134 198404 199443 200211 201171 202401 203398 203803 203836 203747 203304 202291
52972B02291j069j44J221K123K225J792J162O05L98N61O41K29m10o57m46k72l21
$$ 202291 201222 201078 202299 204422 206647 208439 209601 210206 210604 211165 211806 212035 211625 210968 210522 210250 209929
52955B09929r0P78J783K133J731J140O95K35l59p82o72m0Q12J502J612Q42n56
$$ 209929 209839 210617 212400 214533 216264 217404 218099 218334 217975 217193 216521 216481 217293 218795 220407 221249 220693
52938B20693j776k175j893j465j090o28k54m74j370k246k360j733j006o84q01
$$ 220693 218917 216742 214849 213384 212294 211666 211412 210938 209568 207322 204962 203229 202223 201539 200738
52923B00738j174j545j550r54l7N43M84K01K60O44R05Q43O65M60L2n70q07l25
$$ 200738 199564 198019 196469 195515 195478 196021 196505 196706 196966 197610 198515 199358 200023 200483 200515 199945 199138 198813
52905A98813L76M96M0k14J20N16M35J68K73N98N40Q8j31J47M26K85RP0M09O71
$$ 198813 199189 199685 199725 199511 199631 200147 200582 200750 201023 201621 202161 202249 202118 202265 202691 202976 202985 203055 203464 204135
52885B04135Q00R51J008P02J51k02k37l15o82j067j142j121j480k165k425j702
$$ 204135 204935 205886 206894 207596 207747 207545 207308 206993 206311 205244 204102 202981 201501 199336 196911 195209
52869A95209m21L59J44n13p75m85p6K56P54J522K178K330J991J347M57m73q81
$$ 195209 194788 195147 195291 194778 194003 193518 193442 193698 194452 195974 198152 200482 202473 203820 204277 203804 202923
52852B02923l73O64J406J461J076N43j19q11j165r65m94j83j05J6K93M96L24j96
$$ 202923 202550 203214 204620 206081 207157 207700 207581 206770 205605 204640 204146 203963 203858 203874 204167 204663 204987 204791
52834B04791p25r45q93q95j127j320r69J23J574K703L074K780K221J587O83o16
$$ 204791 204066 203121 202228 201333 200206 198886 197917 198040 199614 202317 205391 208171 210392 211979 212662 212046
52818B12046j800k010j040K24O11j79j445k230j998p14J233L170M567N362N764
$$ 212046 210246 208236 207196 207420 208031 207852 206407 204177 202179 201465 202698 205868 210435 215797 221561
52803B21561N762N150L928K330M57j721l914n460n919n554m980m533m068l304
$$ 221561 227323 232473 236401 238731 239188 237467 233553 228093 222174 216620 211640 207107 203039 199735
52789A99735k279j535j674k580l282k908j686n96k06l12n83q59p73M8J229J776
$$ 199735 197456 195921 194247 191667 188385 185477 183791 183195 182989 182677 182094 181235 180462 180510 181739 183515
52773A83515J387R32J110J364P76m18j085o09O08J848K538K268J169J76J91R32
$$ 183515 184902 185834 186944 188308 189084 188666 187581 186972 187580 189428 191966 194234 195403 195579 195770 196702
52757A96702J308Q77K35m2j2J47M66P14M39j72k08O88J639J715J175Q63Q79O84
$$ 196702 198010 198887 199122 199080 199068 199215 199681 200395 200834 200662 200454 201142 202781 204496 205671 206534 207413 208097
52739B08097J90j43j79k89n94p42n02l2N42J214J647J273K00n45j59R27J629J517
$$ 208097 208287 208144 207965 207676 207082 206340 205838 205806 206348 207562 209209 210482 210682 210137 209978 210905 212534 214051
52721B14051J026O05K56r8l56n32q86j504k097k384k457k472k294j809j357j384
$$ 214051 215077 215682 215938 215840 215484 214952 214066 212562 210465 208081 205624 203152 200858 199049 197692 196308
52705A96308j710j681j086m60k95m07l96k96l33l07J88J041J609J511R92N09K54
$$ 196308 194598 192917 191831 191371 191076 190669 190273 189977 189644 189337 189525 190566 192175 193686 194678 195187 195441
52688A95441J87J90R9p4K2O84J476J519O65r6J59J062J445Q36o9m41k87j58k40
$$ 195441 195628 195818 195917 195843 195865 196549 198025 199544 200209 200113 200272 201334 202779 203615 203546 203105 202818 202660 202420
52669B02420j15N90J530J891J272J57o76r84j007q30k88M35P73N88M98J019J839
$$ 202420 202305 202895 204425 206316 207588 207745 207069 206085 205078 204248 203960 204395 205168 205756 206254 207273 209112
52652B09112K378K634K926L200L219L198L422L410K278R6j930k885l103l324l567
$$ 209112 211490 214124 217050 220250 223469 226667 230089 233499 235777 235873 233943 231058 227955 224631 221064
52637B21064l374k708k021j589j306j020p09l56j8R0j43m15k46M35J166J475J286
$$ 221064 217690 214982 212961 211372 210066 209046 208337 207981 207963 208053 207910 207495 207249 207684 208850 210325 211611
52620B11611Q74M96J98j35n39q28p63m19k23n33j220j735j561o21N57J195R52
$$ 211611 212485 212981 213179 213044 212505 211677 210914 210495 210272 209739 208519 206784 205223 204602 205159 206354 207306
52603B07306K85q3m1k8j82o2N39J096J100P91O50N58J67k22K0P16J005P22P77
$$ 207306 207591 207508 207467 207439 207257 207195 207734 208830 209930 210721 211371 211929 212096 211874 211894 212610 213615 214337 215114
52584B15114J750K810K737J541L55j6K17M87O04O23N45L59J86J20P3n6k30l78
$$ 215114 216864 219674 222411 223952 224307 224291 224508 224995 225599 226222 226767 227126 227312 227432 227505 227449 227219 226841
52566B26841n35o99o69k60L50O69M55N1m0J92K47k01q47j131r01m76k26l10o66
$$ 226841 226306 225607 224938 224678 225028 225697 226152 226203 226163 226355 226602 226401 225554 224423 223522 223046 222820 222510 221844
52547B21844r71p23K55J356J654R43l0m79l70j26J0O4P9J87N92J169J335P43q8
$$ 221844 220873 220150 220405 221761 223415 224358 224328 223849 223479 223353 223363 223427 223506 223693 224285 225454 226789 227532 227444
52528B27444m16k71l09p23j012q34n25m73n79o27o87p49m41M50J443J848J597
$$ 227444 227028 226757 226448 225725 224713 223879 223354 222881 222302 221675 220988 220239 219798 220248 221691 223539 225136
52511B25136J200J045J181J648K477L310L502K773J566N63J05O7J00j31p54j617
$$ 225136 226336 227381 228562 230210 232687 235997 239499 242272 243838 244401 244506 244573 244673 244542 243788 242171
52495B42171k393k808k700k066j183n48l66k57K68J016J288Q12J32j07J17M58
$$ 242171 239778 236970 234270 232204 231021 230473 230107 229850 230118 231134 232422 233234 233366 233259 233376 233834
52479B33834Q18J331J926K249K029J371P16N46J006J678J903J482R13P74J031
$$ 233834 234652 235983 237909 240158 242187 243558 244274 244820 245826 247504 249407 250889 251802 252576 253607
52464B53607J164Q12J38l87l30L66J222J536J086L43j99o98j551k584l111k820
$$ 253607 254771 255583 255721 255334 255004 255370 256592 258128 259214 259557 259358 258660 257109 254525 251414 248594
52448B48594k103j444q79l26J1j35o30j040j082q56o61p19j016j336j505j557
$$ 248594 246491 245047 244168 243842 243853 243718 243088 242048 240966 240110 239449 238730 237714 236378 234873 233316
52432B33316j544j267m70O36J321J045M5r19j281j027n04m2K79O00J011J303J185
$$ 233316 231772 230505 230035 230671 231992 233037 233082 232163 230882 229855 229351 229309 229588 230188 231199 232502 233687
52415B33687P19L30K92M24M66N45J010J928K909L452L431L295L754N084O755P887
$$ 233687 234406 234736 235028 235452 235918 236463 237473 239401 242310 245762 249193 252488 256242 261326 268081 275968
52399B75968Q063P409O048L985J590m12j791l098m689n928n965m976l935l344
$$ 275968 284031 291440 297488 301473 303063 302651 300860 297762 293073 287145 281180 276204 272269 268925
52385B68925k847k077j229o55m59n70p93o95J08J376K348K564K269J938J803J889
$$ 268925 266078 264001 262772 262117 261658 261088 260295 259600 259708 261084 263432 265996 268265 270203 272006 273895
52369B73895K094K118J730J217J093J258R81j4j087j604j785k092k319j893q41
$$ 273895 275989 278107 279837 281054 282147 283405 284386 284372 283285 281681 279896 277804 275485 273592 272751
52354B72751J76O14M60J2k78M3R69J810J881J325Q28P25Q30R92J241J460J498
$$ 272751 272927 273541 274001 274013 273735 273778 274747 276557 278438 279763 280591 281316 282146 283138 284379 285839 287337
52337B87337J601K147K941L326L098K691K377K039J890K612M233N637N944N839
$$ 287337 288938 291085 294026 297352 300450 303141 305518 307557 309447 312059 316292 321929 327873 333712
52323C33712O645Q374R599R304Q048P025O686O622O361N752M861L926L302L083
$$ 333712 340357 348731 358330 367634 375682 382707 389393 396015 402376 408128 412989 416915 420217 423300
52309D23300K910K438J994K393L881N600O370N952N205M979N210N274M905M325
$$ 423300 426210 428648 430642 433035 436916 442516 448886 454838 460043 465022 470232 475506 480411 484736
52295D84736L620K602J383N68M79N72J46o13r16n74l05o42j216j406j259j184
$$ 484736 488356 490958 492341 492909 493388 493960 494106 493493 492577 492003 491698 491056 489840 488434 487175 485991
52279D85991j100n09O33J750K438K907L394L646L379K972L121L883M512M404L865
$$ 485991 484891 484382 485015 486765 489203 492110 495504 499150 502529 505501 508622 512505 517017 521421 525286
52264E25286L651L993M397M409M267M566N424O292O662O665O775P103P297P165
$$ 525286 528937 532930 537327 541736 546003 550569 555993 562285 568947 575612 582387 589490 596787 603952
52250F03952O972O975O967O540N597M362L083J987J387J428J767J947K068K667
$$ 603952 610924 617899 624866 631406 637003 641365 644448 646435 647822 649250 651017 652964 655032 657699
52236F57699L849M973N440N425N536O045O712P168P160O630N863N411N531N865
$$ 657699 661548 666521 671961 677386 682922 688967 695679 702847 710007 716637 722500 727911 733442 739307
52222G39307N946N893O148O609O623N920N078M804N077N402N599N939O528P018
$$ 739307 745253 751146 757294 763903 770526 776446 781524 786328 791405 796807 802406 808345 814873 821891
52208H21891P023O575O015N660N699O255P207P943P667O182M281L091L019L565
$$ 821891 828914 835489 841504 847164 852863 859118 866325 874268 881935 888117 892398 895489 898508 902073
52194I02073M064M405M879N605O315O626O390N816N310N059M756L918K551J200
$$ 902073 906137 910542 915421 921026 927341 933967 940357 946173 951483 956542 961298 965216 967767 968967
52180I68967K11p24j998l360m221m519m813n477o263o790p072p308p431p125o191
$$ 968967 969178 968454 966456 963096 958875 954356 949543 944066 937803 931013 923941 916633 909202 902077 895886
52165H95886m747l144j816j050p70n89j61N21J186J571J592J284P07r5j002j778
$$ 895886 891139 887995 886179 885129 884359 883770 883609 884130 885316 886887 888479 889763 890470 890375 889373 887595
52149H87595k160k002j270k1J365K114J677O02K06J038K055J853L95j096j740
$$ 887595 885435 883433 882163 882142 883507 885621 887298 887900 888106 889144 891199 893052 893447 892351 890611
52134H90611j804j900k125k270k298k270k064j448k58J491L468N090O095O981
$$ 890611 888807 886907 884782 882512 880214 877944 875880 874432 874174 875665 879133 884223 890318 897299
52120H97299Q402J0180J1517J2109J2296J2090J0921Q758O596N258M373L179J697
$$ 897299 905701 915881 927398 939507 951803 963893 974814 983572 990168 995426 999799 1002978 1004675
52107A004675M38n53j500k096j705l09J397K776L570L754L713M306N988P905Q688
$$ 1004675 1005113 1004560 1003060 1000964 999259 998950 1000347 1003123 1006693 1010447 1014160 1018466 1024454 1032359 1041047
52092A041047Q134P392P358P548O822M600J212k435n307o782p005o513n479l807
$$ 1041047 1049181 1056573 1063931 1071479 1078301 1082901 1084113 1081678 1076371 1069589 1062584 1056071 1050592 1046785
52078A046785j840l46L74P46J115J305J232J304J820K491L023L640M520N101M693
$$ 1046785 1044945 1044599 1044973 1045719 1046834 1048139 1049371 1050675 1052495 1054986 1058009 1061649 1066169 1071270 1075963
52063A075963L527K580K431K733K882K666K179J537Q42K07l42r19j597k293k874
$$ 1075963 1079490 1082070 1084501 1087234 1090116 1092782 1094961 1096498 1097340 1097547 1097205 1096286 1094689 1092396 1089522
$$ [...]
##END NTUPLES=NMR SPECTRUM
##END=
