
##TITLE=AC1341_BRARS12162_6528860_T8TkLJ4Fg5
##JCAMPDX= 6.0         $$ Bruker NMR JCAMP-DX V2.0
##DATA TYPE= NMR SPECTRUM
##DATA CLASS= NTUPLES
##ORIGIN= BRUKER
##OWNER= Administrator
$$ 1.72 TOPSPIN		Version 2.1
$$ 2012-07-15 18:30:41.203 -0500  Administrator@TOPSPIN
$$ Compression mode = diff/dup
##.OBSERVE FREQUENCY= 400.02188249412
##.OBSERVE NUCLEUS= ^1H
##.ACQUISITION MODE= SIMULTANEOUS (DQD)
##.ACQUISITION SCHEME= undefined
##.AVERAGES= 8
##.DIGITISER RES= 22
##SPECTROMETER/DATA SYSTEM= spect
##.PULSE SEQUENCE= zg30
##.SOLVENT NAME= COFFEE_meoh
##.SHIFT REFERENCE= INTERNAL, COFFEE_meoh, 1, 14.98509
##AUDIT TRAIL= $$ (NUMBER, WHEN, WHO, WHERE, PROCESS, VERSION, WHAT)
$$ ##TITLE= Audit trail, TOPSPIN		Version 2.1
$$ ##JCAMPDX= 5.01
$$ ##ORIGIN= Bruker BioSpin GmbH
$$ ##OWNER= Administrator
$$ $$ C:\Bruker\TOPSPIN/data/COFFEE/nmr/AC1341_BRARS12162_6528860_T8TkLJ4Fg5/10/pdata/1/auditp.txt
$$ ##AUDIT TRAIL=  $$ (NUMBER, WHEN, WHO, WHERE, PROCESS, VERSION, WHAT)
(   1,<2012-07-15 18:30:32.875 -0500>,<Administrator>,<TOPSPIN>,<go>,<TOPSPIN 2.1>,
      <created by zg
	started at 2012-07-15 18:29:26.265 -0500,
	POWCHK enabled, PULCHK disabled,
       configuration hash MD5:
       6B 1B 68 BB D9 2E 58 E2 7F 35 AD 54 07 DF 0E 41
       data hash MD5: 64K
       93 4B 38 12 C2 86 3F 9D D4 5E 08 1F 59 39 9B 99>)
(   2,<2012-07-15 18:30:37.046 -0500>,<Administrator>,<TOPSPIN>,<proc1d>,<TOPSPIN 2.1>,
      <Start of raw data processing
       efp LB = 0 FT_mod = 6 PKNL = 1 PHC0 = 0 PHC1 = 0 SI = 32K 
       data hash MD5: 32K
       B3 0D DF FA 60 12 1D 73 C9 C0 20 1E E7 D5 9E 58>)
(   3,<2012-07-15 18:30:37.328 -0500>,<Administrator>,<TOPSPIN>,<proc1d>,<TOPSPIN 2.1>,
      <pk PHC0 = 175.6934 PHC1 = 0 
       data hash MD5: 32K
       EC 40 50 1C 2D D5 A9 CD 08 61 6E 96 8D 2F A8 89>)
(   4,<2012-07-15 18:30:37.406 -0500>,<Administrator>,<TOPSPIN>,<proc1d>,<TOPSPIN 2.1>,
      <abs ABSG = 1 
       data hash MD5: 32K
       78 84 8A 58 21 B0 62 51 13 4B C6 2E EA 12 DD CD>)
(   5,<2012-07-15 18:30:37.437 -0500>,<Administrator>,<TOPSPIN>,<proc1d>,<TOPSPIN 2.1>,
      <abs ABSG = 2 
       data hash MD5: 32K
       B8 00 99 B9 4F E9 5A BE 45 E5 49 DC 9E B4 1A 9F>)
(   6,<2012-07-15 18:30:37.453 -0500>,<Administrator>,<TOPSPIN>,<proc1d>,<TOPSPIN 2.1>,
      <abs ABSG = 3 
       data hash MD5: 32K
       7D DA A2 4C F3 5A 1F E5 89 F9 79 62 B0 B3 8B 06>)
(   7,<2012-07-15 18:30:37.484 -0500>,<Administrator>,<TOPSPIN>,<proc1d>,<TOPSPIN 2.1>,
      <abs ABSG = 4 
       data hash MD5: 32K
       60 1A 40 AC 1E 61 10 7F 2B 14 21 5F 89 9F 62 71>)
(   8,<2012-07-15 18:30:37.515 -0500>,<Administrator>,<TOPSPIN>,<proc1d>,<TOPSPIN 2.1>,
      <abs ABSG = 5 
       data hash MD5: 32K
       D2 DE 5B EF 1F 92 07 01 06 EF 1F A3 4C 26 94 60>)
$$ ##END=
$$ 
$$ $$ hash MD5
$$ $$ 6F B6 67 3B F3 06 FE 63 DC E1 BE 63 95 B8 E6 E3
##$RELAX= 
##$RELAX= 
##$RELAX= 
##$RELAX= 
##$RELAX= 
##$RELAX= 
##$RELAX= 
$$ Bruker specific parameters
$$ --------------------------
$$ [...]
##$TP= (0..7)
150 150 150 150 150 150 150 150
##$TP07= 0
##$TPNAME0= <>
##$TPNAME1= <>
##$TPNAME2= <>
##$TPNAME3= <>
##$TPNAME4= <>
##$TPNAME5= <>
##$TPNAME6= <>
##$TPNAME7= <>
##$TPOAL= (0..7)
0.5 0.5 0.5 0.5 0.5 0.5 0.5 0.5
##$TPOFFS= (0..7)
0 0 0 0 0 0 0 0
##$TUNHIN= 0
##$TUNHOUT= 0
##$TUNXOUT= 0
##$USERA1= <user>
##$USERA2= <user>
##$USERA3= <user>
##$USERA4= <user>
##$USERA5= <user>
##$V9= 5
##$VALIST= <valist>
##$VCLIST= <CCCCCCCCCCCCCCC>
##$VD= 0
##$VDLIST= <DDDDDDDDDDDDDDD>
##$VPLIST= <PPPPPPPPPPPPPPP>
##$VTLIST= <TTTTTTTTTTTTTTT>
##$WBST= 2048
##$WBSW= 25
##$XGAIN= (0..3)
0 0 0 0
##$XL= 0
##$YL= 0
##$YMAX_a= 512793
##$YMIN_a= -650079
##$ZGOPTNS= <>
##$ZL1= 120
##$ZL2= 120
##$ZL3= 120
##$ZL4= 120
##$ABSF1= 14.98509
##$ABSF2= -5.573092
##$ABSG= 5
##$ABSL= 3
##$ALPHA= 0
##$AQORDER= 0
##$ASSFAC= 0
##$ASSFACI= 0
##$ASSFACX= 0
##$ASSWID= 0
##$AUNMP= <proc_prof1d_extract_pilot.lims>
##$AXLEFT= 0
##$AXNAME= <>
##$AXNUC= <1H>
##$AXRIGHT= 0
##$AXTYPE= 0
##$AXUNIT= <>
##$AZFE= 0.1
##$AZFW= 0.1
##$BCFW= 0
##$BC_mod= 0
##$BYTORDP= 0
##$COROFFS= 0
##$CY= 15
##$DATMOD= 1
##$DC= 0
##$DFILT= <>
##$DTYPP= 0
##$F1P= 0
##$F2P= 0
##$FCOR= 0.5
##$FTSIZE= 32768
##$FT_mod= 6
##$GAMMA= 0
##$GB= 0
##$INTBC= 1
##$INTSCL= 1
##$ISEN= 128
##$LB= 0
##$LEV0= 0
##$LPBIN= 0
##$MAXI= 10000
##$MC2= 0
##$MEAN= 0
##$ME_mod= 0
##$MI= 0
##$NCOEF= 0
##$NC_proc= -8
##$NLEV= 6
##$NOISF1= 0
##$NOISF2= 0
##$NSP= 0
##$NTH_PI= 0
##$NZP= 0
##$OFFSET= 14.98509
##$PC= 1
##$PHC0= 175.6934
##$PHC1= 0
##$PH_mod= 1
##$PKNL= yes
##$PPARMOD= 0
##$PPDIAG= 0
##$PPIPTYP= 0
##$PPMPNUM= 2147483647
##$PPRESOL= 1
##$PSCAL= 4
##$PSIGN= 0
##$PYNMP= <proc.py>
##$REVERSE= no
##$SF= 400.02
##$SI= 32768
##$SIGF1= 0
##$SIGF2= 0
##$SINO= 400
##$SIOLD= 32768
##$SPECTYP= <>
##$SREGLST= <1H.CDCl3>
##$SSB= 0
##$STSI= 32768
##$STSR= 0
##$SW_p= 8223.68421052631
##$SYMM= 0
##$S_DEV= 0
##$TDeff= 65536
##$TDoff= 0
##$TI= <>
##$TILT= no
##$TM1= 0
##$TM2= 0
##$TOPLEV= 0
##$USERP1= <user>
##$USERP2= <user>
##$USERP3= <user>
##$USERP4= <user>
##$USERP5= <user>
##$WDW= 1
##$XDIM= 32768
##$YMAX_p= 471628374
##$YMIN_p= -743159
##$CURPLOT= <Network HP LaserJet P1505>
##$CURPRIN= <$Network HP LaserJet P1505>
##$DFORMAT= <normdp>
##$LAYOUT= <+/1D_H.xwp>
##$LFORMAT= <normlp>
##$PFORMAT= <normpl>
##$SURQMSG= 1
$$ End of Bruker specific parameters
$$ ---------------------------------
##NTUPLES= NMR SPECTRUM
##VAR_NAME=  FREQUENCY,     SPECTRUM/REAL,   SPECTRUM/IMAG
##SYMBOL=    X,             R,               I
##VAR_TYPE=  INDEPENDENT,   DEPENDENT,       DEPENDENT
##VAR_FORM=  AFFN,          ASDF,            ASDF
##VAR_DIM=   32768,         32768,           32768
##UNITS=     HZ,            ARBITRARY UNITS, ARBITRARY UNITS
##FACTOR=    0.250966925370066, 1,           1
##FIRST=     8223.43324360094, -73667,       16586
##LAST=      0,             -180282,         47100
##MIN=       0,             -743159,         0
##MAX=       8223.43324360094, 471628374,    0
$$ Real data points
##PAGE= N=1
##DATA TABLE= (X++(R..R)), XYDATA
$$ [...]
19537B18377G2060f8335A5441a17990m3844L0569j12566N7770M9280b1008q8384
$$ 218377 72060 -68335 15441 -117990 -161834 -131265 -243831 -186061 -136781 -21008 -109392
19526a09392a1568B7284e3322H8155a13042k87998E7888a25116m612L5638B50216
$$ -109392 -11568 27284 -53322 88155 -113042 -401040 57888 -125116 -129728 -94090 250216
19514D07720e9841m6759o9080G0657b0558A54471n6743d02450B20111a00264H9453
$$ 407720 -59841 -106600 -175680 70657 -20558 154471 97728 -402450 220111 -100264 89453
19502C0012J22354a36580A49022a07070n2619j09380N1057B01930a71627b5203
$$ 30012 152366 -136580 149022 -107070 -159689 -269069 -218012 201930 -171627 -25203
19491A29215F468O6534a72922l8595R6667r5762d5096I3545P8073a81593H8745
$$ 129215 6468 73002 -172922 -211517 -114850 -210612 -45096 93545 171618 -181593 88745
19479a48312r8909A68531N5520d61205a60765o2968P7364A68143d22829a89720
$$ -148312 -247221 168531 224051 -461205 -160765 -223733 -146369 168143 -422829 -189720
19468d31109b9709l24796a36666B9398O6657L9852b86872A07328l2602l195h9919
$$ -431109 -29709 -354505 -136666 29398 96055 135907 -286872 107328 74726 71531 -89919
19456b58025a20884A24126L5276a20097E1014K95979A20590b20987f1220o9282
$$ -258025 -120884 124126 159402 -120097 51014 346993 120590 -220987 -61220 -130502
19446a30502L706A7363b7759B3193C80g9209q6183O5747j7359c4646k2742C225
$$ -130502 -126796 17363 -27759 23193 380 -79209 -165392 -99645 -117004 -34646 -57388 3225
19433h3291E5855K37013b89687R0160k96131J88312D4997c44473J40029F9989
$$ -83291 55855 292868 -289687 -199527 -495658 -307346 44997 -344473 -204444 69989
19422C8919J06816a80482H8199J11494G8159a38949O2505k06146f8977B34092
$$ 38919 145735 -180482 88199 199693 78159 -138949 -76444 -282590 -68977 234092
19411B35966b26375A43271b19695R8797A23452a55750o9745K6608l9390b5010
$$ 235966 -226375 143271 -219695 -120898 123452 -155750 -225495 -198887 -238277 -25010
19400A47503J17619b39612k8177e9367H3221f4512E5595L6369b10107A30681b32984
$$ 147503 265122 -239612 -267789 -59367 83221 -64512 55595 91964 -210107 130681 -232984
19388b09176A56665c37632J20582L9372c8618B51909a1058k3829B0514a77702
$$ -209176 156665 -337632 -217050 -177678 -38618 251909 -11058 -34887 20514 -177702
19377f7707D8455b50572A12787d8782B4761J18398g8649h140j04948A23544b46621
$$ -67707 48455 -250572 112787 -48782 24761 143159 -78649 -8140 -113088 123544 -246621
19365A6775O3877d04008A07656b80569N8052B5154J00039f8760D2512L0608a69104
$$ 16775 80652 -404008 107656 -280569 -222517 25154 125193 -68760 42512 73120 -169104
19353A01836g2601I0444a44885m4584A7683c04760C76604G0905g4870k460A4357
$$ 101836 -72601 90444 -144885 -189469 17683 -304760 376604 70905 -74870 -77330 14357
19341I0382a83474E7500Q4769F0053K24015F8759h8769E7142h2754c4518q3691
$$ 90382 -183474 57500 142269 60053 284068 68759 -88769 57142 -82754 -34518 -118209
19330a18209d9176H5148h5515a2906C73958f3979B8779b19346f6687l76108a89474
$$ -118209 -49176 85148 -85515 -12906 373958 -63979 28779 -219346 -66687 -442795 -189474
19318B15814a5556j53151A68336h8167p0895c6629A44752a91699a2626k91838
$$ 215814 -15556 -168707 168336 -88167 -159062 -36629 144752 -191699 -12626 -304464
19308c04464h3537B57883a25154N188A14613J30077r6964b36404B2390c8878p6840
$$ -304464 -83537 257883 -125154 -119966 114613 244690 147726 -236404 22390 -38878 -115718
19297a15718r213B04561J96355j53638C1790a75008b2232j22676j21572C9891
$$ -115718 -124931 204561 400916 247278 31790 -175008 -22232 -144908 -266480 39891
19286D2154c17346J10192j02986J48893e6931r301n780A99613r2513p372f4114
$$ 42154 -317346 -207154 -310140 -161247 -56931 -66232 -72012 199613 107100 99728 -64114
19274b36175H2932a99187A7213g7321G8463c1573j6263H7590k9213a31345B8645
$$ -236175 82932 -199187 17213 -77321 78463 -31573 -47836 87590 58377 -131345 28645
19262a89759B29349A05630b31963J09654D0840i9201p8620b727j25317k1512B1450
$$ -189759 229349 105630 -231963 -122309 40840 -99201 -177821 -2727 -128044 -149556 21450
19250C529a03895n3554C4347L8322f5152J9703k04860A56586b3521B4334M4592
$$ 3529 -103895 -157449 34347 72669 -65152 -45449 -250309 156586 -23521 24334 68926
19239F8926b34372A24096a12205N4925D0319b40633k16200A49596A8771J16142
$$ 68926 -234372 124096 -112205 -57280 40319 -240633 -456833 149596 18771 134913
19229A34913d5138k8734B33558h1023L22E9759b86358a35849a676m3385l24519
$$ 134913 -45138 -73872 233558 -81023 -80701 59759 -286358 -135849 -1676 -45061 -369580
19218c69580a41708m6209B14809m2781c85975H0549a12052q4976A49227o0645
$$ -369580 -141708 -187917 214809 172028 -385975 80549 -112052 -197028 149227 88582
19208H8582i8827r7007k8613d8494r6334b1311k24359l2839B51240r2584h9715
$$ 88582 -98827 -195834 -224447 -48494 -144828 -21311 -245670 -278509 251240 158656 -89715
19196a74318J8603j10880j15389G6045R474F038f2069k4327E1593a40836j87922
$$ -174318 -155715 -266595 -381984 76045 85519 6038 -62069 -86396 51593 -140836 -328758
19185c28758B03862b17660D5120K7525O3611P4112i5623b5315k70370B2702J30073
$$ -328758 203862 -217660 45120 72645 136256 210368 -95623 -25315 -295685 22702 152775
19174A52775b41288H4019a73822D4890a87234k4421A11516c65574Q4868l5667
$$ 152775 -241288 84019 -173822 44890 -187234 -211655 111516 -365574 -280706 -316373
19164c16373P4296B40093b5162L974m76240g548m0296k23100a16652J5483j56004
$$ -316373 -242077 240093 -25162 -21188 -497428 -7548 -47844 -270944 -116652 -101169 -257173
19153b57173F7398a99191P5456A95822a5909k80487a1283A37732D0858K48532
$$ -257173 67398 -199191 -123735 195822 -15909 -296396 -11283 137732 40858 289390
19143B89390o7225d37035a6906j9177j65363C6566M4561a51432c9371J7367A93263
$$ 289390 222165 -437035 -16906 -36083 -201446 36566 81127 -151432 -39371 -22004 193263
19131A2867g7807j82287n3028B0950a20533I253f4422E7954b7453F7462a23432
$$ 12867 -77807 -260094 -313122 20950 -120533 9253 -64422 57954 -27453 67462 -123432
19119a92063j01524l2439D7821a70937b1241j9632c719C22023j40891O074j3151
$$ -192063 -293587 -326026 47821 -170937 -21241 -40873 -3719 322023 181132 187206 174055
19108A74055a97024o0237j81809A19680a13252j80013r8692A86599h1657c6281
$$ 174055 -197024 -257261 -439070 119680 -113252 -293265 -391957 186599 -81657 -36281
19097a16243r3154j77856A4564J50405a3150l19442F4744M4291E159a21380H8334
$$ -116243 -209397 -387253 14564 164969 -13150 -332592 64744 109035 5159 -121380 88334
19085B58629c3898A05193a4772B0450d24560a80321A12205a73731E4243B891a35379
$$ 258629 -33898 105193 -14772 20450 -424560 -180321 112205 -173731 54243 2891 -135379
19073E9350a21023D8917d10352d8470o1568j83749b0140l80677C712a06644C108
$$ 59350 -121023 48917 -410352 -48470 -110038 -293787 -20140 -400817 3712 -106644 3108
19061g4584F8255a08734A37356B9478e4390A8830a47284c5599j12617j5866K741
$$ -74584 68255 -108734 137356 29478 -54390 18830 -147284 -35599 -148216 -164082 -161341
19050a61341O7028H2873c2600m4521j28198A82924A7041c76617J13102q7575a67049
$$ -161341 -94313 82873 -32600 -77121 -205319 182924 17041 -376617 -263515 -351090 -167049
19038b2077k11121h5758r5543H0266C2630a54375B4423a66666D2835k1151j0617
$$ -22077 -233198 -85758 -181301 80266 32630 -154375 24423 -166666 42835 21684 11067
19027A1067K49792i0903q2021A66942A1761b22206O3338b2952B4737e7370k02696
$$ 11067 260859 -90903 -172924 166942 11761 -222206 -158868 -22952 24737 -57370 -260066
19016b60066C5350Q6378f0415A0453J4951K4127J60319r1388B4927b47949A9225
$$ -260066 35350 121728 -60415 10453 25404 49531 209850 118462 24927 -247949 19225
19004g261k20720J07400A28153J70887b25536b8409C3413a03075n0260B23825
$$ -7261 -227981 -120581 128153 299040 -225536 -28409 33413 -103075 -153335 223825
18993g5363k55917B77778A13944e8679D6397b98299B35908c29371Q099A1427M8394
$$ -75363 -331280 277778 113944 -58679 46397 -298299 235908 -329371 -321272 11427 59821
18982E9821a13465A57432B6747h5546k2782C9401j5605A0500J09606N0918B6776
$$ 59821 -113465 157432 26747 -85546 -108328 39401 23796 10500 120106 171024 26776
18970a18977A4355P5884L2849J3620a41666G8681j5085Q9454R2749c6495l4510
$$ -118977 14355 90239 123088 136708 -141666 78681 63596 153050 245799 -36495 -71005
18959g1005k78470E8369d9541B28547a45632L3323h283j1055j41770k8177f1638
$$ -71005 -349475 58369 -49541 228547 -145632 -112309 -8283 -19338 -161108 -189285 -61638
18947b51252C4821J17610h4305j3415G4877q761c0439k12474A49482b38244A366
$$ -251252 34821 152431 -84305 -97720 74877 66116 -30439 -242913 149482 -238244 1366
18935a10975M914L0138G971r91f748C6181a65636A66144P2008p1481a86150C5417
$$ -110975 -106061 -75923 7971 6980 -6748 36181 -165636 166144 238152 166671 -186150 35417
18922B49660H8531K5991K50352a20291N8918p6700A9337b23492a03747L4080A30172
$$ 249660 88531 114522 364874 -120291 -61373 -138073 19337 -223492 -103747 -69667 130172
18910E2563P8749F2619d3307j01776j18121e9837A10304E2765h2540A24638L19358
$$ 52563 131312 62619 -43307 -145083 -263204 -59837 110304 52765 -82540 124638 443996
18899D43996e2671j07185A73737G8392k4418j0669o426J03147o2134O7640g8816
$$ 443996 -52671 -159856 173737 78392 53974 43305 36879 140026 77892 145532 -78816
18887c0306j6217r3128L8486a9814j11995F583b88231q6862G7156E419b51521
$$ -30306 -46523 -139651 -101165 -19814 -131809 6583 -288231 -375093 77156 5419 -251521
18875a80743A2038K21130K746b8612A8402e82041B34925b57463c8700A49418e5374
$$ -180743 12038 233168 235914 -28612 18402 -582041 234925 -257463 -38700 149418 -55374
18863i244n3306a5290A42200o3187b52528B27122m9585D6115J5090a63112J2836
$$ -9244 -62550 -15290 142200 79013 -252528 227122 177537 46115 61205 -163112 -150276
18852a50276N6353F8060a56923B6981O1089b59064k0062i9118C81443a4638A34621
$$ -150276 -93923 68060 -156923 26981 88070 -259064 -279126 -99118 381443 -14638 134621
18840a10660F1021g7431q9115I2373b18030Q608d958j16247p3207f3181p6212
$$ -110660 61021 -77431 -166546 92373 -218030 -209422 -4958 -121205 -194412 -63181 -139393
18829a39393p3619A7735H608a38784j3163B3225J18666K34353c53405J39097R7209
$$ -139393 -213012 17735 8608 -138784 -151947 23225 141891 376244 -353405 -214308 -117099
18818a17099j44965d9284o6632B80804a31642B20874P76a47180j14935R4168h0044
$$ -117099 -262064 -49284 -115916 280804 -131642 220874 221650 -147180 -262115 -167947 -80044
18806f321I6111c06400A60084b47760J18322B34020b20608j99691C48464g4679
$$ -6321 96111 -306400 160084 -247760 -129438 234020 -220608 -420299 348464 -74679
18795B44217b46966C6025b68798H7729g6748L4563p9524d563j69603k29628B4058
$$ 244217 -246966 36025 -268798 87729 -76748 -42185 -121709 -4563 -174166 -403794 24058
18783b4929B79050c4272K506B01067c78141A75425a55355L3041n3311B2887M5349
$$ -24929 279050 -34272 -31766 201067 -378141 175425 -155355 -122314 -175625 22887 68236
18772F8236i1591m5818M8973k61745a8621k25578j10089B44665b51299K7690d5196
$$ 68236 -91591 -137409 -88436 -350181 -18621 -244199 -354288 244665 -251299 -223609 -45196
18760A20679a12675F9547b76862N7534o302J09660j51825q6500J25167c4284A49928
$$ 120679 -112675 69547 -276862 -219328 -225630 -115970 -267795 -354295 -229128 -34284 149928
18748b79866D4280a70019H7954a04789G9230J47978E4358a17090B90910a5728
$$ -279866 44280 -170019 87954 -104789 79230 227208 54358 -117090 290910 -15728
18737A3981d72314a64099p8122O3820j95675a57168f0264r5829h882j43284B88602
$$ 13981 -472314 -164099 -242221 -178401 -374076 -157168 -60264 -156093 -8882 -152166 288602
18725a671F0801L9085b30936l16191g0158j61766B50259j02494a9223k9949k08476
$$ -1671 60801 99886 -230936 -547127 -70158 -231924 250259 147765 -19223 -49172 -257648
18714b57648d0588A39236g6231A26173a04288b8725k95676H5079e6265k24869
$$ -257648 -40588 139236 -76231 126173 -104288 -28725 -324401 85079 -56265 -281134
18704b81134A48610b02112N2990G1089d37546d3197H4137a56077I557R8989J1349
$$ -281134 148610 -202112 -149122 71089 -437546 -43197 84137 -156077 9557 108546 119895
18693A19895b10821H4477f6083o9575a5863D26d2295A75357e4405B60536b28361
$$ 119895 -210821 84477 -66083 -135658 -15863 426 -42295 175357 -54405 260536 -228361
18681a30745e1651k8386B50870q3122a35656N6993A05846A5478g2292j12680a7058
$$ -130745 -51651 -80037 250870 167748 -135656 -78663 105846 15478 -72292 -184972 -17058
18669d7751A97427b20975P1486d2074j31274N5702r8003A00575L1536i1243j51532
$$ -47751 197427 -220975 -149489 -42074 -173348 -117646 -215649 100575 132111 -91243 -242775
18658b42775C39305a22798j02686E7955J12665q3846i1008E1892a50492A67715
$$ -242775 339305 -122798 -225484 57955 170620 86774 -91008 51892 -150492 167715
18647a12156b7897m12985a68866d9557a5237r685D040b20498f9399O356j71876
$$ -112156 -27897 -440882 -168866 -49557 -15237 -24922 4040 -220498 -69399 -63043 -234919
18636b34919B74469b24342f6262n0893F5639a43920O3512a6907p8404J7610k69967
$$ -234919 274469 -224342 -66262 -117155 65639 -143920 -80408 -16907 -95311 -77701 -347668
18625c47668a5611f579j16010C35455a99249A79139G2852K82751C8217a80482
$$ -347668 -15611 -6579 -122589 335455 -199249 179139 72852 355603 38217 -180482
18614d30281Q1735d4603A728Q538J75625a6873C82318G4277b27635d1237D5735
$$ -430281 -348546 -44603 1728 10266 185891 -16873 382318 74277 -227635 -41237 45735
18602b2990A13769a76204A575J12752C637a00037m1076A17140b07497h767n35409
$$ -22990 113769 -176204 1575 114327 3637 -100037 -141113 117140 -207497 -8767 -544176
18591e44176f960k17692A00714b7997k09l3354B66411e6714H1438i4984F9551
$$ -544176 -6960 -224652 100714 -27997 -28206 -61560 266411 -56714 81438 -94984 69551
18579B24851G0105g8585j52193D9818L1082P036a84607a8149l9598p3998e7206
$$ 224851 70105 -78585 -230778 49818 80900 87936 -184607 -18149 -57747 -131745 -57206
18567A49158b87475A69373i3478h642l71902A20295N5624b81348C9085K08844
$$ 149158 -287475 169373 -93478 -8642 -380544 120295 175919 -281348 39085 247929
18557B47929a60812l494D5691b87883E7417N646J29985a12854k134j49649A15659
$$ 247929 -160812 -164306 45691 -287883 57417 63063 193048 -112854 -114988 -264637 115659
18545a62235L4936D4297c3977k91236P9922C8714c8958G1221c65152J58943A06832
$$ -162235 -127299 44297 -33977 -325213 -245291 38714 -38958 71221 -365152 -206209 106832
18533a02664d5933B05292b05446K7670A58339J23237a17410R030D5679J48708
$$ -102664 -45933 205292 -205446 -177776 158339 281576 -117410 -108380 45679 194387
18523A94387a82133p9606h1409l1729l4166j88969B1390b50600j07969a44195
$$ 194387 -182133 -261739 -81409 -113138 -147304 -336273 21390 -250600 -358569 -144195
18512A20835a41825D44818b17413a00906K3105H7444o686c06257a21400B86325
$$ 120835 -141825 444818 -217413 -100906 -77801 87444 80758 -306257 -121400 286325
18501a0441k13806E3025A0142K13365n3959a12323C39375A61279F0029r194g5648
$$ -10441 -224247 53025 10142 223507 169548 -112323 339375 161279 60029 50835 -75648
18489a60209G6390b66107A63976b15549a05053j77011R7704N2591L8388B59226
$$ -160209 76390 -266107 163976 -215549 -105053 -282064 -184360 -131769 -93381 259226
18478A10252a54902B43686a99895k68754a1956j78534p9890j44814b5250D6327
$$ 110252 -154902 243686 -199895 -468649 -11956 -190490 -270380 -415194 -25250 46327
18467b63317F7182b8162F1536b33770R087b1921A6032M4940b25417A8793d9338
$$ -263317 67182 -28162 61536 -233770 -224683 -21921 16032 60972 -225417 18793 -49338
18455b23297g4898n768C95J18120c71428o8155d7251G4952J5626K5351a05640
$$ -223297 -74898 -80666 395 118515 -371428 -439583 -47251 74952 90578 115929 -105640
18443A16802b01776c2985p6684a7933j3572A1599b2898C07790a4435B04935D3744
$$ 116802 -201776 -32985 -109669 -17933 -31505 11599 -22898 307790 -14435 204935 43744
18431H3845g8722j88333B21619E5234N4224K2809b60883a24873a272k34953B0291
$$ 83845 -78722 -267055 221619 55234 109458 132267 -260883 -124873 -1272 -236225 20291
18419H0705f3901D293b75542H5486B2767R3549b64924Q2232F8586J39243a10447
$$ 80705 -63901 4293 -275542 85486 22767 116316 -264924 -182692 68586 207829 -110447
18407F5066k227N5814a05008p5008A61970J27099C6017b47351A03066e4190m22171
$$ 65066 62839 118653 -105008 -180016 161970 289069 36017 -247351 103066 -54190 -476361
18396d76361a58777C25640b03472B35786e7699b8658k49524C976J17321d5667
$$ -476361 -158777 325640 -203472 235786 -57699 -28658 -278182 3976 121297 -45667
18385f00745J48309d3056B66669H8075A6152a74874h4415j14996g0106F6899C2050
$$ -600745 -452436 -43056 266669 88075 16152 -174874 -84415 -199411 -70106 66899 32050
18373a89588B20518r3246R5048J57278d50861e6891E930a4865j32981D8160a21535
$$ -189588 220518 127272 222320 379598 -450861 -56891 5930 -14865 -147846 48160 -121535
18361a10774D5233K0743K66327i3769B8174a87140A490c76888a62249A2076L5281
$$ -110774 45233 65976 332303 -93769 28174 -187140 1490 -376888 -162249 12076 47357
18350D7357a22715m12800A10383R5744h072m99880d8754F0612B9963O0765c77961
$$ 47357 -122715 -535515 110383 206127 -8072 -507952 -48754 60612 29963 90728 -377961
18338b50600b5012A91302c2966k71767c0655A04917d98851b6492k28785c0253
$$ -250600 -25012 191302 -32966 -304733 -30655 104917 -498851 -26492 -255277 -30253
18327b20580H106i5016G8060J4658K71200c64051P8434G7429J64063K37a25083
$$ -220580 8106 -95016 78060 92718 363918 -364051 -285617 77429 241492 241729 -125083
18315b11385O7620D1638J8293a32449A49274j4423l7640e3358j99919a00765B36667
$$ -211385 -143765 41638 59931 -132449 149274 134851 97211 -53358 -253277 -100765 236667
18303b5516k49316b2394k60610p2338G733P423M2662K73119f1013D6988D696a82466
$$ -25516 -274832 -22394 -283004 -355342 7733 15156 57818 330937 -61013 46988 4696 -182466
18290b64403J00131B86325g7197m3244K1201G9075c25390J36982A44750a65469
$$ -264403 -164272 286325 -77197 -120441 -99240 79075 -325390 -188408 144750 -165469
18279h755q421G9680k1034f197k05693G0192h9010j80035E3544a32049L1395A49276
$$ -8755 -17176 79680 58646 -6197 -211890 70192 -89010 -269045 53544 -132049 -100654 149276
18266A66915b3643B66399A15173a03058J2967A12840E4034b72068c3972D4493
$$ 166915 -23643 266399 115173 -103058 -90091 112840 54034 -272068 -33972 44493
18255B69116F3651a97235B6109C07e92548B70516h9897G2906b04499c7620l6565
$$ 269116 63651 -197235 26109 307 -592548 270516 -89897 72906 -204499 -37620 -74185
18244g4185A0407P2618b71553B1559a37125j2531A77822c51957d7699K2406m7668
$$ -74185 10407 83025 -271553 21559 -137125 -149656 177822 -351957 -47699 -25293 -72961
18233g2961D7005n878d1925j09430F22b68761A73339A8400a79562A131e42755
$$ -72961 47005 41127 -41925 -151355 622 -268761 173339 18400 -179562 1131 -542755
18221g720j79704A89982G7820A2300d16039a72971j31395E2842e7933G853J16430
$$ -7720 -187424 189982 77820 12300 -416039 -172971 -304366 52842 -57933 7853 124283
18210A24283f9590B5241m515d9823F8051N2894a3373C1100J61748J86034j22350
$$ 124283 -69590 25241 20726 -49823 68051 120945 -13373 31100 192848 378882 256532
18199B56532b41075d4995B8997c69757B2921L3705L2909a9321j20947a6548A13975
$$ 256532 -241075 -44995 28997 -369757 22921 56626 89535 -19321 -140268 -16548 113975
18187d55148A30363l9342j6979C1535a17720a1063k25548A28547J85702b60438
$$ -455148 130363 91021 74042 31535 -117720 -11063 -236611 128547 314249 -260438
18176B22513a32746G342c1716F9430K07148g5552j66826J12312A88169d8181a7400
$$ 222513 -132746 7342 -31716 69430 276578 -75552 -242378 -130066 188169 -48181 -17400
18164a09674a5739B97310l9123d0217l7820A01623j1460B1302a47390e1509A6257
$$ -109674 -15739 297310 258187 -40217 -78037 101623 90163 21302 -147390 -51509 16257
18152b8652O000k34296B9831e3870j14491B0541L0784K91482a65969B03516b19485
$$ -28652 -22652 -256948 29831 -53870 -168361 20541 51325 342807 -165969 203516 -219485
18140H8688J45262h0076A1118a85533O3996e5751B96790A09365J67973C3616a45016
$$ 88688 233950 -80076 11118 -185533 -121537 -55751 296790 109365 277338 33616 -145016
18128c01252R1343R5453A65219R8751A02965g306A19415b52616A13445m2372c4523
$$ -301252 -209909 -114456 165219 263970 102965 -7306 119415 -252616 113445 71073 -34523
18116f5627p142k0033j08700C70999g7298a2298G7009e5774a1506o6394A26364
$$ -65627 -72769 -92802 -201502 370999 -77298 -12298 77009 -55774 -11506 -77900 126364
18104C64732b7759A3711b7870q2790j90333J37441G9690K78060j39248j01167
$$ 364732 -27759 13711 -27870 -110660 -300993 -163552 79690 357750 218502 117335
18094A17335p571a05070F8099M4881a2486B49174a46376j20013D6933J06539F5736
$$ 117335 109764 -105070 68099 112980 -12486 249174 -146376 -266389 46933 153472 65736
18082d2234E0282a37550o6250O2335o9954A43717b02484A01269b33505a05308
$$ -42234 50282 -137550 -203800 -141465 -211419 143717 -202484 101269 -233505 -105308
18071a26320j25344A55939c8589m30821F5395J29695B3147J84974b31095c1774
$$ -126320 -251664 155939 -38589 -469410 65395 195090 23147 208121 -231095 -31774
18060c1151A37519P5483B4804Q959a10942p8955N1001c3842k36446C2725K2938
$$ -31151 137519 213002 24804 33763 -110942 -189897 -138896 -33842 -270288 32725 55663
18049E5663R8214F3304B0302K17072a8474B57046a63620c0781G7620b26916A95502
$$ 55663 153877 63304 20302 237374 -18474 257046 -163620 -30781 77620 -226916 195502
18037a07218j58497J29011L1741j02988C7190b2925j69131A42631d6489B14868
$$ -107218 -265715 -136704 -104963 -207951 37190 -22925 -192056 142631 -46489 214868
18026B00197e9313A44528J68149g2412k76305A45623c2825A46030n4460a44038
$$ 200197 -59313 144528 312677 -72412 -348717 145623 -32825 146030 91570 -144038
18015b37249B15719C7510b33391N4097M30Q4188B7673d32124A416a43105I1170
$$ -237249 215719 37510 -233391 -179294 -178864 -94676 27673 -432124 1416 -143105 91170
18003B00344I5582b45591b6120f203C8180G190h8283B16855j05600a49473A72855
$$ 200344 95582 -245591 -26120 -6203 38180 7190 -88283 216855 111255 -149473 172855
17991B51050h7659j37032A82342c76712d4131j54469P2369A23869b21844C87883
$$ 251050 -87659 -224691 182342 -376712 -44131 -198600 -126231 123869 -221844 387883
17980a80653p8332B16697J89047F0004d16296P1022b1747q9976B1103c82966h7741
$$ -180653 -258985 216697 405744 60004 -416296 -345274 -21747 -111723 21103 -382966 -87741
17968c07201R7136k902B2193N9133o883J41756E253h2230C60742F4435a3325B2529
$$ -307201 -210065 -212967 22193 81326 74443 216199 5253 -82230 360742 64435 -13325 22529
17955I153a57690o5734C3181a49834B1784a78022A15440i6318p6017M9957B76148
$$ 9153 -157690 -223424 33181 -149834 21784 -178022 115440 -96318 -172335 -122378 276148
17943D8225h4669E4052b61129J27292A82388a38824j13058i4385A37477C7078
$$ 48225 -84669 54052 -261129 -133837 182388 -138824 -251882 -94385 137477 37078
17932A4974h4630j31710A76429E0415D510J8206L4733b4501A61082C4643c23845
$$ 14974 -84630 -216340 176429 50415 4510 22716 57449 -24501 161082 34643 -323845
17920D33747F3715G615J9316R56P6478a92112E3580b38918J15115o5491O4505
$$ 433747 63715 7615 26931 27887 104365 -192112 53580 -238918 -123803 -189294 -124789
17909a24789A47642b08588j33552c4811B13046I6680k0002d1478j9009A20131
$$ -124789 147642 -208588 -342140 -34811 213046 96680 76678 -41478 -60487 120131
17898B33933j7516a71153E8581a6108B6690K51688b76429D0483K89003f8705A96675
$$ 233933 216417 -171153 58581 -16108 26690 278378 -276429 40483 329486 -68705 196675
17886b03781A6065c4294k92686i4197A88812a38063p5228B72961B3326a57356
$$ -203781 16065 -34294 -326980 -94197 188812 -138063 -213291 272961 23326 -157356
17875C40341A15361P2576r827j6180a56191m4415f9363A55057b56246h0400A51830
$$ 340341 115361 187937 178110 161930 -156191 -200606 -69363 155057 -256246 -80400 151830
17863D5953a25989E2549A4536J72251A1799n370b04882E7674f5714b3865B4514
$$ 45953 -125989 52549 14536 186787 11799 6429 -204882 57674 -65714 -23865 24514
17851A42851K5387Q1900a090n6271C13337q2035a21188d6295r4317a1673A21533
$$ 142851 168238 250138 -1090 -57361 313337 231302 -121188 -46295 -140612 -11673 121533
17839C9734K28858j14808a63521A88787D7683J51090C0199K10100I7778J20054
$$ 39734 268592 153784 -163521 188787 47683 198773 30199 240299 97778 217832
17829B17832A7297e28458a61951A28183L7365A7514b18773A29248j8129a08781
$$ 217832 17297 -528458 -161951 128183 165548 17514 -218773 129248 111119 -108781
17818h8074L2301l17433C08437n8320c44729K9102A37094a29278F0276Q7475a10849
$$ -88074 -55773 -373206 308437 250117 -344729 -315627 137094 -129278 60276 147751 -110849
17806a40289I4662K99203a59575A47036i7006B9079c57296F4592k8493K609i0944
$$ -140289 94662 393865 -159575 147036 -97006 29079 -357296 64592 36099 38708 -90944
17794a9686k20463l4038A79268b06253g3731A15064A8659K22394b34311A62615
$$ -19686 -240149 -274187 179268 -206253 -73731 115064 18659 241053 -234311 162615
17783B15949k5292h0433j3635M4323A62657J2203e619B2929c0598F2151e40432
$$ 215949 190657 -80433 -94068 -49745 162657 174860 -5619 22929 -30598 62151 -540432
17771C01802c11682c8251B62832q8205L1620c36012G6287O2655J47673m8065c71139
$$ 301802 -311682 -38251 262832 174627 206247 -336012 76287 138942 286615 238550 -371139
17759e346k26790c9507F8246b78281A01542a7026A37963J39726J38152A12165
$$ -5346 -232136 -39507 68246 -278281 101542 -17026 137963 277689 415841 112165
17748A81938A3821a87275B92796C1728K6171K5586K1042B7682J64093i4238d2485
$$ 181938 13821 -187275 292796 31728 57899 83485 104527 27682 191775 -94238 -42485
17736a44913M4570n9216A81786a47430A03401c28575B89791C1757Q3085a14807
$$ -144913 -100343 -159559 181786 -147430 103401 -328575 289791 31757 114842 -114807
17725E4382b31246f7398A30565a15090f719j17987N9466C33034A10973k3947O538
$$ 54382 -231246 -67398 130565 -115090 -6719 -124706 -65240 333034 110973 87026 93564
17714I3564J92585b67126E130L41607G069J00129a10585c5406B5425A0523R8412
$$ 93564 286149 -267126 5130 346737 7069 107198 -110585 -35406 25425 10523 108935
17703A08935P6811a47796A02333M3933C2140b56966R9868c7252j10337E0293a10711
$$ 108935 185746 -147796 102333 146266 32140 -256966 -157098 -37252 -147589 50293 -110711
17691a24438A81475b53539a17921k17155A60258k4423b79766E3408M03860B0326
$$ -124438 181475 -253539 -117921 -335076 160258 135835 -279766 53408 457268 20326
17680b19965A27773P0536r4104g592j49109E6453R624b8487B05478r9535c5189
$$ -219965 127773 198309 104205 -7592 -156701 56453 66077 -28487 205478 105943 -35189
17668D3047N4681O8499C9459P6189h1582A60180N7693b263q4017B9474K31459
$$ 43047 97728 166227 39459 115648 -81582 160180 217873 -2263 -86280 29474 260933
17657B60933e639A45982h7284j28582A48028c8151m4098G1716a5002o5546B08055
$$ 260933 -5639 145982 -87284 -215866 148028 -38151 -82249 71716 -15002 -80548 208055
17645g1888b8492E14101a66416D7369K20340L33D4395J19390Q6079c5377H1728
$$ -71888 -28492 514101 -166416 47369 267709 268042 44395 163785 249864 -35377 81728
17633b3879j40785F3839O7167B4083a7581A13480c98053A13635J7326E3422J81440
$$ -23879 -164664 63839 131006 24083 -17581 113480 -398053 113635 130961 53422 234862
17622B34862b41202m3968a9961G7610J6490J9798A3001i6301C68542D0848c049
$$ 234862 -241202 -285170 -19961 77610 94100 113898 13001 -96301 368542 40848 -3049
17610A64937A7504b30842P8840k56210C30753a46193c1042A03865L3443i906k0507
$$ 164937 17504 -230842 -152002 -408212 330753 -146193 -31042 103865 137308 -9906 -30413
17599c0413A35463h5700A52787a99859G1594J71653p1202k8511E3628K0215d2994
$$ -30413 135463 -85700 152787 -199859 71594 243247 172045 143534 53628 73843 -42994
17587A49736b7745A44466J8026l3733k3420a60874A70392l9518a26895B61816
$$ 149736 -27745 144466 162492 128759 105339 -160874 170392 130874 -126895 261816
17576c4304o2138A11495n4500h4095B18401a03910A91352l9430a26327B71062
$$ -34304 -96442 111495 56995 -84095 218401 -103910 191352 151922 -126327 271062
17565h1676G7196a16343B21905A00624o652a3898E0965L15423a96787P2231d2838
$$ -81676 77196 -116343 221905 100624 93972 -13898 50965 366388 -196787 -124556 -42838
17553B32983p2545d4721A62023E850a91687B31535o8245m3458Q6319a06020C19793
$$ 232983 160438 -44721 162023 5850 -191687 231535 163290 119832 206151 -106020 319793
17541E7232L6103J20239J79587f845q2917B68181i8509B31091R7872B1880O2280
$$ 57232 93335 213574 393161 -6845 -89762 268181 -98509 231091 328963 21880 84160
17530H4160a91464E43693A39979k3417K140J0429k1189K58335A47430M9839F6454
$$ 84160 -191464 543693 139979 116562 118702 129131 107942 366277 147430 197269 66454
17518f1262C9123P6599c5848A61791O5708J15731j44787E7812c89543I0122K94617
$$ -61262 39123 115722 -35848 161791 227499 343230 198443 57812 -389543 90122 384739
17507C84739d3264j08482A38311l023c4731B20250J29913a84708I6839a3960B59929
$$ 384739 -43264 -151746 138311 135288 -34731 220250 350163 -184708 96839 -13960 259929
17495A29041h1083A64595a58862A2823a13716E4269b6770r3453B73267j30046
$$ 129041 -81083 164595 -158862 12823 -113716 54269 -26770 -120223 273267 143221
17485A43221d6890B88849L4627e0702B35258o1263j2107F4562K33193I3332J03778
$$ 143221 -46890 288849 323476 -50702 235258 173995 161888 64562 297755 93332 197110
17474A97110H3129M97654H7016Q3996D3993b6803k29752o2024g7800D0189Q747
$$ 197110 83129 580783 87016 171012 43993 -26803 -256555 -318579 -77800 40189 48936
17463D8936J87627N2074D1751c9750J3200G4370J36051M64331A6228K34223j17490
$$ 48936 236563 288637 41751 -39750 -26550 74370 210421 674752 16228 250451 132961
17452A32961k5254H624J60409O2232g5189A57895L60770P3015B17690k5718J47468
$$ 132961 107707 8624 169033 231265 -75189 157895 518665 591680 217690 191972 339440
17441C39440F8097j2795b9352F59378B49182d5990k40941I7090L01946A34319
$$ 339440 68097 55302 -29352 659378 249182 -45990 -286931 97090 399036 134319
17430B63258j27064K08599A16284j7868J03928P9131m0585A18298J69920a37963
$$ 263258 136194 344793 116284 98416 202344 281475 240890 118298 288218 -137963
17419I3148J71483j20902K06459R3819j13334B2767K78155P182F5222b96604B23133
$$ 93148 264631 143729 350188 444007 330673 22767 300922 308104 65222 -296604 223133
17407E3370L7888b87326C63433b10027C19215A9541J36800B4770Q5359D6631g5564
$$ 53370 91258 -287326 363433 -210027 319215 19541 156341 24770 110129 46631 -75564
17395A93192j0984J376Q2266J88087j85470j32617d9899C55299a46530I3547L11799
$$ 193192 182208 183584 265850 453937 268467 135850 -49899 355299 -146530 93547 405346
17384D05346j52582o3375E4158b5214C28637G0325L17264a19170A33302J74293
$$ 405346 252764 189389 54158 -25214 328637 70325 387589 -119170 133302 307595
17374C07595A11031R0478C4788m226M9938J86253j3991b18130C92839f7210F1891
$$ 307595 111031 201509 34788 30562 80500 266753 252762 -218130 392839 -67210 61891
17362a07863B55601d6255J1779A35754m9525j4589j8131J64379Q1648l0947F7743
$$ -107863 255601 -46255 -34476 135754 86229 71640 53509 217888 299536 268589 67743
17350d2094a2598A96412a04831A39838J32524e0628C30085J65002A92323E3721
$$ -42094 -12598 196412 -104831 139838 272362 -50628 330085 495087 192323 53721
17339A55972k6020J52849L4090l7993J10022a68023B40730n9143j2117C5432a08644
$$ 155972 129952 282801 316891 278898 388920 -168023 240730 181587 169470 35432 -108644
17327A91612j9973M0518J15726i441A15239B0106J0642f309l8082g164j76588
$$ 191612 171639 212157 327883 -9441 115239 20106 30748 -6309 -44391 -7164 -183752
17316a83752C36896J17787H0104A2847J06581J38983p9032b28612f5334B36236
$$ -183752 336896 454683 80104 12847 119428 258411 179379 -228612 -65334 236236
17305a63126A71751L96903d4998K313j32256B60845p1801m7447J76728c05401
$$ -163126 171751 568654 -44998 -42685 -174941 260845 189044 141597 318325 -305401
17294A15906P0936l4185r932A9377a1067A69630R31J61772i4933C14789A22597
$$ 115906 186842 152657 142725 19377 -11067 169630 170561 332333 -94933 314789 122597
17282g9498B05570q0115L15838a00266A2288J25406n3948M09358f7106k5338J3409
$$ -79498 205570 125455 441293 -100266 12288 137694 83746 493104 -67106 -92444 -79035
17271g9035b700A2615L19008A21508J12346L6983A15659j4606R0563N1561m8285
$$ -79035 -2700 12615 331623 121508 233854 270837 115659 101053 191616 243177 194892
17260A94892n0540J21515r5887p8531q664a94121B52295L9694a21029B2698R3890
$$ 194892 144352 265867 169980 91449 82785 -194121 252295 291989 -121029 22698 116588
17249A16588j9631l5465f6839A98898O3281J99985k02323b6849B22367O4277G645
$$ 116588 96957 61492 -66839 198898 262179 462164 259841 -26849 222367 286644 7645
17237D13152E4036a01951C23685j14174E2491d5858B5080K74928A16659M01056
$$ 413152 54036 -101951 323685 209511 52491 -45858 25080 300008 116659 517715
17227E17715A80872f0195B8589i7458A64330m6972R6933J3301K22879M4115B26354
$$ 517715 180872 -60195 28589 -97458 164330 117358 214291 227592 450471 494586 226354
17215C06947J10177j49779j31295L7891K38607A4156L72816j13847K650a04192
$$ 306947 417124 267345 136050 173941 412548 14156 386972 273125 275775 -104192
17204g1673A44892K33448J67874k18436j55486q757n7787P9856D2869M47299d3896
$$ -71673 144892 378340 546214 327778 172292 163535 105748 185604 42869 490168 -43896
17192A92955H7585M2999M57974a5101D41052A01202R1127M9011o7278c1792G4103
$$ 192955 87585 130584 588558 -15101 441052 101202 192329 241340 174062 -31792 74103
17180E29887f9090D36529p8970A58942J73186j53576l3387a35293C01883M8308
$$ 529887 -69090 436529 357559 158942 332128 178552 145165 -135293 301883 350191
17170C50191k9792i7464A47187J96315P6721j84961J05294C0777N05118j32578
$$ 350191 320399 -97464 147187 343502 420223 235262 340556 30777 535895 403317
17160D03317A30267K29266N0878P0364n3722j56530J22541L658j94816K2862A4192
$$ 403317 130267 359533 410411 480775 427053 270523 393064 396722 201906 224768 14192
17148a670B65748i440C00683o9472K13887j41489o9157O5761j37360K26419A28723
$$ -1670 265748 -9440 300683 231211 445098 303609 234452 300213 162853 389272 128723
17136C08338J7427a17680A91916O5849o7731g875B62491K753A30218M61985k50137
$$ 308338 325765 -117680 191916 257765 190034 -7875 262491 265244 130218 592203 342066
17125C42066J2256A51042J53054D6129O37667C27023M25489A40477L49250k14288
$$ 342066 354322 151042 304096 46129 683796 327023 752512 140477 489727 275439
17115B75439q3776J84862n824o8157N6658m7432L38511D3631K63253l8746J88086
$$ 275439 191663 376525 370701 302544 359202 311770 650281 43631 306884 268138 456224
17104D56224j73766j04508M09274B19530J69661D9146J48194L94459j45858k9548
$$ 456224 282458 177950 587224 219530 389191 49146 197340 591799 445941 416393
17094D16393A67795K42556o0464J41804H0836L08793M2826A58993K99730a30662
$$ 416393 167795 410351 349887 491691 80836 389629 432455 158993 458723 -130662
17083F05212B12784K24169F6110J35817J24730R3747j03516K24802Q2225j83002
$$ 605212 212784 436953 66110 201927 326657 420404 316888 541690 623915 440913
17073D40913m0737K6963j46234J1857L22407B46536C3069J91848L34973p432L753
$$ 440913 400176 427139 280905 292762 615169 246536 33069 224917 559890 552458 556211
17062E56211a25956D76621o7065K10162k40955J92954j18336A76441M14964k57162
$$ 556211 -125956 476621 409556 619718 378763 571717 453381 176441 591405 334243
17052C34243J13865L21050C70115K24828j78152q5318L4959K60412K5328B02961
$$ 334243 448108 769158 370115 594943 416791 331473 366432 626844 652172 202961
17041B99562J22446J96934r9131B46831J29293J10393N650K8705J59679M6440
$$ 299562 422008 618942 519811 246831 376124 486517 492167 520872 680551 726991
17031G26991l22952K78759k95158J07705J32795j73495N8689L03381l39306j9034
$$ 726991 404039 682798 387640 495345 628140 454645 513334 816715 477409 458375
17021D58375r4660J66912P1810M20366C32021M99423q5882C28345L32447j00949
$$ 458375 363715 530627 602437 1022803 332021 831444 745562 328345 660792 559843
17011E59843k9294p3310K83465p6833P1204M3220N0462j00799m2233q786J66597
$$ 559843 530549 457239 740704 663871 735075 778295 828757 727958 685725 676939 843536
17000H43536j74619p1631K03315N5649l9189q6508P5542J15343l00437J11048
$$ 843536 668917 597286 800601 856250 817061 730553 806095 921438 621001 732049
16990G32049J30115j54272l8102J34355O5443m27879L66360j88070J29978J55002
$$ 732049 862164 707892 669790 804145 869588 441709 808069 619999 749977 904979
16980I04979k14242J79347J94247j11271l92659L71801Q1782n02642J01694K66296
$$ 904979 690737 870084 1064331 953060 560401 932202 1013984 511342 613036 879332
16970H79332j72247K16483M3261k67271j54658K45632J78769j02020K07676k47500
$$ 879332 707085 923568 966829 699558 544900 790532 969301 867281 1074957 827457
16960H27457R518O858K43202l31521j01417L37647j55419J66229j94978K9893
$$ 827457 836975 843833 1087035 755514 654097 991744 836325 1002554 807576 837469
16950H37469L11316j11379q4069O68333l35837k73328K37851m560j58809j48497
$$ 837469 1148785 1037406 953337 1621670 1285833 1012505 1250356 1245796 1086987 938490
16940I38490L05076n14701K01415q8109J20398Q9008L07727J69933k58873k63720
$$ 938490 1243566 728865 930280 842171 962569 1051577 1359304 1529237 1270364 1006644
16930A006644R7472P5394o3189j38130K56068K51620n95305N64586o9793o5810
$$ 1006644 1104116 1179510 1116321 978191 1234259 1485879 890574 1455160 1385367 1319557
16920A319557L82942l96064l9191K44593j05858J43854p3999k3719j30798M3048
$$ 1319557 1702499 1306435 1267244 1511837 1405979 1549833 1475834 1452115 1321317 1364365
16910A364365j73994K70366l01694R5092L3882K66757J36372l31568L40885K8509
$$ 1364365 1190371 1460737 1159043 1254135 1288017 1554774 1691146 1359578 1700463 1728972
16900A728972k48866K59401J64474m90503J96522J11103j73063L17146j34333
$$ 1728972 1480106 1739507 1903981 1413478 1610000 1721103 1548040 1865186 1730853
16891A730853p2130m1966r3308M57997R4375r4310l8728N1030k17850J65327K43607
$$ 1730853 1658723 1616757 1523449 1981446 2075821 1981511 1942783 1993813 1775963 1941290 2184897
16880B184897k02130J66103P2220k6825o6791M429J27867O2744m12050N77405
$$ 2184897 1982767 2148870 2221090 2194265 2127474 2131903 2259770 2322514 1910464 2487869
16870B487869J663m75516M62616J04277M0800k2761j22151J98232l43039M40509
$$ 2487869 2489532 2014016 2476632 2580909 2621709 2598948 2476797 2675029 2331990 2772499
16860B772499J73279m8611j48947j94050N16216l38778K5088j06052O23609l1148
$$ 2772499 2945778 2897167 2748220 2554170 3070386 2731608 2756696 2650644 3274253 3243105
16850C243105m29515L92990j75240O8992p3615M97112k99556J76402P4324L48161
$$ 3243105 2813590 3206580 3031340 3100332 3026717 3523829 3224273 3400675 3474999 3823160
16840C823160m61413K42124N37541n56465J91511R8696k14296K94261j89937L93474
$$ 3823160 3361747 3603871 4141412 3584947 3776458 3875154 3660858 3955119 3765182 4158656
16830D158656J30379M07834m39488L30713o1997P8372K33498l00786N31624K6998
$$ 4158656 4289035 4696869 4257381 4588094 4526097 4604469 4837967 4537181 5068805 5095803
16820E095803J47537r3782N21456l8125K47274l84239N13810m4621M99505m8220
$$ 5095803 5243340 5149558 5671014 5632889 5880163 5495924 6009734 5965113 6464618 6416398
16810F416398j82275M94993J15499j67726K98141J5720N52372q2300K94998N4985
$$ 6416398 6234123 6729116 6844615 6676889 6975030 6990750 7543122 7460822 7755820 7810805
16800G810805J00242J78692K46348N73815m85146J62572Q63764k24094M08637
$$ 7810805 7911047 8089739 8336087 8909902 8424756 8587328 9451092 9226998 9635635
16791I635635M57875M25966L8313J2750P99345P6655p8832P10712J46379L40803
$$ 9635635 10093510 10519476 10557789 10570539 11369884 11446539 11367707 12078419 12224798 12565601
16781A2565601M27992O42796O52815K06608M47684L28619L04503O46100O87366
$$ 12565601 12993593 13636389 14289204 14495812 14943496 15272115 15576618 16222718 16910084
16772A6910084M20440N47013R41063K91254Q69753O63473R74733P30288R52149
$$ 16910084 17330524 17877537 18818600 19109854 19979607 20643080 21617813 22348101 23300250
16763B3300250R29561J116462Q83136R82163J385536R15857J290993J497634J690170
$$ 23300250 24229811 25346273 26229409 27211572 28597108 29512965 30803958 32301592 33991762
16754C3991762R08806J845649J613242J971944K165986K221189K217825K414836
$$ 33991762 34900568 36746217 38359459 40331403 42497389 44718578 46936403 49351239
16746D9351239K511214K848562L078504L163515L368947M017536L873523M229098
$$ 49351239 51862453 54711015 57789519 60953034 64321981 68339517 72213040 76442138
16738G6442138M861531M601035N490218N722934O051837O173192P203952P107027
$$ 76442138 81303669 85904704 91394922 97117856 103169693 109342885 116546837 123653864
16730A23653864P609535P726773Q317923Q266146Q364801Q436033Q067859P468652
$$ 123653864 131263399 138990172 147308095 155574241 163939042 172375075 180442934 187911586
16722A87911586O849100O061296M638602L013487K710185L25722q39026k177316
$$ 187911586 194760686 200821982 205460584 208474071 211184256 211509978 210670952 208493636
16714B08493636l888778n150828o408916p069501p382054q127202q453865q372463
$$ 208493636 204604858 199454030 193045114 185975613 178593559 170466357 162012492 153640029
16706A53640029q778974q122047q069590p675533p149890o735006o888518n977104
$$ 153640029 144861055 136739008 128669418 120993885 113843995 107108989 100220471 94243367
16698I4243367n787907n040917m859561m639128m324703l938885l976011l045449
$$ 94243367 88455460 83414543 78554982 73915854 69591151 65652266 61676255 58630806
16690E8630806l464918l101818k610933k550539k347750k258292k102049k184192
$$ 58630806 55165888 52064070 49453137 46902598 44554848 42296556 40194507 38010315
16682C8010315j721685j788497j394026j171682j613282j321776j017541j510689
$$ 38010315 36288630 34500133 33106107 31934425 30321143 28999367 27981826 26471137
16674B6471137j093513j169721j082491o35149p67402q73949j136663k35842j003912
$$ 26471137 25377624 24207903 23125412 22490263 21722861 20848912 19712249 19476407 18472495
16665A8472495l21195o43619n60142o19314o54477k42274j153922n59067O2465
$$ 18472495 18151300 17507681 16947539 16328225 15673748 15431474 14277552 13718485 13780950
16656A3780950p11617j39923m17645n53962m80850K62826o48085k61194m72561
$$ 13780950 13069333 12929410 12511765 11957803 11476953 11739779 11091694 10830500 10357939
16647A0357939J2692l49568m93349l58298J3192p24786K77934k93932m18287j11364
$$ 10357939 10370631 10021063 9527714 9169416 9182608 8457822 8735756 8441824 8023537 7912173
16637G912173L3167n85321j47932J56340l27640r1077p55651N46722p47996l5113
$$ 7912173 7945340 7360019 7212087 7368427 7040787 6949710 6194059 6740781 5992785 5957672
16627E957672J22508l05680k5155p9295o5503l89775K22782j99071k40537K41483
$$ 5957672 6080180 5774500 5749345 5670050 5604547 5214772 5437554 5238483 4997946 5239429
16617E239429l41147O700k42730j07635j65025p2907j9514J37652l27798m9329
$$ 5239429 4898282 4904982 4662252 4554617 4389592 4316685 4297171 4434823 4107025 4057696
16607D057696N290j58712j60101K12943m10099K60325r9747m73818J10284J21790
$$ 4057696 4062986 3904274 3744173 3957116 3547017 3807342 3707595 3233777 3344061 3465851
16597C465851l70845l21598J60302o6385j51189M69551j49056l2595j27902J41545
$$ 3465851 3095006 2773408 2933710 2867325 2716136 3185687 3036631 3004036 2876134 3017679
16587C017679K8959m01797M6581P1236n1045Q8440k03860j70485l2208J83527
$$ 3017679 3046638 2644841 2691422 2762658 2711613 2800053 2596193 2425708 2393500 2577027
16577B577027j34129J42156n27716K13143J19809k86871K27343l08681J92003
$$ 2577027 2442898 2585054 2057338 2270481 2390290 2103419 2330762 2022081 2214084
16568B214084J48296k87732m9582K8878P3849m12362K61091L2144l11727P7106
$$ 2214084 2362380 2074648 2025066 2053944 2127793 1715431 1976522 2008666 1696939 1774045
16558A774045l14022J8980K48062o7523J49678o0073k68796r6353R663J50608
$$ 1774045 1460023 1479003 1727065 1659542 1809220 1749147 1480351 1383998 1393661 1544269
16548A544269J82575p391j29082l41937m0992K84266j446j80429N6444j1596J6405
$$ 1544269 1726844 1719453 1590371 1248434 1207442 1491708 1490262 1309833 1366277 1354681 1371086
16537A371086l99438K98977N45442o67963M98055j84162j29332L56544m87324
$$ 1371086 971648 1270625 1816067 1148104 1646159 1461997 1332665 1689209 1201885
16528A201885k46921J30849J24774n9637N660J07305J61907k37260L3598r8873
$$ 1201885 954964 1085813 1210587 1150950 1156610 1263915 1425822 1188562 1222160 1123287
16518A123287J97837k00147j5238k51792q2079J58996L6458M88241m84738P8412
$$ 1123287 1321124 1120977 1105739 853947 771868 930864 967322 1455563 970825 1049237
16508A049237j14568J88911K0395l1793J53046k27393m01506K21034k11337J02268
$$ 1049237 934669 1123580 1143975 1112182 1265228 1037835 636329 857363 646026 748294
16498G48294J62742K42312l83113q6846N8646O301K23775l22376K40295l6987
$$ 748294 911036 1153348 770235 683389 742035 748336 972111 649735 890030 853043
16488H53043J22584j68226L73880l52823K4331k49757N38677D69927M52202K55639
$$ 853043 975627 807401 1181281 828458 852789 603032 1141709 469927 922129 1177768
16478A177768n02826L05862l32492N8450p6092n1899M02578l1678m67010R2524
$$ 1177768 674942 980804 648312 706762 630670 578771 981349 949671 482661 575185
16468E75185K02260j85208J46843j24319K8132J40215j38678L21928j27551j85545
$$ 575185 777445 592237 739080 614761 642893 783108 644430 966358 838807 653262
16458F53262M4191J22371m8148C59537J51206K31022j19707Q6743j43605P4007
$$ 653262 697453 819824 771676 359537 510743 741765 622058 708801 565196 639203
16448F39203A23323O71241k45609A81698L40955J56560k44883L80722l16483A28504
$$ 639203 123323 794564 548955 181698 522653 679213 434330 815052 498569 128504
16437C35669K47293j57234Q5924L60888l36799J50086G6462O84067l07535K45295
$$ 335669 582962 425728 511652 872540 535741 685827 76462 760529 452994 698289
16427F98289j70101m0893L37196B80956J03721J99349k49856K86777j56929B21169
$$ 698289 528188 487295 824491 280956 384677 584026 334170 620947 464018 221169
16416G05683j3649m6696K79955j50991l27610P9851k0133l7762J41054j74650
$$ 705683 692034 645338 925293 774302 446692 526543 506410 468648 609702 435052
16406D35052Q5766J17347j85008j61800J96428m7613J23984j85569J12392j46385
$$ 435052 520818 638165 453157 291357 487785 440172 564156 378587 490979 344594
16396C44594K96155k10761J95131A99568J68862K60990M8356j20287K6762r2404
$$ 344594 640749 429988 625119 199568 368430 629420 677776 557489 584251 491847
16386D91847B08429L27303B55464L46805A11346K10363A38017J83740j10142M72862
$$ 491847 208429 535732 255464 602269 111346 321709 138017 321757 211615 684477
16376F84477H7167J238K71349N1396K57706F6992N2130P18984l99437q1361A58646
$$ 684477 87167 88405 359754 411150 668856 66992 119122 838106 438669 357308 158646
16364d8930C06171R2582M3598B13554B2509L86767O2567q7386R3818B03631M04526
$$ -48930 306171 398753 442351 213554 22509 409276 471843 384457 478275 203631 608157
16353F08157B38413K27797k1487K07629D0500N23363P6486j90558B05470Q971
$$ 608157 238413 466210 444723 652352 40500 563863 640349 449791 205470 214441
16343B14441F1052J12425K34799J9734j08462r102L58850k08434j83573n3639
$$ 214441 61052 173477 408276 428010 319548 310446 669296 460862 277289 223650
16333B23650J59465M02346B81822a10050I4911K39762L759A28785K91223L7880
$$ 223650 383115 785461 281822 -110050 94911 334673 338432 128785 420008 457888
16323D57888J13100j63087j81348m4854L03795J00841k57969A09249J74665l5262
$$ 457888 570988 407901 226553 181699 485494 586335 328366 109249 283914 248652
16313B48652J40423M01273B94357J73901j27928o4924L7675o9766K15702j62468
$$ 248652 389075 790348 294357 468258 340330 275406 313081 243315 459017 296549
16303B96549J85837j66851N626E9019K47975D9053N05264g8246I1769K91146j65362
$$ 296549 482386 315535 321161 59019 306994 49053 554317 -78246 91769 382915 217553
16292B17553N2820d8609A85645q0705L40293J96022k61036k7970L5322e4900D26800
$$ 217553 270373 -48609 185645 104940 445233 641255 380219 352249 387571 -54900 426800
16280C41349O3741G1415M75292k46288o3170J53514R2755j40119j01911r5638
$$ 341349 405090 71415 546707 300419 237249 390763 483518 343399 241488 145850
16270A45850J30303Q568Q6894O3259P096D9494L61320j12921A00993i8478A66151
$$ 145850 276153 284721 371615 434874 441970 49494 410814 297893 100993 -98478 166151
16258A60474O8355q5552L8046M3434J39388A11324J95226a7856F051N4279L17637
$$ 160474 228829 143277 181323 224757 364145 111324 306550 -17856 6051 60330 377967
16247C77967A30858m7402J53656A1114P6111J25302c771C04590p1848N6940A24011
$$ 377967 130858 83456 237112 11114 87225 212527 -3771 304590 232742 289682 124011
16235c3921A80225n2399C2295a60572A51460D6065J9344P0463k780F5201J79358
$$ -33921 180225 127826 32295 -160572 151460 46065 65409 135872 133092 65201 244559
16224B44559A4211L55638f6008A88588N5546R9089N2269g2980k6768D25958H423
$$ 244559 14211 369849 -66008 188588 244134 343223 395492 -72980 -99748 425958 8423
16212D85458B23666A05554l7367K12358H2344K15087G6641J75334p8216N4994
$$ 485458 223666 105554 68187 280545 82344 297431 76641 251975 173759 228753
16202B28753A03864N8638L6433L90209k52984b65693A72482p4064l2475O4680
$$ 228753 103864 162502 198935 589144 336160 -265693 172482 98418 65943 130623
16192A30623R111L22639j91545B4351J76347L4079R5687I2308a44792D24919c62437
$$ 130623 139734 462373 270828 24351 200698 234777 330464 92308 -144792 424919 -362437
16180B08114G9622b08584A47123J41553D9716L86437E0790h0582A59083m8116
$$ 208114 79622 -208584 147123 288676 49716 436153 50790 -80582 159083 110967
16170A10967E3426L33418r8303A29677K34755b5413a1878E3086F022J00459K0473
$$ 110967 53426 386844 288541 129677 364432 -25413 -11878 53086 6022 106481 126954
16159A26954m0508K67980o2803E7502K60172N0653h8560A93738a13081I7380g6088
$$ 126954 86446 354426 291623 57502 317674 368327 -88560 193738 -113081 97380 -76088
16147A24128B5045b52222D32085C5169Q8744D4439b51935J16242E1702J61815
$$ 124128 25045 -252222 432085 35169 123913 44439 -251935 -135693 51702 213517
16137B13517D8974a19308H0246L6673M144a75097B93614c8546I6061a39623m6315
$$ 213517 48974 -119308 80246 116919 121063 -175097 293614 -38546 96061 -139623 -185938
16126a85938A70881J99373A16908M0087o3303c3871o8926j67613A12478a78144
$$ -185938 170881 370254 116908 156995 93692 -33871 -102797 -270410 112478 -178144
16115B3600L80777K1944A72758i8450C1693a952A91437c6464G2744N1530f0376
$$ 23600 404377 426321 172758 -98450 31693 -1952 191437 -36464 72744 124274 -60376
16103F8458K14273o6459A4488a53406J4596A39031j5440D2379L6046b8523k1924
$$ 68458 282731 216272 14488 -153406 -138810 139031 123591 42379 78425 -28523 -50447
16092e0447k9010q7499b1300j571A50344C7304j5867K1261O8136D7022L35273
$$ -50447 -79457 -166956 -21300 -22871 150344 37304 21437 42698 110834 47022 382295
16081C82295j52849H3806K43595b9200l25651B69553j27275P9071h3965j88814
$$ 382295 229446 83806 327401 -29200 -354851 269553 142278 221349 -83965 -272779
16071b72779R3160B2317J47240a57629J5289A9726a02162B49747F7357J4295b13915
$$ -272779 -179619 22317 169557 -157629 -142340 19726 -102162 249747 67357 81652 -213915
16059B16982c43298A25437a3929C24445c62813C056J25083K03836a3002B23641
$$ 216982 -343298 125437 -13929 324445 -362813 3056 128139 331975 -13002 223641
16048e8192B61339f4078B02901b21839k9773B18280I9720K3336b13102c6204k64280
$$ -58192 261339 -64078 202901 -221839 -251612 218280 99720 123056 -213102 -36204 -300484
16037c00484A92388L1606b18373d1319K959B93855a37866d9073q8105M8486o4025
$$ -300484 192388 223994 -218373 -41319 -38360 293855 -137866 -49073 -137178 -88692 -152717
16026a52717l9966b5505F6311a96025I784k662J87710c36375i1610B50589L4962
$$ -152717 -192683 -25505 66311 -196025 9784 7122 194832 -336375 -91610 250589 285551
16015B85551A07827b02719F9933e2536n6E2192K8149O5565A2263i5653j47401
$$ 285551 107827 -202719 69933 -52536 -52592 52192 80341 145906 12263 -95653 -243054
16004b43054A32897c27774c14k3590A1687J81563a60723m5855M8135C4897J25805
$$ -243054 132897 -327774 -314 -23904 11687 193250 -160723 -206578 -158443 34897 160702
15993A60702J3914a09023d9858A87301F6216k8125g6441D1454a04133j26746C4221
$$ 160702 174616 -109023 -49858 187301 66216 38091 -76441 41454 -104133 -230879 34221
15981e273H6346h3400k35370B62579O8886C2685J88188a46343N599K8858q6471
$$ -5273 86346 -83400 -318770 262579 331465 32685 220873 -146343 -140744 -111886 -198357
15970a98357B81216j37308i8561d8803A72383d32G1846c5565k04475A38900a31089
$$ -198357 281216 143908 -98561 -48803 172383 -432 71846 -35565 -240040 138900 -131089
15958I7493Q4743l992C1625c60445a28655a9976j14714b0673A53355o476D158
$$ 97493 182236 178244 31625 -360445 -128655 -19976 -134690 -20673 153355 146879 4158
15946b41073b0043E2028B0455b79035C4250d4306j86606H7343b6482k3951k911
$$ -241073 -20043 52028 20455 -279035 34250 -44306 -230912 87343 -26482 -50433 -53344
15935e3344j13620c987j73053j31950B15296b20567G6685c7772a5611r560j48678
$$ -53344 -166964 -3987 -177040 -308990 215296 -220567 76685 -37772 -15611 -25171 -173849
15924a73849r5934L3696R5023j65178E4411J21175a45087f7552H561g8120A55995
$$ -173849 -269783 -236087 -141064 -306242 54411 175586 -145087 -67552 8561 -78120 155995
15912g7986j1266A17926A2936J31260f5738o4778r2506B25853b6291m96631B2379
$$ -77986 -89252 117926 12936 144196 -65738 -130516 -223022 225853 -26291 -522922 22379
15900B79882a11823K606j29334c5908l67356a25040A39524b02732A72671d6315
$$ 279882 -111823 -109217 -238551 -35908 -403264 -125040 139524 -202732 172671 -46315
15889d39614b6243j15318M5323H5121f1174B93350b70740e3585C8533j701Q0122
$$ -439614 -26243 -141561 -96238 85121 -61174 293350 -270740 -53585 38533 36832 116954
15878A16954c6041k76358I2609K3318a46832l50923K45337k4084B7035a22814
$$ 116954 -36041 -312399 92609 115927 -146832 -497755 -252418 -276502 27035 -122814
15867b22558I3661b18177J8994c5638q1309j0377b0438D710a53497q0795G8753
$$ -222558 93661 -218177 -199183 -35638 -116947 -127324 -20438 4710 -153497 -234292 78753
15855i635G0603a98704l28420h6722D16517A75810d05018a01099c5870C49743
$$ -9635 70603 -198704 -527124 -86722 416517 175810 -405018 -101099 -35870 349743
15844b1471p1057J9749r4805l1012d5933C180a10751I3943l9611c30460B16652
$$ -21471 -92528 -72779 -167584 -198596 -45933 3180 -110751 93943 54332 -330460 216652
15832d05185I3792K56866H1664J04288O2071h9010B183K5170a46276Q939L8819
$$ -405185 93792 350658 81664 185952 248023 -89010 2183 27353 -146276 -137337 -98518
15821i8518q4189n8160I6029a62048A08405a10459j57755B17891A8956e6666N169
$$ -98518 -182707 -240867 96029 -162048 108405 -110459 -268214 217891 18956 -56666 -51497
15810e1497A00945J31080c6289l48257e2471j58858C00341a16996k6800A38159
$$ -51497 100945 232025 -36289 -384546 -52471 -211329 300341 -116996 -143796 138159
15799B09519A8662J09801J62232a79570q9381B12702k4324b29171f1586p8204
$$ 209519 18662 128463 290695 -179570 -268951 212702 188378 -229171 -61586 -139790
15789a39790C78944g8441r9359b97F8561c32158N1019g6625B8836a01749j4238
$$ -139790 378944 -78441 -177800 -297 68561 -332158 -281139 -76625 28836 -101749 -115987
15778a15987n8088j56006A56492e89A25654a353A3510b48799B05113g0552H7735
$$ -115987 -174075 -330081 156492 -589 125654 -1353 13510 -248799 205113 -70552 87735
15766A23602C3327d5781j06429l5838p2547f3776b6944D9972K43926C5584J03570
$$ 123602 33327 -45781 -152210 -188048 -260595 -63776 -26944 49972 293898 35584 139154
15755A39154a23709A13071a77853Q1281b7546k68230a03117A88812g9238l7252
$$ 139154 -123709 113071 -177853 -96572 -27546 -295776 -103117 188812 -79238 -116490
15745a16490A34619h1287A7286P8321C8987b27144j3010A84338D7819B0901c59695
$$ -116490 134619 -81287 17286 95607 38987 -227144 -240154 184338 47819 20901 -359695
15733a24785l3285A13086k9054b71414i3591A17537e3758C08209A25664J5893
$$ -124785 -158070 113086 84032 -271414 -93591 117537 -53758 308209 125664 141557
15723A41557C0807J31015c27323A99166b05790q9950J14767A29836h1664b0312
$$ 141557 30807 161822 -327323 199166 -205790 -295740 -180973 129836 -81664 -20312
15712f0937K7938q4148l2311E4888c65450J25360m5399J06944k41441c4784l2314
$$ -60937 -32999 -117147 -149458 54888 -365450 -240090 -285489 -178545 -419986 -34784 -67098
15701f7098b6298A5033L7083c46174A43955a91173I7523a62969C16038a7359D0513
$$ -67098 -26298 15033 52116 -346174 143955 -191173 97523 -162969 316038 -17359 40513
15689i4838A1825R5201a87663Q3552j98079R3167f8048b6715j60741B44222d6421
$$ -94838 11825 107026 -187663 -104111 -302190 -209023 -68048 -26715 -187456 244222 -46421
15677a66305B430b25762B1088b03939g6934G668a74464D5985b10876B36735G1992
$$ -166305 2430 -225762 21088 -203939 -76934 7668 -174464 45985 -210876 236735 71992
15665A34396c4134k26005I6501c47591a15903A15863i8924G504b12170g9146j38924
$$ 134396 -34134 -260139 96501 -347591 -115903 115863 -98924 7504 -212170 -79146 -218070
15654b18070a05380l1545e3769A01066J34171c36258a49726j7185B11711J6968
$$ -218070 -105380 -136925 -53769 101066 235237 -336258 -149726 -166911 211711 228679
15644B28679B9604K4327a49032j0340B54596j02484c60428R4291c6850G5969a68883
$$ 228679 29604 53931 -149032 -159372 254596 152112 -360428 -266137 -36850 75969 -168883
15632a40709o4846k12590b0167k70828e4856F1537J0871b72360O7153A70877b3961
$$ -140709 -205555 -418145 -20167 -290995 -54856 61537 72408 -272360 -205207 170877 -23961
15620F008J73210k8308P2993B3663g0637k52673E1107J12538c23515C11296a40971
$$ 6008 179218 150910 223903 23663 -70637 -323310 51107 163645 -323515 311296 -140971
15608a11505A18661E5386J90338c5756l7140G6430a30535B58949C9443b38011
$$ -111505 118661 55386 245724 -35756 -72896 76430 -130535 258949 39443 -238011
15597A6540a34641B0822a70709d4736A14245a09335j72413d7995A59839a56426
$$ 16540 -134641 20822 -170709 -44736 114245 -109335 -281748 -47995 159839 -156426
15586b28262A72757C8134L73724b64540c2232A66694D2319c74705B07498d4760
$$ -228262 172757 38134 411858 -264540 -32232 166694 42319 -374705 207498 -44760
15575a46561M9476A18785b14887D67a47799k60860a01861E7514c2668m9033A37483
$$ -146561 -97085 118785 -214887 467 -147799 -408659 -101861 57514 -32668 -81701 137483
15563D4782h8945A36901a48150j4811E00358B35614Q4575J39070A73811c4572
$$ 44782 -88945 136901 -148150 -162961 500358 235614 320189 459259 173811 -34572
15552b78867A03641a4038l09487h3116E0734c28304N1437E8313a54684n3391q7992
$$ -278867 103641 -14038 -323525 -83116 50734 -328304 -276867 58313 -154684 -208075 -296067
15541b96067J27294A54375C3397r809a07750A8821b8723A69258a56638p7338R0159
$$ -296067 -168773 154375 33397 23588 -107750 18821 -28723 169258 -156638 -233976 -143817
15530a43817K0821C67657a03452j50593C2773R1911E5332J19350q5282e3824j17976
$$ -143817 -122996 367657 -103452 -254045 32773 124684 55332 174682 89400 -53824 -171800
15519a71800D37a60854E1469K46835e6333A948a96226Q8035j32925b0650H7936
$$ -171800 437 -160854 51469 298304 -56333 1948 -196226 -108191 -241116 -20650 87936
15507G2511a6588j20736k94558A66755b10291a830D70786a44440f3084A40515
$$ 72511 -16588 -137324 -431882 166755 -210291 -1830 470786 -144440 -63084 140515
15496a95231b3200o8532H1333a16959D7179d5637k6628B05743C799g642o4469
$$ -195231 -23200 -91732 81333 -116959 47179 -45637 -72265 205743 3799 -7642 -72111
15485g2111B44300A10341a30825A37040E0032E448J25060a38666o4102o0172J09320
$$ -72111 244300 110341 -130825 137040 50032 5448 130508 -138666 -202768 -262940 -153620
15474a53620B2065g2157A03595g3796G8190d6991E9603i5255d5466k00838D7385
$$ -153620 22065 -72157 103595 -73796 78190 -46991 59603 -95255 -45466 -246304 47385
15462h5538c0876l40897c2612j47995F717M63688A68906a76463A32786K04621
$$ -85538 -30876 -371773 -32612 -180607 6717 470405 168906 -176463 132786 337407
15452C37407A07896J0352l9340J06190r0298h5522k25893C1176f425D957P8336
$$ 337407 107896 118248 78908 185098 94800 -85522 -311415 31176 -6425 4957 83293
15441H3293a78139k87191g3128C2210e0656q4593A04274a57600E7392A6851Q4775
$$ 83293 -178139 -465330 -73128 32210 -50656 -135249 104274 -157600 57392 16851 101626
15430A01626K07681a1428H6457a51985c8947j24184j1330g892l6529j00528B03974
$$ 101626 309307 -11428 86457 -151985 -38947 -163131 -174461 -7892 -44421 -144949 203974
15418a12198l3239C37493L215j22951f1999k372p4070I2796N2019o7038L57707
$$ -112198 -145437 337493 340708 217757 -61999 -64371 -138441 92796 144815 77777 435484
15407D35484b06972A34547A0681b18560B17160Q6025c5964A14377P9109a19483
$$ 435484 -206972 134547 10681 -218560 217160 303185 -35964 114377 193486 -119483
15396A9140a13390E7022k3675Q447c50574B82697n860a64053b4849D4353a4491
$$ 19140 -113390 57022 33347 41794 -350574 282697 276837 -164053 -24849 44353 -14491
15384D52577A60301a1595j14144n6939h6219C13224A12693g5129A51072o9752
$$ 452577 160301 -11595 -125739 -182678 -86219 313224 112693 -75129 151072 81320
15374H1320J6859h403D95358a34054A19606b89451I938k840J91152D8226J07132
$$ 81320 98179 -8403 495358 -134054 119606 -289451 9938 7098 198250 48226 155358
15363A55358b34745A55796a46963d8634J6304F7725N0471b19603L540f9357n1337
$$ 155358 -234745 155796 -146963 -48634 -32330 67725 118196 -219603 -216063 -69357 -120694
15352a20694A24351J98329j16391n7186n280a66601M8328r125c8754H3229K37536
$$ -120694 124351 322680 206289 149103 143823 -166601 -118273 -127398 -38754 83229 320765
15341C20765a01572j7653A51689a39705c8100E7729O0339a16412A61297K0843
$$ 320765 -101572 -119225 151689 -139705 -38100 57729 118068 -116412 161297 182140
15331A82140b51778d7480b3359D8662Q0986K20007b4785B0652c08976D3825J368
$$ 182140 -251778 -47480 -23359 48662 129648 349655 -24785 20652 -308976 43825 45193
15320D5193J69225F1890L4222K57022a61289A54775b19342A1203K65393e1275
$$ 45193 214418 61890 96112 353134 -161289 154775 -219342 11203 276596 -51275
15309D1123e024A83572n6430d8887j80690A11795m4327c5522j08677A32335G419
$$ 41123 -5024 183572 127142 -48887 -229577 111795 67468 -35522 -144199 132335 7419
15297A44870H717a12901B7316J43716e4011K6762C9545J59414p3200a02596j25775
$$ 144870 8717 -112901 27316 171032 -54011 -27249 39545 198959 125759 -102596 -228371
15286b28371G1194f7607A79541b65422A34810c5609A70493G6726L6188a8030D881
$$ -228371 71194 -67607 179541 -265422 134810 -35609 170493 76726 112914 -18030 4881
15274a72427D9989a12522G9121d7027G4681j9594J41790L04888A61621A4187J00440
$$ -172427 49989 -112522 79121 -47027 74681 55087 196877 501765 161621 14187 114627
15263A14627b8794m06062I5777K55821F8067J11689G6167J61952f6363B85187
$$ 114627 -28794 -434856 95777 351598 68067 179756 76167 238119 -66363 285187
15252C70384i419A06243K0040J64751k5646O97662J798677j080720J42128L06947
$$ 370384 -9419 106243 126283 291034 265388 963050 2761727 1681007 1823135 2130082
15242B130082G14661B37256j02593J00114K786E004R8363M3366a21000b3353B9409
$$ 2130082 714661 237256 134663 234777 237563 5004 103367 146733 -121000 -23353 29409
15230h7843L1846B1711J1034D880J41924a2067k7352j31725f1934k23375D34069
$$ -87843 -55997 21711 32745 4880 146804 -12067 -39419 -171144 -61934 -285309 434069
15218A44339j6468J4873J8764a81063A55669b00832r6763A87611a76328Q481D8498
$$ 144339 127871 142744 161508 -181063 155669 -200832 -297595 187611 -176328 -167847 48498
15206F4576J59739o5756M8431I3821a78473A6970K51236r4070J20894F8576Q6889
$$ 64576 224315 158559 206990 93821 -178473 16970 268206 174136 295030 68576 155465
15195A55465J05p5821b67626A34764k367a4562C13867f1204A29919R9593E9240
$$ 155465 155570 79749 -267626 134764 132397 -14562 313867 -61204 129919 229512 59240
15183B78872C0228J81369e9246o3938A49435L518b32203C06690D5865a21584B64657
$$ 278872 30228 211597 -59246 -123184 149435 152953 -232203 306690 45865 -121584 264657
15171a7563q1134d6888o917C46171A32733n9117K6515M2796C7472a9115B06894
$$ -17563 -98697 -46888 -53805 346171 132733 73616 100131 142927 37472 -19115 206894
15159D355c0187j0637j14462B2525K78164j32083K49930j53341h4946A22090J97133
$$ 4355 -30187 -40824 -155286 22525 300689 168606 418536 265195 -84946 122090 319223
15148C19223C8887K89647N7943j79319b7899B11338r9446A6984c0785p3719B45182
$$ 319223 38887 328534 386477 207158 -27899 211338 111892 16984 -30785 -104504 245182
15136a00485C4036N8656d6030D5730L0470K24874J06145A75132J67254e384A03850
$$ -100485 34036 92692 -46030 45730 76200 301074 407219 175132 342386 -5384 103850
15124A45644m4750a32100A52781g642A20861J81632B6627K05766m510L9234j28167
$$ 145644 100894 -132100 152781 -7642 120861 302493 26627 232393 227883 267117 138950
15113A38950K9182P4262A7701J32977b4288A43380J05117L3013a8190k49752H3769
$$ 138950 168132 242394 17701 150678 -24288 143380 248497 281510 -18190 -267942 83769
15101F3164G104M43777A04846K11147A57727J97231d2863B37235B2339e7894B45080
$$ 63164 7104 450881 104846 315993 157727 354958 -42863 237235 22339 -57894 245080
15089C35348R9727j33496Q4756L6452j89723L35604B20898q3068L7251K4264M7750
$$ 335348 435075 301579 386335 422787 233064 568668 220898 137830 175081 199345 247095
15078B47095L37A22129K51591H2784A9302J32157K75610q9416a10079D6346g9451
$$ 247095 247432 122129 373720 82784 19302 151459 427069 337653 -110079 46346 -79451
15066B98682D4091B418J16028K94426F2121j0475b0950C1043K26139A12167L30830
$$ 298682 44091 2418 118446 412872 62121 51646 -20950 31043 257182 112167 442997
15055D42997j79374O7004f311l5460D81490A75070K3621J39398A65583a85450
$$ 442997 263623 330627 -6311 -41771 481490 175070 198691 338089 165583 -185450
15044a31967A86835J0556a3231j11727A00625J45806A9202a57709C28808a48659
$$ -131967 186835 197391 -13231 -124958 100625 246431 19202 -157709 328808 -148659
15033f0433r7995G2827J90160f8623C49281p1645G5070b27493g3487C22453j46085
$$ -60433 -158428 72827 262987 -68623 349281 277636 75070 -227493 -73487 322453 176368
15022A76368q492P8100J02329A07641O9739o6080Q5843K47741B05470F5557b93380
$$ 176368 167876 245976 348305 107641 177380 111300 197143 444884 205470 65557 -293380
15010C52204A70523L07335r5855D1541J76000l1550P7793J06179Q3474p3016o9480
$$ 352204 170523 477858 382003 41541 217541 185991 263784 369963 453437 380421 310941
14999C10941J67235k15590C6739L46486j78489j0044J7773C898L7246e2923A17375
$$ 310941 478176 262586 36739 383225 204736 194692 212465 3898 41144 -52923 117375
14987B22204F8135J34777e2818E50013A34538M46321B59794Q8439A16969J06788
$$ 222204 68135 202912 -52818 550013 134538 580859 259794 348233 116969 223757
14977B23757g5567A54641L66880J52937c7849A94653K62667a3941B41106J10387
$$ 223757 -75567 154641 521521 674458 -37849 194653 457320 -13941 241106 351493
14967C51493N3183A40828P9928J07835D7999J06738J56243R0125K29421B87095
$$ 351493 404676 140828 220756 328591 47999 154737 310980 401105 630526 287095
14956F46551B97340K4230J87350A50107J76659L9331d2564B53058L6356j12140
$$ 646551 297340 321570 508920 150107 326766 366097 -42564 253058 289414 177274
14946A77274i1624C7881K22065M0348j49305N5933K6875j01209J01758o137n2249
$$ 177274 -91624 37881 259946 300294 150989 206922 233797 132588 234346 228209 175960
14935A75960o1209O04761C57338M4381F9890M41583j32957J46685j65416L182
$$ 175960 114751 719512 357338 401719 69890 511473 378516 525201 359785 362967
14925C62967n3884e516A07497J40959E4375K74788E7286L51088p0823j47293J41575
$$ 362967 309083 -5516 107497 248456 54375 329163 57286 408374 337551 190258 331833
14914C31833N3543r5862K7900P6026A66318j4517K51840O1742j88573K24826k17266
$$ 331833 385376 289514 317414 393440 166318 151801 403641 465383 276810 501636 284370
14903B84370O0708q7962r6917C7639K27045a09692E72134o7445j0152l3610A88456
$$ 284370 345078 257116 160199 37639 264684 -109692 572134 504689 494537 460927 188456
14891C91736r383A62165K54914K6946j77514K95713c5673G286K20932J28674R05
$$ 391736 382353 162165 417079 444025 266511 562224 -35673 7286 228218 356892 357797
14880C57797K91858A40545m156K67206L23803k7248l33090Q4679j32189O5233
$$ 357797 649655 140545 136389 403595 727398 700150 367060 451739 319550 384783
14870C84783L22593k99593j8751k3735R6903M209J16548q9811k10711K18376K02736
$$ 384783 707376 407783 389032 365297 462200 466409 582957 493146 282435 500811 703547
14859G03547p1657M2706q7747j70918n1206Q989K31771k38113r756O0832L98430
$$ 703547 631890 674596 586849 415931 364725 373714 605485 367372 357616 418448 816878
14848H16878C55279j10080K70990p3226K33261B90137k0252K28505n1308j04811
$$ 816878 355279 245199 516189 442963 676224 290137 269885 498390 447082 342271
14838C42271J85007J31206j96632J00652m749B71819M4782F4853L19118J57584
$$ 342271 527278 658484 461852 562504 557755 271819 316601 64853 383971 541555
14828E41555k10953K3459K95335j60080J39708k32862J63711K7969j55445J11415
$$ 541555 330602 354061 649396 489316 629024 396162 559873 587842 432397 543812
14818E43812j42265J54108K07267j4754K57999m20669k09635K33749k0990F1255
$$ 543812 401547 555655 762922 748168 1006167 585498 375863 609612 588622 61255
14807D90744o7776N9807j9722j03702M14548k73k51027k5067J83244M1422C44508
$$ 490744 422968 482775 463053 359351 773899 773626 522599 497532 680776 722198 344508
14795D54783L33090l01420M13935C06647L25669k97753k3757M18094k04424J95281
$$ 454783 787873 486453 900388 306647 632316 334563 310806 728900 524476 719757
14785G19757B33199N17637l02l49695K34287M5096R2096j63254J42376R3630j47522
$$ 719757 233199 750836 750534 400839 635126 680222 772318 609064 751440 845070 697548
14774F97548j03209p1907O9012m4689K68933j37409n5901K51634k13384n95j03327
$$ 697548 594339 522432 591444 546755 815688 678279 622378 874012 660628 660033 556706
14763E56706j82082N38966m16222M05477p6960l46360j99111N00700P6826j13522
$$ 556706 374624 913590 497368 902845 825885 479525 280414 781114 857940 744418
14753G44418j15827O8721k96675K67329J49144k64613o211K02288K9591L9626
$$ 744418 628591 697312 400637 667966 817110 552497 546286 748574 778165 817791
14743H17791j91347q7620Q1914M01697k83894l23024K74648K30607J51745K9417
$$ 817791 626444 538824 620738 1022435 738541 415517 690165 920772 1072517 1101934
14733A101934k96335C75554L29789L42093D06561M38685l04705M06117k96581
$$ 1101934 805599 375554 705343 1047436 406561 845246 540541 946658 650077
14724F50077J3897J54971j58965p7529Q5154J8640K38108j99726K97773k72318
$$ 650077 663974 818945 659980 582451 667605 686245 924353 724627 1022400 750082
14714G50082R1262K88464k62455K30699o8250J4143r6349j12708J36969J34199
$$ 750082 841344 1129808 867353 1098052 1029802 1043945 947596 834888 971857 1106056
14704A106056l38098j13639M83902m88524L79999j21281K84266k16817K67629
$$ 1106056 767958 654319 1138221 649697 1029696 908415 1192681 975864 1243493
14695A243493m19487K63546k40927M22522k21795m4235r2239R543L4042L9341
$$ 1243493 824006 1087552 846625 1269147 1047352 1003117 910878 920421 954463 993804
14685I93804Q1210K968k74691L18909k6715K24664m26055j33161k5003J77854
$$ 993804 1075014 1077982 803291 1122200 1095485 1320149 894094 760933 735930 913784
14675I13784M58484l88960K905K80811k15229k2847R8069k62971J75197J98737
$$ 913784 1372268 983308 986213 1267024 1051795 1028948 1127017 864046 1039243 1237980
14665A237980j17102k13498K81932j41551L52698j89006R0793J11305j49332n8788
$$ 1237980 1120878 907380 1189312 1047761 1400459 1211453 1302246 1413551 1264219 1205431
14655A205431j51177K5676O7808J17773Q9910n0507k21668L8496M57921n76531
$$ 1205431 1054254 1079930 1147738 1265511 1355421 1304914 1083246 1121742 1579663 1003132
14645A003132K76125K01603j12580k22951J62805M86763l76070P7274r9397L4924
$$ 1003132 1279257 1480860 1368280 1145329 1308134 1794897 1418827 1496101 1396704 1431628
14635A431628j13616J39083k69470L98301m5784j85026J53633k27876K70654m59095
$$ 1431628 1318012 1457095 1187625 1585926 1540142 1355116 1508749 1280873 1551527 1092432
14625A092432L15476j06978Q1390n9024j2098K20411k003o4814J05087M04905
$$ 1092432 1407908 1300930 1382320 1323296 1311198 1531609 1529606 1464792 1569879 1974784
14615A974784n09024P0866J11054l18710J44271J68836O8341o5363J42777j52611
$$ 1974784 1465760 1536626 1647680 1328970 1473241 1642077 1710418 1645055 1787832 1635221
14605A635221K68582J6738o882m08146o5255K39205O3149J87982j65647o739j93601
$$ 1635221 1903803 1920541 1913659 1505513 1440258 1679463 1742612 1930594 1764947 1758208 1564607
14594A564607L44133q8401j47964M34991n47289M27935P178R7748M3827j78135
$$ 1564607 1908740 1820339 1672375 2107366 1560077 1988012 1995190 2092938 2136765 1958630
14584A958630M04226k33473K45462Q1084j47401j62115k0405k808J89503k27350
$$ 1958630 2362856 2129383 2374845 2455929 2308528 2146413 2126008 2123200 2312703 2085353
14574B085353L7300M75149l71801K66607j44166J08537K82246k64186k5650K19907
$$ 2085353 2122653 2597802 2226001 2492608 2348442 2456979 2739225 2475039 2449389 2669296
14564B669296M0506J32236p5697J8172M16815k91294N69531o5359L52154J17657
$$ 2669296 2709802 2842038 2766341 2784513 3201328 2910034 3479565 3414206 3766360 3884017
14554C884017J86554M49084J87397P25408J127526J825533M189419Q229411J4429384
$$ 3884017 4070571 4519655 4707052 5432460 6559986 8385519 12574938 20804349 35233733
14545C5233733O734623j8455211j1081380j737707m395244k778160q45809k18088
$$ 35233733 41968356 23513145 12431765 10694058 6298814 3520654 2674845 2456757
14537B456757m45994N34861L2862k98389J15215J15258j85215P6630J84427q7224
$$ 2456757 2010763 2545624 2578486 2280097 2395312 2510570 2325355 2401985 2586412 2499188
14527B499188P7272K81938l48029r0848O1196L920J73835L3610k2678J07780j73177
$$ 2499188 2576460 2858398 2510369 2419521 2480717 2484637 2658472 2692082 2669404 2777184 2604007
14516B604007J59113J64720k00779M74112l31473j7264J29401K8057J53273N4186
$$ 2604007 2763120 2927840 2727061 3201173 2869700 2852436 2981837 3009894 3163167 3217353
14506C217353m1187K3413m6415M04999m43106L3804M51454k37459K55513J15112
$$ 3217353 3176166 3199579 3153164 3558163 3115057 3148861 3600315 3362856 3618369 3733481
14496C733481j36659l65204M45285K11561l28122k17189L87090L06970j68493
$$ 3733481 3596822 3231618 3676903 3888464 3560342 3343153 3730243 4037213 3868720
14487C868720J34980j23783N4879L28801j56623M8443m18472J78208N72892M8647
$$ 3868720 4003700 3879917 3934796 4263597 4106974 4155417 3736945 3915153 4488045 4536692
14477D536692k54406L03703m10798M69140m66681O72685j16762K99926k66235
$$ 4536692 4282286 4585989 4175191 4644331 4177650 4850335 4733573 5033499 4767264
14468D767264j589L13052n6110L9737K85167k87196J92482K43263j20363p5921
$$ 4767264 4765675 5078727 5022617 5062354 5347521 5060325 5252807 5496070 5375707 5299786
14458E299786M31614l07709J34683l25020M66601r9481O0854K43439l025L09749
$$ 5299786 5731400 5423691 5558374 5233354 5699955 5600474 5661328 5904767 5901742 6211491
14448F211491M1738j02840j59198L75155L02322l64013j66901P25020k83915K62146
$$ 6211491 6253229 6150389 5991191 6366346 6668668 6304655 6137754 6862774 6578859 6841005
14438F841005k02279L02839J04191O8964q130J10793j13267K68297P1511K78925
$$ 6841005 6638726 6941565 7045756 7114720 7106590 7217383 7104116 7372413 7443924 7722849
14428G722849O3217O74779j74366J54420j64422J13374R3187K43346l6027j1610
$$ 7722849 7786066 8460845 8286479 8440899 8276477 8389851 8483038 8726384 8690357 8678747
14418H678747K50392L46283j00361L58011J217R8230K28676J80025J15728M39754
$$ 8678747 8929139 9275422 9175061 9533072 9534289 9632519 9861195 10041220 10156948 10596702
14408A0596702p5725L64354j73707K77765P7114k4175O05578K75115j90342K14949
$$ 10596702 10520977 10885331 10711624 10989389 11066503 11042328 11647906 11923021 11732679 11947628
14398A1947628N15500l11700N97981N3268K23279K08466O17357m91101K28401
$$ 11947628 12463128 12151428 12749409 12802677 13025956 13234422 13851779 13360678 13589079
14389A3589079N59913J13129N95710J01988M00726K49114L2124L66903R4025N21430
$$ 13589079 14148992 14262121 14857831 14959819 15360545 15609659 15641783 16008686 16102711 16624141
14379A6624141L94964J21037J65546N25346M75391M45139J82264J98464N21918
$$ 16624141 17019105 17140142 17305688 17831034 18306425 18751564 18933828 19132292 19654210
14370A9654210K41196L73898N23789O39823K51084N62483O04829L94198K67194
$$ 19654210 19895406 20269304 20793093 21432916 21684000 22246483 22851312 23245510 23512704
14361B3512704Q49008M66347N46984O10857j27897J249575P11574L13258P23777
$$ 23512704 24361712 24828059 25375043 25985900 25858003 27107578 27819152 28132410 28856187
14352B8856187Q97033N81651R47216N66994Q30351Q16936O01332J012997J288926
$$ 28856187 29753220 30334871 31282087 31849081 32679432 33496368 34097700 35110697 36399623
14343C6399623R25512P56103J084886J103742Q95628J446056J070745R29763J531478
$$ 36399623 37325135 38081238 39166124 40269866 41165494 42611550 43682295 44612058 46143536
14334D6143536J405389J437157J537821J434266J541719K013206J572094K080630
$$ 46143536 47548925 48986082 50523903 51958169 53499888 55513094 57085188 59165818
14326E9165818J655834J830542K073505K384391K059148K552776K208266K861568
$$ 59165818 60821652 62652194 64725699 67110090 69169238 71722014 73930280 76791848
14318G6791848K922226K814578L350720L110649L272768L850720L573531M090720
$$ 76791848 79714074 82528652 85879372 88990021 92262789 96113509 99687040 103777760
14310A03777760M485086M127046M597630M972233N176192N328157O119558O280868
$$ 103777760 108262846 112389892 116987522 121959755 127135947 132464104 138583662 144864530
14302A44864530O396709O702828P343214P971157Q061056Q074608R391882R587778
$$ 144864530 151261239 157964067 165307281 173278438 181339494 189414102 198805984 208393762
14294B08393762R974628J0276106J1177645J1364310J2061907J2856766J2930587
$$ 208393762 218368390 228644496 239822141 251186451 263248358 276105124 289035711
14287B89035711J3371541J3828122J4345422J4450618J4510472J4767325J4196837
$$ 289035711 302407252 316235374 330580796 345031414 359541886 374309211 388506048
14280C88506048J4085688J3416288J2904514J1447978J0478051Q896071O903179
$$ 388506048 402591736 416008024 428912538 440360516 450838567 459734638 466637817
14273D66637817M173101Q17456j243335j501648k818896m704046o030461q302473
$$ 466637817 470810918 471628374 470385039 468883391 466064495 461360449 455329988 447027515
14265D47027515r550499j0782348j2076199j3234161j4104844j4698126j5090519
$$ 447027515 437477016 426694668 414618469 401384308 387279464 372581338 357490819
14258C57490819j4971930j5368844j4489882j4956128j3888857j3054750j1443937
$$ 357490819 342518889 327150045 312660163 297704035 283815178 270760428 259316491
14251B59316491j2535675j2085668j1495922j0022427j0444691r341296q972757
$$ 259316491 246780816 234695148 223199226 213176799 202732108 193390812 184418055
14244A84418055q433138p837988p612851p603290o479842o473149n788459n503099
$$ 184418055 175984917 168146929 160534078 152930788 146450946 139977797 134189338 128686239
14236A28686239n622427n038094m752677m726997m087473l877022m147369l543108
$$ 128686239 123063812 118025718 113273041 108546044 104458571 100581549 96434180 92891072
14228I2891072l384879l547009l099850l095059k896636k784657k147624k698005
$$ 92891072 89506193 85959184 82859334 79764275 76867639 74082982 71935358 69237353
14220F9237353j814200k606924k168532j667702k445615j702926j422621j636537
$$ 69237353 67423153 64816229 62647697 60979995 58534380 56831454 55408833 53772296
14212E3772296j727422j428357j601139j431765q96050j298140q30503j823173
$$ 53772296 52044874 50616517 49015378 47583613 46687563 45389423 44558920 42735747
14204D2735747j435869p76324r34667j038195p46568j443355o76057j065938r98690
$$ 42735747 41299878 40523554 39588887 38550692 37804124 36360769 35684712 34618774 33620084
14195C3620084q89831r67163m96728r27064p08158o75525m66473p74354m12851
$$ 33620084 32730253 31763090 31266362 30339298 29631140 28955615 28489142 27714788 27301937
14186B7301937p00061q88489m82717l79369p05552n39911j72056o36053n09987
$$ 27301937 26601876 25713387 25230670 24851301 24145749 23605838 23433782 22797729 22287742
14177B2287742m13966n61445l56310m22488k54727k30546p12572p9256p83868
$$ 22287742 21873776 21312331 20956021 20533533 20278806 20048260 19335688 19256432 18472564
14168A8472564k82313n11314j9774l26444n63692k92747l76776P4063m08862k45677
$$ 18472564 18190251 17678937 17659163 17332719 16769027 16476280 16099504 16173567 15764705 15519028
14158A5519028j96052j20505o31745P0492m18324k95091m7043k37013k09108m41983
$$ 15519028 15322976 15202471 14570726 14641218 14222894 13927803 13880760 13643747 13434639 12992656
14148A2992656l8298n24097N6730q5713l53384j8987m0329n98093j68546j23519
$$ 12992656 12954358 12430261 12486991 12401278 12047894 12028907 11988578 11390485 11221939 11098420
14138A1098420q3537j38323q7941K8030p10040J71475o4817j37145l55416k8299
$$ 11098420 11014883 10876560 10788619 10816649 10106609 10278084 10213267 10076122 9720706 9692407
14128I692407m50492Q0277J53788k35308k98769p0859J09344n7211l50618l5362
$$ 9692407 9241915 9322192 9475980 9240672 8941903 8871044 8980388 8923177 8572559 8537197
14118H537197o7122j97728k38711J09506m77580N61357l74049l30263k2662m9012
$$ 8537197 8470075 8272347 8033636 8143142 7665562 8226919 7852870 7522607 7499945 7450933
14108G450933r5036K49414p40731K68193k95698J52490R2010q6738l57260K19070
$$ 7450933 7355897 7605311 6864580 7132773 6837075 6989565 7081575 6994837 6637577 6856647
14098F856647n02200L11596m26883M5068K39737m65110J24030r8580J21881k79726
$$ 6856647 6354447 6666043 6239160 6284228 6523965 6058855 6182885 6084305 6206186 5926460
14088E926460k0458j52917j16131r6912J761J100K91463n05052j27637L28180
$$ 5926460 5906002 5753085 5636954 5540042 5541803 5542903 5834366 5329314 5201677 5529857
14078E529857m88348K34892L8179j68884k49351J29982m40808M79811l45550O3087
$$ 5529857 5041509 5276401 5314580 5145696 4896345 5026327 4585519 5065330 4719780 4782867
14068D782867j46669K53116j79015k08942j72151L8685N4388k02188L5077J15942
$$ 4782867 4636198 4889314 4710299 4501357 4329206 4367891 4422279 4220091 4255168 4371110
14058D371110K2314M4295N636L7936j22838k19171r8169j24400L52506k03374
$$ 4371110 4393424 4437719 4443355 4481291 4358453 4139282 4041113 3916713 4269219 4065845
14048D065845l43481M01281l98730k20300M41271q5599n49591M98510k84237j05040
$$ 4065845 3722364 4123645 3724915 3504615 3945886 3860287 3310696 3809206 3524969 3419929
14038C419929L31077J66803o34421M46136L4941l49991K6074J59161k35782j31157
$$ 3419929 3751006 3917809 3283388 3729524 3764465 3414474 3440548 3599709 3363927 3232770
14028C232770o0437L37659k67074p3180J02750k50964L5261L26434n88192K10292
$$ 3232770 3172333 3509992 3242918 3169738 3272488 3021524 3056785 3383219 2795027 3005319
14018C005319m87825N60908l23717L04385k36165k85995N5318M71557k83867j44467
$$ 3005319 2517494 3078402 2754685 3059070 2822905 2536910 2592228 3063785 2779918 2635451
14008B635451L38597k74929k53100J89414K10991j88919q4413O6429k72886J21653
$$ 2635451 2974048 2699119 2446019 2635433 2846424 2657505 2573092 2639521 2366635 2488288
13998B488288j27870L7343L6500j26223J96618p4731M15216K43774Q0246J421111
$$ 2488288 2360418 2397761 2434261 2308038 2504656 2429925 2845141 3088915 3169161 4590272
13988D590272K897103O950171J5075769J2548412j3460629j2990039n745649k556112
$$ 4590272 7487375 14437546 29513315 42061727 28601098 15611059 9865410 7309298
13980G309298j493915r32791n16791k76465m96942j75245k99224j66319L96272
$$ 7309298 5815383 4882592 4365801 4089336 3592394 3417149 3117925 2951606 3347878
13971C347878k37186j70947k73190J29406J41571n58265N15482l84720j15783
$$ 3347878 3110692 2939745 2666555 2795961 2937532 2379267 2894749 2510029 2394246
13962B394246j08627r5085l5475M17349j57874j04233O1245m67784L85005l30748
$$ 2394246 2285619 2190534 2155059 2572408 2414534 2310301 2371546 1903762 2288767 1958019
13952A958019J61842j99273O43085m84430q8618K39854j66469k89116J38396K34203
$$ 1958019 2119861 1920588 2563673 2079243 1990625 2230479 2064010 1774894 1913290 2147493
13942B147493n5069k72373J76388j31550p6818O6952R3268K81654l49238J32023
$$ 2147493 2092424 1820051 1996439 1864889 1788071 1855023 1948291 2229945 1880707 2012730
13932B012730l31789K7148N8861j38630Q6294Q9605j59483j28033L0680J11424
$$ 2012730 1680941 1708089 1766950 1628320 1714614 1804219 1644736 1516703 1547383 1658807
13922A658807L90246k70034R5251k53867L03767l09815n6522q8057M03809k54363
$$ 1658807 2049053 1779019 1874270 1620403 1924170 1614355 1557833 1469776 1873585 1619222
13912A619222j17324L09014j35633k0077j6030K17510m80263M61250k40481l64458
$$ 1619222 1501898 1810912 1675279 1655202 1639172 1856682 1376419 1837669 1597188 1232730
13902A232730M67708K03789l25378j29884J80066k71582K47980j30447J02645
$$ 1232730 1700438 1904227 1578849 1448965 1629031 1357449 1605429 1474982 1577627
13893A577627r8445j27302j31924L17007M6493q72l09025j08616J66572k70032
$$ 1577627 1479182 1351880 1219956 1536963 1583456 1582584 1273559 1164943 1331515 1061483
13883A061483L40891j64681l0118J21509q2152L04461k64182P0583M15417m00174
$$ 1061483 1402374 1237693 1207575 1329084 1246932 1551393 1287211 1357794 1773211 1373037
13873A373037k19646L53299l49752K28725m69156K96719k5276J11495k06783O6252
$$ 1373037 1153391 1506690 1156938 1385663 916507 1213226 1187950 1299445 1092662 1158914
13863A158914P3593j60203K39392o5897J1545k6386l9362M05383l21252j29258
$$ 1158914 1232507 1072304 1311696 1245799 1257344 1230958 1191596 1596979 1275727 1146469
13853A146469k47494K04413J92890j36538j24988L02285j2723l58876J49476K15954
$$ 1146469 898975 1103388 1296278 1159740 1034752 1337037 1324314 965438 1114914 1330868
13843A330868j00152r2022K75547F64027L47332m7116K06626J9732J06595l35998
$$ 1330868 1230716 1138694 1414241 664027 1011359 964243 1170869 1190601 1297196 961198
13833I61198K14019p0718k15899O7434K08588J34227l46679K63793L2665L7181
$$ 961198 1175217 1104499 888600 956034 1164622 1298849 952170 1215963 1248628 1285809
13823A285809l39558j67294J68937l9564J663q6473J76827k97956Q1503O2362
$$ 1285809 946251 778957 947894 908330 909993 823520 1000347 702391 783894 846256
13813H46256K35887J30409P3931m61966L12114m28702M53919k08389N71j46548
$$ 846256 1082143 1212552 1286483 824517 1136631 707929 1161848 953459 954030 807482
13803H07482P4702L78437D46953N16744l49736L69468n4060O3967J7029j53851
$$ 807482 882184 1260621 446953 963697 613961 983429 929369 993336 1010365 856514
13793H56514J34962l9441K70755l43770K8010K12090q5294l75707M00746n21276
$$ 856514 991476 952035 1222790 879020 907030 1119120 1033826 658119 1058865 537589
13783E37589N29859k34070m6315j47127K24217k70548K49347J46919n4723l4458
$$ 537589 1067448 833378 787063 639936 864153 593605 842952 989871 935148 900690
13773I00690K248r0042J76363k8460q1615l70898L50517k31533J50523j02005
$$ 900690 902938 812896 989259 960799 879184 508286 858803 627270 777793 675788
13763F75788R4060j86070K9052N3655j59407L07828K00717k85502J39647J93943
$$ 675788 769848 583778 612830 666485 507078 814906 1015623 730121 869768 1063711
13753A063711l65834K92602j51143j32424K2826j46639K89215m823k89774L28132
$$ 1063711 697877 990479 839336 706912 729738 583099 872314 867491 577717 905849
13743I05849k42488l0470j94924O80980q5796q0382l4683l45980J20155n0227
$$ 905849 663361 632891 437967 1118947 1033151 952769 918086 572106 692261 642034
13733F42034J7873j2350M5675j49782K92496k4626P1583r4622j65207K22365l28715
$$ 642034 659907 647557 693232 543450 835946 811320 882903 788281 623074 845439 516724
13722E16724K50906p4631k4493B67658N10146o5668k16225L9761K69773k89571
$$ 516724 767630 692999 668506 267658 777804 712136 495911 535672 805445 515874
13712E15874J27845J45252l88600Q7044j3050O7236j48465M8796m8647q5259L40741
$$ 515874 643719 788971 400371 487415 474365 541601 393136 441932 393285 308026 648767
13701F48767r1426R8626o6140K18005C96424K64054F9604J51639K35595K20720
$$ 648767 557341 655967 589827 807832 396424 660478 69604 221243 456838 677558
13691F77558j79972J03254k70822Q3101o1087J78728K9344j64113J64876r763
$$ 677558 497586 600840 330018 413119 352032 530760 560104 395991 560867 551104
13681E51104K22016j52181C01969N2440J69795k07557L30055A74497J84128L02049
$$ 551104 773120 620939 301969 354409 524204 316647 646702 174497 358625 660674
13671F60674C15288J47278O3742J80990j47900K85989k33955n3774K3278j54085
$$ 660674 315288 462566 526308 707298 559398 845387 611432 557658 580936 426851
13661D26851R0861k53651M28694K6117j64208k29123J70346N7991k22666M01287
$$ 426851 517712 264061 692755 718872 554664 325541 495887 553878 331212 732499
13651G32499r0495k21615K31657j07786k24473L77417B72694J05474p7389J62160
$$ 732499 642004 420389 652046 544260 319787 697204 272694 378168 300779 462939
13641D62939l4585L50220A39936M16517a10728D09502H7765N09451j04455L6965
$$ 462939 428354 778574 139936 556453 -110728 409502 87765 597216 492761 529726
13631E29726j62750J02746M1770K5409k9561J15974j08448k8697j65429K42535
$$ 529726 366976 469722 511492 536901 507340 623314 514866 486169 320740 563275
13621E63275j43079l6900L05920C33517J02460L16804k66295o250a41038E45762
$$ 563275 420196 383296 689216 333517 435977 752781 486486 480236 -141038 545762
13610C35875K91762A63034N7586M08843k12901j5709j39627J60946J27376j21509
$$ 335875 627637 163034 220620 629463 416562 400853 261226 422172 549548 428039
13600D28039m7819p1739J98967B04402K61628R9853q1821A90581K48317p4402
$$ 428039 380220 308481 507448 204402 466030 565883 484062 190581 438898 364496
13590C64496N3696O8999k7393k17976J56563J35809M940r3169J62633A28580L61351
$$ 364496 418192 487191 459798 241822 398385 534194 539134 445965 608598 128580 489931
13579D89931a93820C51530Q3944n8419L14148C18057K58173o2436B43992M26521
$$ 489931 -193820 351530 435474 377055 691203 318057 576230 513794 243992 670513
13569F70513k55570J21961M1998J95568j93716M8707j69361B29832K25278L098
$$ 670513 414943 536904 578902 774470 580754 629461 460100 229832 455110 458208
13559D58208p9659M9585j65493M3352K9309N7852J18329n1299J81746j54513A77013
$$ 458208 378549 428134 262641 305993 335302 393154 511483 460184 641930 487417 177013
13547C83266J84510A80281R6948O2610A23318a11176E48959k55374L5282j00743
$$ 383266 567776 180281 277229 339839 123318 -111176 548959 293585 328867 228124
13537B28124r6341J05407R7091j38113K37669B2647c5982E40565B41512K19027
$$ 228124 131783 237190 334281 196168 433837 22647 -35982 540565 241512 460539
13527D60539j41076R4473q1216j57741K45439j79607J99528p00B7573L33696L29001
$$ 460539 319463 413936 332720 174979 420418 240811 440339 439639 27573 361269 690270
13516F90270l21654n9901K6443j09635K00417H7168K80859R382l1713m1820H8514
$$ 690270 368616 308715 335158 225523 425940 87168 368027 377409 345696 303876 88514
13504C39850j67039o0826L88096J83335k00349M5789A37362L85238j69003D2433
$$ 339850 172811 111985 500081 683416 483067 528856 137362 522600 353597 42433
13493C55879H8713L03196j70601J9913K69568c0991E65286B53112k3818J41020
$$ 355879 88713 391909 221308 241221 510789 -30991 565286 253112 229294 370314
13483C70314j47654L970j5578I5949K29918J28712m0329j85452K4486r9818L4551
$$ 370314 222660 226630 211052 95949 325867 454579 414250 228798 253284 153466 188017
13472A88017L02668Q7670P249J9092q5884j91184A17458J26472J52289F0194d1742
$$ 188017 490685 578355 585604 604696 518812 327628 117458 243930 396219 60194 -41742
13460B97948A19041m6074K68854L1783j46131G7545N05432k08864e96C53413L1623
$$ 297948 119041 72967 341821 373604 227473 77545 582977 374113 -596 353413 385036
13449C85036r9676L11964k78959j06673N33359D4608K61056G7606J53398e6201
$$ 385036 285360 597324 318365 211692 745051 44608 305664 77606 231004 -56201
13438E05431A86475N0203M820L30375A24796K16208A07588k0551l070L47318A48604
$$ 505431 186475 236678 241498 571873 124796 341004 107588 87037 83967 431285 148604
13426D85293k37658J61669P3790j87699A09613K80952L5602a273j16219N0311
$$ 485293 247635 409304 483094 295395 109613 390565 426167 -1273 -117492 -67181
13416f7181D07746A61631Q025l8824J55068K57530B54101R5871j7444m869L60065
$$ -67181 407746 161631 169656 130832 285900 543430 254101 349972 332528 327659 687724
13405F87724A07393B0164h7159B06023K72680A97881J75952m0667P084j28660
$$ 687724 107393 20164 -87159 206023 478703 197881 373833 333166 340250 211590
13395B11590K76779A73644K45773A15396a90810C59074J52647k01455l8119J54951
$$ 211590 488369 173644 419417 115396 -190810 359074 511721 310266 272147 427098
13385D27098A78942E1525M50273q055b4152A34159K37575F8781L76739A54075
$$ 427098 178942 51525 501798 493743 -24152 134159 371734 68781 445520 154075
13374C02599A44839l6402K6907J92859q9437L16667k72595n8854A11828l4195
$$ 302599 144839 108437 135344 328203 238766 555433 282838 223984 111828 77633
13364G7633M40679A47800J42578G1994L55035r2743A28167o0929A5778K82309
$$ 77633 518312 147800 290378 71994 427029 334286 128167 67238 15778 298087
13354B98087C1657M34776A56618J25863j11365J58477a52004A53166h887C32450
$$ 298087 31657 466433 156618 282481 171116 329593 -152004 153166 -8887 332450
13343H3761L82598A76287j1328G8103K80222j45819O6370i335E20787A57266P8338
$$ 83761 466359 176287 164959 78103 358325 212506 278876 -9335 520787 157266 235604
13332B35604k1837J77167G3424L142J2183f8545C15010J53507j90045J76864j65526
$$ 235604 213767 390934 73424 76566 88749 -68545 315010 468517 278472 455336 289810
13321B89810A08560n2524N50381b0500B55956K05080F519M18410A61188K74469
$$ 289810 108560 56036 606417 -20500 255956 461036 6519 424929 161188 435657
13311D35657c3249A00730M89811D5564a28370A96084f2011A68096d1520B59569
$$ 435657 -33249 100730 590541 45564 -128370 196084 -62011 168096 -41520 259569
13300B52241m3903a30598B42908K2447j07648a54662A50813J61901f0953A91137
$$ 252241 208338 -130598 242908 265355 157707 -154662 150813 312714 -60953 191137
13289D24241k02533M1039j07467n2361i7251a0754A70173a26115C8066L21505
$$ 424241 221708 262747 155280 102919 -97251 -10754 170173 -126115 38066 359571
13279C59571j28009b3117C21064k7736K38802H1186L01373A50079L06336D3537
$$ 359571 231562 -23117 321064 293328 532130 81186 382559 150079 456415 43537
13268C20065L1581j44414f8121A33847l8282a51567A01115P0953l4632c18965
$$ 320065 351646 207232 -68121 133847 95565 -151567 101115 172068 137436 -318965
13257H6544a37464B61019j13388D2403K85276l775j05943L0480k9236k0471a27110
$$ 86544 -137464 261019 147631 42403 327679 323904 217961 248441 219205 198734 -127110
13245C1924g3779A15838L6638B4750J13262J53995B9124K87759i3744D10043g9548
$$ 31924 -73779 115838 152476 24750 138012 292007 29124 316883 -93744 410043 -79548
13233C01523E0595J31809H0994J170h7459C67577e4358l5486A28079f6783F4983
$$ 301523 50595 182404 80994 82164 -87459 367577 -54358 -89844 128079 -66783 64983
13221a43398A9377J31594a51420A02479a62681B7022c2324C93430j4940d6640
$$ -143398 19377 150971 -151420 102479 -162681 27022 -32324 393430 378490 -46640
13210A96228m1520o2313M10089b9558A63471E8056Q8551F0813L24709B632J50910
$$ 196228 154708 92395 502484 -29558 163471 58056 146607 60813 385522 2632 153542
13199A53542a47505f2611G8008c8000B60272E0013J68780H2252K85925j17098
$$ 153542 -147505 -62611 78008 -38000 260272 50013 218793 82252 368177 251079
13189B51079j5130k3218j6601E7153A5660O010d6453C32693b11074B67746J33468
$$ 251079 235949 212731 196130 57153 15660 21670 -46453 332693 -211074 267746 401214
13178D01214I2656J55205B7011c5760F9860e955A0919J27935J04030j6111I7717
$$ 401214 92656 247861 27011 -35760 69860 -5955 10919 138854 242884 226773 97717
13166d6184B7088a52000A61160b1817E00417A92598L1712a6701A73965d3206G2761
$$ -46184 27088 -152000 161160 -21817 500417 192598 224310 -16701 173965 -43206 72761
13154I6219a83513A1769L33954a80803B08620l6735a09515d3556p512A27848B5507
$$ 96219 -183513 11769 345723 -180803 208620 171885 -109515 -43556 -51068 127848 25507
13142d0275j32482L9353A52703J7301l1090J37650k2833e5286b4090B29093r354
$$ -40275 -172757 -133404 152703 170004 138914 276564 253731 -55286 -24090 229093 219739
13131B19739q0461c6969B92133j36932L8886B7488K58476F443J13294a1266C41550
$$ 219739 139278 -36969 292133 155201 194087 27488 285964 6443 119737 -11266 341550
13119C08850e1038A19959L5631o3773d2744A70713a36452D9101N0656J61463A2209
$$ 308850 -51038 119959 155590 91817 -42744 170713 -136452 49101 99757 261220 12209
13107I7051J28778a5783j73340d3438A27102J87451J31054a38049a063n4198H1747
$$ 97051 225829 -15783 -189123 -43438 127102 314553 445607 -138049 -1063 -55261 81747
13095B71668b83791B57450G2563d5203j53163a0903k7565B87396B1327J01363
$$ 271668 -283791 257450 72563 -45203 -198366 -10903 -38468 287396 21327 122690
13085A22690b66790F6944k5718j7395P8201L262L07767C5986M0766J03279M7775
$$ 122690 -266790 66944 41226 23831 102032 105294 413061 35986 76752 180031 227806
13074B27806c5674B21579c9467o9671O893B5075K19033a43939A95011J13952H0679
$$ 227806 -35674 221579 -39467 -109138 -102245 25075 244108 -143939 195011 308963 80679
13062b05731N6459B7230c08466B18916N7529F9900K07683A6137L10849F2155b8270
$$ -205731 -149272 27230 -308466 218916 276445 69900 277583 16137 326986 62155 -28270
13050b58057C14350c2676D2371j8077N8182M17562a8542G699M11299f7079D7279
$$ -258057 314350 -32676 42371 24294 82476 500038 -18542 7699 418998 -67079 47279
13038B23063L3215b0183C18685c0009j45942B08930J40040A7409P0265R8933K73960
$$ 223063 256278 -20183 318685 -30009 -175951 208930 348970 17409 87674 186607 460567
13027D60567G6121b1919m956B48346F8543J82512B6752J60751l5777O7426G6773
$$ 460567 76121 -21919 -26875 248346 68543 251055 26752 187503 151726 219152 76773
13015H3277M52334p8751k14314H3244e4596C04446o8886d1143B83595a43112c144
$$ 83277 535611 456860 242546 83244 -54596 304446 235560 -41143 283595 -143112 -3144
13003G5952K18008K898I706b7478A09537a95492C79759j14013h5866l6275G4285
$$ 75952 293960 296858 9706 -27478 109537 -195492 379759 265746 -85866 -122141 74285
12991B33324E0157K54109h7307B36295D596a07361C21164g0184c72B10101H4515
$$ 233324 50157 304266 -87307 236295 4596 -107361 321164 -70184 -372 210101 84515
12979h2089b9315B26880b09873B96249R5639F8502O299R314a83461b7938B72901
$$ -82089 -29315 226880 -209873 296249 391888 68502 74801 84115 -183461 -27938 272901
12967A9594K516a6850A34369a14877j79630A68172l6468K8621J7527a3878D32045
$$ 19594 22110 -16850 134369 -114877 -294507 168172 131704 160325 177852 -13878 432045
12955b10425A60969E2528K32693A33709i9356m5562e8159k09885A92339L8694
$$ -210425 160969 52528 285221 133709 -99356 -144918 -58159 -268044 192339 231033
12945B31033J14548F673J44070F1830K46455k7014L42383a11457c254k285D05480
$$ 231033 345581 6673 150743 61830 308285 281271 623654 -111457 -3254 -5539 405480
12933I0986e414H8985K49753N6098A26800a70428A00303j2816L0875a59994b8192
$$ 90986 -5414 88985 338738 394836 126800 -170428 100303 87487 118362 -159994 -28192
12921h8652A95265h7652D7616J64119O2790b20767E9286f4983A34548m9838a40006
$$ -88652 195265 -87652 47616 211735 274525 -220767 59286 -64983 134548 84710 -140006
12909A30627b12693g5481j461A71436c31545a33501b3699D31814E2218M7289D781
$$ 130627 -212693 -75481 -76942 171436 -331545 -133501 -23699 431814 52218 99507 4781
12897c731r3776o4202d5771A27316b49597e8826O361B5160J06240a54039B7540
$$ -3731 -97507 -161709 -45771 127316 -249597 -58826 -52465 25160 131400 -154039 27540
12885b69442B15101E3290M1684K4360K8034h9537q68A51636m8956J44625q9608
$$ -269442 215101 53290 94974 119334 147368 -89537 -90405 151636 102680 247305 157697
12874A57697a67512B41392a59187L103c8618A08980i7955k23500e4080b3374j97208
$$ 157697 -167512 241392 -159187 -156084 -38618 108980 -97955 -321455 -54080 -23374 -220582
12863b20582f5706I0599c01580B6250j1598i1857M4539H0682c71712J35865I8630
$$ -220582 -65706 90599 -301580 26250 14652 -91857 -47318 80682 -371712 -235847 98630
12851a28263B09660a4248r0875n5185A29902J8614P2069J93326I4766a3645r1266
$$ -128263 209660 -14248 -105123 -160308 129902 148516 220585 413911 94766 -13645 -104911
12840a04911B7417L6471A5089K35075a65925A8563Q4320Q9611M9258a62181b8680
$$ -104911 27417 63888 15089 250164 -165925 18563 102883 192494 241752 -162181 -28680
12828i3535A14038b9395B0396K89207b77977g3308a1899j29412a0122A89435J4403
$$ -93535 114038 -29395 20396 309603 -277977 -73308 -11899 -141311 -10122 189435 203838
12817B03838J14818b46897h6243j32811p6206H9038f490A28027D8097J18233a71090
$$ 203838 318656 -246897 -86243 -219054 -295260 89038 -6490 128027 48097 166330 -171090
12805I3742a60485L6774q651b5907m1100A27482J0175d3109j1090A17220J41111
$$ 93742 -160485 -123711 -132362 -25907 -67007 127482 137657 -43109 -54199 117220 258331
12794B58331a6870A25214K2168O9688l0083f2781D3458a11989k05266F8482b17364
$$ 258331 -16870 125214 147382 217070 186987 -62781 43458 -111989 -317255 68482 -217364
12782A61775O0116p3572J34107a20154A6315J88186a21480c0310F494K15546l829
$$ 161775 221891 148319 282426 -120154 16315 204501 -121480 -30310 6494 222040 218211
12771B18211a8083k22092B93100D9093J83987Q437C2735f2214D13597J00663k32813
$$ 218211 -18083 -240175 293100 49093 233080 241517 32735 -62214 413597 514260 281447
12760B81447j26813Q0236q1868b2388A02773C1440J04660N0522a30015N5132c6799
$$ 281447 154634 234870 153002 -22388 102773 31440 136100 186622 -130015 -74883 -36799
12748E0103b79071A53941E5747L9471P0040k3946f8915r0212H6563b09498B39144
$$ 50103 -279071 153941 55747 95218 165258 141312 -68915 -159127 86563 -209498 239144
12736A03249K24451a09215b0124p0412A82908J36344A57714o0375b00460G9703
$$ 103249 327700 -109215 -20124 -90536 182908 319252 157714 97339 -200460 79703
12725a47489G3339J04986q1024b34060A79574i5618l75930A00359l8550c09209
$$ -147489 73339 178325 97301 -234060 179574 -95618 -471548 100359 61809 -309209
12714E6957P1533a24597k24181M989J49642I8956K32627j26248a37159J9691A69399
$$ 56957 128490 -124597 -348778 -343789 -194147 98956 331583 205335 -137159 -117468 169399
12702b1661D8708a15965p0998A58097b882F6072J89599A09251l4505h6399m5512
$$ -21661 48708 -115965 -186963 158097 -2882 66072 255671 109251 74746 -86399 -131911
12691a31911c4430A97101F6268a16006C28496a24647g450A75808c49570G0322
$$ -131911 -34430 197101 66268 -116006 328496 -124647 -7450 175808 -349570 70322
12680I8189h870B62396p7074f9863A33214J35847f9052H7020j7293d4163A99349
$$ 98189 -8870 262396 185322 -69863 133214 269061 -69052 87020 69727 -44163 199349
12668a07391E0047J35151o464d33732a8328j81122B37249p6993J74133d857B20872
$$ -107391 50047 185198 178734 -433732 -18328 -199450 237249 160256 334389 -4857 220872
12656I1423I997K72580L9888G549M4221b47635k08496A33424d900A13340i2386
$$ 91423 9997 282577 322465 7549 51770 -247635 -456131 133424 -4900 113340 -92386
12644D9350J15443D3452A4040b53517C6129c32644a18591K5546A3050O4069C2102
$$ 49350 164793 43452 14040 -253517 36129 -332644 -118591 -93045 13050 77119 32102
12632D1074J3816J13478g7013D26539b42521d3867A23881k0270l1417K37889N7260
$$ 41074 54890 168368 -77013 426539 -242521 -43867 123881 103611 72194 310083 367343
12621C67343e333A0217J79192M4230i2595B72390j25087g1244B07710A00148J83563
$$ 367343 -5333 10217 189409 233639 -92595 272390 147303 -71244 207710 100148 283711
12610B83711A3634N6525Q6809a99608C35166j34026r2444b60853A43030J52646
$$ 283711 13634 70159 156968 -199608 335166 201140 108696 -260853 143030 295676
12600B95676B2493i8313C58208C4264J42366b69716A66268B9503a079B03192J51757
$$ 295676 22493 -98313 358208 34264 176630 -269716 166268 29503 -1079 203192 354949
12589C54949a04260I3977L3922l7539A9527J06986l3075b07996B8562J51201a86334
$$ 354949 -104260 93977 127899 90360 19527 126513 93438 -207996 28562 179763 -186334
12577B59899o4936L53285C4575J72811C4869e8332a5914C3422J56921K5325p7551
$$ 259899 194963 548248 34575 207386 34869 -58332 -15914 33422 190343 215668 138117
12566A38117m9521b46020a22467D5812J08650h7780A93107a85798E6943a69396
$$ 138117 88596 -246020 -122467 45812 154462 -87780 193107 -185798 56943 -169396
12555e4538A92444i2377A19759a30031A26190a56975B47752I9849d336k07641
$$ -54538 192444 -92377 119759 -130031 126190 -156975 247752 99849 -4336 -211977
12545b11977j49113I4031c16513B66420a19504A83538r0699D0872K01214K2997
$$ -211977 -361090 94031 -316513 266420 -119504 183538 92839 40872 242086 265083
12535B65083M1972r2842E4892a06101N813A53357a80430d6067B53959A5823N2919
$$ 265083 307055 214213 54892 -106101 -100288 153357 -180430 -46067 253959 15823 68742
12524F8742K45536F7460a3534k54998h3720L6705j250j9606A80940j8583L1773
$$ 68742 314278 67460 -13534 -268532 -83720 -47015 -48265 -67871 180940 162357 194130
12513A94130I6243c6839k6993A97605e0375B4469L94432B1502a82055O5000A8516
$$ 194130 96243 -36839 -63832 197605 -50375 24469 418901 21502 -182055 -117055 18516
12501A19799c22235i4890A1349J24588Q580c05761G5292j181J50572a07603j9434
$$ 119799 -322235 -94890 11349 135937 144517 -305761 75292 74111 224683 -107603 -127037
12490a27037j43584d4371j45039A35793F650M09459j00508d1738A67995J5930
$$ -127037 -270621 -44371 -189410 135793 6650 416109 315601 -41738 167995 183925
12480A83925b51242I0580J82678a3612I7090b13607h0546A6304O6144b00858g2073
$$ 183925 -251242 90580 273258 -13612 97090 -213607 -80546 16304 82448 -200858 -72073
12468b9049A75074p608K79249G2370K87842A29687L19939R4919E7178a60488B94045
$$ -29049 175074 167466 446715 72370 360212 129687 449626 544545 57178 -160488 294045
12456B05020c9882A90145f524q8637j08137E1569b06347e2964E3867g4042k12949
$$ 205020 -39882 190145 -6524 -95161 -203298 51569 -206347 -52964 53867 -74042 -286991
12445b86991E1164K41724b05907j55472E5283c21467J18453q505c4572G2555O7693
$$ -286991 51164 292888 -205907 -361379 55283 -321467 -203014 -211519 -34572 72555 140248
12434A40248Q0562E5473a748o2130J846H8483a81221B03415F0537R4590Q2943
$$ 140248 220810 55473 -1748 -63878 -62032 88483 -181221 203415 60537 155127 238070
12423B38070a44147B688i0352j78359B37178a76904P5895o850I4193J87784b03615
$$ 238070 -144147 2688 -90352 -268711 237178 -176904 -101009 -107859 94193 281977 -203615
12411a04550d6716j10134A12893n5504h7565A39882O5885b38983a2406A47383
$$ -104550 -46716 -156850 112893 57389 -87565 139882 205767 -238983 -12406 147383
12400b8591k2598C4556d5641H959g095r3257F092N7953a39773q4455k6204B57071
$$ -28591 -51189 34556 -45641 8959 -7095 -100352 6092 64045 -139773 -224228 -250432 257071
12387b5341F3347d25187A93864f4227I4338g340E4538b97335A65999b10211A08661
$$ -25341 63347 -425187 193864 -64227 94338 -7340 54538 -297335 165999 -210211 108661
12375a48593F2263K12732o6797c0180j42090B81432a14846B51464K4305c61814
$$ -148593 62263 274995 208198 -30180 -172270 281432 -114846 251464 275769 -361814
12364g1267H3120a92110B68380A24632P705a0074k04870D7786b28449g0287d821
$$ -71267 83120 -192110 268380 124632 132337 -10074 -214944 47786 -228449 -70287 -4821
12352B97347b2982j11481N8154a1754B06101f9314A46392D5198e0194d996B5895
$$ 297347 -22982 -134463 -76309 -11754 206101 -69314 146392 45198 -50194 -4996 25895
12340B416O373c39321J30595F0653c86037A17206a10353A0886N2742c43319A9004
$$ 2416 8789 -339321 -208726 60653 -386037 117206 -110353 10886 63628 -343319 19004
12328A13534a25332A81451J57652a64892P8557B59138D0962A011b08591B01543
$$ 113534 -125332 181451 339103 -164892 -86335 259138 40962 1011 -208591 201543
12317D85643A5994J05445b1736C19460i4394O138G8713b42865j67631B15822C359
$$ 485643 15994 121439 -21736 319460 -94394 -88256 78713 -242865 -410496 215822 3359
12305h7119L3141q8585e1963H2967A3498J16786B246J03104a98144A95624l8724
$$ -87119 -53978 -142563 -51963 82967 13498 130284 2246 105350 -198144 195624 156900
12294A56900l2257d247k94993A7984N4316i6404A37259J76653G7887C7395M9037
$$ 156900 124643 -4247 -299240 17984 72300 -96404 137259 313912 77887 37395 86432
12283H6432a30817J6874j63054A54331c4709n4759a9669F1373J81164h3817B53569
$$ 86432 -130817 -113943 -276997 154331 -34709 -89468 -19669 61373 242537 -83817 253569
12271B24681I8899q563a6982E3690O1724L6627b61744C63213j0486g3969n4670
$$ 224681 98899 90336 -16982 53690 115414 152041 -261744 363213 352727 -73969 -128639
12260a28639B57229b19103F5247Q3533L0599g5332A98069b6890D61241G7882L78671
$$ -128639 257229 -219103 65247 148780 179379 -75332 198069 -26890 461241 77882 456553
12249D56553A28135i38j72658A26797A3083a56121O0881j15262c5023A86513b5030
$$ 456553 128135 -938 -173596 126797 13083 -156121 -95240 -210502 -35023 186513 -25030
12237a89137B34875E5474L33875a60913L9360j01739h7116B06580k2375J43601
$$ -189137 234875 55474 389349 -160913 -121553 -223292 -87116 206580 184205 327806
12227C27806o7836a5679j65500I7965L01005J36918A77861a14487B22357j1101
$$ 327806 259970 -15679 -181179 97965 398970 535888 177861 -114487 222357 211256
12217B11256K66730i0935r4765B29810a2486B25858o6571M2097J74262f6187G9200
$$ 211256 477986 -90935 -185700 229810 -12486 225858 159287 201384 375646 -66187 79200
12205A42494J19646g2076A46692J51592d24391B52191r2979J12509j25013l9061
$$ 142494 262140 -72076 146692 298284 -424391 252191 159212 271721 146708 107647
12195A07647e8184B09095r422D3826L27863C7022R5393P1822r5885J16994H902
$$ 107647 -58184 209095 199673 43826 371689 37022 132415 204237 108352 225346 8902
12183e950B68775m5720J87682F6543K0879k7433O7185l238A6837c499B09939b3570
$$ -5950 268775 223055 410737 66543 87422 59989 127174 123936 16837 -3499 209939 -23570
12170a34371B92032a75734I4492K18274c6728A90384m4692B615e1933a6854A79055
$$ -134371 292032 -175734 94492 312766 -36728 190384 145692 2615 -51933 -16854 179055
12158i4166p1977A33001Q6161O367A5543K40675r6370B5344C813K65264f2407
$$ -94166 -166143 133001 219162 225529 15543 256218 159848 25344 3813 269077 -62407
12146b63459o0795C1976f655D5440K62748i9168j02604B497J77003L3574D5938
$$ -263459 -324254 31976 -6655 45440 308188 -99168 -201772 2497 179500 213074 45938
12134b17641A76460P7604F3497D889J82819E0643j6441c73883a06346N963d6167
$$ -217641 176460 254064 63497 4889 187708 50643 34202 -373883 -106346 -100383 -46167
12122D21667a12789B0805c22637B29314o5786a62997O5606B77435a39510D15019
$$ 421667 -112789 20805 -322637 229314 163528 -162997 -97391 277435 -139510 415019
12111c8324o63j84683f6010H3449J82139l0421f077A1520d5311A87089b842B2038
$$ -38324 -38987 -223670 -66010 83449 265588 235167 -6077 11520 -45311 187089 -2842 22038
12098C0820h6110B92507q0809B7152M1745a02519j08989I6478N0756b55881c6683
$$ 30820 -86110 292507 211698 27152 68897 -102519 -211508 96478 147234 -255881 -36683
12086B26751j9133a2087G3881K29270p888C0518K22844J53606A13450I777b1831
$$ 226751 207618 -12087 73881 303151 295263 30518 253362 406968 113450 9777 -21831
12074a83104j1771D5062b53601E5949J6795a60208H9139h0632j56003A45570k113
$$ -183104 -194875 45062 -253601 55949 72744 -160208 89139 -80632 -236635 145570 143457
12063A43457a80146A44420m9170J62902b6057m5433j45754B97683f0768C56850
$$ 143457 -180146 144420 95250 258152 -26057 -71490 -217244 297683 -60768 356850
12052D1487c30666J61505Q952e657B25482J00976Q28649B33106a98786M8808D0283
$$ 41487 -330666 -169161 -160209 -5657 225482 326458 1155107 233106 -198786 -149978 40283
12040b39514f7571I5056d4395A71714a81814A49812Q2331k964b61071j92548a31911
$$ -239514 -67571 95056 -44395 171714 -181814 149812 232143 229179 -261071 -453619 -131911
12028F6274N4334K14886a55531a1275n5670j8685A05504b52026i7902l9478c0162
$$ 66274 120608 335494 -155531 -11275 -66945 -85630 105504 -252026 -97902 -137380 -30162
12016a97626l813j8596d0281B21848o1607R6211b41285L063D05943h1236E932
$$ -197626 -201439 -220035 -40281 221848 160241 256452 -241285 -238222 405943 -81236 5932
12004b33803A03208N9496J18141c34124a18233B21394h4851F5696b2862j21353
$$ -233803 103208 162704 280845 -334124 -118233 221394 -84851 65696 -22862 -144215
11994a44215K6756h452p1867A02857d68660a17438M9600p4463g283n9487A03203
$$ -144215 -117459 -8452 -80319 102857 -468660 -117438 -67838 -142301 -7283 -66770 103203
11982i177j6330n2449f066k51649a27607C37079j12138a37076A17099a10253k64432
$$ -9177 -25507 -77956 -6066 -257715 -127607 337079 224941 -137076 117099 -110253 -374685
11971c74685f5189B33437A08800c78532P9430b2715q0903N0122B89705c58056
$$ -374685 -65189 233437 108800 -378532 -299102 -22715 -103618 -53496 289705 -358056
11960b32755A41395c17773J21302A24784g435r0470C07056j44288h5351j72436
$$ -232755 141395 -317773 -196471 124784 -7435 -97905 307056 162768 -85351 -257787
11950b57787G4567N1581J19169A01672b38449a6991A01160C5054J0888b80998
$$ -257787 74567 126148 245317 101672 -238449 -16991 101160 35054 45942 -280998
11939b27816j23934J71127j08096g9705A33502a36675D8845J93076I6059f0755
$$ -227816 -351750 -180623 -288719 -79705 133502 -136675 48845 241921 96059 -60755
11928B96433j40914g8473C41575a5746j36792b0663h111r0108B65465g4632A40712
$$ 296433 155519 -78473 341575 -15746 -152538 -20663 -8111 -98219 265465 -74632 140712
11916H4532J08802c9030j50867B4777J8197J87747a29108p9271A77337l8752J05479
$$ 84532 193334 -39030 -189897 24777 42974 230721 -129108 -208379 177337 138585 244064
11905B44064E5436j9429b20071N7854A96820N152G6449d9486C21312i6666k7411
$$ 244064 55436 36007 -220071 -162217 196820 201972 76449 -49486 321312 -96666 -124077
11894a24077n880k76725E4514M7703b26461N5245j13799d3815E5979O6422k6047
$$ -124077 -129957 -406682 54514 102217 -226461 -171216 -285015 -43815 55979 122401 96354
11883I6354N4157a87351a6291j96317g121k50785a25546b719B14644b787m4751
$$ 96354 150511 -187351 -16291 -212608 -7121 -257906 -125546 -2719 214644 -2787 -47538
11872d7538C89975a48038B26329a42821d1238p9084K0610B23994b06881h5165
$$ -47538 389975 -148038 226329 -142821 -41238 -120322 -99712 223994 -206881 -85165
11861A314f0321K544j29846B37057B8636g1719h021l94657D89943a48233B50786
$$ 1314 -60321 -57777 -187623 237057 28636 -71719 -8021 -402678 489943 -148233 250786
11849a35533D08005b31252A27989a80277I5795B7621L00032c26051A30655i2390
$$ -135533 408005 -231252 127989 -180277 95795 27621 327653 -326051 130655 -92390
11838A88099L90395a58418C6190a10846j27865a7322G7246J77644h6131l4151
$$ 188099 578494 -158418 36190 -110846 -238711 -17322 77246 254890 -86131 -120282
11828a20282Q268A27486b13919B74204c33451a16130A3513K27124g4583l7307
$$ -120282 -112014 127486 -213919 274204 -333451 -116130 13513 240637 -74583 -111890
11818a11890r2064F6955A7027J52472L6655b02240k3697D6994b55964F7207m118
$$ -111890 -203954 66955 17027 169499 206154 -202240 -225937 46994 -255964 67207 63089
11807F3089c78335A0069b6078j56605j21987a08133C7233h6105l9505a9904D28667
$$ 63089 -378335 10069 -26078 -182683 -304670 -108133 37233 -86105 -125610 -19904 428667
11795g1093k7473m7810B12541h7567k94558c3492B38688b137B15659J15597A15703
$$ -71093 -98566 -146376 212541 -87567 -382125 -33492 238688 -2137 215659 331256 115703
11783a24730A5509h4119q9250D14463B7590b17904H3868F339b86639H6794l47
$$ -124730 15509 -84119 -173369 414463 27590 -217904 83868 6339 -286639 86794 86447
11772H6447b01450o8371D5546a51897a9515A84228e2345m4785F3142K91788C002
$$ 86447 -201450 -269821 45546 -151897 -19515 184228 -52345 -97130 63142 354930 3002
11760b43204f7999A52493h900F7201a6388l24089A6980L4248a98675i2506O392
$$ -243204 -67999 152493 -8900 67201 -16388 -340477 16980 51228 -198675 -92506 -86114
11749h6114l4559A2015a71042B6781a67394K4250J2208A18941n8331a06023B69984
$$ -86114 -120673 12015 -171042 26781 -167394 -143144 -130936 118941 60610 -106023 269984
11737B86063A7231e9387k80939I3677l8444k836J96577C5549j2685g2453C1356
$$ 286063 17231 -59387 -340326 93677 55233 52397 248974 35549 22864 -72453 31356
11725a76424p2760D1057a14743l6538f4843I457a48386i032j69323O483b2388
$$ -176424 -249184 41057 -114743 -151281 -64843 9457 -148386 -9032 -178355 -171872 -22388
11713a57672C8308K5584k4814a24040L0667M0416A77596k1683D0001a04502A4093
$$ -157672 38308 63892 39078 -124040 -93373 -52957 177596 155913 40001 -104502 14093
11701B48424a85953f5511j16765L7314H5260l2901e8674H8298n052M1311m4671
$$ 248424 -185953 -65511 -182276 -144962 85260 52359 -58674 88298 83246 124557 79886
11690G9886f5738j72296a02156c9500j03885A82921F4878c62084E9430J41191
$$ 79886 -65738 -238034 -102156 -39500 -143385 182921 64878 -362084 59430 200621
11680B00621Q1197i7991a1543r4163d0515C33704I8066C7078L8745a98416A41054
$$ 200621 281818 -97991 -11543 -105706 -40515 333704 98066 37078 75823 -198416 141054
11668b16865g3148D30650a14569c1527A44628J3445N0633D6503e7770j55472B45867
$$ -216865 -73148 430650 -114569 -31527 144628 158073 208706 46503 -57770 -213242 245867
11656a64083A40290m5903b19075B08992p1162J69294b83435J14929j4612I3390
$$ -164083 140290 94387 -219075 208992 137830 307124 -283435 -168506 -183118 93390
11645A46299e9862H3127k8397L90764g8761r2590k29974A46188E189M5842c0572
$$ 146299 -59862 83127 54730 445494 -78761 -171351 -401325 146188 5189 51031 -30572
11633b47145B1471L3227Q769h4899p2448O8711A60503o1348O8938b50293B16504
$$ -247145 21471 54698 63467 -84899 -157347 -88636 160503 99155 168093 -250293 216504
11621A14442n3709a74537k237a5284E38343b13447A40210F5939K11601q193G1175
$$ 114442 60733 -174537 -176774 -15284 538343 -213447 140210 65939 277540 269347 71175
11609C74832H9788c07070A05256b57456J27984E6093e7348k42004A16546b54244
$$ 374832 89788 -307070 105256 -257456 -129472 56093 -57348 -299352 116546 -254244
11598b04874e5169j25199I553K29591a2071k24291d6557k6152A89419o6519f8550
$$ -204874 -55169 -180368 9553 239144 -12071 -236362 -46557 -72709 189419 122900 -68550
11586a43069l5155A47502p0115J8707a1015D22941b96037D989b28793A50294c17166
$$ -143069 -178224 147502 77387 96094 -11015 422941 -296037 4989 -228793 150294 -317166
11574d1262E5396a52725d146A6390Q0876b8836P605j44791E9921a14632m995e7146
$$ -41262 55396 -152725 -4146 16390 97266 -28836 -21231 -166022 59921 -114632 -119627 -57146
11561b47034K504D6603A850h5977B38402e1264A57651D9849A1438a01346A97605
$$ -247034 -244530 46603 1850 -85977 238402 -51264 157651 49849 11438 -101346 197605
11549b37146A28687c13152f8280D2117N363A8158c29697B3957J07137E1565A9783
$$ -237146 128687 -313152 -68280 42117 47480 18158 -329697 23957 131094 51565 19783
11537D10537B4412c8923D9280a55148c1412l94212B98899N6899a77025g9963r7854
$$ 410537 24412 -38923 49280 -155148 -31412 -425624 298899 355798 -177025 -79963 -177817
11526a77817A47518n8782a64863F6081b3930r5431M8688A73443d9996o0958A65254
$$ -177817 147518 88736 -164863 66081 -23930 -119361 -70673 173443 -49996 -110954 165254
11514B96268g6498A22964k4645K17973k5712R8521c32061D8906i3433J2406E9293
$$ 296268 -76498 122964 98319 316292 290580 389101 -332061 48906 -93433 -81027 59293
11502E9938a48452B93328j44225D7809d9994B54576i9587A16207k0442m3528M1211
$$ 59938 -148452 293328 149103 47809 -49994 254576 -99587 116207 95765 52237 93448
11491I3448m5266K65873C8961A7790J64355p5939O201M45449d2384j31830D15176
$$ 93448 48182 314055 38961 17790 182145 106206 112407 557856 -42384 -174214 415176
11479B30896j04818C9743a55424D4243A1603J95150f2501B76522h9637a4442F8676
$$ 230896 126078 39743 -155424 44243 11603 206753 -62501 276522 -89637 -14442 68676
11467a15664A87600c3600A17044a9587j96641D6502a25062A57658c4267A07543
$$ -115664 187600 -33600 117044 -19587 -216228 46502 -125062 157658 -34267 107543
11456F2830J92891H3710R7188c0228I7273f4629l7182e0513A27892i7103j2852
$$ 62830 255721 83710 180898 -30228 97273 -64629 -101811 -50513 127892 -97103 -109955
11445a09955G0786J75821a88771B39602I2260Q4124A0414a21013A67979K30511
$$ -109955 70786 246607 -188771 239602 92260 176384 10414 -121013 167979 398490
11435C98490b22179a08802G4186d019C09843l3465c2491k34403I3849a77213a0646
$$ 398490 -222179 -108802 74186 -4019 309843 276378 -32491 -266894 93849 -177213 -10646
11423d773H4024a12173n304j31151P1725P3960E4489c55066J74574P9431o697
$$ -4773 84024 -112173 -117477 -248628 -176903 -102943 54489 -355066 -180492 -101061 -107758
11412a07758B850c8146D5896e115l5788j74062j50538C273N3693L8030f9181A4283
$$ -107758 2850 -38146 45896 -5115 -40903 -214965 -365503 3273 56966 94996 -69181 14283
11399A70267I104K01111b41716A76110b59328J0566d8862l66264c7580i59E0469
$$ 170267 9104 210215 -241716 176110 -259328 -248762 -48862 -415126 -37580 -959 50469
11387C3010a97635f8936A14596i5712B09277c43842A0614a00551n5309G1820l015
$$ 33010 -197635 -68936 114596 -95712 209277 -343842 10614 -100551 -155860 71820 68805
11376F8805J52133a2726m9068k75437C24440q1202q6728b7845j31683c3764j9569
$$ 68805 220938 -12726 -61794 -337231 324440 243238 156510 -27845 -159528 -33764 -53333
11365e3333E5070g1443B329K11356l309a39657O6321A04440K88384a97269h4341
$$ -53333 55070 -71443 2329 213685 210376 -139657 -73336 104440 392824 -197269 -84341
11353B28395b6899E5334J19101o8614e4807k0436B5333b78171k7697A07617l8367
$$ 228395 -26899 55334 174435 105821 -54807 -75243 25333 -278171 -305868 107617 69250
11342F9250a631A80891H1128l1581h0669k26466A94101E4145B2331J47740g914
$$ 69250 -1631 180891 81128 49547 -80669 -307135 194101 54145 22331 170071 -7914
11330b00286p360h7877A1339a46254M2261j72057B6949J65953m4479l8854a81281
$$ -200286 -207646 -87877 11339 -146254 -103993 -276050 26949 192902 148423 109569 -181281
11318A98306d8762F9516k8871a24326D2490J42377E6207A1457a24737h93A39420
$$ 198306 -48762 69516 40645 -124326 42490 184867 56207 11457 -124737 -893 139420
11306c67010f7915K5923A01842d162j80954M884F0708B933J8665h3103j53424
$$ -367010 -67915 -41992 101842 -4162 -185116 -180232 60708 2933 21598 -83103 -236527
11295b36527Q6873c9984n3447F9408C3923b43993g5054k57001l0077A54057c99811
$$ -236527 -149654 -39984 -93431 69408 33923 -243993 -75054 -332055 -362132 154057 -399811
11283h0340C3656a08165B90638c2996j26144j00824f75H3953a32151A21721N7204
$$ -80340 33656 -108165 290638 -32996 -159140 -259964 -675 83953 -132151 121721 178925
11272A78925K3207a16408A87265c27583m2972k82768A49450b1742A19782M2317
$$ 178925 202132 -116408 187265 -327583 -370555 -653323 149450 -21742 119782 162099
11262A62099a1654l29735o9951e9297l6433F6304b04712G958J4149a1592j53417
$$ 162099 -11654 -341389 -411340 -59297 -95730 66304 -204712 7958 22107 -11592 -165009
11251a65009I7924R8273c8500B16294J31097a95895A1397a30898L8237B12829
$$ -165009 97924 196197 -38500 216294 347391 -195895 11397 -130898 -92661 212829
11240F5774d5653l9088D9280g7127b8724D9906K8182l7382b75440B16771B464
$$ 65774 -45653 -84741 49280 -77127 -28724 49906 78088 40706 -275440 216771 2464
11228a60205L6456D8582b43837P2787a371q4962r3797E0351J06495C8636g0044
$$ -160205 -123749 48582 -243837 -171050 -1371 -86333 -180130 50351 156846 38636 -70044
11216A8366F010J89442b60161c6157q771A31017b67616C27535a50304A516J09650
$$ 18366 6010 195452 -260161 -36157 -44928 131017 -267616 327535 -150304 1516 111166
11205A11166J79356b72200l1522J40811J4399O0016j27960M9503B1118L1960a4805
$$ 111166 290522 -272200 -303722 -162911 -148512 -88496 -216456 -166953 21118 53078 -14805
11193a86297A80656a04877H088b81862F9909j2256K973c12729f7753A90283d75760
$$ -186297 180656 -104877 8088 -281862 69909 57653 60626 -312729 -67753 190283 -475760
11181B8694b17741F0532a91412k40065C82304b78460a3600j88784B97761a51615
$$ 28694 -217741 60532 -191412 -431477 382304 -278460 -13600 -202384 297761 -151615
11170a19356q2168m8289B72662b80221D30662a719A29433n5960e8310b1554j3719
$$ -119356 -201524 -249813 272662 -280221 430662 -1719 129433 73473 -58310 -21554 -35273
11159c5273B19743D2206a57679e0030D521L9773j5121a41080F7932c6150r1386
$$ -35273 219743 42206 -157679 -50030 4521 44294 29173 -141080 67932 -36150 -127536
11148a27536K0395K6983A15453a14316c6068a7365E2552a15107K9645D3851b1437
$$ -127536 -107141 -80158 115453 -114316 -36068 -17365 52552 -115107 -85462 43851 -21437
11136A6944J30865C9733P0805L6707c43808c675m6040A25231d0047C46155a15218
$$ 16944 147809 39733 110538 147245 -343808 -3675 -49715 125231 -40047 346155 -115218
11124e7437I8519K05010R2147d8394B60709j14212K1687j4596b12723f4309E5687
$$ -57437 98519 303529 395676 -48394 260709 146497 168184 153588 -212723 -64309 55687
11112a46789E2343b0635D1983c203k09793G4337J19443k1091J04221Q0436A20042
$$ -146789 52343 -20635 41983 -3203 -212996 74337 193780 172689 276910 357346 120042
11100B8558K22754k4892q9735j8599o968J33157E8366J25237r960a07785D8588
$$ 28558 251312 226420 136685 118086 111118 244275 58366 183603 173643 -107785 48588
11088d0714A59056K71647A6875K31418a22054C11984q0914G131i3339B77865j18472
$$ -40714 159056 430703 16875 248293 -122054 311984 231070 7131 -93339 277865 159393
11077A59393K9921a5225A65359n706r463J0004f7037B81582O2627A19237K61489
$$ 159393 189314 -15225 165359 159653 150190 160194 -67037 281582 344209 119237 380726
11066C80726j4172A40500J12756J15660p6065K93144j5900j60572K13499A66988
$$ 380726 366554 140500 253256 368916 292851 585995 570095 409523 623022 166988
11055B72407M39J58765J18596j32576A95563N09287p7310k42162L78388k53726
$$ 272407 272846 431611 550207 417631 195563 704850 627540 385378 763766 510040
11045E10040k25030L17639j36689J21281l129L1722r5151j2605O9514j54728J71061
$$ 510040 285010 602649 465960 587241 584112 615834 520683 508078 577592 422864 593925
11034E93925j39081J82795J24119l26514m5023j11769J91517J6011P8798M6481
$$ 593925 454844 637639 761758 435244 390221 278452 469969 485980 564778 611259
11024F11259J38946j79185j26007L477M2256I579O53305A18110K94614K2669J5709
$$ 611259 750205 571020 445013 448490 490746 9579 662884 118110 412724 435393 451102
11013D51102k7186j43789J99234j46729K63044p0553J07655B16142M38244j87191
$$ 451102 423916 280127 479361 332632 595676 525123 632778 216142 654386 467195
11003D67195r9765K36157B14952K86394j65852K79695K8669B50920J67491A81814
$$ 467195 367430 603587 214952 501346 335494 615189 643858 250920 418411 181814
10992G03056k48856j6057B17669P5540L09969l1553Q1917j59126K52654q007l3923
$$ 703056 454200 438143 217669 293209 603178 571625 653542 494416 747070 739063 705140
10981G05140m5819N63510k49196K88573j25290K56238K39104J9209M63847j94340
$$ 705140 659321 1222831 973635 1262208 1136918 1393156 1632260 1651469 2115316 1920976
10971A920976O62159o08924j66704j56024l652o63209K69118R4119l20476J1864
$$ 1920976 2583135 1974211 1807507 1651483 1647831 984622 1253740 1347859 1027383 1039247
10961A039247J01501J83244j13773m29604M12919K7098n37887K93227r6399l08915
$$ 1039247 1140748 1323992 1210219 780615 1193534 1220632 682745 975972 879573 570658
10951E70658J7673A86266N10756C46467p3978n9097l6763M0159L1781l9168L79079
$$ 570658 588331 186266 697022 346467 272489 213392 176629 216788 248569 209401 588480
10940E88480A7314J28633O058L57885b04806D38446k10496h636B4715a01870B24790
$$ 588480 17314 145947 152005 509890 -204806 438446 227950 -8636 24715 -101870 224790
10928C65057h8003A06604J2097J23209G1098Q6370o8076a48840A20651c65855
$$ 365057 -88003 106604 118701 241910 71098 157468 89392 -148840 120651 -365855
10917d25362d1842k1805A51839J5365rd037j27003A21851P5995d5409A30787h2882
$$ -425362 -41842 -63647 151839 167204 167195 -4037 -131040 121851 197846 -45409 130787 -82882
10904e6594I4110J70055n2937b82729i5471K8795B96390a56183A61917c09369
$$ -56594 94110 264165 211228 -282729 -95471 -66676 296390 -156183 161917 -309369
10893b05985d1627k9606e467p1452A14e9689A08378i698A15052P412a74160A73710
$$ -205985 -41627 -71233 -5467 -76919 114 -59689 108378 -9698 115052 122464 -174160 173710
10880a51835C44834h6409G7240N2682c23151B80734e0262j12508A27324a66599
$$ -151835 344834 -86409 77240 129922 -323151 280734 -50262 -162770 127324 -166599
10869B29891k5056a46266B59275b23642A4228g0192C37579b19470n0741J06218
$$ 229891 204835 -146266 259275 -223642 14228 -70192 337579 -219470 -270211 -163993
10859a63993O9069A7500a42720D0703b08178f5767i483E6243a0220j46785C5737
$$ -163993 -94924 17500 -142720 40703 -208178 -65767 -9483 56243 -10220 -157005 35737
10847A81006b09043L434h8416A8700d9340G3087b40780n1919J33398N0356A39731
$$ 181006 -209043 -205609 -88416 18700 -49340 73087 -240780 -292699 -159301 -108945 139731
10835c8420I0053a13829N2835A0199h1727A48019m2906B7201b70798g9842j29568
$$ -38420 90053 -113829 -60994 10199 -81727 148019 105113 27201 -270798 -79842 -209410
10824b09410A64564e0746o1630c0427D1847a9915k13389g1735l09159g8822a7033
$$ -209410 164564 -50746 -112376 -30427 41847 -19915 -233304 -71735 -380894 -78822 -17033
10812A64923F2891L175b25568H8327k5486c25333l770R0460h084I357b47099b8282
$$ 164923 62891 66066 -225568 88327 62841 -325333 -329103 -238643 -8084 9357 -247099 -28282
10799G0094J27672p7798b54105f7591j76574b8656k31520a05752A30429b05450
$$ 70094 197766 119968 -254105 -67591 -244165 -28656 -260176 -105752 130429 -205450
10788a66315D3869c00378A23839a04663j34624P9268P9873k49632i6815B69326
$$ -166315 43869 -300378 123839 -104663 -239287 -160019 -80146 -329778 -96815 269326
10777b43200n361n7947J23611A7479o063N2114O7271a57381B75846a07771A32280
$$ -243200 -248561 -306508 -182897 17479 11416 63530 130801 -157381 275846 -107771 132280
10765E880d30101h4528j16029O8602M7183K0695r0198b3915m1734a1048C10267
$$ 5880 -430101 -84528 -200557 -131955 -84772 -64077 -154275 -23915 -65649 -11048 310267
10753a56947d1515d536C90831j29553j2922a11203D996a74637j01502c3753p2710
$$ -156947 -41515 -4536 390831 261278 248356 -111203 4996 -174637 -276139 -33753 -106463
10742a06463I4224f1997J9787a6851k35958B36244i3295j22999J5575Q5404A81086
$$ -106463 94224 -61997 -42210 -16851 -252809 236244 -93295 -216294 -200719 -115315 181086
10730c8759A74175l266Q3585c5680B13271a8947j91720J5404c7200j253C6888
$$ -38759 174175 170909 254494 -35680 213271 -18947 -210667 -195263 -37200 -38453 36888
10718b3523k51462e1100k258B65739a22384N0757b5431G2321D032a75590j43692
$$ -23523 -274985 -51100 -53358 265739 -122384 -71627 -25431 72321 4032 -175590 -319282
10707c19282H5457c51652B11567b6038l27906I7611a69517c0691k61782H2224
$$ -319282 85457 -351652 211567 -26038 -353944 97611 -169517 -30691 -292473 82224
10696B1490J5414a8145B7824J11679M718E7336J87990c6834l74919J72044o0294
$$ 21490 36904 -18145 27824 139503 144221 57336 245326 -36834 -411753 -239709 -300003
10685c00003P3276N5076p1287k016g3991J2247A49091a67191j36690A10974a62985
$$ -300003 -226727 -171651 -242938 -244954 -73991 -61744 149091 -167191 -303881 110974 -162985
10673c7574H4417K72241b262k71453A37744O6215l3463c87505a50421A50081K53666
$$ -37574 84417 356658 -2262 -273715 137744 203959 170496 -387505 -150421 150081 403747
10662D03747a18385k8663B0873a35850j12753A23007a06802M7768H0738O149c43459
$$ 403747 -118385 -147048 20873 -135850 -248603 123007 -106802 -59034 80738 86887 -343459
10650A49509a98456B75199d419q0226K1542B48509d21024A64559c4493A52897
$$ 149509 -198456 275199 -4419 -84645 -63103 248509 -421024 164559 -34493 152897
10639A15901c28000F4224f1074l5050a2718A1988a50740I365d76520I3935K7572
$$ 115901 -328000 64224 -61074 -96124 -12718 11988 -150740 9365 -476520 93935 121507
10628A21507M3309b20566e5437j30489F616a8507H7293a11773j43006B39927p9999
$$ 121507 164816 -220566 -55437 -185926 6616 -18507 87293 -111773 -254779 239927 159928
10617A59928a35577m2852I4396b63690e8544b7819n6595j10389A05817a74773
$$ 159928 -135577 -178429 94396 -263690 -58544 -27819 -84414 -194803 105817 -174773
10606a57863A08038e8903A10786J18177d19902g8104B3156a860j34666l4183N3565
$$ -157863 108038 -58903 110786 228963 -419902 -78104 23156 -1860 -136526 -170709 -117144
10595a17144I4171b42244Q0481a3013l64018E2448J67022i8819B38779L02440
$$ -117144 94171 -242244 -161763 -13013 -377031 52448 219470 -98819 238779 541219
10585E41219H5758b85107C37074a92105F4747g7771J2871m8258H4862b98267j21479
$$ 541219 85758 -285107 337074 -192105 64747 -77771 -64900 -113158 84862 -298267 -419746
10574d19746a3387r2774K8601B66352A16721a37060d9542A91001C777a44455H1646
$$ -419746 -13387 -106161 -77560 266352 116721 -137060 -49542 191001 3777 -144455 81646
10562c1340A15659k411m9969J00957b66535O2182C20631a18557A57006b01622
$$ -31340 115659 113248 63279 164236 -266535 -204353 320631 -118557 157006 -201622
10551H3723b0053r8760D5641K08091d7310O677k11783e3854A49773h5109j72379
$$ 83723 -20053 -118813 45641 253732 -47310 -40633 -252416 -53854 149773 -85109 -257488
10540b57488h407C0867b83106F4867N3067a18009A37173a55974d8013j18043b3006
$$ -257488 -8407 30867 -283106 64867 117934 -118009 137173 -155974 -48013 -166056 -23006
10528A72982g0124l40j75054b9580d277j54176k71261h2173L0668I6375b46035
$$ 172982 -70124 -70464 -245518 -29580 -4277 -158453 -429714 -82173 -51505 96375 -246035
10516A44557a52766r1796q2652C43466G128b61618A03660m9844a62922L3142c3617
$$ 144557 -152766 -244562 -327214 343466 7128 -261618 103660 53816 -162922 -129780 -33617
10504A91799M0682d0124D9034b55346N3663d3737j68959i9513E807J24545g6427
$$ 191799 232481 -40124 49034 -255346 -201683 -43737 -212696 -99513 5807 130352 -76427
10492I928a38585A40063k9783b40182h7371L0125A44919c3600H9370a15536k88403
$$ 9928 -138585 140063 110280 -240182 -87371 -57246 144919 -33600 89370 -115536 -403939
10481d03939a2795j01994k2157E949J17897c34368A74604R2658q1292a50934e5832
$$ -403939 -12795 -114789 -136946 5949 123846 -334368 174604 267262 185970 -150934 -55832
10469H4666k482b61382e2162B43797M7764c34187a01080j39355M782A74720a52333
$$ 84666 82184 -261382 -52162 243797 291561 -334187 -101080 -240435 -235653 174720 -152333
10457b56138k7250d405k646j54491j06448M8044i6403I2489a7819F6790Q8627
$$ -256138 -283388 -4405 -7051 -161542 -267990 -219946 -96403 92489 -17819 66790 155417
10446A55417a51564e1975a8138B17345a58784G3393K31198C1748J96565k8580
$$ 155417 -151564 -51975 -18138 217345 -158784 73393 304591 31748 228313 199733
10436A99733b72554B08292c7438j92534e1141E799Q8208b04110L9629e7004l4411
$$ 199733 -272554 208292 -37438 -229972 -51141 5799 94007 -204110 -164481 -57004 -91415
10425i1415F7010i1595m11280F3843J04481G794f4067k52752F4640j4766J64089
$$ -91415 67010 -91595 -502875 63843 168324 7794 -64067 -316819 64640 49874 213963
10414B13963a06355A81302c97926d0323a3703C0122a31663A9280c1538H9642J275
$$ 213963 -106355 181302 -397926 -40323 -13703 30122 -131663 19280 -31538 89642 90917
10403I0917a67304j30010C71302I6974a43339N7979k4745k2108C2478K57291o7089
$$ 90917 -167304 -297314 371302 96974 -143339 -85360 -110105 -132213 32478 289769 222680
10392B22680C3180a11276C66935B0630G593M1671a67804A34476K7687D703g177
$$ 222680 33180 -111276 366935 20630 7593 49264 -167804 134476 162163 4703 -7177
10380d0631A85924E8425c5748B69306b4548A48473N5201I6938k4473J81704J34487
$$ -40631 185924 58425 -35748 269306 -24548 148473 203674 96938 72465 254169 388656
10369C88656A86507R982J88392A78894J33424j6364a89045C41966H4393J03699
$$ 388656 186507 196489 384881 178894 312318 295954 -189045 341966 84393 188092
10359A88092J15936j08968L33091d4861B03620q8214M36104A22935O77449k46904
$$ 188092 304028 195060 528151 -44861 203620 115406 551510 122935 800384 553480
10349E53480k41090r5968o8822N8096R838F4810d57231A59031p4719b10784A79669
$$ 553480 312390 216422 147600 205696 215534 64810 -457231 159031 84312 -210784 179669
10337B41326j3524q5608a8296B55056o7279l8343a11079A45625M6783K13597C2893
$$ 241326 227802 142194 -18296 255056 187777 149434 -111079 145625 192408 406005 32893
10325A03103a31075E3506J51368a6277D729J98564a04913a0172C1326b35484f3120
$$ 103103 -131075 53506 204874 -16277 4729 203293 -104913 -10172 31326 -235484 -63120
10313E5187J04317j1705M777D8160J33808A3845b20130B92941n7145A17020a60127
$$ 55187 159504 147799 152576 48160 181968 13845 -220130 292941 235796 117020 -160127
10301a82108g2442K3603A1617a63960C15927C7228c297I0263C0734J88651r4369
$$ -182108 -72442 -48839 11617 -163960 315927 37228 -3297 90263 30734 219385 125016
10290A25016F210c53953B29176a51392r5898N7837N1615A40231b50152a11191
$$ 125016 6210 -353953 229176 -151392 -247290 -189453 -137838 140231 -250152 -111191
10279g6603a4081j06535B1250h4759B9162L71011E5453e7265m228k15417B86932
$$ -76603 -14081 -120616 21250 -84759 29162 400173 55453 -57265 -61493 -276910 286932
10267B2390D733b49548A13638f9913B5675a10748B87635b9266A26606a63113D65386
$$ 22390 4733 -249548 113638 -69913 25675 -110748 287635 -29266 126606 -163113 465386
10255F9674K22800q4219L598d9608A83642B5437g7390D0890b4885j20299I9082
$$ 69674 292474 208255 211853 -49608 183642 25437 -77390 40890 -24885 -145184 99082
10243i2228l50980F4329M8601a17808J4110C76918e8065a2714n0430A48581b37771
$$ -92228 -443208 64329 112930 -117808 -103698 376918 -58065 -12714 -63144 148581 -237771
10231h6353j30459A09235c79794J01683c8146E2093d00193F1948i7775A02937
$$ -86353 -216812 109235 -379794 -278111 -38146 52093 -400193 61948 -97775 102937
10220b72962M1574e3595j06094F3176K00307a03078r3362F5658a52521C26206
$$ -272962 -231388 -53595 -159689 63176 263483 -103078 -196440 65658 -152521 326206
10209b01622L2380p6148C08620a2002j8492C1869O8564f624j82855A13433c81038
$$ -201622 -169242 -245390 308620 -12002 -30494 31869 100433 -6624 -189479 113433 -381038
10197a26820G7678a92505Q2612F3965K09158A09955J35205b2166k37167E5243
$$ -126820 77678 -192505 -109893 63965 273123 109955 245160 -22166 -259333 55243
10186A09517b11859q7231B426b2634o5516r2425j94033B5986b92571b5138A13206
$$ 109517 -211859 -299090 2426 -22634 -88150 -180575 -374608 25986 -292571 -25138 113206
10174a64623B11000a0410I6977J04796A0738O3881b88565C3030a15152j31485
$$ -164623 211000 -10410 96977 201773 10738 74619 -288565 33030 -115152 -246637
10164b46637d306j68820K2916j51322b8554j57555N662A46508a43956A03811i1244
$$ -246637 -4306 -173126 -150210 -301532 -28554 -186109 -180447 146508 -143956 103811 -91244
10152B4990J50564h7266q513B23e5064A06826J63427a74772c1669G4421H52K204
$$ 24990 175554 -87266 -95779 223 -55064 106826 270253 -174772 -31669 74421 852 3056
10140C056h3675A0717b90657C2354c47993e3471m9921L7185A79062a8883m0122
$$ 3056 -83675 10717 -290657 32354 -347993 -53471 -103392 -66207 179062 -18883 -59005
10129e9005a1706B70217a33665F6246i0893K6980l1804j14321i1413D93446b0628
$$ -59005 -11706 270217 -133665 66246 -90893 -63913 -95717 -210038 -91413 493446 -20628
10117A05264i1328J5065k1007j75663d8928j69779h9580j51721A65929h5196K2326
$$ 105264 -91328 -76263 -97270 -272933 -48928 -218707 -89580 -241301 165929 -85196 -62870
10106f2870l58772d4301A35149c5868J1092A79414d8081k30666l4813M2805a33880
$$ -62870 -421642 -44301 135149 -35868 -24776 179414 -48081 -278747 -313560 -270755 -133880
10094A28038c7654C0733b35964A29419a50889g2078K2528G5324b61821B182c1730
$$ 128038 -37654 30733 -235964 129419 -150889 -72078 -49550 75324 -261821 2182 -31730
10082C6415a63708B12895b44598c0861p5666A57542b88135b3551j25057n437C312
$$ 36415 -163708 212895 -244598 -30861 -106527 157542 -288135 -23551 -148608 -154045 3312
10070b19989G7502J30780d6528j669G2426b50108q0466a34924A48628b87362b077
$$ -219989 77502 208282 -46528 -48197 72426 -250108 -330574 -134924 148628 -287362 -2077
10058a1853k45292B98447f7672a3037r8993j09060A21764b80398G4764o70b67696
$$ -11853 -257145 298447 -67672 -13037 -112030 -221090 121764 -280398 74764 74094 -267696
10046a15838a5450k95497B3560g5846H6062c00369J18372p4562j1240i471D301
$$ -115838 -15450 -310947 23560 -75846 86062 -300369 -181997 -256559 -267799 -9471 4301
10034b13484d3625M818A91504a36476m2333l8464a1903k56016a8949j2992l0375
$$ -213484 -43625 -38807 191504 -136476 -178809 -217273 -11903 -267919 -18949 -31941 -62316
10023f2316k91201B00599b04444c4311l4574k04141P6516C7522a17148G2824C0909
$$ -62316 -353517 200599 -204444 -34311 -68885 -273026 -196510 37522 -117148 72824 30909
10011i9210j48356G1286h4918O374A78740b73682Q1674H5724b29779a10933j33637
$$ -99210 -247566 71286 -84918 -78544 178740 -273682 -192008 85724 -229779 -110933 -244570
10000b44570N6727b7784l1760A07376c69735B9222a02286a9692k24758A11505
$$ -244570 -187843 -27784 -59544 107376 -369735 29222 -102286 -19692 -244450 111505
9989c06450P0928N2715h6094q1512j66776A79398H078d07120a97096A24835g4616
$$ -306450 -235522 -182807 -86094 -167606 -334382 179398 8078 -407120 -197096 124835 -74616
9977B64850a47108A59094b27661A9572b58290A2169d9542p1646N5721D63369a76207
$$ 264850 -147108 159094 -227661 19572 -258290 12169 -49542 -121188 -65467 463369 -176207
9965c9158j65304k67744b32674h5943I5360N6808a96924A78389c556k46207A03550
$$ -39158 -204462 -472206 -232674 -85943 95360 152168 -196924 178389 -3556 -249763 103550
9953A25817f6743m6721G296J0367b59364e8979r7812M7034n5247b7762E1088c5757
$$ 125817 -66743 -113464 7296 17663 -259364 -58979 -156791 -109757 -165004 -27762 51088 -35757
9940a58084O0834j19790A43310B6717g9380C50015A55317b65645Q1710H6620c39355
$$ -158084 -97250 -217040 143310 26717 -79380 350015 155317 -265645 -183935 86620 -339355
9928g3166n8278A13125a83663e5460C7625b36645d1655a3568k31717B0188J57673
$$ -73166 -131444 113125 -183663 -55460 37625 -236645 -41655 -13568 -245285 20188 177861
9917A77861D9590J54828H5457E90K0633J5744c41046a31226e0748f485n32816
$$ 177861 49590 204418 85457 590 21223 36967 -341046 -131226 -50748 -6485 -539301
9906e39301a295l26735D7040j7708L7296K06611g7875j22453j43414a12356m3975
$$ -539301 -1295 -328030 47040 29332 66628 273239 -77875 -200328 -343742 -112356 -156331
9895a56331L107A49500n1970J51321a23420M339b9821m7233H1973l6369a9630
$$ -156331 -153224 149500 97530 248851 -123420 -119081 -29821 -77054 81973 45604 -19630
9883d9023B4445J46921M4800e1994B0124c66482R1586o8258B94891a36355B83137
$$ -49023 24445 171366 216166 -51994 20124 -366482 -274896 -343154 294891 -136355 283137
9871f1967B22043k561b65258A39711a32305A66047a96576A59689b2582k01553
$$ -61967 222043 219482 -265258 139711 -132305 166047 -196576 159689 -22582 -224135
9861b24135N5109p1991l4543N595j84771a16967k52202B52479b26504A23391a30778
$$ -224135 -169026 -241017 -275560 -269965 -454736 -116967 -369169 252479 -226504 123391 -130778
9849c08725D5126O3652k9459a8517j90988C8756J48965a72468D4872a80225M3035
$$ -308725 45126 108778 79319 -18517 -209505 38756 187721 -172468 44872 -180225 -137190
9838a37190I9643b33453m9993d558l61660A23571M7262b31349a11615m460j8903
$$ -137190 99643 -233453 -283446 -4558 -366218 123571 170833 -231349 -111615 -116075 -134978
9827a34978B69396n4974b21619H1705a16445B42278J08624b31421P5500F554e0621
$$ -134978 269396 214422 -221619 81705 -116445 242278 350902 -231421 -155921 6554 -50621
9815A62442F2370h4772j86647P2929F439L9714K066f9912A9094J02617a7579l16178
$$ 162442 62370 -84772 -271419 -198490 6439 46153 48219 -69912 19094 121711 -17579 -333757
9803c33757O1210R3892L8063j2990O570j56618j04312h8405A31719a97378L8161
$$ -333757 -272547 -178655 -140592 -153582 -147012 -303630 -407942 -88405 131719 -197378 -159217
9792a59217k33595B34963a07330A06351Q9625H0378a45236B16784a20467J2471
$$ -159217 -392812 234963 -107330 106351 195976 80378 -145236 216784 -120467 -107996
9782a07996H036f6660B5357L3555c8584l13443J24134C7809b32772B1446m679
$$ -107996 8036 -66660 25357 58912 -38584 -352027 -227893 37809 -232772 21446 16767
9771A6767L1227a09519F5080b76765o1276c5176A46835d7344j24205j41713J3528
$$ 16767 47994 -109519 65080 -276765 -338041 -35176 146835 -47344 -171549 -313262 -299734
9760b99734c0914B5544a1156j99586A35629a39023j99887A5560L15467A54477
$$ -299734 -30914 25544 -11156 -210742 135629 -139023 -338910 15560 331027 154477
9749a87664C22045a06975j38492j18478E5095f2487C1675L3767c66179C42108
$$ -187664 322045 -106975 -245467 -363945 55095 -62487 31675 65442 -366179 342108
9738E2790R4918b08116i5569A19718i8877D1723J42837a60610b5050l4111B08369
$$ 52790 147708 -208116 -95569 119718 -98877 41723 184560 -160610 -25050 -59161 208369
9726a2903H0591a70830B0687a5813n0421k68529a18686r9118F2073a28611I5621
$$ -12903 80591 -170830 20687 -15813 -66234 -334763 -118686 -217804 62073 -128611 95621
9714a88239l865B2545h5503b2777r0995a9314O403A85822Q57B5326b71974a00485
$$ -188239 -192104 22545 -85503 -22777 -113772 -19314 -12911 185822 186679 25326 -271974 -100485
9701b9057j74822H7244b61066B9274a16044k1875e1527G1318l0242b67613C8965
$$ -29057 -203879 87244 -261066 29274 -116044 -137919 -51527 71318 41076 -267613 38965
9689b0323B9843a27081B11360o7602e5497j36962f0718I8905b2277k2184k3656
$$ -20323 29843 -127081 211360 143758 -55497 -192459 -60718 98905 -22277 -44461 -68117
9678f8117k4736H0215e7244j29756k0277C43425a83210j4539h8264k85443a12721
$$ -68117 -92853 80215 -57244 -187000 -207277 343425 -183210 -197749 -88264 -373707 -112721
9666A93971c26543B36792h4630l7130d6614k23920j5717h7749b4501l4775r5832
$$ 193971 -326543 236792 -84630 -121760 -46614 -270534 -286251 -87749 -24501 -59276 -155108
9655a55108p8505p286F6306c65759a230l4455J0065q9139p4013A02162m8080b28606
$$ -155108 -233613 -240899 66306 -365759 -1230 -35685 -25620 -114759 -188772 102162 54082 -228606
9642a00121f441o8529H1310a77380I5532b1913k91068A59125a66486q1799k55236
$$ -100121 -6441 -74970 81310 -177380 95532 -21913 -312981 159125 -166486 -248285 -503521
9631e03521A76900c87872J43920h8366F0494b6253n0922B2068L31433b49156j25798
$$ -503521 176900 -387872 -243952 -88366 60494 -26253 -77175 22068 353501 -249156 -374954
9620c74954C41307b7884C5515b43956M0548i1540C06341i6520O057L8817j35583
$$ -374954 341307 -27884 35515 -243956 -203408 -91540 306341 -96520 -90463 -51646 -187229
9609a87229h6840B86047a62292M8821o2078a0738C61000b49240C68594a7277j79175
$$ -187229 -86840 286047 -162292 -113471 -175549 -10738 361000 -249240 368594 -17277 -196452
9598a96452A52820i1704A70204G9356g0374r679q8264F5279c03900F6794a21688
$$ -196452 152820 -91704 170204 79356 -70374 -80053 -168317 65279 -303900 66794 -121688
9586c81374A44796d77314B20107A09736B8107c38321i4937L5360k2366q9071D0930
$$ -381374 144796 -477314 220107 109736 28107 -338321 -94937 -59577 -81943 -171014 40930
9574A71697o3089l3553g6985j01338e9880l34860C71871G0444a39157l96359b52281
$$ 171697 108608 75055 -76985 -178323 -59880 -394740 371871 70444 -139157 -535516 -252281
9562a9387l30199J11576A5465i4663K0221k81750a56368e3663l87064a9616l031
$$ -19387 -349586 -238010 15465 -94663 -74442 -356192 -156368 -53663 -440727 -19616 -22647
9551b2647l4224o7942c5477A26832h6469L5514J7239C8070a70757C14348j16246
$$ -22647 -56871 -124813 -35477 126832 -86469 -50955 -33716 38070 -170757 314348 198102
9540A98102a45500A197M19749b1880D3735a75237M9161p2443Q319A40166L2943
$$ 198102 -145500 1197 420946 -21880 43735 -175237 -126076 -198519 -190200 140166 173109
9529A73109B6621b41008i5872B9290K5885L4007a27390j58866F6927a48677f2940
$$ 173109 26621 -241008 -95872 29290 55175 89182 -127390 -286256 66927 -148677 -62940
9517a45421e1784f010j41567B53665a22850J1791a6159q2129j35763C29415D003
$$ -145421 -51784 -6010 -147577 253665 -122850 -111059 -16159 -98288 -234051 329415 4003
9505A58340a60715b2960A70113D6776e5408C5658L197J59785c39500J18793d7008
$$ 158340 -160715 -22960 170113 46776 -55408 35658 38855 198640 -339500 -220707 -47008
9493g041j28632E4041J48763c513j59117A6264c55143g3500h078j37439A06847
$$ -7041 -135673 54041 202804 -3513 -162630 16264 -355143 -73500 -8078 -145517 106847
9481a68007f5882k20842A2290a17462k67847C1926Q678F438L51586g0913B55215
$$ -168007 -65882 -286724 12290 -117462 -385309 31926 40604 6438 358024 -70913 255215
9469B145f7461A60505a46673J6558F1539a65406C39799C5036b0131j08835j06932
$$ 2145 -67461 160505 -146673 -130115 61539 -165406 339799 35036 -20131 -128966 -235898
9458b35898B5701R2242J05662d3072B75787b92979a4234E9331L0606c80718E5647
$$ -235898 25701 117943 223605 -43072 275787 -292979 -14234 59331 89937 -380718 55647
9446A93134b89370A13012m8016e172j6635B73033e3906j83917C6885b73834H6817
$$ 193134 -289370 113012 64996 -5172 -21807 273033 -53906 -237823 36885 -273834 86817
9434a56692b0739A3117b62607e1325k99190E2568D4J60555d3193B20326a98313
$$ -156692 -20739 13117 -262607 -51325 -350515 52568 44 160599 -43193 220326 -198313
9422a3250k91168L3041B28180a04474A26598a18574j06394q8419b1277F478k984
$$ -13250 -304418 -271377 228180 -104474 126598 -118574 -224968 -313387 -21277 6478 3494
9411C494f0729j9580m03730f0898A27086b21002d0564J1769B12754k510c37703
$$ 3494 -60729 -80309 -484039 -60898 127086 -221002 -40564 -28795 212754 210244 -337703
9399c2775G3043C5604a60158j40898b8261A2073c9426e42k12314d3983l11127
$$ -32775 73043 35604 -160158 -301056 -28261 12073 -39426 -542 -212856 -43983 -355110
9388c55110a24727O2134B14981o6192o8120a32849c3375q8498k910o128j32975
$$ -355110 -124727 -62593 214981 148789 80669 -132849 -33375 -121873 -124783 -130911 -263886
9377b63886a1552m27700d2546A04662b25911K9628l3655a4528B07703o9487d72842
$$ -263886 -11552 -439252 -42546 104662 -225911 -196283 -229938 -14528 207703 138216 -472842
9365c89710B41879F7556a95723N8402G6395a61783A77339m7738B3510b64572A45751
$$ -389710 241879 67556 -195723 -137321 76395 -161783 177339 129601 23510 -264572 145751
9353b3269l19580A14421f20125b32104A65903b03006g6656o1887C1240O7320a92458
$$ -23269 -342849 114421 -620125 -232104 165903 -203006 -76656 -138543 31240 98560 -192458
9341B48903f430B69368G9857b16557I0101J20848b75015B15278b80688i8442d1911
$$ 248903 -6430 269368 79857 -216557 90101 210949 -275015 215278 -280688 -98442 -41911
9329a04259A8850a87991R3350d4550l45003C52K15092b90457I3260e5424j35548
$$ -104259 18850 -187991 -94641 -44550 -389553 352 215444 -290457 93260 -55424 -190972
9318a90972H6447g0832A76037a90107j66699A04523B7137P3805a08601L142e1616
$$ -190972 86447 -70832 176037 -190107 -356806 104523 27137 100942 -108601 -105459 -51616
9306A47536l1058a56911f6215A43045A9303a17603b5037k7755C50099A69186a61230
$$ 147536 116478 -156911 -66215 143045 19303 -117603 -25037 -52792 350099 169186 -161230
9294g6405A88479F5005j2128l050J04951P6616F670K33482b206A43748c6705j74311
$$ -76405 188479 65005 52877 49827 154778 231394 6670 240152 -2206 143748 -36705 -211016
9282b11016B26889a05817r6092A09091G585J9891L2861i5846f049j13711L5028
$$ -211016 226889 -105817 -201909 109091 7585 27476 60337 -95846 -6049 -119760 -84732
9271h4732d722k85597f0243k12296B59965E0295a02665E9401b45322b2542k36444
$$ -84732 -4722 -290319 -60243 -272539 259965 50295 -102665 59401 -245322 -22542 -258986
9260b58986C7123d1285j36408j45483h3169H4338e9512r3611J3963j7517A8804
$$ -258986 37123 -41285 -177693 -323176 -83169 84338 -59512 -153123 -139160 -156677 18804
9248b40787a03733J5180F5112M5794a05318j92671B32647a50856I8469a53984
$$ -240787 -103733 -88553 65112 110906 -105318 -297989 232647 -150856 98469 -153984
9237D4298L81349A00292J63203I0925g3417j07102A04981A2301b34971D8861L08928
$$ 44298 425647 100292 263495 90925 -73417 -180519 104981 12301 -234971 48861 357789
9226C57789c5711j19618A27505f8815h904q7255a529B83005A19561B5879O7883
$$ 357789 -35711 -155329 127505 -68815 -8904 -96159 -1529 283005 119561 25879 93762
9215I3762c01669i9078A21473b19559i1877m4764f228q9369j76714k0347G5726
$$ 93762 -301669 -99078 121473 -219559 -91877 -136641 -6228 -95597 -272311 -292658 75726
9203c35407A545Q9339c44449a03264f668A12755a35969L5483J5662G1522b46335
$$ -335407 1545 90884 -344449 -103264 -6668 112755 -135969 -100486 -84824 71522 -246335
9191A0970a4111j4468n5408L4860A65841c50414a20745k76665B31489a23983L8168
$$ 10970 -14111 -28579 -83987 -49127 165841 -350414 -120745 -397410 231489 -123983 -85815
9180h5815A07961i0844B9328g5315R019J2601g289H1338e6948m0233P145c2953
$$ -85815 107961 -90844 29328 -75315 -66296 -53695 -7289 81338 -56948 -97181 -90036 -32953
9167F4230a61485C2426a59960A66565G6464a91218N4936B23034c23834c798j04658
$$ 64230 -161485 32426 -159960 166565 76464 -191218 -136282 223034 -323834 -3798 -108456
9156a08456b6424k08822p6352B06987D3180d9110k24247d2139A45974a46560M2464
$$ -108456 -26424 -235246 -311598 206987 43180 -49110 -273357 -42139 145974 -146560 -104096
9145a04096a3434o2429K7819m0957j47422B9428a77218j57582J58053A38429a76488
$$ -104096 -13434 -75863 -48044 -89001 -236423 29428 -177218 -334800 -176747 138429 -176488
9133E6053a06385C087e90688b27098o1443A93805a77970L2681b0069B42271r8799
$$ 56053 -106385 3087 -590688 -227098 -288541 193805 -177970 -145289 -20069 242271 143472
9122A43472i3469L4014q1868a1294m1381k74109a23016C2227a89292p7423j56155
$$ 143472 -93469 -59455 -141323 -11294 -52675 -326784 -123016 32227 -189292 -266715 -422870
9111d22870d2002d643C34079A36564P7156e7983j92864L2391M1837D9450Q2729
$$ -422870 -42002 -4643 334079 136564 213720 -57983 -250847 -218456 -176619 49450 132179
9100A32179c96427e5677B73926j32053J29301E1823b08840Q7596K4367b4542l70648
$$ 132179 -396427 -55677 273926 141873 271174 51823 -208840 -121244 -96877 -24542 -395190
9089c95190D6542J85233a91488o626R3669g640j25347l954M885A31979O3136c9040
$$ -395190 46542 231775 -191488 -198114 -104445 -7640 -132987 -136941 -132056 131979 195115 -39040
9076i9689F7043a30501M7440A87214K0083a85086P2555A32367a9051A02586a62953
$$ -99689 67043 -130501 -83061 187214 207297 -185086 -112531 132367 -19051 102586 -162953
9064G1670b44732J22171i282j8532k67743A27739c14985a8925k38780B14603J53937
$$ 71670 -244732 -122561 -9282 -27814 -295557 127739 -314985 -18925 -257705 214603 368540
9053C68540b18258M015l5192A23159b97167O276B82299b19425E91R9766c1170
$$ 368540 -218258 -214243 -249435 123159 -297167 -290891 282299 -219425 591 100357 -31170
9041b14899D83941I2081a23929E4567b75880a5365j01247j52172Q297H8573k1563
$$ -214899 483941 92081 -123929 54567 -275880 -15365 -116612 -268784 -260487 88573 67010
9030F7010j6535J18807O4760A13520F480a47400L6652b449r114H045b72005q5398
$$ 67010 50475 169282 234042 113520 6480 -147400 -110748 -2449 -11563 8045 -272005 -357403
9018c57403B02069O7687c35054J10102j19369a13095a1053H9840g250l7062A48676
$$ -357403 202069 269756 -335054 -224952 -344321 -113095 -11053 89840 -7250 -44312 148676
9006a5667j30963A32435O6451i2124q0725j07891A26663b0370q5700j82079F3156
$$ -15667 -146630 132435 198886 -92124 -172849 -280740 126663 -20370 -106070 -288149 63156
8994c08330a43164d7796a012D0528R412J2482d0072k37k8661G7343Q614b12959
$$ -308330 -143164 -47796 -1012 40528 49940 62422 -40072 -40309 -68970 77343 85957 -212959
8981a72340A45032i2242J8664j32571F5183c30293A25726b08476n5651a19929
$$ -172340 145032 -92242 -73578 -206149 65183 -330293 125726 -208476 -264127 -119929
8970a82835O6539J8025A34356c66727F45g700A4407K19378B4955L419a92590l1594
$$ -182835 -116296 -98271 134356 -366727 645 -7700 14407 233785 24955 28374 -192590 -224184
8958b24184B63094p9430G3395c44039P7902f4611a7433j14919k32745c9248D747
$$ -224184 263094 183664 73395 -344039 -266137 -64611 -17433 -132352 -365097 -39248 4747
8946b52344D8254c79114b3411A30216L9410b09452O9549B32643a33994A01884
$$ -252344 48254 -379114 -23411 130216 169626 -209452 -139903 232643 -133994 101884
8935A91706b4567A77954J66717q8641a7416D5992J91246E9940K20634O2945A2028
$$ 191706 -24567 177954 344671 256030 -17416 45992 237238 59940 280574 343519 12028
8923E95747J285653N146719K200992B063792F04146B61313D1794J22542J71941
$$ 595747 1881400 7028119 9229111 2063792 604146 261313 41794 164336 336277
8914C36277F4654a18416l2935M995r4705B5361N13595A32498J29962C3826L5154
$$ 336277 64654 -118416 -151351 -146356 -241061 25361 538956 132498 262460 33826 68980
8903F8980J61091r4885n8975A9206O48731a19321k83805A32201k5659b88692H6702
$$ 68980 230071 135186 76211 19206 667937 -119321 -403126 132201 106542 -288692 86702
8891c90761B73392J849p6369L603f9442o0322k24889f0589B22947h447A6684b41938
$$ -390761 273392 275241 198872 202475 -69442 -129764 -354653 -60589 222947 -8447 16684 -241938
8878b26194C0669b21247j26691F2589i7043o1397e13m07395B5770h7497G713N2115
$$ -226194 30669 -221247 -347938 62589 -97043 -158440 -513 -407908 25770 -87497 7713 59828
8866E9828b10304j75421B85326c1247m17947J63654g8719j56021k2100B6967b67032
$$ 59828 -210304 -385725 285326 -31247 -449194 -285540 -78719 -234740 -256840 26967 -267032
8854c51266A00605Q2946a13486j39585i7347O94j13181A38638H285J53538f9192
$$ -351266 100605 183551 -113486 -253071 -97347 -96653 -209834 138638 8285 161823 -69192
$$ [...]
##END NTUPLES=NMR SPECTRUM
##END=
