
##TITLE=AC1341_BRARS12162_6528860_T8TkLJ4Fg5
##JCAMPDX= 6.0         $$ Bruker NMR JCAMP-DX V2.0
##DATA TYPE= NMR SPECTRUM
##DATA CLASS= NTUPLES
##ORIGIN= BRUKER
##OWNER= Administrator
$$ 1.72 TOPSPIN		Version 2.1
$$ 2012-07-15 18:43:44.218 -0500  Administrator@TOPSPIN
$$ Compression mode = diff/dup
##.OBSERVE FREQUENCY= 400.02188249412
##.OBSERVE NUCLEUS= ^1H
##.ACQUISITION MODE= SIMULTANEOUS (DQD)
##.ACQUISITION SCHEME= undefined
##.AVERAGES= 64
##.DIGITISER RES= 22
##SPECTROMETER/DATA SYSTEM= spect
##.PULSE SEQUENCE= noesygpps1d.comp
##.SOLVENT NAME= COFFEE_meoh
##.SHIFT REFERENCE= INTERNAL, COFFEE_meoh, 1, 14.961
##AUDIT TRAIL= $$ (NUMBER, WHEN, WHO, WHERE, PROCESS, VERSION, WHAT)
$$ ##TITLE= Audit trail, TOPSPIN		Version 2.1
$$ ##JCAMPDX= 5.01
$$ ##ORIGIN= Bruker BioSpin GmbH
$$ ##OWNER= Administrator
$$ $$ C:\Bruker\TOPSPIN/data/COFFEE/nmr/AC1341_BRARS12162_6528860_T8TkLJ4Fg5/12/pdata/1/auditp.txt
$$ ##AUDIT TRAIL=  $$ (NUMBER, WHEN, WHO, WHERE, PROCESS, VERSION, WHAT)
(   1,<2012-07-15 18:43:39.187 -0500>,<Administrator>,<TOPSPIN>,<go>,<TOPSPIN 2.1>,
      <created by zg
	started at 2012-07-15 18:32:08.968 -0500,
	POWCHK enabled, PULCHK disabled,
       configuration hash MD5:
       6B 1B 68 BB D9 2E 58 E2 7F 35 AD 54 07 DF 0E 41
       data hash MD5: 64K
       29 F7 A4 2C C0 C6 63 FB 52 A2 71 98 45 74 04 4F>)
(   2,<2012-07-15 18:43:41.984 -0500>,<Administrator>,<TOPSPIN>,<proc1d>,<TOPSPIN 2.1>,
      <Start of raw data processing
       efp LB = 0.3 FT_mod = 6 PKNL = 1 PHC0 = 0 PHC1 = 0 SI = 128K 
       data hash MD5: 128K
       A8 8C 3D C8 DA 1C F0 4D FF 94 2E 9D 04 89 5A 8A>)
(   3,<2012-07-15 18:43:43.125 -0500>,<Administrator>,<TOPSPIN>,<proc1d>,<TOPSPIN 2.1>,
      <pk PHC0 = -1.983032 PHC1 = 0 
       data hash MD5: 128K
       1F 97 31 16 F0 59 8A 3C D5 32 E0 7E C3 4D 48 F7>)
(   4,<2012-07-15 18:43:43.875 -0500>,<Administrator>,<TOPSPIN>,<proc1d>,<TOPSPIN 2.1>,
      <abs ABSG = 1 
       data hash MD5: 128K
       09 25 E0 D4 A3 BE FA ED 6E 18 6B 8F 88 01 7C EC>)
(   5,<2012-07-15 18:43:43.953 -0500>,<Administrator>,<TOPSPIN>,<proc1d>,<TOPSPIN 2.1>,
      <abs ABSG = 2 
       data hash MD5: 128K
       BA F7 C7 9C 8C F9 34 66 AF 1B F2 99 57 C4 6E 29>)
(   6,<2012-07-15 18:43:44.015 -0500>,<Administrator>,<TOPSPIN>,<proc1d>,<TOPSPIN 2.1>,
      <abs ABSG = 3 
       data hash MD5: 128K
       6C 7F 4F 2E E7 A4 7D 89 F5 0A 10 5B C7 10 EB CE>)
(   7,<2012-07-15 18:43:44.078 -0500>,<Administrator>,<TOPSPIN>,<proc1d>,<TOPSPIN 2.1>,
      <abs ABSG = 4 
       data hash MD5: 128K
       81 CA B9 20 B4 FC DD B5 5C 71 29 CA 5E AC CF 28>)
(   8,<2012-07-15 18:43:44.140 -0500>,<Administrator>,<TOPSPIN>,<proc1d>,<TOPSPIN 2.1>,
      <abs ABSG = 5 
       data hash MD5: 128K
       32 AB 75 FA B6 5F 78 15 55 07 2D 7C 65 CD B8 86>)
$$ ##END=
$$ 
$$ $$ hash MD5
$$ $$ 1D DF 3F E1 8B 61 70 05 7E 89 01 73 7A 94 D9 9F
##$RELAX= 
##$RELAX= 
##$RELAX= 
##$RELAX= 
##$RELAX= 
##$RELAX= 
##$RELAX= 
##$RELAX= 
$$ Bruker specific parameters
$$ [...]
150 150 150 150 150 150 150 150
##$TP07= 0
##$TPNAME0= <>
##$TPNAME1= <>
##$TPNAME2= <>
##$TPNAME3= <>
##$TPNAME4= <>
##$TPNAME5= <>
##$TPNAME6= <>
##$TPNAME7= <>
##$TPOAL= (0..7)
0.5 0.5 0.5 0.5 0.5 0.5 0.5 0.5
##$TPOFFS= (0..7)
0 0 0 0 0 0 0 0
##$TUNHIN= 0
##$TUNHOUT= 0
##$TUNXOUT= 0
##$USERA1= <user>
##$USERA2= <user>
##$USERA3= <user>
##$USERA4= <user>
##$USERA5= <user>
##$V9= 5
##$VALIST= <valist>
##$VCLIST= <CCCCCCCCCCCCCCC>
##$VD= 0
##$VDLIST= <DDDDDDDDDDDDDDD>
##$VPLIST= <PPPPPPPPPPPPPPP>
##$VTLIST= <TTTTTTTTTTTTTTT>
##$WBST= 2048
##$WBSW= 25
##$XGAIN= (0..3)
0 0 0 0
##$XL= 0
##$YL= 0
##$YMAX_a= 9913510
##$YMIN_a= -7345679
##$ZGOPTNS= <>
##$ZL1= 120
##$ZL2= 120
##$ZL3= 120
##$ZL4= 120
##$ABSF1= 14.961
##$ABSF2= -5.597181
##$ABSG= 5
##$ABSL= 3
##$ALPHA= 0
##$AQORDER= 0
##$ASSFAC= 0
##$ASSFACI= 0
##$ASSFACX= 0
##$ASSWID= 0
##$AUNMP= <proc_prof1d_extract.lims>
##$AXLEFT= 0
##$AXNAME= <>
##$AXNUC= <1H>
##$AXRIGHT= 0
##$AXTYPE= 0
##$AXUNIT= <>
##$AZFE= 0.1
##$AZFW= 0.1
##$BCFW= 0
##$BC_mod= 0
##$BYTORDP= 0
##$COROFFS= 0
##$CY= 15
##$DATMOD= 1
##$DC= 0
##$DFILT= <>
##$DTYPP= 0
##$F1P= 0
##$F2P= 0
##$FCOR= 0.5
##$FTSIZE= 131072
##$FT_mod= 6
##$GAMMA= 0
##$GB= 0
##$INTBC= 1
##$INTSCL= 1
##$ISEN= 128
##$LB= 0.3
##$LEV0= 0
##$LPBIN= 0
##$MAXI= 10000
##$MC2= 0
##$MEAN= 0
##$ME_mod= 0
##$MI= 0
##$NCOEF= 0
##$NC_proc= -2
##$NLEV= 6
##$NOISF1= 0
##$NOISF2= 0
##$NSP= 0
##$NTH_PI= 0
##$NZP= 0
##$OFFSET= 14.961
##$PC= 1
##$PHC0= -1.983032
##$PHC1= 0
##$PH_mod= 1
##$PKNL= yes
##$PPARMOD= 0
##$PPDIAG= 0
##$PPIPTYP= 0
##$PPMPNUM= 2147483647
##$PPRESOL= 1
##$PSCAL= 4
##$PSIGN= 0
##$PYNMP= <proc.py>
##$REVERSE= no
##$SF= 400.020009635754
##$SI= 131072
##$SIGF1= 0
##$SIGF2= 0
##$SINO= 400
##$SIOLD= 131072
##$SPECTYP= <>
##$SREGLST= <1H.CDCl3>
##$SSB= 0
##$STSI= 131072
##$STSR= 0
##$SW_p= 8223.68421052631
##$SYMM= 0
##$S_DEV= 0
##$TDeff= 65536
##$TDoff= 0
##$TI= <>
##$TILT= no
##$TM1= 0
##$TM2= 0
##$TOPLEV= 0
##$USERP1= <user>
##$USERP2= <user>
##$USERP3= <user>
##$USERP4= <user>
##$USERP5= <user>
##$WDW= 1
##$XDIM= 131072
##$YMAX_p= 384202017
##$YMIN_p= -11921
##$CURPLOT= <Network HP LaserJet P1505>
##$CURPRIN= <$Network HP LaserJet P1505>
##$DFORMAT= <normdp>
##$LAYOUT= <+/1D_H.xwp>
##$LFORMAT= <normlp>
##$PFORMAT= <normpl>
##$SURQMSG= 1
$$ End of Bruker specific parameters
$$ ---------------------------------
##NTUPLES= NMR SPECTRUM
##VAR_NAME=  FREQUENCY,     SPECTRUM/REAL,   SPECTRUM/IMAG
##SYMBOL=    X,             R,               I
##VAR_TYPE=  INDEPENDENT,   DEPENDENT,       DEPENDENT
##VAR_FORM=  AFFN,          ASDF,            ASDF
##VAR_DIM=   131072,        131072,          131072
##UNITS=     HZ,            ARBITRARY UNITS, ARBITRARY UNITS
##FACTOR=    0.0627417313425164, 1,          1
##FIRST=     8223.62146879497, 1408,         -45147
##LAST=      0,             2695,            -45268
##MIN=       0,             -11921,          0
##MAX=       8223.62146879497, 384202017,    0
$$ Real data points
##PAGE= N=1
##DATA TABLE= (X++(R..R)), XYDATA
$$ [...]
$$ plain form
63972 269070 274273 278892 282961 287199 292193 297790 303628 309900 317105 325201 333633 342139 350930 360070
63958 360070 369282 378541 388326 398994 410385 422283 434906 448665 463843 480849 500394 523073
63946 523073 549019 578290 611338 648832 691389 739925 795975 861218 936905 1024164 1124479
63935 1124479 1239160 1368400 1511491 1667945 1837660 2019802 2212156 2411891 2616492
63926 2616492 2823452 3029380 3229781 3419570 3593578 3746879 3875335 3976172 4047986 4090033
63916 4090033 4101451 4081207 4028879 3945497 3833482 3695753 3535283 3355787 3162436 2961132
63906 2961132 2756873 2553121 2352668 2158423 1973056 1798351 1635455 1485564 1349958
63897 1349958 1229369 1123506 1031142 950643 880638 820406 769432 726486 689439 656262 626027
$$ packed form
63972B69070N203M619M069M238M994N597N838O272P205Q096Q432Q506Q791R140
63958C60070R212R259R785J0668J1391J1898J2623J3759J5178J7006J9545K2679
63946E23073K5946K9271L3048L7494M2557M8536N6050O5243P5687Q7259J00315
63935A124479J14681J29240J43091J56454J69715J82142J92354J99735K04601
63926B616492K06960K05928K00401J89789J74008J53301J28456J00837P1814M2047
63916D090033J1418k0244n2328q3382j12015j37729j60470j79496j93351k01304
63906B961132k04259k03752k00453j94245j85367j74705j62896j49891j35606
63897A349958j20589j05863r2364q0499p0005o0232n0974m2946l7047l3177l0235
$$ plain form
63886 626027 598697 574214 552196 532300 514337 497910 482296 466908 451737 437280 424112
63875 424112 412517 402367 393280 384988 377547 371166 365934 361861 359073 357810 358233 360340 363964 368721
63861 368721 374087 379790 386104 393589 402566 413070 425230 439393 455818 474446 495099 517742
63849 517742 542470 569358 598343 629091 660963 693281 725732 758407 791349 824145 855992
63838 855992 886016 913493 937932 959066 976679 990358 999541 1003890 1003518 998689 989423 975557 957207
63825 957207 934979 909651 881760 851617 819638 786474 752758 718824 684770 650701 616862
63814 616862 583591 551346 520694 492081 465581 441076 418708 398853 381500 365967 351549
63803 351549 338308 326854 317396 309401 302261 295946 290738 286516 282633 278542 274360 270707 268023 266069
$$ packed form
63886F26027k7330k4483k2018j9896j7963j6427j5614j5388j5171j4457j3168
63875D24112j1595j0150r087q292p441o381n232m073k788j263M23K107L624M757
63861C68721N366N703O314P485Q977J0504J2160J4163J6425J8628K0653K2643
63849E17742K4728K6888K8985L0748L1872L2318L2451L2675L2942L2796L1847
63838H55992L0024K7477K4439K1134J7613J3679R183M349l72m829r266j3866j8350
63825I57207k2228k5328k7891l0143l1979l3164l3716l3934l4054l4069l3839
63814F16862l3271l2245l0652k8613k6500k4505k2368j9855j7353j5533j4418
63803C51549j3241j1454r458p995p140o315n208m222l883m091m182l653k684j954
$$ plain form
63789 266069 264104 261469 257981 253825 249275 244616 240125 235905 231738 227278 222377 217144 211792 206623
63775 206623 202078 198495 195741 193289 190727 188097 185705 183822 182593 181975 181648 181176 180401 179520 178708 177881
63759 177881 176996 176334 176189 176417 176576 176479 176308 176221 176127 175938 175789 175819 175915 175845 175609 175497 175750 176227 176474 176228 175850
63738 175850 176137 177523 179582 181513 183100 184884 187302 189919 191840 192727 193172 194081 195913 198562 201751
63723 201751 205362 209452 214033 218896 223710 228331 232889 237464 241798 245518 248513 250829 252286 252601
63709 252601 251917 250782 249466 247702 245349 242845 240669 238732 236780 234989 233596 232218 230296 228126
63695 228126 226642 226118 225870 225464 225399 226195 227556 229036 230904 233567 236509 238653 239701 240508 242150 245091
63679 245091 249101 253358 256689 258332 258640 258619 258778 258894 258925 259538 261454 264658 268435 271911 274454 275963
$$ packed form
63789B66069j965k635l488m156m550m659m491m220m167m460m901n233n352n169
63775B06623m545l583k754k452k562k630k392j883j229o18l27m72p75q81q12q27
63759A77881q85o62j45K28J59r7j71q7r4j89j49L0R6p0k36j12K53M77K47k46l78
63738A75850K87J386K059J931J587J784K418K617J921Q87M45R09J832K649L189
63723B01751L611M090M581M863M814M621M558M575M334L720K995K316J457L15
63709B52601o84j135j316j764k353k504k176j937j952j791j393j378j922k170
63695B28126j484n24k48m06o5P96J361J480J868K663K942K144J048Q07J642K941
63679B45091M010M257L331J643L08k1J59J16L1O13J916L204L777L476K543J509
$$ plain form
63663 275963 276954 278126 279761 281758 284090 286649 288664 288995 287324 284525 281549 278428 274709 270345 265598
63648 265598 260557 255362 250635 247043 244527 242511 240794 239740 239641 240360 241627 243207 244725 245840 246727
63633 246727 248010 250008 252439 255060 258259 262621 268112 274052 279871 285592 291458 297361 302938 308207
63619 308207 313790 320303 327756 335872 344951 355955 369558 385393 402513 420366 439138 459378
63607 459378 481620 506170 532885 561187 590580 621067 652807 685415 717818 748597 776188
63596 776188 799012 816089 827707 835093 839273 840528 838997 835304 830298 824415 817498 808956 797868
63583 797868 783213 764452 741899 716374 688610 659226 629129 599587 571777 546385 523674
63572 523674 503769 486739 472467 460610 450843 443126 437626 434360 433023 433272 434986 438072 442193
$$ packed form
63663B75963R91J172J635J997K332K559K015L31j671k799k976l121l719m364m747
63648B65598n041n195m727l592k516k016j717j054r9P19J267J580J518J115Q87
63633B46727J283J998K431K621L199M362N491N940N819N721N866N903N577N269
63619C08207N583O513P453Q116R079J1004J3603J5835J7120J7853J8772K0240
63607D59378K2242K4550K6715K8302K9393L0487L1740L2608L2403L0779K7591
63596G76188K2824J7077J1618P386M180J255j531l693n006n883o917q542j1088
63583G97868j4655j8761k2553k5525k7764k9384l0097k9542k7810k5392k2711
63572E23674j9905j7030j4272j1857r767p717n500l266j337K49J714L086M121
$$ plain form
63559 442193 446999 452542 459123 466730 474985 483675 492993 503114 513989 525812 539290 555059 573080
63546 573080 593121 615632 641681 672013 706689 745556 788311 833558 878154 918110 950305
63535 950305 973281 986771 991175 987764 978920 967597 956269 946304 938075 931271 924989 917752 907781
63522 907781 893477 873910 848953 819010 784625 746499 705961 665097 625920 589315 555116
63511 555116 523263 494456 469386 447741 428481 410998 395536 382435 371406 361655 352475 343573
63499 343573 335068 327356 320796 315344 310529 305894 301405 297444 294418 292376 290862 289278 287497 286014
63485 286014 285271 284963 284362 283269 282303 282192 283195 285281 288445 292626 297616 303239 309323 315293 320187
63470 320187 323445 325439 326912 328095 328663 328312 326966 324594 321254 317259 312967 308528 304168 300550 298339
$$ packed form
63559D42193M806N543O581P607Q255Q690R318J0121J0875J1823J3478J5769J8021
63546E73080K0041K2511K6049L0332L4676L8867M2755M5247M4596L9956L2195
63535I50305K2976J3490M404l411q844j1323j1328r965q229o804o282p237r971
63522I07781j4304j9567k4957k9943l4385l8126m0538m0864l9177l6605l4199
63511E55116l1853k8807k5070k1645j9260j7483j5462j3101j1029r751r180q902
63499C43573q505p712o560n452m815m635m489l961l026k042j514j584j781j483
63485B86014p43l08o01j093r66j11J003K086L164M181M990N623O084N970M894
63470C20187L258J994J473J183N68l51j346k372l340l995m292m439m360l618k211
$$ plain form
63455 298339 297407 296898 296158 295166 294075 292907 291907 291674 292532 294098 295879 298063 301242 305505 310278 315167
63439 315167 320526 327001 334814 343843 354239 366600 381426 398785 418797 442199 469908 501865
63427 501865 536536 571620 604898 634308 657846 674233 683795 688362 690315 692009 695812 703803 716988
63414 716988 735161 757855 785116 817055 852943 891076 929310 965413 997232 1023198 1042806
63403 1042806 1056418 1064585 1067833 1066936 1062986 1057031 1049801 1041574 1031885 1019340 1002308 980111 953272
63390 953272 922464 887685 848867 806984 764029 722034 682545 646756 615310 587660 562321
63379 562321 538368 516462 497935 483056 470754 459989 450816 443918 439598 437582 437516 439233 442659
63366 442659 447748 454528 463014 473127 484859 498482 514442 533072 554407 578141 603700 630688
$$ packed form
63455B98339r32n09p40r92j091j168j000k33Q58J566J781K184L179M263M773M889
63439C15167N359O475P813R029J0396J2361J4826J7359K0012K3402K7709L1957
63427E01865L4671L5084L3278K9410K3538J6387R562M567J953J694L803P991J3185
63414G16988J8173K2694K7261L1939L5888L8133L8234L6103L1819K5966J9608
63403A042806J3612Q167L248q97l950n955p230q227r689j2545j7032k2197k6839
63390I53272l0808l4779l8818m1883m2955m1995l9489l5789l1446k7650k5339
63379E62321k3953k1906j8527j4879j2302j0765r173o898m320k016o6J717L426
63366D42659N089O780Q486J0113J1732J3623J5960J8630K1335K3734K5559K6988
$$ plain form
63354 630688 659459 690967 725661 762741 800900 839533 878566 917136 953162 984471 1009790
63343 1009790 1028510 1040265 1045406 1045448 1042268 1036950 1029806 1021240 1011813 1001351 988631 972280 951773
63330 951773 927350 899225 867204 831146 791774 750946 710947 673325 638519 606662 578392
63319 578392 554564 535454 520726 510057 503163 499132 496202 492452 486419 477025 463480 445725 424839
63306 424839 402720 381365 362313 346317 333174 322035 312106 303042 294734 287149 280593 275728 272889
63293 272889 271471 270308 268601 266296 263634 260666 257274 253532 249947 247176 245361 243829 241779 239251
63279 239251 237026 235507 234220 232662 231126 230236 230073 230288 230754 231484 232147 232335 232259 232509 233106 233417 233146
63262 233146 232821 233057 233850 234857 235947 237132 238320 239464 240709 242053 243100 243436 243086 242391 241632 241037
$$ packed form
63354F30688K8771L1508L4694L7080L8159L8633L9033L8570L6026L1309K5319
63343A009790J8720J1755N141M2l180n318p144q566r427j0462j2720j6351k0507
63330I51773k4423k8125l2021l6058l9372m0828l9999l7622l4806l1857k8270
63319E78392k3828j9110j4728j0669o894m031k930l750o033r394j3545j7755k0886
63306D24839k2119k1355j9052j5996j3143j1139r929r064q308p585o556m865k839
63293B72889j418j163j707k305k662k968l392l742l585k771j815j532k050k528
63279B39251k225j519j287j558j536q90j63K15M66P30O63J88p6K50N97L11k71
63262B33146l25K36P93J007J090J185J188J144J245J344J047L36l50o95p59n95
$$ plain form
63246 241037 240934 241533 242563 243404 243657 243522 243622 244416 245670 246568 246585 246225 246469 247468 248332 248485 248601 249616
63228 249616 251229 252284 252535 253148 255176 258218 261130 263522 265868 268325 270233 271019 271078 271363 272379 274001
63212 274001 276117 278892 282233 285411 287604 288705 289300 289949 290775 291763 293144 295321 298520 302577 307050
63197 307050 311589 316302 321656 327914 334836 342120 349927 358584 367956 377619 387731 399185 412666
63184 412666 427921 444156 460858 478063 496135 515524 536409 558343 580422 601956 622764
63173 622764 642758 661702 679532 696500 712684 727719 741272 753421 764229 773319 780198 784571
63161 784571 785990 783651 777083 766609 752635 734965 713557 689551 664628 639489 613800 587621
63149 587621 561996 538017 516015 495874 477398 460197 443848 428507 414869 403330 393646 385531
$$ packed form
63246B41037j03N99J030Q41K53j35J00P94J254Q98J7l60K44R99Q64J53J16J015
63228B49616J613J055K51O13K028L042K912K392K346K457J908P86N9K85J016J622
63212B74001K116K775L341L178K193J101N95O49Q26R88J381K177L199M057M473
63197C07050M539M713N354O258O922P284P807Q657R372R663J0112J1454J3481
63184D12666J5255J6235J6702J7205J8072J9389K0885K1934K2079K1534K0808
63173F22764J9994J8944J7830J6968J6184J5035J3553J2149J0808R090O879M373
63161G84571J419k339o568j0474j3974j7670k1408k4006k4923k5139k5689k6179
63149E87621k5625k3979k2002k0141j8476j7201j6349j5341j3638j1539r684q115
$$ plain form
63137 385531 378974 373737 369218 365118 361716 359155 357039 355076 353563 352838 352782 353329 354893 357659 360864
63122 360864 363493 365507 367777 370976 375074 379887 385535 392178 399600 407190 414295 420698 426832 433315
63108 433315 440182 446864 452970 458709 464370 469922 475440 481311 487476 492948 496855 499688 502799 506789
63094 506789 511040 514873 518489 522644 527838 533891 539951 544934 548347 550663 552522 553688 553262 550823
63080 550823 546742 541405 534824 527193 519154 511171 503107 494796 486653 479333 473023 467403 462139 457200
63066 457200 452840 449431 447174 445804 444746 443653 442686 442236 442557 443639 445171 446591 447546 448429 450159
63051 450159 453281 457539 462375 467518 472982 478860 485351 492605 500350 508011 515481 523360 532086 541190
63037 541190 549862 557983 566004 573989 581447 588236 595007 602372 609956 616698 622007 626297 630310 634191
$$ packed form
63137C85531o557n237m519m100l402k561k116j963j513p25n6N47J564K766L205
63122C60864K629K014K270L199M098M813N648O643P422P590P105O403O134O483
63108D33315O867O682O106N739N661N552N518N871O165N472L907K833L111L990
63094E06789M251L833L616M155N194O053O060M983L413K316J859J166m26k439
63080E50823m081n337o581p631q039p983q064q311q143p320o310n620n264m939
63066D57200m360l409k257j370j058j093r67m50L21J082J532J420R55Q83J730
63051D50159L122M258M836N143N464N878O491P254P745P661P470P879Q726R104
63037E41190Q672Q121Q021P985P458O789O771P365P584O742N309M290M013L881
$$ plain form
63023 634191 637440 639673 641121 642270 643256 643922 644351 644958 646005 647405 649193 651889 656072 661748 668450
63008 668450 675936 684605 695207 708313 724091 742510 763706 787989 815361 845200 876744 909801
62996 909801 944532 980462 1016336 1051298 1085701 1120175 1154328 1187018 1217766 1247119 1275634
62985 1275634 1303203 1329492 1354300 1377043 1396392 1410871 1419540 1421815 1417010 1404561 1384567 1357746
62973 1357746 1325033 1287436 1245955 1201241 1153552 1103592 1053133 1004182 957570 913048 870825
62962 870825 832211 798342 768953 742963 719784 699320 681036 663919 647429 631792 617134
62951 617134 602980 588891 575056 561795 548878 535864 522877 510423 498513 486584 474438
62940 474438 462760 452305 442925 433812 424603 415738 407646 400037 392371 384765 377914 372121 366927 361935
$$ packed form
63023F34191L249K233J448J149R86O66M29O07J047J400J788K696M183N676O702
63008F68450P486Q669J0602J3106J5778J8419K1196K4283K7372K9839L1544L3057
62996I09801L4731L5930L5874L4962L4403L4474L4153L2690L0748K9353K8515
62985A275634K7569K6289K4808K2743J9349J4479Q669K275m805j2449j9994k6821
62973A357746l2713l7597m1481m4714m7689m9960n0459m8951m6612m4522m2223
62962H70825l8614l3869k9389k5990k3179k0464j8284j7117j6490j5637j4658
62951F17134j4154j4089j3835j3261j2917j3014j2987j2454j1910j1929j2146
62940D74438j1678j0455r380r113r209q865q092p609p666p606o851n793n194m992
$$ plain form
62926 361935 357550 354400 352283 350208 347479 344235 340960 338018 335784 334605 334272 333989 333284 332575 332410
62911 332410 332558 332394 331902 331666 332012 332756 333699 334712 335362 335185 334525 334459 335563 337253 338696 339895 341446
62894 341446 343636 346329 349528 353496 358245 363279 367924 371775 374839 377428 379878 382186 383920 384555
62880 384555 383881 382096 379663 377099 374638 371915 368210 363218 357438 351709 346516 341975 338171 335102
62866 335102 332368 329345 325817 322225 319218 317030 315335 313562 311345 308752 306182 304082 302728 302049
62852 302049 301464 300044 297344 294227 292349 292437 293437 293794 293257 292827 293138 293736 294111 294603 295733 297138 297822
62835 297822 297356 296264 295218 294315 293269 291921 290326 288625 287151 286508 287137 288723 290334 291321 291890 292564
62819 292564 293270 293362 292559 291451 290842 290820 290774 290243 289448 288996 289284 290186 291110 291314 290458 289014 287966 287834 288052
$$ packed form
62926C61935m385l150k117k075k729l244l275k942k234j179l33k83p05p09j65
62911C32410J48j64m92k36L46P44R43J013O50j77o60o6J104J690J443J199J551
62894C41446K190K693L199L968M749N034M645L851L064K589K450K308J734O35
62880C84555o74j785k433k564k461k723l705m992n780n729n193m541l804l069
62866C35102k734l023l528l592l007k188j695j773k217k593k570k100j354o79
62852C02049n85j420k700l117j878Q8J000L57n37m30L11N98L75M92J130J405O84
62835B97822m66j092j046r03j046j348j595j701j474o43O29J586J611R87N69O74
62819B92564P06R2q03j108o09k2m6n31p95m52K88R02R24K04q56j444j048j32K18
$$ plain form
62800 288052 287573 286186 285023 285539 288049 291400 294055 295344 295656 295658 295492 294676 292670 289569 286260 283744
62784 283744 282279 281390 280819 281114 282901 285805 288653 290737 292412 294374 296877 299859 303334 307196 310940
62769 310940 314052 316574 318934 321295 323409 325101 326568 328088 329553 330373 329857 327908 325465 323969 324094
62754 324094 325090 325587 324906 323349 321407 319208 316747 314208 311783 309403 306861 304150 301547 299373 297685
62739 297685 296212 294665 293154 292123 291702 291290 290092 288000 285741 284180 283758 284542 286383 288884 291495
62724 291495 293921 296318 298964 301939 305246 309048 313512 318499 323667 328882 334336 340200 346380 352796
62710 352796 359813 368196 378586 391139 405748 422413 441230 462156 485066 510036 537340 567182
62698 567182 599743 635482 675022 718559 765684 815958 869292 925482 983739 1043112 1103086
$$ packed form
62800B88052m79j387j163N16K510L351K655J289L12Kj66q16k006l101l309k516
62784B83744j465q89n71K95J787K904K848K084J675J962K503K982L475L862L744
62769C10940L112K522K360K361K114J692J467J520J465Q20n16j949k443j496J25
62754C24094R96M97o81j557j942k199k461k539k425k380k542k711k603k174j688
62739B97685j473j547j511j031m21m12j198k092k259j561m22P84J841K501K611
62724B91495K426K397K646K975L307L802M464M987N168N215N454N864O180O416
62710C52796P017Q383J0390J2553J4609J6665J8817K0926K2910K4970K7304K9842
62698E67182L2561L5739L9540M3537M7125N0274N3334N6190N8257N9373N9974
$$ plain form
62687 1103086 1163228 1222327 1278352 1329215 1373114 1408175 1432431 1444524 1444246 1432272 1409594 1377285
62675 1377285 1336451 1288208 1233864 1175204 1114323 1053023 992500 933638 877256 823955 773987
62664 773987 727539 684921 646249 611087 578706 548677 521070 496119 473836 454005 436399
62653 436399 420924 407512 395941 385823 376771 368464 360612 353097 346208 340405 335617 331073 326116
62640 326116 320920 316046 311630 307501 303816 300807 298022 294641 290748 287517 285835 285325 285105 284802 284354
62625 284354 283439 281851 280089 278769 277609 275671 272648 269314 266641 264948 264029 263619 263459 263274 263014 263036
62609 263036 263828 265485 267493 269027 269500 268955 267978 267278 267278 267948 268782 269055 268421 267357 266717 266802 267177 267455
62591 267455 267762 268234 268557 268485 268413 268875 269774 270669 271650 273199 275172 276615 276864 276328 275843 275590 275007 273665
$$ packed form
62687A103086O0142N9099N6025N0863M3899L5061K4256J2093k78j1974k2678l2309
62675A377285m0834m8243n4344n8660o0881o1300o0523n8862n6382n3301m9968
62664G73987m6448m2618l8672l5162l2381l0029k7607k4951k2283j9831j7606
62653D36399j5475j3412j1571j0118r052q307p852p515o889n803m788m544m957
62640C26116n196m874m416m129l685l009k785l381l893l231j682n10k20l03m48
62625B84354r15j588j762j320j160j938l023l334k673j693r19m10j60j85k60K2
62609B63036P92J657K008J534M73n45r77p00%O70Q34K73o34j064o40Q5L75K78
62591B67455L07M72L23p2p2M62Q99Q95R81J549J973J443K49n36m85k53n83j342
$$ plain form
62573 273665 271922 270640 270272 270264 269507 267479 264778 262321 260253 258038 255472 253039 251208 249862 248659
62558 248659 247581 246892 246793 247373 248631 250327 252039 253616 255386 257641 260068 261965 262915 263087 263053 263597
62542 263597 265458 268774 272681 275885 277842 279168 280752 282723 284545 285891 287062 288587 290781 293673
62528 293673 297031 300347 303201 305865 309260 313956 319540 325371 331707 339551 349433 361034 374077 388914
62514 388914 405902 424810 445364 467962 493286 521421 551848 584142 618132 653468 689458
62503 689458 725262 759843 791824 819861 843167 861331 873802 880054 880258 875245 865742 852102
62491 852102 834826 814872 793322 771229 749837 730334 713174 698168 685535 676280 671171 669826
62479 669826 671356 675520 682724 693120 706185 721019 736575 751689 765350 776927 785892 791480
$$ packed form
62573B73665j743j282l68qp57k028k701k457k068k215k566k433j831j346j203
62558B48659j078o89r9N80J258J696J712J577J770K255K427J897R50J72l4N44
62542B63597J861L316L907L204J957J326J584J971J822J346J171J525K194K892
62528B93673L358L316K854K664L395M696N584N831O336P844R882J1601J3043J4837
62514C88914J6988J8908K0554K2598K5324K8135L0427L2294L3990L5336L5990
62503F89458L5804L4581L1981K8037K3306J8164J2471O252K04n013r503j3640
62491H52102j7276j9954k1550k2093k1392j9503j7160j5006j2633r255n109j345
62479F69826J530M164P204J0396J3065J4834J5556J5114J3661J1577Q965N588
$$ plain form
62467 791480 793028 790519 784381 774762 761408 744247 723706 700372 674719 647282 618827 590171
62455 590171 562001 534923 509454 485831 463979 443752 425180 408513 394129 382335 373073 365813
62443 365813 359856 354783 350535 347222 345014 344071 344260 345012 345722 346322 347191 348529 350116 351686 353190 354516
62427 354516 355274 355109 354029 352241 349768 346465 342346 337686 332788 327773 322652 317566 312859 308879 305679
62412 305679 303022 300692 298727 297320 296589 296507 296816 296904 296100 294382 292569 291460 290954 290426 289804 289678 290421
62395 290421 291799 293560 295743 298199 300481 302608 305346 309198 313558 317445 320739 324030 327502 330745
62381 330745 333643 336716 340447 344845 349863 355744 362625 370136 377705 385120 392602 400514 409142 418618
62367 418618 428900 439878 451489 463723 476718 491043 507654 527175 549368 573828 601112
$$ packed form
62467G91480J548k509o138r619j3354j7161k0541k3334k5653k7437k8455k8656
62455E90171k8170k7078k5469k3623k1852k0227j8572j6667j4384j1794r262p260
62443C65813n957n073m248l313k208r43J89P52P10O00Q69J338J587J570J504J326
62427C54516P58j65j080j788k473l303m119m660m898n015n121n086m707l980l200
62412C05679k657k330j965j407p31q2L09Q8q04j718j813j109n06n28o22j26P43
62395B90421J378J761K183K456K282K127K738L852M360L887L294L291L472L243
62381C30745K898L073L731M398N018N881O881P511P569P415P482P912Q628R476
62367D18618J0282J0978J1611J2234J2995J4325J6611J9521K2193K4460K7284
$$ plain form
62356 601112 632562 668922 709736 754281 802463 854402 909684 967423 1026524 1085321 1141333
62345 1141333 1192084 1236026 1272303 1300017 1318483 1327993 1329526 1323564 1309745 1287814 1258353 1222447
62333 1222447 1181142 1135538 1087027 1037201 987683 940050 895513 854531 817058 783233 753414
62322 753414 727450 704405 683314 663805 645768 628835 612567 596756 581161 565265 548771
62311 548771 532117 516022 500729 486162 472629 460735 450454 440845 430918 420555 410515 401844
62299 401844 395300 390946 388072 385807 383985 383149 383566 384593 385356 385784 386468 387682 389057 390327 391854
62284 391854 394103 396993 400186 403759 408025 412706 416880 419998 422550 425321 428349 431073 433355 435822
62270 435822 439119 443274 447959 453046 458684 465070 472395 480992 491408 504331 520333 539556 561720
$$ packed form
62356F01112L1450L6360M0814M4545M8182N1939N5282N7739N9101N8797N6012
62345A141333N0751M3942L6277K7714J8466R510J533n962j3819k1931k9461l5906
62333A222447m1305m5604m8511m9826m9518m7633m4537m0982l7473l3825k9819
62322G53414k5964k3045k1091j9509j8037j6933j6268j5811j5595j5896j6494
62311E48771j6654j6095j5293j4567j3533j1894j0281r609r927j0363j0040q671
62299D01844o544m354k874k265j822q36M17J027P63M28O84J214J375J270J527
62284C91854K249K890L193L573M266M681M174L118K552K771L028K724K282K467
62270D35822L297M155M685N087N638O386P325Q597J0416J2923J6002J9223K2164
$$ plain form
62257 561720 586732 615268 648470 687089 731159 780425 834476 892304 952244 1012698 1072510
62246 1072510 1130369 1184279 1232139 1272625 1305126 1329141 1344219 1350236 1347172 1334712 1312583 1281226
62234 1281226 1241627 1194599 1140847 1081847 1020092 958211 898115 841056 787974 739432 695478
62223 695478 655890 620503 589205 561826 538092 517577 499719 484145 470947 460297 451740 444261
62211 444261 437178 430601 424836 419787 415221 411237 408010 405202 402142 398579 394985 392022 389933 388566
62197 388566 387785 387662 388243 389342 390821 393041 396684 401886 407829 413596 419277 425796 433710 442744 452570
62182 452570 463394 475350 487815 499835 511072 521922 532820 543800 554620 564997 574714 583746
62170 583746 592317 600723 609290 618750 630499 646104 666473 691664 721399 755399 793197 833928
$$ packed form
62257E61720K5012K8536L3202L8619M4070M9266N4051N7828N9940O0454N9812
62246A072510N7859N3910M7860M0486L2501K4015J5078O017l064j2460k2129l1357
62234A281226l9599m7028n3752n9000o1755o1881o0096n7059n3082m8542m3954
62223F95478l9588l5387l1298k7379k3734k0515j7858j5574j3198j0650q557p479
62211D44261p083o577n765n049m566l984l227k808l060l563l594k963k089j367
62197C88566p81j23N81J099J479K220L643N202N943N767N681O519P914R034R826
62182D52570J0824J1956J2465J2020J1237J0850J0898J0980J0820J0377R717R032
62170E83746Q571Q406Q567R460J1749J5605K0369K5191K9735L4000L7798M0731
$$ plain form
62158 833928 876525 919978 963217 1004808 1042933 1075840 1102386 1122181 1135213 1141475 1141022 1134215
62146 1134215 1121475 1102773 1077674 1046147 1009138 968196 924741 879925 834989 791342 750233
62135 750233 712486 678554 648664 622882 601135 583161 568438 556299 546154 537500 529763 522479
62123 522479 515718 509933 505158 500739 496306 492645 490974 491495 493315 495918 500143 507401 518335 532509
62109 532509 549011 566829 584725 601201 614858 624826 631043 634351 636316 638647 642444 647799 654010
62096 654010 660064 664895 667342 666290 661338 653471 644864 637742 633344 631844 633024 636831 643442 652974
62082 652974 665158 679302 694731 711353 729558 749441 770425 791881 813792 836384 859408
62071 859408 882310 904955 927587 950041 971670 992286 1012566 1033165 1053965 1074738 1096237
$$ packed form
62158H33928M2597M3453M3239M1591L8125L2907K6546J9795J3032O262m53o807
62146A134215j2740j8702k5099l1527l7009m0942m3455m4816m4936m3647m1109
62135G50233l7747l3932k9890k5782k1747j7974j4723j2139j0145q654p737p284
62123E22479o761n785m775m419m433l661j671N21J820K603M225P258J0934J4174
62109E32509J6502J7818J7896J6476J3657R968O217L308J965K331L797N355O211
62096F54010O054M831K447j052m952p867q607p122m398j500J180L807O611R532
62082F52974J2184J4144J5429J6622J8205J9883K0984K1456K1911K2592K3024
62071H59408K2902K2645K2632K2454K1629K0616K0280K0599K0800K0773K1499
$$ plain form
62060 1096237 1119958 1146821 1176528 1208085 1240388 1272094 1301486 1326989 1347787 1363724 1374708
62049 1374708 1380433 1380649 1375400 1364807 1348703 1326610 1298180 1263714 1224265 1181222 1135756 1088673
62037 1088673 1040801 993364 947790 905105 865606 829136 795548 764919 737518 713661 693349
62026 693349 675950 660438 646194 633369 622197 612298 603061 594473 586861 579818 572212 563568 554801
62013 554801 547037 540243 533610 526898 520645 515238 510573 506749 504387 503894 504797 506188 507613 509290 511636
61998 511636 514841 518889 523733 529322 535370 541225 546238 550380 554244 558202 561844 564505 566109 566972
61984 566972 566928 565215 561369 555809 549424 542931 536731 530975 525523 520089 514588 509132 503670 497987 492204
61969 492204 486858 482230 477898 473306 468538 464245 460888 458297 455922 453339 450576 448043 446080 444586
$$ packed form
62060A096237K3721K6863K9707L1557L2303L1706K9392K5503K0798J5937J0984
62049A374708N725K16n249j0593j6104k2093k8430l4466l9449m3043m5466m7083
62037A088673m7872m7437m5574m2685l9499l6470l3588l0629k7401k3857k0312
62026F93349j7399j5512j4244j2825j1172r899r237q588p612p043p606q644q767
62013E54801p764o794o633o712o253n407m665l824k362m93R03J391J425J677K346
61998E11636L205M048M844N589O048N855N013M142L864L958L642K661J604Q63
61984E66972m4j713l846n560o385o493o200n756n452n434n501n456n462n683n783
61969D92204n346m628m332m592m768m293l357k591k375k583k763k533j963j494
$$ plain form
61955 444586 443250 442063 441255 440680 439731 438129 436486 435760 436336 437926 440156 442917 446203 449942 454046
61940 454046 458540 463655 469814 477368 486320 496490 507961 520993 535377 550249 564742 578524
61928 578524 591494 603381 614068 623852 632897 640646 646337 649922 651936 652558 651361 648038 642901 636599
61914 636599 629721 622747 615981 609491 603486 598790 596505 597116 600294 605599 612937 622144 632638 643763
61900 643763 655205 666848 678461 689611 699522 706878 710326 709527 705457 699348 691671 682443 672020
61887 672020 660960 649367 637083 624567 613001 603312 595402 588362 581142 572994 563821 554293 545286
61874 545286 536849 527942 517433 505259 492442 480142 468934 458891 450018 442492 436574 432379 429738
61861 429738 428319 427926 428609 430431 433290 437056 441807 447780 455160 464074 474743 487456 502362 519432
$$ packed form
61955D44586j336j187q08n75r49j602j643p26N76J590K230K761L286L739M104
61940D54046M494N115O159P554Q952J0170J1471J3032J4384J4872J4493J3782
61928E78524J2970J1887J0687R784R045P749N691L585K014O22j197l323n137o302
61914F36599o878o974o766o490o005m696k285O11L178N305P338R207J0494J1125
61900F43763J1442J1643J1613J1150R911P356L448p99m070o109p677r228j0423
61887F72020j1060j1593j2284j2516j1566r689p910p040p220q148r173r528r007
61874E45286q437q907j0509j2174j2817j2300j1208j0043q873p526n918m195k641
61861D29738j419l93O83J822K859L766M751N973P380Q914J0669J2713J4906J7070
$$ plain form
61847 519432 538608 559792 582617 606432 630652 655003 679268 702886 725011 744916 762103
61836 762103 775957 785587 790246 789886 785182 777050 766348 754013 741211 729111 718551 710116 704526
61823 704526 702700 705244 711915 721707 733436 746182 759184 771522 782073 789785 793958 794221 790278
61810 790278 781763 768447 750640 729331 705852 681375 656714 632454 609062 586928 566435 547977
61798 547977 531754 517585 505145 494368 485286 477462 470069 462821 456468 451863 448753 445991 442848
61785 442848 439573 436614 433902 431135 428318 425582 422839 419981 417211 414752 412429 409964 407639 406208
61771 406208 406053 406791 407825 408949 410302 411984 413945 416050 418037 419612 420815 422184 424251 426971 429932
61756 429932 433096 436928 441678 446853 451728 456128 460369 464522 468225 471301 474120 476997 479481 480679
$$ packed form
61847E19432J9176K1184K2825K3815K4220K4351K4265K3618K2125J9905J7187
61836G62103J3854R630M659l60m704q132j0702j2335j2802j2100j0560q435n590
61823G04526j826K544O671R792J1729J2746J3002J2338J0551P712M173K63l943
61810G90278q515j3316j7807k1309k3479k4477k4661k4260k3392k2134k0493j8458
61798E47977j6223j4169j2440j0777r082p824p393p248o353m605l110k762l143
61785D42848l275k959k712k767k817k736k743k858k770k459k323k465k325j431
61771D06208j55P38J034J124J353J682J961K105J987J575J203J369K067K720K961
61756D29932L164L832M750N175M875M400M241M153L703L076K819K877K484J198
$$ plain form
61742 480679 480309 479125 478171 477772 477322 475874 472851 468364 463161 458326 454846 453177 452975 453235 452954 451922
61726 451922 450936 451124 452997 456160 459757 463019 465493 467127 468296 469497 470830 471873 472256 472263 472693 474106
61710 474106 476327 478674 480512 481569 481853 481419 480216 478127 475156 471609 468075 465130 462965 461320 459810
61695 459810 458269 456724 455130 453348 451359 449275 447147 444993 443119 442062 442021 442583 443206 443699 443984 443805
61679 443805 443149 442679 443112 444244 445125 445203 444808 444564 444903 446169 448465 451124 452998 453645 453798 454363 455434
61662 455434 456622 457795 459001 460141 461242 462734 464921 467443 469745 471732 473430 474403 474257 473549 473472
61647 473472 474603 476452 478193 479274 479476 479119 479242 480875 483919 487238 489921 491913 493359 494153 494414
61632 494414 494740 495410 495837 495258 493671 491655 489549 487247 484610 481731 478868 476324 474241 472362 470229
$$ packed form
61742D80679l70j184r54l99m50j448l023m487n203m835l480j669k02K60k81j032
61726D51922r86J88J873L163L597L262K474J634J169J201J333J043L83PM30J413
61710D74106K221K347J838J057K84m34j203k089k971l547l534k945k165j645j510
61695D59810j541j545j594j782j989k084k128k154j874j057m1N62O23M93K85j79
61679D43805o56m70M33J132Q81P8l95k44L39J266K296K659J874O47J53N65J071
61662D55434J188J173J206J140J101J492K187K522K302J987J698R73j46p08p7
61647D73472J131J849J741J081K02l57J23J633L044L319K683J992J446P94K61
61632D94414L26O70M27n79j587k016k106k302k637k879k863k544k083j879k133
$$ plain form
61617 470229 467713 465097 462548 460001 457724 456382 456074 455801 454492 452151 449379 446138 441873 436756 431813
61602 431813 427602 423524 418804 413569 408506 403978 400015 396774 394335 392198 389561 386210 382682 379502
61588 379502 376630 373812 371124 368887 367291 366312 365844 365604 365034 363614 361391 358989 357050 355792 355067
61573 355067 354551 353777 352298 350142 347991 346608 346079 345791 345123 343955 342501 340951 339371 337778 336156
61558 336156 334487 332893 331666 331009 330739 330343 329353 327757 326038 324781 324138 323756 323249 322672 322341 322311 322257
61541 322257 321890 321254 320536 319792 319038 318469 318375 318824 319512 319968 319929 319582 319402 319757 320686 322025 323523 324697
61523 324697 324835 323588 321565 319952 319401 319487 319319 318404 316836 314978 313217 311873 311102 310927 311387 312398
61507 312398 313434 313740 313155 312416 312276 312481 312119 310909 309639 309167 309361 309325 308424 306810 305065 303680 302892
$$ packed form
61617D70229k516k616k549k547k277j342l08k73j309k341k772l241m265n117m943
61602D31813m211m078m720n235n063m528l963l241k439k137k637l351l528l180
61588C79502k872k818k688k237j596r79m68k40n70j420k223k402j939j258p25
61573C55067n16p74j479k156k151j383n29k88o68j168j454j550j580j593j622
61558C36156j669j594j227o57k70l96r90j596j719j257o43l82n07n77l31l0n4
61541C22257l67o36p18p44p54n69r4M49O88M56l9l47j80L55R29J339J498J174
61523C24697J38j247k023j613n51Q6j68r15j568j858j761j344p71j75M60J011
61507C12398J036L06n85p39j40K05l62j210j270m72J94l6r01j614j745j385p88
$$ plain form
61490 302892 302672 302606 301943 300232 298036 296706 297055 298387 299166 298645 297495 296790 296777 296909 296695 296105 295261 294243
61472 294243 293279 292813 293114 293917 294621 294867 294807 294747 294604 293974 292834 291885 291837 292418 292553 291597 290017 288697 288004
61453 288004 287807 287971 288311 288345 287693 286687 286118 286339 287028 287838 288805 289993 291201 292269 293383 294790 296434
61436 296434 298011 299172 299552 298941 297760 297067 297666 299272 300878 301935 302803 303965 305157 305580 304874 303635
61420 303635 302848 302963 303639 304450 305542 307323 309642 311813 313599 315676 318633 321893 324275 325551 326677
61405 326677 328298 329761 330087 329318 328259 327281 326151 324871 323815 322889 321367 318944 316348 314443 313182
61390 313182 311978 310714 309720 308929 307744 305876 303824 302362 301850 302158 302911 303712 304385 305155 306406 308176
61374 308176 310064 311672 312900 313807 314482 315201 316388 318161 320071 321500 322234 322506 322621 322705 322733 322641 322454
$$ packed form
61490C02892k20o6o63j711k196j330L49J332P79n21j150p05j3J32k14n90q44j018
61472B94243r64m66L01Q03P04K46o0o0j43o30j140r49m8N81J35r56j580j320o93
61453B88004j97J64L40L4o52j006n69K21O89Q10R67J188J208J068J114J407J644
61436B96434J577J161L80o11j181o93N99J606J606J057Q68J162J192M23p06j239
61420C03635p87J15O76Q11J092J781K319K171J786K077K957L260K382J276J126
61405C26677J621J463L26p69j059r78j130j280j056r26j522k423k596j905j261
61390C13182j204j264r94p91j185j868k052j462n12L08P53Q01O73P70J251J770
61374C08176J888J608J228R07O75P19J187J773J910J429P34K72J15Q4K8r2j87
$$ plain form
61357 322454 322460 323195 325061 327890 330920 333307 334749 335668 336811 338703 341479 345084 349329 353745 357783
61342 357783 361465 365561 370793 377091 383994 391507 399934 408940 417444 424612 430399 434851 437488 437836
61328 437836 436293 433957 431661 429491 427100 424230 420930 417495 414273 411495 409214 407308 405460 403422
61314 403422 401546 400746 401491 403051 404352 405417 407182 409895 412668 414952 417558 421619 427207 433611 440412
61299 440412 447612 455182 463222 472186 482206 492518 502260 511492 520615 529039 535355 538667 538875 535756
61285 535756 528937 519110 508293 498267 489271 480579 471828 463342 455626 449064 443804 439602 435999 432935
61271 432935 430915 430314 430874 432187 434324 437569 441779 446482 451512 457086 463218 469442 475256 480545 485469
61256 485469 490169 494843 499972 506097 513261 520890 528451 536121 544561 554099 564375 574649 584019 591366
$$ packed form
61357C22454OP35J866K829L030K387J442R19J143J892K776L605M245M416M038
61342C57783L682M096N232O298O903P513Q427R006Q504P168N787M452K637L48
61328D37836j543k336k296k170k391k870l300l435l222k778k281j906j848k038
61314D03422j876q00P45J560J301J065J765K713K773K284K606M061N588O404O801
61299D40412P200P570Q040Q964J0020J0312R742R232R123Q424O316L312K08l119
61285E35756o819r827j0817j0026q996q692q751q486p716o562n260m202l603l064
61271D32935k020o01N60J313K137L245M210M703N030N574O132O224N814N289M924
61256D85469M700M674N129O125P164P629P561P670Q440R538J0276J0274R370P347
$$ plain form
61242 591366 595702 596893 595636 592466 587227 579904 571425 562967 554844 546779 539111 532909 528842 526568
61228 526568 525368 524830 524812 525339 526759 529493 533402 537828 542497 547861 554227 560950 566962 571860 576086
61213 576086 580193 584320 588378 592420 596699 601460 606716 612146 617173 621191 623952 625893 627979 630908
61199 630908 634436 637746 640470 642878 645068 646627 647484 648477 650531 653822 658341 664716 673561 684360
61185 684360 696016 708298 721721 736020 749833 762193 773330 783605 792467 799035 803166 805566
61173 805566 807205 808863 810714 812140 812345 811259 809339 806508 802110 796038 789030 781564 773287 763893
61159 763893 753698 742830 730725 717112 702770 688656 674952 661661 649370 638473 628211
61148 628211 617596 607021 597947 591112 585982 581980 579337 578510 579497 582025 585929 591033 596920 602986
$$ packed form
61242E91366M336J191j257l170n239p323q479q458q123q065p668o202m067k274
61228E26568j200n38j8N27J420K734L909M426M669N364O366O723O012M898M226
61213E76086M107M127M058M042M279M761N256N430N027M018K761J941K086K929
61199F30908L528L310K724K408K190J559Q57R93K054L291M519O375Q845J0799
61185F84360J1656J2282J3423J4299J3813J2360J1137J0275Q862O568M131K400
61173H05566J639J658J851J426K05j086j920k831m398o072p008p466q277r394
61159G63893j0195j0868j2105j3613j4342j4114j3704j3291j2291j0897j0262
61148F28211j0615j0575r074o835n130m002k643q27R87K528L904N104N887O066
$$ plain form
61134 602986 608540 612833 615241 615556 614006 611097 607566 604299 601999 600887 600855 601854 604068 607826 613375
61119 613375 620582 628926 638088 648552 661176 676131 692687 710160 728513 747912 768257 789411
61107 789411 811355 833844 856441 879103 902117 925081 946611 965589 982200 997305 1011309
61096 1011309 1024107 1035539 1045305 1052850 1057877 1060566 1060811 1057772 1050740 1039943 1025978 1008994 989150
61083 989150 967314 944561 921243 897286 873039 849180 826121 804122 783620 764823 747347
61072 747347 730856 715640 701975 689474 677883 667930 660510 655427 651859 649630 649035 649740 650943
61059 650943 652479 654779 657888 661394 665232 669685 674721 680211 686663 694838 704758 715903 728280 742370
61045 742370 758145 774989 792571 810987 830161 849892 870399 892116 915161 939720 966538
$$ packed form
61134F02986N554M293K408L15j550k909l531l267k300j112l2R99K214L758N549
61119F13375P207Q344R162J0464J2624J4955J6556J7473J8353J9399K0345K1154
61107G89411K1944K2489K2597K2662K3014K2964K1530J8978J6611J5105J4004
61096A011309J2798J1432R766P545N027K689K45l039p032j0797j3965j6984j9844
61083I89150k1836k2753k3318k3957k4247k3859k3059k1999k0502j8797j7476
61072G47347j6491j5216j3665j2501j1591r953p420n083l568k229n95P05J203
61059F50943J536K300L109L506L838M453N036N490O452Q175R920J1145J2377J4090
61045G42370J5775J6844J7582J8416J9174J9731K0507K1717K3045K4559K6818
$$ plain form
61034 966538 996106 1027697 1060214 1093664 1128777 1165596 1203672 1243398 1285839 1331295 1379256
61023 1379256 1429674 1483191 1540144 1600362 1663690 1729589 1796616 1863634 1931339 2001556 2075679
61012 2075679 2155186 2242845 2341484 2452085 2574975 2712161 2866227 3037814 3227393 3439774
61002 3439774 3684591 3973335 4319796 4743393 5267871 5916325 6712510 7688842 8889147
60993 8889147 10363283 12165123 14352950 16969086 19990685 23287955 26633076 29752461
60985 29752461 32377443 34280373 35329839 35572199 35269787 34817782 34564240 34658646 35027293
60976 35027293 35450013 35643560 35312036 34206181 32218633 29457137 26214819 22843334
60968 22843334 19624911 16723699 14207816 12085477 10326850 8881289 7696173 6726837
$$ packed form
61034I66538K9568L1591L2517L3450L5113L6819L8076L9726M2441M5456M7961
61023A379256N0418N3517N6953O0218O3328O5899O7027O7018O7705P0217P4123
61012B075679P9507Q7659R8639J10601J22890J37186J54066J71587J89579K12381
61002C439774K44817K88744L46461M23597N24478O48454P96185R76332J200305
60993H889147J474136J801840K187827K616136L021599L297270L345121L119385
60985B9752461K624982J902930J049466K42360l02412m52005k53542R4406L68647
60976C5027293M22720J93547l31524j105855j987548k761496l242318l371485
60968B2843334l218423k901212k515883k122339j758627j445561j185116r69336
$$ plain form
60960 6726837 5934261 5282421 4741781 4291283 3913935 3593112 3314823 3070390 2854338
60951 2854338 2661562 2488136 2332623 2194317 2071414 1962211 1866468 1783845 1712059 1647818
60941 1647818 1588494 1531885 1475678 1418546 1360972 1304052 1248358 1194535 1143719 1096356 1051649
60930 1051649 1009004 968928 931682 896273 861796 828755 798127 770088 744543 721795 701692
60919 701692 683132 665367 648856 633969 619944 606133 593142 581562 570635 559481 548752
60908 548752 539731 532529 526490 521592 518017 514882 510908 506099 501508 497648 494243 491269 489048 487453
60894 487453 486052 484834 483860 482518 480127 477032 474105 471399 468376 465161 462454 460281 457992 455545
60880 455545 453727 452887 452303 451064 448911 446121 443170 440630 438866 437748 437014 436700 436770 436707 436104 435333 434875
$$ packed form
60960F726837p92576o51840n40640m50498l77348l20823k78289k44433k16052
60951B854338j92776j73426j55513j38306j22903j09203r5743q2623p1786o4241
60941A647818n9324n6609n6207n7132n7574n6920n5694n3823n0816m7363m4707
60930A051649m2645m0076l7246l5409l4477l3041l0628k8039k5545k2748k0103
60919G01692j8560j7765j6511j4887j4025j3811j2991j1580j0927j1154j0729
60908E48752r021p202o039m898l575l135l974m809m591l860l405k974k221j595
60894D87453j401j218r74j342k391l095k927k706l023l215k707k173k289k447
60880D55545j818q40n84j239k153k790k951k540j764j118p34l14P0o3o03p71m58
$$ plain form
60863 434875 434368 433165 431568 430562 430429 430501 430199 429458 428216 426427 424619 423494 422797 421450 419000 416202
60847 416202 413965 412422 411263 410315 409535 408967 408896 409588 410779 411843 412394 412261 411101 408783 406088 404155
60831 404155 403150 402261 401150 400558 401281 403328 406348 410097 414135 417824 421125 424801 429392 434492 439344
60816 439344 443611 447152 449696 451258 452428 453679 454730 455003 454431 453407 452301 451449 451206 451459 451266 449523
60800 449523 445980 441326 436432 431769 427368 422906 417901 412172 406159 400577 395706 391179 386393 381045
60786 381045 375349 369945 365520 362335 360016 357812 355154 352039 348965 346373 344088 341512 338537 336002
60772 336002 334866 335049 335496 335414 335072 335361 336853 339359 342128 344438 346275 348374 351341 354888 358316 361570
60756 361570 365224 369463 373853 378242 383158 388921 394985 400642 405884 411091 416301 421405 426757 432872
$$ packed form
60863D34875n07j203j597j006j33P2l02p41j242j789j808j125o97j347k450k798
60847D16202k237j543j159r48p80n68p1O92J191J064N51j33j160k318k695j933
60831D04155j005q89j111n92P23K047L020L749M038L689L301L676M591N100M852
60816D39344M267L541K544J562J170J251J051K73n72j024j106q52k43K53j93j743
60800D49523l543m654m894m663m401m462n005n729o013n582m871m527m786n348
60786C81045n696n404m425l185k319k204k658l115l074k592k285k576k975k535
60772C36002j136J83M47q2l42K89J492K506K769K310J837K099K967L547L428L254
60756C61570L654M239M390M389M916N763O064N657N242N207N210N104N352O115
$$ plain form
60742 432872 439578 446049 451724 456669 460925 464014 465422 465277 464194 462551 460230 457160 453811 450907
60728 450907 448587 446130 442676 438160 433346 428947 424889 420478 415147 408982 402541 396247 390054 383828
60714 383828 377922 372937 368795 364550 359524 354267 349823 346304 342914 339266 335892 333280 331244 329679
60700 329679 329262 330674 333457 336280 338282 339691 341167 343082 345510 348517 352157 356313 360786 365549
60686 365549 370819 376765 383158 389382 394881 399525 403411 406415 408192 408685 408432 408203 408360 408614 408381 407355
60670 407355 405776 404070 402223 399662 395879 391073 386060 381731 378660 376917 375950 374833 373020 370764
60656 370764 368603 366686 364954 363668 363152 363154 363071 362805 362894 363795 365560 368232 371844 375932 379717 383046 386542
60639 386542 390491 394142 396584 397850 398648 399343 399771 399893 400102 400883 402481 404937 408216 412252 416939 422087
$$ packed form
60742D32872O706O471N675M945M256L089J408j45j083j643k321l070l349k904
60728D50907k320k457l454m516m814m399m058m411n331o165o441o294o193o226
60714C83828n906m985m142m245n026n257m444l519l390l648l374k612k036j565
60700C29679m17J412K783K823K002J409J476J915K428L007L640M156M473M763
60686C65549N270N946O393O224N499M644L886L004J777M93k53k29J57K54k33j026
60670D07355j579j706j847k561l783m806n013m329l071j743r67j117j813k256
60656C70764k161j917j732j286n16Kq3k66Q9R01J765K672L612M088L785L329L496
60639C86542L949L651K442J266P98O95M28J22K09P81J598K456L279M036M687N148
$$ plain form
60623 422087 427437 432904 438737 445213 452230 459548 467357 476197 486283 497399 509491 522750 536894
60610 536894 550962 564263 577113 590292 604162 618702 633975 650017 666420 682505 697852
60599 697852 712397 726122 738829 750170 759797 767675 774292 780213 785352 789025 790799 790832 789248 785731
60585 785731 780018 772342 763107 752592 741221 729553 717628 704906 691289 677561 664370 651457
60573 651457 638618 626783 617220 610083 604749 601303 600670 603247 608349 615227 623875 634591 647267
60560 647267 661365 676147 690750 704313 716044 724885 729310 728056 721102 709626 695146 679152
60548 679152 663336 649341 638109 629940 625210 624489 627925 635126 645828 660207 678425 700292 725457
60535 725457 753397 782981 812427 839761 863037 880249 889776 891204 885358 873455 856710 836739
$$ packed form
60623D22087N350N467N833O476P017P318P809Q840J0086J1116J2092J3259J4144
60610E36894J4068J3301J2850J3179J3870J4540J5273J6042J6403J6085J5347
60599F97852J4545J3725J2707J1341R627P878O617N921N139L673J774L3j584l517
60585G85731n713p676r235j0515j1371j1668j1925j2722j3617j3728j3191j2913
60573F51457j2839j1835r563p137n334l446o33K577N102O878Q648J0716J2676
60560F47267J4098J4782J4603J3563J1731Q841M425j254o954j1476j4480j5994
60548F79152j5816j3995j1232q169m730p21L436P201J0702J4379J8218K1867K5165
60535G25457K7940K9584K9446K7334K3276J7212R527J428n846j1903j6745j9971
$$ plain form
60523 836739 815587 794960 775864 759207 746058 736798 730467 725612 721666 719085 718198 718316 718115 716778
60509 716778 714737 713292 713499 715620 719704 726245 735708 747709 761442 777094 796188 820463 850977
60496 850977 888437 933564 986618 1047144 1114746 1189573 1271425 1358573 1448032 1536765 1622106
60485 1622106 1701126 1770215 1825537 1863746 1882330 1879610 1854770 1808186 1741993 1660184 1567625
60474 1567625 1468677 1366863 1265645 1168752 1079274 998791 927624 865534 811775 764972 723697
60463 723697 687228 655404 627812 603555 581779 562139 544722 529672 516847 505720 495723 486778
60451 486778 479274 473362 468558 464203 459978 455718 451090 445916 440627 435958 432193 428987 425856 422695
60437 422695 419989 418654 419338 421561 423797 424807 424699 424427 424585 425067 425544 425659 424903 422903 419879 416479
$$ packed form
60523H36739k1152k0627j9096j6657j3149r260o331m855l946k581q87J18k01j337
60509G16778k041j445K07K121M084O541R463J2001J3733J5652J9094K4275L0514
60496H50977L7460M5127N3054O0526O7602P4827Q1852Q7148Q9459Q8733Q5341
60485A622106P9020O9089N5322L8209J8584k720k4840m6584o6193q1809r2559
60474A567625r8948j01814j01218r6893q9478q0483p1167o2090n3759m6803m1275
60463G23697l6469l1824k7592k4257k1776j9640j7417j5050j2825j1127r997q945
60451D86778p504n912m804m355m225m260m628n174n289m669l765l206l131l161
60437D22695k706j335O84K223K236J010j08k72J58M82M77J15p56k000l024l400
$$ plain form
60421 416479 413235 410509 408713 407964 407620 406804 405439 404290 403927 404200 404819 405864 407494 409583 411866 414155
60405 414155 416233 417860 418964 419543 419427 418533 417329 416428 415593 413863 410927 407812 405790 405091 405160 405592
60389 405592 406163 406317 405447 403705 401905 400553 399473 398488 397927 398223 399330 400828 402411 404085 405956 407974
60373 407974 409878 411343 412258 412867 413588 414669 416046 417501 418908 420384 422234 424702 427677 430669 433108
60358 433108 434623 435086 434625 433664 432694 431791 430550 428729 426763 425371 424697 424210 423393 422264 421123 420191
60342 420191 419600 419511 419935 420554 420986 421238 421777 423063 425022 427014 428426 429295 430263 431810 433676 435257 436494
60325 436494 438023 440339 443022 445064 445848 445616 444975 444162 442924 441034 438755 436664 435126 434158 433844 434665
60309 434665 437166 441358 446603 452061 457175 462052 467789 476299 489141 506201 525800 546249 566888
$$ packed form
60421D16479l244k726j796p49l44q16j365j149l63K73O19J045J630K089K283K289
60405D14155K078J627J104N79j16q94j204r01q35j730k936l115k022o99O9M32
60389D05592N71J54q70j742j800j352j080r85n61K96J107J498J583J674J871K018
60373D07974J904J465R15O09P21J081J377J455J407J476J850K468K975K992K439
60358D33108J515M63m61r61r70r03j241j821j966j392o74m87q17j129j141r32
60342D20191n91q9M24O19M32K52N39J286J959J992J412Q69R68J547J866J581J237
60325D36494J529K316K683K042P84k32o41q13j238j890k279k091j538r68l14Q21
60309D34665K501M192N245N458N114M877N737Q510J2842J7060J9599K0449K0639
$$ plain form
60296 566888 587299 606019 620754 629825 632904 630296 622086 608348 589979 568990 547902 528735
60284 528735 512304 498327 486279 476161 468383 462988 459322 456579 454473 453224 452932 453081 452687 450974
60270 450974 448085 445046 442867 441641 440672 439423 438056 437025 436430 435929 435047 433488 431386 429389 428238
60255 428238 428084 428385 428567 428486 428096 427096 425412 423771 423227 424025 425290 426002 425973 425742 425726 425758 425440 424784 424345
60236 424345 424681 425771 427119 428327 429334 430150 430760 431478 432917 435276 438007 440572 443257 446719 450949
60221 450949 455250 459118 462438 464841 465626 464726 463184 462285 462496 463518 465003 466843 469053 471746 475024
60206 475024 478661 482128 485264 488623 492733 497221 501176 504259 506883 509274 510949 511440 511168 511208 512313
60191 512313 514398 516867 519122 520754 521498 521274 520318 519146 518226 517601 516898 515776 514269 512651 511072 509479
$$ packed form
60296E66888K0411J8720J4735R071L079k608q210j3738j8369k0989k1088j9167
60284E28735j6431j3977j2048j0118p778n395l666k743k106j249k92J49l94j713
60270D50974k889l039k179j226r69j249j367j031n95n01q82j559k102j997j151
60255D28238j54L01J82q1l90j000j684j641n44P98J265P12k9k31j6L2l18o56m39
60236D24345L36J090J348J208J007Q16O10P18J439K359K731K565K685L462M230
60221D50949M301L868L320K403P85r00j542q99K11J022J485J840K210K693L278
60206D75024L637L467L136L359M110M488L955L083K624K391J675M91k72M0J105
60191E12313K085K469K255J632P44k24r56j172r20o25p03j122j507j618j579j593
$$ plain form
60175 509479 507805 506026 504112 502130 500412 499338 498833 498338 497426 496266 495340 494926 495089 495957 497554 499436
60159 499436 500894 501597 501741 501505 500766 499500 497979 496268 493952 490892 487938 486281 486106 486466 486522 486418
60143 486418 486834 488189 490510 493652 497411 501693 506695 512502 518436 523388 527069 530334 533876 537160
60129 537160 539252 540219 540934 541758 542200 541794 540579 538732 536344 533733 531463 529936 529303 529763 531454 534123
60113 534123 537336 541025 545301 549856 554164 558321 563003 568506 574471 580651 587233 594136 600751 606690
60099 606690 612062 616609 619355 619786 618725 617279 615320 611782 606242 599544 592972 587418 583165 579889
60085 579889 576845 573596 570626 568931 569021 570554 572778 575020 577009 579118 582123 586251 590593 593844 595489
60070 595489 595882 595376 593835 590867 586073 579252 570945 562626 555676 550111 544834 539114 533222 527595 522136
$$ packed form
60175E09479j674j779j914j982j718j074n05m95r12j160r26m14J63Q68J597J882
60159D99436J458P03J44k36p39j266j521j711k316l060k954j657j75L60N6j04
60143D86418M16J355K321L142L759M282N002N807N934M952L681L265L542L284
60129E37160K092R67P15Q24M42m06j215j847k388k611k270j527o33M60J691K669
60113E34123L213L689M276M555M308M157M682N503N965O180O582O903O615N939
60099F06690N372M547K746M31j061j446j959l538n540o698o572n554m253l276
60085E79889l044l249k970j695R0J533K224K242J989K109L005M128M342L251J645
60070E95489L93n06j541k968m794o821q307q319o950n565n277n720n892n627n459
$$ plain form
60055 522136 516668 511510 507171 503809 501267 499299 497502 495338 492533 489272 485904 482764 480402 479525
60041 479525 480343 482234 484363 486390 488324 490030 491390 492834 495174 498811 503389 508280 513117 517742
60027 517742 521897 525264 527783 529709 531217 532025 531594 529731 526883 523668 520218 516185 511384 506183 501127
60012 501127 496359 491619 486754 482007 477721 473863 469989 465733 461239 457034 453501 450598 448034 445538
59998 445538 442917 440064 437092 434394 432450 431583 431851 432980 434362 435371 435907 436512 437812 440009 442968
59983 442968 446499 450261 453692 456522 459286 462884 467524 472411 476577 479800 482551 485255 487797 489740
59969 489740 490867 491320 491197 490247 488283 485830 483929 483158 483184 483390 483542 483638 483639 483743 484451 485828 487022 487106
59951 487106 486100 484624 482851 480560 477973 475696 473838 471993 470138 468760 467975 467343 466793 466905 467876
$$ packed form
60055E22136n468n158m339l362k542j968j797k164k805l261l368l140k362q77
60041D79525Q18J891K129K027J934J706J360J444K340L637M578M891M837M625
60027E17742M155L367K519J926J508Q08m31j863k848l215l450m033m801n201n056
60012E01127m768m740m865m747m286l858l874m256m494m205l533k903k564k496
59998D45538k621k853k972k698j944q67K68J129J382J009N36O05J300K197K959
59983D42968L531L762L431K830K764L598M640M887M166L223K751K704K542J943
59969D89740J127M53j23r50j964k453j901p71K6K06J52R6JJ04P08J377J194Q4
59951D87106j006j476j773k291k587k277j858j845j855j378p85o32n50J12R71
$$ plain form
59936 467876 468955 469406 469461 469744 470270 470561 470381 469817 468974 468136 467883 468489 469436 470084 470646 471942 474235 476870
59918 476870 479010 480326 480962 481294 481783 482707 483908 485040 485998 486856 487475 487529 486964 486071 485039 483819 482520
59901 482520 481556 481102 480628 479391 477411 475677 475190 475899 476753 476837 476253 475806 476066 477060 478764 481436 485263
59884 485263 489977 495147 500667 506698 513180 519612 525392 530317 534777 539465 544776 550444 555858 560726
59870 560726 565166 569182 572329 574051 574069 572232 568316 562343 554923 546926 538832 530709 522725 515327 508825
59855 508825 503136 498154 494157 491591 490413 489884 489220 488509 488803 491180 495731 501590 507934 514805 523028
59840 523028 533501 546484 561203 576015 589179 599678 607273 611969 613852 613591 612650 612602 614176 616980
59826 616980 619814 621131 619509 614130 604876 592078 576435 559196 541938 525768 510981 497652
$$ packed form
59936D67876J079M51N5K83N26K91j80n64q43q38k53O06R47O48N62J296K293K635
59918D76870K140J316O36L32M89R24J201J132R58Q58O19N4n65q93j032j220j299
59901D82520r64m54m74j237j980j734m87P09Q54Q4n84m47K60R94J704K672L827
59884D85263M714N170N520O031O482O432N780M925M460M688N311N668N414M868
59870E60726M440M016L147J722J8j837l916n973p420p997q094q123p984p398o502
59855E08825n689m982l997k566j178n29o64p11K94K377M551N859O344O871Q223
59840E23028J0473J2983J4719J4812J3164J0499P595M696J883k61r41m8J574K804
59826F16980K834J317j622n379r254j2798j5643j7239j7258j6170j4787j3329
$$ plain form
59814 497652 486173 476780 468969 462003 455922 451445 448816 447272 445813 444098 442320 440505 438336 435632
59800 435632 432737 430318 428760 427816 426959 425992 425124 424374 423233 421238 418673 416272 414278 412222 409749
59785 409749 407268 405459 404398 403509 402356 401236 400856 401581 403063 404495 405076 404355 402395 399804 397440
59770 397440 395874 395111 394888 395095 395703 396444 396962 397400 398458 400611 403393 405674 406635 406391 405775 405626 406238
59753 406238 407357 408658 410100 411826 413907 416416 419589 423572 428059 432435 436223 439124 440805 441184
59739 441184 440925 441013 441672 442164 441901 441204 440695 440469 440281 440070 439810 439187 437990 436647 435875 435953 436628 437537 438317
59720 438317 438575 438190 437506 436836 435987 434759 433620 433314 433863 434580 435102 435839 437232 439038 440667 441953 443298
59703 443298 445167 447607 450301 453065 456177 460020 464438 468805 472863 477095 482042 487672 493754 500365
$$ packed form
59814D97652j1479r393p811o966o081m477k629j544j459j715j778j815k169k704
59800D35632k895k419j558r44q57r67q68p50j141j995k565k401j994k056k473
59785D09749k481j809j061q89j153j120l80P25J482J432N81p21j960k591k364
59770C97440j566p63k23K07O08P41N18M38J058K153K782K281R61k44o16j49O12
59753D06238J119J301J442J726K081K509L173L983M487M376L788K901J681L79
59739D41184k59Q8O59M92k63o97n09k26j88k11k60o23j197j343p72P8O75R09P80
59720D38317K58l85o84o70q49j228j139l06N49P17N22P37J393J806J629J286J345
59703D43298J869K440K694K764L112L843M418M367M058M232M947N630O082O611
$$ plain form
59689 500365 507446 514214 519623 523264 525307 525834 524939 523370 522256 522005 522010 521528 520359 518664 516712 514990
59673 514990 513987 513565 512929 511420 509065 506335 503706 501539 499957 498758 497754 497170 497214 497316 496445 494387
59657 494387 492173 490975 491065 492031 493514 495394 497644 500357 503571 506882 509684 512043 514810 518410 521986
59642 521986 524239 524821 524376 523447 521931 519563 516370 512556 508312 503859 499465 495308 491477 488051 485048
59627 485048 482368 479949 477988 476828 476603 477039 477595 477793 477487 476894 476283 475617 474600 473027 470930 468385
59611 468385 465335 461680 457373 452449 447263 442704 439850 439154 440098 441663 442960 443432 442881 441612 440354
59596 440354 439729 439836 440426 441359 442658 444178 445448 445965 445726 445412 445849 447148 448602 449621 450414 451327 451780
59579 451780 450615 447534 443518 439608 435938 432283 428838 425858 422987 419671 416054 412842 410373 408356
$$ packed form
59689E00365P081O768N409L641K043N27q95j569j114k51Nm82j169j695j952j722
59673E14990j003m22o36j509k355k730k629k167j582j199j004n84M4J02q71k058
59657D94387k214j198R0R66J483J880K250K713L214L311K802K359K767L600L576
59642E21986K253N82m45r29j516k368l193l814m244m453m394m157l831l426l003
59627D85048k680k419j961j160k25M36N56J98l06n93o11o66j017j573k097k545
59611D68385l050l655m307m924n186m559k854o96R44J565J297M72n51j269j258
59596D40354o25J07N90R33J299J520J270N17k39l14M37J299J454J019P93R13M53
59579D51780j165l081m016l910l670l655l445k980k871l316l617l212k469k017
$$ plain form
59565 408356 406522 405006 403926 403063 402207 401559 401517 402187 403232 404194 404791 404955 404729 404258 403890 404088 405070 406547
59547 406547 408037 409496 411483 414553 418558 422669 426195 429407 433549 439874 448662 459352 471749 486692
59533 486692 505093 526387 548222 567560 581730 588743 587644 579237 566225 552071 539467 529700
59521 529700 523060 519513 518944 520955 524614 528761 532735 536637 540612 544179 546601 547686 547701 546704 544551
59506 544551 541434 537697 533122 527139 519896 512390 505295 498401 491496 485099 479806 475501 471754 468548
59492 468548 466088 464255 462722 461346 460123 459045 458238 457844 457583 457030 456601 457538 460438 464422 468417 472556
59476 472556 477624 483732 490496 498108 507115 517215 527156 535884 543010 548178 550804 550745 548699 545784
59462 545784 542950 540743 539220 538172 537734 538553 540993 544548 548631 553572 560153 568480 578202 589544
$$ packed form
59565D08356j834j516j080q63q56o48m2O70J045R62N97J64k26m71l68J98R82J477
59547D06547J490J459J987L070M005M111L526L212M142O325Q788J0690J2397J4943
59533D86692J8401K1294K1835J9338J4170P013j099q407j3012j4154j2604r767
59521E29700o640l547n69K011L659M147L974L902L975L567K422J085J5r97k153
59506E44551l117l737m575n983p243p506p095o894o905o397n293m305l747l206
59492D68548k460j833j533j376j223j078q07l94k61n53m29R37K900L984L995M139
59476D72556N068O108O764P612R007J0100R941Q728P126N168K626n9k046k915
59462E45784k834k207j523j048m38Q19K440L555M083M941O581Q327R722J1342
$$ plain form
59448 589544 603092 618583 634985 651954 670116 689487 708465 724869 737279 744917 747027 743197
59436 743197 733977 720624 704418 686519 668065 649958 632738 616873 602824 590521 579189 568113
59424 568113 557374 547570 539183 532606 528459 527350 529350 534041 540999 550042 561157 574532 590667
59411 590667 610237 633703 660841 690364 719964 746975 769087 784279 790502 786421 773049 754247
59399 754247 735074 719573 709910 706644 708902 714508 720694 724873 724546 716921 699782 673346 640992
59386 640992 607655 577220 551168 529174 510533 494976 482500 472910 465757 460609 457138 454917
59374 454917 453377 452069 450820 449557 448179 446771 445783 445766 446851 448589 450281 451468 452119 452430 452508 452406
59358 452406 452478 453371 455354 457829 459931 461624 463786 467192 471858 477546 484422 492854 502793 513726 525104
$$ packed form
59448E89544J3548J5491J6402J6969J8162J9371J8978J6404J2410P638K110l830
59436G43197r220j3353j6206j7899j8454j8107j7220j5865j4049j2303j1332j1076
59424E68113j0739r804q387o577m147j109K000M691O958R043J1115J3375J6135
59411E90667J9570K3466K7138K9523K9600K7011K2112J5192O223m081j3372j8802
59399G54247j9173j5501r663l266K258N606O186M179l27p625j7139k6436l2354
59386F40992l3337l0435k6052k1994j8641j5557j2476r590p153n148l471k221
59374D54917j540j308j249j263j378j408r88j7J085J738J692J187O51L11P8j02
59358D52406P2Q93J983K475K102J693K162L406M666N688O876Q432R939J0933J1378
$$ plain form
59343 525104 536681 548671 561819 576984 594198 612263 629597 645488 660284 674487 687997
59332 687997 700181 710304 717800 722375 724063 723118 719839 714556 707737 699935 691613 683054 674312 665121
59318 665121 655033 643951 632604 622230 613692 606888 601036 595374 589659 584157 579282 575177 571581
59305 571581 568144 564893 562347 561237 562116 565113 569857 575715 582312 589903 599137 610513 624270 640764
59291 640764 660575 683928 710095 737598 764808 789947 810463 822960 824516 814532 795411 771425
59279 771425 746753 724184 705053 689848 678645 671136 666651 664496 664320 665998 669192 673342 678224
59266 678224 684255 691904 700916 710447 719817 728777 737020 743956 749153 752654 754596 754784 752950 749212
59252 749212 744029 737827 730926 723645 716173 708441 700388 692306 684691 677852 671844 666713 662564 659515
$$ packed form
59343E25104J1577J1990J3148J5165J7214J8065J7334J5891J4796J4203J3510
59332F87997J2184J0123P496M575J688r45l279n283o819p802q322q559q742r191
59318F65121j0088j1082j1347j0374q538o804n852n662n715n502m875m105l596
59305E71581l437l251k546j110Q79K997M744N858O597P591R234J1376J3757J6494
59291F40764J9811K3353K6167K7503K7210K5139K0516J2497J556r984j9121k3986
59279G71425k4672k2569j9131j5205j1203p509m485k155j76J678L194M150M882
59266F78224O031P649R012R531R370Q960Q243O936N197L501J942J88j834l738
59252G49212n183o202o901p281p472p732q053q082p615o839o008n131m149l049
$$ plain form
59238 659515 657771 657501 658360 659292 659242 658082 656505 655152 654236 653919 654390 655324 655787 655070 653414 651539 649642
59221 649642 647122 643243 637838 631348 624341 616975 608845 599390 588552 577063 566052 556311 547896
59208 547896 540372 533377 526912 521059 515515 509706 503412 497072 491297 486263 481805 477921 474852 472621
59194 472621 470827 469038 467289 466059 465794 466467 467678 469260 471643 475340 480074 484759 488537 491515 494309
59179 494309 497250 500350 503678 507301 511059 514797 518611 522491 526037 529045 532159 536287 541496 547114
59165 547114 552857 559132 566144 573451 580667 588072 596163 604964 614020 622763 630708 637633 643704 649164
59151 649164 653847 657352 659637 660947 661189 660058 657895 655666 653690 651085 647042 642148 637812 634673
59137 634673 632189 629647 626980 624521 622389 620265 617692 614603 611637 609749 609364 610060 611137 612254 613415
$$ packed form
59238F59515j744k70Q59R32n0j160j577j353r16l17M71R34M63p17j656j875j897
59221F49642k520l879n405o490p007p366q130r455j0838j1489j1011r741q415
59208E47896p524o995o465n853n544n809o294o340n775n034m458l884l069k231
59194D72621j794j789j749j230k65O73J211J582K383L697M734M685L778K978K794
59179D94309K941L100L328L623L758L738L814L880L546L008L114M128N209N618
59165E47114N743O275P012P307P216P405Q091Q801R056Q743P945O925O071N460
59151F49164M683L505K285J310K42j131k163k229j976k605m043m894m336l139
59137F34673k484k542k667k459k132k124k573l089k966j888l85O96J077J117J161
$$ plain form
59122 613415 614696 616242 618343 621261 625154 630237 636711 644377 652655 661204 670200 679769 689519 699003
59108 699003 708328 717876 727579 736850 745197 752541 758966 764386 768495 770988 771947 772065 772288 773083 774172
59093 774172 774979 775054 774120 772219 770036 768632 768470 768909 768929 768031 766227 763555 760002 755677 750646 744791
59077 744791 738082 730709 722674 713558 703094 691701 680039 668281 656241 644021 632092 620916
59065 620916 610911 602565 596030 590653 585383 579714 573928 568496 563602 559208 555157 551156 546956 542600
59051 542600 538297 534145 530216 526740 523855 521277 518545 515571 512586 509632 506519 503351 500675 498974
59037 498974 498248 498175 498478 499023 499752 500648 501707 502920 504332 506048 508096 510375 512826 515576 518847 522888
59021 522888 527981 534183 540945 547357 553094 558876 565671 573605 581926 589722 596355 601433 604884 607049
$$ packed form
59122F13415J281J546K101K918L893N083O474P666Q278Q549Q996R569R750R484
59108F99003R325R548R703R271Q347P344O425N420M109K493R59J18K23P95J089
59093G74172Q07P5r34j901k183j404j62M39K0q98j804k672l553m325n031n855
59077G44791o709p373q035r116j0464j1393j1662j1758j2040j2220j1929j1176
59065F20916j0005q346o535n377n270n669n786n432m894m394m051m001m200m356
59051E42600m303m152l929l476k885k578k732k974k985k954l113l168k676j701
59037D98974p26p3L03N45P29Q96J059J213J412J716K048K279K451K750L271M041
59021E22888N093O202O762O412N737N782O795P934Q321P796O633N078L451K165
$$ plain form
59007 607049 608352 608917 608749 608105 607308 606355 605156 604098 603989 605359 608065 611503 614995 618151 621193 624831
58991 624831 629439 634416 638684 641640 643293 643657 642617 640431 637802 635210 632474 629128 624941 619976
58977 619976 614428 608607 602907 597694 593293 590038 588190 587838 589082 592205 597363 604152 611776 619737
58963 619737 628173 637469 647670 658264 668453 677691 686042 693906 701326 707730 712449 715162 715722 713913
58949 713913 709746 703641 695958 686593 675464 663132 650490 638119 626411 615964 607147 599396 591675
58936 591675 583708 576167 569602 563779 558215 552806 547643 542651 537698 532852 528369 524563 521660 519549
58922 519549 517735 515814 513904 512391 511424 510971 511113 511817 512682 513406 514328 515911 517927 519844 521791 524351
58906 524351 527601 531361 536269 543295 551975 560456 567988 576193 586909 599649 612358 624016 635275
$$ packed form
59007F07049J303N65j68o44p97r53j199j058j09J370K706L438L492L156L042L638
58991F24831M608M977M268K956J653L64j040k186k629k592k736l346m187m965
58977F19976n548n821n700n213m401l255j848l52J244L123N158O789P624P961
58963F19737Q436R296J0201J0594J0189R238Q351P864P420O404M719K713N60j809
58949G13913m167o105p683r365j1129j2332j2642j2371j1708j0447q817p751p721
58936E91675p967p541o565n823n564n409n163m992m953m846m483l806k903k111
58922E19549j814j921j910j513r67m53J42P04Q65P24R22J583K016J917J947K560
58906E24351L250L760M908P026Q680Q481P532Q205J0716J2740J2709J1658J1259
$$ plain form
58893 635275 646716 657808 667735 676369 684104 691457 699164 708175 719137 732112 746955 763644 781995
58880 781995 801284 820346 838033 853562 866629 877312 885686 891408 893737 892107 886667 878175 867430
58867 867430 854889 840884 826011 811083 796631 782632 768904 755587 743034 731347 720235
58856 720235 709316 698263 686737 674562 662083 650046 638896 628350 617775 606880 595948
58845 595948 585560 576214 568063 560870 554208 547779 541559 535710 530451 525925 522083 518687 515487 512285
58831 512285 508765 504527 499561 494532 490306 487263 485231 483879 482866 481832 480698 479806 479420 479193 478650
58816 478650 478066 478278 479629 481694 484107 487009 490470 494078 497470 500809 504381 508053 511469 514445 516916
58801 516916 518783 520066 520877 521002 519994 518046 516357 516008 516674 516962 515969 514021 511916 510015 508309 506985
$$ packed form
58893F35275J1441J1092R927Q634P735P353P707R011J0962J2975J4843J6689J8351
58880G81995J9289J9062J7687J5529J3067J0683Q374N722K329j630n440q492j0745
58867H67430j2541j4005j4873j4928j4452j3999j3728j3317j2553j1687j1112
58856G20235j0919j1053j1526j2175j2479j2037j1150j0546j0575j0895j0932
58845E95948j0388r346q151p193o662o429o220n849n259m526l842l396l200l202
58831E12285l520m238m966n029m226l043k032j352j013j034j134q92l86k27n43
58816D78650n84K12J351K065K413K902L461L608L392L339L572L672L416K976K471
58801E16916J867J283Q11J25j008j948j689l49O66K88r93j948k105j901j706j324
$$ plain form
58785 506985 506488 507072 508550 510597 513184 516584 520945 526024 531472 537241 543492 550113 556570 562251 566848
58770 566848 570313 572536 573102 571399 567126 560829 553716 546710 539815 532695 525674 519672 515135 511491
58756 511491 507880 504113 500674 497963 495828 493852 492010 490862 491004 492353 494213 496073 498052 500478
58742 500478 503372 506646 510445 514941 520028 525568 531659 538294 545070 551654 558215 564962 571633 577968
58728 577968 584234 590577 596229 600284 603029 605552 608125 610015 610973 611865 613540 615979 618848 622131 625796
58713 625796 629594 633592 638262 643679 649213 654352 659220 663934 668018 670823 672058 671598 669278 665131
58699 665131 659368 652006 643071 633170 623017 612256 599674 584954 569364 554346 540299 527197
58687 527197 515354 504925 495525 487119 480508 476055 472673 468965 464804 460930 457551 454264 450918 447629
$$ packed form
58785E06985m97N84J478K047K587L400M361N079N448N769O251O621O457N681M597
58770E66848L465K223N66j703m273o297p113p006o895p120p021o002m537l644
58756E11491l611l767l439k711k135j976j842j148J42J349J860J860J979K426
58742E00478K894L274L799M496N087N540O091O635O776O584O561O747O671O335
58728E77968O266O343N652M055K745K523K573J890R58Q92J675K439K869L283L665
58713F25796L798L998M670N417N534N139M868M714M084K805J235m60k320m147
58699F65131n763p362q935r901j0153j0761j2582j4720j5590j5018j4047j3102
58687E27197j1843j0429r400q406o611m453l382l708m161l874l379l287l346l289
$$ plain form
58673 447629 444311 441070 438670 437704 437620 437476 437406 438401 440907 444636 449635 456408 464838 473870 482538 490565
58657 490565 497762 503491 507030 508038 506527 502861 497915 492784 488076 483667 479181 474493 469885 465949
58643 465949 463226 461626 460359 458748 456931 455423 454243 452891 451056 448941 447017 445676 444912 444105 442475
58628 442475 440055 437756 436124 434553 432280 429633 427543 426229 425141 423988 423071 422800 423577 426001 430446
58613 430446 436528 443568 451412 460165 469422 478575 487689 497169 506595 514764 520969 525444 528542 530405
58599 530405 531583 533043 535136 537261 538937 540523 542408 544110 544776 544345 543717 543892 545201 547337 549976
58584 549976 553381 558271 564926 572658 580507 588259 596293 604616 612677 620127 627107 633599 639103 643220
58570 643220 646152 648354 650096 651646 653645 656956 662178 669292 677692 686687 696191 706807 718936 731968
$$ packed form
58673D47629l318l241k400r66q4j44p0R95K506L729M999O773Q430R032Q668Q027
58657D90565P197N729L539J008j511l666m946n131m708m409m486m688m608l936
58643D65949k723j600j267j611j817j508j180j352j835k115j924j341p64q07j630
58628D42475k420k299j632j571k273k647k090j314j088j153r17k71P77K424M445
58613D30446O082P040P844Q753R257R153R114R480R426Q169O205M475L098J863
58599E30405J178J460K093K125J676J586J885J702O66m31o28J75J309K136K639
58584E49976L405M890O655P732P849P752Q034Q323Q061P450O980O492N504M117
58570F43220K932K202J742J550J999L311N222P114Q400Q995R504J0616J2129J3032
$$ plain form
58556 731968 744762 756780 768287 779478 789915 798872 805773 810175 811732 810384 806452 800570 793673
58543 793673 786822 780600 774692 768386 761405 753954 746187 738083 729727 721186 712194 702470 692250 681977
58529 681977 671509 660293 648389 636748 626362 617652 610755 605774 602440 599988 597796 595901 594754
58516 594754 594695 595797 597903 600605 603398 606077 608841 611890 614994 617510 618899 619364 619979 621877 625164
58501 625164 628924 632400 635691 639020 641964 644090 645900 648321 651422 654362 656447 657513 657409 655956
58487 655956 653618 651436 650031 649160 648425 647893 647799 648153 648979 650614 653506 657799 663253 669475 676272 683869
58471 683869 692535 701784 710270 716873 721606 725040 727148 727351 725474 722066 717870 713567 709877 707242
58457 707242 705377 703728 702362 701917 702763 704769 707820 711900 716690 721696 726879 732560 738585 744122 748355
$$ packed form
58556G31968J2794J2018J1507J1191J0437Q957O901M402J557j348l932n882o897
58543G93673o851o222n908o306o981p451p767q104q356q541q992r724j0220j0273
58529F81977j0468j1216j1904j1641j0386q710o897m981l334k452k192j895j147
58516E94754n9J102K106K702K793K679K764L049L104K516J389M65O15J898L287
58501F25164L760L476L291L329K944K126J810K421L101K940K085J066j04j453
58487F55956k338k182j405q71p35n32r4L54Q26J635K892M293N454O222O797P597
58471F83869Q666R249Q486O603M733L434K108K03j877l408m196m303l690k635
58457G07242j865j649j366m45Q46K006L051M080M790N006N183N681O025N537M233
$$ plain form
58442 748355 750943 751748 750673 747993 744465 740969 738168 736421 735709 735761 736495 738170 740924 744503 748796
58427 748796 754079 760222 766142 770800 774381 777851 781756 786228 791706 798596 806383 813995 820998 827586
58413 827586 833540 838092 840858 842121 842191 841248 839762 838342 837176 836187 835511 835131 834451 833076 831670 831026
58397 831026 830657 829442 827522 826358 827001 829363 833035 837603 842171 845883 849021 852454 856049 858903 861112
58382 861112 863810 867281 870572 873355 876600 880769 884798 887716 890169 893475 898111 903902 910789 918603
58368 918603 926743 934773 942845 951085 959171 966912 974615 982604 991039 1000345 1010986 1022619 1034382
58355 1034382 1046215 1058834 1072128 1084768 1095858 1105914 1115663 1124970 1133568 1141828 1150002 1157597
58343 1157597 1164298 1170858 1178386 1187250 1197277 1208428 1220704 1233826 1247442 1261315 1275147 1288755
$$ packed form
58442G48355K588Q05j075k680l528l496k801j747p12N2P34J675K754L579M293
58427G48796N283O143N920M658L581L470L905M472N478O890P787P612P003O588
58413H27586N954M552K766J263P0r43j486j420j166r89o76l80o80j375j406o44
58397H31026l69j215j920j164O43K362L672M568M568L712L138L433L595K854K209
58382H61112K698L471L291K783L245M169M029K918K453L306M636N791O887P814
58368I18603Q140Q030Q072Q240Q086P741P703P989Q435R306J0641J1633J1763
58355A034382J1833J2619J3294J2640J1090J0056R749R307Q598Q260Q174P595
58343A157597O701O560P528Q864J0027J1151J2276J3122J3616J3873J3832J3608
$$ plain form
58331 1288755 1302512 1317013 1332297 1348099 1364785 1383055 1402671 1422397 1441299 1459190 1475908
58320 1475908 1491334 1506184 1521538 1537393 1552888 1568030 1583781 1600202 1615974 1630329 1644092
58309 1644092 1658319 1673112 1688330 1704297 1721214 1738955 1757867 1778715 1801450 1825083 1848973
58298 1848973 1873123 1897172 1920548 1943797 1968185 1993715 2019144 2044269 2070441 2098391 2127310
58287 2127310 2156640 2186966 2218509 2250564 2283167 2317549 2354176 2392071 2430836 2471496 2514514
58276 2514514 2558876 2604072 2651094 2700409 2750806 2801462 2853447 2908009 2965069 3024457 3086891
58265 3086891 3152533 3220292 3289653 3361539 3436376 3513234 3592009 3674451 3761699 3852730 3946605
58254 3946605 4044264 4146609 4252737 4361663 4473999 4590409 4710175 4832863 4959727 5092027
$$ packed form
58331A288755J3757J4501J5284J5802J6686J8270J9616J9726J8902J7891J6718
58320A475908J5426J4850J5354J5855J5495J5142J5751J6421J5772J4355J3763
58309A644092J4227J4793J5218J5967J6917J7741J8912K0848K2735K3633K3890
58298A848973K4150K4049K3376K3249K4388K5530K5429K5125K6172K7950K8919
58287B127310K9330L0326L1543L2055L2603L4382L6627L7895L8765M0660M3018
58276B514514M4362M5196M7022M9315N0397N0656N1985N4562N7060N9388O2434
58265C086891O5642O7759O9361P1886P4837P6858P8775Q2442Q7248R1031R3875
58254C946605R7659J02345J06128J08926J12336J16410J19766J22688J26864J32300
$$ plain form
58244 5092027 5229744 5373247 5524310 5683988 5851427 6026222 6210008 6404348 6609148
58235 6609148 6824639 7052733 7294855 7550665 7820476 8106651 8411167 8734285 9077298
58226 9077298 9443996 9837589 10258766 10708555 11190462 11708100 12263672 12860742 13505596
58217 13505596 14203970 14959636 15778385 16670235 17645700 18713498 19884386 21173997 22599867
58208 22599867 24179838 25936476 27899912 30104780 32589817 35404886 38616277 42304830
58200 42304830 46566200 51519196 57313045 64127308 72172126 81692475 92967746 106304646
58192 106304646 122031807 140489097 161985173 186706876 214581620 245097226 277117693
58185 277117693 308808488 337787882 361482342 377538367 384202017 380693462 367524229
$$ packed form
58244E092027J37717J43503J51063J59678J67439J74795J83786J94340K04800
58235F609148K15491K28094K42122K55810K69811K86175L04516L23118L43013
58226I077298L66698L93593M21177M49789M81907N17638N55572N97070O44854
58217A3505596O98374P55666Q18749Q91850R75465J067798J170888J289611J425870
58208B2599867J579971J756638J963436K204868K485037K815069L211391L688553
58200D2304830M261370M952996N793849O814263Q044818R520349J1275271J3336900
58192A06304646J5727161J8457290K1496076K4721703K7874744L0515606L2020467
58185B77117693L1690795K8979394K3694460J6056025O663650l508555j3169233
$$ plain form
58178 367524229 346520082 320386280 292011757 263905482 237932449 215216073 196100101
58171 196100101 180248776 166916111 155213980 144243399 133199817 121593784 109458548
58164 109458548 97287671 85705468 75160295 65850247 57804670 50955073 45164593
58157 45164593 40267958 36116169 32585259 29562430 26949259 24674898 22689458 20946742
58149 20946742 19404033 18031899 16810064 15715457 14723566 13817822 12988237 12223538 11512632
58140 11512632 10850993 10238012 9670201 9143032 8656379 8211666 7805949 7434257 7094996
58131 7094996 6787416 6506240 6244199 5997602 5764521 5540062 5318936 5101127 4890331
58122 4890331 4688358 4495280 4313057 4144189 3987822 3841125 3703453 3575658 3456656
$$ packed form
58178C67524229k1004147k6133802k8374523k8106275k5973033k2716376j9115972
58171A96100101j5851325j3332665j1702131j0970581j1043582j1606033j2135236
58164A09458548j2170877j1582203j0545173r310048q045577o849597n790480
58157D5164593m896635m151789l530910l022829k613171k274361j985440j742716
58149B0946742j542709j372134j221835j094607r91891r05744q29585p64699p10906
58140A1512632o61639o12981n67811n27169m86653m44713m05717l71692l39261
58131G094996l07580k81176k62041k46597k33081k24459k21126k17809k10796
58122D890331k01973j93078j82223j68868j56367j46697j37672j27795j19002
$$ plain form
58113 3456656 3344224 3237978 3138323 3043762 2952394 2864778 2782360 2704431 2629438 2557743 2490125
58102 2490125 2425103 2360783 2297970 2238443 2181521 2125360 2070399 2018438 1969359 1921710 1875589
58091 1875589 1832110 1790845 1750494 1711388 1674717 1640077 1606203 1573385 1542716 1513653 1484651
58080 1484651 1455490 1426812 1398170 1368740 1339179 1310587 1282524 1254250 1226994 1202544 1180325
58069 1180325 1158256 1135904 1114445 1094087 1073944 1054182 1036014 1019700 1004497 990307 977511
58058 977511 965468 953023 940260 928055 916299 904239 892118 880697 869566 857634 844901
58047 844901 832200 819700 807355 796114 786845 778556 769622 760307 752179 745383 738533 731031 723554
58034 723554 716286 708573 700417 692594 685137 677164 668293 658900 649105 638883 628978 620236 612206 603782
$$ packed form
58113C456656j12432j06246r9655r4561r1368q7616q2418p7929p4993p1695o7618
58102B490125o5022o4320o2813n9527n6922n6161n4961n1961m9079m7649m6121
58091A875589m3479m1265m0351l9106l6671l4640l3874l2818l0669k9063k9002
58080A484651k9161k8678k8642k9430k9561k8592k8063k8274k7256k4450k2219
58069A180325k2069k2352k1459k0358k0143j9762j8168j6314j5203j4190j2796
58058I77511j2043j2445j2763j2205j1756j2060j2121j1421j1131j1932j2733
58047H44901j2701j2500j2345j1241r269q289q934r315q128o796o850p502p477
58034G23554p268p713q156p823p457p973q871r393r795j0222r905q742q030q424
$$ plain form
58020 603782 595035 587032 580092 573676 567718 562561 557814 552818 548041 544461 541756 538692 535133 532058
58006 532058 529671 527207 524599 522705 521777 521284 521286 522346 523956 524766 524676 525072 526602 528285 529313 530220 531628
57989 531628 533205 534551 535895 537198 537548 536166 533255 529441 525154 520815 516715 512341 506756 500044
57975 500044 493503 488077 483469 479199 475555 472917 470874 468616 465725 462186 458117 453836 449803 446253
57961 446253 443212 440873 439473 438803 438387 438090 437999 437763 436740 434820 432455 429899 427103 424350 422277 421099
57945 421099 420344 419465 418307 417044 416099 415940 416474 416906 416796 416846 417926 419646 420855 421338 422012 423496 425372
57928 425372 426941 427876 428052 427483 426505 425379 423808 421471 418913 417135 416380 416112 416067 416462 417118 417203 416022
57911 416022 413499 409910 405751 401762 398381 395174 391383 386838 381811 376285 370100 363428 356326 348240
$$ packed form
58020F03782q747q003o940o416n958n157m747m996m777l580k705l064l559l075
58006E32058k387k464k608j894r28m93KJ060J610Q10r0L96J530J683J028R07J408
57989E31628J577J346J344J303L50j382k911l814m287m339m100m374n585o712
57975E00044o541n426m608m270l644k638k043k258k891l539m069m281m033l550
57961D46253l041k339j400o70m16k97r1k36j023j920k365k556k796k753k073j178
57945D21099p55q79j158j263r45j59N34M32j10N0J080J720J209M83O74J484J876
57928D25372J569R35J76n69r78j126j571k337k558j778p55k68m5L95O56Q5j181
57911D16022k523l589m159l989l381l207l791m545n027n526o185o672p102q086
$$ plain form
57897 348240 338986 329825 322405 316788 311649 306309 301339 297200 293578 290292 287765 286277 285649 285884 287192
57882 287192 289253 291321 293202 295264 297448 299268 300934 303438 307301 312094 317292 322632 327530 331285
57868 331285 334081 336805 339599 341674 342715 343271 343366 341952 338431 333702 329026 324755 320795 317471 315140
57853 315140 313538 312163 310892 309794 308895 308462 308933 310220 311718 313302 315642 319200 323679 328759 334586
57838 334586 341059 347436 353191 358583 363816 368276 371213 372665 373192 373099 372352 370820 368302 364756 360781
57823 360781 357347 354803 352703 350741 349110 347693 345832 343360 341048 339447 338081 336454 335131 334990
57809 334990 335906 336960 337649 338141 338494 338217 336586 333170 328177 322407 316549 310468 303650 296373 289731
57794 289731 284285 279413 274256 268580 262385 255580 248577 242439 237724 233824 230037 226636 224135 222138
$$ packed form
57897C48240r254r161p420n617n139n340m970m139l622l286k527j488o28K35J308
57882B87192K061K068J881K062K184J820J666K504L863M793N198N340M898L755
57868C31285K796K724K794K075J041N56R5j414l521m729m676m271l960l324k331
57853C15140j602j375j271j098q99m33M71J287J498J584K340L558M479N080N827
57838C34586O473O377N755N392N233M460K937J452N27r3p47j532k518l546l975
57823C60781l434k544k100j962j631j417j861k472k312j601j366j627j323j41
57809C34990R16J054O89M92L53k77j631l416m993n770n858o081o818p277o642
57794B89731n446m872n157n676o195o805p003o138m715l900l787l401k501j997
$$ plain form
57780 222138 219839 217300 215399 214700 215047 216103 217658 219515 221548 223731 225799 227218 227910 228701 230533
57765 230533 233529 237202 241305 246029 251639 258277 265775 273410 280343 286724 293725 301876 309943 316181
57751 316181 320284 323279 325884 327881 328898 328900 327868 325884 323656 322196 321660 321040 319287 316364 312961
57736 312961 309533 305973 302057 297960 294258 291448 289526 288175 287327 287271 288098 289445 291005 292982 295615
57721 295615 298492 300787 302175 303201 304693 306948 309458 311273 311731 311007 309898 309027 308398 307722 306922 306147
57705 306147 305509 304963 304354 303546 302663 302209 302667 303942 305492 307047 308875 311281 314143 317016 319407 320976
57689 320976 321783 322291 322733 322601 321238 318869 316375 314105 311741 309464 308375 309401 312534 317567 324879
57674 324879 335046 348370 365433 387563 416115 451750 495005 547040 608978 680375 758429
$$ packed form
57780B22138k299k539j901o99L47J056J555J857K033K183K068J419O92P91J832
57765B30533K996L673M103M724N610O638P498P635O933O381P001Q151Q067O238
57751C16181M103K995K605J997J017Kj032j984k228j460n36o20j753k923l403
57736C12961l428l560l916m097l702k810j922j351q48n6Q27J347J560J977K633
57721B95615K877K295J388J026J492K255K510J815M58p24j109q71o29o76q00p75
57705C06147o38n46o09q08q83m54M58J275J550J555J828K406K862K873K391J569
57689C20976Q07N08M42j32j363k369k494k270k364k277j089J026L133N033P312
57674C24879J0167J3324J7063K2130K8552L5635M3255N2035O1938P1397P8054
$$ plain form
57663 758429 838095 912415 973264 1012890 1025658 1009306 965860 901897 826924 750069 677590
57652 677590 612812 557180 510680 472180 440506 415094 395247 379422 366084 354881 346172 339792
57640 339792 335003 331327 328613 326591 325159 324837 326055 328187 330111 331583 333184 335043 336538 337323 337784
57625 337784 338317 338875 339343 339682 339580 338641 337119 335779 334858 333740 331909 329683 327749 326395 325455 324635
57609 324635 323716 322819 322558 323475 325119 326113 325434 323421 321384 320425 320682 321422 321689 321049 319797 318439 317124
57592 317124 315750 314360 313073 311784 310378 309083 308148 307260 305782 303599 301245 299221 297622 296423 295592
57577 295592 294785 293489 291736 290338 290103 290913 291701 291266 289269 286667 285054 285199 286317 287077 287137 287224 287938
57560 287938 289146 290547 292054 293390 293972 293637 293050 293020 293739 294990 296729 299012 301613 304127 306385 308439
$$ packed form
57663G58429P9666P4320O0849L9626J2768j6352m3446o3963p4973p6855p2479
57652F77590o4778n5632m6500l8500l1674k5412j9847j5825j3338j1203q709o380
57640C39792m789l676k714k022j432l22J218K132J924J472J601J859J495P85M61
57625C37784N33N58M68L39j02r39j522j340r21j118j831k226j934j354r40q20
57609C24635r19q97k61R17J644R94o79k013k037r59K57P40K67o40j252j358j315
57592C17124j374j390j287j289j406j295r35q88j478k183k354k024j599j199q31
57577B95592q07j296j753j398k35Q10P88m35j997k602j613J45J118P60O0Q7P14
57560B87938J208J401J507J336N82l35n87l0P19J251J739K283K601K514K258K054
$$ plain form
57544 308439 310250 311697 312904 314278 316125 318323 320391 321889 322816 323704 325282 327934 331375 334804 337371
57529 337371 338681 339001 339004 339223 339771 340531 341435 342441 343463 344532 345884 347648 349493 350806 351264 351167 351270
57512 351270 352351 354689 357819 360929 363657 366297 369092 371662 373484 374743 376273 378706 381968 385548
57498 385548 388949 391933 394602 397234 399842 401990 403288 403942 404530 405317 406109 406757 407501 408746 410656 412883
57482 412883 414670 415458 415642 416505 419041 422946 427006 430270 432631 434533 436544 439018 441719 443881 444984
57467 444984 445353 445703 446368 447373 449008 451610 454924 458301 461541 464937 468518 471980 475508 479865 485300
57452 485300 490862 495338 498500 501058 503663 506435 509330 512543 516404 521028 526176 531416 536438 541210
57438 541210 545857 550503 555263 560165 564963 569285 573163 577175 581736 586529 590989 595087 599122 602984
$$ packed form
57544C08439J811J447J207J374J847K198K068J498R27Q88J578K652L441L429K567
57529C37371J310L20LK19N48P60R04J006J022J069J352J764J845J313M58r7J03
57512C51270J081K338L130L110K728K640K795K570J822J259J530K433L262L580
57498C85548L401K984K669K632K608K148J298O54N88P87P92O48P44J245J910K227
57482D12883J787P88J84Q63K536L905M060L264K361J902K011K474K701K162J103
57467D44984L69L50O65J005J635K602L314L377L240L396L581L462L528M357N435
57452D85300N562M476L162K558K605K772K895L213L861M624N148N240N022M772
57438E41210M647M646M760M902M798M322L878M012M561M793M460M098M035L862
$$ plain form
57424 602984 606311 609427 613370 618721 624880 630804 636096 641124 646397 652092 657986 663605 668591 673051
57410 673051 677409 681895 686448 691150 696405 702467 709055 715634 721908 727951 734036 740526 747678 755320
57396 755320 762832 769735 776225 782939 790171 797494 804262 810351 816225 822301 828554 834953 842008 850421
57382 850421 860172 870393 880237 889464 898095 906033 913394 920701 928249 935585 942074 947769 953248 958861
57368 958861 964575 970386 976383 982577 989060 996123 1003787 1011500 1018845 1026289 1034609 1043825 1053339 1062932
57354 1062932 1072818 1082843 1092526 1101935 1111718 1122046 1132352 1142322 1152378 1162825 1173226 1183158
57342 1183158 1193007 1203482 1214655 1225960 1236898 1247409 1257720 1268135 1278826 1289706 1300623
57331 1300623 1311680 1323112 1334926 1347013 1359485 1372401 1385214 1397185 1408420 1419805 1431759
$$ packed form
57424F02984L327L116L943N351O159N924N292N028N273N695N894N619M986M460
57410F73051M358M486M553M702N255O062O588O579O274O043O085O490P152P642
57396G55320P512O903O490O714P232P323O768O089N874O076O253O399P055Q413
57382H50421R751J0221R844R227Q631P938P361P307P548P336O489N695N479N613
57368I58861N714N811N997O194O483P063P664P713P345P444Q320R216R514R593
57354A062932R886J0025R683R409R783J0328J0306R970J0056J0447J0401R932
57342A183158R849J0475J1173J1305J0938J0511J0311J0415J0691J0880J0917
57331A300623J1057J1432J1814J2087J2472J2916J2813J1971J1235J1385J1954
$$ plain form
57320 1431759 1443807 1455674 1468035 1481566 1495858 1509889 1523222 1536126 1548841 1561355 1573779
57309 1573779 1586424 1599488 1612969 1626776 1640703 1654521 1668367 1682837 1698322 1714492 1730742
57298 1730742 1746921 1763167 1779226 1794459 1808622 1822235 1836052 1850414 1865230 1880313 1895573
57287 1895573 1910953 1926379 1941815 1957312 1972923 1988564 2004087 2019482 2034885 2050288 2065458
57276 2065458 2080340 2095325 2110827 2126740 2142671 2158633 2175063 2192156 2209577 2226921 2244088
57265 2244088 2261037 2277482 2293066 2307716 2321795 2335973 2350851 2366480 2382257 2397550 2412321
57254 2412321 2426948 2441654 2456436 2471353 2486382 2501125 2515135 2528501 2541653 2554733 2567660
57243 2567660 2580697 2594218 2607949 2621168 2633834 2646809 2660724 2675190 2689423 2703108 2716371
$$ packed form
57320A431759J2048J1867J2361J3531J4292J4031J3333J2904J2715J2514J2424
57309A573779J2645J3064J3481J3807J3927J3818J3846J4470J5485J6170J6250
57298A730742J6179J6246J6059J5233J4163J3613J3817J4362J4816J5083J5260
57287A895573J5380J5426J5436J5497J5611J5641J5523J5395J5403J5403J5170
57276B065458J4882J4985J5502J5913J5931J5962J6430J7093J7421J7344J7167
57265B244088J6949J6445J5584J4650J4079J4178J4878J5629J5777J5293J4771
57254B412321J4627J4706J4782J4917J5029J4743J4010J3366J3152J3080J2927
57243B567660J3037J3521J3731J3219J2666J2975J3915J4466J4233J3685J3263
$$ plain form
57232 2716371 2729401 2742387 2755440 2768348 2780762 2792740 2804676 2816572 2827876 2838210 2847817
57221 2847817 2857179 2866706 2876786 2887519 2898261 2908144 2917267 2926691 2937067 2947977 2958910 2970041
57209 2970041 2981583 2993169 3004480 3015889 3027925 3040578 3053605 3066903 3080082 3092282 3103116
57198 3103116 3113349 3123996 3135061 3145637 3154937 3162854 3169965 3177395 3186035 3195391 3203793 3210290 3215691
57185 3215691 3221159 3226537 3230979 3234513 3237834 3240982 3243445 3245466 3248126 3251980 3256544 3261249 3266071 3270936
57171 3270936 3275284 3278597 3280886 3282383 3283116 3283026 3282216 3280863 3279097 3277091 3275131 3273521 3272370 3271437 3270246
57156 3270246 3268646 3267168 3266435 3266259 3265901 3265237 3264804 3264443 3262902 3259434 3254906 3250455 3245721 3239409 3231005
57141 3231005 3220835 3208804 3194327 3177476 3159182 3140252 3121025 3102027 3084055 3067421 3051874
$$ packed form
57232B716371J3030J2986J3053J2908J2414J1978J1936J1896J1304J0334R607
57221B847817R362R527J0080J0733J0742R883R123R424J0376J0910J0933J1131
57209B970041J1542J1586J1311J1409J2036J2653J3027J3298J3179J2200J0834
57198C103116J0233J0647J1065J0576R300P917P111P430Q640R356Q402O497N401
57185C215691N468N378M442L534L321L148K463K021K660L854M564M705M822M865
57171C270936M348L313K289J497P33r0q10j353j766k006j960j610j151r33j191
57156C270246j600j478p33j76l58o64m33l61j541l468m528m451m734o312q404
57141C231005j0170j2031j4477j6851j8294j8930j9227j8998j7972j6634j5547
$$ plain form
57130 3051874 3037457 3024847 3014717 3007272 3002477 3000211 3000188 3002152 3006133 3012057 3019301 3027114 3035260 3043778
57116 3043778 3052569 3062033 3073777 3089713 3110582 3136260 3167319 3205165 3250643 3303772 3365278 3437542
57104 3437542 3523713 3626918 3750906 3900839 4083026 4304422 4572801 4896921 5286284 5751143
57094 5751143 6302482 6950620 7702682 8561235 9524733 10587649 11739070 12961643 14232472
57085 14232472 15524347 16805010 18035246 19168804 20156174 20951896 21523193 21855982 21954550
57076 21954550 21835001 21517129 21019676 20360088 19556600 18630219 17605321 16508668 15367778
57067 15367778 14209842 13061058 11945199 10881505 9883583 8959943 8114879 7348771 6658633
57058 6658633 6039474 5485561 4990783 4548866 4154006 3801193 3485808 3203367 2949932
$$ packed form
57130C051874j4417j2610j0130p445m795k266k3J964L981N924P244P813Q146Q518
57116C043778Q791R464J1744J5936K0869K5678L1059L7846M5478N3129O1506P2264
57104C437542Q6171J03205J23988J49933J82187K21396K68379L24120L89363M64859
57094E751143N51339O48138P52062Q58553R63498J062916J151421J222573J270829
57085A4232472J291875J280663J230236J133558R87370P95722N71297L32789R8568
57076B1954550j19549l17872m97453o59588q03488r26381j024898j096653j140890
57067A5367778j157936j148784j115859j063694r97922r23640q45064p66108o90138
57058F658633o19159n53913m94778m41917l94860l52813l15385k82441k53435
$$ plain form
57049 2949932 2722293 2517408 2332137 2163822 2010659 1871100 1743408 1626218 1519045
57040 1519045 1421693 1333439 1253253 1180432 1114478 1054610 999956 950160 905423 865996 831888
57029 831888 802941 778940 759785 745730 737337 735324 740825 755774 782480 822648 877223 946872
57017 946872 1031487 1128699 1233441 1338563 1434026 1505029 1534172 1509838 1434310 1323061 1195801
57006 1195801 1068059 949086 843722 753761 678431 615499 562669 518108 480376 448514 421916
56995 421916 399708 380577 363491 348206 334724 322739 312014 302866 295629 289969 285344 281935
56983 281935 280428 280783 281796 282004 280592 277341 272243 265497 257574 248875 239469 229423 219256 209793
56969 209793 201617 194909 189730 186180 184313 184153 185804 189289 194293 200384 207597 216436 227115 238989
$$ packed form
57049B949932k27639k04885j85271j68315j53163j39559j27692j17190j07173
57040A519045r7352q8254q0186p2821o5954n9868n4654m9796m4737l9427l4108
57029H31888k8947k4001j9155j4055q393k013N501J4949K6706M0168N4575O9649
57017I46872Q4615R7212J04742J05122R5463P1003K9143k4334p5528j11249j27260
57006A195801j27742j18973j05364q9961p5330o2932n2830m4561l7732l1862k6598
56995D21916k2208j9131j7086j5285j3482j1985j0725r148p237n660m625l409
56983B81935j507L55J013K08j412l251n098o746p923q699r406j0046j0167r463
56969B09793q176o708n179l550j867j60J651L485N004O091P213Q839J0679J1874
$$ plain form
56955 238989 250899 261776 270749 276979 279850 279263 275529 269100 260593 250852 240624 230363 220566
56942 220566 212052 205467 200744 197535 196047 196935 200487 206452 214610 224919 237064 250458 264763
56929 264763 279742 294415 306950 315691 319807 318851 312451 300927 285699 268618 251196 234650
56917 234650 219972 207319 195875 185006 175189 167221 160837 154940 149055 143762 139604 136251 133034
56904 133034 129767 126730 124106 121745 119494 117648 116985 118139 120841 124034 126997 130169 134632 141026
56890 141026 149304 159250 170694 183251 196328 209470 222361 234431 244814 252800 258046 260314
56878 260314 259332 255175 248666 241220 234255 228630 224529 221887 220979 222418 226537 233048 241651 252766
56864 252766 267235 285436 307099 331949 359909 390403 421766 451650 477794 498299 511490
$$ packed form
56955B38989J1910J0877Q973O230K871n87l734o429q507r741j0228j0261r797
56942B20566q514o585m723l209j488Q88L552N965Q158J0309J2145J3394J4305
56929B64763J4979J4673J2535Q741M116r56o400j1524j5228j7081j7422j6546
56917B34650j4678j2653j1444j0869r817p968o384n897n885n293m158l353l217
56904A33034l267l037k624k361k251j846o63J154K702L193K963L172M463O394
56890A41026Q278R946J1444J2557J3077J3142J2891J2070J0383P986N246K268
56878B60314r82m157o509p446o965n625m101k642r08J439M119O511Q603J1115
56864B52766J4469J8201K1663K4850K7960L0494L1363K9884K6144K0505J3191
$$ plain form
56853 511490 516081 511704 499273 480848 459114 436668 415450 396641 381139 369976 364119 363871
56841 363871 368758 378294 392837 413414 440611 473830 511867 554025 600216 649694 699763 745802
56829 745802 782591 805824 812971 803479 778730 741930 697601 650418 603948 560295 520806 486699
56817 486699 458810 437240 421825 412799 410501 414631 424523 440168 462206 490592 523796 559476
56805 559476 595244 628270 654829 671163 674975 665927 645087 614408 576588 534869 492659 453097
56793 453097 418413 389297 365138 345255 329720 318853 312421 309901 311218 316638 326071 338948
56781 338948 354597 372090 389730 405269 416833 423277 423689 417182 403535 383751 359697 333215
56769 333215 305730 278500 252936 230390 211478 195707 182061 169966 159431 150277 141844 133745
$$ packed form
56853E11490M591m377j2431j8425k1734k2446k1218j8809j5502j1163n857k48
56841C63871M887R536J4543K0577K7197L3219L8037M2158M6191M9478N0069M6039
56829G45802L6789K3233P147r492k4749l6800m4329m7183m6470m3653l9489l4107
56817D86699k7889k1570j5415r026k298M130R892J5645K2038K8386L3204L5680
56805E59476L5768L3026K6559J6334L812r048k0840l0679l7820m1719m2210l9562
56793D53097l4684k9116k4159j9883j5535j0867o432k520J317N420R433J2877
56781C38948J5649J7493J7640J5539J1564O444M12o507j3647j9784k4054k6482
56769C33215k7485k7230k5564k2546j8912j5771j3646j2095j0535r154q433q099
$$ plain form
56757 133745 126402 120376 115513 111278 107561 104510 101791 98767 95405 92400 90281 88935 88062 87585 87432
56742 87432 87362 87176 86770 85919 84367 82247 80134 78622 78044 78484 79670 80908 81510 81320 80537 79253 77709
56725 77709 76766 77279 78899 80205 80287 79593 79083 79293 80464 82695 85405 87367 88038 88355 89484 91168 92105
56708 92105 91734 90800 90232 90229 90538 90939 91223 91193 90968 90887 90918 90582 89674 88737 88494 89046 89921 90729 91431 92022 92256
56687 92256 91858 90907 89917 89499 89863 90631 91228 91511 91919 92885 94200 95159 95335 95033 94828 94851 94678 93866 92389
56668 92389 90529 88644 87191 86725 87522 89165 90753 91660 92001 92320 92959 93794 94435 94571 94173 93554 93222
56651 93222 93537 94434 95513 96460 97326 98295 99305 100110 100779 101829 103596 105601 106935 107263 107108 107012 106837
56634 106837 106197 105318 105001 105710 107062 108398 109638 111357 114003 117195 119962 121706 122778 123900 125178
$$ packed form
56757A33745p343o026m863m235l717l051k719l024l362l005k119j346q73m77j53
56742H7432p0j86m06q51j552k120k113j512n78M40J186J238O02j90p83j284j544
56725G7709r43N13J620J306Q2o94n10K10J171K231K710J962O71L17J129J684R37
56708I2105l71r34n68lL09M01K84l0k25q1L1l36r08r37k43N52Q75Q08P02N91K34
56687I2256l98r51r90m18L64P68N97K83M08R66J315R59J76l02k05K3j73q12j477
56668I2389j860j885j453m66P97J643J588R07L41L19O39Q35O41J36l98o19l32
56651I3222L15Q97J079R47Q66R69J010Q05O69J050J767K005J334L28j55r6j75
56634A06837o40q79l17P09J352J336J240J719K646L192K767J744J072J122J278
$$ plain form
56619 125178 125995 125928 125382 125168 125733 126980 128501 129764 130359 130422 130576 131120 131560 131329 130696 130461 130914 131674
56601 131674 132434 133225 133881 133948 133419 132996 133215 133677 133601 132890 132258 132374 133259 134543 136027 137826 139993 142124
56583 142124 143460 143487 142308 140319 137730 134726 132010 130646 131144 132952 135052 136814 138164 139246 140234
56568 140234 141309 142549 143863 145204 146749 148770 151425 154854 159316 165022 171813 179075 186008 192040
56554 192040 197104 201495 205253 207760 208268 206919 204860 203127 201737 200097 197988 195712 193488 191251
56540 191251 189029 187052 185320 183440 181113 178582 176393 174827 173729 172760 171638 170191 168340 166140
56526 166140 163785 161563 159765 158579 158007 157883 157956 157997 157905 157772 157783 157933 157912 157370 156280 154873 153281 151497
56508 151497 149764 148628 148382 148671 148979 149335 150094 151076 151434 150623 149097 147797 147258 147470 148293 149533 150790
$$ packed form
56619A25178Q17o7n46k14N65J247J521J263N95O3J54N44M40k31o33k35M53P60
56601A31674P60P91O56O7n29m23K19M62p6p11o32J16Q85J284J484J799K167K131
56583A42124J336K7j179j989k589l004k716j364M98J808K100J762J350J082R88
56568A40234J075J240J314J341J545K021K655L429M462N706O791P262O933O032
56554A92040N064M391L758K507N08j349k059j733j390j640k109k276k224k237
56540A91251k222j977j732j880k327k531k189j566j098r69j122j447j851k200
56526A66140k355k222j798j186n72j24P3M1r2j33J1J50k1n42j090j407j592j784
56508A51497j733j136k46K89L08L56P59R82L58q11j526j300n39K12Q23J240J257
$$ plain form
56491 150790 151705 152302 152749 152831 152105 150608 148963 147705 146858 146290 146088 146335 146879 147593 148642 150206 152071
56474 152071 153705 154671 154897 154683 154506 154642 154940 155145 155445 156388 158225 160634 163111 165246 166590 166825 166344
56457 166344 166206 167147 168918 170785 172259 173144 173413 173503 174240 175927 177859 179184 179900 180447 180775 180544 179937
56440 179937 179530 179435 179305 179096 179100 179146 178494 176716 174226 171810 170087 169443 169924 171008 171945 172502 173002 173599
56422 173599 174013 174109 174223 174620 175056 175166 175004 174940 175176 175549 175651 175107 173941 172723 172158 172505 173524 174855
56404 174855 176166 177039 177147 176579 175720 174878 174307 174392 175312 176552 177206 176809 175523 173637 171400 169303 167913
56387 167913 167306 167087 166951 166795 166350 165297 163838 162587 161895 161821 162684 164861 167937 170941 173689 177171
56371 177171 182235 188619 195563 202564 209040 214092 217431 220008 222912 225977 228202 229241 229693 230053 230142
$$ packed form
56491A50790R15N97M47Q2p26j497j645j258q47n68k02K47N44P14J049J564J865
56474A52071J634R66K26k14j77J36K98K05L00R43J837K409K477K135J344K35m81
56457A66344j38R41J771J867J474Q85K69R0P37J687J932J325P16N47L28k31o07
56440A79937m07r5j30k09MM6o52j778k490k416j723o44M81J084R37N57N00N97
56422A73599M14R6J14L97M36J10j62o4K36L73J02n44j166j218n65L47J019J331
56404A74855J311Q73J08n68q59q42n71Q5R20J240O54l97j286j886k237k097j390
56387A67913o07k19j36j56m45j053j459j251o92p4Q63K177L076L004K748L482
56371A77171N064O384O944P001O476N052L339K577K904L065K225J039M52L60Q9
$$ plain form
56356 230142 229672 228857 228212 228050 228294 228577 228527 228062 227472 227159 227442 228524 230330 232283 233576 233936 233968 234581
56338 234581 236175 238395 240440 241704 242472 243889 246778 250532 253805 256267 258889 262283 265641 267839
56324 267839 268927 269882 271410 273584 276226 278956 281081 282084 282142 281805 281348 280761 280117 279599 279382 279730 280860
56307 280860 282452 283722 284296 284591 285036 285509 286021 287306 290011 293704 297378 300635 303667 306402 308445
56292 308445 309724 310563 311177 311614 311996 312349 312453 312425 313163 315513 319224 323320 327225 330841 333911 336277
56276 336277 338589 341718 345488 348983 352203 356284 361756 367639 372890 377882 383678 390477 397659 405048
56262 405048 413235 422577 432547 442349 451921 462102 473830 487270 501793 516844 532718 550361
56250 550361 570517 593360 618866 647268 679060 714784 754865 799463 848521 902110 960603
$$ packed form
56356B30142m70q15o45j62K44K83n0m65n90l13K83J082J806J953J293L60L2O13
56338B34581J594K220K045J264P68J417K889L754L273K462K622L394L358K198
56324B67839J088R55J528K174K642K730K125J003N8l37m57n87o44n18k17L48J130
56307B80860J592J270N74K95M45M73N12J285K705L693L674L257L032K735K043
56292C08445J279Q39O14M37L82L53J04k8P38K350L711M096L905L616L070K366
56276C36277K312L129L770L495L220M081N472N883N251M992N796O799P182P389
56262D05048Q187R342R970R802R572J0181J1728J3440J4523J5051J5874J7643
56250E50361K0156K2843K5506K8402L1792L5724M0081M4598M9058N3589N8493
$$ plain form
56239 960603 1024198 1092319 1163807 1237640 1313071 1388991 1463587 1534874 1601236 1661200 1712897
56228 1712897 1754127 1783073 1798881 1801563 1791524 1769325 1735987 1693253 1643179 1587328 1526661
56217 1526661 1462367 1396459 1331100 1267433 1205388 1144715 1086000 1030649 979961 934171 892294
56206 892294 853073 816158 782248 751990 725062 700589 678142 657990 640435 625256 611845
56195 611845 599688 588682 579015 570669 563151 555962 549330 543992 540114 536904 533583 530345 527968 526761
56181 526761 526336 526217 526262 526581 527302 528335 529231 529516 529244 528974 529084 529550 530501 532416 535410 538856 542104
56164 542104 545111 547976 550455 552471 554587 557342 560572 563988 567939 572822 578153 583082 587697 593008
56150 593008 599743 607819 616887 626666 636772 646810 656781 667028 677899 689766 703077 717903
$$ packed form
56239I60603O3595O8121P1488P3833P5431P5920P4596P1287O6362N9964N1697
56228A712897M1230K8946J5808K682j0039k2199l3338m2734n0074n5851o0667
56217A526661o4294o5908o5359o3667o2045o0673n8715n5351n0688m5790m1877
56206H92294l9221l6915l3910l0258k6928k4473k2447k0152j7555j5179j3411
56195F11845j2157j1006r667q346p518p189o632n338l878l210l321l238k377j207
56181E26761m25j19M5L19P21J033Q96K85k72k70J10M66R51J915K994L446L248
56164E42104L007K865K479K016K116K755L230L416L951M883N331M929M615N311
56150E93008O735Q076R068R779J0106J0038R971J0247J0871J1867J3311J4826
$$ plain form
56138 717903 733717 750088 767292 785860 806009 828119 853211 882238 915465 953450 998153
56127 998153 1051974 1115824 1188967 1270248 1358222 1450235 1542660 1632198 1716017 1790929 1854087
56116 1854087 1905221 1947204 1983791 2017258 2048096 2075712 2098699 2115230 2124081 2125267 2119671 2108566
56104 2108566 2093424 2075300 2053817 2027057 1992588 1948407 1893402 1828041 1755008 1678424 1602105
56093 1602105 1528810 1460852 1400397 1348790 1306231 1272376 1246673 1228006 1214756 1205569 1199716 1196679
56081 1196679 1196005 1197581 1201454 1207256 1214354 1222513 1231850 1242213 1253333 1265452 1279015 1293824 1309281
56068 1309281 1325418 1342838 1361652 1381353 1401669 1422631 1443869 1464866 1486004 1508357 1532340
56057 1532340 1557418 1583081 1609104 1634916 1659928 1684561 1709768 1735411 1760313 1784040 1807364
$$ packed form
56138G17903J5814J6371J7204J8568K0149K2110K5092K9027L3227L7985M4703
56127I98153N3821O3850P3143Q1281Q7974R2013R2425Q9538Q3819P4912O3158
56116A854087N1134M1983L6587L3467L0838K7616K2987J6531Q851J186n596j1105
56104B108566j5142j8124k1483k6760l4469m4181n5005o5361p3033p6584p6319
56093A602105p3295o7958o0455n1607m2559l3855k5703j8667j3250r187n853l037
56081A196679o74J576L873N802P098Q159R337J0363J1120J2119J3563J4809J5457
56068A309281J6137J7420J8814J9701K0316K0962K1238K0997K1138K2353K3983
56057A532340K5078K5663K6023K5812K5012K4633K5207K5643K4902K3727K3324
$$ plain form
56046 1807364 1830798 1854085 1877463 1902057 1928455 1956116 1984690 2014742 2046695 2080327 2115795
56035 2115795 2153916 2194684 2236696 2278813 2321469 2365723 2411986 2460230 2510573 2563042 2617565
56024 2617565 2674514 2734419 2796964 2861274 2927239 2995407 3065694 3137780 3212835 3292896 3378144
56013 3378144 3466762 3558052 3653657 3754818 3860478 3969291 4081734 4198925 4321009 4448033
56003 4448033 4580858 4719872 4864275 5013980 5170872 5336832 5511896 5695690 5889363
55994 5889363 6094692 6312425 6542823 6786754 7045244 7319137 7610150 7920900 8253080
55985 8253080 8607167 8984689 9388915 9822530 10286894 10784798 11321550 11901935 12528578
55976 12528578 13205114 13938784 14738224 15611197 16566530 17616020 18772643 20049650 21463845
$$ packed form
56046A807364K3434K3287K3378K4594K6398K7661K8574L0052L1953L3632L5468
56035B115795L8121M0768M2012M2117M2656M4254M6263M8244N0343N2469N4523
56024B617565N6949N9905O2545O4310O5965O8168P0287P2086P5055Q0061Q5248
56013C378144Q8618R1290R5605J01161J05660J08813J12443J17191J22084J27024
56003D448033J32825J39014J44403J49705J56892J65960J75064J83794J93673
55994E889363K05329K17733K30398K43931K58490K73893K91013L10750L32180
55985H253080L54087L77522M04226M33615M64364M97904N36752N80385O26643
55976A2528578O76536P33670P99440Q72973R55333J049490J156623J277007J414195
$$ plain form
55967 21463845 23037739 24797189 26770724 28994548 31516456 34394342 37696607 41509334
55959 41509334 45942458 51129724 57230612 64438354 72982997 83124089 95146070 109361426
55951 109361426 126099803 145662632 168246366 193831655 222017784 251829540 281616488
55944 281616488 309164350 332004993 347804138 354747877 351921537 339609015 319323471
55937 319323471 293447596 264619560 235172752 206841104 180719497 157358237 136902999
55930 136902999 119240840 104121873 91238095 80269918 70918553 62924599 56068627
55923 56068627 50164281 45056149 40619052 36751368 33367084 30393948 27773937 25459408
55915 25459408 23408126 21582901 19953191 18493666 17181887 15998816 14929603 13961633
$$ packed form
55967B1463845J573894J759450J973535K223824K521908K877886L302265L812727
55959D1509334M433124N187266O100888P207742Q544643J0141092J2021981J4215356
55951A09361426J6738377J9562829K2583734K5585289K8186129K9811756K9786948
55944B81616488K7547862K2840643J5799145O943739k826340j2312522k0285544
55937C19323471k5875875k8828036k9446808k8331648k6121607k3361260k0455238
55930A36902999j7662159j5118967j2883778j0968177r351365p993954o855972
55923E6068627n904346n108132m437097l867684l384284k973136k620011k314529
55915B5459408k051282j825225j629710j459525j311779j183071j069213r67970
$$ plain form
55907 13961633 13082783 12282710 11553853 10889295 10281032 9721696 9206320 8730808 8290257
55898 8290257 7880334 7498814 7144136 6813666 6504771 6216233 5947115 5695465 5459602
55889 5459602 5239620 5036162 4848658 4675951 4517681 4373911 4244440 4129619 4030799 3948802
55879 3948802 3882989 3832845 3799137 3781882 3777885 3781325 3785771 3784290 3768808 3731524 3667434 3575215
55867 3575215 3456760 3317182 3164444 3007210 2852459 2705065 2568401 2444093 2331804
55858 2331804 2230506 2139736 2058951 1986415 1919885 1858095 1800775 1747638 1698221 1652241 1609233
55847 1609233 1568206 1528376 1489798 1452581 1416112 1379939 1344828 1311948 1281310 1251820 1222563
55836 1222563 1193331 1164391 1136550 1111003 1088191 1067103 1046468 1026276 1007419 990297 974640
$$ packed form
55907A3961633q78850q00073p28857o64558o08263n59336n15376m75512m40551
55898H290257m09923l81520l54678l30470l08895k88538k69118k51650k35863
55889E459602k19982k03458j87504j72707j58270j43770j29471j14821r8820q1997
55879C948802o5813n0144l3708j7255l997L440M446j481j5482l7284o4090r2219
55867C575215j18455j39578j52738j57234j54751j47394j36664j24308j12289
55858B331804j01298r0770q0785p2536o6530o1790n7320n3137m9417m5980m3008
55847A609233m1027l9830l8578l7217l6469l6173l5111l2880l0638k9490k9257
55836A222563k9232k8940k7841k5547k2812k1088k0635k0192j8857j7122j5657
$$ plain form
55825 974640 960233 946816 933584 919732 905323 890792 875938 860346 844522 829523 815516
55814 815516 801730 787847 774513 762285 750964 740207 730074 720674 711834 703422 695598 688587
55802 688587 682480 677286 672868 668865 665005 661454 658533 656238 654284 652434 650463 648105 645427 642933
55788 642933 640901 639007 637097 635843 635910 636908 637959 638957 640205 640902 639005 632822 622109 607563 590150
55773 590150 571239 552601 535768 521660 510887 503810 500067 498528 498041 497854 497293 495543 492126 487239
55759 487239 481402 475079 468786 463130 458439 454552 451157 448059 444923 441096 435975 429497 422023 413845
55745 413845 404919 395122 384744 374701 366108 359447 354214 349493 344783 340230 336315 333553 332147 331538
55731 331538 330496 328121 324693 321134 317781 314132 309738 304834 299958 295406 291202 287244 283300 279068
$$ packed form
55825I74640j4407j3417j3232j3852j4409j4531j4854j5592j5824j4999j4007
55814H15516j3786j3883j3334j2228j1321j0757j0133r400q840q412p824p011
55802F88587o107n194m418m003l860l551k921k295j954j850j971k358k678k494
55788F42933k032j894j910j254O7R98J051R98J248O97j897o183j0713j4546j7413
55773E90150j8911j8638j6833j4108j0773p077l743j539m87j87n61j750l417m887
55759D87239n837o323o293n656m691l887l395l098l136l827n121o478p474q178
55745D13845q926r797j0378j0043q593o661n233m721m710m553l915k762j406o09
55731C31538j042k375l428l559l353l649m394m904m876m552m204l958l944m232
$$ plain form
55717 279068 274432 269634 265224 261894 260043 259315 258875 258519 259164 261723 265794 270132 274192 278285 282199
55702 282199 284674 284727 282789 279964 276648 272517 267546 262378 257618 253192 248562 243483 238471 234432 231672
55687 231672 229344 226229 222117 218142 215649 214991 215434 215854 215466 214282 213110 212777 213119 212992 211481 208851
55671 208851 206143 204155 202973 202086 200668 198095 194597 191236 188929 187613 186575 185310 183788 182208
55657 182208 180984 180756 181888 183906 185843 187199 188187 189034 189506 189395 189118 189419 190538 191969 193156 194187
55641 194187 195636 197759 200154 202232 203750 204612 204403 202581 199159 194806 190154 185377 180618 176350 172950
55626 172950 170212 167746 165681 164460 164015 163628 162756 161597 160683 160214 159993 159791 159516 159125 158565 157797 156742
55609 156742 155298 153485 151479 149391 147149 144833 142986 142152 142031 141474 139649 137014 134739 133399 132685
$$ packed form
55717B79068m636m798m410l330j851p28m40l56O45K559M071M338M060M093L914
55702B82199K475N3j938k825l316m131m971n168m760m426m630n079n012m039k760
55687B31672k328l115m112l975k493o58M43M20l88j184j172l33L42j27j511k630
55671B08851k708j988j182q87j418k573l498l361k307j316j038j265j522j580
55657A82208j224k28J132K018J937J356R88Q47M72j11k77L01J119J431J187J031
55641A94187J449K123K395K078J518Q62k09j822l422m353m652m777m759m268l400
55626A72950k738k466k065j221m45l87q72j159r14m69k21k02k75l91n60p68j055
55609A56742j444j813k006k088k242k316j847q34j21n57j825k635k275j340p14
$$ plain form
55594 132685 132257 132145 132098 131281 129236 126714 124874 123896 123077 122126 121577 121807 122401 122817 123111 123610 124337 125156
55576 125156 126160 127588 129608 132444 136349 141203 146547 152283 158768 165835 172319 177297 181281 185316
55562 185316 189146 191301 190936 188549 184784 179560 172886 165630 158765 152394 146153 140109 134579 129404
55548 129404 124156 118970 114505 111041 108160 105395 102775 100545 98711 97047 95371 93744 92499 92053
55534 92053 92467 93194 93459 92927 91838 90602 89471 88514 87563 86155 83892 81013 78409 76923 76843 78044
55518 78044 80345 83576 87575 92366 98142 104810 111633 117569 121999 125037 127195 128888 130167 130763 130348
55503 130348 128892 126809 124712 122920 121175 118884 115739 112201 109246 107469 106495 105435 103863 102093
55489 102093 100496 99009 97523 96402 96175 96777 97471 97552 96912 95935 95086 94669 94758 95145 95467 95538 95607 96186 97535
$$ packed form
55594A32685m28j12m7q17k045k522j840r78q19r51n49K30N94M16K94M99P27Q19
55576A25156J004J428K020K836L905M854N344N736O485P067O484M978L984M035
55562A85316L830K155l65k387l765n224o674p256o865o371o241o044n530n175
55548A29404n248n186m465l464k881k765k620k230j834j664j676j627j245m46
55534I2053M14P27K65n32j089j236j131r57r51j408k263k879k604j486q0J201
55518G8044K301L231L999M791N776O668O823N936M430L038K158J693J279N96m15
55503A30348j456k083k097j792j745k291l145l538k955j777r74j060j572j770
55489A02093j597j487j486j121k27O02O94Q1o40r77q49m17Q9L87L22P1O9N79J349
$$ plain form
55470 97535 99259 100517 100748 100171 99422 98753 97857 96540 95150 94138 93465 92835 92293 92158 92427 92725 92900
55453 92900 93220 93790 94146 93724 92523 91064 89827 88927 88262 87740 87386 87342 87749 88534 89360 89848 89878 89631 89351
55434 89351 89091 88704 88124 87593 87514 87966 88571 88933 89042 89032 88796 88167 87330 86607 85944 85099 84320 84255 85093 86396
55414 86396 87960 90143 92907 95228 96184 96213 96464 97150 97396 96702 95621 94683 93467 91318 88505 86052
55398 86052 84603 84014 83959 84430 85435 86569 87182 86957 86139 85198 84380 83647 82988 82546 82364 82188 81693 80856
55380 80856 79890 78914 77923 77033 76469 76209 75986 75745 75784 76248 76758 76914 76964 77557 78795 79944 80217 79569 78511
55361 78511 77406 76275 75149 74211 73545 73006 72497 72126 71994 72007 72084 72377 73040 73911 74620 74959 74922 74569 74121
55342 74121 74021 74456 74893 74615 73811 73564 74516 76034 77058 77330 77355 77522 77835 78261 78713 78771 77988 76485 74838
$$ packed form
55470I7535J724J258K31n77p49o69q96j317j390j012o73o30n42j35K69K98J75
55453I2900L20N70L56m22j201j459j237r00o65n22l54m4M07P85Q26M88L0k47k80
55434H9351k60l87n80n31p9M52O05L62J09j0k36o29q37p23o63q45p79o5Q38J303
55414H6396J564K183K764K321R56K9K51O86K46o94j081r38j216k149k813k453
55398H6052j449n89n5M71J005J134O13k25q18r41q18p33o59m42j82j76m95q37
55380H0856r66r76r91q90n64k60k23k41L9M64N10J56N0N93J238J149K73o48j058
55361G8511j105j131j126r38o66n39n09l71j32J3P7K93O63Q71P09L39l7l53m48
55342G4121j00M35M37k78q04k47R52J518J024K72K5J67L13M26M52N8p83j503j647
$$ plain form
55323 74838 73401 72242 71714 72405 74263 76201 76991 76382 75181 74381 74314 74439 73864 72242 70177 68569 67710
55306 67710 67335 67430 68356 70090 71918 73199 73950 74396 74396 73771 72776 71780 70776 69686 68979 69383 71004 73151
55288 73151 75070 76502 77535 78276 78820 79260 79569 79624 79444 79348 79722 80546 81168 80818 79565 78533 78729 79703
55270 79703 79936 78594 76263 73818 71469 69415 68530 69417 71264 72709 73606 74938 77052 79037 80017 80119
55254 80119 79880 79544 79231 79052 78668 77568 76165 75819 77199 79363 81103 82435 83920 85216 85442 84699
55238 84699 84058 84025 84027 83598 83132 83076 83135 82771 82010 81278 80742 80229 79619 79037 78742 78952 79612 80251 80341 79889 79428
55217 79428 79294 79229 78813 78037 77259 76808 76781 76986 76946 76199 74849 73606 73081 73286 73927 74902 76199 77580 78745
55198 78745 79677 80473 80939 80740 79928 78943 78091 77371 76898 77080 78073 79288 79850 79557 79116 79280 79939 80351 80207
$$ packed form
55323G4838j437j159n28O91J858J938P90o09j201q00o7J25n75j622k065j608q59
55306F7710l75R5R26J734J828J281P51M46%o25r95r96j004j090p07M04J621K147
55288G3151J919J432J033P41N44M40L09N5j80r6L74Q24O22l50j253j032J96R74
55270G9703K33j342k331k445k349k054q85Q87J847J445Q97J332K114J985R80J02
55254H0119k39l36l13j79l84j100j403l46J380K164J740J332J485J296K26p43
55238H4699o41l3Km29m66n6N9l64p61p32n36n13o10n82k95K10O60O39R0m52m61
55217G9428j34o5m16p76p78m51k7K05m0p47j350j243n25K05O41R75J297J381J165
55198G8745R32P96M66j99q12r85q52p20m73J82R93J215N62k93m41J64O59M12j44
$$ plain form
55179 80207 80088 80688 81961 83442 85130 87340 89630 90662 89665 87563 86069 85914 86528 87160 87600 87801
55163 87801 87592 87055 86704 86915 87480 87939 88072 87838 87174 86185 85314 85019 85350 86030 86787 87387 87528 87028 86096
55144 86096 85213 84756 84838 85379 86182 86969 87517 87730 87528 86799 85604 84253 83033 81965 80982 80185 79686 79372
55126 79372 79078 78930 79169 79654 79811 79237 78204 77513 77872 79334 81185 82447 82699 82400 82280 82559 82950 83283
55108 83283 83667 84057 84133 83840 83690 84165 85047 85735 86103 86623 87590 88590 89003 88796 88542 88671 89045 89303 89410
55089 89410 89612 90017 90557 91328 92559 94088 95253 95625 95593 95777 96029 95565 94143 92514 91430 90685 89621
55072 89621 88284 87436 87423 87607 87220 86426 86091 86595 87297 87287 86388 85229 84513 84499 85069 85916 86583 86708 86504
55053 86504 86724 87822 89305 90307 90637 90786 90924 90513 89183 87464 86232 85743 85670 85863 86466 87299 87710
$$ packed form
55179H0207j19O00J273J481J688K210K290J032r97k102j494j55O14O32M40K01
55163H7801k09n37l51K11N65M59J33k34o64r89q71k95L31O80P57O00J41n00r32
55144H6096q83m57Q2N41Q03P87N48K13k02p29j195j351j220j068r83p97m99l14
55126G9372k94j48K39M85J57n74j033o91L59J462J851J262K52k99j20K79L91L33
55108H3283L84L90P6k93j50M75Q82O88L68N20R67J000M13k07k54J29L74K58J07
55089H9410K02M05N40P71J231J529J165L72l2J84K52m64j422j629j084p45j064
55072H9621j337q48j3J84l87p94l35N04P02j0q99j159p16j4N70Q47O67J25k04
55053H6504K20J098J483J002L30J49J38m11j330j719j232m89p3J93O03Q33M11
$$ plain form
55036 87710 87303 86438 85720 85255 84751 84199 84044 84562 85388 85881 85811 85424 84907 84143 83117 82256 82028 82324 82602
55017 82602 82635 82759 83266 83893 84165 84008 83743 83705 84135 85268 87101 89034 90105 89801 88540 87321 86964 87591
54999 87591 88630 89326 89431 89390 89691 90181 90317 90017 89767 89825 89864 89674 89754 90679 92135 93185 93396 93206 93140 93199
54979 93199 93182 93134 93122 92935 92429 91971 92124 92900 93683 93966 93875 93838 94060 94529 95357 96740 98497 99902 100233 99467
54959 99467 98285 97366 96847 96527 96362 96428 96511 96179 95437 94964 95369 96496 97799 99196 100957 102782 103674 103049
54941 103049 101502 100069 99066 98120 97103 96477 96643 97404 98220 98726 98913 99028 99397 100120 100931 101496 101847
54924 101847 102275 102827 103359 104152 106001 109296 113375 117200 120596 124446 129742 136737 144999 153899 162862
54909 162862 171325 178629 184024 186924 187307 185736 182754 178350 172334 165146 157883 151357 145510 139954
$$ packed form
55036H7710m07q65p18m65n04n52j55N18Q26M93p0l87n17p64j026q61k28K96K78
55017H2602L3J24N07O27K72j57k65l8M30J133J833J933J071l04j261j219l57O27
54999H7591J039O96J05m1L01M90J36l00k50N8L9j90Q0R25J456J050K11j90o6N9
54979I3199j7m8j2j87n06m58J53P76P83K83r1l7K22M69Q28J383J757J405L31p66
54959I9467j182r19n19l20j65O6Q3l32p42m73M05J127J303J397J761J825Q92o25
54941A03049j547j433j003r46j017o26J66P61Q16N06J87J15L69P23Q11N65L51
54924A01847M28N52N32P93J849L295M079L825L396L850N296O995Q262Q900Q963
54909A62862Q463P304N395K900L83j571k982m404o016p188p263o526n847n556
$$ plain form
54895 139954 134765 130342 126712 123448 120340 117752 116151 115472 115175 114792 114296 114023 114367 115489 117180 119026
54879 119026 120794 122648 124879 127492 130182 132680 134984 137334 140212 144381 150503 158442 167051 174926
54865 174926 181336 186261 189699 191306 190704 187877 183196 177280 170873 164575 158503 152372 146028 139807
54851 139807 134302 129847 126202 122583 118129 112738 107517 103944 102333 101451 99933 97743 95858 94898 94644
54836 94644 94728 95091 95663 96187 96586 97019 97307 96809 95273 93513 92672 92915 93341 93229 92888 93071 93889 94694 94908
54817 94908 94574 94058 93574 93200 93079 93231 93263 92729 91871 91555 92221 93194 93466 92926 92368 92347 92563 92517 92386 92906
54797 92906 94521 96852 98945 100035 100124 99866 99825 100020 100299 100884 102062 103435 104083 103626 102627 101765 101149 100770
54779 100770 101037 102208 103673 104518 104695 104979 105780 106700 107412 108289 109775 111650 113465 115449 118422 122872
$$ packed form
54895A39954n189m423l630l264l108k588j601o79k97l83m96k73L44J122J691J846
54879A19026J768J854K231K613K690K498K304K350K878M169O122P939Q609P875
54865A74926O410M925L438J607o02k827m681n916o407o298o072o131o344o221
54851A39807n505m455l645l619m454n391n221l573j611q82j518k190j885r60k54
54836I4644Q4L63N72N24L99M33K88m98j536j760q41K43M26j12l41J83Q18Q05K14
54817I4908l34n16m84l74j21J52L2n34q58l16O66R73K72n40n58k1K16m6j31N20
54797I2906J615K331K093J090Q9k58m1J95K79N85J178J373O48m57r99q62o16l79
54779A00770K67J171J465Q45J77K84Q01R20P12Q77J486J875J815J984K973M450
$$ plain form
54763 122872 128555 135054 142304 150356 158929 167510 175829 183953 191836 198945 204456 207767 208776 207735
54749 207735 204974 200752 195224 188548 181107 173598 166673 160468 154719 149415 145047 141943 139706 137699
54735 137699 135942 134991 134889 134781 133802 131980 129910 127938 126097 124643 124046 124396 125298 126518 128322 130924
54719 130924 133977 137077 140540 145111 150913 157209 163409 169777 176669 183396 188480 191001 191175 189537
54705 189537 186162 181036 174712 168016 161236 154136 146760 139782 133936 129397 125820 122725 119719 116663
54691 116663 113850 111851 110930 110745 110738 110676 110565 110232 109339 107862 106254 105016 104238 103628 102879 101860 100647
54674 100647 99519 98910 99104 99926 100858 101545 102076 102633 103043 102959 102494 102317 102923 103981 104680 104584 103906 103035 102195
54655 102195 101612 101599 102216 103048 103645 104077 104794 105968 107213 107992 108185 108195 108589 109636 111078 112347 113072 113382
$$ packed form
54763A22872N683O499P250Q052Q573Q581Q319Q124P883P109N511L311J009j041
54749B07735k761m222n528o676p441p509o925o205n749n304m368l104k237k007
54735A37699j757r51j02j08r79j822k070j972j841j454n97L50R02J220J804K602
54719A30924L053L100L463M571N802O296O200O368O892O727N084K521J74j638
54705A89537l375n126o324o696o780p100p376o978n846m539l577l095l006l056
54691A16663k813j999r21j85po2j11l33q93j477j608j238p78o10p49j019j213
54674A00647j128o09J94Q22R32O87N31N57M10q4m65j77O06J058O99r6o78q71q40
54655A02195n83j3O17Q32N97M32P17J174J245P79J93J0L94J047J442J269P25L10
$$ plain form
54637 113382 113637 113958 114200 114359 114756 115628 116663 117200 116888 116029 115169 114540 114031 113602 113458 113735 114205 114504
54619 114504 114517 114368 114102 113595 112822 111971 111184 110353 109279 107978 106780 106189 106523 107461 108018 107359 105749 104312
54601 104312 103725 103581 103282 102994 103211 103817 104366 104984 106124 107463 107991 107474 106930 107180 107683 107447 106493 105616
54583 105616 105086 104480 103637 102934 102584 102378 102236 102349 102608 102520 101971 101496 101481 101596 101408 101082 100999 101013 100659 99888
54563 99888 99107 98558 98085 97535 97032 96840 97198 98256 99912 101709 103124 103954 104240 103947 103027 101744 100613
54546 100613 99943 99710 99843 100349 101129 101957 102734 103546 104435 105358 106399 107687 109007 109840 110052 110295 111400
54529 111400 113441 115612 117008 117417 117338 117374 117695 118113 118602 119471 120847 122215 122811 122360 121116 119382 117485
54512 117485 116125 116016 116969 117928 118228 118201 118223 117873 116661 114952 113362 111698 109524 107541 107206 108777 110725
$$ packed form
54637A13382K55L21K42J59L97Q72J035N37l12q59q60o29n09m29j44K77M70K99
54619A14504J3j49k66n07p73q51p87q31j074j301j198n91L34R38N57o59j610j437
54601A04312n87j44k99k88K17O06N49O18J140J339N28n17n44K50N03k36r54q77
54583A05616n30o06q43p03l50k06j42J13K59q8n49m75j5J15j88l26q3J4l54p71
54563I9888p81n49m73n50n03j92L58J058J656J797J415Q30K86k93r20j283j131
54546A00613o70k33J33N06P80Q28P77Q12Q89R23J041J288J320Q33K12K43J105
54529A11400K041K171J396M09p9L6L21M18M89Q69J376J368N96m51j244j734j897
54512A17485j360j09R53R59L00k7K2l50j212j709j590j664k174j983l35J571J948
$$ plain form
54495 110725 111556 111420 111398 111873 112283 112071 111222 110029 108900 108271 108296 108628 108846 108962 109246 109692 110014 110049 109866
54476 109866 109600 109476 109859 110900 112208 113234 113865 114251 114182 113264 111832 111056 111723 113229 114207 113948 112920
54459 112920 112005 111642 111648 111535 110830 109331 107314 105484 104629 105125 106658 108358 109369 109439 109026 108791 109037 109683
54441 109683 110591 111644 112484 112484 111317 109513 108167 107984 108729 109663 110319 110721 111062 111458 111966 112546 112986 113131
54423 113131 113201 113611 114394 115084 115387 115693 116601 118103 119572 120538 121173 121952 123060 124287 125360 126191 126781
54406 126781 126978 126550 125549 124465 123774 123366 122738 121780 121014 120888 121249 121761 122504 123696 125040 125894 126037
54389 126037 125876 125891 126256 126990 128066 129277 130355 131241 131960 132286 131985 131368 131052 131030 130581 129327 127846 126864
54371 126864 126336 125772 125064 124391 123628 122450 120948 119592 118607 117873 117438 117618 118494 119690 120814 121804 122692
$$ packed form
54495A10725Q31j36k2M75M10k12q49j193j129o29K5L32K18J16K84M46L22L5j83
54476A09866k66j24L83J041J308J026O31L86o9r18j432p76O67J506R78k59j028
54459A12920r15l63Oj13p05j499k017j830q55M96J533J700J011P0m13k35K46O46
54441A09683R08J053Q40%j167j804j346j83P45R34O56M02L41L96N08N80M40J45
54423A13131P0M10P83O90L03L06R08J502J469R66O35P79J108J227J073Q31N90
54406A26781J97m28j001j084o91m08o28r58p66j26L61N12P43J192J344Q54J43
54389A26037j61J5L65P34J076J211J078Q86P19L26l01o17l16k2m49j254j481r82
54371A26864n28n64p08o73p63j178j502j356r85p34m35J80Q76J196J124R90Q88
$$ plain form
54354 122692 123375 123780 124018 124142 123884 122900 121278 119652 118688 118436 118199 117198 115382 113461 112116 111407 111049
54337 111049 110933 111041 111092 110755 110182 109910 110188 110776 111500 112605 114309 116202 117349 116992 115201 112967 111614
54320 111614 111808 113008 114021 114085 113277 112016 110646 109632 109632 110974 113186 115343 116814 117499 117533 117060 116259
54303 116259 115346 114441 113470 112178 110342 108109 106142 105176 105329 106059 106869 107721 108654 109391 109748 110155 111231
54286 111231 112914 114459 115413 116155 117299 118887 120443 121657 122715 124021 125785 127924 130204 132397 134333
54271 134333 135877 136980 137822 138863 140559 142905 145300 146995 147732 147860 147792 147457 146466 144734 142671 140696
54255 140696 138840 137020 135381 134034 132682 131007 129297 128101 127277 126017 124052 122174 121126 120571 119736
54240 119736 118638 117891 117564 117111 116500 116561 117854 119716 120862 120661 119545 118424 117939 118090 118324 118101 117424
$$ packed form
54354A22692O83M05K38J24k58r84j622j626r64k52k37j001j816j921j345p09l58
54337A11049j16J08N1l37n73k72K78N88P24J105J704J893J147l57j791k234j353
54320A11614J94J200J013O4q08j261j370j014%J342K212K157J471O85L4m73q01
54303A16259r13r05r71j292j836k233j967r66J53P30Q10Q52R33P37L57M07J076
54286A11231J683J545R54P42J144J588J556J214J058J306J764K139K280K193J936
54271A34333J544J103Q42J041J696K346K395J695P37J28o8l35r91j732k063j975
54255A40696j856j820j639j347j352j675j710j196q24j260j965j878j048n55q35
54240A19736j098p47l27m53o11O1J293J862J146k01j116j121m85J51K34k23o77
$$ plain form
54223 117424 116672 115971 115088 114032 113276 113115 113163 112810 111934 110912 110183 110076 110743 111818 112410 111980 111098 110840
54205 110840 111462 112214 112449 112370 112471 112779 113019 113154 113341 113556 113693 113953 114726 116016 117260 117827 117551 116686
54187 116686 115533 114305 113305 112925 113330 114233 115203 116180 117459 119095 120557 121239 121164 120861 120624 120237 119481
54170 119481 118580 117939 117705 117751 117879 117852 117432 116659 115910 115446 115042 114337 113438 112779 112474 112231 111940 111911 112311 112736
54150 112736 112706 112409 112572 113596 115056 116128 116389 116122 115903 115967 115966 115398 114213 112934 112206 112377 113504 115422
54132 115422 117626 119348 120147 120402 120937 122075 123320 123999 124004 123768 123696 123821 123932 123853 123595 123314 123097 122802 122223
54113 122223 121476 121115 121638 122886 124137 124906 125493 126556 128143 129446 129602 128570 127024 125573 124376 123480
54097 123480 123070 123224 123753 124515 125570 126760 127483 127368 126946 127046 127589 127633 126746 125666 125269 125483 125754 126148
$$ packed form
54223A17424p52p01q83j056p56j61M8l53q76j022p29j07O67J075N92m30q82k58
54205A10840O22P52K35p9J01L08K40J35J87K15J37K60P73J290J244N67k76q65
54187A16686j153j228j000l80M05R03R70R77J279J636J462O82p5l03k37l87p56
54170A19481r01o41k34M6J28k7m20p73p49m64m04p05q99o59l05k43k91k9M00M25
54150A12736l0k97J63J024J460J072K61k67k19O4jn68j185j279p28J71J127J918
54132A15422K204J722P99K55N35J138J245O79Nk36p2J25J11p9k58k81k17k95n79
54113A22223p47l61N23J248J251P69N87J063J587J303J56j032j546j451j197q96
54097A23480m10J54N29P62J055J190P23j15m22J00N43M4q87j080l97K14K71L94
$$ plain form
54079 126148 127253 129135 131033 132241 132804 133138 133340 133163 132515 131671 130973 130447 129874 129241 128976 129495 130591
54062 130591 131613 132385 133529 135605 138285 140822 143037 145235 147247 148266 147823 146427 145049 144336 144502
54047 144502 145486 146895 148160 149156 150393 152319 154681 156953 159132 161708 164986 168873 173272 178285 183959
54032 183959 190170 196801 203760 210811 217621 224101 230517 237184 244131 251013 257244 262321 266277 269673
54018 269673 272906 275594 277061 277398 277570 278336 279491 280430 280989 281316 281176 279963 277411 273909 270013 265919
54002 265919 261497 256612 251274 245665 240187 235330 231353 228106 225206 222322 219241 215860 212258 208764
53988 208764 205776 203479 201789 200485 199264 197670 195264 192007 188398 185059 182208 179659 177272 175193
53974 175193 173611 172465 171516 170576 169564 168487 167512 166934 166874 167096 167337 167766 168807 170512 172388 173972
$$ packed form
54079A26148J105J882J898J208N63L34K02j77o48q44o98n26n73o33k65N19J096
54062A30591J022P72J144K076K680K537K215K198K012J019m43j396j378p13J66
54047A44502R84J409J265R96J237J926K362K272K179K576L278L887M399N013N674
54032A83959O211O631O959P051O810O480O416O667O947O882O231N077L956L396
54018B69673L233K688J467L37J72P66J155R39N59L27j40j213k552l502l896m094
54002B65919m422m885n338n609n478m857l977l247k900k884l081l381l602l494
53988B08764k988k297j690j304j221j594k406l257l609l339k851k549k387k079
53974A75193j582j146r49r40j012j077r75n78o0K22K41M29J041J705J876J584
$$ plain form
53958 173972 175273 176507 177655 178557 179248 179842 180228 180260 180249 180859 182355 184234 185780 186737 187302 187776 188504
53941 188504 189923 192218 194952 197402 199302 200984 202728 204354 205643 206816 208263 210026 211955 214240
53927 214240 217364 221434 225972 230558 235369 240788 246795 253110 259830 267408 275892 284601 292799 300485
53913 300485 308211 316313 324643 333049 341673 350652 359833 369057 378538 388545 398673 407761 414700 419159
53899 419159 421417 421761 420429 418050 415675 414097 413338 412998 412905 413112 413357 412985 411589 409381 406708 403479
53883 403479 399451 394957 390883 387821 385534 383372 380861 377617 373010 366402 357762 347760 337197 326497
53869 326497 315799 305303 295411 286573 279014 272523 266534 260560 254606 248986 243814 238882 234085 229641
53855 229641 225733 222171 218680 215354 212538 210326 208431 206533 204478 202163 199536 196848 194685 193503
$$ packed form
53958A73972J301J234J148R02O91N94L86L2j1O10J496J879J546R57N65M74P28
53941A88504J419K295K734K450J900J682J744J626J289J173J447J763J929K285
53927B14240L124M070M538M586M811N419O007O315O720P578Q484Q709Q198P686
53913C00485P726Q102Q330Q406Q624Q979R181R224R481J0007J0128R088O939M459
53899D19159K258L44j332k379k375j578p59l40r3K07K45l72j396k208k673l229
53883D03479m028m494m074l062k287k162k511l244m607o608q640j0002j0563j0700
53869C26497j0698j0496r892q838p559o491n989n974n954n620n172m932m797m444
53855B29641l908l562l491l326k816k212j895j898k055k315k627k688k163j182
$$ plain form
53841 193503 193195 193259 193307 193239 193006 192463 191564 190506 189442 188177 186458 184548 183096 182223 181113 178993 176322
53824 176322 174437 173979 174283 174513 174724 175378 176332 177076 177656 178599 179930 181005 181505 181945 182895 184211 185411
53807 185411 186427 187589 189190 191450 194598 198500 202412 205681 208673 212465 217535 223219 228683 234013
53793 234013 239929 246666 253571 259829 265196 269868 273915 277234 279910 282277 284440 286110 287098 287736 288449
53778 288449 289077 289049 288203 286954 285545 283601 280690 276979 272966 268783 264139 258834 253055 247239 241902
53763 241902 237478 234001 230974 227769 224181 220457 216892 213635 210739 208129 205579 202962 200442 198165
53749 198165 195936 193546 191375 190174 190148 190622 190775 190381 189659 188731 187502 185951 184256 182687 181465 180680
53733 180680 180277 180139 180192 180352 180522 180809 181613 183168 185047 186501 187271 187681 187870 187494 186445 185372 185096
$$ packed form
53841A93503l08O4M8o8k33n43q99j058j064j265j719j910j452q73j110k120k671
53824A76322j885m58L04K30K11O54R54P44N80R43J331J075N00M40R50J316J200
53807A85411J016J162J601K260L148L902L912L269K992L792N070N684N464N330
53793B34013N916O737O905O258N367M672M047L319K676K367K163J670R88O38P13
53778B88449O28k8q46j249j409j944k911l711m013m183m644n305n779n816n337
53763B41902m424l477l027l205l588l724l565l257k896k610k550k617k520k277
53749A98165k229k390k171j201k6M74J53l94p22r28j229j551j695j569j222p85
53733A80680m03j38N3J60J70K87Q04J555J879J454P70M10J89l76j049j073k76
$$ plain form
53716 185096 185754 186883 188103 189359 190754 192535 195008 198054 200944 203137 205067 207545 210437 212730
53702 212730 214103 215743 219076 224164 229969 235922 242545 250504 259678 269435 279325 288943 297314 303017
53688 303017 305153 303905 300020 294113 286783 278956 271470 264354 257129 249929 243699 238975 235042 230818
53674 230818 226196 221968 218718 216372 214647 213294 211979 210563 209532 209451 209905 209660 208131 206043 204331
53659 204331 203066 201945 201223 201404 202331 203268 203819 204199 204669 205266 206028 206930 207549 207370 206572 206053 206449 207448
53641 207448 208281 208524 208236 207614 206841 206151 205766 205791 206254 207168 208495 210165 212156 214397 216588 218394 219922
53624 219922 221721 224088 226577 228484 229757 231174 233532 236858 240530 244091 247729 251852 256359 260679
53610 260679 264549 268322 272228 275773 278413 280526 282994 285863 288268 289851 291417 293735 296330 298160
$$ packed form
53716A85096O58J129J220J256J395J781K473L046K890K193J930K478K892K293
53702B12730J373J640L333N088N805N953O623P959R174R757R890R618Q371N703
53688C03017K136j248l885n907p330p827p486p116p225p200o230m724l933m224
53674B30818m622m228l250k346j725j353j315j416j031q1M54k45j529k088j712
53659B04331j265j121p22J81R27R37N51L80M70N97P62R02O19j79p98n19L96R99
53641B07448Q33K43k88o22p73o90l85K5M63R14J327J670J991K241K191J806J528
53624B19922J799K367K489J907J273J417K358L326L672L561L638M123M507M320
53610B60679L870L773L906L545K640K113K468K869K405J583J566K318K595J830
$$ plain form
53596 298160 298977 299304 299388 299002 298159 297252 296404 295273 293638 291654 289482 287194 285148 283882 283430 283214 282859
53579 282859 282558 282373 281646 279620 276361 272671 269303 266583 264475 262591 260343 257577 254963 253368 252926
53564 252926 253049 253249 253427 253417 252820 251608 250548 250661 252325 254973 257506 258962 259104 258659 258836 260290 262612
53547 262612 265006 267328 270104 273527 276930 279604 281874 284900 289424 295122 301258 307537 314015 320523
53533 320523 326673 332341 337788 343280 348955 355063 362026 370097 379176 388983 399218 409600 420091
53520 420091 431174 443474 456972 470900 484605 498247 512495 527956 545076 564105 584692
53509 584692 605860 626934 648327 670956 694973 719507 743516 766463 788208 808820 828538
53498 828538 847526 865597 882556 898774 914939 931236 947336 963283 979753 997080 1014658
$$ packed form
53596B98160Q17L27Q4l86q43r07q48j131j635j984k172k288k046j266m52k16l55
53579B82859l01j85p27k026l259l690l368k720k108j884k248k766k614j595m42
53564B52926J23K00J78j0n97j212j060J13J664K648K533J456J42m45J77J454K322
53547B62612K394K322K776L423L403K674K270L026M524N698O136O279O478O508
53533C20523O150N668N447N492N675O108O963Q071R079R807J0235J0382J0491
53520D20091J1083J2300J3498J3928J3705J3642J4248J5461J7120J9029K0587
53509E84692K1168K1074K1393K2629K4017K4534K4009K2947K1745K0612J9718
53498H28538J8988J8071J6959J6218J6165J6297J6100J5947J6470J7327J7578
$$ plain form
53487 1014658 1031771 1048576 1065649 1082863 1099390 1114713 1129059 1142813 1156048 1168728 1180768
53476 1180768 1191625 1200260 1205991 1209183 1210784 1211252 1210209 1207009 1201333 1193266 1183113 1171191 1157559
53463 1157559 1141948 1124320 1105542 1087118 1069986 1053847 1037896 1021786 1005443 988342 969824
53452 969824 950102 930137 910232 889538 867526 845334 824847 806623 789503 772254 754983
53441 754983 738819 724822 713385 704215 696561 689794 684067 680186 678554 678534 679169 680288 682538 686395
53427 686395 691583 697572 704315 712217 721500 731886 743055 755280 769367 785868 804518 824600
53415 824600 845779 868353 892676 918563 945401 972784 1000917 1030400 1061683 1094815 1129725
53404 1129725 1166549 1205440 1246141 1288112 1331208 1375865 1422392 1470417 1519365 1569125 1619789
$$ packed form
53487A014658J7113J6805J7073J7214J6527J5323J4346J3754J3235J2680J2040
53476A180768J0857Q635N731L192J601M68j043l200n676q067j0153j1922j3632
53463A157559j5611j7628j8778j8424j7132j6139j5951j6110j6343j7101j8518
53452I69824j9722j9965j9905k0694k2012k2192k0487j8224j7120j7249j7271
53441G54983j6164j3997j1437r170p654o767n727l881j632k0O35J119K250L857
53427F86395N188N989O743P902R283J0386J1169J2225J4087J6501J8650K0082
53415H24600K1179K2574K4323K5887K6838K7383K8133K9483L1283L3132L4910
53404A129725L6824L8891M0701M1971M3096M4657M6527M8025M8948M9760N0664
$$ plain form
53393 1619789 1670948 1721882 1772415 1823081 1874310 1925841 1976939 2026709 2074231 2118969 2161200
53382 2161200 2201465 2239352 2273459 2302922 2328488 2351511 2372195 2389308 2401399 2407863 2408961 2405298
53370 2405298 2397269 2384684 2366925 2343595 2314871 2281083 2242272 2198541 2150498 2098896 2044058
53359 2044058 1986333 1927075 1868470 1811992 1757392 1703551 1650051 1597569 1546846 1497780 1449771
53348 1449771 1402771 1357545 1314740 1273958 1234122 1194739 1156337 1119577 1084307 1049815 1015744
53337 1015744 982477 950795 921439 894771 870534 848020 826764 806972 789084 773117 758725
53326 758725 745622 733571 722186 711314 701566 693906 688599 684971 682242 680151 678741 678075 678449 680380
53312 680380 684026 688950 694805 701948 710928 721566 733095 745259 758806 774667 792883 812607
$$ packed form
53393A619789N1159N0934N0533N0666N1229N1531N1098M9770M7522M4738M2231
53382B161200M0265L7887L4107K9463K5566K3023K0684J7113J2091O464J098l663
53370B405298q029j2585j7759k3330k8724l3788l8811m3731m8043n1602n4838
53359B044058n7725n9258n8605n6478n4600n3841n3500n2482n0723m9066m8009
53348A449771m7000m5226m2805m0782l9836l9383l8402l6760l5270l4492l4071
53337A015744l3267l1682k9356k6668k4237k2514k1256j9792j7888j5967j4392
53326G58725j3103j2051j1385j0872r748p660n307l628k729k091j410o66L74J931
53312F80380L646M924N855P143Q980J0638J1529J2164J3547J5861J8216J9724
$$ plain form
53300 812607 833062 854238 876544 900009 924118 948497 973519 999951 1028028 1057121 1086295
53289 1086295 1114971 1142944 1170093 1196364 1221882 1246660 1270077 1290918 1308169 1321667 1331846
53278 1331846 1338990 1343020 1343914 1341847 1336750 1328167 1315994 1301110 1284787 1267566 1249177 1229485 1208878
53265 1208878 1187624 1165535 1142580 1119262 1095894 1071952 1046752 1020447 993755 966900 939443
53254 939443 911147 882400 853682 825016 796124 766841 737396 708552 681366 656358 632891
53243 632891 609802 586715 564335 543359 523568 504172 484710 465414 446985 430194 415411
53232 415411 402252 389870 377806 366389 356243 347572 340055 333248 326867 320780 314812 308575 301620
53219 301620 293954 286325 279644 274077 268956 263595 257891 252117 246533 241395 237011 233523 230751 228344
$$ packed form
53300H12607K0455K1176K2306K3465K4109K4379K5022K6432K8077K9093K9174
53289A086295K8676K7973K7149K6271K5518K4778K3417K0841J7251J3498J0179
53278A331846P144M030Q94k067n097q583j2173j4884j6323j7221j8389j9692k0607
53265A208878k1254k2089k2955k3318k3368k3942k5200k6305k6692k6855k7457
53254I39443k8296k8747k8718k8666k8892k9283k9445k8844k7186k5008k3467
53243F32891k3089k3087k2380k0976j9791j9396j9462j9296j8429j6791j4783
53232D15411j3159j2382j2064j1417j0146q671p517o807o381o087n968o237o955
53219C01620p666p629o681n567n121n361n704n774n584n138m384l488k772k407
$$ plain form
53205 228344 225947 223162 219707 215811 212295 210046 209357 209719 210097 209530 207807 205584 203652 202115 200536
53190 200536 198714 196829 194956 192993 191140 189789 188794 187463 185557 183712 182549 181912 181366 180915 180728
53175 180728 180655 180551 180644 181075 181482 181654 182161 183556 185281 186201 186073 185641 185339 184791 183792 182909 182738 183195 183925
53156 183925 184859 185921 186695 186960 187251 188308 190055 191591 192198 191999 191553 191177 190843 190548 190503 190902 191595 192060
53138 192060 191751 190539 188938 187905 188151 189403 190417 190102 188759 187880 188541 190298 191864 192539 192598 192529 192459
53121 192459 192294 191936 191289 190351 189379 188643 188034 187276 186540 186400 187000 187661 187619 186946 186414 186572 187162 187433 186835
53102 186835 185414 183603 181716 179772 177836 176243 175210 174364 173113 171446 169925 168814 167756 166542
53088 166542 165662 165657 166253 166702 166733 166596 166271 165315 163684 162134 161415 161410 161470 161351 161358 161693 162194 162775 163650 164848
$$ packed form
53205B28344k397k785l455l896l516k249o89L62L78n67j723k223j932j537j579
53190B00536j822j885j873j963j853j351r95j331j906j845j163o37n46m51j87
53175A80728p3j04R3M31M07J72N07J395J725R20j28m32l02n48r99q83j71M57P30
53156A83925R34J062P74K65K91J057J747J536O07j99m46l76l34k95m5L99O93M65
53138A92060l09j212j601j033K46J252J014l15j343q79O61J757J566O75N9o9p0
53121A92459j65l58o47r38r72p36o09p58p36j40O00O61m2o73n32J58N90K71n98
53102A86835j421j811j887j944j936j593j033q46j251j667j521j111j058j214
53088A66542q80nN96M49L1j37l25r56j631j550p19nO0j19PL35N01N81Q75J198
$$ plain form
53068 164848 165907 166434 166718 167302 168070 168302 167728 166979 166682 166588 166060 165124 164425 164167 163717 162484 160745 159260
53050 159260 158353 157808 157528 157741 158395 158810 158409 157579 157318 157924 158579 158429 157579 156549 155284 153467 151596
53033 151596 150692 150746 150451 149012 147406 147041 147844 148643 148981 149353 149695 148932 146509 143505 141596 141408 142294
53016 142294 143246 143565 143071 142269 142053 142816 143989 144786 145139 145532 146186 146949 147832 149008 150252 150906 150632 149864
52998 149864 149267 149009 148777 148341 147830 147516 147535 147926 148761 150048 151429 152223 151995 151006 149895 148926 147914 146860
52980 146860 146189 146076 145998 145389 144467 143915 143890 143915 143715 143562 143672 143837 143952 144393 145440 146670 147453 147823 148302
52961 148302 149017 149613 150032 150704 151712 152403 152300 151955 152281 153313 154256 154586 154409 153729 152225 150045 148057
52944 148057 146821 145848 144542 143345 143174 143975 144730 144887 144940 145387 145912 145988 145656 145225 144641 143630 142189 140435
$$ packed form
53068A64848J059N27K84N84P68K32n74p49k97r4n28r36o99k58m50j233j739j485
53050A59260r07n45k80K13O54M15m01q30k61O06O55j50q50j030j265j817j871
53033A51596r04N4k95j439j606l65Q03P99L38L72L42p63k423l004j909j88Q86
53016A42294R52L19m94q02k16P63J173P97L53L93O54P63Q83J176J244O54k74p68
52998A49864n97k58k32m36n11l14J9L91Q35J287J381P94k28r89j111r69j012j054
52980A46860o71j13p8o09r22n52k5K5k00j53J10J65J15M41J047J230P83L70M79
52961A48302P15N96M19O72J008O91j03l45L26J032R43L30j77o80j504k180j988
52944A48057j236r73j306j197j71Q01P55J57N3M47N25P6l32m31n84j011j441j754
$$ plain form
52926 140435 138329 136020 134250 133777 134426 135176 135225 134622 133893 133526 133858 134973 136411 137318 137178 136310 135487
52909 135487 135200 135405 135780 136049 136183 136458 137238 138564 139958 140735 140551 139647 138625 137999 137811 137651 137172 136619
52891 136619 136652 137589 139024 140354 141441 142456 143204 143101 141956 140415 139299 138713 138169 137483 137099 137359 137877
52874 137877 137964 137524 137121 137190 137584 138017 138575 139484 140590 141485 142102 142788 143727 144631 145198 145580 146144 146949 147826
52855 147826 148851 150294 152014 153352 153947 154342 155378 157094 158692 159620 160249 161204 162379 163039 162784 161960
52839 161960 160962 159501 156887 153001 148657 144896 142177 140434 139667 139933 140697 140741 139314 137181 135993 136521
52823 136521 137972 139127 139651 139932 140096 139788 138872 137837 137307 137411 137771 137970 137879 137562 137017 136204 135392 135303
52805 135303 136600 139228 142566 146182 150059 153943 157015 158556 158603 157616 155865 153542 151046 148580 145753
$$ packed form
52926A40435k106k309j770m73O49P50M9o03p29l67L32J115J438R07j40q68q23
52909A35487k87K05L75K69J34K75P80J326J394P77j84r04j022o26j88j60m79n53
52891A36619L3R37J435J330J087J015P48j03j145j541j116n86n44o86l84K60N18
52874A37877Q7m40m03O9L94M33N58R09J106Q95O17O86R39R04N67L82N64Q05Q77
52855A47826J025J443J720J338N95L95J036J716J598R28O29R55J175O60k55q24
52839A61960r98j461k614l886m344l761k719j743p67K66P64M4j427k133j188N28
52823A36521J451J155N24K81J64l08r16j035n30J04L60J99r1l17n45q13q12q9
52805A35303J297K628L338L616L877L884L072J541M7r87j751k323k496k466k827
$$ plain form
52790 145753 142277 138854 136634 135824 135549 135119 134626 134156 133261 131703 130082 129169 128995 129053 129044 129023 129065 129230 129674
52771 129674 130427 131193 131617 131600 131207 130515 129713 129059 128596 128224 128199 129059 130832 132786 134285 135380 136205 136433
52753 136433 135930 135384 135510 136043 136284 136327 136755 137334 137056 135686 134298 133987 134766 136089 137687 139385 140664
52736 140664 141114 141045 141179 141866 142945 144119 145118 145641 145552 145157 145105 145925 147618 149503 150530 150083 148687 147576
52718 147576 147410 147683 147588 147025 146369 145617 144394 142701 141089 139911 138876 137546 136021 134842 134392 134621
52702 134621 135217 135816 136031 135602 134684 133838 133547 133734 133968 134141 134729 136207 138345 140320 141518 142014 142221
52685 142221 142259 141880 140949 139820 139087 139043 139565 140484 141790 143267 144213 144007 142883 141652 140636 139445 138049
52668 138049 137376 138233 140077 141581 142172 142372 142719 143155 143543 144062 144842 145746 146730 147926 149156 149873 149906 149801
$$ packed form
52790A45753l476l423k220q10k75m30m93m70q95j558j621r13j74N8rk1M2J65M44
52771A29674P53P66M24j7l93o92q02o54m63l72k5Q60J773J954J499J095Q25K28
52753A36433n03n46J26N33K41M3M28N79k78j370j388l11P79J323J598J698J279
52736A40664M50o9J34O87J079J174R99N23q9l95n2Q20J693J885J027m47j396j111
52718A47576j66K73r5n63o56p52j223j693j612j178j035j330j525j179m50K29
52702A34621N96N99K15m29r18q46k91J87K34J73N88J478K138J975J198M96K07
52685A42221L8l79r31j129p33m4N22R19J306J477R46k06j124j231j016j191j396
52668A38049o73Q57J844J504N91K00L47M36L88N19P80R04R84J196J230P17L3j05
$$ plain form
52650 149801 150170 151131 152664 154914 157654 159940 160979 161035 160869 160477 159108 156457 153188 150173 147762 145978
52634 145978 144892 144459 144288 143878 142970 141569 139860 138295 137510 137882 139191 140872 142561 144282 146147 148018
52618 148018 149596 150760 151673 152452 152829 152382 151148 149750 148840 148634 149133 150405 152290 154090 155040 155073 154684
52601 154684 154084 153009 151466 150076 149398 149329 149539 150096 151164 152359 153028 153132 153275 153749 154099 153903 153586
52584 153586 154007 155420 157210 158585 159217 159253 159057 158993 159246 159704 160182 160781 161769 163071 164152 164635 164752 164920
52566 164920 165084 164854 164196 163524 163078 162608 161891 161170 160815 160769 160666 160396 160207 160252 160310 160046 159339 158344 157432 157142
52546 157142 157934 159736 161785 163106 163258 162552 161628 160888 160317 159686 158818 157767 156779 156102 155765 155670 155863 156609
52528 156609 158012 159668 160881 161235 160908 160452 160406 160989 161874 162305 161726 160435 159357 159099 159466 159959 160398
$$ packed form
52650A49801L69R61J533K250K740K286J039N6j66l92j369k651l269l015k411j784
52634A45978j086m33j71m10r08j401j709j565p85L72J309J681J689J721J865J871
52618A48018J578J164R13P79L77m47j234j398r10k06M99J272J885J800R50L3l89
52601A54684o00j075j543j390o78o9K10N57J068J195O69J04J43M74L50j96l17
52584A53586M21J413J790J375O32L6j96o4K53M58M78N99R88J302J081M83J17J68
52566A64920J64k30o58o72m46m70p17p21l55m6j03k70j89M5N8k64p07r95r12k90
52546A57142P92J802K049J321J52p06r24p40n71o31q68j051r88o77l37r5J93P46
52528A56609J403J656J213L54l27m56m6N83Q85M31n79j291j078k58L67M93M39
$$ plain form
52511 160398 160884 161501 162377 163726 165490 167198 168549 169870 171562 173387 174840 176045 177568 179400 180812
52496 180812 181240 180685 179137 176439 173020 170055 168308 167308 166199 164958 164200 164064 163949 163257 161964 160562
52480 160562 159732 159908 160800 161524 161553 161351 161732 162912 164611 166705 169117 171317 172717 173540 174566 175993
52464 175993 177265 178126 179060 180397 181687 182460 183030 184025 185506 187084 188513 189680 190271 190035 189203 188128
52448 188128 186641 184317 181339 178518 176364 174625 172935 171462 170633 170513 170767 170984 170825 170089 168974 168138
52432 168138 168134 168749 169170 168808 167753 166429 165180 164323 164232 164951 165800 165818 164715 163190 162199 162068 162470 163052
52414 163052 163844 165062 166791 168908 171199 173420 175344 176886 178262 179938 182351 185624 189567 193999
52400 193999 198990 204658 210673 216082 219784 221258 220842 219279 217003 213926 209970 205734 202304 200246
$$ packed form
52511A60398M86O17Q76J349J764J708J351J321J692J825J453J205J523J832J412
52496A80812M28n55j548k698l419k965j747j000j109j241p58j36j15o92j293j402
52480A60562q30J76Q92P24K9k02L81J180J699K094K412K200J400Q23J026J427
52464A75993J272Q61R34J337J290P73N70R95J481J578J429J167N91k36q32j075
52448A88128j487k324k978k821k154j739j690j473q29j20K54K17j59p36j115q36
52432A68138mO15M21l62j055j324j249q57r1P19Q49J8j103j525r91j31M02N82
52414A63052P92J218J729K117K291K221J924J542J376J676K413L273L943M432
52400A93999M991N668O015N409L702J474m16j563k276l077l956m236l430k058
$$ plain form
52386 200246 199011 197617 195790 194092 193036 192537 192327 192362 192544 192492 192045 191740 192305 193766 195492 197068 198728
52369 198728 200804 203110 205061 206299 207135 208392 210725 213877 216737 218338 218692 218417 217753 216422 214442
52354 214442 212496 211222 210476 209650 208570 207687 207422 207580 207578 207170 206795 207133 208344 209882 211078 211739 212142
52337 212142 212717 213957 216371 220062 224422 228583 232261 235890 239921 244251 248378 251922 254993 258238
52323 258238 262461 267914 274055 280316 286894 294311 302282 309755 316187 322122 328131 333796 338285 341547
52309 341547 344379 347509 351089 354929 358682 361873 364196 365930 367741 370002 372486 374723 376463 377833
52295 377833 379214 381004 383281 385723 387880 389465 390323 390301 389391 387854 386005 383976 381900 380176 379258
52280 379258 379153 379415 379679 380064 381019 382896 385721 389241 393137 397166 401156 405015 408849 412920 417274
$$ packed form
52386B00246j235j394j827j698j056m99k10L5J82n2m47l05N65J461J726J576J660
52369A98728K076K306J951J238Q36J257K333L152K860J601L54k75o64j331j980
52354B14442j946j274p46q26j080q83k65J58km08l75L38J211J538J196O61M03
52337B12142N75J240K414L691M360M161L678L629M031M330M127L544L071L245
52323B58238M223N453O141O261O578P417P971P473O432N935O009N665M489L262
52309C41547K832L130L580L840L753L191K323J734J811K261K484K237J740J370
52295C77833J381J790K277K442K157J585Q58k2r10j537j849k029k076j724r18
52280C79258j05K62K64L85R55J877K825L520L896M029L990L859L834M071M354
$$ plain form
52265 417274 421497 425198 428660 432590 437192 442003 446757 451766 457142 462284 466739 471034 475956 481323
52251 481323 486253 490451 494443 498541 502436 506030 509957 514826 520300 525267 528754 530610 531599 532949
52237 532949 535488 539035 542772 546207 549597 553497 558236 563713 569349 574312 578323 582208 587166 593496
52223 593496 600535 607754 615126 622332 628535 633437 637884 642924 648719 654807 660856 666668 671993 676952
52209 676952 682175 687896 693437 698301 703345 709844 717627 725143 731434 737070 742888 748715 753839 758110
52195 758110 761939 765551 768801 771686 774645 778222 782484 786743 790025 792046 793608 795682 798198 800188
52181 800188 801098 801313 801231 800457 798413 795289 791804 788243 784301 779781 774916 769916 764618 758835 752795
52166 752795 747077 742178 738240 735065 732365 730070 728452 727852 728245 729156 730085 730926 731897 733087 734220 734920
$$ packed form
52265D17274M223L701L462L930M602M811M754N009N376N142M455M295M922N367
52251D81323M930M198L992M098L895L594L927M869N474M967L487J856R89J350
52237E32949K539L547L737L435L390L900M739N477N636M963M011L885M958O330
52223E93496P039P219P372P206O203M902M447N040N795O088O049N812N325M959
52209F76952N223N721N541M864N044O499P783P516O291N636N818N827N124M271
52195G58110L829L612L250K885K959L577M262M259L282K021J562K074K516J990
52181H00188R10K15q2p74k044l124l485l561l942m520m865n000n298n783o040
52166G52795n718m899l938l175k700k295j618o00L93R11R29Q41R71J190J133P00
$$ plain form
52150 734920 735087 734866 734368 733646 732988 732929 733731 734976 735932 736227 735959 735287 734234 732867 731257 729186 726250
52133 726250 722475 718502 714911 711666 708576 706073 705043 705862 707976 710619 713739 718037 724244 732469
52119 732469 742203 752816 764034 775927 788504 801444 814258 826614 838280 848801 857475 863782
52107 863782 867673 869396 869226 867535 864950 862121 859278 856268 853062 850054 847771 846520 846466 847812 850501
52092 850501 853858 856918 859260 861280 863492 865748 867264 867263 865480 862254 858296 854206 850086 845739 841368
52077 841368 837777 835671 835010 835368 836640 838941 841987 845180 848352 851889 855971 860175 864080 867794 871494
52062 871494 874827 877281 879038 880932 883405 885778 886781 885746 883114 879737 875870 871159 865666 860422
52048 860422 856444 853429 850030 845442 840097 834645 828961 822610 815736 808845 802013 794931 787614 780500
$$ packed form
52150G34920J67k21m98p22o58n9Q02J245R56K95k68o72j053j367j610k071k936
52133G26250l775l973l591l245l090k503j030Q19K114K643L120M298O207Q225
52119G32469R734J0613J1218J1893J2577J2940J2814J2356J1666J0521Q674O307
52107H63782L891J723j70j691k585k829k843l010l206l008k283j251n4J346K689
52092H50501L357L060K342K020K212K256J516jj783l226l958m090m120m347m371
52077H41368l591k106o61L58J272K301L046L193L172L537M082M204L905L714L700
52062H71494L333K454J757J894K473K373J003j035k632l377l867m711n493n244
52048H60422l978l015l399m588n345n452n684o351o874o891o832p082p317p114
$$ plain form
52034 780500 773952 768105 763167 759422 756926 755643 755799 757639 760775 764326 767811 771496 775733 780387
52020 780387 785103 789729 794249 798652 803055 807582 811856 815021 816666 817411 818109 818639 818049 815829 812502
$$ packed form
52034G80500o548n847m938l745k496j283J56J840L136L551L485L685M237M654
52020G80387M716M626M520M403M403M527M274L165J645P45O98N30n90k220l327
$$ [...]
##END NTUPLES=NMR SPECTRUM
##END=
