
##TITLE=AC1342_CMFRS10072_6534272_EPMFhfBqo4
##JCAMPDX= 6.0         $$ Bruker NMR JCAMP-DX V2.0
##DATA TYPE= NMR SPECTRUM
##DATA CLASS= NTUPLES
##ORIGIN= BRUKER
##OWNER= Administrator
$$ 1.72 TOPSPIN		Version 2.1
$$ 2012-07-16 16:29:44.000 -0500  Administrator@TOPSPIN
$$ Compression mode = diff/dup
##.OBSERVE FREQUENCY= 400.02188249412
##.OBSERVE NUCLEUS= ^1H
##.ACQUISITION MODE= SIMULTANEOUS (DQD)
##.ACQUISITION SCHEME= undefined
##.AVERAGES= 8
##.DIGITISER RES= 22
##SPECTROMETER/DATA SYSTEM= spect
##.PULSE SEQUENCE= zg30
##.SOLVENT NAME= COFFEE_meoh
##.SHIFT REFERENCE= INTERNAL, COFFEE_meoh, 1, 14.98509
##AUDIT TRAIL= $$ (NUMBER, WHEN, WHO, WHERE, PROCESS, VERSION, WHAT)
$$ ##TITLE= Audit trail, TOPSPIN		Version 2.1
$$ ##JCAMPDX= 5.01
$$ ##ORIGIN= Bruker BioSpin GmbH
$$ ##OWNER= Administrator
$$ $$ C:\Bruker\TOPSPIN/data/COFFEE/nmr/AC1342_CMFRS10072_6534272_EPMFhfBqo4/10/pdata/1/auditp.txt
$$ ##AUDIT TRAIL=  $$ (NUMBER, WHEN, WHO, WHERE, PROCESS, VERSION, WHAT)
(   1,<2012-07-16 16:29:30.625 -0500>,<Administrator>,<TOPSPIN>,<go>,<TOPSPIN 2.1>,
      <created by zg
	started at 2012-07-16 16:28:22.328 -0500,
	POWCHK enabled, PULCHK disabled,
       configuration hash MD5:
       6B 1B 68 BB D9 2E 58 E2 7F 35 AD 54 07 DF 0E 41
       data hash MD5: 64K
       AC 1E ED 34 97 5C 43 A8 92 C5 84 B4 61 2C 5B FA>)
(   2,<2012-07-16 16:29:38.171 -0500>,<Administrator>,<TOPSPIN>,<proc1d>,<TOPSPIN 2.1>,
      <Start of raw data processing
       efp LB = 0 FT_mod = 6 PKNL = 1 PHC0 = 0 PHC1 = 0 SI = 32K 
       data hash MD5: 32K
       18 53 BB DD 89 E3 70 FF A7 C8 E1 35 99 17 69 C6>)
(   3,<2012-07-16 16:29:39.156 -0500>,<Administrator>,<TOPSPIN>,<proc1d>,<TOPSPIN 2.1>,
      <pk PHC0 = 176.1548 PHC1 = 0 
       data hash MD5: 32K
       72 1B 7A 9C 22 A2 BF C0 C6 C7 C3 2C BF DB CF AF>)
(   4,<2012-07-16 16:29:39.718 -0500>,<Administrator>,<TOPSPIN>,<proc1d>,<TOPSPIN 2.1>,
      <abs ABSG = 1 
       data hash MD5: 32K
       2D 5F 3B 13 C9 5E 57 EF 0F 4A D5 18 89 B9 2E 47>)
(   5,<2012-07-16 16:29:40.015 -0500>,<Administrator>,<TOPSPIN>,<proc1d>,<TOPSPIN 2.1>,
      <abs ABSG = 2 
       data hash MD5: 32K
       1A C7 65 39 88 01 EC 21 E7 A9 82 F8 56 DE ED B7>)
(   6,<2012-07-16 16:29:40.187 -0500>,<Administrator>,<TOPSPIN>,<proc1d>,<TOPSPIN 2.1>,
      <abs ABSG = 3 
       data hash MD5: 32K
       E9 6B 39 BF D8 DE BE 13 13 26 9E 44 3D 88 66 0D>)
(   7,<2012-07-16 16:29:40.218 -0500>,<Administrator>,<TOPSPIN>,<proc1d>,<TOPSPIN 2.1>,
      <abs ABSG = 4 
       data hash MD5: 32K
       DC 18 A1 3C B6 9A 1A 13 25 FA 07 EC 31 65 1F 8C>)
(   8,<2012-07-16 16:29:40.265 -0500>,<Administrator>,<TOPSPIN>,<proc1d>,<TOPSPIN 2.1>,
      <abs ABSG = 5 
       data hash MD5: 32K
       9E D7 45 C7 70 13 F0 B0 24 8A 45 D1 03 EA CB 73>)
$$ ##END=
$$ 
$$ $$ hash MD5
$$ $$ FE E1 B7 EF 38 53 C4 07 EC 36 35 B8 C4 23 36 2C
##$RELAX= 
##$RELAX= 
##$RELAX= 
##$RELAX= 
##$RELAX= 
##$RELAX= 
##$RELAX= 
$$ Bruker specific parameters
$$ --------------------------
$$ [...]
150 150 150 150 150 150 150 150
##$TP07= 0
##$TPNAME0= <>
##$TPNAME1= <>
##$TPNAME2= <>
##$TPNAME3= <>
##$TPNAME4= <>
##$TPNAME5= <>
##$TPNAME6= <>
##$TPNAME7= <>
##$TPOAL= (0..7)
0.5 0.5 0.5 0.5 0.5 0.5 0.5 0.5
##$TPOFFS= (0..7)
0 0 0 0 0 0 0 0
##$TUNHIN= 0
##$TUNHOUT= 0
##$TUNXOUT= 0
##$USERA1= <user>
##$USERA2= <user>
##$USERA3= <user>
##$USERA4= <user>
##$USERA5= <user>
##$V9= 5
##$VALIST= <valist>
##$VCLIST= <CCCCCCCCCCCCCCC>
##$VD= 0
##$VDLIST= <DDDDDDDDDDDDDDD>
##$VPLIST= <PPPPPPPPPPPPPPP>
##$VTLIST= <TTTTTTTTTTTTTTT>
##$WBST= 2048
##$WBSW= 25
##$XGAIN= (0..3)
0 0 0 0
##$XL= 0
##$YL= 0
##$YMAX_a= 500484
##$YMIN_a= -635800
##$ZGOPTNS= <>
##$ZL1= 120
##$ZL2= 120
##$ZL3= 120
##$ZL4= 120
##$ABSF1= 14.98509
##$ABSF2= -5.573092
##$ABSG= 5
##$ABSL= 3
##$ALPHA= 0
##$AQORDER= 0
##$ASSFAC= 0
##$ASSFACI= 0
##$ASSFACX= 0
##$ASSWID= 0
##$AUNMP= <proc_prof1d_extract_pilot.lims>
##$AXLEFT= 0
##$AXNAME= <>
##$AXNUC= <1H>
##$AXRIGHT= 0
##$AXTYPE= 0
##$AXUNIT= <>
##$AZFE= 0.1
##$AZFW= 0.1
##$BCFW= 0
##$BC_mod= 0
##$BYTORDP= 0
##$COROFFS= 0
##$CY= 15
##$DATMOD= 1
##$DC= 0
##$DFILT= <>
##$DTYPP= 0
##$F1P= 0
##$F2P= 0
##$FCOR= 0.5
##$FTSIZE= 32768
##$FT_mod= 6
##$GAMMA= 0
##$GB= 0
##$INTBC= 1
##$INTSCL= 1
##$ISEN= 128
##$LB= 0
##$LEV0= 0
##$LPBIN= 0
##$MAXI= 10000
##$MC2= 0
##$MEAN= 0
##$ME_mod= 0
##$MI= 0
##$NCOEF= 0
##$NC_proc= -8
##$NLEV= 6
##$NOISF1= 0
##$NOISF2= 0
##$NSP= 0
##$NTH_PI= 0
##$NZP= 0
##$OFFSET= 14.98509
##$PC= 1
##$PHC0= 176.1548
##$PHC1= 0
##$PH_mod= 1
##$PKNL= yes
##$PPARMOD= 0
##$PPDIAG= 0
##$PPIPTYP= 0
##$PPMPNUM= 2147483647
##$PPRESOL= 1
##$PSCAL= 4
##$PSIGN= 0
##$PYNMP= <proc.py>
##$REVERSE= no
##$SF= 400.02
##$SI= 32768
##$SIGF1= 0
##$SIGF2= 0
##$SINO= 400
##$SIOLD= 32768
##$SPECTYP= <>
##$SREGLST= <1H.CDCl3>
##$SSB= 0
##$STSI= 32768
##$STSR= 0
##$SW_p= 8223.68421052631
##$SYMM= 0
##$S_DEV= 0
##$TDeff= 65536
##$TDoff= 0
##$TI= <>
##$TILT= no
##$TM1= 0
##$TM2= 0
##$TOPLEV= 0
##$USERP1= <user>
##$USERP2= <user>
##$USERP3= <user>
##$USERP4= <user>
##$USERP5= <user>
##$WDW= 1
##$XDIM= 32768
##$YMAX_p= 473867705
##$YMIN_p= -716401
##$CURPLOT= <Network HP LaserJet P1505>
##$CURPRIN= <$Network HP LaserJet P1505>
##$DFORMAT= <normdp>
##$LAYOUT= <+/1D_H.xwp>
##$LFORMAT= <normlp>
##$PFORMAT= <normpl>
##$SURQMSG= 1
$$ End of Bruker specific parameters
$$ ---------------------------------
##NTUPLES= NMR SPECTRUM
##VAR_NAME=  FREQUENCY,     SPECTRUM/REAL,   SPECTRUM/IMAG
##SYMBOL=    X,             R,               I
##VAR_TYPE=  INDEPENDENT,   DEPENDENT,       DEPENDENT
##VAR_FORM=  AFFN,          ASDF,            ASDF
##VAR_DIM=   32768,         32768,           32768
##UNITS=     HZ,            ARBITRARY UNITS, ARBITRARY UNITS
##FACTOR=    0.250966925370066, 1,           1
##FIRST=     8223.43324360094, 14061,        -201830
##LAST=      0,             -312470,         -57360
##MIN=       0,             -716401,         0
##MAX=       8223.43324360094, 473867705,    0
$$ Real data points
##PAGE= N=1
##DATA TABLE= (X++(R..R)), XYDATA
$$ [...]
23850 -306993 -32520 -275191 80364 -142925 287762 -171804 -221179 195784 -86662 -102473
23840 -102473 -103714 -101408 -83474 -18090 63368 295099 -17962 -7135 132515 20585 123230
23829 123230 262729 172064 -289328 317944 -89871 -292271 -213814 -142246 103274 -104937
23818 -101668 -491712 -50327 -158389 -264381 -193897 -90115 41375 -283273 -165726 -382451
23808 -382451 66479 212587 -181632 219283 31152 -9017 -104053 -198171 -67928 56215 -163187
23796 217774 86136 205562 -57016 184048 94594 68219 59524 -193002 -85460 -296690 -325814
23785 -325814 -376819 58945 -267458 -82818 -144117 -12951 -160546 73653 -237901 -44242 25839
23773 163161 108733 150471 -482921 -28122 -111830 8812 -58567 254359 -57588 123639 145921
23762 145921 355462 -53436 -175599 100102 -173734 338897 -113658 129780 79119 -110618
23751 -354451 34338 -66843 -11032 -25556 -125564 224347 -30716 18926 -275706 -19061 -213302
23740 -213302 227763 -166512 -81145 377145 -172219 318099 -66961 173785 -32661 34865
23729 137876 -217637 36695 -206988 -67160 410214 98548 -188991 -141472 -107202 -109039 134720
23717 -136829 -8773 118343 335818 -13180 -27186 -170201 -323673 -109371 85505 -273465
23706 216931 -429726 56752 -43637 116237 -59518 -59698 42233 148391 116298 438055 -340949
23694 -62319 -248824 6654 220698 -112676 173506 49639 98716 -10215 47371 -149868 -193883
23683 -193883 -501252 -271598 -131844 -339105 -7064 -246499 105571 8615 -245018 59843
23672 111199 151064 -170701 15444 182208 -159891 -112699 196810 62406 143701 -83438 -311904
23661 -311904 -63696 -109232 130281 -256373 155253 16170 -201161 120403 206180 -239016
23650 -186843 140718 275000 178930 205190 59654 169751 42638 -209676 -269971 107945
23639 -152879 -152369 118632 -5173 450874 18434 289277 -85932 -26443 72421 -160630 20619
23627 28633 -12806 99739 130410 79418 -172302 -152731 -51125 66748 7747 23782 -96887 18033
23614 -119515 -51364 -367029 48685 -119268 -147069 -214322 351382 -45086 -220051 119616
23603 -102540 -41652 -2050 219676 -92928 -156158 121256 -372867 -283199 -222401 -146844 67586
23591 98473 50511 149847 -31669 -82639 -158768 -17246 88226 155623 -1164 -168897 285995
23579 -4594 -213000 -117996 12304 -183000 157529 33031 -145312 -149979 -232450 54881 57925
23568 57925 -354429 -18983 220981 327920 82658 18831 -20371 -31319 -30392 67954 167672
23557 167672 130419 -112438 144006 -260592 -86177 -128884 117197 172571 300915 -272260
23546 294409 -210170 -10429 -127776 70271 -83809 70085 -46274 17191 49233 261378 382755
23535 382755 277023 -328441 71299 -53413 115769 -127849 136481 -3517 -145064 -109727
23525 -109727 -17965 -324073 57005 -71416 70591 131264 63627 -136657 -80631 -317222 -3859
23513 -89764 -26787 2426 146646 110784 -222255 101608 163588 39640 -137863 123450 -278272
23501 -106506 183344 -7514 141687 139535 15072 -317478 -3002 141738 78625 61856 -131633
23489 -247505 52184 -154955 -198879 219190 10405 -285133 -104729 -43756 32004 45764 -198099
23477 287021 -23360 62167 -338452 393733 -99439 101687 112571 114618 -291015 102671 104832
23466 104832 -246324 -95462 1813 -129559 247177 363972 298281 -233727 32409 -198999
23455 -8156 348565 36129 188681 -32278 -27336 -201948 -158143 -20319 -139790 -98637 66019
23443 -188635 144945 -189075 70419 -35656 -87426 -65536 -258996 -180815 169196 -42478 -4329
23431 -98462 -15204 -274691 117479 494235 124111 -45252 -177485 48068 -185523 283033
23420 120272 -188805 -145170 205324 76510 -197303 179145 118171 -176128 -61708 -117771
23410 -117771 142958 -306629 -16222 -265344 -268527 -127599 -211258 2655 103762 -306552 -228027
23399 -228027 -176983 -309686 -60390 -220684 261420 -227888 -68872 -178146 324680 24322
23388 -109226 -295969 16413 97052 239407 -145517 122965 140140 23731 -273269 -6439 -22090
23377 -22090 -10682 -214005 -232956 33878 -133995 -162592 152319 219467 -16620 5122 243812
23366 243812 120591 -58829 -44014 -25659 153719 223385 94538 -178155 -12007 135384 49196
23354 34951 117178 -227998 -372449 -353637 123110 138264 -80627 -90526 126902 -104673 -32217
23342 -137737 -421969 -94634 288458 3252 -92176 -367963 -253654 -98667 90848 -281674 -14951
23330 -84992 99413 81230 81699 12064 19172 -56785 -353755 70306 -296139 271749 182378 -266129
23317 21819 -2918 -5723 204993 -52060 -108142 154232 -215738 124837 235577 -63596 132758
23305 71647 -41561 60850 -79093 -84809 -258393 141265 -98077 -429912 14272 38878 146773
23294 146773 -144381 3649 63422 72055 -75744 567204 -73287 317743 364702 -19654 173420
23282 47112 -168458 93542 -420786 -3353 -200364 -487113 -164646 153956 -198873 -40888
23271 -69911 -143991 -11423 76414 210128 -134511 130133 -92782 -104945 73689 -46862 96265
23259 -37045 53672 -99109 -50949 -221889 66497 -107674 209835 -86502 -188158 129481 -166039
23247 226603 -208454 -89895 -169728 204736 -74084 -50944 -40296 -383659 -21472 -288331 87659
23235 -453534 -189651 -313793 -102283 -9423 2595 102823 115667 -115664 -123922 -213848 -133867
23224 -133867 -30018 -297268 -195006 80119 74029 111805 -102580 95205 112270 262380 -351942
23212 -144346 406232 56471 -62140 -233674 -192783 28185 172504 -68170 169113 78525 6919
23200 99463 -67943 36237 -144148 26964 -103882 -298941 68407 -391233 -36633 21763 -77376
23188 -84096 77500 -71693 -144585 -2527 -155131 247143 126294 -14917 46261 -336382 183416
23176 -114169 -498 -437038 81363 301356 -298988 275894 43804 224535 43457 337307 123296
23164 49675 -98743 -59916 -215643 -9145 -63240 256722 43932 -142087 67395 7276 165182
23153 165182 -102691 -94439 -81260 -31549 241971 -49003 72603 74536 83979 -298011 -262182
23142 -262182 -406702 14536 -21532 -431835 5480 86273 -278700 -113650 122872 -120203
23131 -40811 45039 -104397 -56336 -478726 191619 -11524 53461 118303 171466 68682 -262315
23119 -125514 -80455 -17056 288662 282010 353909 16307 -204832 118660 146001 209871 111942
23108 111942 120685 -75411 -67739 199559 103608 33731 189536 -183133 126216 -684 404305
23096 -158416 -129244 34914 -364203 96074 -130270 364293 141487 6381 55798 -175625 -78169
23084 -208012 334219 -58046 164967 238010 -261525 136525 -364591 25186 -186268 78129
23073 57876 78844 105719 120627 -88694 -21391 -80377 457164 -250663 -184738 188692 -267301
23061 -41405 104840 163979 -125131 -67700 100591 386026 -357326 -47050 393710 -83729
23050 -150820 -178247 -120626 -28126 -104556 -108806 152076 186614 -162440 -62917 -63020 -190803
23039 -190803 132897 -132858 -184297 -40191 47055 -356366 113590 184215 -67104 -30806 -170651
23028 -170651 -59832 -18972 -150886 10485 23235 -138620 -48593 -193774 326553 204620
23018 204620 56933 -49465 -69603 -210202 148541 30718 37674 235350 -101527 -738 63515
23006 208478 -75877 154690 -7502 63777 8682 118247 19798 34753 -151331 150220 -24984
22994 189237 -133810 -27300 -191323 -298128 -214639 -30155 -188379 87260 -87813 -171616 -169996
22983 -169996 145156 -86737 42233 -244312 280225 -8680 -386295 355571 -205032 -105878
22973 -105878 143121 -234146 114871 62244 -198970 -25091 -26039 -106731 -249091 24398 -13717
22961 146205 -56907 4531 -7470 -29688 91483 206611 -120678 -89259 67619 95470 -389356
22949 217437 -197942 124962 -166984 145923 188412 -519597 -52902 -162127 -31995 -253549
22939 -253549 -1224 16029 8275 -33802 112436 -14573 -137259 138478 -46869 -223659 105116
22927 101715 45291 -71254 -64158 -55100 56154 -199820 219926 98096 -152891 120575 -198699
22915 -162619 160131 33620 -59448 2546 -71703 -254501 -199036 -54046 101087 99860 -161343
22903 189039 36200 -139963 71493 -46509 -85782 -157537 -175196 180909 178497 53068 -83932
22891 564 102442 5380 -61032 -190210 -68682 -466929 -81873 -280792 -32914 60101 234554
22880 234554 53270 -196367 179947 -314663 -359924 144092 -65430 -137635 117248 -152457
22869 -34919 -109619 373941 134717 320904 156225 87688 28954 -363563 -159571 -99503
22859 -99503 -70214 47515 260201 -129455 -355490 -180558 127967 -164805 -216714 124630
22848 402088 -177429 490728 99588 205558 20328 63578 63479 -31561 -40973 -100524 -131677 -251826
22836 -251826 -6744 -3332 108433 -108284 -19665 350969 -50661 -240807 36710 -209576 -80502
22824 -94201 -214473 -230727 67594 -34612 379787 -101812 373216 148360 -3141 240878 197404
22813 197404 11445 -199925 -109889 -147184 35388 97596 -359990 265416 -81547 -481712 -13951
22801 196339 275852 128977 103443 -243831 220974 109748 -160450 -45425 -99561 -200987
22791 -200987 -15464 -69472 -372604 -105643 -30151 -142914 397331 101232 -104235 28187
22780 51655 -71803 -154859 106646 90826 -42795 -66937 -107520 -159306 -200406 -194111 -1762 -126272
22768 -126272 139385 159980 92069 176903 88503 163166 -253075 -158708 -114369 117804 262554
22757 262554 104428 57792 -157843 -25017 -128888 63730 46506 -163216 -132100 -220129 -107244
22745 -271255 320142 272198 51156 -151656 -10727 -240104 -174567 283422 55688 85654 302108
22734 302108 -74967 135707 111744 195216 222822 -119654 249054 157065 130387 -50148 127309
22722 -211255 -425097 -137712 -8368 41747 4156 243386 -95265 -25205 -205455 226586 40307
22710 -126705 -313914 -205907 -120840 60792 140912 -180871 -608009 -222525 47538 -130800
22699 -336558 -137547 -4064 -36077 89180 32575 -267806 113187 26267 -84983 -172645 5897
22687 -1913 -38895 -142107 -24601 39539 -65496 -327563 -60518 -426901 -71353 321437 -88719
22675 18018 -17356 -190005 -296561 -266631 305176 -67911 163103 -155591 -109274 65301 242837
22664 242837 -94149 95534 110449 -114433 23252 -5785 -100801 -80337 190383 120291 -69049
22652 60987 58270 99467 130687 -118783 -199120 -69564 -102253 -65702 192245 88036 -294887
22640 -380588 143767 295038 145302 -249111 111386 376223 -234881 -201817 126866 -75134
22629 232863 216455 -212950 -77133 -96760 200189 -373698 37423 202301 -84685 135707
22618 -313625 -125932 79918 -108084 -93830 324048 46222 -145206 -153389 -34685 -223527 -207416
22607 -207416 110065 -88505 -56328 227737 167059 167872 309058 218843 -338254 65906 -248716
22595 -17780 -56249 79516 -238307 180788 -3768 25146 -138872 -23614 177831 -136893 250804
22583 227301 175298 14410 -9445 -310925 6108 119717 -310275 -33733 272769 197066 93613
22571 -320210 -283038 -110686 27349 173182 -100520 79710 -133476 -94274 -70948 -119072 -227176
22560 -227176 370317 95976 88409 -296745 151657 -157913 -265356 -317279 -152328 -131148
22550 -131148 119674 -152358 -67130 -43739 -80081 3990 167864 134004 15383 -44050 44717
22538 -127053 -235993 -152203 102858 -94664 -165182 269274 -139546 274151 -118866 -10834
22527 54127 -17619 -166583 61314 -303979 96152 158967 -59089 -57228 158010 -53506 292507
22515 -77143 16477 -129752 127982 -232976 -22010 -40234 -115621 -280233 -273916 309 101068
22504 101068 -45520 18701 -207570 -162777 34101 -92725 295439 -124164 -67522 60933 432046
22493 432046 -383075 -332156 130115 -53557 111999 -93979 64066 3014 -176356 16446 -43825
22481 -116181 -394511 112070 166988 -41253 194082 -54335 -38247 5258 355703 -27736 -105626
22470 -105626 255696 -219061 -31942 -239398 136715 -49164 -52891 -179377 9187 -102940 155695
22458 -258152 -260525 -83790 -91113 -89919 202401 -271197 -210465 -92078 241337 137751 209905
22447 209905 2702 156588 65275 -92722 227122 522117 8432 -116930 -19913 -34739 30236
22435 34649 138259 169706 -410747 -260482 -141270 187464 -21220 -171619 -26112 -30578 -318746
22424 -318746 -150043 -279179 31408 502 -160892 -117224 -141602 -396219 -171671 -127225 -69207
22413 -69207 -22753 -29395 70045 -84653 -178566 166975 37813 6718 -118095 -328488 -51740
22401 -238714 2244 180768 11343 125539 -84057 -81873 -138038 5921 -63853 189803 -81893
22389 -218567 -205158 134614 196885 41263 -4223 -97884 219236 -3674 -204280 41014 -194444
22377 53694 246853 -126938 -94284 -127268 74472 -68670 60480 197102 -86824 70436 -186421
22365 118508 114270 -298243 -34608 -272472 -20878 16995 73984 102842 -67125 24589 -842 183969
22352 -60898 239752 -135483 268505 -27640 25340 198548 -211029 -26429 189030 102381
22342 102381 46208 -196751 -69716 254805 -85912 -318747 -88853 -10136 -57355 -313705 -122667
22330 -150267 54344 -14719 540811 -137000 289759 133366 -70677 167761 264466 71068
22319 -186875 -159393 -249 -389655 -142070 63507 -150934 -83859 -90132 11884 -24218 101087
22307 13607 -188794 -379339 219535 -118212 -13518 -8811 -91250 -90177 -100366 60865 108949
22296 108949 -248600 43693 203944 60424 -220550 -195949 50977 -94534 112006 -205425
22285 156790 57123 -272643 -108327 55986 230948 -103580 -14570 -98998 5307 -186922 -252897
22274 -252897 -42017 305298 188464 -24602 -32634 178131 -23469 -179114 -59399 81188 -68976
22262 -261102 62638 -13550 -343962 88757 -165931 -247414 238645 237912 -32323 -56257 185863
22250 157551 -2988 -5928 -194213 114226 -391560 -101507 -247480 -122595 -124829 -63774 42040
22238 -305688 145292 -213291 -40432 59668 159816 43738 72487 -580577 85119 3052 -215511
22226 -431028 -42695 -3878 -101150 64761 -146121 78761 -19919 95435 -63558 -167800 -154245
22215 -154245 -185193 -117044 -7262 -72627 -171256 -173820 -133797 -26689 21968 61056 -99891 -27739
22202 -74606 58341 -183387 -105019 -33720 45740 -23434 500280 7581 -46671 134795 -32558
22190 -232093 71006 32793 74299 -55245 -134924 -40018 -149367 -11950 -73445 130519 -23011
22178 -60705 -244150 61054 87683 -143479 53952 75818 -150464 -83902 -15892 13650 -105535
22166 -65138 103747 98561 -260918 -322025 -24655 256021 -25429 -308027 20404 -76892 -103334
22155 -103334 -376484 -63946 -245700 -156696 -9426 -9756 53922 -70037 120488 93090 186922
22144 186922 -64526 -246420 217821 138943 -544075 44035 -58632 -121292 -219604 43082 -177968
22132 349491 111996 44160 -270113 165570 281352 33644 301014 -150744 95421 326486
22122 326486 -272338 -145653 83742 -170983 132267 -41706 -106203 -4359 -240083 -15737 -77119
22111 -77119 279946 -275232 -59382 93064 -362849 294162 -164434 31498 -300728 -236658
22101 -236658 -32904 127255 56776 -157416 -181298 61895 178672 -128355 -3094 79444 -263548
22089 -124465 44914 -243311 34152 -26644 32004 147937 -71541 -265512 -98665 -244408 -25575
22077 -138156 -91956 -212044 -127328 -15163 -132143 -76213 -181683 -91687 -234834 157282
22066 -248053 -123160 -103200 138934 -1807 -225739 -48561 -47290 -86467 -185630 -60530 228288
22054 -112061 -144982 -11605 -182168 -212668 -212401 163498 -49778 289303 114527 -118732 118657
22042 83814 -257468 32067 -293216 103615 29100 43444 -14869 217875 -186874 -98359 102585
22030 -227439 114026 47129 28859 53898 -65465 -61541 4051 -126282 203883 -53729 -63372
22019 -63372 -139046 -188914 -299220 -64624 283137 74306 -260592 -87215 -115862 -279554 -19984
22007 -137469 -112038 -162220 66436 -141751 87843 49400 -236265 -364043 -211774 -313766
21997 -313766 207644 97286 131462 -235514 -67226 125789 -252744 87036 127465 117451 -92215
21985 -122628 -234437 -125 -283584 -14390 -267457 -236301 160598 -104510 71024 30707 -133540
21973 156749 45982 41202 454939 -111668 136786 102546 59600 -123344 52414 -184059 -121289
21962 -121289 -69530 -250098 86511 -200025 -105132 8679 76866 145751 -250769 -54062 -12648
21950 65429 -3104 -416071 -276495 -260379 135515 -244983 54359 -61393 -91045 -34006 -131438
21939 -131438 -215773 -94540 -259766 -3150 62360 -400575 134112 -67066 125198 -169300 149110
21927 -82339 -28256 -116433 -18511 -125394 -253401 -11367 17170 -102793 137248 -78867 19816
21915 -7592 -123027 169490 -7352 -121126 -222278 328899 195562 -2930 -142116 16012 -1057
21903 -130259 183575 1433 258453 95596 -88927 205279 171326 -254421 -203453 43320 69710
21892 69710 43775 -200858 190033 -119343 184782 97346 59976 -62794 -92252 -152240 -130868
21881 -130868 -244908 -251429 108898 1425 210823 -58502 -28647 -45882 -233430 85751 -51362
21869 70826 -205144 -297171 -240180 -15878 -293795 -220063 297322 -555909 50308 -8345 147548
21857 -232190 -126379 -9259 91016 -122547 78210 -169119 116055 -227957 -327331 443935
21846 -35135 -84301 -186480 8433 120710 29075 -28982 -240859 -152721 -10969 -229111 -148830
21835 -148830 30502 -13177 70940 -65261 -136349 -22131 401943 312133 -71267 -248036 -138531
21824 -138531 317365 73141 -7576 -75179 125465 -221985 -273780 193654 117674 -448272 129472
21812 137020 -81404 7894 -11324 -122763 -48989 48992 -284135 -130828 278400 279435 -36562
21800 267828 292172 -2513 33559 -65480 -34363 101071 146480 -98696 328180 -155869 -104805
21789 -104805 109523 57214 13334 134148 210365 482240 -33261 -94766 -181884 -92311 219152
21777 -174811 84927 -28049 -177349 -35612 73919 -394261 20820 -165115 92152 149707 -81259
21765 105249 -43842 -77609 -151386 167577 330830 250454 -74857 7056 177686 -155273 -169627
21754 -169627 -34576 26392 73082 -170296 76805 72911 -199967 3975 -128970 -346436 -179856
21743 -179856 31019 121460 156655 9169 -552909 232383 -266454 -17821 58381 -116472 -243610
21732 -243610 -190885 -4573 3807 252147 153999 58195 -69136 -274815 30155 -57161 -8178 18271
21719 -87286 -238489 -110323 292467 28200 -50489 -158260 147191 -186052 -270108 217004
21708 44236 -165253 -14721 -168071 -20765 -259661 79499 -64381 -237838 -132383 22840 -48902
21696 -150837 -37542 148166 -42942 -86365 -28564 234449 -200215 45469 -81712 -87143 168647
21684 -84493 -214804 173528 39898 -303076 -78653 -226086 204928 186744 105620 34205 -299974
21672 -140241 235480 -149907 -124296 -188710 -243784 83376 -223077 -61460 -40312 -225297 293009
21660 -81714 43518 -52371 29294 28605 -62491 -73739 151143 -397971 -168624 -41410 -117253
21649 -117253 123415 -28183 -73682 -190553 118337 -81943 4631 -35025 55474 79045 65437
21638 65437 -77021 190912 10412 -173320 -170572 -42109 -205181 264961 141969 205356 10083
21626 171283 -72020 -119254 106555 12057 -28052 -92520 -10037 84748 -445204 -11574 151141
21614 -89093 -134438 -155817 288291 7438 143053 90968 -37105 -172842 -57679 -12119 21112
21602 104832 -117710 49542 -376018 -60725 -93035 43999 22296 39157 80436 234483 196152
21591 196152 94573 214694 349054 9529 216021 -255129 -232721 -365223 272706 125979
21580 158098 234264 -347168 -54034 247483 -33028 -102477 -151902 -179534 -7359 -414268 134951
21568 -187973 -103767 -98823 96691 267876 16601 -132840 124203 -131260 267338 -374996
21557 -109652 207525 -314956 38737 -191852 29134 -118668 -38700 -172132 -115555 -108339 -297712
21546 -297712 116197 147769 -175297 -153069 -253483 31026 -155027 -176975 -138869 -159230 49130
21534 -284435 191425 -208550 -70804 -187101 129015 76553 -173534 -254999 394229 -175617
21523 40091 -27676 -339661 41197 -125929 -211959 -149231 76865 38791 33748 -82828 -279680
21512 -279680 338938 -140274 -136238 280838 -344167 199912 -73494 -612203 -404420 -143792
21501 -135446 9799 141826 -24093 94132 -160712 -108365 -88141 -113145 235083 -94492 -57320
21490 -57320 -75323 -123218 -76008 24527 34191 103265 -29777 262545 -127008 -60927 -60854 -122425
21478 -122425 -170923 -122771 58400 -1209 -124304 -132123 -39973 22565 -245128 -227126 152533
21466 215488 96449 -205105 -113290 124361 43975 216899 -118468 -55676 272669 -237578
21455 -386551 -818 277405 -216360 -329141 -168376 -57671 -279518 303415 -201608 -50067
21444 97395 -138949 -18832 -1077 355785 158078 -14902 177749 487944 417336 395660 40973
21432 391845 224055 492776 329852 -19455 101580 56372 -79645 -195651 -155473 138881
21421 160837 -38570 -26737 205208 -3539 106012 44085 174748 -259510 -300914 -173578 -69234
21409 -148845 -192821 -169392 131836 -26997 -113822 18699 198437 116448 -135957 -101216 -270204
21398 -270204 -41377 183535 11153 -406297 -392529 219353 -483177 7534 15330 -228097 -134104
21387 -134104 123763 177305 49654 4480 235906 133363 146132 9777 -208019 25294 91511
21376 91511 50246 108548 324797 78692 -65127 -54942 377337 210671 5506 -188430 -231232
21365 -231232 -314596 182729 160684 -146661 213305 -389618 233128 -386694 -206301 11341
21354 -309041 -122840 2970 -189249 -50214 45282 181567 47403 188805 25312 -44836 -322701
21343 -322701 -171799 -151810 46452 -52563 115694 -126443 102206 23121 -347981 184654
21332 222047 -289749 -228227 189745 -151244 75606 -273268 -92707 -234717 49001 31105
21322 31105 61242 -67180 -324368 60432 -106934 26563 -150492 -149106 -154233 200589 -9076
21310 -11269 -135225 -32524 -151181 -15697 39012 -92315 102507 228901 -121290 116300
21299 -140886 64924 -132076 -60445 200853 -166706 178133 -51370 6432 -96733 -238904 72292
21287 -973 -117731 -133337 67215 1979 -69876 -149301 70648 -128252 -28197 -253870 23750 45552
21275 45552 -132999 -1220 187754 -28097 180907 -180364 -103049 -75273 53188 132166 10665
21263 -11669 -239240 -53719 121339 61467 143435 12783 87247 -246244 309928 -82730 259602
21251 148573 102130 -128063 -190731 29865 17183 -290800 18977 186597 220392 -111851 -60389
21240 -60389 -382798 -207761 -75895 -290123 -150366 101864 -52853 -254437 -531340 -144671
21229 -126752 226884 -139372 139842 87752 181401 93440 -29666 8493 -50256 -77302 -272602
21218 -272602 -148162 28750 -314114 280037 111194 40836 78803 -197112 -51146 211897
21207 235411 212903 169253 -100935 -109471 941 -85798 -15609 -155748 -25434 -131445 121570
21195 -186890 -45162 182072 -19633 -229725 -75753 -97711 -53374 81101 78168 15977 213076
21184 213076 -244131 -105870 -160712 -80333 77223 -9791 -304090 -75544 -54348 -96721 -88946
21173 -88946 -231452 86630 -41353 6005 -70785 155271 -38830 -132240 78652 289559 -316449
21161 -64994 -266109 -129638 93922 51092 57962 -211528 -4725 105265 -122608 -97151 105278
21149 -88232 -257148 36039 324164 -37851 147650 80183 154199 136061 -86990 109560 -131861
21137 343410 -99709 -500656 63737 114868 -122442 61627 -99509 -165525 105725 68510 -4341
21125 152544 24366 32430 -206957 -213661 -40742 -310271 -148738 -128259 -74999 -370535 -149198
21113 -156123 167610 14093 -251530 -154685 147645 -224516 -137150 199847 -172911 324470
21102 -183925 33882 47045 -207288 216418 -5221 -14665 134494 81322 107670 -4742 24332
21090 -133908 120341 -117250 -341630 -25258 -19397 93621 -66179 -144241 -183784 21923 136859
21079 136859 -132079 31370 -39918 311361 -119148 -22401 65679 98199 10178 136929 -205913
21067 -246164 -60479 -90147 101501 -107791 -242909 -283840 129087 14863 104967 -270037
21056 105261 216342 29879 -35803 92077 -335096 155492 -24774 -242989 105489 148824
21046 148824 -184240 1409 42101 -97758 114278 27322 209790 43195 205233 -54204 -45877
21035 -45877 -83090 225745 74185 70964 51383 9346 -7245 37878 4123 247 147852 311773
21023 311773 21843 -171905 -129334 -86689 -49348 -315987 171424 -301687 -223827 -207940 -138043
21012 -138043 159386 -33028 -193396 -209434 11968 -35025 29399 -272137 -118373 -139102 -86396
21001 -86396 23642 -199146 148324 147569 65717 -27011 -174304 -7112 278859 262452 -232767
20989 -31331 -32552 -101152 -271531 84611 12477 101690 39398 -110566 -189862 181148 75494
20977 -14875 122231 4927 -26164 -49027 3116 304073 -156929 -205751 59538 -122510 -174640
20966 -174640 -117501 189707 -247913 -44280 -118025 -158005 -44305 -125663 91919 -128479 -35527
20954 -172810 121113 123887 -83895 -83812 116121 -16509 -32861 187782 -73780 -52708 -29692 15958
20941 478089 -155617 25528 -350571 15790 -208593 50341 5931 -154424 270475 -171264
20930 -15562 -61729 -12867 -541762 113997 -60333 8878 -116900 -472041 273015 -258696 -187584
20919 -187584 -2729 54602 -35684 -49653 80237 -142275 401110 -249812 92206 94591 -199709
20907 222556 93321 37193 -170048 -91895 -268731 -104050 161192 -121108 249855 -64145
20896 -18034 102655 257953 -35727 -179315 228006 -145148 -74836 -123035 -308764 74468
20885 -66124 -48403 -214549 81139 -177470 230952 17512 341883 99733 216769 -128049
20874 -21866 17321 -218156 -150423 -293401 232391 -254606 216526 -160442 -202097 203259
20863 -83019 -163298 -157671 -136876 -86551 -213038 96074 11826 -130276 481574 -139077 -149592
20852 -149592 -86594 -139581 224152 7846 115959 -120920 -52024 195953 -35017 -243083 -78398
20840 154932 37617 -235782 -147221 -8910 168266 -47738 -67160 -242144 -278222 -162822 -160932
20829 -160932 -171552 -67621 -236526 -131992 -86490 46790 168596 -9771 -98084 186082 -238021
20817 38452 -44730 -126418 8558 -205689 81373 -97520 -130735 37036 27144 36072 -288305 37758
20804 -20681 -238136 -138785 -126376 128242 -232762 -153890 -532834 42007 -42722 -151147 23413
20792 -122338 256882 155375 41628 -83881 188828 119152 208042 85763 72433 -49663 187274
20780 25139 297920 44614 133101 -22946 -26579 210910 -122956 -42818 30009 -64091 25468
20768 -6763 -248097 -124167 -211668 99717 -83542 -302413 -43006 -94986 -123178 69464 -336159
20756 189811 37354 176792 -157171 -50166 -146018 -74500 103780 -47232 -48826 -7860 -37335
20745 -37335 -44955 159892 -40860 25075 -18275 3043 -283396 -210538 83505 -91906 -98756 23906
20732 -264798 -21675 150130 -33617 218663 -171618 114903 -292631 -159480 177359 -165834
20721 78879 131810 -203795 -208971 -161080 49996 -312174 -384909 -194698 251276 164137 127418
20710 127418 -74638 -316445 -37151 269900 117107 -167804 -92451 -75152 94910 -175600
20699 271210 -171917 -85432 -72801 -42763 149349 -356198 -4682 46589 -101037 -88831 -310068
20688 -310068 -135603 -393149 -83873 -64410 -197955 -144503 -345371 -187091 -117002 -68212
20678 -68212 15646 -98427 -222300 31992 -131256 113419 -107672 -40509 89080 242601 -193970
20666 -93910 -194969 141518 -142659 -246546 84100 -5155 205126 -273039 399127 171181
20655 -171146 -271051 269134 158556 -370787 -117651 -110157 211589 -244944 -250689 -34473 29094
20643 247746 19674 -31729 -179531 16772 57682 64268 -29167 -226045 -233747 -56805 125027
20631 253196 -186178 133650 57006 -29052 132980 79360 -205183 231447 64331 -247954
20620 -81012 3012 159164 81066 2222 160615 -1188 -143027 -238469 251680 -110111 46280
20608 -57712 79607 -46296 57363 -171914 -85642 199762 -172341 -244520 302290 124247 389659
20597 389659 247752 -181839 -290120 277279 56933 -224978 -201977 -96796 -144300 -113851
20587 -113851 -186836 -131832 95553 246389 -159165 -269 966 87076 222364 130618 -79931 -155630
20575 -155630 -126293 185987 -57798 -69365 -4819 -52141 -213156 206025 -102764 -109104 -40882
20563 73474 -165247 58150 -388464 85412 -134004 -169364 32448 -52662 -6163 -1007 -6837 -432663
20551 -432663 -202070 -61585 -226947 -63411 -139513 -66193 -329598 -189889 184147 -153830
20540 -102313 -132833 -77689 -435300 -451342 83729 -70988 18773 194804 -369804 153098 -128299
20528 -225114 -183783 -76073 -145913 32051 -126200 -115190 -548624 -12708 109558 -253986 50706
20516 -85242 -313290 -22418 -71110 345919 132078 -77709 -209319 -225765 -394488 -228753
20506 -228753 215462 -26668 -100256 -172322 -171769 -89254 -43555 -99743 -62483 10584 -109372
20494 179250 221215 245558 -154955 6318 5510 -295786 -23444 92109 307901 -177927 5713
20482 -38071 -362328 -160718 -228071 35090 149839 -34215 -356990 -240045 64345 -193480
20471 -1230 -217720 -135540 -146607 323355 288478 -168995 -144805 -327813 -174063 274972 -176474
20459 -178895 -788 -11745 -140193 290917 -15324 72927 -51840 -122906 -335959 -169891 -52665
20447 431110 19901 2907 -70240 -108025 -16073 14118 -94751 236610 339561 -158758 -261393
20436 -261393 16949 126004 8069 -128608 -88426 6053 -147282 -194279 13958 221197 -145306
20424 84397 21367 -86662 -65086 -65720 183463 220312 -4643 44411 20576 259493 30541 28131
20412 28131 24190 -278392 -52719 239249 87556 -170938 -238869 -184564 83476 -104721 -63142
20401 -63142 -383653 -45613 6949 87233 -16511 32586 21310 69060 -294294 -292655 -127703
20389 -92214 -303258 -97689 22645 54253 -420779 -73292 56043 -128860 154925 -57522 -174340
20378 -174340 -209614 -92828 -114972 -486835 -145814 -53252 -92182 -10284 -153003 -146604 -229003
20367 -229003 81902 -241301 -36358 -124230 -26445 -345851 -194580 -36814 -35589 -316920 220203
20355 -167886 333127 159396 -85050 -19769 -207547 -84061 73061 150609 -82145 50047 -37175
20343 178448 -106348 -464880 -447485 168556 -76736 -295784 -301592 -153184 -90532 46470 267919
20332 267919 205226 250614 -172259 -421028 -220433 -232291 154344 -133148 50094 -18513
20321 7857 62625 -124946 -18274 -88047 161557 -31630 -156363 65288 -134795 118088 -295195
20309 65607 -203812 147127 -231903 268388 -37038 -64120 -206807 -147523 67302 -118468
20298 -71331 -102025 65145 -287957 -112935 -344474 127680 -36724 73278 165077 104545 -114592
20286 41805 -215215 86835 -126961 -54263 130596 -171450 -107713 37893 -249544 -1024 -188283
20275 -188283 162552 -7075 -101640 -19882 196333 17223 -205464 -190735 -20610 29903 -87377
20263 -66668 46507 -35330 -125790 71481 -121331 -229975 -109156 175653 261643 -129717 -8194
20251 -13201 -339106 -155369 -139918 151740 92585 -78451 -319744 122118 -285946 -107165
20240 -185949 -185235 -66821 288872 84537 60310 -319744 -235227 53059 -46989 183290 14547
20228 77667 95066 -331016 -3654 -306542 -213918 281605 58607 -81963 -319924 260776 -16271
20216 16239 -412026 72710 -62822 5506 -172552 -127342 -415877 -190862 19077 -367080 -6041
20204 206306 156281 -130514 -311996 64306 -113336 36386 -16862 -233274 38387 -337928
20193 187557 91357 -212878 143595 262884 146475 -326545 -12317 2212 193716 -48707
20182 -43073 -377438 -99986 39093 -167147 238154 348710 -347344 -104887 -30519 -173038
20172 -173038 63781 107332 -176842 -26995 76389 51566 -87880 -136080 84359 -12836 295562
20160 -158681 -337930 -214411 -238887 -10659 129404 45613 -186269 -214123 -255123 -94010 -89627
20149 -89627 26053 -152603 96482 148553 -1455 129184 222711 -537651 110910 40730 119253
20138 119253 264166 156099 -448413 2368 44219 -99396 -211879 -285381 -31998 -56597 -312531
20127 -312531 -361148 -11603 -44714 -211051 433261 -314335 -198651 -41880 104998 -2245 -217181
20116 -217181 -244587 -286811 -84303 -279968 -267944 414641 -66760 -98154 -148705 40444 -223010
20104 -74376 -395728 -65118 81096 -348364 136053 35930 -200491 -77662 -304369 -54879 -96248
20093 -96248 -81698 -88486 271091 -309016 -177571 103363 -131824 -129385 -357035 -21882 -187646
20082 -187646 150437 -98084 180186 -137911 138011 -222693 20004 -97856 -179347 102361
20071 -180673 -136168 224242 -156335 141797 313440 -352733 -39223 141419 -8772 130746
20060 -105142 -404503 -131395 116103 -11516 207153 928 59047 -242172 -284553 -72872 -60443
20049 -60443 179323 77093 315532 129942 5473 -89529 -109920 111974 -321014 -65125 -156920
20038 -156920 -15848 237779 30673 -161231 -222325 124389 14210 153498 227827 -338988
20027 -192182 -177782 2766 -98574 -89158 -86781 -249260 -24507 -299603 -237968 -42814 -272114
20016 -272114 176658 -20000 -235092 -570170 -215698 13589 110267 -124896 -92552 153190
20005 -224656 261799 -249009 -251261 -268841 -235600 -190286 -220493 143283 87283 -332117 -297826
19994 -297826 97059 465436 35608 44451 -16564 -43646 22878 33776 -395476 54074 169156
19983 169156 -28131 -201363 -151673 361414 78549 -102882 -45942 -23393 140903 -214818
19972 -167932 196616 106412 84402 -102400 89358 -183114 184688 -25978 -146901 109233
19961 -100684 -282004 38827 -297460 -116600 32511 84833 -167653 -48584 72058 52983 -112758
19949 257511 731 -164502 71259 -107850 -123568 28501 53038 30744 -203201 -110939 18164
19937 -373831 112804 145462 15702 -30477 -36702 132959 24615 -23338 -386346 -139395 -468705
19926 -468705 -125094 164478 52186 -40478 43092 -199739 -586270 -28802 190359 42863
19915 -81036 111939 32045 -138053 -164456 -87122 -303065 -1388 -249278 -779 -23602 98089
19903 -45621 -90743 143618 -13600 131616 196330 -179584 -85944 -253445 65614 -43946 -19343
19891 -146885 -36816 29685 -85442 -65963 22552 -76536 38695 -253172 -280066 2178 168834
19880 168834 -326701 92355 -275488 91192 -20157 52258 -103425 -118119 76407 19202 -24483
19868 241754 -73744 -304150 71468 131891 138167 -101516 -39831 -311328 -302366 62212 -172813
19856 -298316 -462 -437507 -3187 -51321 99095 -54512 -216250 284567 219755 144557 -232920
19844 -29446 -174095 -188633 -360595 88011 40745 -9266 72328 189478 -46162 -26026 -297653
19833 -297653 -281427 -63505 -281414 12319 -320377 -340171 -49927 -185082 29770 -183875 83871
19821 -331116 -48991 -220649 148202 -106478 -467266 -103604 -310844 -53237 -412866 -30351
19810 -161812 -48321 61976 -134952 -94902 8350 -146569 -28881 145936 -138466 -51890 -259943
19799 -259943 -16298 -1605 99037 -204397 26527 -193247 56044 -65650 -103855 85192 82719
19788 82719 135186 -321765 -150451 60470 -62691 60725 -242298 -230373 46199 -25665 -95629
19777 -95629 -168549 285556 58563 36480 -64881 209240 54606 30015 206149 -218818 77649
19765 412749 -254539 -217366 -203518 -180125 -265023 71531 -145196 55205 -216538 45545 -134633
19753 172477 166950 -26741 276601 1363 53383 106816 -48123 -33454 216961 170029 12598
19741 -17445 252919 -137687 -132926 -184646 -346085 -170657 -115646 66098 -271765 -244933 122559
19729 -370606 -35995 153637 156829 7457 37205 -113349 120489 -64197 -207733 217290 73613
19717 -157698 -314326 159776 -9534 -121652 -70740 -105189 -187413 -57337 13140 -63840 -105442
19706 -105442 -303516 126121 -106156 -219060 215920 -50404 101900 -292171 174049 -179269
19695 -138495 283093 -94953 -302445 174428 25458 141215 7214 172292 -38660 -303673
19685 -303673 -42779 -268835 -6995 -91594 -145865 -143092 -206494 43413 79703 -384169 -91534
19673 -79084 19843 -104957 133568 -273407 -43899 -91026 -17873 -230594 -74786 -236741 -20185
19661 87021 -131443 -202057 -49160 -17472 -51073 -598 -411791 74255 -150070 -92856 79569
19649 -61652 6590 -146543 -27376 -90615 -58160 -105469 34656 70840 326816 -245562 250666
19637 -349600 -189323 56261 98089 130777 -83295 10712 113162 193289 -206946 37094 -209527
19625 124200 -111290 -62500 -56502 -162105 127991 70943 89546 8738 -67082 -217677 319868
19613 -158437 -74032 -95643 -76894 -238285 192263 -353593 -143644 246955 -246661 251989
19602 -53290 -28966 91971 86757 67617 -182679 -181926 -31308 271201 5440 90684 3052 123903
19590 123903 -139105 53330 -295994 -42360 -118636 62858 85079 106486 -174176 -220838 100024
19578 -161806 -71960 -80400 -42972 -116887 -133497 -211513 198401 -287305 -288362 175182 -166469
19566 -228994 -127369 -113563 -59857 -193030 -128082 -94248 108355 -161900 -285104 -160437
19556 -160437 -44716 -150884 -170 95007 134551 -60437 16576 174937 -87710 -162140 -32534
19544 -174519 -96192 123637 -61990 -18637 237579 116915 91472 -79518 -72169 -202048 180976
19532 -109160 -201072 -150329 131257 -106334 82738 -303013 -20665 -105752 -219066 -331431
19522 -331431 -417010 -9595 111741 -33760 -209704 -70400 92705 -27471 -53568 -270752 -45421
19510 64286 -94307 -180263 254849 -234049 -107453 -352362 -236434 209633 99320 114141
19500 114141 -136996 40492 -65983 -143230 169975 -281028 -323449 51259 35890 -130230 -214209
19489 -214209 -164365 -42926 232400 -9744 -524164 -173481 -272711 90236 -53051 -177656 -269896
19478 -269896 -1236 -43715 -136300 -158336 -301011 395324 -61180 69666 33272 15822 38621
19467 38621 127792 -149055 -172424 -25487 39455 -321499 -255941 -5468 -125042 -424936 -220061
19456 -220061 -298358 -189547 -194790 430058 -320268 -22325 96254 -75807 59292 27321 -19351
19444 -28041 107763 -157646 -223454 -169793 -88892 155948 -71433 -372879 -333290 -31309 -173128
19433 -173128 227382 66498 -321557 21311 -109655 -16090 -226244 -198912 -80968 120195
19422 -319670 144275 182293 -212192 50153 270330 3691 -181845 -211352 101003 -81065 50182
19410 -49527 -104693 217852 -185062 -242231 -330212 -9511 42585 -158413 -299227 84259 258648
19399 258648 -167241 -214031 44666 204171 -133031 -86099 198086 -58105 -132336 -10219 -53375
19388 -53375 68904 -411364 131381 -114485 -54424 -125670 -16966 -182294 -181265 -482826 793
19376 -60735 138797 122560 151871 151755 -180474 31480 -124973 194933 -98582 45798 -87453
19364 -231224 111719 189956 -13933 -168719 183161 -48434 -134803 -380504 -76857 206918
19353 -432883 -536363 88083 -92015 208017 -353969 -151428 77059 -164314 -8622 -133367
19343 -133367 -166690 117255 -123963 -378550 -103938 185306 -47501 14507 9338 176367
19333 176367 -405519 130836 -512990 262794 -136978 81099 68471 149341 200492 -222263
19322 -254118 119363 19346 -17465 -230408 -117326 -131592 -208682 -209523 -324520 -139960 -131363
19311 -131363 -212704 98919 -202362 169868 -5200 -175866 -120216 -68192 91522 130378 16796
19299 -1786 16703 -208519 -58482 -225114 173184 58416 -224271 -109460 -36471 -67989 -220432
19288 -220432 -29680 -108339 -23210 -116399 -88612 -68668 -144066 -96256 -264631 -60094 -243583
19277 -243583 208831 -78604 184291 51126 -333468 -92669 -118614 -89025 -268317 -111606
19266 27308 80363 117077 -145634 -19546 -265644 -78319 -123372 -180776 -58929 -237631 -50958
19254 -345273 93125 92608 -15028 61133 46011 -113459 -308523 -304531 8265 119878 153103 159885
19242 159885 -234238 -111038 -41769 -5736 -94450 -247668 6587 190290 -54351 42034 -79233
19230 -26679 161311 -228275 -223610 -161909 129455 1710 72252 -242074 -230064 -263228 -60091
19218 230324 109412 -276894 -32123 -268496 -238447 -234364 -25941 138665 -61772 80987 184915
19207 184915 -58852 -142491 -51776 -241009 -222144 60377 94865 -251403 -53399 94785 347857
19196 347857 -317288 -374291 215341 119792 76311 -870 100414 93623 -77006 96766 14193
19184 -118233 -246449 58882 -145462 -418612 -225365 186421 -117914 209533 -256293 25231
19173 -11956 -319472 37496 -25471 25971 -25839 -110245 -168521 127817 131317 -133085 103481
19161 -92246 -32983 -65842 10883 243096 -40386 6513 -49220 -33077 -108077 -87195 183175
19149 -134707 -283645 -10495 -97350 -25228 90981 -354353 78412 -73150 -363673 260403 116468
19137 68119 165483 -192850 149437 2733 -90867 -260374 120371 -53810 -159286 -211897 -143672
19126 -143672 24220 -40595 -181467 23530 -226535 149392 -20848 47395 230458 95959 326282
19115 326282 53187 -190742 -97811 -14336 123783 -169053 -103280 -59129 57509 57124 -10050
19103 -25274 -313526 -225251 -301413 -37604 302938 -109982 -100256 -102673 -175918 -8969 -227294
19092 -227294 44687 -248159 -428145 -81195 -20327 -10248 -237552 -226507 -187610 129561 -137730
19080 -165369 148507 -131006 92098 -336228 46746 -193591 58341 152591 -53586 -157667
19070 -157667 -63670 197820 23210 -158790 -225521 255130 8800 266632 -117823 117843
19059 43949 -151701 62891 116863 -309988 -66824 -37738 131504 38771 46354 -128446 -190008
19048 -190008 312154 52649 -420435 -33592 319259 -490868 -52035 164112 -242696 -147341
19038 -147341 142355 236914 -123737 23038 -203448 221487 -25332 1030 -244638 -5316 120333
19026 110969 -3662 -4739 -15370 -94425 -97387 -311473 -132876 -202182 -65124 -149298 -191264 60922
19013 -267675 49096 178380 22247 72638 -154010 -309303 -79015 -303492 294574 -228382
19002 203986 -180268 54658 -267500 -232518 -127617 -220153 -71926 78359 16006 -191473 -218967
18991 -218967 44951 39676 -454033 1475 -77196 267865 -8040 250771 -105719 -277926 37003
18979 232623 -166179 127467 -223530 -65207 -452025 -168505 27734 189967 -157851 180384
18968 -133501 -72609 -149389 -204772 49031 -334728 -34044 -87761 -95751 -271162 -198123 -94923
18956 69868 -281870 -253534 21480 41553 44749 13153 -121775 -99524 262988 -228936 -172919
18945 -172919 -193921 -18021 -10948 41638 -80200 -78101 15601 -59377 177041 -174964 -116789
18934 -116789 289881 -129001 -256694 92631 -69025 175343 5775 -159735 -126602 -199671 -285295
18923 -285295 -195451 -46664 -218575 96918 106509 133409 -37253 -157302 55249 -475683 237419
18911 -414514 -350089 -202240 239756 -52013 92771 222828 -57718 -112621 47806 -192478 -230803
18900 -230803 -150783 -95714 254495 -135337 -19772 2375 -195282 -514452 -175282 -93364 117233
18888 -18388 -65906 117384 -388757 -111047 25111 -52480 -68285 -287847 -4004 45755 -431398
18876 90182 -69579 176455 -144008 -12562 -291009 -168542 -175069 -127102 52898 6390 -126388
18864 -81912 53376 60421 102442 -106928 195443 -91412 -99045 15977 107755 -25404 -87910 -72858
18852 -72858 -13155 -122909 -73962 -108342 -341659 -255499 -266566 -42831 -277853 -21121 -311829
18841 -311829 -479490 -189290 125816 96705 -135977 187146 1757 275830 262733 133382
18831 133382 102981 -290343 -178384 51714 -126459 -98396 -56269 -471630 -76390 54126 -43470
18819 161597 298393 220647 294654 6565 -338056 20794 -258897 74245 -301498 -241610 87812
18807 146122 -153939 -129934 -440213 -260502 -82687 -54379 -264610 -183532 37763 -297812
18796 -26757 42073 102423 139177 66911 142986 123077 -261378 122964 -33880 -295463 21179
18784 29656 -36986 -148367 114144 181316 31418 -8693 -157396 130963 54469 226701 31024
18772 -24250 -170725 -48715 34188 -225802 64728 281885 -186095 -320373 -285358 -216842 -159881
18761 -159881 166633 -149396 319172 -257526 64383 -2025 -10324 262342 59990 51365 -92519
18749 194340 -408825 168068 -116447 -85071 284526 181750 -102734 -55210 161605 77876
18738 -249770 -289507 -58053 9041 176060 218427 -40496 -126795 -170412 323711 189162 -254730
18726 8704 -189766 320633 -226341 -111982 202586 -208540 -80435 -145983 41599 26745 -280262
18714 -159088 -301362 -417537 -64222 -337991 408758 64025 116365 21270 31612 -75469 43502
18702 37214 -339635 -58632 8213 -22845 -37231 -104341 458 -108880 132704 -22229 19642 1035
18689 7827 -99324 43826 -121341 36457 -158584 -201071 -93183 -182332 137694 89685 -236732
18677 -82362 -251880 105011 -278759 -113507 -209263 -212722 3589 -82371 53362 31757 157773
18666 157773 -36274 -160165 -27767 -147965 263100 -25777 91701 -111793 112557 53764
18655 -9258 177955 -33142 -79079 267319 1124 -143712 -263163 124183 24987 -215954 45381
18643 -291511 -29261 -51234 -42529 -56402 246593 5328 58140 -374733 28433 113179 -95187
18631 -25003 -55416 -327682 -56568 -124119 156771 -123599 42871 -124601 -176005 125727 58391
18619 126216 -122899 -298872 262684 -330146 62738 367241 -138271 17794 -3452 -166000
18609 -166000 -10634 -51535 72652 -159739 -194555 147233 24380 -113107 -58576 -342656 -159225
18597 -192631 84446 -506822 -77881 -52696 11087 -349038 230026 -132036 -73793 51531 -267325
18585 -157900 -268102 6420 -150199 236366 -290690 -173530 -109696 149551 31208 -185505
18574 228536 -351288 1666 -42992 -127204 -37482 1888 -40353 104709 42037 77846 -31277
18562 -93408 -125886 85047 -114044 -140471 -43354 -134943 -191174 5568 -221844 250120 -109521
18550 -234634 -109875 -177701 -122318 207069 -93405 159875 197854 -355851 62248 -245155
18539 -181137 178962 265097 182071 -61939 -464028 131684 107401 -332170 112620 192638
18529 192638 107198 -40096 -5776 22865 171573 -113298 -220276 -184117 351563 -50695 219537
18517 -274242 -330606 41729 11455 -22866 23256 11519 -119324 -247660 -199318 -147645 -109761
18506 -109761 154646 -107544 33737 -106862 158678 -250051 -46352 -319807 26150 -1039
18495 16153 -8425 446859 -130470 52661 -103813 77423 -167275 -31903 -97256 -113902 -199242
18484 -199242 -281696 -515584 -91408 283285 -6911 117604 34119 -427875 4572 197205 -39811
18472 -133843 -335023 71008 508 -200095 -5595 -8980 -12581 -9415 -16493 -284033 -55067 99776
18459 38425 -221416 -99101 284839 166780 25305 48690 65501 -33394 -152814 -446541 -45948
18447 232269 -279127 -163436 -4908 -275899 19539 261165 -36312 -32417 32886 313475 -149708
18435 -137333 -130095 -223546 44351 -33109 -255771 -26929 -255216 -32738 -102013 -259330 -210436
18424 -210436 -84846 193844 -172430 -200227 -135735 133497 -239882 -97798 21790 119309 -45610
18412 -89742 -323564 -230933 -183967 -320999 -69228 -145238 267865 -131472 263149 85520 -102847
18400 -88794 186089 141551 356297 -267775 -1106 -366293 66955 28568 -19873 314413 -157589
18388 -37927 129709 2990 -215827 138770 -128370 28298 -13319 -495145 31718 150580 146557
18377 146557 -314627 3614 -100176 -166093 193843 -224446 -97388 -101779 -78133 -130646 -10240
18365 95344 200512 60628 33603 180352 81817 60142 17989 -104419 -107307 30422 -199329
18353 45866 -81674 -3599 153451 53694 -264357 162931 -310802 -51081 -221107 -2690 -110700
18342 -110700 -145164 1412 -192997 -336 -151732 211743 -161616 140171 167636 65751 55730
18331 55730 61529 -161240 230128 -85077 3841 106242 152678 92209 -83184 -335517 100407
18319 -173252 136050 -59280 55991 -283790 113979 -36203 25865 -61825 73239 -81918 91444
18307 168783 196595 196696 239484 -160548 -346030 -66060 26429 -171836 268067 322458 -224616
18295 86467 -160288 59142 -19954 -41434 62295 197814 78813 45734 -55845 23266 -228965
18283 197840 -305655 23592 113585 -237863 99569 78046 -199068 -49403 -40183 -94856 164506
18271 34144 144120 50105 -272563 -218586 -266297 -331626 177688 91733 -551050 -150971 -339473
18260 -339473 36309 202256 -128833 -96163 19229 -292378 -206645 5023 -220129 -295336 232817
18248 120740 186496 -278814 -31148 20273 -228095 84592 -27838 -159668 303730 -46787 178365
18236 63670 -62179 50797 -241856 -33790 91152 -13033 -210423 -145869 -226536 -113032 -72108
18225 -72108 -79305 65295 11652 76532 -51043 189309 20068 153957 100282 -89300 43858
18213 -307698 28453 -257884 -37844 -329511 228982 -250178 147660 491752 159398 169173
18203 169173 34519 16508 116401 -274413 -259512 -25239 -120656 153038 -10898 -100838 37243
18191 -245483 -604605 -63407 36176 -104234 -30018 100387 44954 140960 -273451 127201
18180 -29816 -73524 146934 -40206 -72364 -276441 -35234 -160981 52566 154985 107088 38831
18168 37595 -395200 -411645 99462 -179252 -60353 -348724 -203396 -114974 28037 206135 -156121
18156 -122222 -219743 -77890 74792 73212 -78414 -82989 -189562 -356450 92079 -546943 155627
18144 -167013 -171269 -168119 234355 54630 19874 158753 303222 24102 285272 -126383 -105115
18133 -105115 145399 60906 210229 -226873 -91916 38681 194453 -91472 12006 -174951
18122 16504 -121048 -3238 -14532 69797 -347888 33757 28441 158399 73639 -25759 6881 -113619
18109 59789 113040 394632 255048 205475 14368 118178 -386657 171005 391724 -170602
18098 -77985 10703 144861 -28402 -38041 28545 -44757 102195 -272808 93334 -12751 -135450
18087 -135450 15569 273732 -75293 -370153 -94453 -46486 -218258 -226510 -9327 57079 215001
18076 215001 -64454 -178259 -319866 111706 -211899 -233629 -457949 212423 -200261 109161
18065 93641 32369 -9379 -456515 95615 -217375 154356 -234886 460898 49898 118552 -27079
18053 870 -43841 -31278 353880 9118 102219 -197260 -182127 -22679 -238776 128370 -22381
18041 -271768 -32797 124995 -22274 297672 -277958 268552 279110 119591 -311171 19124
18030 147449 64795 37149 192894 -124724 -40293 2768 101978 -319486 24148 -142606 64343
18018 -296199 28410 -204960 60075 35025 -142523 -142318 -293231 68087 -228006 -128412 304675
18006 -73397 -2543 -133061 37027 367819 141995 -119143 -159262 93855 -155269 -198010 127461
17994 -145430 27586 -4782 189660 -152357 178884 -288522 187268 -51795 239329 10448
17983 -56678 -110337 -77851 502 32178 200939 327676 15276 -84927 46027 -153555 200851
17971 73044 38870 -122932 -4547 85157 -39050 109270 64367 116249 -121002 -223769 -7399
17959 -27539 -22979 95326 9927 337255 -24228 -316 281483 -33571 -185524 -85493 -394483 9513
17946 1243 107260 -37255 82249 -246606 70971 -86684 -76681 37794 -49797 80309 -317389
17934 15644 116649 -238268 -142625 10986 414882 15769 112436 -119831 11693 113556 420058
17923 420058 61236 185961 -99966 -141323 260756 184863 32249 257571 178235 -50180 3579
17911 -193563 164361 5222 41006 -386693 -57364 -197287 -311064 -87189 76661 16872 -80095
17899 -270596 19058 -44700 73579 379897 43794 24264 -29510 233444 72573 132888 -161185
17887 282364 -152228 187288 143125 -180235 -358445 -19881 -110755 -1959 -59810 247661 293697
17876 293697 120496 -140791 152619 112745 -125134 -245592 125044 33280 -10259 319622
17865 220743 -133946 22780 9244 72422 -154568 -82401 24734 -161363 44523 -81992 -418604
17854 -418604 -247042 -190629 -54591 186828 -59585 192926 -265028 -82987 -96371 108089
17843 -78550 188218 -2376 44331 -167302 16288 -18060 229263 -8330 220361 -246437 -343491
17832 -343491 -22575 124583 186908 163035 -2999 -102527 -214742 -158148 -143401 45841 102310
17821 102310 -3709 415051 -125096 153840 165845 109537 -391432 79756 -44120 -204831 406807
17809 193950 -276728 252478 -395898 77617 -77901 -27323 183745 64609 289016 201066
17799 201066 179344 -130882 354345 5792 -131957 -30924 83195 178240 59339 -47035 293790
17787 40404 -36050 386305 100609 -377777 -97479 -164456 -26636 -81098 -394248 -40799 -159414
17776 -159414 243371 203300 -133494 115209 104674 67870 -228241 95685 37571 -185583
17765 -165403 -456389 -153644 -108932 422598 -472384 -37469 -166065 103193 -241280 -246104
17755 -246104 -30536 21912 -147802 -174776 -74372 388495 -242195 45715 233238 561 181095
17744 181095 41987 -212436 183450 -277753 32322 -125819 29052 222383 -100396 -93009
17734 -93009 -141806 -105340 73149 15661 46690 133495 46450 110577 100248 139407 -167209
17722 -124375 187541 -121541 -52269 -5698 1539 -22270 -93266 179465 56690 133535 439482
17711 439482 32341 -41459 -155964 -139187 40335 -159252 -14680 -164911 -242392 277070 23823
17699 -90836 -56503 -97870 103509 161741 -93915 128670 137656 -219867 40576 41979 22970
17688 22970 -306647 237892 -68994 -72163 62646 -32212 53713 371895 144871 -179073 88460
17676 77770 76077 161329 243023 8795 33033 193007 194914 -33831 32145 -10068 -373 -133929
17664 -133929 -173674 -1632 -38885 -67494 -71613 127469 -131403 173581 121992 6292 282475
17653 282475 -123534 79985 -238005 108634 -100142 -214452 333484 -74652 -156028 193389
17642 123327 126722 -50864 62110 190414 302697 -42542 271536 304095 -125145 -113 -133400
17631 -133400 42794 49077 225813 33449 -118467 -121398 -196797 158011 47573 44195 -59204
17619 -86962 -132962 343777 142480 369327 -64107 -70632 239134 191932 -124506 -246879 66033
17607 -133641 -158890 82850 19310 -242144 65047 304499 122123 62650 -37832 -114112 -203257
17596 -203257 7415 -58543 165210 139789 -239683 95464 -209440 425929 54234 -226033 254313
17584 111612 66166 -167000 148851 -96903 186751 284815 222638 294591 84175 71457 161780
17573 161780 104453 -290039 269632 218874 143599 -336814 125263 57134 440289 -141026
17562 -248320 82150 136293 24696 -138394 83023 -8273 -77216 104293 -67666 120277 -114863
17550 187100 27548 -66376 206077 -4008 159187 -267127 154796 -17266 207888 -229852
17539 123888 -62606 34403 146259 57160 98944 164095 5814 -24245 -7755 -91406 221215
17527 279156 -316486 330730 325780 44091 305552 295485 77255 274462 -137569 377938
17516 148571 -116696 -270129 -280773 497913 77066 269256 285192 193524 200385 -370013 34886
17504 25056 30742 164842 210868 173445 69362 25708 -81044 334044 137422 -185788 248184
17492 -26098 77605 90250 187905 366779 111378 33400 -86570 47639 7255 334984 -337025
17480 -51143 30297 -210628 115996 300131 -178758 -215466 295758 339660 377118 -174526
17469 114352 63130 -70829 380702 -191299 202347 -111509 28406 316122 148364 298224
17459 298224 -33076 23889 119790 -161855 -58812 233256 -77026 230191 117849 208967 64371
17447 402465 215347 387238 424405 112679 149702 541425 330447 492646 275687 -49909
17436 276859 34304 167049 105906 168299 175357 303440 87071 134683 295092 202451 390379
17425 390379 330071 -65134 42046 117846 120314 257470 463779 407315 184247 254451 542156
17414 542156 232166 257205 337186 630896 216224 214181 11273 130104 183246 151814 415904
17403 415904 -132838 99557 486169 -94407 230726 38108 269593 55929 280918 58134
17392 108294 106430 102189 280748 -51457 45078 253353 411296 180867 48207 389419 356022
17381 356022 487836 222372 225106 94676 236466 41797 133667 134011 83759 69408 40005
17370 40005 339999 491994 532693 287440 276764 225409 295057 -88612 19768 106504 32322
17358 -89748 -20111 152180 -252684 263007 -128404 -235111 454698 657816 -211711 -13006
17347 98522 230030 64342 28702 313579 206743 381294 -46946 379942 336078 -18869 -11122
17336 -11122 121686 253004 -18417 272195 -32343 224126 312112 265603 -163796 199224
17325 277350 152024 40306 174631 563453 -173880 272339 339051 -14936 141805 347659
17315 347659 308277 112440 -116680 104158 141022 26968 110070 -103388 70905 84086 -148826
17303 -212798 183308 -126153 132897 79332 346126 -193083 400546 330093 167897 28550
17292 -56389 -19365 95324 157485 229457 48920 6345 387105 252253 79965 167484 38239
17280 176464 80268 80765 176725 152696 256355 -43614 -27047 465005 349077 -59134 150981
17268 392475 289000 239459 430573 -10317 -247246 439832 -76092 -141629 164413 110142
17258 110142 100143 145405 164251 261893 87110 -78699 -44983 187991 157756 273298 240732
17247 240732 81195 215198 436943 -16912 202861 268434 329488 250508 133285 94329 256040
17236 256040 524344 174185 316232 39005 385495 15138 141368 254133 -80786 114602
17225 298214 195588 -121227 -6812 208423 300796 168671 15282 162098 178585 182994 418804
17214 418804 446347 354130 244834 447271 353612 81335 224238 22999 367850 456339 -162446
17202 89365 347956 404042 278396 209636 612787 96772 -194399 356007 107584 140574
17192 140574 -8937 324392 101350 68450 210626 309910 21467 502651 86549 227499 374085
17181 374085 299941 163279 365091 -3799 206586 42637 427884 432059 271101 406399 292054
17170 292054 63336 480182 74136 539622 121718 158073 388330 115499 132381 223514
17160 223514 362572 -37254 210493 314253 309744 479353 349415 169590 119190 372931
17150 372931 414893 85397 346414 203203 173895 -36263 246313 246996 298792 253871 215937
17139 215937 79237 601335 420028 363364 301734 108548 458641 391024 236456 361061
17129 361061 348504 211203 353220 424088 524556 481182 333070 206899 255526 244887
17119 244887 491844 15287 248430 296498 323482 495314 440466 502299 277602 254486 528721
17108 528721 145827 203715 257461 454702 573468 351748 392260 302822 259184 89381 205742
17097 205742 435929 239834 429980 402564 198818 382482 307627 252511 304126 329152
17087 329152 456952 377473 123716 424558 108733 604142 453780 288244 573449 310361
17077 310361 499772 250597 406444 599230 479246 281954 526584 266715 468180 485804
17067 485804 213838 321222 596352 357740 280825 590223 583391 673098 551863 661170
17057 661170 542603 495400 380122 667882 713287 817260 401804 702148 389770 708521
17047 708521 724203 33321 713660 650983 579516 295473 640823 288047 649525 29065
17036 720166 558439 554893 139754 339786 340329 404139 876388 543805 702290 347797 695856
17025 695856 711991 573909 747214 277782 326412 667386 762545 767325 329515 511382
17015 511382 638089 314711 764468 365866 333433 690296 556559 735785 518201 490889
17005 490889 805050 493320 480383 696364 415314 803590 622323 792521 1026683 760142
16995 760142 434245 574978 624853 681628 666906 750728 725398 777158 404176 372445 590360
16984 590360 730920 427734 836205 489761 811965 756588 730879 577591 810261 938814
16974 938814 771585 928476 652055 938331 914505 812450 853799 812383 969909 657795
16964 657795 525404 707827 1063306 1034281 638232 894036 998788 943203 711033 932688
16954 932688 943467 876995 991221 727703 957470 816660 1023284 1093752 861481 1030294
16944 1030294 1139562 1058288 852086 1226468 1261514 869174 989557 1128766 1187589 1232169
16934 1232169 1325042 748285 1269668 1148040 1109477 1133640 1018806 1153873 1467949 1229407
16924 1229407 953693 1195071 1207645 1210941 1309890 1439195 1352223 1338799 1440832 1305672
16914 1305672 1252559 1022082 1369324 1274928 1347909 1520552 1478514 1480711 1704781 1675813 1443090
16903 1443090 1641443 1513322 1361807 1316776 1576695 1495618 1790203 1684696 1641320 1922773
16893 1922773 1839173 1963524 1847250 1722110 1690502 2012994 1893898 1972327 1636105 1755709
16883 1755709 1898311 2209962 2221972 1900869 2232297 2010956 2207614 2300212 2654666 2110586
16873 2110586 2244608 2132508 2218215 2076647 2283968 2256624 2920214 2166106 2704148 2363577
16863 2363577 2576193 2746747 2504173 2488190 2593738 2625886 2802156 2757023 2951419 2813851
16853 2813851 3028724 2825748 3106866 3031195 3319892 2883694 3586681 3282030 3286236 3240853
16843 3240853 3475954 3327604 3382374 3691226 3430151 3514848 3908549 3626819 4021567 3846495
16833 3846495 4058258 4135184 4294465 4231909 4236654 4217332 4406009 4651681 4877056 4598134
16823 4598134 4916505 4744852 4959168 5211454 4932489 5279331 5424066 5355191 5952771 5650191
16813 5650191 5867677 5924625 6035607 6162743 6158100 6511719 6529849 6599641 6865872 6856541 7126751
16802 7126751 7625515 7273579 7547392 7864297 8156610 7947085 8276377 8705778 8931380
16793 8931380 9167158 9404960 9365258 10053110 10053545 10300264 10399574 10989877 11365520 11789369
16783 11789369 12086335 12536911 12631344 13014041 13318543 13765438 13743699 14463289 15034928 15752591
16773 15752591 15755460 16678920 17384866 17981775 18276379 19189397 20011568 20469981 21128916 22184265
16763 22184265 22926491 23844827 24933355 25728177 27235852 28470427 29605095 31177789
16755 31177789 32228989 34141187 35590463 37662284 39164086 40940917 43290487 45381299
16747 45381299 47925950 50245123 53267440 56136604 59502555 62680228 66641819 70743954
16739 70743954 74812847 79711209 84514502 89654578 95387226 101882275 108702375 115444513
16731 115444513 122838157 130902299 139278443 147786638 156416582 165643275 174023045 182555200
16723 182555200 190851110 198263541 204495484 209777553 213469387 215340067 215797255 214023377
16715 214023377 210741907 206207442 200136466 192865513 184864389 176425104 167571437 158382616
16707 158382616 149335600 140215332 131759823 123427392 115594380 108526543 101316541 94872004
16699 94872004 88837226 83092082 78068044 73217647 68606487 64597477 60843425 57584957
16691 57584957 54215413 50855293 48150136 45824379 43102827 40985722 38625582 37035393
16683 37035393 34953781 33848334 31733254 30381159 29262016 27766660 26469294 25702002
16675 25702002 24477921 23341476 22063137 21338531 20609759 19695571 19302425 18330395 17723323
16666 17723323 17265172 16435015 15846818 15354382 14520860 14262967 13593542 13413504 12789973
16657 12789973 12785901 12373459 11854055 11407103 11042966 10784128 10427536 9633932 9971635 9536347
16647 9536347 9400851 9035071 8637821 8317772 8220248 7870547 7647634 7484702 7124362 7276637
16637 7276637 7142783 7028829 7205670 6791745 6240915 6354301 6153698 5796706 5806900 5744271
16627 5744271 5488225 5569639 5338768 5145504 4994189 5013453 4648269 4784058 4469318 4293723
16617 4293723 4264975 4643197 4406657 4149770 4203315 4128634 3797071 4207167 3693140 3792273
16607 3792273 3619621 3722102 3495278 3396414 3039536 3205274 3464598 2968507 3142957 3054548
16597 3054548 3133734 3092646 2686376 2969180 3127152 2900183 2825302 2706135 2632720 2732995
16587 2732995 2721711 2725716 2302577 2439946 2524428 2137501 2543614 2556735 2370822 2241163
16577 2241163 2263461 2006357 2149985 1874754 2098169 1763274 2238098 2208474 2081114 1789245
16567 1789245 1891649 2038316 1833136 1946272 1704738 1622681 2059637 1873070 1786258 1978432
16557 1978432 1766716 1872900 1347763 1322234 1563165 1388464 1536306 1416066 1067375 1443497
16547 1443497 1295950 1386964 1521122 1481719 1064416 1382274 1304652 1105126 1218239 1217766
16537 1217766 1268433 1423922 1315446 1277013 1189802 1102155 1214331 1001140 890586 868476
16527 868476 1102326 1150386 1138612 882680 920976 975780 857384 930878 1146278 988251
16517 988251 623021 1085846 1169788 725184 1234251 1092379 1048122 946342 783918 747867
16507 747867 993047 839854 941405 987642 763359 886095 1163603 688439 747975 998633
16497 998633 626994 656215 819024 743094 575879 616433 746193 507316 729605 711096
16487 711096 919369 818631 818105 469513 752547 715551 739269 799125 504238 1021959 695608
16476 695608 649237 622783 461968 611292 864666 603530 656557 700321 915032 851004
16466 851004 689517 816025 564055 704208 524249 598735 894789 557631 606713 232446
16455 601638 466155 492341 650860 765257 515735 861352 600920 572827 802412 450784
16445 450784 491737 380103 424300 369571 404258 602994 342067 684934 799797 703160
16435 703160 706555 308871 673650 393936 399302 333363 151706 508113 346411 234859
16425 234859 489347 307374 474151 351519 515827 494692 320543 302133 209649 198106
16415 198106 382543 312798 379242 303164 267719 417960 405221 452503 475181 630834 708272
16404 708272 374947 641350 206963 445156 254720 609060 382153 447335 294200 386390
16394 386390 241609 411775 225564 374342 131341 337427 533536 377286 517880 425413
16384 425413 120710 401580 290615 334128 260825 -10482 185638 220053 582774 350572
16374 350572 386498 558805 305926 320481 362844 510178 325731 353834 444806 426794 121880
16362 479738 535923 76172 336538 305437 256300 55723 -131637 328027 395330 32431 329550
16351 329550 222270 175115 308420 276149 197743 151435 375886 217218 542558 277744
16341 277744 114210 -111990 147301 143592 297280 135812 412336 -23410 200954 388828
16331 388828 264149 252071 578407 4015 -118651 -85374 363684 207194 32862 543821
16321 543821 61379 176199 81588 23495 33094 460856 547142 234157 250990 21322 96177
16310 96177 260401 271832 590693 80512 -112645 360603 204467 52323 209558 169773
16300 169773 363406 95156 242033 243680 382237 69539 84162 289008 150717 298634
16290 298634 13395 95342 360974 266559 85804 124349 18661 91100 164009 308381 499525
16279 499525 166371 45488 56745 211388 143314 97050 278983 418821 95464 83466 194387
16268 194387 19563 390614 26861 199813 278896 378885 32567 211436 -115567 340970
16257 22323 121130 462643 -134258 -5761 156410 293180 32106 -231547 -52750 52130 96842
16246 96842 99510 185785 139716 137863 391132 246164 109143 -117643 23165 220103 -21952
16234 239741 153038 250773 112246 62210 219704 248928 348181 148451 119781 -129464 250632
16222 -113890 242798 239833 119167 167420 -26102 108006 -61077 127206 332438 236292 -244956
16210 167921 115051 461107 -131498 -132144 154569 276482 417013 316003 -60166 419173
16199 255993 258516 -35026 34385 76951 65418 58952 155448 144506 128722 280490 197106 5271
16186 -2937 105818 49947 80339 2468 40424 -298930 -259420 -123196 -99281 -88017 192072
16174 -136300 -81579 -161494 26762 -320092 455563 -234685 402111 3339 352710 -110196
16163 -59284 -18336 100160 332998 -72721 -44121 384054 370644 -115824 109720 -125157
16152 -228239 -329513 506460 69800 18761 126186 148500 380275 -71394 52629 74630 4505
16140 272313 1953 -208394 -26547 -273723 256608 -71346 50700 126243 -109818 20731 225193
16129 225193 8645 218576 -71578 32132 -209870 47649 298632 -93868 -141547 -214787 -40998
16117 -125482 62545 -113900 102744 -26745 -47198 -43121 379809 -61121 272933 -138825 354296
16105 -62247 -219476 971 -11635 -11092 136272 52281 122002 -103818 -116510 21097 111056 8959
16092 141468 43977 -132902 189561 214224 -83218 -111812 -80894 195488 -3751 -141941 -30518
16080 61646 17514 -164100 11095 257404 -354591 -47885 169171 116916 78134 13029 -58895
16068 -214526 -78899 -112157 -147215 -121291 118269 -159861 12997 -95281 -229262 169170 39619
16056 10043 -38966 -79892 -58638 108884 -300583 74793 174527 25574 -179153 239251 106624
16044 189556 17112 -8592 -287158 395001 -180218 208124 -322586 187272 -76763 180077
16033 -45939 17486 -286758 -89700 110882 -93535 -205090 -145666 228201 115867 106513 223852
16022 223852 221627 65141 176783 -174561 -1510 61221 -362741 -1240 110075 -24406 -268542
16011 -268542 -112033 -200387 -125710 -30378 -4272 -153684 438293 274054 -206231 59921 105716
16000 105716 -215306 -19176 -957 -299338 147679 -66800 -214757 -23223 91989 44729 -188828
15988 -24382 132955 -32078 -262272 -134958 160944 47499 151814 191973 111339 -44628 111102
15976 84342 38025 -191833 -88375 -252060 -306685 85842 216233 -177797 231856 -340187
15965 -119438 56644 28168 162809 -246576 -15621 81768 150584 169454 -181849 -87125 -291215
15954 -291215 407464 212852 41152 -128897 240859 -266170 -230847 -92951 248885 28783
15943 -103872 -90739 -131027 -318116 191128 -212241 237656 18889 -43732 -150748 -54124
15932 -165849 -97307 28674 119800 233418 -109292 -249628 -76648 -62782 -101246 -5965 69023
15920 -30095 75307 105603 -213561 20158 203901 -259534 28184 -401171 -61351 -187278 -194959
15909 -194959 -50479 -156123 -103118 -13550 -101101 -222360 197001 -32199 -171518 85370 98955
15898 98955 -57999 -112594 103892 -36483 -48667 -429998 100233 275509 -28923 -142102 289247
15886 -225484 -59895 146488 130463 150642 896 186754 -196928 -235727 78708 -160940 176794
15874 69079 70859 27563 132376 424198 -168065 -268867 231352 -109364 -501258 -20215
15863 216460 -239718 -281318 -201081 -79120 47705 -37273 -184063 -242903 19639 -24440 36314
15851 249198 2160 -67482 59047 275132 13216 173246 16774 74479 -83654 62598 -237872
15839 117348 -112990 60422 -215225 -143285 -33215 -27270 -1413 -493100 80106 308249 -207004
15827 252229 -2661 42264 -358228 25249 -98689 -152251 138887 31198 194300 -37140 -355522
15816 -355522 -291053 114829 52689 -59757 -24252 -177676 193014 -203729 -347542 259619
15805 248259 -21730 90501 -258787 -36139 259872 -109174 -134908 182851 -69052 -264384
15795 -264384 60198 -28824 23561 -27516 -44789 -215014 -47703 232833 207044 91633 -691
15783 -70826 -75393 6277 -16830 -155078 276986 -140457 -150869 55931 268474 -40072 -162736
15772 -162736 291511 130742 159550 179243 -12180 -244062 38045 391407 67595 8918 -484946
15760 -88303 22272 -307474 -242113 -186027 -148913 -34765 -146869 -15821 128140 559 -60351
15748 -138984 -20081 39517 -113139 -243732 -79607 -186097 -57177 113589 -182244 110871
15737 114850 -37785 -109559 -101023 6490 179556 -289228 230647 -96508 -172854 -19920 -345323
15726 -345323 -10561 161271 -129899 -437961 -191312 -139434 160126 -146628 78048 -92204
15715 63664 68549 168950 -1016 -147092 -6254 -149659 -148721 111642 21297 20018 76511 122865
15703 122865 109151 104579 112218 -377352 250378 -148797 303922 122689 -151692 -232280 -78297
15691 -151926 -238384 -60276 99892 -153011 -88666 -11558 94784 -86669 152602 -140089 -150217
15680 -150217 -146099 -284545 -42805 265327 166973 -146253 159914 33760 -251324 -22338 95182
15668 252448 -30834 -137765 -52793 51444 -1810 -348345 -89625 17193 -196714 -315737 38620
15656 -121718 142354 -27227 205003 72438 -138494 -227810 -120940 -143894 331528 159601
15645 -240613 -55020 -21928 -192729 -261246 80048 -257308 138682 -272964 -238460 -186428 -30963
15633 -136030 93359 -211376 -235762 -4698 -110562 110384 516529 -403741 180644 -88567
15622 -255715 -89198 -233572 -24176 -39265 -197611 12904 -5537 253796 -367220 -343836 -176478
15611 -176478 -215817 -69182 -106422 -200715 55403 -221304 16012 -403971 -286672 -254640 119512
15599 -11415 -314277 -108041 76424 84747 -173454 -20033 -27176 -116472 -320403 -106357 139977
15587 121177 79207 -42688 -89714 68955 195325 101070 62891 40086 -289481 27724 -65054
15575 -176678 -391108 3010 42087 -45803 -232345 57911 -61552 -50181 35981 -141545 -187526
15564 -187526 -20149 -54549 55898 146708 199574 82692 -153535 156773 299130 -107271 -42980
15552 18754 357102 -127003 -405446 -186066 -46307 -285358 -288631 296728 25624 -65997 276561
15540 412990 -37013 -26881 166417 127117 156869 77044 -243012 37602 25266 -55513 -27233
15528 12154 12213 -34730 100554 46945 -55101 223215 -130570 105726 -45123 196361 -74368
15516 -229012 -137313 341591 111604 10189 -75673 149993 -89953 -51369 -151717 -279905
15506 -279905 -30473 165300 179837 -98408 -140516 -223400 -260660 36188 -29224 121349 74972
15495 74972 9017 19382 -70026 225684 95909 -89359 66531 -55130 144211 -105586 -198965
15484 -198965 -13316 -86852 201687 -94729 315580 -96631 187426 225618 213521 -10340 -7253
15473 -7253 259538 -94467 61382 -36003 -40504 -56685 179146 47992 152676 -50816 -154808
15462 -154808 -146846 275516 -287810 -28541 -149050 102516 172248 275125 235823 -277501
15451 -362449 -84734 -95276 222719 35249 -221736 90240 192569 10260 -83699 -332689 -150538
15439 -311066 123866 -61031 80032 236263 -167029 -263420 -130035 -80478 138103 95414
15429 95414 -466215 -102503 225068 -319253 -89435 -112707 77790 203646 -125637 330566
15418 223808 -22416 81126 -172962 -229721 -276908 251511 -16012 127785 160499 61414 127576
15407 127576 302706 9381 -50289 116360 -86811 -339333 91343 -171888 -91521 -93939 -101130
15396 -101130 29959 -283111 186741 123336 144328 -1637 -37144 -67308 -31699 81117 -81879
15384 129581 -157410 124787 218954 216557 224671 130963 -11996 42750 139606 27694 90925
15373 90925 -150258 -232544 137265 123411 -198026 109258 -213498 -29986 -78837 270517
15362 -135166 -84537 134682 218164 60760 -366056 210348 79008 140632 2239 503537 -39288
15350 -26666 65490 -40408 23017 22779 15719 134077 75606 -126627 192913 126862 119223 35433
15337 198762 -156760 -37945 -137061 313381 -2175 -20925 -61455 -149436 278002 24841 1449
15325 -150103 -105558 148126 -54912 48651 -40050 28712 222906 -282184 35498 26155 159898
15314 159898 155541 -76253 -71502 201168 76597 27014 -267011 302865 -78746 -137198 -23523
15302 -309398 -6901 192285 269865 -258788 182319 16022 -2661 350291 -150606 -21380 459097
15290 -67732 115491 79090 109841 154818 -201522 5844 -186312 -393254 -108123 126856 71711
15279 71711 66001 98495 317512 141192 -501551 -80328 155035 288809 134246 -2544 -239087
15268 -239087 89198 -44030 186685 -232414 -18503 329120 -198983 124063 184361 314928
15258 314928 145775 -1861 -312183 116042 190051 110546 127641 46450 379435 281818 264585
15247 264585 1041664 2111098 2064522 1752000 2820456 1657751 288661 59545 -3477 34667
15236 17321 21979 -79004 127108 100739 -156421 170132 146361 88607 149862 83173 237591
15225 237591 53847 135458 129322 -46637 322950 141132 218040 230981 164551 189512 7098
15213 233882 -43324 144603 76785 42688 47258 260110 -150809 -145091 161754 266711 -237351
15201 180545 431427 -87986 63184 205856 -106595 53733 242911 269412 146227 71613
15190 77726 -51879 153100 42274 516535 330712 -43051 172748 -4222 -291737 182627 -94901
15178 -218910 91789 -114181 53610 -68377 63067 221040 84024 239933 413922 90736 -170555
15166 17233 5129 -247068 -198380 58076 325144 104358 389374 130387 -61499 -21265 104691
15154 204258 200739 184217 333694 296079 -97277 -126429 3251 -258597 219486 254514 303434
15143 303434 4100 -105089 -379764 205143 -46604 -196673 185684 117701 -53033 116504
15132 231002 -39628 216920 145403 185742 -82256 7792 203822 -43015 53797 257891 127779
15120 162124 175807 387826 73195 48672 343946 -76924 160764 361772 -17077 339291
15109 63217 204416 534521 193228 -42655 58555 318103 182497 303690 485232 292613
15099 292613 243076 155340 215912 154651 -227609 -40064 85366 -449291 161399 195079 82063
15087 -738 139220 46383 34750 191690 185658 360589 83115 56384 331374 271783 277730 116147
15074 278863 425439 -118947 118559 171094 126225 371582 220952 335356 301517 175435
15064 175435 81286 -89242 -93544 346083 603131 -237083 334686 35725 218040 266585 180742
15053 180742 270833 353740 249311 289227 158024 482531 127535 196843 -56369 13028 -87571
15041 212892 211162 346477 349418 444044 247886 68012 182932 169336 444872 33309 -5754
15029 110871 48372 218105 218838 95052 192602 414777 373145 553446 499736 192286 -198504
15017 137326 231820 36790 571214 239959 210984 -128979 169210 331068 345689 236486
15007 236486 242162 408126 445656 382526 151200 166650 651070 242094 277314 -153028 103930
14995 545665 38909 334480 422398 54017 268390 319387 86701 175933 350323 32117 207524
14984 207524 -34023 124658 336063 -97873 -44391 208715 285327 274935 379607 13847 419760
14973 419760 -12870 133605 123757 248083 166413 450050 177209 169278 124941 303059 282871
14962 282871 41832 451498 191349 356107 342335 403616 426470 367162 -28984 432964 420083
14951 420083 55378 -43092 623766 265007 5952 246566 479966 411628 177115 310334
14941 310334 263629 333493 -5121 360158 70244 174501 422631 254054 307590 336995 386601
14930 386601 225180 228065 158135 307914 137400 275585 338244 377306 -204401 407248
14919 -53413 271190 266926 477981 427829 244753 200419 409071 -13017 132959 330897 537032
14908 537032 -47051 170955 70642 226497 242350 308932 275877 46181 374622 348374 214580
14897 214580 432553 141083 161080 155631 276580 38234 213539 331450 473495 163333
14886 749385 357567 352269 304825 593227 469035 -31097 460363 539319 228446 587157
14876 587157 550345 329191 527915 589080 253496 398 314176 330590 188713 362231 566929
14865 566929 569662 289353 282468 509720 551118 456665 707879 59118 505206 122839 553263
14854 553263 494291 433091 696723 390535 423413 412989 806641 399315 288108 628633
14844 628633 630806 328457 573920 684002 449788 195778 364301 450453 335385 564585
14834 564585 439413 216187 313772 451117 442417 215264 450790 453463 267033 337922 569269
14823 569269 367189 407409 239610 493078 199490 571634 283378 532691 695179 822721
14813 822721 556944 457167 861559 536361 707231 443159 334850 410550 213800 598121
14803 598121 467411 231683 564710 484046 769369 764733 675292 485042 466750 350106
14793 350106 430486 585931 404742 406755 702670 433052 359611 530786 355183 710945
14783 710945 655647 266656 812007 479530 503464 531651 741719 980770 832402 213418
14772 758291 523877 726154 960246 782450 551954 722466 604826 375369 929653 205007
14761 683780 781925 358936 672178 932877 786320 656498 747438 387286 679938 802706
14751 802706 819723 522909 728006 579607 933738 665545 1043231 625482 682312 648321
14741 648321 610487 754227 705302 476189 640380 663803 704351 352242 566670 858657
14731 858657 925490 738024 660825 694649 890617 474885 622773 536832 990055 914632
14721 914632 872275 1253062 868558 661131 1096984 837459 1066297 598276 863835 961749
14711 961749 909930 538500 870454 925558 1142136 910978 943715 772894 809677 1216882
14701 1216882 855654 1227527 1006884 1110337 752071 812885 503719 904430 1230807 847738
14691 847738 802415 571345 656099 932291 981993 659077 1233504 1080841 832977 774762
14681 774762 1058471 1144512 913504 1215503 1158356 1085290 1280724 956715 1246999 910654
14671 910654 952164 1079924 1245852 854460 1367518 1039361 1187083 1264014 1255710 1253917 1062898
14660 1062898 1007494 1356584 1200789 981197 1141252 1161705 1136814 1135137 856516 1297108
14650 1297108 1254293 1113815 1026306 1393943 1091333 1303316 999608 1632823 1141976 1550938
14640 1550938 1013410 1311723 1352711 1041851 1255538 1473839 1381760 1729030 1246820 1169662
14630 1169662 1419818 1322607 1475956 1549966 1548634 1225176 1782877 1497715 1538868 1448012
14620 1448012 1553735 1717828 1586803 1647910 1629301 1444807 1494275 1423782 1614328 1487679
14610 1487679 1318708 1414950 1476158 1638893 1871621 1963166 1800685 1637236 1784687 1427986
14600 1427986 1411662 1530881 1681504 1657186 1395107 1689706 1610989 1782863 2056383 1689122
14590 1689122 1961656 1928833 1971630 1915899 1866499 1931561 2095509 1920522 2482045 1927117
14580 1927117 2102017 2201163 2176021 2115990 2101519 2166526 2670337 2295160 2409597 2138212
14570 2138212 2145581 2433586 2351934 2481352 2388886 2879387 2732361 2727147 2620174 2947964
14560 2947964 2814360 3187801 3012323 3280492 3487380 3684272 3610114 3524487 4638494 5319331
14550 5319331 5873911 7619020 11831214 21181786 41155105 42464997 20181055 9778073
14541 7042142 9015704 4899310 3211703 2305165 2277829 1963213 2060717 2568280 2087089
14532 2087089 2023327 2609577 2309551 2255314 2276196 2435166 2459783 2436836 2374005 2495355
14522 2495355 2831261 2382701 2351048 2580087 2748549 2868694 2888902 2539445 2548638 2670329
14512 2670329 2898251 2497513 2623760 2935874 3054627 3246866 2830155 3286214 2919942
14503 2919942 3347975 2863185 3191834 3278261 3531363 3640576 3607767 3505613 3483685 3267073
14493 3267073 3385486 3807291 3360183 3374418 3535516 3838369 3784968 3672537 3770458 4220461
14483 4220461 3865798 3842036 3822589 4166280 4199511 4331356 4132066 4130880 4078065 4274599
14473 4274599 4375680 4544269 4269117 4162373 4617349 4394089 4823178 4719732 4756032 4523843
14463 4523843 4698377 4851226 4913127 5237212 5258376 5075166 5252914 5047682 5762006 5274837
14453 5274837 5576710 5753931 5598276 5760698 5812858 5798923 5849399 5952664 6136306 6000071
14443 6000071 6281483 6283634 6403318 6448419 6457396 6707666 6715579 7074399 7130312 7003320 7172433
14432 7172433 6841253 7265767 7122253 7428924 7425339 7521076 7645730 7571270 7928323 7678402
14422 7678402 8190700 8354410 8372829 8613629 8638798 8888224 8923789 8860283 8927646 9361023
14412 9361023 9694826 9679559 9305703 10048204 9573352 9840533 10212309 10340428 10417661 10814257
14402 10814257 10832315 11335147 11113624 11471601 11906250 11818856 11978945 12293580 12269915 12361272
14392 12361272 12787369 13225032 13339779 13530384 13830968 14029649 14177687 14421034 14863667
14383 14863667 15094525 15230530 15487270 16137819 16141066 16406672 16689024 16962572 17868343 17823559
14373 17823559 18448297 18445664 18875343 18846919 20169865 20093169 20219890 20418907 20943693 21568444
14363 21568444 22035139 22528337 22976109 23549073 24099616 24821022 25229508 25377641 26682240
14354 26682240 27074329 27866062 28449926 29241007 29628538 30346151 31291016 31976824 33001732
14345 33001732 33609628 34877695 35223448 36379549 37320862 38520685 39443590 40450263 41683862
14336 41683862 42771616 43762751 45577261 46889394 48360378 49831898 51277903 52831993
14328 52831993 54725690 56337495 58398108 60054887 61930476 64474068 66337776 69038536
14320 69038536 71433302 73819218 76571369 79279537 82670002 85827672 89359907 92475649
14312 92475649 96387628 99984291 104275504 108720756 113360449 118078584 123347778 128875943
14304 128875943 134706020 140948197 147493062 154261226 161346493 168731652 177127715 185499791
14296 185499791 194529309 203979366 213952701 224478915 235615654 247342405 259462880
14289 259462880 272108387 285534377 299014867 313618168 327658679 342408294 357288860
14282 357288860 372120652 386860472 401368117 414954061 428110379 440141975 450872832
14275 450872832 460107288 467322569 472367602 473867705 472444117 468828700 464273223 459302998
14267 459302998 453105633 444634872 434722041 423240355 409912010 395977729 381153784
14260 381153784 365701614 349971819 334428946 319280607 303899307 289107794 274736671
14253 274736671 261181978 249855006 238436072 226494339 215356240 204483864 194716056
14246 194716056 184990706 176614372 168885506 160696083 153258178 146034879 139630115 133381511
14238 133381511 127932577 122377905 117010026 111944196 107532907 103236894 99146292 95478497
14230 95478497 91879737 87868666 84808665 81572144 78427082 75556826 73039405 70578433
14222 70578433 67917541 65560705 63585522 61438076 59543448 57430556 55788958 54001204
14214 54001204 52566266 51264853 49217211 47674706 45909859 45033405 43757549 43171301
14206 43171301 42237686 40424671 39367963 38188203 37066273 36385633 35596210 34870550 33440568
14197 33440568 32707642 31697117 30834298 30301481 29644619 28557570 28001650 27258828 26886195
14188 26886195 26172777 25671755 25152483 24371791 23685036 23324196 22712935 22506176 21590924
14179 21590924 21430139 20936125 20463103 20412461 19660894 19133965 18851589 18514464 18023489
14170 18023489 17640189 17389329 17384972 16977048 16687768 16010964 16138073 15736081 15515385 15122470
14160 15122470 14916056 14680296 14524790 14343113 13880266 13592654 13226184 13101423 12849015
14151 12849015 12664936 12505063 12324942 11833014 12068140 11796833 11906009 11379432 11429458
14142 11429458 11128651 10935249 10537805 10566329 10322202 10426230 10332844 10300126 10026255 9904303
14132 9904303 9808048 9192962 9472480 9325243 9069401 9139191 8833420 8794549 8481462 8208159
14122 8208159 8277342 8220891 8327932 8373385 7861813 7752399 7815726 7937437 7419615 7601333
14112 7601333 7290054 7582407 6931448 6974974 7076938 7059849 6924177 6484802 6827268 6429870
14102 6429870 6473143 6636547 6362506 6096718 6262169 6046503 6182581 5994275 6431846 5914093
14092 5914093 5869367 5765792 5602909 5685827 5492868 5579561 5454490 5143414 5413691 5339766
14082 5339766 5192009 5416653 5219886 4965616 4884429 4879902 5074134 5200026 4657457 5124706
14072 5124706 4533529 4757604 4644260 4501166 4360085 4693952 4182912 4551189 4131224
14063 4131224 4297622 4326324 3981822 4077721 4172853 3922490 3849892 4171541 3909509 4079349
14053 4079349 3979806 4048634 3917267 3563840 3655876 3627497 3827841 3616982 3315070 3437882
14043 3437882 3392887 3471129 3387225 3511047 3651351 3440386 3321208 3333821 3096994 3157244
14033 3157244 3009957 3308741 3474986 3487199 3177425 3351432 3172743 3385592 3257322 2670620
14023 2670620 2860833 3073295 2905074 2752264 2896118 2625958 2862720 2547408 2362968
14014 2362968 2541057 2636399 2504199 2385476 2683165 2665262 2466215 2388212 2466920 2491782
14004 2491782 2352937 2274994 2214731 2449040 2389284 2199561 2518587 2532024 2511587 2529533
13994 2529533 2219650 2208043 2429026 2407330 3133600 3930338 6512315 14388737 34414810
13985 34414810 44388941 25642416 13672122 8806876 6285895 5162452 4597961 4136061
13977 4136061 3780284 3662211 3127206 2914813 2605935 2557210 3056143 2916097 2670027 2587116
13967 2587116 2772840 2482936 2643569 2090373 2406367 2081632 2295784 2347564 2230829 2467555
13957 2467555 2025281 2185725 2073231 1995170 2125553 2109632 2023427 2292223 2324242 2137221
13947 2137221 2139651 1890970 2112483 1917550 1830483 1733020 1975642 1881458 1613603 1877583
13937 1877583 1862262 1767066 1901634 1918386 1939673 1588842 1791462 2006170 1854464 1711366
13927 1711366 1863418 1708213 1761370 1605224 1767440 1917840 1544944 1514856 1730191 1553586
13917 1553586 1694427 1489827 1700839 1461960 1831028 1430905 1454645 1225232 1570511 1596789
13907 1596789 1600372 1449747 1356576 1442859 1369566 1169597 1374493 1040756 1146784 1396255
13897 1396255 1810010 1452971 1143885 1692284 1093241 1383538 1149239 1005272 1375832
13888 1375832 1530798 1540867 1614392 1314239 1157763 1499842 1528763 1366962 1207594 1158622
13878 1158622 1222972 1097088 1280916 1196773 1250851 1188274 1416407 1197679 923420 1007323
13868 1007323 1242604 1079631 1107956 1101749 987864 1260641 1268293 965136 1360469 1321355
13858 1321355 968253 1261557 1242639 1049755 1259806 987049 1100874 1266615 1181986 1058049
13848 1058049 1260561 879421 990085 1027269 1173600 838116 837820 1203406 1110173 948656
13838 948656 1019274 978933 1289926 814610 1107189 757588 1147486 1071057 843122 950629
13828 950629 675864 850315 946806 913581 844182 865268 881244 726258 1029457 868817
13818 868817 1161798 728641 818815 1014869 1175733 911815 1132759 929091 943630 794672
13808 794672 704297 803674 793320 758078 1225777 1004848 769593 797227 834066 1032807 1063343
13797 1063343 1098826 504940 853656 1015709 1064252 821878 764828 834909 613135 877464
13787 877464 1006062 516681 751565 887305 622015 927831 733865 902820 515117 593920
13777 593920 663150 676991 779170 891879 817037 965128 522676 866659 781177 885862
13767 885862 1004796 715743 906972 558336 600209 642963 664648 888240 1137262 769770
13757 769770 657517 771380 427739 562260 636576 894964 428379 725080 1068574 588949
13747 588949 683016 615810 258619 923700 556531 602360 611641 508500 494707 591674 441731
13736 441731 698807 680763 579821 767237 563362 559749 805829 580675 853426 738090
13726 738090 510140 942268 380705 587122 498109 485877 375979 355148 584440 856867
13716 856867 715820 662495 448248 547374 522844 639104 882093 920873 669484 593626
13706 593626 818430 331301 686663 629118 675751 622162 192183 544898 528338 590740
13696 590740 630524 602666 658531 418344 438902 880122 448844 513898 454099 283915 463941
13685 463941 452890 554512 656204 614570 615165 544628 337712 536488 320967 484215 280589
13674 280589 768354 351293 454530 596619 504258 342706 540885 387070 593955 510902
13664 510902 508653 169200 503151 459142 508160 562877 604727 517127 491715 345473 272841
13653 272841 766346 459590 345477 528162 547652 467736 169513 582969 382616 630932
13643 630932 358559 267698 280595 182509 708824 480874 464945 764391 224468 383145
13633 383145 -48859 362287 453697 189451 417226 292309 498380 737131 511071 315562
13623 315562 583168 420639 452758 975334 282775 505041 65997 391857 530274 400480
13613 400480 696552 164833 275649 726738 356301 667068 470689 243223 641521 343194
13603 343194 254296 664633 440865 433717 421638 506385 504941 333260 261353 247556 476665
13592 476665 248817 537709 479949 486426 354907 419130 54418 309802 331901 459020 623606
13581 623606 371823 432466 323652 394859 324899 215770 46134 600636 129305 353274
13571 353274 204046 299053 371042 408950 437425 385444 378323 372254 353113 443489 129536
13559 252342 84460 569862 192405 214487 792387 318449 292961 619945 341299 254449
13549 254449 223313 321153 30198 321887 561979 250160 275477 -36963 265775 391054
13539 391054 288972 289796 511326 549372 222251 351999 316703 422056 242356 490459
13529 490459 122798 378969 247921 265480 246519 265897 93005 530119 107840 462660
13519 462660 431957 121056 291719 96767 -78941 337941 273200 276195 86997 277069 419488
13508 419488 241018 269002 522741 397255 125862 -100886 244037 361775 435545 40711
13497 191448 191357 262735 290019 308975 228919 2540 408049 413555 191710 352667 422554 83484
13484 331768 227828 201078 382662 520974 218368 75370 153751 81683 441515 -32301
13473 -25501 321554 463711 212902 253235 462068 240183 -86596 329396 236530 228763 205254
13462 205254 239000 166229 -153862 125207 146346 325075 214609 226567 397420 201459
13452 201459 -15627 108670 -9440 252485 264749 239716 24980 -126472 204742 407428 294142
13441 294142 51871 369363 438404 -102464 117302 250464 244386 -34819 149610 -236683
13430 300979 244057 -2800 342114 431771 241917 340692 357849 175944 73428 169074 61710
13418 185821 227001 395216 404055 73243 316424 50470 27212 -62567 230232 345818 484129
13407 484129 361325 309746 296183 56841 277721 2529 94887 309143 204043 52151 -14817
13395 265786 250879 658231 -236152 101179 391853 69950 228161 19418 102985 170695
13385 170695 127984 396139 517881 80560 240337 142165 279291 275716 167811 77026 56810
13374 56810 436158 117526 108637 202149 168597 129192 787906 204338 133548 239238 290016
13363 290016 407341 521159 169953 151548 207460 99693 -9634 333724 -82792 -205920 519720
13351 251 487079 72431 356442 10158 431913 368957 350837 369266 539125 366555 556311
13340 556311 523118 441982 134642 224156 457908 181266 172823 231996 -17432 -3112 369121
13328 428718 -150693 286699 346014 110486 141892 396663 395005 322456 -39012 -60549 -147271
13317 -147271 322024 239273 225199 120986 212728 -54820 -90114 -41396 161060 292839 26800
13305 423326 329057 89523 334219 333052 356761 182219 89408 129376 297244 285058 -34155
13293 74598 127889 241312 -30429 -99474 175783 280366 68629 508403 136312 310179
13283 310179 -41057 180926 123453 239549 110875 15604 -33015 -33384 127715 -6318 196228
13271 175270 242769 360295 474486 334252 -118329 367914 -171956 -42287 155191 65726
13260 99661 -229568 109605 148794 202736 33474 220206 350743 70293 138497 -97062 210972
13248 176741 325092 392700 113651 -252832 54825 89769 217036 -22823 -135790 287042
13237 34815 261553 337044 -124980 58600 178624 155763 103942 365783 182001 30135 70795
13226 70795 55334 384403 26939 95074 -305010 208408 215854 13319 -173774 242269 -33612
13214 134213 227032 -201775 216785 349888 -73872 -161051 -37195 282060 222309 -78607 -88017
13203 -88017 -66830 -179929 99478 477106 54130 87455 194231 -16164 142734 -169294 53857
13191 150201 -372725 249629 401028 262140 259254 282973 -40385 8274 31192 107779 17707
13179 361105 15297 -233372 194429 91417 171894 89481 407629 -59626 229820 42415 340696
13168 340696 3521 317791 186618 -268240 294138 339589 -216531 422802 75693 360900
13158 360900 -188651 300164 43497 326798 380028 -93883 -118059 55166 74982 234803 258252
13147 258252 409611 -151768 193970 -91928 -63690 185320 444722 -118053 52517 133251
13137 133251 -138314 79359 118230 54934 193446 -53513 110705 -89360 -60781 79484 320434
13126 320434 109503 -20035 -25455 26187 4190 263123 -171149 338336 113221 40877 -71043
13114 -18177 161021 118030 -52693 -32043 -172865 133205 147604 207959 171900 127999 153511
13103 153511 139582 174651 -359967 -158931 -64671 -20685 -35976 64550 -47558 -188396 -112460
13092 -112460 173485 -94571 184483 -166831 18187 162007 -10214 108890 169551 259777
13082 259777 123317 85689 -171009 178618 220886 -70034 21582 -145907 373825 17090
13071 256557 -104249 -144027 76149 235804 33286 60908 354244 311507 79749 -178923 150699
13059 240874 211751 367322 -99012 -59105 -117241 463981 187057 260866 58306 248094 -34775
13047 261973 -106110 89849 136416 221902 249964 24875 94099 -5357 8883 -469725 59370
13035 228702 25524 146797 49103 -288502 41896 17581 176316 -65767 185477 101177 163554
13024 163554 160350 351814 198480 260443 -23981 144671 -204972 322211 12697 193966
13014 193966 236835 -89934 76780 176991 96188 -66652 124205 423028 213791 49625 -61334
13002 128798 -130808 73318 43602 -19905 175854 254020 173352 110490 -106071 -290291 -44489
12990 -19246 -54727 -47479 87632 -85014 237637 141377 -197263 243622 498992 -268451 -42885
12978 -151561 -119487 -96801 277378 -38627 198016 -62848 196657 -295607 266409 -169719
12967 -82469 152543 -42764 41649 -157818 50596 160778 149184 22285 -76592 136327 5823
12955 -69830 34043 -91551 -6606 -217581 29618 -60767 -156157 158071 9510 -304331 299224
12943 -349631 270922 176936 -329480 210893 206481 -50790 -205210 -43600 -343583 42614 644663
12932 644663 199715 -249443 59237 -224563 256796 288345 80543 -32778 -25107 -225669 54128
12920 288285 215580 130879 174397 -20239 166908 99904 74816 -19031 390127 -100178 207637
12908 456448 150856 105282 -389034 -51756 43359 77982 132362 -61434 -53319 -307056 355409
12896 694229 140177 -89010 63678 -286505 -7066 189858 -27109 28720 80624 27343 -318479
12884 -118467 -63702 -54382 31462 188708 288524 -176226 269190 40159 -71450 165679 51423
12872 -133586 22239 283840 229921 -255725 213149 422633 205023 251798 -82324 -228763
12862 -228763 99921 263303 42690 -237381 -29659 495 210275 -59710 4936 -274740 118779
12850 281308 -274061 169521 76807 167261 385360 24123 -14111 150237 95289 -132072
12839 -70516 123096 -11381 -98862 -232705 445848 -113163 -246292 208169 451468 163259
12828 -121522 -83118 29928 209282 246831 101142 24711 250214 -121345 237016 28397
12817 -185950 160584 -296716 185439 188145 -28418 154150 90672 112539 -17145 259621 -218946
12805 1214 -224203 -50923 -93653 -89735 111353 -128122 73565 -25454 336567 68679 -186282
12793 -130509 -139125 221941 18375 129482 43887 61327 36510 11188 -68119 -19655 -135170
12782 -135170 -59173 256665 -102485 -109904 -58296 -56538 -26398 70236 -11040 -119415 270681
12770 146210 -37104 66064 -87380 -98784 333 -90186 243069 264199 47033 158404 24349
12758 -305611 -19665 -97228 -127562 -202780 43887 -152042 339246 -143578 104801 91244 391172
12747 391172 -457813 -249048 119114 42368 125122 -65782 93378 325756 545801 63580
12736 -151292 136560 -48904 -116550 148736 186290 367305 54735 92544 103386 123241 125975
12725 125975 208330 -68975 -19938 -13277 12906 -186077 214527 -112245 -170041 -5323 283289
12713 182481 163361 93129 -115390 167094 -104310 -3727 81989 253103 -15660 135781 -104922
12701 138613 190159 -244644 49590 85112 92262 -166855 197786 -91653 -224698 -6668 -256413
12690 -256413 425460 -69868 151591 64659 37495 -160839 -254234 -142363 222079 172457
12680 172457 -44765 92084 379145 44903 408805 -208476 253800 223883 188518 317033
12670 317033 -98991 -84838 205463 107167 130700 -92807 60230 -59126 57264 -69851 154381
12658 96922 182285 15269 146155 -1305 56705 -346942 -69167 472321 203418 113876 279389
12647 279389 -201211 128037 41013 -182938 -149020 -13396 -337868 248430 403821 76813
12636 14709 -7317 48311 278861 -76952 130114 134067 457383 172993 70529 498906 7316
12624 537759 233904 -172216 -87299 -107390 507528 445223 126483 43616 166352 86240
12614 86240 187086 229378 -34207 13875 69670 42047 10651 -23390 -198785 25423 -405607
12602 -28016 187074 41265 31301 186453 305676 -8892 -200 -113885 386610 -60771 -138066
12591 -138066 -56045 -225587 -53574 27262 41013 325814 136840 150403 -186805 28480 -263491
12579 -21152 80382 90243 -276538 -113867 53968 160793 -136712 220591 -23784 -77292 -143914
12568 -143914 -29752 11669 -23994 286495 194181 153876 41779 -70538 100256 -90082 182403
12556 -260813 72419 357049 -26321 176624 106242 -163409 -31579 203633 128774 75424 38457
12545 38457 110632 119451 -89518 244466 -53725 -101289 318057 350007 -325042 248712 135497
12534 135497 -12446 -110422 -37990 100103 34354 142988 -191463 298150 -167855 18996
12523 -91953 29558 197560 -35586 120136 188421 131030 -57433 69066 -24738 -165812 147665
12511 -209427 146727 129096 132263 118790 204929 23654 240416 164751 76669 65869 -42168
12499 36198 -43437 239357 -150591 274860 -69881 52842 184340 102781 59784 -382061 -43737
12487 11435 33343 141783 63192 154048 -210809 2805 466281 -25531 257356 206110 -211474
12475 -35132 38059 131094 -402957 395982 67652 18740 -60170 -45834 9335 -78979 -154508
12464 -154508 -45373 -35775 -67007 -216185 -173261 -69004 19644 100798 52947 -362969 -110891
12452 182715 10927 109575 -92347 114314 -206677 -196440 63541 181312 211904 153281 33679
12440 202667 -170712 -352728 -31534 -7488 37718 -81064 241293 268101 -10818 358476 -84972
12428 -168073 252086 107720 3256 162910 317547 29455 -141291 -321593 117575 103874
12418 103874 -118400 -54515 -381133 -99020 274549 -284385 51376 -16315 -293623 221186
12407 -25170 140067 126971 192180 54660 209719 70978 -121194 29003 7733 116921 23582
12395 386543 -224135 231264 59574 -162987 -81371 2377 252959 -19020 14884 -439964 152838
12383 -108509 -118696 233398 -344614 -128983 141650 168869 -104794 -410696 198131 -173250
12372 167579 102200 -293698 -126916 25854 -323997 36020 391430 89055 30825 -135832
12361 261839 -55929 -10189 -85536 51561 -981 -6695 60876 114472 90413 -64450 -351402 -129322
12348 -29260 -245000 -311220 321440 -126963 51886 46943 177698 13439 -70305 70988 341363
12337 341363 20225 161810 -142011 240750 -226645 -37378 136397 -64752 -106531 107725
12326 -7587 131258 -37777 149355 -64840 80308 -101353 175627 -156954 -99181 39986 -298461
12314 62609 -110297 154822 275696 50258 463957 48014 -78777 292500 56416 -17398 -126333
12303 -126333 -157609 -220810 -83655 239087 -141785 137640 163074 -242844 -153159 102977
12292 98379 28435 -192090 -118077 -440862 214547 40404 -66313 206049 123917 224892 229151
12281 229151 -65028 148424 128447 243939 261418 330265 -62797 412951 257075 313013 163621
12270 163621 131715 -219831 -80784 79959 -200863 298249 -257104 -93738 141708 9324 -64048
12258 -151822 226821 104585 -158740 -62554 -152906 158800 60918 -113163 144716 212094
12248 212094 189174 300016 -63721 23945 246276 77268 -250600 308983 -58730 98571 20373
12236 357291 -130089 -195995 143280 148421 -98749 148910 237587 339936 172762 186600 -44852
12224 350338 172671 228254 53600 142889 18502 263509 288814 306528 199288 99949 295379
12213 295379 352128 164963 -99987 -184990 71351 28128 57117 275607 338646 -33547 219661
12201 79205 -4277 116618 159171 438103 -215670 223536 337319 270183 569378 -32131 230379
12189 128139 134419 349957 85956 -94010 123832 71443 110802 35511 208906 491450 501388
12178 501388 19233 285834 46694 111565 287620 373158 180894 -6160 31866 31022 316210
12167 316210 -57457 262226 28524 220404 97365 -42034 151055 10037 -170847 118311
12156 272296 -141247 276835 -12562 4848 450946 10016 -8682 -88545 173929 -165895 157769
12144 -275963 158951 -111935 176185 -29786 73989 135779 -63180 41610 180942 122323 -92032
12132 -89538 -73968 -62568 155195 -164407 148399 -232855 -183070 78908 -170901 -22626 -52457
12121 -52457 29708 48594 51992 53191 93482 328506 -130573 122845 305231 257045 222255
12110 222255 136077 161342 167374 19697 25627 152213 223982 -279027 -56928 -226455 76771
12098 182055 -159046 -90458 -123308 396130 -173204 55931 103400 -315991 -216331 -38255 230178
12086 -271774 -165949 117787 123211 224563 83284 -223680 23501 -32313 -53456 144827 61046
12074 54846 -165969 -26641 132132 -43131 -139512 131940 -260705 254299 193910 11539 30008
12063 30008 11760 37995 130930 -174902 30673 126189 -27251 123606 -158850 -55854 -174318
12052 -174318 425097 723798 1133984 109755 198688 205543 -249950 -201030 59162 213752
12042 213752 -3021 -241584 -13250 -182659 -201090 -68295 11430 -97616 203542 286828 158425
12031 158425 62205 -314882 -129948 -190332 -278101 185104 185383 -65184 -16403 393790 -40971
12019 -146714 -81808 -104997 4189 411095 -9988 -63679 -59526 -149291 92444 -157288 304177
12007 108567 146147 -23769 235155 -179544 30419 200203 170468 42266 -126473 -210716 -91024
11995 126566 254703 -52237 -148428 -84397 -46539 53212 77058 -143122 125056 -112025 -92920
11984 -92920 -174653 50080 -141080 -101303 -62898 -159086 188853 -195729 77584 10018 17083
11973 17083 249669 -37081 109271 112072 -186883 35647 44673 89523 -6816 116887 25253
11961 121996 -4585 -188348 -169029 94390 204091 227444 -2199 -216267 602260 116112 -114342
11949 -63472 245524 117702 49418 -320192 -57772 197287 206918 -295700 196098 76406 -106751
11937 -282993 -58166 -13872 216990 -274625 220121 -50681 68076 28656 -165526 -439515
11927 -439515 117537 14001 -185414 -28436 142634 236600 50701 -90271 -127659 -334107 25805
11915 37824 40761 -137298 -128106 91516 -283730 47879 155866 -308181 -117348 176176 -190021
11903 126966 58170 -86535 237184 117659 -51319 -157276 -81250 108360 -132352 -227587
11893 -227587 369268 -42187 128636 -136496 -401679 194254 -97175 -110638 -280730 40065
11882 -232612 -130159 1768 272300 -19108 -294173 -49383 -84962 -112089 108404 -35687 -140304
11871 -140304 153965 -150549 -47519 136744 -52955 -84425 -186417 -832 -108356 -86332 22480
11859 -193657 173217 -132727 -122068 197188 12889 7321 126115 -202161 -263061 -385103
11849 -385103 -174404 192247 -47422 -2447 17032 140860 -25433 -125645 320470 -60596 169968
11837 -1039 -108192 -58362 91897 -66885 -309032 202733 -104388 15405 -118536 85259 -348136
11825 129272 -110201 -100876 101794 -207940 2642 -274039 -267183 -83544 61082 224679 -367742
11813 115692 67914 -4655 -220330 -12398 121266 33178 -112873 113911 -198015 -25611 12600
11801 -74966 -70021 -151499 -20760 -33285 86584 50536 -319841 40141 -161176 -189538 138306
11789 38156 -435128 -245160 135096 -23923 23456 -19748 20359 -151553 -20442 205933 -205266
11777 -429050 174543 -171603 -185485 -66596 -37094 -125112 10212 76919 206500 -128694 -53222
11765 -49978 78404 -99067 -84995 -89667 248509 -95047 103248 88261 273918 318928 -228827
11753 -246969 79992 -68611 -290987 53887 4044 423154 13094 -107334 -93554 -492186 -12650
11741 -185570 -89211 -108601 -124267 -6573 -88335 -61407 -19286 180877 259927 -216581 -52310
11729 44788 186486 -112081 44595 -197163 -335500 192351 -31350 -231850 -104277 -198683
11719 -198683 400793 -44680 -20430 -130869 -37992 -387492 85290 14380 -28328 -40966 -147368
11708 -147368 -398269 -77761 -137062 126297 -79942 126663 -122623 218185 -350155 276140
11697 -231232 -94180 -43265 -505377 82905 257935 -120226 -76216 39642 124084 -154615 -56375
11685 -81619 246693 -38167 -189917 122738 313860 -131076 3540 200071 227881 -12175 161696
11673 -48130 -60118 39924 -262968 9538 -11226 -68867 23792 258009 -386138 150834 -460738
11661 21311 12761 66354 189743 41000 -318235 -146076 -80990 -52590 33716 -13768 -47658
11650 -47658 16536 -43488 -5441 -461882 136840 133405 167307 -323251 177563 -89251 145673
11638 104072 -157204 -88303 -265171 264758 -179045 -301009 87960 -136049 405553 36062
11627 26732 381557 387799 -37931 -486862 462637 -418052 211814 211967 138291 -42425 154375
11615 48874 145513 17732 33853 52121 231808 -133083 26754 122307 53916 94836 18794
11603 -13419 109615 -210077 -130786 -124640 -31856 180682 119847 56134 187999 -92693 -132812
11592 -132812 -112786 -10073 138084 247732 -249350 -330423 79816 -353688 252985 61239
11581 8878 12870 -197859 167986 -51642 -181174 7124 -39 215762 -622549 -171690 -304864
11570 -304864 -99480 -200861 -29797 -60591 210538 -139460 11594 -149836 142808 -9152 -126004
11559 -126004 54414 478190 173069 -191836 178983 13179 -44598 113542 8132 -239839
11548 195323 35926 -147611 273826 -237700 513987 104288 161631 -183042 309203 30730
11537 220014 243785 -147128 42728 243019 -159266 -275473 305113 -176627 -53547 61624
11526 262716 589369 251083 -267639 428576 14071 73465 161547 304646 -44865 181605
11515 400682 105660 13959 52697 146493 455028 177475 399780 -80954 66877 108132 132220
11504 132220 174341 -317631 98902 -385591 290917 74009 118105 239225 -335326 67366
11493 145877 221365 -187985 257701 213840 86841 156671 322157 280797 244334 -57464 253850
11481 125607 142605 197870 -190720 -41546 11556 -107935 335057 -154968 -14583 72297 252781
11470 252781 177332 260698 82868 199860 127879 135248 84672 292212 -16748 296597 -131995
11458 278189 30106 188830 380291 -59374 -61008 173087 206083 107175 -146842 294778 92968
11446 113994 -241000 -165644 8488 165776 68057 19205 202091 127902 -323726 -123344 298223
11434 -192149 124828 -142802 -141455 77663 -175020 134163 108142 -37943 191521 294042
11424 294042 59996 -295148 -317506 214187 -102428 28165 99747 128932 190306 -303031 -80609
11412 19348 -39022 -439137 -23391 -190558 -229897 299732 246357 64342 26958 161485 -357748
11400 208487 31314 117914 -191969 -149752 -12399 10149 -36573 3668 -200752 -57114 -134053
11389 -134053 -46847 332696 -98976 -185883 -201152 -40696 376109 172996 -347186 -122211
11378 -181784 -95092 -132353 -155221 368463 -105312 -50233 -179382 -22862 -20648 189577 -106403
11366 -191545 -78223 -13516 -101236 65441 103487 -27474 -296254 306754 -107797 26895 163115
11355 163115 291431 18575 -55603 -227110 63222 -40898 -22611 -253434 -80802 -72047 -26356
11343 143894 184568 -163427 -134452 73208 -119672 -6594 180845 -182173 5283 333816 61140
11331 -180058 -74244 -247494 149002 -247203 -70460 -213901 -55150 331765 137106 -4969
11320 304509 86352 22255 -140613 -5792 -148717 -66941 180731 46523 20780 105949 113852
11309 113852 19494 -175455 5269 90636 -199968 -265189 -164936 -254939 -207021 -31769 94573
11297 -279933 -119497 97860 422754 2873 70200 -439920 -188106 312531 -24910 -35598 -34258
11286 -34258 76803 490313 -45903 -58533 -59672 -95795 198196 -80714 87 -106380 229531 308289
11274 308289 -185198 -182048 35767 -144585 212537 -80493 -322688 -122496 108720 -512958
11263 -78249 -269495 53564 -255791 -78405 185044 67619 -355529 -113941 -190379 -429983
11253 -429983 61814 -189245 382385 -54983 -242729 -228449 -169427 -185969 -15938 -240250 -300697
11242 -300697 -605766 -32935 -219975 73794 -268247 -77635 116179 -836 125512 -49538 93822
11230 -219424 -67295 226684 -102196 -330712 12054 -303791 98391 -233898 -186150 -41712
11219 -37525 119992 -186334 17246 -48261 -40530 -127287 -77161 -183554 176586 90929 142891
11208 142891 31809 7202 111135 -106571 -97341 -155739 20450 -109886 15909 94773 -50553
11196 -67792 -133727 161699 278029 -34306 64627 -40036 -218126 49195 -106009 80085 520496
11185 520496 185319 -100772 -183892 38508 70019 -21618 144986 3488 29715 -6173 122650
11173 -59477 -265205 -356805 -159744 198184 -225672 -23156 -226841 136499 217143 2427 -169273
11161 8522 -65492 -57436 -117030 -328912 -375911 6838 99138 216881 -191450 150134 363441
11150 363441 164619 18417 357803 143872 -39894 241279 84363 200490 139721 38297
11139 35895 9269 33231 -229628 -13817 159692 45549 176521 330688 173124 -42139 254266
11127 -28991 78571 -237282 89944 198013 441258 168648 -257362 -22119 61664 -198122
11116 229449 -84058 109158 146863 247873 99282 141161 169560 263163 287221 210627 79087
11104 77167 2734 64553 30498 253834 892 113018 74300 270994 250391 254296 -81705 379862
11091 257548 79204 277851 259083 303268 362143 -58907 -16904 636209 -182417 -106221 145400
11079 10664 155091 337976 46393 387803 502858 -986 335650 213601 168868 659045 307599
11067 -139806 429771 392353 400964 270262 251909 452266 360546 641467 596204 602070 624136
11056 624136 257602 69020 849865 559927 433488 863973 792935 372080 482887 545337
11046 545337 690487 597777 644095 833748 1017854 605210 494505 582315 544360 95275
11035 916998 511392 680796 762324 696503 481662 878242 743319 878257 586362 1287919
11025 1287919 642257 838529 395289 458799 688716 418004 445551 579996 650472 315620
11014 529759 830878 667117 866332 492568 702579 558554 779986 834026 436953 413017
11004 413017 781254 436241 669634 498904 652980 840517 858379 874718 581673 536802
10994 536802 581320 439240 678873 616191 681099 575428 516096 732423 1002042 444084
10983 819122 622790 988848 1305575 1558254 1415552 1618323 1533156 1846977 2047840 2408228
10973 2408228 2604100 2829308 2783810 3052701 3004139 2987159 2791151 2352233 1852644 1483654
10963 1483654 1283487 1417927 1524514 1015698 1052301 1240810 876885 1064139 930792 840617
10953 840617 408275 615230 249657 173113 257010 639951 323174 248848 -43071 224035
10942 53917 31179 154178 -180201 151907 200729 -326737 -9982 128284 72200 -156337 11271
10930 -27022 120465 67459 138059 -58958 203213 -197452 147975 147269 296645 83215 -4103
10918 50401 -18676 135302 -25401 -805 141378 101980 152470 -428155 -101435 277856 -2795
10906 17024 71129 20774 -90822 59113 192522 -451929 -155240 208095 6908 16910 -116998
10894 -167326 316008 -131684 43127 -203838 77138 154329 -368850 96662 -133938 126530
10883 -37177 -201570 140838 -143907 141359 60411 225951 -2705 -82145 -40729 -123547 -18958
10871 -116438 254741 89747 -228851 194899 -122583 -132978 22675 61135 124381 112508 89589
10860 89589 8767 -17186 -25644 84131 6509 103383 -168738 -95221 -264724 -144227 159224
10848 -200164 -15793 -167680 74340 133565 -231836 211748 65900 316766 66304 -241716
10837 200296 209742 290058 17172 27820 -163296 -84533 -154971 -405739 -254523 -177168 134686
10825 65911 -279533 -19580 -212591 19675 -66819 -318395 -256185 203355 22384 -12616 -46204
10814 -46204 -246530 -266288 -2077 -80336 -14026 159537 27985 -44311 -89375 -64564 -69412 105018
10801 -257129 -245463 -408553 -37581 40783 -18045 -266568 32126 -76939 128176 -98015 -127592
10790 -127592 3418 -29737 -346597 -45252 221155 164672 -47341 399592 -79893 22696 -230820
10778 32006 512520 -39159 171106 35097 -210250 -407271 186172 -133322 151028 -131161
10767 243705 -242304 200329 212082 -237859 386238 -128982 88445 -141995 35730 -28540
10756 144843 -28791 -189101 -137810 108564 81577 -394445 -19823 106438 70153 -268943
10745 -75421 -135338 -155489 -85180 -76629 -65266 152853 2808 110014 -126581 72346 -45143
10733 -209902 115814 -70448 367153 -13438 -131476 -260935 -135639 95908 375436 285688
10723 285688 -94649 -151190 204125 213805 -40804 -172012 -230156 145965 219364 -274804 292100
10711 -132371 -95218 53479 -412593 -144127 -183455 -218301 -288936 84545 -186041 -151281 -46610
10699 -159543 218486 -2649 282847 47970 -146695 -352107 -46447 -95302 -17413 116161 -257070
10687 -38681 182575 174316 -104380 -78816 -308361 -87772 7642 -47414 313314 58467 -68364
10675 37567 9268 -142086 93569 -135435 -14140 18748 2459 -239978 67293 -111836 103590
10663 -115517 -177991 86395 232751 12259 32095 -252429 -308122 -250 22389 80646 53088
10652 53088 36023 15966 -158032 432204 -70892 -30449 -232165 -149485 -137016 -197306 107287
10640 188063 -100879 13719 131066 -197756 -253825 -281522 160115 -169404 26092 157774
10630 157774 204740 -30499 -273175 -53632 7500 -96160 -146373 189214 -57551 69534 72580
10619 72580 105593 -261492 16121 23122 33897 131242 -67316 -209372 -224278 103867 -89450
10607 -205967 -170844 -332294 -164977 -9187 81287 114895 155329 -265778 8946 -138643 128340
10595 -16705 -83303 -40203 50778 130939 231046 -131744 120785 -239261 137834 -74877 26655
10583 18817 -81173 -279404 -84037 -221151 -104455 -364022 -204640 -112379 79885 -327908
10572 148896 -162552 20366 103846 -438882 47597 40829 -108757 -214484 -162174 -160284 -44198
10560 -46570 -123964 9965 158260 -227707 85493 31346 225759 194253 -27179 -303679 -21617
10548 28792 267489 57585 21565 152214 -27114 175219 13729 57039 -311905 -21020 -105395
10537 -105395 -49240 -327374 59789 -32453 -118582 -143821 -148232 -70131 13728 -77260 23434
10525 117441 33741 89462 12297 217281 -169224 97187 -144786 -237009 346947 -360990
10514 -130389 -122912 -60973 -198681 -339587 12406 -153502 -39890 -174205 -187726 -265120 -319403
10503 -319403 -101274 -18097 -53758 87407 -32701 -80769 330060 -411170 143742 -213931
10492 130470 346662 -232743 105626 -224923 -40389 -10498 62845 -93309 -92191 -113227 -440488
10481 -440488 -67538 374622 118240 296466 -92141 -232336 -304706 -557413 165627 272905
10471 272905 418608 66909 78297 109564 66162 -58130 -88750 -80902 -60660 180109 1557
10459 377100 -389756 -33426 -484778 -115552 127577 134754 15978 -135117 -54891 -167948
10449 -167948 105323 -93864 105842 -336909 75306 16508 187197 403573 6294 -47566 -19842
10437 -1893 88790 205523 -122912 327857 -139679 -355251 64153 -41924 204994 364850
10427 364850 -125339 -110823 -47037 94224 188305 26816 -6134 96761 -138251 84496 63714
10416 63714 -183992 21451 364439 -211086 88365 -195886 90323 145408 -72912 -18248 147662
10404 7710 -107694 218596 -95297 -608821 -909 255402 327861 -8176 121099 -26957 319430
10392 139597 -160138 -18535 233318 -134659 46934 -103016 68701 109937 81284 -177551
10381 126476 65235 246811 50522 320669 406212 193900 10993 9582 13479 260477 247570
10370 247570 673774 121679 438260 496338 577656 448245 190011 674343 77400 368269
10360 368269 223670 229981 -31110 142870 60832 431143 197223 642883 412720 722956
10350 722956 773577 293929 314628 91958 399863 161772 357416 515732 387268 173310
10339 127862 271243 156116 -8671 412025 298731 337498 -66148 360236 237719 221554
10329 221554 128621 55791 136813 86241 318416 57034 460666 85768 571372 18106 192614
10318 192614 240839 46379 241601 47365 15261 -129537 -6902 -364263 105069 -317628 -191540
10307 -191540 -193581 -152571 -154691 -181769 66800 222330 332419 47952 235808 -258561 -16229
10295 14945 -83946 -147327 169741 -117961 176270 111937 25854 22767 -86513 303598 -134964
10283 -147299 268834 40716 -118314 -36747 -6479 -101264 -69534 -68989 365555 -148171 63952
10271 304850 -106340 -37866 -298599 220320 -27633 -498767 48169 -382174 33313 -194001
10260 -170493 99392 266243 33694 378509 710739 34165 -7761 58162 34734 -55317 -253260
10249 -253260 102036 242516 78204 -375706 206872 184525 70932 -173980 30921 -61110
10238 -66779 223595 -29987 277405 -542793 130461 -254330 -117704 -74795 -246781 7474
10227 -280375 144501 -221169 -295213 190379 -114198 52937 302059 -352413 -94713 -106599
10217 -106599 187083 -21761 -16342 -64868 171256 5230 37369 -342087 -22595 -175772 -102083
10206 -102083 -411546 -46727 -175238 314 -308164 57386 -206236 -79214 -4008 26713 101708
10195 101708 265690 -123284 -184532 -189450 -188943 -20183 -212017 -35491 -180787 -155703 -455387
10184 -455387 176673 -42548 42541 -278736 -364682 10764 11414 3390 -36529 -30732 364251 -375398
10171 -143523 -95470 191915 -44077 -239433 -198974 -363918 -38954 -87458 -152735 73739 -104829
10159 -72824 -278348 120641 -140286 -198813 439031 22205 -371938 106650 -58128 -38488
10149 -38488 -297195 -225591 -80790 30655 203158 -109710 -176342 57229 -378434 -83800 77686
10137 -59963 51005 14854 -197879 27355 -89951 63402 60333 18712 -202363 -73904 -367017
10126 -367017 -71916 -167945 131256 -320927 -25521 96713 -4223 50528 71903 -56914 53370
10114 -124109 -7224 92069 -326057 227674 68850 -125001 113941 30018 -60440 78610 99027
10103 99027 -196875 -21200 88406 -29939 -57302 -356800 98517 -13972 98966 12799 -186650
10091 56805 -75703 19957 -268199 -36602 -245686 -117533 218276 116744 -209564 -321354
10081 -321354 -75727 -286117 -215479 -184757 83139 72734 -226260 -92225 -248634 213313 -66590
10069 192742 12931 -80535 -87246 -409899 9082 -53287 -277855 -205611 248146 -101924 -424183
10058 -424183 -180838 376422 283247 -199837 -46220 201776 -3403 -167910 -136078 -137756 77377
10046 -341515 -65105 -104282 -16221 -84478 -177979 119958 -204345 -353999 234838 -297625
10035 -52332 311306 -218842 -79004 -121508 -271109 -241672 -284037 -22849 -185620 -236615 -254481
10024 -254481 -6323 38863 -197143 -113804 162031 178001 54373 -205035 -352104 -9029 -103255
10013 -103255 -150167 -451659 -136281 -75840 -70086 -196660 -287973 7474 -52820 -105005 13109
10001 -103924 -197298 78031 -163158 20160 -179790 45790 -290378 65013 -100395 209370
9990 45828 6197 -110668 87331 7844 56795 -354210 -61188 -1613 -192913 292979 -61392 52356
9977 -215223 -435977 112456 24391 -17291 -387112 -131196 70168 57086 6937 -84379 47624
9965 -77235 -166314 -52131 -189697 346194 -232104 -312804 -83628 128312 -146845 76502 -366894
9953 -71342 83334 78806 61724 -130458 -33416 24019 109507 128908 65183 -218606 -134577 -375908
9941 -375908 -243049 -125679 -109632 104667 147185 51323 -71790 -95716 36967 7005 99598
9930 99598 360209 -89876 -4357 -430196 -79786 -4617 11968 283087 -114280 -49277 -33379
9919 -33379 -38599 5653 -173938 -239414 -272761 -64770 256371 -105873 -80987 -58902 -22318 158213
9906 42011 82593 7821 113405 -158409 24730 4946 -199671 -257080 -82549 8486 116391 -223323
9893 6497 70360 -534332 -173013 -259702 92207 145171 126632 -131773 -86605 578602 -294829
9881 -281289 -387853 -165408 -126295 -78950 -11881 -172251 -20756 -339089 -84526 208366 19264
9869 -233237 119720 -152616 33676 -96771 -46565 94043 117385 147213 -468190 71041 314528
9858 314528 -159937 -147104 15908 -100905 -17370 122388 -288932 -253437 -245787 157356 -301651
9846 -379102 143656 129844 131222 8120 24182 -385222 -294611 -238811 -130488 -29729 -329801
9835 -329801 10870 -173233 -522365 -130851 -264915 -59321 57620 -90407 -260672 -35283 -68902
9824 -68902 -255550 -173151 151468 -244977 199736 186308 57054 -64448 9048 146874 -21576
9812 -75647 182049 59818 106724 145694 -227242 81702 478 218891 -284202 -27169 -83957
9801 -83957 -24741 51340 16132 -403287 -29717 -17952 -109135 -165001 -175086 -176475 109448 -340550
9788 -285966 -82635 -227922 -148992 -158266 250722 -232 -137970 -15922 -54671 -271004 -78411
9776 -448311 -194907 -349166 -132302 -210824 -118578 -243624 58607 -329336 -138616 -233289
9766 -233289 -74495 63602 -307627 -88617 -167616 -203724 271735 323178 89959 -433549 -49764
9754 -384509 62545 133337 -313916 196649 -68295 -77789 -72269 -50911 -115180 62215 -214565
9742 124014 63144 73673 127306 -118556 -7014 26684 42869 -181866 -206404 -156956 407967
9730 -332202 376726 109551 -59832 64564 -132340 -12307 -161468 29474 -92060 -113326 -94412
9719 -94412 -41389 142313 -97972 -63693 120196 -208495 -99387 -202152 -108145 -271003 102688
9707 -331072 -194152 -201061 134787 63556 69740 237664 176242 -356244 137694 216832 -139774
9695 13631 -19129 138694 -13113 -170764 -80828 -14118 -83864 -36971 -182648 -59984 2773
9683 69765 94261 -146771 120801 -354125 -16980 62211 -261529 -132127 69024 62282 -139911
9671 -61756 -185459 -258479 35060 -78258 -21277 -202206 -130228 26685 -112765 -341421 254897
9659 -51851 155863 -86323 -217758 36088 163042 179826 189090 -141114 -123456 -187082 -213460
9648 -213460 52171 3079 -70379 132304 -261088 -361997 185444 -313555 -135287 -70166 84960
9636 -50429 99277 25680 -87176 -410988 -226558 -70079 -255427 -137272 161134 -71538 154325
9624 -56369 -126313 245435 248149 -19117 169782 -272914 296183 -169647 -211218 -67936 187608
9612 76508 -264726 53423 57396 5851 -2517 -33794 107062 -299626 -341550 10895 -32751 75365
9599 -22049 241419 -314544 -215339 -17370 134090 -90055 -229824 -144370 135620 48665 -252502
9587 -128475 -44190 92866 -70946 74736 -121502 -229885 -47195 -162525 189265 -175311 -360368
9576 -360368 -148963 136505 28271 -185737 -133608 68176 146511 -105955 168402 -172506
9565 -18851 -141888 -543583 47530 -243411 147719 220112 138421 -71044 -235108 -337996 -97818
9553 -96019 168399 -206341 -198869 331130 -66789 235173 -173633 46921 -26121 54913 -256795
9541 -143271 -55921 -19801 -210013 -253366 -37644 89153 147091 -7713 -52983 16200 -14797 -7952
9529 -7952 -116565 -267185 -66089 -74331 -203345 -218760 -202492 -261812 -138048 46767 72940
9518 72940 -18860 -75312 129325 -204349 -187978 -77635 -76940 -194165 -518770 -265273 -240448
9507 -240448 121359 64510 -47601 80659 -469186 -240560 15240 -58399 -270955 -240889 14240
9495 -210114 137338 -372295 -104433 -94662 145774 38644 -132976 -85580 -111171 84479 -76304
9483 -145128 -137338 -375312 73312 -292348 -201816 203624 142852 -171257 -105434 -199043 -36045
9471 -66774 -130348 -259922 -104871 -394454 177486 140209 19936 -377425 -169251 -353482
9461 -353482 -54334 -177020 -41601 -305972 -266141 -35037 -5063 -13615 -257276 35581 1549 -14710
9448 72827 72879 151899 118534 -307216 -424328 -15060 34568 108439 -131790 -233071 -83069 118189
9435 373185 -38506 -352135 -100567 -226349 -98915 230856 -137136 -429188 -117568 -177226
9425 -177226 105305 274781 88228 -200082 11615 -57311 -157357 226148 132873 -120047
9414 114027 -21952 44368 228956 -43093 166928 -408745 -221380 -149792 104088 -42703 339577
9402 -84783 -124915 -81830 -176493 -52255 200375 129185 1478 -175955 -256722 -57258 -286598
9391 -286598 28179 69101 -116023 72910 -118053 -335694 6446 -238597 -108456 -131248 58000
9379 17699 -79801 -59477 -38479 -39902 -82854 61244 103631 34824 45005 74148 -179973 -102602
9367 -102602 -149540 148762 -50789 -71648 -115207 -46900 139804 45328 278840 -562535 13613
9355 77021 8540 131367 -8474 94217 38992 346739 -25833 -74232 -31063 -128535 353550 -113073
9342 82249 -69891 -93371 -145132 -3250 -41799 -54194 330322 -14424 13409 -200019 255010
9330 -294535 -280886 -243279 -104013 -144449 -61779 -227110 113240 -40216 -151893 75367 71413
9319 71413 215481 123747 48377 -119090 -104145 -60798 -50824 -89744 -234918 -330852 123991
9307 -110565 34396 86385 -199364 -139607 -313227 143522 122549 -299179 119726 -81803 -218290
9296 -218290 -99725 -273078 60389 -33564 115971 -50756 -48765 46324 -457290 36736 43493
9285 43493 -248146 18760 -14264 293324 -131195 -273414 -63613 180473 -396936 -86181 -228970
9274 -228970 -12511 83888 265273 173474 8638 -182829 -5195 -42003 110540 -340108 180092
9262 -42676 144757 158 -89743 -53279 -317033 -229373 10779 -106276 -140906 58937 -7571 -25989
9250 -25989 54763 -259481 -176207 -143585 96045 -49594 254347 -271688 -145538 4704 187072
9239 187072 -467601 -376683 -392557 -142268 -106542 -75577 -196368 51079 13488 55819 -455404
9227 550578 170519 -143004 -82308 6982 192106 -250548 -57365 -271506 -333921 -248724 167387
9215 122055 -117791 -288770 218386 -343390 -201252 -113791 11041 152428 -400728 12251
9204 168458 -118307 194667 -87763 81353 -202727 147565 -85794 144406 -6890 -120362 178337
9192 243883 148900 -98372 -59303 126026 -116692 105779 -254097 -31256 428361 -364563
9181 -275165 -190281 -125035 350618 -136942 31184 -259552 87293 16837 63072 -224149 59643
9169 272438 -314025 -166558 -223884 -150548 97640 60081 -43010 107604 34704 -38579 -93565
9158 -93565 -107686 -275767 -13639 209538 -262649 38855 7746 -351666 -150347 -220975 103865
9146 39509 327801 -243686 47501 118671 51317 102547 -177862 -218291 -147361 -153559 -218916
9135 -218916 -22464 -133155 200343 213714 -32892 -16035 -421516 4694 -51935 225881 -254767
9123 -78486 -130554 -74152 -96685 -218299 586 -60185 123747 -3366 -74479 -182135 -82200 -41010
9110 -55610 12541 -91583 -59433 83323 32393 213639 -361898 -207905 -106421 5006 -149627
9098 -58989 -78194 -44008 -215363 -81513 390750 -119032 -54239 215411 -388551 -36867 -169437
9087 -169437 -3569 -105149 -119191 -67682 -67507 -220472 234925 -124282 -146359 -301057 -337336
9076 -337336 -45549 22717 66497 110299 -15816 -278504 87711 -154419 101220 -198006 -3663
9064 26173 -239419 -21683 33026 2558 156398 59309 -182418 60720 76534 -10279 225074
9052 265781 -352532 153503 -177540 -86730 124441 -47109 -109312 42013 -198681 -47846 -115853
9041 -115853 83127 -184821 -139352 -190990 2343 -58920 -142833 648 172794 -171180 -183776 199352
9028 169422 144448 -183461 -113984 -196756 236584 19328 68350 -317756 69039 42420 -23795
9016 45650 -92037 -49434 39005 216757 23033 -556634 147677 41652 -28367 -186990 -80776
9004 172728 -22736 -122095 94627 48029 72042 -228229 -192001 -82253 -58882 13681 46012
8993 46012 -244321 -12248 462743 -241385 -4587 -128211 -5027 -22945 -240925 -469004 -162727
8981 -98391 -124811 -211308 -64936 110536 -158068 -110654 19651 98608 -117195 231788 -142039
8969 -269996 -73654 -76148 -6881 252346 -134399 151848 133007 -41084 230433 3317 172640
8958 172640 -68619 70660 146552 -177350 74653 -102623 211069 41770 -45027 -19609 52320
8946 -344192 -176302 -9427 -85136 55799 -109556 -139119 -182532 -226817 22599 83456 -49420
8934 183938 234154 77642 160067 -192330 -174967 63734 -15040 277947 29667 269702 187846
8923 187846 1830688 9284251 5443525 1440997 501776 293376 -203039 -20844 -74054
8914 -74054 12976 -2314 86212 3974 103894 95844 40954 177356 -35663 52318 -151761 102457
8901 274742 27241 -82053 198972 -27612 94881 165744 312373 340622 149378 5051 -3291
8889 32644 -157928 -5753 -97863 101868 -130967 198784 -299691 36717 16004 349497 -67948
8877 82219 -100907 -48888 24787 -224440 -46554 -227087 -28855 -207852 177050 60785 247629
8866 247629 95447 343700 -219878 -304395 -191847 -69458 -326667 258176 -53936 -224506
8856 -224506 164703 -61371 94216 -211567 247197 -238878 28740 59254 -160547 -288711
8846 -288711 -124935 -59709 -171541 251737 111260 187249 -194590 -425317 -121186 -50726
8835 223210 182000 -41055 -346860 121036 -214176 -261553 -150791 -85199 93904 -15678 31465
8823 5346 -316308 175550 133318 -89 -146939 181631 -85112 -346512 -214735 204250 -221088
8811 -301055 -261667 -212407 39003 47758 31778 -57102 116925 170936 265495 -281354 -58171
8799 -260732 10393 226881 30053 18389 98729 -120190 104856 -255904 288653 19305 10574
8788 10574 -109000 258925 -112195 -213489 172077 -556013 -115300 -262366 -158310 66097
8777 218621 -97946 -113751 -68577 -51188 -123234 -88019 -57618 40946 -113116 -147786 -277654
8766 -277654 148382 -236108 168310 110615 -142101 115307 40878 56927 -5944 -57225 102291
8754 -132068 214058 -24184 -97686 -79853 -319813 -62399 -58768 -157780 52768 -220604 -156323
8743 -156323 -227060 -24353 -80817 56313 76158 123307 22816 -315280 -64277 143 -377145 172957
8730 -209007 -52364 -133712 -55990 -147329 199119 93793 221596 -65606 -207040 3238 -193165
8718 170002 43860 238394 -41632 -101953 44481 -70332 16028 -144267 -95112 111873 -74579
8706 262464 -397731 -40194 121706 -51022 -91806 23704 39580 -153554 -83003 -276837 -80656
8694 -102584 -274127 -150032 272777 -164364 183988 67711 -31652 -32259 -226610 151259 -36226
8682 -51926 -221302 -465717 3713 398 268007 -118807 -180326 -182380 -21835 65951 -61237 -85299
8670 -85299 -208268 -30471 -161650 -174772 88142 233245 218694 -197053 -78740 51353 -25384
8658 171693 -147629 -153652 141138 -367718 145294 -54342 -220159 46275 1909 -34284 -194032
8647 -194032 -18453 151808 -292823 -28186 -233121 -166590 -39551 -76714 11980 -4424 23764
8635 305120 85110 241855 -62507 33494 -77773 -240627 -116167 -25313 5617 66341 -108376
8623 118495 33741 -164860 79990 -7916 204385 -47578 -63386 -249443 166347 -14805 -134963
8612 -134963 -998 143462 208401 -440598 227917 120434 -138527 -24705 -406418 178892 -208765
8600 99956 -35353 -181304 -22472 -199446 35525 -28171 -115737 -157544 121572 -186878 29167
8588 69006 -170098 -129984 98278 85517 145163 -62385 -211200 -64463 103793 -96532 -83299
8577 -83299 289850 120982 -211253 -408798 157073 121046 -189465 -15107 238 -106397 16281
8565 77654 56363 -125645 -218506 120732 306470 -215364 -87852 196957 206029 154696 -195538
8553 -104096 -167849 22357 8968 63622 -121225 205810 45853 9100 44157 82258 -53327 -13882
8540 -70588 129240 -136762 112143 -96671 78003 -58256 -207851 -421102 -72429 69555 -373248
8528 96871 216708 -101762 -155757 -12627 134963 -148516 -71891 -38029 -384020 14293 14997
8517 14997 -49799 163431 -272479 -7757 225380 286626 -46291 3326 -268060 230550 35028
8505 52101 10625 -261996 -125869 38158 -286941 -159604 30486 -184691 -173569 -113136 193361
8493 -183795 28847 -67469 86956 80350 100061 -154910 171193 -242377 43478 -133229 -76544
8482 -76544 281592 -219540 -104187 -142339 -272859 -97220 -162656 137984 -288956 -78215 -313880
8471 -313880 -110107 -102777 -193391 -68029 94774 -257312 -237372 54877 47163 4332 361463 -80184
8458 -283817 25861 -34211 35038 -170755 -126697 53455 -19039 -40499 50733 -155105 -256394
8447 -256394 -13711 10758 -139633 150224 -91893 -12338 30470 95229 -66353 12680 -87651
8435 -139334 90670 -13648 -55381 -15207 -122114 130339 -71665 59799 47263 107324 -116275
8423 -111894 296012 15312 -230404 248091 -488583 -253955 78733 -82989 -179517 -110308 138170
8411 -54123 178797 -44011 -194143 26596 -201569 502749 -82772 -300550 -284404 371177 146363
8399 -265666 -33244 128226 -162310 -62070 219419 -71263 43674 -176137 166516 -33306 31090
8387 -229910 -295195 122304 -155820 -380233 34336 161021 -190051 -75858 287548 114246
8376 -280110 325542 50152 -118250 -101026 67653 -339218 -123999 859 238238 -270752 -259447
8365 -259447 -96448 -189541 -38083 64816 213872 62761 261384 -2902 19391 -10858 -300430
8354 -300430 -373375 -277740 58742 161553 -151658 40591 -151183 -210741 265938 153679 -148261
8342 -215041 -165364 -97410 158060 124277 -162428 -240156 45505 -83030 107308 108229 -109684
8330 -130422 -233630 92174 -149774 38530 41549 -24865 -56183 -29121 -148818 -127995 -154003
8319 -154003 51661 140516 -130926 26274 123611 -340954 -124860 -111802 55183 58502 152358
8308 152358 52454 172533 -205355 -158813 -322825 -27036 -126088 158751 -159407 -117994 -157856
8297 -157856 -6033 336265 -174155 -155420 12088 -97820 -16260 21846 -229088 -52756 -32758
8286 -32758 -109232 56809 -94137 175096 -174628 -13044 -66578 215724 -219666 -65676 -32199
8274 -216354 -88030 -176215 152977 -105644 -176455 31927 -133388 -113723 -82813 211093 -134163
8262 -81224 -119130 41312 238229 -267994 -206237 -258854 -259112 -164752 55 81870 55867 -87768
8249 -543381 -36900 -18849 -32812 -304808 91872 111046 66165 -50359 329454 -169829 -128629
8238 -128629 -157346 179913 137136 124573 5252 75834 81039 183131 121082 -183503 -268382
8227 -268382 -47419 53827 175629 188832 98015 -176367 163467 -50969 -252376 -261100 106135
8215 -379150 158768 -53870 -124017 50607 23246 -299140 -323161 129732 -62904 -202768 112610
8203 171864 71704 61162 83285 -552781 5154 -183662 211639 -88136 -182922 332664 115191
8191 -243171 -16968 -162440 -341589 88484 -60462 -66620 13652 92867 -188598 -6225 131771
8179 213244 -14129 116990 14663 5502 -48539 -154654 -7438 -188548 99277 -44707 65701
8167 -99647 -247438 -396248 -110708 18304 89633 116586 -428080 -80168 -94682 -14111 61864
8155 39633 132060 -457745 95653 139872 94830 -200963 163891 265129 -77630 -38546 -246705
8144 -246705 -39131 -130578 180577 -372829 -60300 43442 -169169 -96777 -353480 -197548 36239
8132 -14380 37219 -73756 -59549 14298 -356431 -186297 -55194 -285606 -46278 -32437 103930
8120 36913 -7318 48245 56753 -210348 -178915 110344 41530 -32737 232113 109435 -232973
8108 -149525 -277401 15530 -130754 -13060 -276836 178900 -212248 -179842 -152475 -5246 147640
8096 -63858 -174566 76861 17475 -219758 144477 81816 243823 136007 -111031 -69368 19543
8084 -184421 -156872 -328756 -153275 -17134 28988 -7548 256011 356653 -206334 126088 149003
8073 149003 -60930 27245 -62500 92328 -241458 -59597 17225 28381 -181312 -174401 -53093
8061 -204256 4542 -61649 -20094 12377 202445 -3369 162121 -77632 -182411 162582 205597
8050 205597 -103790 -166883 -28400 345467 128199 -25081 3312 -42739 -134463 -66769 71957
8038 -354366 128422 -138601 -99620 249098 271800 215672 -22109 -95415 -170724 26389 168999
8027 168999 145965 -17284 -350417 -166767 58500 162719 -26244 14460 21481 80172 -193476
8015 18583 -40375 -39705 -162754 -55265 -96462 18893 -24359 -253612 -414489 -62984 120915
8003 -128712 -109300 156253 -5587 44521 -46758 -490459 -19238 -303253 -60409 85060 142069
7992 142069 247967 -149542 62500 24550 -2144 -104526 237028 295509 102130 -186988 -398261
7981 -398261 -23314 -3712 117700 36188 91963 -36487 -179465 45113 31092 714 -7029 -23089
7969 -23089 -154562 -127337 200457 -25206 -154479 25067 57228 -255949 -170688 -354116 -52012
7957 215192 -212117 64533 -147144 -140625 -62225 -104747 94820 151581 90098 123160 -22241
7945 -40970 -142562 -64626 -373769 -183831 102687 24896 6883 -4994 -35386 110603 -126386
7933 321333 -51468 -301498 -224044 339346 -356500 49607 -223716 -114395 120817 -49909
7922 -78913 55835 126281 -40264 134419 -83540 -151819 78113 -15148 -293370 23427 -322270
7910 -91249 220040 239779 11805 -183064 4911 -153921 13273 -69279 -179910 66478 -75328
7898 -88955 65312 -63215 -326929 -32138 -106358 -107265 -276384 -310637 -4207 -65469 -250152 16290
7885 -51691 -309774 -397266 -13131 193423 81680 94027 80181 183794 -48378 -202430 115550
7873 3611 -25044 -83655 -41924 51964 -121044 -445657 -7640 -108885 -261525 -99054 -7249 53316
7860 30324 40107 59139 48170 103714 119456 -147884 153906 -70571 -309492 74363 3867 -105708
7847 183693 250924 -137508 72600 -51496 -57481 -164293 -263889 -169828 -60147 -125295 -122214 -173866
7835 -173866 -104297 -221771 -207864 -124304 86446 83634 -243823 -86719 -377601 -411321 116726
7823 344963 -108154 -118494 42864 -219486 -231330 -4619 89867 -37188 13572 532936 133804
7811 -712 430024 182796 -107663 18089 148490 -93314 126468 36034 -15775 -33031 -11970
7799 20484 186613 -139496 -50883 58721 171726 94080 -146104 -58125 -352375 -57566 -256915
7788 -256915 -110865 104612 -180078 -431167 30169 212648 81407 45292 -92646 192175
7777 -132547 -365838 -288802 -120487 -79801 -1387 -128957 -143064 243285 -355120 -159985 265476
7765 -290450 -184824 -342122 -90179 85070 -80618 66327 236039 176135 -99980 -158309 -193660
7754 -193660 2024 19271 208322 -40655 -149933 26663 224421 206076 85768 -226349 -191549
7743 -191549 -265070 -238811 148220 -202112 -37738 -122528 54498 -111039 -470368 61858 -152779
7731 -91688 158275 173835 -207559 47813 82935 -184003 -106918 190116 -216099 -34463 50106
7719 109489 -417353 -90932 194304 18734 -63278 111778 -139836 -238836 135184 -50258 127067
7707 316717 111322 -69289 -86957 15326 76516 -3636 68592 162148 22273 -97705 226650
7695 -119061 178184 -1042 -32632 120392 15857 4071 161806 -327164 -53020 -95222 929 -129559
7682 -17922 165376 -120698 -29108 -109297 -17694 78247 116467 21052 135775 -91527 -192132
7671 -192132 284346 -144173 -191261 -7141 88258 79895 14400 144087 70140 -201051 -127363
7660 -127363 49091 -22370 130929 -66655 -85608 -81344 -137537 -140254 146879 -120043 -154590
7649 -154590 -82130 206590 -33300 -49197 211442 -271648 -38046 -269441 37227 154861 129814
7638 129814 -272115 -163189 349286 28261 -135627 -129221 57534 -54724 150084 -155031 783
7626 53768 -456160 -323538 -24519 137238 -102937 -118401 -9449 -4195 -186647 -248357 34791
7614 -15778 -151631 48232 -28829 -119456 238340 -150762 153706 80467 73927 -373018 46415
7602 -75485 -332909 -61461 -14346 80508 148967 63692 95856 286144 98864 15882 15019 -19362
7589 -316314 -258524 260952 128066 -350632 5404 -130689 141156 345027 260009 148029
7579 148029 439620 -240323 -108306 -7273 27170 -59179 -172694 130003 81956 100953 -406617
7567 -106057 -1381 -316308 -260495 -204125 98701 44295 -197347 -237568 -194679 -120334 -263934
7556 -263934 -88316 -205903 -389523 -11148 -282625 -171645 74636 -183394 40243 -199937
7545 -56382 -188976 81840 228835 225050 46547 -352269 -59996 152183 -347925 -280338 -308294
7534 -308294 -101773 24928 352957 -50429 -160505 -168398 -199227 -20231 -103968 156397 -58345
7522 169784 -14137 -319818 7850 -281461 148836 196086 -148350 -391099 97216 90358 3754
7510 387177 -26074 -56734 188152 -183599 77028 89047 55788 -322078 108290 -161995 -27484
7498 58914 124983 222435 -39212 128542 -44243 47270 -18209 -243149 -289141 -112462 -170887
7487 -170887 -11574 -13588 -156558 -188206 -81955 -49803 -210611 -122117 33692 -72804 -20869
7475 -97302 -169954 -83906 38630 309866 22849 -157816 -79292 179932 -14469 -178873 159535
7463 -148841 -45302 -270117 229070 -56413 -38376 241768 84608 -289926 359378 -410665
7452 230261 164541 -237208 337809 84453 -152794 171880 -3751 -441016 116956 -203931
7441 -81548 -174820 136098 39995 161933 -514686 22681 99861 -156467 150531 -185128 -454758
7430 -454758 -84827 -54185 -11482 229638 -95132 -72765 -277891 -257461 199292 226389 191549
7419 191549 -225128 332227 174460 84158 -8645 22383 -16825 -11257 113615 -125879 128190
7407 -147290 -90674 -30416 -182321 -52253 -28227 -241506 -96117 -36790 6311 -44228 -202701
7396 -202701 173349 -128425 33987 101518 -44552 22 -178732 -23736 -43571 48472 33031 -175944
7383 80009 93769 81096 -74239 -76703 27154 297646 -136215 80211 -47379 185828 -358806
7371 -103043 118565 141120 -205254 105924 -82156 -49352 -203691 34723 208663 -44623 38449
7359 9283 -96206 -37684 -230483 106958 -313747 -162659 -154847 -85933 242724 -187990 -3054
7347 -221168 30707 -118712 -129808 58488 221865 -103718 64589 -284890 136691 -309063
7336 -174604 45632 72106 148607 89410 -239409 155775 -326626 -49086 -23840 34986 -48218
7324 -65356 -228850 -1591 -177960 -168657 274059 126368 -93711 275212 -85062 -244216 202009
7312 284078 -178494 -148373 -63048 -160234 38205 62860 125854 164319 68297 129375 -108269
7300 10524 177280 -273654 -341897 -136758 283289 -62432 -408364 -152050 -98089 -18176 -39003
7289 -39003 273336 221077 -199132 12970 -359035 -107499 94151 -286054 -21796 77976 -208737
7277 101901 -93992 -320401 -167357 -237481 -394614 -85119 -33856 13969 -31071 190942 -253451
7265 -67221 19170 -16908 -48352 -86750 22908 -112121 -68952 -490016 -354277 2239 63469
7254 63469 366823 -208481 -512204 -90913 -172649 -1450 120194 19633 149980 -41471 -96021
7243 -96021 -131197 19888 -31962 -37842 114776 -33950 390017 259372 -174085 191991 23136
7231 100496 -83179 326521 -77887 -111316 -321514 -18990 -382971 45800 -52073 5504 124901
7220 124901 58697 98016 -122420 -405415 280274 -3488 -267805 -61218 -164305 -184461 -75855
7208 75852 -65495 -317213 -124807 339583 -537 4958 -58110 -38129 70771 3803 113484 86300
7196 86300 -273966 286427 -322706 -642 130065 -173313 37802 124096 21659 141602 101023
7185 101023 10486 93214 -212150 -88349 -144681 -137389 -87091 137625 -134318 -42262 318815
7173 -165536 299974 236855 -263788 -264385 98458 152259 269212 69267 -177426 -1966 382938
7161 67150 -137797 140595 -170478 -122550 -17625 248607 103171 -53219 -142488 124649 -244661
7149 -120057 82179 -52892 -56708 100024 -274979 -93250 -237770 190228 60936 21393 -84190
7137 295907 82928 -80452 -138273 -104565 -258601 -458041 263207 -28481 117487 -141568 255665
7125 162950 348946 197992 -134286 127548 -272304 -11847 -170281 26038 29865 6570 10849
7114 10849 94269 -356315 81708 -146149 -235210 -129845 -98074 -88620 572 -92908 -124814 -32263
7101 303920 -315000 -287110 264736 -164819 93065 184074 22177 -34161 -51576 34106 -223335
7089 80499 92405 -321033 48516 163027 -177117 -146572 -286991 23476 65252 -154794 233733
7077 -130804 -311657 -123623 -195109 -135620 15011 -31502 -93327 248687 -107368 396029 -122125
7065 -176324 40811 23439 -160183 -34468 -51933 -12250 30062 105284 144586 -240349 -108895
7053 -71764 227875 -28883 46775 -16045 -175606 -31806 -48968 261486 -152042 121186 100160
7042 100160 -237168 -889 -310349 -159798 -2026 117659 479175 108544 42105 115750 326079
7031 326079 209282 -22357 96431 -135481 -371862 -228913 -69632 -313654 87957 8799 53453
7020 53453 303651 -108231 71721 307756 11921 35090 94639 -67212 107892 -98228 157159
7008 89345 -230162 199045 62644 -316897 -18133 118002 -162122 -251073 73091 2871 -55067
6996 -453529 230577 -525034 -211024 121543 -57653 -328298 -200537 80129 91293 -45857
6985 -154227 82456 -239244 158944 -103297 72374 82496 -107527 163173 53678 -19622 -159934
6974 -159934 -159625 259918 144554 -30371 -100596 -171097 31518 70162 -272383 170602 194386
6963 194386 51186 -52087 -16697 -163346 122342 -301336 185556 14572 120233 16231 63473
6952 63473 205715 150546 243848 -336856 197594 -167351 6629 -379428 -128703 -187266 -69928
6940 53982 -18169 -75616 -84623 -53108 -269614 28094 -102537 -382215 79432 223562 -172671
6928 -275356 -270732 -189761 57135 69070 147390 156119 -194284 -191133 -370880 -211576 -3409 -49244
6916 -49244 480054 446728 68259 16663 -186599 -93971 -285533 277111 -65132 -50995 198418
6904 -182804 -74778 615629 -315583 -41395 -175530 14240 -47167 222026 -405652 31786 -14350
6892 -147074 183838 -73063 -140122 160580 187772 29808 124075 -405247 193400 -101491 46203
6880 19435 -119042 83159 38956 -12765 146174 43274 335348 176386 -69466 -125327 -54605
6868 33056 -209984 -2076 -11221 -21317 64800 39825 -127687 -155721 -24953 276148 246552 -489560
6855 -28627 144962 107683 -284114 190851 54167 43676 -5048 124333 -128995 -137696 145632
6843 -254665 -22810 132967 -89493 -235606 -255369 -36639 -12211 -88892 -40683 98370 162872
6832 162872 76885 -40515 -170926 -309942 -15627 15728 -19971 195568 158028 -237043 -54801
6820 18613 112378 229030 9807 -58687 305187 -49139 -196012 52902 -189823 -35180 403195
6808 128866 83372 -124489 53821 102125 99612 59866 -369965 580678 121963 138526 143021
6797 143021 39299 -121537 99026 240594 72206 -195028 165020 5496 7748 -40995 -294463
6786 -294463 -485860 171996 351898 -355798 -203915 -156176 -62702 -88985 -168198 370911
6775 -156766 390358 3304 -301828 -134144 -189038 87591 -60522 227197 159742 82219 336853
6764 336853 -132211 -47946 -239327 7547 262381 46261 -138436 179063 -316215 65728 -2979
6752 79891 201247 87542 169412 -71783 -322308 49436 -295657 -209492 406692 -278578 51565
6740 21680 221999 32865 -117215 -221541 -156123 -2053 -115194 -98584 4655 -110689 -132119
6729 -132119 -81504 1765 82527 118392 -224860 21500 88950 -34151 -102350 -33657 -2343 18731
6716 65008 -46915 -23691 -244882 10604 -50612 -189548 -72782 47658 -51230 -147142 -215410
6705 -215410 -195863 203441 29060 -204803 66790 288480 -40647 24332 -155376 -146048 188863
6693 -44895 -64476 -60382 -166666 -114695 291647 153182 -43579 -93515 -97322 -31546 38272 -155284
6680 24299 123601 -24939 75362 176505 -48873 -115346 185103 4126 -101886 56193 15442
6668 -47650 -2979 -239618 25139 62451 340299 -303594 -66727 -62087 118862 187617 111102
6657 111102 -275126 48424 133353 -363384 177442 116212 128535 114300 -48613 47127 -68706
6645 -18459 -225900 9187 -107465 -459573 -133976 72402 -509445 -269990 -14164 -376252 138335
6633 110953 171148 413168 -73058 100010 37440 69695 342101 50386 39093 -301406 -463614
6622 -463614 -48219 111721 -162086 228463 163191 232066 -75687 96563 -8081 173868 77606
6610 90324 -231565 44740 22058 162967 -35470 -39428 17352 121343 -119114 -96972 -44804
6598 54012 -73099 -64738 -228148 169327 23897 7326 -171749 270822 30585 177515 -278266
6586 -284231 -142280 109816 15887 235135 -92790 -268929 229089 -90119 36896 454026
6576 454026 61954 106335 -50326 -195209 -174399 -216156 204016 -157647 262662 70092 -187234
6564 165054 1605 -94928 -147757 -58962 -96501 128486 319989 143840 23744 -232675 -185932
6553 -185932 -46481 -2612 99049 -62591 -80564 145841 -72699 -9015 -102818 149317 -46072 49811
6540 13434 -124887 236157 -41226 142832 -98687 350193 -196271 -134453 -256 -146309 -102102
6529 -102102 24883 64227 -58922 112555 255708 -60806 50450 -111858 -206219 188607 248544
6518 248544 -28529 298046 283584 -11809 267893 -63864 -3591 110697 13036 -12398 -241776
6507 -241776 -119542 -119480 -209931 12653 32123 421143 48560 47515 47883 105659 72573 -114207
6494 -181472 -72880 88265 112916 77218 -353759 -150328 40806 117938 135670 132993 120257
6483 120257 91254 183294 -193157 -92177 250 255842 155895 87625 134044 67845 -312417
6471 -214094 120874 65225 -1450 -72500 58147 260463 -182642 -102556 37117 -105129 -120014
6460 -120014 -41498 -193766 89950 285619 -154629 -212370 111078 185781 126196 139869 -151273
6448 165023 81042 427318 -123130 72784 -183571 -164581 21573 88970 -24093 -267356 134408
6436 84526 -74816 -138799 52547 -84695 1117 -11681 -209126 -238962 -203051 -219798 -8774 -141979
6424 -141979 52752 184557 -90154 147921 -158845 -101787 72276 -290854 -259843 51770 141560
6413 141560 29754 -46208 -289007 48953 524714 -155818 -147345 -75230 11569 149201 -225740
6401 -276738 88594 -19762 69600 11819 -34668 190679 -139268 86763 179095 -165543 175783
6389 113394 -30141 -25912 43452 25284 140305 -254241 85881 133475 267762 59213 943 110011
6377 110011 -105421 311330 40775 -417260 -95812 -80220 42217 -46438 369493 49109 22605
6365 -224606 -17005 -87060 183604 -200454 -54310 53811 -57860 -227746 -333022 64265 35444
6354 35444 -83876 -123620 -172597 -174780 -183347 -243570 334996 -164832 -41025 -177263 107534
6342 -19552 -371630 305872 -199822 -193075 -3738 -116805 50639 16991 255397 2256 349686
6331 349686 -226232 190661 16898 -469006 178156 -224174 193601 42670 41598 -236435
6320 71582 11552 -113694 -34069 -322414 142509 -127964 -264451 -118246 294987 -21980
6309 -319 137058 -96907 -15359 -116541 -521802 26768 -97535 215336 67554 134416 -182612
6297 -92580 276651 -108427 63827 -33423 138037 -284639 169997 75530 15867 -336781 354972
6285 -120512 -102336 -271203 -44341 -73003 216049 177914 -286684 19139 520011 -158908 183412
6273 -130415 -56238 -80991 138081 109553 154415 160390 62099 -58745 151143 -182053 79030
6261 90409 180850 -9466 -178005 54266 -59265 39759 71635 -196969 58605 -208376 204497
6249 -62792 -196308 233313 -330179 -65732 234434 182886 170297 -155765 187490 47551 -88038
6237 -277148 134953 14080 -86538 169519 244037 329433 -10986 -221843 -194348 15777 12995
6226 12995 -145357 154372 -85948 127004 184483 -132952 -362214 -96185 -42172 -125672 20771
6214 103662 251383 262302 -71431 20378 304893 -118682 -180166 -212187 -12403 -65321 -142276
6203 -142276 165653 -161225 90866 65518 -78700 38013 60803 -220313 -102572 -73194 -92545
6192 -92545 -292603 -488590 -255927 -116334 -46379 -93594 -374262 -23526 224251 -114650
6181 256974 59867 249628 -351866 -28216 146246 -153272 -8888 126390 -210481 -178406 -241123
6170 -241123 -93673 80864 32517 -259152 -134978 182221 149903 53520 -3296 -281834 141235
6158 -101323 113768 -257547 -186459 123310 386671 -22283 -43960 -155683 103043 -193893
6147 37250 151384 -82150 69373 189733 254405 -35158 -97381 66692 -34632 187803 -170302
6135 -101621 -398165 162895 -307477 -415976 -94068 64001 93390 49452 58918 -126801 194515
6123 -54871 79344 -501355 85457 382671 -89758 21921 116225 -16960 -228995 -3490 265626
6111 -93897 32808 -132681 -84887 -45424 -64807 12893 105290 -158102 -155526 -117731 -135632 -2719
6098 156889 57651 -110390 -244147 -179740 -60313 -241159 -130184 -58581 -42694 76090 -1441
6086 88889 328126 -73434 -130042 350144 84182 -16910 -183821 -224150 39716 -80232 -31404
6074 211622 88895 -253974 -348861 38052 -144791 286487 24239 235961 158105 -92594 2435
6062 42269 -178298 -209481 111714 -227829 131047 -135952 -101033 260578 367225 -10953
6051 125546 -209962 245510 92274 133254 -244036 -315129 438958 142146 27044 -60183 205071
6039 203825 -22649 -222885 119267 -38117 -46079 137618 -68197 96320 13122 -130866 -124983
6028 -124983 49089 -246213 -202559 39986 -142899 50432 -10911 153835 -135154 111083 229643
6017 229643 -104005 -114167 -176446 42721 -243808 -59274 -19209 215159 53414 -128591 120572
6005 -216808 -12021 191398 116841 -102597 210248 -106338 246360 -13658 167194 -261247
5994 150060 -53679 -164831 122460 36357 -207847 37040 -183113 -388874 -234778 -100782
5983 123463 106591 -282498 155832 56838 47798 81059 389092 -310200 151464 -193276 -207512
5972 -207512 -132729 260178 45848 -250284 -28034 -248455 38164 57143 229677 -126911 100446
5960 43751 38350 91563 954 125361 251847 -182572 23869 -78386 149897 150640 -281134 61624
5947 -492 56031 -150706 58912 57975 124162 40590 107225 136648 -56845 46653 206672 -211388
5934 42416 267930 -157261 -160964 90971 35459 -203356 14634 -59162 -175114 240209 -354377
5922 62056 304457 -189068 34117 -231269 399171 68292 14707 -15396 -83272 -70536 -95306
5911 -95306 116847 38902 194654 108234 194843 268801 588057 160822 64162 -352485 112366
5899 90804 -7489 27773 139267 240653 -360427 -44893 -53927 -316868 -200317 -148277 -174153
5888 -174153 140399 -153599 74177 -99855 -107333 98258 -55150 154395 463603 -298190 17709
5876 -57966 50995 -34593 -37438 -385832 135046 24076 -187679 -210311 257620 314760 -47137
5864 -118353 -153751 53673 -137520 400442 194747 214957 47187 282389 195313 -2288 -21227
5853 -21227 -181736 -184224 184015 -10171 -174141 -174872 -171050 -87157 -4815 27793 52608 64505
5841 64505 -5422 10287 226211 -95927 -120062 -41050 -87245 37424 63566 -130998 -59559 -131306
5829 -131306 107569 9724 140398 -127177 -274868 -272184 67924 -132656 344007 96430 -77804
5817 -277692 182351 281882 -95965 88289 -328629 259271 -19768 -63437 -57536 -231034 -151283
5806 -151283 -198313 118985 -145926 63417 102802 -308351 -400674 133240 243821 302635 -132813
5794 103659 -108530 -10669 313419 -2724 -321345 -411044 -195694 235460 -52450 138014 -102005
5782 222861 213489 58032 -141509 159799 97294 -228316 -278021 -23558 381541 -164803 -68785
5770 -38359 81959 -114060 -396747 -177169 15449 5317 43926 -86570 -182030 -192426 -44342
5758 -140418 163614 24604 121768 239923 126053 72218 -261763 -66808 149777 31715 128904
5747 128904 -38175 -196899 182501 191697 -73888 462714 -253433 -153285 -148833 -66769 -318313
5736 -318313 167608 17152 33232 26213 138778 185269 -33692 48879 122104 119269 308501
5725 308501 -30775 -12161 6363 181197 -261626 13760 -165330 -1635 351789 25689 -72683
5713 -97487 25459 -84036 96547 -229887 -2691 -140814 -62626 -89797 42423 214867 41918
5701 47414 42359 174055 23372 -123984 12108 129571 -101683 96030 -49362 -185206 -98534
5690 -98534 103206 100435 136074 -83833 99898 -193933 -132562 -251716 -132314 51664 147370
5679 147370 -33201 287726 -156070 204296 53670 -169210 -206432 75770 192 83188 290917
5668 290917 249766 -193284 134586 -365559 31233 -395933 -179468 -107901 -211731 -151435
5658 -151435 -239583 -39013 66005 -146761 93529 47689 114223 -96711 237371 285613 -106023
5646 -168474 302072 13618 281989 80503 173186 -309583 -144266 -46458 109989 163305 25082
5634 -35340 21886 10723 286192 121329 -245454 11064 11144 207136 66525 -74938 68324 -153884
5621 -49041 -197653 -159064 -157644 196600 -218822 -70641 -241721 123555 -182633 127651 93013
5610 93013 215209 220806 -136077 148267 -79987 -103779 -67430 63725 181488 -71328 54523
5598 -79938 -31601 26646 -108471 254950 -134477 428 -31905 -236004 -239804 -170017 116661
5586 -282091 -26914 139619 -34615 -85492 -9646 -166723 -14063 -76163 235067 -327222 119229
5574 33711 428922 -25055 197259 95337 -295683 268459 56080 96634 -161169 -345625 62617
5562 216140 -11967 219972 145198 -143649 -139386 117158 -35201 55602 -89163 164947 39934
5550 169901 -37165 -61368 -223088 114361 295388 42588 25220 90202 203821 -279667 -398622
5539 -398622 -8097 -52078 -90197 62669 103262 228111 269468 -29440 -82553 173628 -39236
5527 -183553 -49693 141475 60738 16995 -162657 57331 -115353 -282 -140279 -47859 -9145
5515 -63371 -142198 -348189 30489 -14059 259040 -187162 -137717 283261 -276042 -154305 -60693
5503 -147713 60515 -195637 -181404 -256586 120485 123617 165642 -117831 -40426 194874 9076
5491 -128270 -360680 313845 94603 46368 3954 224226 -3361 -98583 -278056 -93049 10492
5479 -109198 -346288 -154962 -313781 154167 -273671 -76461 91415 -140889 -457167 279423
5468 125025 -194481 40456 153737 -9752 223236 -82613 313303 128827 -230917 65374 105955
5457 105955 -41521 -178558 -63764 -64181 327234 75835 -207278 -139110 -81696 187347 162605
5446 162605 225798 27742 152520 -167076 37404 72479 -34696 -122277 -335686 74381 53750
5435 53750 -233486 41075 319444 -125360 278083 -301964 -73161 -172657 105355 205761
5425 205761 -47623 -111171 -213571 -75779 86207 9604 286887 -387981 -188408 -98256 95813
5413 -121740 157473 -101639 24896 9078 68698 82884 146082 -17328 249930 50169 -138812
5401 68979 343003 -44162 -34379 -148569 73868 -378125 -19040 304937 262793 151907 1546
5389 104004 501704 150387 -267080 237177 33325 -123245 110574 14307 73061 -11395
5378 175365 152586 9653 -50837 -88399 -9347 9569 -229246 20574 -246786 55091 -97283 -160344
5366 -160344 -3059 218600 -10873 116892 99718 -316250 53181 -113990 -27815 421800 -51053
5354 31864 3161 -46802 22754 86380 -173647 -42169 -119924 32965 -53302 -80147 197871 37717
5341 382976 150932 179889 -277416 -15007 21214 -51208 39148 -60767 -448937 19638 -84756
5329 -359096 44579 -155145 -14293 -273264 161310 -110201 -128835 27682 -213975 23431 77021
5318 77021 3165 -260595 133787 220422 -106089 -146829 180537 291011 24691 136962 326910
5307 326910 374437 87763 -79579 252768 183273 -23120 83074 -212305 88652 -125748 166375
5295 117874 -345689 -25895 -228639 90873 -58265 105053 185303 223176 -8905 105060 121257
5284 121257 121451 184263 191267 -172720 -280706 -233552 -73842 32524 204943 -19950 37175 -156120
5271 -107910 72066 198648 -142482 165711 -33534 -136745 42162 217276 130833 -54857 95693
5259 110410 151554 116523 -390632 88048 -94743 -74865 -74584 -128026 -129214 211523 -6207 -118619
5247 -118619 -161276 -247391 362117 -5798 136020 -87449 175068 70168 -140671 194090 53037
5235 -140416 160844 -258801 -73428 130722 -128237 -202743 50181 -45320 -239 -18300 101811
5223 164730 -236348 291988 12072 -70238 154799 -238400 321593 -32887 -58430 39627 -53867
5211 60015 -275431 61081 -44549 -46145 -211599 -199193 971 176338 198683 63955 312852 -279140
5198 8727 -158840 174609 -380708 -225357 14604 17691 290209 -34824 -127679 -31872 75537
5186 298211 -3404 -68719 282492 76707 -225553 137915 120436 53211 -43961 74003 -110364
5174 -11953 107177 60141 -185331 47760 41466 -21029 59958 100322 -306977 117811 128423
5163 128423 154764 263090 -179701 -118734 33655 337038 315485 -168748 -211029 59431 71284
5152 71284 -44033 -233524 -18690 -30028 113974 -65760 -325813 -104976 -252116 68127 285506
5141 285506 119731 -202897 20595 43611 335463 -291862 187485 -109246 -94604 -307774
5131 -307774 -55668 81636 312856 262265 -189022 -5245 219395 -95529 26100 -24185 -107850
5120 -107850 174656 -128765 272170 -90406 206069 48295 -75247 127334 11816 -89997 -38376
5108 -167509 123689 -137652 -132488 28113 237979 -42881 -217306 -242579 -115902 19156 -13713
5096 3259 -19884 -104690 78397 737 -79340 4416 -427311 19581 -26001 147142 -70007 48480
5083 209897 62217 -206644 -218196 -38307 205440 27678 123970 21963 141128 -235383 317544
5071 78087 -155264 -22908 22691 249634 -22161 -337975 -5350 413483 33111 -246402 -212190
5060 -212190 45264 -27517 102519 -6308 -236341 -97837 -184574 -103460 216667 -69824 291650
5048 337054 236510 -101942 89993 -39681 -25108 -2950 -294281 121944 -48096 133131 -199114
5036 108791 -65319 156014 223210 -463 17846 59016 185523 -19187 64103 -97089 37419 103981
5024 103981 -206446 209815 153064 -250245 140928 17368 49504 -51068 -148750 192354 141308
5013 141308 43299 -196049 281890 -70855 112182 179061 -73125 -85234 -274423 308902 27619
5001 -282652 -56459 -27708 -83969 85485 -39775 310043 -33974 25099 79700 -118973 120358
4989 -38146 -25591 115614 111393 -21876 -156338 -172550 -236753 51955 -86438 -182567 34270 -135480
4976 -344049 130025 108398 10101 -161265 59593 146095 -160697 270378 63797 99775 176650
4965 176650 127911 71302 -71867 127465 8367 -167175 324132 -72014 8885 -259561 5373
4953 362662 -151080 -21476 -84799 220429 -160201 -538 -60828 -160227 39232 18897 416049
4942 416049 -59607 39835 289301 204452 -26029 151436 73054 -20835 -179197 -69224 86846
4930 17422 -275250 354554 92818 64530 -107342 -148874 203610 -272426 77436 256967 145286
4919 145286 20992 10381 273840 -551149 -320 9734 132780 3161 89305 -266109 400726
4907 -405280 -46775 459746 255908 126067 -228540 177875 -216981 265229 179315 -28254
4896 36939 -75024 -189335 -157101 85884 -294643 -31599 -336736 37802 -123268 -28186 -201745
4885 -201745 -76996 -259492 355361 171485 -45017 4868 16556 31720 -74783 95374 -47073
4873 27493 -127476 -103791 115149 -152460 339019 93584 76501 -94060 80518 31363 159315
4862 159315 -267841 375645 134640 169305 -13076 37381 148906 91389 1735 30506 135149
4851 135149 -74765 -53065 86935 -148179 -48976 -277396 -169253 65042 67074 -16875 12761
4839 -59089 152304 146388 -231906 68920 -131923 83922 -178662 -66233 -4661 -91324 -184539
4828 -184539 -259620 -77629 -67702 22427 -83950 14496 -245888 -279586 171244 477552 72982
4816 164773 -126469 237495 -19112 58280 109327 77325 -186191 307830 -76480 -81510 133204
4804 -22848 230877 213987 292889 17430 202401 38992 -9047 -105144 -200256 9293 -216967 -45980
4791 -208327 169624 -263571 -199560 61267 -40585 347649 -30428 367837 -437338 -99555 -162459
4780 -162459 214069 -159124 -181697 -162211 -231899 -117168 -294071 -161210 131900 -252514
4769 -392073 184343 204411 -335814 18300 207383 264869 47495 105997 -257884 516719 -218124
4757 -49205 9818 88319 58282 9320 32484 -305750 21672 -86726 -37670 -44081 -35193 -86473
4745 -86473 20894 212772 67599 137166 -155203 -91918 112737 -117124 -44052 136280 32007
4733 -39929 9888 49186 2091 114718 208104 -124866 19262 23012 -129495 -71807 -248460 -181358
4721 -181358 -60980 -61911 -259435 -260338 294229 254284 42629 -3590 -194368 63886 37144 26389
4709 26389 -20005 -154444 -33121 377345 -18710 30321 -60976 -33083 240925 -175444 -129422
4698 -129422 129433 462717 -120789 -53133 265494 -46680 150579 -106310 -19177 189094
4687 198814 97798 -36504 -133184 50188 -202276 -290921 89516 -132993 267553 -173530 -32915
4675 152608 -239337 -194998 -196906 72896 76930 128158 104041 -110436 -20106 249802 111569
4663 66344 -225247 -156453 -75651 352936 110285 -93846 -51524 -454 134547 134654 -91555 -64898
4651 -64898 176943 -235864 -160155 -398910 94538 50400 12299 -140635 10209 215860 48686
4639 76950 2544 182603 185214 -48357 -110595 29769 16538 51929 75804 94235 72152 -65242
4626 -44655 -61009 67519 416691 42045 57586 -107431 -125195 -138286 -77790 -309503 -10268
4614 -334992 -85980 -77919 -252843 23778 155467 -185694 56389 56418 -329664 -177481 -98 19934
4601 -233592 36165 157166 296045 195241 -77554 -156862 14929 97827 344625 122231 193123
4590 193123 -213555 -54740 -362165 -168702 -294686 -78183 38709 -52974 44418 208423 -25688
4578 -254021 44159 -71162 135096 55298 5028 60591 -47995 -105710 -340013 -38582 196402
4566 -187404 -19914 99681 -174432 15446 159453 196421 -76114 75994 417977 -117539 -319291
4555 -319291 185185 -45270 -279927 92983 292477 -71977 -88517 73109 110526 227215 37285
4543 245942 -52882 52187 290422 -179447 -267033 212570 -261467 -157638 121962 -233010
4532 47166 -113146 -85833 1863 -244900 266524 219563 -99980 -52459 126123 55942 -329011
4520 45268 37642 -141753 13075 -207397 368564 -56428 -95342 164735 -15587 -126630 458876
4508 -53389 288479 -117397 -203827 88881 -99910 -139677 219218 296167 13987 -40219 -50541
4497 -50541 -1053 -137738 36694 -84521 89480 163430 299517 132218 -170436 29337 123736
4486 123736 -120573 423379 218966 295306 -298392 -66306 -248817 127571 51658 -307026
4475 -86158 104736 -7184 345565 -106864 213200 -38233 2526 -65581 120863 150564 208168
4464 208168 186203 219477 -309667 110226 -44831 114024 -37497 -152026 -288895 132018
$$ [...]
##END NTUPLES=NMR SPECTRUM
##END=
