
##TITLE=AC1342_CMFRS10072_6534272_EPMFhfBqo4
##JCAMPDX= 6.0         $$ Bruker NMR JCAMP-DX V2.0
##DATA TYPE= NMR SPECTRUM
##DATA CLASS= NTUPLES
##ORIGIN= BRUKER
##OWNER= Administrator
$$ 1.72 TOPSPIN		Version 2.1
$$ 2012-07-16 16:42:47.781 -0500  Administrator@TOPSPIN
$$ Compression mode = diff/dup
##.OBSERVE FREQUENCY= 400.02188249412
##.OBSERVE NUCLEUS= ^1H
##.ACQUISITION MODE= SIMULTANEOUS (DQD)
##.ACQUISITION SCHEME= undefined
##.AVERAGES= 64
##.DIGITISER RES= 22
##SPECTROMETER/DATA SYSTEM= spect
##.PULSE SEQUENCE= noesygpps1d.comp
##.SOLVENT NAME= COFFEE_meoh
##.SHIFT REFERENCE= INTERNAL, COFFEE_meoh, 1, 14.96082
##AUDIT TRAIL= $$ (NUMBER, WHEN, WHO, WHERE, PROCESS, VERSION, WHAT)
$$ ##TITLE= Audit trail, TOPSPIN		Version 2.1
$$ ##JCAMPDX= 5.01
$$ ##ORIGIN= Bruker BioSpin GmbH
$$ ##OWNER= Administrator
$$ $$ C:\Bruker\TOPSPIN/data/COFFEE/nmr/AC1342_CMFRS10072_6534272_EPMFhfBqo4/12/pdata/1/auditp.txt
$$ ##AUDIT TRAIL=  $$ (NUMBER, WHEN, WHO, WHERE, PROCESS, VERSION, WHAT)
(   1,<2012-07-16 16:42:42.718 -0500>,<Administrator>,<TOPSPIN>,<go>,<TOPSPIN 2.1>,
      <created by zg
	started at 2012-07-16 16:31:12.343 -0500,
	POWCHK enabled, PULCHK disabled,
       configuration hash MD5:
       6B 1B 68 BB D9 2E 58 E2 7F 35 AD 54 07 DF 0E 41
       data hash MD5: 64K
       DE 8D 3E 74 E9 71 1E 21 69 29 0F 08 00 47 AA C5>)
(   2,<2012-07-16 16:42:45.546 -0500>,<Administrator>,<TOPSPIN>,<proc1d>,<TOPSPIN 2.1>,
      <Start of raw data processing
       efp LB = 0.3 FT_mod = 6 PKNL = 1 PHC0 = 0 PHC1 = 0 SI = 128K 
       data hash MD5: 128K
       8F 48 C8 81 EE BA 4A 21 0C 45 9B 82 92 08 8B 1B>)
(   3,<2012-07-16 16:42:46.687 -0500>,<Administrator>,<TOPSPIN>,<proc1d>,<TOPSPIN 2.1>,
      <pk PHC0 = -1.340332 PHC1 = 0 
       data hash MD5: 128K
       EA 65 31 71 53 1F A4 EC 3A 3A C2 E5 4F C3 00 73>)
(   4,<2012-07-16 16:42:47.234 -0500>,<Administrator>,<TOPSPIN>,<proc1d>,<TOPSPIN 2.1>,
      <abs ABSG = 1 
       data hash MD5: 128K
       4B 88 56 CD AE 7C 35 B8 93 08 87 73 F0 14 C0 6B>)
(   5,<2012-07-16 16:42:47.312 -0500>,<Administrator>,<TOPSPIN>,<proc1d>,<TOPSPIN 2.1>,
      <abs ABSG = 2 
       data hash MD5: 128K
       5A E7 05 51 59 19 0A 14 F9 FF 2B 76 D4 5A B0 7C>)
(   6,<2012-07-16 16:42:47.375 -0500>,<Administrator>,<TOPSPIN>,<proc1d>,<TOPSPIN 2.1>,
      <abs ABSG = 3 
       data hash MD5: 128K
       AA EE 9A F9 9B 22 19 61 F8 07 C5 50 10 A6 4F 2A>)
(   7,<2012-07-16 16:42:47.421 -0500>,<Administrator>,<TOPSPIN>,<proc1d>,<TOPSPIN 2.1>,
      <abs ABSG = 4 
       data hash MD5: 128K
       1E 5E BC F6 21 50 59 77 3A 66 5C 3F 78 1F 2E B7>)
(   8,<2012-07-16 16:42:47.468 -0500>,<Administrator>,<TOPSPIN>,<proc1d>,<TOPSPIN 2.1>,
      <abs ABSG = 5 
       data hash MD5: 128K
       28 66 A9 D2 D3 C5 F0 91 6D 4F F1 0F C8 9F 61 2B>)
$$ ##END=
$$ 
$$ $$ hash MD5
$$ $$ 4F EE 65 2A 8E 46 2D BC 4E 36 8D C5 CC F9 90 28
##$RELAX= 
##$RELAX= 
##$RELAX= 
##$RELAX= 
##$RELAX= 
##$RELAX= 
##$RELAX= 
##$RELAX= 
$$ Bruker specific parameters
$$ [...]
##$TP07= 0
##$TPNAME0= <>
##$TPNAME1= <>
##$TPNAME2= <>
##$TPNAME3= <>
##$TPNAME4= <>
##$TPNAME5= <>
##$TPNAME6= <>
##$TPNAME7= <>
##$TPOAL= (0..7)
0.5 0.5 0.5 0.5 0.5 0.5 0.5 0.5
##$TPOFFS= (0..7)
0 0 0 0 0 0 0 0
##$TUNHIN= 0
##$TUNHOUT= 0
##$TUNXOUT= 0
##$USERA1= <user>
##$USERA2= <user>
##$USERA3= <user>
##$USERA4= <user>
##$USERA5= <user>
##$V9= 5
##$VALIST= <valist>
##$VCLIST= <CCCCCCCCCCCCCCC>
##$VD= 0
##$VDLIST= <DDDDDDDDDDDDDDD>
##$VPLIST= <PPPPPPPPPPPPPPP>
##$VTLIST= <TTTTTTTTTTTTTTT>
##$WBST= 2048
##$WBSW= 25
##$XGAIN= (0..3)
0 0 0 0
##$XL= 0
##$YL= 0
##$YMAX_a= 11045246
##$YMIN_a= -8417049
##$ZGOPTNS= <>
##$ZL1= 120
##$ZL2= 120
##$ZL3= 120
##$ZL4= 120
##$ABSF1= 14.96082
##$ABSF2= -5.597362
##$ABSG= 5
##$ABSL= 3
##$ALPHA= 0
##$AQORDER= 0
##$ASSFAC= 0
##$ASSFACI= 0
##$ASSFACX= 0
##$ASSWID= 0
##$AUNMP= <proc_prof1d_extract.lims>
##$AXLEFT= 0
##$AXNAME= <>
##$AXNUC= <1H>
##$AXRIGHT= 0
##$AXTYPE= 0
##$AXUNIT= <>
##$AZFE= 0.1
##$AZFW= 0.1
##$BCFW= 0
##$BC_mod= 0
##$BYTORDP= 0
##$COROFFS= 0
##$CY= 15
##$DATMOD= 1
##$DC= 0
##$DFILT= <>
##$DTYPP= 0
##$F1P= 0
##$F2P= 0
##$FCOR= 0.5
##$FTSIZE= 131072
##$FT_mod= 6
##$GAMMA= 0
##$GB= 0
##$INTBC= 1
##$INTSCL= 1
##$ISEN= 128
##$LB= 0.3
##$LEV0= 0
##$LPBIN= 0
##$MAXI= 10000
##$MC2= 0
##$MEAN= 0
##$ME_mod= 0
##$MI= 0
##$NCOEF= 0
##$NC_proc= -2
##$NLEV= 6
##$NOISF1= 0
##$NOISF2= 0
##$NSP= 0
##$NTH_PI= 0
##$NZP= 0
##$OFFSET= 14.96082
##$PC= 1
##$PHC0= -1.340332
##$PHC1= 0
##$PH_mod= 1
##$PKNL= yes
##$PPARMOD= 0
##$PPDIAG= 0
##$PPIPTYP= 0
##$PPMPNUM= 2147483647
##$PPRESOL= 1
##$PSCAL= 4
##$PSIGN= 0
##$PYNMP= <proc.py>
##$REVERSE= no
##$SF= 400.020009709769
##$SI= 131072
##$SIGF1= 0
##$SIGF2= 0
##$SINO= 400
##$SIOLD= 131072
##$SPECTYP= <>
##$SREGLST= <1H.CDCl3>
##$SSB= 0
##$STSI= 131072
##$STSR= 0
##$SW_p= 8223.68421052631
##$SYMM= 0
##$S_DEV= 0
##$TDeff= 65536
##$TDoff= 0
##$TI= <>
##$TILT= no
##$TM1= 0
##$TM2= 0
##$TOPLEV= 0
##$USERP1= <user>
##$USERP2= <user>
##$USERP3= <user>
##$USERP4= <user>
##$USERP5= <user>
##$WDW= 1
##$XDIM= 131072
##$YMAX_p= 410413911
##$YMIN_p= -15154
##$CURPLOT= <Network HP LaserJet P1505>
##$CURPRIN= <$Network HP LaserJet P1505>
##$DFORMAT= <normdp>
##$LAYOUT= <+/1D_H.xwp>
##$LFORMAT= <normlp>
##$PFORMAT= <normpl>
##$SURQMSG= 1
$$ End of Bruker specific parameters
$$ ---------------------------------
##NTUPLES= NMR SPECTRUM
##VAR_NAME=  FREQUENCY,     SPECTRUM/REAL,   SPECTRUM/IMAG
##SYMBOL=    X,             R,               I
##VAR_TYPE=  INDEPENDENT,   DEPENDENT,       DEPENDENT
##VAR_FORM=  AFFN,          ASDF,            ASDF
##VAR_DIM=   131072,        131072,          131072
##UNITS=     HZ,            ARBITRARY UNITS, ARBITRARY UNITS
##FACTOR=    0.0627417313425164, 1,          1
##FIRST=     8223.62146879497, 75,           -52732
##LAST=      0,             1177,            -53022
##MIN=       0,             -15154,          0
##MAX=       8223.62146879497, 410413911,    0
$$ Real data points
##PAGE= N=1
##DATA TABLE= (X++(R..R)), XYDATA
$$ [...]
63889E80700k5058k2228j9435j7416j6117j4559j2418j0602r783r278q019n987
$$ 580700 555642 533414 513979 496563 480446 465887 453469 442867 433084 423806 415787 409800
63877D09800m021k678j976j840k099k172j462r0J299K450L805N784Q176J0359
$$ 409800 405779 403101 401125 399285 397186 395014 393552 393462 394761 397211 401016 406800 414976 425335
63863D25335J1848J2647J3310J4642J6971J9747K2188K4236K6431K8832L0718
$$ 425335 437183 449830 463140 477782 494753 514500 536688 560924 587355 616187 646905
63852F46905L1608L2006L2697L3677L4302L4264L3742L2705L0698K7544K3799
$$ 646905 678513 710519 743216 776893 811195 845459 879201 911906 942604 970148 993947
63841I93947K0183J6859J3517R890N827J110m296r775j4344j7687k0616k4092
$$ 993947 1014130 1030989 1044506 1054396 1060223 1061333 1057037 1047262 1032918 1015231 994615 970523
63829I70523k7985l1184l2983l3879l4753l5676l6036l5608l4931l4461l3816
$$ 970523 942538 911354 878371 844492 809739 774063 738027 702419 667488 633027 599211
63818E99211l2203k9373k5896k2663k0324j8969j8068j6863j5124j3392j2210
$$ 599211 567008 537635 511739 489076 468752 449783 431715 414852 399728 386336 374126
63807C74126j1327j0008q074o074m539l547l095l344m154m878n041m915n099n689
$$ 374126 362799 352791 344717 338643 334104 330557 327462 324118 319964 315086 310045 305130 300031 294342
63793B94342o220o262n759m946m180l749l593l409l146l150l505l685l211k337
$$ 294342 288122 281860 276101 271155 266975 263226 259633 256224 253078 249928 246423 242738 239527 237190
63779B37190j619j126o70m94r36j570j585j040q88j546k280k355k026j851j733
$$ 237190 235571 234445 233775 233281 232345 230775 229190 228150 227262 225716 223436 221081 219055 217204 215471
63764B15471j260n08J13M44M49m9r12j413j057l82j85l08j6O17P28J26l49j33
$$ 215471 214211 213703 213816 214260 214709 214660 213748 212335 211278 210896 210711 210403 210387 211004 211732 211858 211509 211376
63746B11376L11M70O87J340J888J508M21k33K10J298K161K373K060J546J120R17
$$ 211376 211687 212157 212844 214184 216072 217580 218001 217768 217978 219276 221437 223810 225870 227416 228536 229453
63730B29453R35J245K028L228M289M608M227L850M158N280O855Q275Q953Q726
$$ 229453 230388 231633 233661 236889 241178 245786 250013 253863 258021 263301 270156 278431 287384 296110
63716B96110Q134P900Q074P930O891N226L547J923q0k575m918o280o450o021n789
$$ 296110 304244 312144 320218 328148 335039 340265 343812 345735 345655 343080 338162 331882 325432 319411 313622
63701C13622n996o128n566m417l456l149l045k437j271m7J007J988K675K571J809
$$ 313622 307626 301498 295932 291515 288059 284910 281865 279428 278157 278110 279117 281105 283780 286351 288160
63686B88160J300J626K280K497K352K386K551K279J436N28o2l82m18M6R59J923
$$ 288160 289460 291086 293366 295863 298215 300601 303152 305431 306867 307395 307333 306951 306533 306579 307538 309461
63670C09461K826L937N176N815N374M424M037M630N657O209N719M300K643J425
$$ 309461 312287 316224 321400 327215 332589 337013 341050 345680 351337 357546 363265 367565 370208 371633
63656C71633N84n51k305m226n741o804p579p958p847p499p092o358n145l962l299
$$ 371633 372217 371666 369361 365135 359394 352590 345011 337053 329206 321707 314615 308257 303112 299150 295851
63641B95851k746j578l3Q68Q75R71J977L405M195M055L640L614M046M568M838
$$ 295851 293105 291527 291494 292362 293237 294208 296185 299590 303785 307840 311480 315094 319140 323708 328546
63626C28546M732M371L968L781M111N130O504P484P697P693Q271R439J0541J1371
$$ 328546 333278 337649 341617 345398 349509 354639 361143 368627 376324 384017 392288 401727 412268 423639
63612D23639J2534J4555J7208J9872K2191K4177K6043K8159L0783L3666L6147
$$ 423639 436173 450728 467936 487808 509999 534176 560219 588378 619161 652827 688974
63601F88974L7684L7931L6427L2854K7705K2009J6172R867L357j918m784n733
$$ 688974 726658 764589 801016 833870 861575 883584 899756 909623 912980 911062 906278 900545
63589I00545o146o664p106p632q918j1191j3940j6680j9335k1720k3305k3758
$$ 900545 894399 887735 880629 872997 864079 852888 838948 822268 802933 781213 757908 734150
63577G34150k3309k2330k0925j9076j6869j4399j1746r121o810m852l072j384
$$ 734150 710841 688511 667586 648510 631641 617242 605496 596375 589565 584713 581641 580257
63565E80257K10J845L629N222O043O007N656N440N302N169N348O103P182Q180
$$ 580257 580467 582312 585941 591163 597206 603213 608869 614309 619611 624780 630128 636231 643413 651593
63551F51593R152J0522J2500J4890J7403J9997K2968K6770L1661L7326M3079M8277
$$ 651593 660745 671267 683767 698657 716060 736057 759025 785795 817456 854782 897861 946138
63539I46138N2168N3221M9409L9904K6404J2242J92q582j3883j5829j5084j3038
$$ 946138 998306 1051527 1100936 1140840 1167244 1179486 1179678 1171096 1157213 1141384 1126300 1113262
63527A113262j1062r710q931q874j0067j2861j6960k1542k5817k9395l2278l4462
$$ 1113262 1102200 1092490 1083559 1074685 1064618 1051757 1034797 1013255 987438 958043 925765 891303
63515H91303l5635l5408l3847l1590k9323k7278k5242k2930k0231j7356j4804
$$ 891303 855668 820260 786413 754823 725500 698222 672980 650050 629819 612463 597659
63504E97659j3015j1852j0719r320q095p595p692p719p281o510n713n132m966
$$ 597659 584644 572792 562073 552753 544658 537063 529371 521652 514371 507861 502148 497016 492050
63491D92050n211n436n118m259l368k928l072l629m042l467j678K55R71N70N11
$$ 492050 486839 481403 476285 472026 468658 465730 462658 459029 454987 451520 449842 450097 451068 451638 452149
63476D52149J599L110M246N280O493P098O357M993M198L704K260k36k537l958
$$ 452149 453748 456858 461104 466384 472877 479975 486332 491325 495523 499227 501487 501251 498714 494756
63462D94756n102o446p485p765p570p124o092m502l213k825k934l046l336l838
$$ 494756 489654 483208 475723 467958 460388 453264 447172 442670 439457 436632 433698 430652 427316 423478
63448D23478l785k683j277m98o7Q73K278L378L909M206M468M904O219Q826J1896
$$ 423478 419693 417010 415733 415235 415168 416041 418319 421697 425606 429812 434280 439184 445403 454229 466125
63433D66125J4445J7067K1309K7331L3583L8841M2873M4754M2359L4790K4282
$$ 466125 480570 497637 518946 546277 579860 618701 661574 706328 748687 783477 807759
63422H07759J4386O895J557j893k855r52L146Q317J3817J9403K5085L0766L5830
$$ 807759 822145 829040 830597 828704 825849 824897 828043 836360 850177 869580 894665 925431 961261
63409I61261L9151L9819L7773L3450K7231J9619J1591M130k416p909j1650j2944
$$ 961261 1000412 1040231 1078004 1111454 1138685 1158304 1169895 1174025 1171609 1163700 1152050 1139106
63397A139106j2414j1841j2460j4203j6746k0308k4705k8593l0747l1647l2668
$$ 1139106 1126692 1114851 1102391 1088188 1071442 1051134 1026429 997836 967089 935442 902774
63386I02774l3825l3604l1268k8112k5756k4064k1734j8396j5052j2565j0741
$$ 902774 868949 835345 804077 775965 750209 726145 704411 686015 670963 658398 647657
63375F47657q984p001m657j963N08J898K272K850M536O801Q638R997J1454J2979
$$ 647657 638673 631672 627015 625052 625560 627458 629730 632580 637116 643917 652555 662552 674006 686985
63361F86985J4062J4856J6220J8567K1436K4295K6946K9184L0924L2847L5913
$$ 686985 701047 715903 732123 750690 772126 796421 823367 852551 883475 916322 952235
63350I52235L9816M2696M2885M0350L6004L0389K3695J6405R125K094m421r545
$$ 952235 992051 1034747 1077632 1117982 1153986 1184375 1208070 1224475 1233600 1235694 1231273 1221728
63338A221728j2354j2978j2590j2385j2981j4553j6946j9687k2394k5207k8503
$$ 1221728 1209374 1196396 1183806 1171421 1158440 1143887 1126941 1107254 1084860 1059653 1031150
63327A031150l2232l5743l8099l8411l6231l2110k7469k3385j9709j5711j1177
$$ 1031150 998918 963175 925076 886665 850434 818324 790855 767470 747761 732050 720873
63316G20873o284r94M378Q100P778K605n695j4338k1238k5403k6603k5396k2959
$$ 720873 714589 713595 717973 726073 733851 736456 730761 716423 695185 669782 643179 617783 594824
63303E94824k0267j7676j5383j3739j2788j1992j0951r923r260q785q206p701
$$ 594824 574557 556881 541498 527759 514971 502979 492028 482105 472845 464060 455854 448153
63291D48153p539p457p044o477o280o496o688o651o497o155n380m373l732l601
$$ 448153 440614 433157 426113 419636 413356 406860 400172 393521 387024 380869 375489 371116 367384 363783
63277C63783l435k833k151j950k162k175j644q93n56r02j538j780j387q70q98
$$ 363783 360348 357515 355364 353414 351252 349077 347433 346540 345984 345082 343544 341764 340377 339507 338609
63262C38609j519k203k583k723k694k359j771j330j262j163n22N23J293J335Q15
$$ 338609 337090 334887 332304 329581 326887 324528 322757 321427 320165 319002 318480 319003 320296 321631 322446
63247C22446J26n35j139j568j563r93j66K58r8p73q82k00M81L81k80p76r76j312
$$ 322446 322572 322037 320898 319330 317767 316774 316608 316866 316768 315995 315113 314913 315394 315775 315495 314719 313743 312431
63229C12431j712j463l27Q58J170O93J50j06j62N8O46J178J068N31L60O61N82
$$ 312431 310719 309256 308929 309787 310957 311650 311800 311694 311532 311590 312236 313414 314482 315013 315373 316034 316616
63212C16616k60q49r7J512K428K057J389J583K688L946M700M689L982L060K565
$$ 316616 316356 315507 315410 316922 319350 321407 322796 324379 327067 331013 335713 340402 344384 347444 350009
63197C50009K600K627K357K345L229M759O067O705O882O922P089P800R314J1100
$$ 350009 352609 355236 357593 359938 363167 367926 373993 380698 387580 394502 401591 409391 418705 429805
63183D29805J2197J2412J2614J3588J5103J6351J6899J6817J6279J5474J4704
$$ 429805 442002 454414 467028 480616 495719 512070 528969 545786 562065 577539 592243
63172E92243J4147J3655J3049J2371J1713J0993J0164R331Q372O826M464J694
$$ 592243 606390 620045 633094 645465 657178 668171 678335 687666 696038 702864 707328 709022
63160G09022j034l759o532q856j0359j1686j3872j6836j9350k0523k0532j9804
$$ 709022 707988 704229 697697 688841 678482 666796 652924 636088 616738 596215 575683 555879
63148E55879j8447j6788j5548j4957j4357j3242j2023j1167j0221q473o172m242
$$ 555879 537432 520644 505096 490139 475782 462540 450517 439350 429129 420656 414484 410242
63136D10242l113k606k607l017l171k360r83k39m34m61N93K124K854K479J845
$$ 410242 407129 404523 401916 398899 395728 393368 392385 392146 391712 391251 391844 393968 396822 399301 401146
63121D01146J767K302L080L832M507N105N505N460M880M212M239N233O559P306
$$ 401146 402913 405215 408295 412127 416634 421739 427244 432704 437584 441796 446035 451268 457827 465133
63107D65133P259O963O923P051O928O413N892N908O560P323P633P639Q058R244
$$ 465133 472392 479355 486278 493329 500257 506670 512562 518470 525030 532353 539986 547625 555683 564927
63093E64927J0666J1575J1943J2350J3051J3558J3283J2266J1000R671P880N191
$$ 564927 575593 587168 599111 611461 624512 638070 651353 663619 674619 684290 692170 697361
63081F97361J768j767n030q079j0846j2734j3216j2652j2091j2207j2838j3506
$$ 697361 699129 697362 692332 684253 673407 660673 647457 634805 622714 610507 597669 584163
63069E84163j3939j3941j3308j2192j1100j0207r071p477o143n861o239n980m507
$$ 584163 570224 556283 542975 530783 519683 509476 500405 492928 486785 480924 474685 468705 464198
63056D64198k582j205n07JO44J475K525L663M430M524M328M570N432O375O890
$$ 464198 461616 460411 459904 459905 460549 462024 464549 468212 472642 477166 481494 486064 491496 497871 504761
63041E04761P006O948O669O039N328N101N529O111O283O099O073O357O449N816
$$ 504761 511767 518715 525384 531423 536751 541852 547381 553492 559775 565874 571947 578304 584753 590569
63027E90569M585L340K397J562O01l91j155j556j584j268q47p73j288k061k464
$$ 590569 595154 598494 600891 602453 603054 602663 601508 599952 598368 597100 596253 595480 594192 592131 589667
63012E89667k163j285j15J086K067K778L653N327P866J0615J2981J5065J7276
$$ 589667 587504 586219 586104 587190 589257 592035 595688 601015 608881 619496 632477 647542 664818
62999F64818J9575K1563K3072K4189K4775K4524K3621K2768K2338K1945K1134
$$ 664818 684393 705956 729028 753217 777992 802516 826137 848905 871243 893188 914322
62988I14322K0164J9680J9896K0429K0774K0504J9289J7091J4344J1507Q448M616
$$ 914322 934486 954166 974062 994491 1015265 1035769 1055058 1072149 1086493 1098000 1106448 1111064
62976A111064k66n916j1839j7573k2653k6773l0045l2724l4653l5393l4917l3763
$$ 1111064 1110798 1104882 1093043 1075470 1052817 1026044 995999 963275 928622 893229 858312 824549
62964H24549l2366l0720k8803k6883k5138k3365k1332j9144j7044j5175j3693
$$ 824549 792183 761463 732660 705777 680639 657274 635942 616798 599754 584579 570886
62953E70886j2758j2179j1523j0783j0456j0620j0500r541q409q206q984r766
$$ 570886 558128 545949 534426 523643 513187 502567 492067 482526 474117 465911 456927 447161
62941D47161r936r785r633r230q287p085o121n561n268n071m786m266l647l249
$$ 447161 437225 427440 417807 408577 400290 393205 387084 381523 376255 371184 366398 362132 358485 355236
62927C55236l072k681j854j044q67j333j858j917j471q09k94j85m73q56r80p47
$$ 355236 352164 349483 347629 346585 345718 344385 342527 340610 339139 338330 338036 337851 337378 336522 335542 334795
62911C34795k69L35R54J375J436J378J735K669L518L344K012N10L7R16K498L976
$$ 334795 334526 334861 335815 337190 338626 340004 341739 344408 347926 351270 353282 353792 353829 354745 357243 361219
62895C61219N088O085P350Q973J0497J1124J0538R478R043R368R416Q346O535
$$ 361219 366307 372392 379742 388715 399212 410336 420874 430352 439395 448763 458179 466525 473060
62882D73060M878L563K093K43j614l072m094m812n319n716o124o602p214p936
$$ 473060 477938 481501 483594 483837 482223 479151 475057 470245 464926 459210 453086 446484 439270 431334
62868D31334q402q099p184o648p094p780p568o546n800n725n549m695l674l189
$$ 431334 422932 414833 407649 401001 393907 386127 378559 372013 366213 360488 354939 350244 346570 343381
62854C43381l189l236l192l059k683k083j645j547j431j029o19m67k97J57N48
$$ 343381 340192 336956 333764 330705 328022 325939 324294 322747 321316 320287 319668 319201 318904 319061 319609
62839C19609M71K06K69N13L94o1k21K57J104J959K656L011K817K186J446P38O
$$ 319609 320080 320286 320555 321068 321462 321401 321180 321437 322541 324500 327156 330167 332984 335170 336616 337354 337360
62822C37360n54m84M02J717K705K627J211q61k200j996r88o27j299k010j866j151
$$ 337360 336806 336322 336724 338441 341146 343773 344984 344123 341923 339927 338939 338312 337013 335003 333137 331986
62806C31986o48n34m21j96k30p91j595k030j776j086m74q5M15J156J574J071k8
$$ 331986 331338 330804 330383 330187 329957 329166 327571 325541 323765 322679 322205 322120 322535 323691 325265 326336 326308
62789C26308p22o19l78o61j224j460j322j179r46j32J207K218K252J826K128L605
$$ 326308 325586 324967 324589 323928 322704 321244 319922 318743 317797 317665 318872 321090 323342 325168 327296 330901
62773C30901N476O651O829O427N769M840L770K964K526J960Q28n64j510j772j685
$$ 330901 336377 343028 349857 356284 362053 366893 370663 373627 376153 378113 378941 378377 376867 375095 373410
62758C73410j595j589j684j911k149k240k265k378k485k406k259k271k287j999
$$ 373410 371815 370226 368542 366631 364482 362242 359977 357599 355114 352708 350449 348178 345891 343892
62744C43892j621j806k675l520l676l220k622k136j838j826j941j674p54L62R59
$$ 343892 342271 340465 337790 334270 330594 327374 324752 322616 320778 318952 317011 315337 314583 314945 315904
62729C15904Q41L68n0k11o5K64N24O57R29J511K193K687L026L374L689L917M270
$$ 315904 316745 317113 317063 316852 316787 317051 317575 318232 319161 320672 322865 325552 328578 331952 335641 339558 343828
62712C43828M988N977P054Q296R749J0999J1540J1584J1940J3106J4816J6578
$$ 343828 348816 354793 361847 370143 379892 390891 402431 414015 425955 439061 453877 470455
62700D70455J8224J9868K1659K3763K6255K8903L1314L3391L5473L7795M0071
$$ 470455 488679 508547 530206 553969 580224 609127 640441 673832 709305 747100 787171
62689G87171M1735M2486M2412M1674M0167L7529L3488K8155K1897J4890P061j377
$$ 787171 828906 871392 913804 955478 995645 1033174 1066662 1094817 1116714 1131604 1138665 1137288
62677A137288r672j7144k3864l0188l5785l9741m1765m2597m2924m2483m0794
$$ 1137288 1127616 1110472 1086608 1056420 1020635 980894 939129 896532 853608 811125 770331
62666G70331l8307l6076l4417l2641l0206k7449k4890k2430j9790j7374j5954
$$ 770331 732024 695948 661531 628890 598684 571235 546345 523915 504125 486751 470797
62655D70797j5509j5019j3611j1492r455p877o577n478m816m689m792m782m631
$$ 470797 455288 440269 426658 415166 405711 397834 391257 385779 380963 376274 371482 366700 362069
62642C62069m495m441m364m066l388k356j268l72M03J187J703J536Q48L48M02
$$ 362069 357574 353133 348769 344703 341315 338959 337691 337319 337722 338909 340612 342148 342996 343344 343746
62627C43746O21N40J86l10j022j743j787r84l92j101k579l141k160q25m49q67
$$ 343746 344367 344907 345093 344783 343761 342018 340231 339247 338855 337754 335175 332034 329874 329049 328600 327733
62611C27733j088q28o68r39j222j053o42n63r17j153p80n5L71L74M28P00O82M9
$$ 327733 326645 325817 325149 324210 322988 321935 321293 320730 319813 318660 317880 317825 318196 318570 318998 319698 320380 320429
62593C20429o59q52p86r43r26lJ423K122J830J564J876J965J126Lm63m33n53o78
$$ 320429 319770 318918 318132 317189 316263 316260 317683 319805 321635 323199 325075 327040 328166 328169 327706 327273 326720 326042
62575C26042k68M09N69J89q1j33n32j372j981j995j915k273k845l016k537j647
$$ 326042 325774 326183 326752 326941 326860 326727 326195 324823 322842 320847 318932 316659 313814 310798 308261 306614
62559C06614q14m14l73j29O71J498J508P48J50J89K48l69j358j837j472p11j29
$$ 306614 305800 305386 305013 304884 305555 307053 308561 309309 309459 309648 309896 309527 308169 306332 304860 304149 304020
62542C04020J13K23M60Q97J360J626J655J579J578J908K797M015M802M615L865
$$ 304020 304133 304356 304816 305713 307073 308699 310354 311933 313511 315419 318216 322231 327033 331648 335513
62527C35513L359L239L085K872L041L572L955M296N442P533R345R834R674J0370
$$ 335513 338872 342111 345196 348068 351109 354681 358636 362932 368374 375907 385252 395086 404760 415130
62513D15130J2315J4652J6684J8499K0254K1793K3118K4556K6118K7178K7066
$$ 415130 427445 442097 458781 477280 497534 519327 542445 567001 593119 620297 647363
62502F47363K5756K3798K1761J9809J7613J4663J0789O329J781k499o100q485
$$ 647363 673119 696917 718678 738487 756100 770763 781552 787881 789662 787163 781063 772578
62490G72578r491r643r498q895p310m783j899J097M549Q599J2626J5792J7947
$$ 772578 763087 753444 743946 735051 727741 722958 721059 722156 726705 735304 747930 763722 781669
62477G81669J9769K2059K4887K7294K7905K6003K2013J6916J1488O182J259l466
$$ 781669 801438 823497 848384 875678 903583 929586 951599 968515 980003 986185 987444 983978
62465I83978q697j4854k1364k7207l1916l5561l8040l9132l9138l8690l7899l6386
$$ 983978 975281 960427 939063 911856 879940 844379 806339 767207 728069 689379 651480 615094
62453F15094l4148l1584k8702k5187k1380j8215j5849j3439j0670q518p732p548
$$ 615094 580946 549362 520660 495473 474093 455878 440029 426590 415920 407402 399670 392122
62441C92122o818n698n082m960m524l688l211l304l230k569j914j897k266k399
$$ 392122 385304 379606 374524 369564 365040 361352 358141 354837 351607 349038 347124 345227 342961 340562
62427C40562k163j784j290n94P8L42J38j72k07O7L09J45l41m80L03J692K574K151
$$ 340562 338399 336615 335325 334731 334809 335151 335289 335117 334910 334977 335286 335431 335090 334610 334913 336605 339179 341330
62409C41330P44o14j196j072p13l83L9O89J279J298P00J69L82J139J609J429J168
$$ 341330 342074 341460 340264 339192 338479 338096 338135 338824 340103 341401 342101 342270 342652 343791 345400 346829 347997
62392C47997J561K552L435L721L646L785M337M958N274N386N679O250O824P312
$$ 347997 349558 352110 355545 359266 362912 366697 371034 375992 381266 386652 392331 398581 405405 412717
62378D12717P988Q901R532R476R151R324J0082J0882J1505J2293J3439J4609J5507
$$ 412717 420705 429606 439138 448614 457765 467089 477171 488053 499558 511851 525290 539899 555406
62365E55406J6264J7029J7714J8454J9812K2202K5401K9015L3062L7720M2815
$$ 555406 571670 588699 606413 624867 644679 666881 692282 721297 754359 792079 834894
62354H34894M7978N3073N8079O2704O6484O9103P0240O9234O5380N8555M9368
$$ 834894 882872 935945 994024 1056728 1123212 1192315 1262555 1331789 1397169 1455724 1505092
62343A505092L8678K7314J6066N606l716j1907j9257k6268l3356m0217m5754m9072
$$ 1505092 1543770 1571084 1587150 1592756 1589040 1577133 1557876 1531608 1498252 1458035 1412281 1363209
62331A363209n0459n0871n0690m9520m7221m4377m1472l8264l4508l0871k8482
$$ 1363209 1312750 1261879 1211189 1161669 1114448 1070071 1028599 990335 955827 924956 896474
62320H96474k7650k7537k7116k6146k5097k4438k4152k3816k3014k1662j9998
$$ 896474 868824 841287 814171 788025 762928 738490 714338 690522 667508 645846 625848
62309F25848j8310j6747j5335j4041j2750j1356r960q821q039p347o448n391m415
$$ 625848 607538 590791 575456 561415 548665 537309 527349 518528 510489 503142 496694 491303 486888
62296D86888l567k675j683p34O2P39J284J632J839K124K536K917L296L948M863
$$ 486888 483321 480646 478963 478229 478291 479030 480314 481946 483785 485909 488445 491362 494658 498606 503469
62281E03469N447N215M593M408M671M554L693K845K744K997K783K315K679M241
$$ 503469 508916 514131 518724 523132 527803 532357 536050 538895 541639 544636 547419 549734 552413 556654
62267E56654O104P393Q415J0059J2582J5432J8008K0203K2421K5418K9775L5212
$$ 556654 562758 570151 578566 588625 601207 616639 634647 654850 677271 702689 732464 767676
62255G67676M0688M5584N0440N5991O1808O6635O9833P1559P1528O8623O2268
$$ 767676 808364 853948 904388 960379 1022187 1088822 1158655 1230214 1301742 1370365 1432633
62244A432633N3301M2919L1433J8842O067n484j5387k4376l2952m0756m7426n3141
$$ 1432633 1485934 1528853 1560286 1579128 1585195 1579711 1564324 1539948 1506996 1466240 1418814 1365673
62232A365673n7912o1050o2013o1268n9679n7432n4228n0214m5964m1661l7091
$$ 1365673 1307761 1246711 1184698 1123430 1063751 1006319 952091 901877 855913 814252 777161
62221G77161l2417k8261k4897k2022j9483j7520j6081j4644j3074j1908j1311
$$ 777161 744744 716483 691586 669564 650081 632561 616480 601836 588762 576854 565543
62210E65543j0495q886p171o311o068n544m750m407m402l783k450j485j357j012
$$ 565543 555048 546162 538991 532680 526612 521068 516318 511911 507509 503726 501276 499791 498434 497422
62196D97422N10K571L910M313M453M742N284O403Q197J0016J1253J2262J3539
$$ 497422 497932 500503 504413 508726 513179 517921 523205 529608 537805 547821 559074 571336 584875
62183E84875J4496J4282J3417J3232J3779J3751J2669J1580J1105J0224P995N319
$$ 584875 599371 613653 627070 640302 654081 667832 680501 692081 703186 713410 721405 726724
62171G26724L909M216N426O978R032J1781J5311J9939K5834L2339L8389M3537
$$ 726724 730633 734849 740275 747253 756285 768066 783377 803316 829150 861489 899878 943415
62159I43415M7944N1477N3502N3496N1222M6375L8874K9533J9821J0760K544m811
$$ 943415 991359 1042836 1096338 1149834 1201056 1247431 1286305 1315838 1335659 1346419 1348963 1344152
62147A344152j1264j7279k3685l0577l6954m1896m5463m7898m8653m7123m4067
$$ 1344152 1332888 1315609 1291924 1261347 1224393 1182497 1137034 1089136 1040483 993360 949293
62136I49293m1197l9216l7129l3845k9736k5958k2804j9651j6354j3653j1905
$$ 949293 908096 868880 831751 797906 768170 742212 719408 699757 683403 669750 657845
62125F57845j0348q255o185n153m969m416l003j429k09J161L126N206O879Q591
$$ 657845 647497 639242 633057 627904 622935 618519 615516 614087 613878 615039 618165 623371 630250 638841
62111F38841J1057J4160J7347K0551K3751K5971K5883K3243J8974J4065R336N990
$$ 638841 649898 664058 681405 701956 725707 751678 777561 800804 819778 833843 843179 849169
62099H49169N030O003P448Q635R672R783P191J547m878r466j1778j2768j2559
$$ 849169 854199 860202 867650 876285 885957 895740 902931 904478 899600 890134 878356 865588 853029
62086H53029j0520p018l453n56K166N136P961J0312J2574J5233J8189K1050K3574
$$ 853029 842509 835491 832038 831482 833648 838784 846745 857057 869631 884864 903053 924103 947677
62073I47677K5660K7251K8518K9656L0446L0454K9759K8967K8357K7600K6616
$$ 947677 973337 1000588 1029106 1058762 1089208 1119662 1149421 1178388 1206745 1234345 1260961
62062A260961K6130K6917K8862L1134L3024L4134L4054L2355K9003K4349J8789
$$ 1260961 1287091 1314008 1342870 1374004 1407028 1441162 1475216 1507571 1536574 1560923 1579712
62051A579712J2615O250K23n243j0397j5588k0863k6088l1278l6533m1595m5810
$$ 1579712 1592327 1598577 1598800 1593557 1583160 1567572 1546709 1520621 1489343 1452810 1411215 1365405
62039A365405m8702n0408n1314n1431n0488m8546m6068m3294l9985l6057l2043
$$ 1365405 1316703 1266295 1214981 1163550 1113062 1064516 1018448 975154 935169 899112 867069
62028H67069k8589k5729k3020k0213j7427j4845j2577j0802r675r144r035r203
$$ 867069 838480 812751 789731 769518 752091 737246 724669 713867 704192 695048 686013 676810
62016F76810r440r524r568j0055j1095j1958j1771j0522q896p325n794m400l382
$$ 676810 667370 657846 648278 638223 627128 615170 603399 592877 583981 576656 570862 566462 563080
62003E63080k535j302L98K057L473N090P107Q813R365Q845Q001P156N856L680
$$ 563080 560545 559243 559641 561698 565171 570261 577368 586181 595546 604391 612392 619548 625404 629084
61989F29084J031j097k106k467l315n235p653r569j0662j1331j1821j1953j1664
$$ 629084 630115 629018 626912 624445 621130 615895 608242 598673 588011 576680 564859 552906 541242
61976E41242j1258j0898j0338r407q364p523o851o146n359m591l957l552l295
$$ 541242 529984 519086 508748 499341 490977 483454 476603 470457 465098 460507 456550 452998 449703
61963D49703k850k039j240r19q65n36j7J10j7N63K188L912M787N050N414O009
$$ 449703 446853 444814 443574 442655 441790 441254 441237 441347 441330 441893 444081 447993 452780 457830 463244 469253
61947D69253O671P593Q827R791J0206J1025J3370J6838J9958K2129K4069K6423
$$ 469253 475924 483517 492344 502135 512341 523366 536736 553574 573532 595661 619730 646153
61935F46153K8997L1487L3887L5858L6591L5799L4270L3001L2203L1376K9891
$$ 646153 675150 706637 740524 776382 812973 848772 883042 916043 948246 979622 1009513
61924A009513K7367K3853J9866J5824J1433O181M53m581q367j1491j4451j6612
$$ 1009513 1036880 1060733 1080599 1096423 1107856 1114037 1114490 1109909 1101542 1090051 1075600 1058988
61912A058988j6934j5230j2128q200l665J286O463J1843J7344K2446K6402K8770
$$ 1058988 1042054 1026824 1014696 1006496 1002831 1004117 1010580 1022423 1039767 1062213 1088615 1117385
61900A117385K9472K8474K5762K1484J5894R128J382o743j4247k0271k4632k7821
$$ 1117385 1146857 1175331 1201093 1222577 1238471 1247599 1248981 1242238 1227991 1207720 1183088 1155267
61888A155267l0480l2768l4253l4476l3513l1851k9860k7708k5666k4101k3094
$$ 1155267 1124787 1092019 1057766 1023290 989777 957926 928066 900358 874692 850591 827497
61877H27497k2392k1817k1395k1010k0378j9424j8342j7132j5455j3223j0926
$$ 827497 805105 783288 761893 740883 720505 701081 682739 665607 650152 636929 626003
61866F26003r053p476n665l376q59J391L007M084N320P493J0630J3994J7095K0327
$$ 626003 616950 609474 603809 600433 599574 600965 603972 608056 613376 620869 631499 645493 662588 682915
61852F82915K4259K8708L3045L7163M1605M6683N1913N6376N9417O0932O1197
$$ 682915 707174 735882 768927 806090 847695 894378 946291 1002667 1062084 1123016 1184213
61841A184213O0455N8595N5194M9957M2909L4188K3925J2615J350q618j6515k2121
$$ 1184213 1244668 1303263 1358457 1408414 1451323 1485511 1509436 1522051 1523401 1514783 1498268 1476147
61829A476147k5395k6321k4971k1464j5920q676m41P918J5697K2356K7400L0452
$$ 1476147 1450752 1424431 1399460 1377996 1362076 1353400 1352959 1360877 1376574 1398930 1426330 1456782
61817A456782L1274K9525K4788J7058P072m125j5668k6798l6626m4494n0445n4862
$$ 1456782 1488056 1517581 1542369 1559427 1566499 1562374 1546706 1519908 1483282 1438788 1388343 1333481
61805A333481n7756n8848n8256n6629n4495n1890m8686m4968m0939l6763l2627
$$ 1333481 1275725 1216877 1158621 1101992 1047497 995607 946921 901953 861014 824251 791624
61794G91624k8784k5415k2604k0373j8558j6721j4596j2549j1223j0661j0136
$$ 791624 762840 737425 714821 694448 675890 659169 644573 632024 620801 610140 600004
61783F00004r029p528o177n123m122l131k461k308k406k313j955j731k033k713
$$ 600004 590975 583447 577270 572147 568025 564894 562433 560125 557719 555406 553451 551720 549687 546974
61769E46974l139k776j661k34J122K273L135L515L225K316J175L56K02N06P30
$$ 546974 543835 541059 539398 539164 540286 542559 545694 549209 552434 554750 555925 556281 556483 556989 557719
61754E57719O32N43Q53J381J594J288Q04N08L98K81J38Q1P6j58q38j754k298k060
$$ 557719 558351 558894 559747 561128 562722 564010 564814 565322 565720 566001 566139 566220 566296 566138 565300 563546 561248 559188
61736E59188j356r52j197j721k046k099j966j548r01n12o92r14l53R84K316L132
$$ 559188 557832 556880 555683 553962 551916 549817 547851 546303 545402 544890 544198 543284 542931 543915 546231 549363
61720E49363L624L984M053L867L877M248M498M229L723L380K977K044O45o99j722
$$ 549363 552987 556971 561024 564891 568768 573016 577514 581743 585466 588846 591823 593867 594512 593813 592091
61705E92091k501l029l234l337l681m174m349m032l535l143k837k631k721l040
$$ 592091 589590 586561 583327 579990 576309 572135 567786 563754 560219 557076 554239 551608 548887 545847
61691E45847l044k297j094j93Kj94j22N99J740K566K443J468M52R3L23O06O47
$$ 545847 542803 540506 539412 539219 539221 539027 538905 539504 541244 543810 546253 547721 548173 548266 548589 549195 549842
61674E49842N12K14l19q27p53M7R22J143P30K69j2m59j289k103k414k403k727
$$ 549842 550354 550568 550249 549422 548669 548716 549638 550781 551511 551780 551768 551309 550020 547917 545503 543100 540373
61657E40373l568m232l909k693j504r41n63L69J660K326K045J790K466L501L540
$$ 540373 536805 532573 528664 525971 524467 523526 522963 523332 524992 527318 529363 531153 533619 537120 540660
61642E40660K400J466J954L538N011N653N414M373K772J271M49J6r09k633m493
$$ 540660 543060 544526 546480 550018 555029 560682 566096 570469 573241 574512 574961 574977 574068 571435 566942
61627E66942n688o094o074n859n391m649l882l442l416l437l051k263j528j020
$$ 566942 561254 555160 549086 543227 537836 533187 529305 525863 522447 519010 515959 513696 512168 511148
61613E11148l49O88J426J032k23j185j384j747l301n641p314p477o699o065n957
$$ 511148 510799 511487 512913 513945 513722 512537 511153 509406 506105 500464 493150 485673 478974 472909 466952
61598D66952n881n331m505m078m309m611m225l221k502k699l359l483k741j789
$$ 466952 461071 455740 451235 447157 442848 438237 434012 430791 428289 425590 422231 418748 416007 414218
61584D14218j408j667k089k388k674k971k977k586k299k644l300l368k641k038
$$ 414218 412810 411143 409054 406666 403992 401021 398044 395458 393159 390515 387215 383847 381206 379168
61570C79168k430l464m002l445k163q95k27m66j366k014j605m91Q4m98j495j748
$$ 379168 376738 373274 369272 365827 363664 362769 362542 362076 360710 358696 357091 356600 356684 356186 354691 352943
61554C52943r80J18P47N79r7n82k89O00J222J004L08j41j98k67m77m05K36J052
$$ 352943 351963 352081 352828 353407 353310 352728 352439 353039 354261 355265 355573 355432 355234 354967 354490 354085 354321 355373
61536C55373J377J121Q86J225J978K509K504K262K195K332K500K585K433J702
$$ 355373 356750 357871 358757 359982 361960 364469 366973 369235 371430 373762 376262 378847 381280 382982
61522C82982K96j251k241k625k899l237l236k640j846j441j573j977k351k506
$$ 382982 383278 382027 379786 377161 374262 371025 367789 365149 363303 361862 360289 358312 355961 353455
61508C53455k352j935j412r11n36m09m96n53m76n57r32j099n59K09K32n22j088
$$ 353455 351103 349168 347756 346845 346309 345900 345404 344851 344375 343818 342886 341787 341228 341437 341669 341147 340059
61491C40059j016r13j151j035k4J142J487J283J423J751J283m8r98o45N11J438
$$ 340059 339043 338130 336979 335944 335920 337062 338549 339832 341255 343006 344289 344241 343243 342598 343109 344547
61475C44547J785J832J748J487J064O03J84j63m30o73q82q67m86j8M3l73p87q36
$$ 344547 346332 348164 349912 351399 352463 353066 353250 353087 352657 351984 351102 350235 349749 349731 349774 349401 348614 347778
61457C47778p30q88j324j599j332n85K14O99Q63Q90Q26O15M88Q69J689K157J685
$$ 347778 347048 346160 344836 343237 341905 341320 341534 342233 343096 343986 344812 345427 345915 346784 348473 350630 352315
61440C52315P58L86Q44J487J805K050K634L445M045M238M148L924L630L334L163
$$ 352315 353073 353459 354303 355790 357595 359645 362279 365724 369769 374007 378155 382079 385709 389043 392206
61425C92206L215L440L542L199K507K045K205K654K791K673K897L625M287M409
$$ 392206 395421 398861 402403 405602 408109 410154 412359 415013 417804 420477 423374 426999 431286 435695
61411D35695M232M078L612K293L27j360k181k517l115m117m953n152m982n058
$$ 435695 439927 444005 447617 449910 450237 448877 446696 444179 441064 436947 431994 426842 421860 416802
61397D16802n430n409m502l211k584k977l644l601k643j426p40q14j190j210o99
$$ 416802 411372 405963 401461 398250 395666 392689 389045 385444 382801 381375 380635 379821 378631 377421 376722
61382C76722j36pj51n3L76O97O28L53J15l0J46J053K514L452K932J378J97K25
$$ 376722 376586 376579 376428 376375 376751 377448 378076 378429 378544 378514 378660 379713 382227 385679 388611 389989 390186 390411
61364C90411J005J671J977K167K276K067J597J353J685K344K886L307L994M996
$$ 390411 391416 393087 395064 397231 399507 401574 403171 404524 406209 408553 411439 414746 418740 423736
61350D23736N761N851N683O171P632R410J0705J1471J2229J3224J4094J4409J4190
$$ 423736 429497 435348 441031 447202 454834 464244 474949 486420 498649 511873 525967 540376 554566
61337E54566J3768J3316J2722J1788J0345Q239N515K740P59j91r09k355m429o096
$$ 554566 568334 581650 594372 606160 616505 624744 630259 632999 633758 633567 632658 630303 625874 619778
61323F19778o727o784o957p196p051o561o203o105n895n334m618l989l421k857
$$ 619778 613051 606267 599310 592114 585063 578502 572299 566194 560299 554965 550347 546358 542937 540080
61309E40080k394k077j764j353r51p22o94p39n74J75J647L496N155O366P176P491
$$ 540080 537686 535609 533845 532492 531541 530819 530125 529386 528812 528987 530634 534130 539285 545651 552827 560318
61293E60318P030N762M029K042k80k812m912n994o176o055n944n686n091m257
$$ 560318 567348 573110 577139 579181 578901 576089 571177 565183 559007 552952 547008 541322 536231 531974
61279E31974l459k833k228j289K01J923L168L543L438L606M426N765P411R210
$$ 531974 528515 525682 523454 522165 522366 524289 527457 531000 534438 538044 542470 548235 555646 564856
61265E64856J0796J1589J1305J0336R408Q954Q855Q769Q621Q766R739J1680J4067
$$ 564856 575652 587241 598546 608882 618290 627244 636099 644868 653489 662255 671994 683674 697741
61252F97741J6100J7487J8667K0074K1256K1066J8801J4924J0473N972J251l712
$$ 697741 713841 731328 749995 770069 791325 812391 831192 846116 856589 862561 863812 860100
61240H60100q213j1347j2977j3921j5021j6206j6581j5519j3461j1455r967q616
$$ 860100 851887 840540 827563 813642 798621 782415 765834 750315 736854 725399 715432 706816
61228G06816p109n979n853o394o601o056n202m329l077j265M73J446J789K028
$$ 706816 699707 693728 687875 681481 674880 668824 663622 659293 656216 654951 655424 656870 658659 660687
61214F60687K117J540K14j305k504l213l277k452q34R32K095K269J525K51j002
$$ 660687 662804 664344 664558 663253 660749 657536 654259 651807 650973 651905 654000 656269 657794 658045 657043
61199F57043j832k195k259k059j470l80J301L604O286Q815J0920J3017J5639J8587
$$ 657043 655211 653016 650757 648698 647228 646848 648149 651753 658039 666854 677774 690791 706430 725017
61185G25017K1050K2629K3691K4509K4511K2809J9471J5837J3423J2528J2178
$$ 725017 746067 768696 792387 816896 841407 864216 883687 899524 912947 925475 937653
61174I37653J1439J0488J0102J0358J0475R868Q684P081M762J701j358l766n850
$$ 937653 949092 959580 969682 980040 990515 1000383 1009067 1016148 1020910 1022611 1021253 1017487 1011637
61161A011637q282j0967j3292j5062j6397j7092j7024j6962j7822j9165j9528
$$ 1011637 1003355 992388 979096 964034 947637 930545 913521 896559 878737 859572 840044
61150H40044j8395j6787j5557j4163j1794q790o125m043k076r7J431K213K475
$$ 840044 821649 804862 789305 775142 763348 754558 748433 744390 742314 742217 743648 745861 748336
61137G48336K427J783M5k861o277r164j0749j0943j0169q955p684o459n041l119
$$ 748336 750763 752546 752591 749730 743453 734289 723540 712597 702428 693473 685789 679330 674289 671170
61123F71170q46J176K707M266O400Q920J1315J3481J5502J7142J8323J9728K2025
$$ 671170 670324 671500 674207 678473 684873 693793 705108 718589 734091 751233 769556 789284 811309
61110H11309K4651K6275K6378K5650K4887K4453K4665K5634K6626K6497K5069
$$ 811309 835960 862235 888613 914263 939150 963603 988268 1013902 1040528 1067025 1092094
61099A092094K3204K1518J9890J8272J6908J5435J2907R071M674J46m874j0316
$$ 1092094 1115298 1136816 1156706 1174978 1191886 1207321 1220228 1229299 1233973 1234119 1229245 1218929
61087A218929j5045j8216k0267k1959k3310k4147k4835k5640k6106k5845k5248
$$ 1218929 1203884 1185668 1165401 1143442 1120132 1095985 1071150 1045510 1019404 993559 968311
61076I68311k4710k3835k2213k0304j8789j7512j5920j4044j2340j0931r661q500
$$ 968311 943601 919766 897553 877249 858460 840948 825028 810984 798644 787713 778052 769552
61064G69552p355n955m373l151k434j588k19J133J918K458L284M283N197O343
$$ 769552 762197 756242 751869 748718 746284 744696 744477 745610 747528 749986 753270 757553 762750 769093
61050G69093P990R652J0784J1669J2850J4246J5502J6767J8406K0343K2332K4347
$$ 769093 777083 786735 797519 809188 822038 836284 851786 868553 886959 907302 929634 953981
61038I53981K6232K7551K8260K8972L0080L1351L2680L4317L5965L6765L6782
$$ 953981 980213 1007764 1036024 1064996 1095076 1126427 1159107 1193424 1229389 1266154 1302936
61027A302936L7217L8599M0083M1315M3433M7177N1469N5137N8615O2540O6044
$$ 1302936 1340153 1378752 1418835 1460150 1503583 1550760 1602229 1657366 1715981 1778521 1844565
61016A844565O7931O8300O7802O6773O6554O9839P7864Q8825J00803J14362J30146
$$ 1844565 1912496 1980796 2048598 2115371 2181925 2251764 2329628 2418453 2519256 2633618 2763764
61005B763764J46211J60495J74138J89737K08784K34156K72421L29239M04758
$$ 2763764 2909975 3070470 3244608 3434345 3643129 3877285 4149706 4478945 4883703
60996D883703M98669O17707P72379R68976J212559J515461J891417K338874K836604
$$ 4883703 5382372 6000079 6772458 7741434 8953993 10469454 12360871 14699745 17536349
60987A7536349L345951L786762M000485L782692L025687J864347O56284k24733
$$ 17536349 20882300 24669062 28669547 32452239 35477926 37342273 37998557 37773824
60979C7773824n99472n14406j21209M13990Q87037J032098O29094l19395j539142
$$ 37773824 37174352 36659946 36538737 36952727 37839764 38871862 39500956 39181561 37642419
60970C7642419k645368l371418l666601l625693l372327l004307k595183k198385
$$ 37642419 34997051 31625633 27959032 24333339 20961012 17956705 15361522 13163137
60962A3163137j841544j531005j266443j047008q67455p18879n95631m96604m19494
$$ 13163137 11321593 9790588 8524145 7477137 6609682 5890803 5295172 4798568 4379074
60953D379074l58867l10407k72413k42489k16811j93555j73433j56047j39048
$$ 4379074 4020207 3709800 3437387 3194898 2978087 2784532 2611099 2455052 2316004
60944B316004j21643j05696r2409q0915p1089o4838o3208o4488o6345o7800o8246
$$ 2316004 2194361 2088665 1996256 1915341 1844252 1779414 1716206 1651718 1585373 1517573 1449327
60933A449327o6751o3492o0010n7045n3723m9615m5702m2523l9233l5440l2162
$$ 1449327 1382576 1319084 1259074 1202029 1148306 1098691 1052989 1010466 971233 935793 903631
60922I03631l0008k8077k5688k3525k2111k0703j8753j6930j5682j4325j2593
$$ 903631 873623 845546 819858 796333 774222 753519 734766 717836 702154 687829 675236
60911F75236j1489j1367j0792q701o234m920m279k924j056l4j49m14k38J08M40
$$ 675236 663747 652380 641588 632887 626653 621733 617454 614530 613474 613440 613291 612877 612639 612747 613187
60896F13187Q73J186R85L28m65j313k066k167j400n19l68q44j373j899k688l605
$$ 613187 614060 615246 616231 616559 616094 614781 612715 610548 609148 608629 608261 607417 606044 604145 601457 597852
60880E97852m400n210o066o366n693m743m615n457o538p348p879q080p822p338
$$ 597852 593452 588242 582176 575810 570117 565374 560759 555302 548764 541416 533537 525457 517635 510297
60866E10297p040o953o741o167n221l967k646j606r42n03l81p30r82j05J921L742
$$ 510297 503257 496304 489563 483396 478175 474208 471562 469956 469014 468511 468130 467400 466418 466313 468234 471976
60850D71976M346M246M283M201L472K703K925L915M548M599M911N764O278N655
$$ 471976 476322 480568 484851 489052 492524 495227 498152 502067 506615 511214 516125 521889 528167 533822
60836E33822M105K240M12j100j911j974j731j536j321j037r22j133j404j330q13
$$ 533822 537927 540167 540579 539479 537568 535594 533863 532327 531006 529969 529047 527914 526510 525180 524367
60821E24367j13L89M65K29J3l7j58n82j200j842k687l997n605o935p580p652p617
$$ 524367 524254 524643 525108 525337 525350 525313 525155 524573 523373 521531 518844 514847 509242 502307 494727 487075 479458
60804D79458p895q454q704p991o382m732l819l682l906m141m161l810l293l115
$$ 479458 471563 463109 454405 446414 440032 435300 431481 427799 423893 419752 415591 411781 408488 405373
60790D05373l400l513k783j419l28j60p39j296j100j27Q13R52N56N46J122J465
$$ 405373 401973 398460 395677 394258 393930 393770 393031 391735 390635 390508 391321 392273 392829 393375 394497 395962
60774C95962J092O52Q91J614K341L273M681N951O221N714N491N984O697P225P739
$$ 395962 397054 397706 398597 400211 402552 405825 410506 416457 422678 428392 433883 439867 446564 453789 461528
60759D61528Q346Q724Q541P777O572N219M207L793L563K981K225J897K031K062
$$ 461528 469874 478598 487139 494916 501488 506707 510914 514707 518270 521251 523476 525373 527404 529466
60745E29466J771J538J584J601J306P67k5j264k828m168m990n685o702p837q504
$$ 529466 531237 532775 534359 535960 537266 538033 538008 536744 533916 529748 524758 519073 512371 504534 496030
60730D96030q480q115p808p507o870n857n008m894n316n493n106m671m583m397
$$ 496030 487550 479435 471627 464120 457250 451393 446385 441491 436175 430682 425576 420905 416322 411925
60716D11925l601k585k095j966j242M05K127K873K453J506R38J378K764M264N040
$$ 411925 408324 405739 403644 401678 400436 400841 402968 405841 408294 409800 410738 412116 414880 419144 424184
60701D24184N147N361O128P028P369O943O139N579N648O120O324N925N296M845
$$ 424184 429331 434692 440820 447848 455217 462160 468299 473878 479526 485646 491970 497895 503191 508036
60687E08036M313L226J773O30M1l14o46r13j196j536j412k05J743L303L999M491
$$ 508036 512349 515575 517348 517978 518019 517705 517059 516146 514950 513414 512002 511797 513540 516843 520842 525333
60671E25333N381O283O612O593O904P672Q487R160R933J0947J1949J2663J3224
$$ 525333 530714 536997 543609 550202 557106 564778 573265 582425 592358 603305 615254 627917 641141
60658F41141J4057J5280J6369J6634J6108J5582J5587J5604J4739J2842J0486
$$ 641141 655198 670478 686847 703481 719589 735171 750758 766362 781101 793943 804429
60647H04429Q081N632L236J136p45k752n003p404j0089j3137j5869j7191j6804
$$ 804429 812510 818142 821378 822514 821769 819017 814014 806610 796521 783384 767515 750324 733520
60634G33520j5514j4201j3112j2286j1870j1687j1129r880q335p066o228n612
$$ 733520 718006 703805 690693 678407 666537 654850 643721 633841 625506 618440 612212 606600
60622F06600m810l355j318K39K46p72j065J7J039M32j540l456m598n201n479n434
$$ 606600 601790 598435 597117 597356 597602 596830 595765 595782 596821 597253 595713 592257 587659 582458 576979 571545
60606E71545n333n413n311m583l679l530m242m960n067m851m809m984n147n155
$$ 571545 566212 560799 555488 550905 547226 543696 539454 534494 529427 524576 519767 514783 509636 504481
60592E04481m868m154l180k413k125k053j767j193p03p16j183j496j026J05J055
$$ 504481 499613 495459 492279 489866 487741 485688 483921 482728 482025 481309 480126 478630 477604 477709 478764
60577D78764J216R85J227K198L392M347N175O161P256Q254R281J0772J2915J5362
$$ 478764 479980 480965 482192 484390 487782 492129 497304 503465 510721 518975 528256 539028 551943 567305
60563E67305J7749K0348K3849K8243L2265L4241L3356K9866K4374J7426R645J597
$$ 567305 585054 605402 629251 657494 689759 724000 757356 787222 811596 829022 838667 840264
60551H40264o423j3956j9800k2612k2341k0373j7944j5077j1319o820k136K537
$$ 840264 833841 819885 800085 777473 755132 734759 716815 701738 690419 683599 681463 684000
60539F84000P300J2128J6993K2123K7688L3478L9091M3992M7154M7327M4197L8700
$$ 684000 691300 703428 720421 742544 770232 803710 842801 886793 933947 981274 1025471 1064171
60527A064171L1650K2776J1874L14r663j6840k1299k3136k2170j9056j5555j3183
$$ 1064171 1095821 1118597 1130471 1130785 1121122 1104282 1082983 1059847 1037677 1018621 1003066 989883
60515I89883j2085j1544j1022j0343r419q156o570m721k719p00J319L471N658
$$ 989883 977798 966254 955232 944889 935470 927314 920744 916023 913304 912604 913923 917394 923052
60502I23052P442Q650R898J2067J5505K0246K6700L5355M5871N7172O8536P9886
$$ 923052 930494 939144 949042 961109 976614 996860 1023560 1058915 1104786 1161958 1230494 1310380
60490A310380R0880J00405J07172J10325J09275J03577R3322P9407O3216M6240
$$ 1310380 1401260 1501665 1608837 1719162 1828437 1932014 2025336 2104743 2167959 2214199
60480B214199K9832J4692M15j3950k8787m3743n8548p3159q6884r8134j05568
$$ 2214199 2244031 2258723 2259138 2245188 2216401 2172658 2114110 2040951 1954067 1855933 1750365
60469A750365j08999j08867j05440r9057r0709q1724p2980o4763n7125n0123m3858
$$ 1750365 1641366 1532499 1427059 1328002 1237293 1155569 1082589 1017826 960701 910578 866720
60458H66720l8557l4287l0552k6655k2696j9646j8055j7258j6329j5223j4262
$$ 866720 828163 793876 763324 736669 713973 694327 676272 659014 642685 627462 613200
60447F13200j3102j1197q994p621p315p078o071m593l275k110q81O5K00k37l80
$$ 613200 600098 588901 579907 572286 564971 557893 551822 547229 543954 541844 540963 541028 541228 540991 540611
60432E40611J64Q41R11K54p00j556k294l185m509o168p467p541o256m494l270
$$ 540611 540775 541616 542527 542781 542081 540525 538231 535046 530537 524369 516902 509361 503105 498611 495341
60417D95341k669k005q83L51J239J736J961J860J470J116R63P79M57M89J279K268
$$ 495341 492672 490667 489784 490135 491374 493110 495071 496931 498401 499517 500480 501259 501716 502205 503484 505752
60401E05752K412J477K90l32l35m0M16R96J564K051K494K831K882K624K168J507
$$ 505752 508164 509641 509931 509599 509264 509224 509640 510636 512200 514251 516745 519576 522458 525082 527250 528757
60385E28757P28M09J130K476L209K760J894J532J566J469J409J937K847L282K926
$$ 528757 529485 529894 531024 533500 536709 539469 541363 542895 544461 545930 547339 549276 552123 555405 558331
60370E58331K406K416L007L850M679N292N556N602N776O222O716O966O866O458
$$ 558331 560737 563153 566160 570010 574689 579981 585537 591139 596915 603137 609853 616819 623685 630143
60356F30143N903N519N490N500M942L636K154J245J125J529K239L326M937P095
$$ 630143 636046 641565 647055 652555 657497 661133 663287 664532 665657 667186 669425 672751 677688 684783
60342F84783R740J2823J6254J9848K3450K6923K9790L0950K9245K4581J8225J1516
$$ 684783 694523 707346 723600 743448 766898 793821 823611 854561 883806 908387 926612 938128
60330I38128M589l100j1162j7991k2330k4338k4808k4021k2057j9584j7449j5690
$$ 938128 942717 939617 928455 910464 888134 863796 838988 814967 792910 773326 755877 740187
60318G40187j3820j1922j0621r929q948o977m241j332J435L790N395O464Q036
$$ 740187 726367 714445 703824 693895 684947 677970 673729 672397 673832 677622 683017 689481 697517
60305F97517J1019J5275K0126K5437L1692L9208M7636N5848O1744O2685N7183
$$ 697517 708536 723811 743937 769374 801066 840274 887910 943758 1005502 1068187 1125370
60294A125370M6348L2859J8237J913j6601l5288n0230n8456n9764n5998m9277
$$ 1125370 1171718 1204577 1222814 1224727 1208126 1172838 1122608 1064152 1004388 948390 899113
60283H99113m0995l1842k2303j3080n096R76N145P793Q933Q066M906M1n373j0437
$$ 899113 858118 826276 803973 790893 785797 786773 791918 799711 808644 816710 821616 821657 816284 805847
60269H05847j4900j8763k1740k3211k2791k0914j8639j6699j4847j2456r623p267
$$ 805847 790947 772184 750444 727233 704442 683528 664889 648190 633343 620887 611264 603997
60257F03997o014n504n005m293l584k991k534k465k983l734m092l935l687l528
$$ 603997 597983 592479 587474 583181 579597 576606 574072 571607 568624 564890 560798 556863 553176 549648
60243E49648l105k205j236p29o96p38n91l26k02l95q21j042n89N35J826K865L685
$$ 549648 546543 544338 543102 542373 541677 540939 540348 540022 539820 539425 538604 537562 536973 537508 539334 542199 545884
60226E45884M513N368O111O665P024P175P068O545N358L598K052J632K266K790
$$ 545884 550397 555765 561876 568541 575565 582740 589808 596353 601711 605309 607361 608993 611259 614049
60212F14049K267R69j72p22r15j036j117j055o22M14J778K538J976N55m73l58
$$ 614049 616316 617285 617113 616391 615476 614440 613323 612268 611646 612060 613838 616376 618352 618907 618434 618076
60196F18076N82J470J580P31m76r39j41J087J448P37j01l44j33L47J311K543L066
$$ 618076 618658 620128 621708 622439 621963 621024 620883 621970 623418 624155 624054 623710 623577 623924 625235 627778 630844
60179F30844K327J192R08J416J521N57q94j981k500k683k610k176j283J08J826
$$ 630844 633171 634363 635271 636687 638208 638765 637871 635890 633390 630707 628097 625921 624638 624746 626572
60164F26572L287L839L596L593M742O783Q547R122Q490P142N498L691J665o79
$$ 626572 629859 633698 637294 640887 645629 652412 660959 670081 678571 685713 691211 694902 696567 695888
60150F95888l165n194o109n924n390n149m996m271k826j248l4J028K525M650P069
$$ 695888 692723 687529 681420 675496 670106 664957 659961 655690 652864 651616 651582 652610 655135 659785 666854
60135F66854R349J1358J3158J4750J5863J5931J4352J1005O588K215j462m670
$$ 666854 676203 687561 700719 715469 731332 747263 761615 772620 779208 781423 779961 775291
60123G75291p940j1194j3557j4219j3259j1482r524p449n308l664l065l159k872
$$ 775291 767351 756157 742600 728381 715122 703640 694116 686667 681359 677695 674630 671471 668599
60110F68599j661j54P26R26J136J765K487K903L181L863N236P099Q932J0171J0389
$$ 668599 666938 666784 667510 668436 669572 671337 673824 676727 679908 683771 689007 696106 705038 715209 725598
60095G25598R542Q051O631N811N501N039L837K115Q65R01J938K841K847K377K415
$$ 725598 735140 743191 749822 755633 761134 766173 770010 772125 772990 773891 775829 778670 781517 783894 786309
60080G86309L171L740L186J704K83o62j708l367n159o323p070q315j0244j1951
$$ 786309 789480 793220 796406 798110 798393 797731 796023 792656 787497 781174 774104 765789 755545 743594
60066G43594j2660j2586j2263j1599j0224q321o524n239m492m237m291m203l705
$$ 743594 730934 718348 706085 694486 684262 675941 669417 664178 659686 655449 651158 646955 643250
60053F43250l186l230l875m705n489o184o540o372o039n949n655m306k134n09
$$ 643250 640064 636834 632959 628254 622765 616581 610041 603669 597630 591681 586026 581720 579586 579077
60039E79077j94l43K08J382K310K745L159L696L925L661L276L035K644J787O95
$$ 579077 578883 578540 578748 580130 582440 585185 588344 592040 595965 599626 602902 605937 608581 610368 611063
60024F11063j25n40q98j520k311k945l324l760m573n603o285o228n526m532l557
$$ 611063 610938 610398 609500 607980 605669 602724 599400 595640 591067 585464 579179 572951 567425 562893 559336
60009E59336k918k863l201l299k785k054j688j602j222m34L03Q22J581K813L911
$$ 559336 556418 553555 550354 547055 544270 542216 540528 538926 537704 537270 537573 538395 539976 542789 546700
59994E46700M198L955M056M754N471N702N515M967L786K051N91J22K58Q3n29q36
$$ 546700 550898 554853 558909 563663 569134 574836 580351 585318 589104 591155 591746 591868 592126 592209 591680 590844
59978E90844m43R5J51k43p80j450k282k951l121k890k545k153j810j873k423k756
$$ 590844 590401 590496 590647 590404 589624 588174 585892 582941 579820 576930 574385 572232 570422 568549 566126 563370
59962E63370k053m36J167K103K452K500K367K125J805J249M17k66m23m75j181
$$ 563370 561317 560881 562048 564151 566603 569103 571470 573595 575400 576649 577066 576800 576377 575902 574721
59947E74721k420l143k665j345J76J591K554K551J748J157J348J547P55p23j769
$$ 574721 572301 569158 566493 565148 565324 566915 569469 572020 573768 574925 576273 577820 578575 577852 576083
59932E76083k024k109k384k454k073j643j532j402p38L76J300J531J126N49K78
$$ 576083 574059 571950 569566 567112 565039 563396 561864 560462 559724 560100 561400 562931 564057 564606 564884
59917E64884M56Q06R18O60K49m6j16L2L70P52Q77M66l87j145j172l59O74J154
$$ 564884 565340 566146 567064 567724 567973 567927 567811 567843 568213 568965 569842 570308 569921 568776 567604 567245 567919 569073
59899E69073R41N42M23N11N16L93L44N49J073J828K533K870K919L174L929M874
$$ 569073 570014 570556 570979 571490 572006 572399 572743 573292 574365 576193 578726 581596 584515 587689 591618 596492
59883E96492N499N749N948O235O408O339O264O581P392Q248Q392P398N610L799
$$ 596492 601991 607740 613688 619923 626331 632670 638934 645515 652907 661155 669547 676945 682555 686354
59869F86354K383J126l52k067l761n190o203o726o859o813o572n953n020m157
$$ 686354 688737 689863 689511 687444 683683 678493 672290 665564 658705 651892 645320 639367 634347 630190
59855F30190l602l205k876k833l155l384l002k083j196p77p82p12J48K232N176
$$ 630190 626588 623383 620507 617674 614519 611135 608133 606050 604854 604077 603295 602583 602731 604963 610139
59840F10139Q079J0468J2666J4956J6791J7159J5452J1818P084K657mm32O42K353
$$ 610139 618218 628686 641352 656308 673099 690258 705710 717528 724612 727269 727265 726833 727475 729828
59826G29828M465O580P224M742q83p686j3250j6306j7097j6839j6722j7000j6981
$$ 729828 734293 740873 748097 752839 751956 744270 731020 714714 697617 680778 664056 647056 630075
59813F30075j6048j4449j2841j1487j0276r115p866o328m723l686l309k810j843
$$ 630075 614027 599578 586737 575250 564974 555859 547993 541665 536942 533256 529947 527137 525294
59800E25294j291j927k989l242k860k918l490l719l590l918m598m443l170j992
$$ 525294 524003 522076 519087 515845 512985 510067 506577 502858 499268 495350 490752 486309 483139 481147
59786D81147j733j728j276q10q07o89J40J088J220O51J60K8M4J51L12J51n28j299
$$ 481147 479414 477686 476410 475600 474793 474104 474244 475332 476552 477203 477363 477391 477435 477586 477898 478049 477521 476222
59768D76222j740k012k276k101j162M0Q16J171J397J307P07J10J75P55J233J482
$$ 476222 474482 472470 470194 468093 466931 466971 467787 468958 470355 471662 472369 472479 472654 473409 474642 476124
59752D76124J782K134K400K770L380L753L464K966K995L423L564L395L454L656
$$ 476124 477906 480040 482440 485210 488590 492343 495807 498773 501768 505191 508755 512150 515604 519260
59738E19260L196J791K05o83p42m29k90o39j226j307o15j1n20j844k725k634k256
$$ 519260 522456 524247 524452 523769 523027 522598 522308 521669 520443 519136 518521 518510 517990 516146 513421 510787 508531
59721E08531k226k363k371k418k585k518k010j365p94o3Q40J333J031M93O09J517
$$ 508531 506305 503942 501571 499153 496568 494050 492040 490675 489881 489818 490658 491991 493022 493515 494124 495641
59705D95641K582L249L469L452L363L274L230L297L596M093M381M012L096K331
$$ 495641 498223 501472 504941 508393 511756 515030 518260 521557 525153 529246 533627 537639 540735 543066
59691E43066K255K720L168L149K501J318o0j247k100k655k794k334j466p63n54
$$ 543066 545321 548041 551209 554358 556859 558177 558117 556870 554770 552115 549321 546987 545521 544758 544204
59676E44204o31o74o42n67l91k19l99j031j712j994j948j941k098k241k248k156
$$ 544204 543573 542899 542257 541690 541299 541080 540681 539650 537938 535944 533996 532055 529957 527716 525468 523312
59660E23312k015j831j631j401j020m29K04O85J025J375J739J979K070K124K171
$$ 523312 521297 519466 517835 516434 515414 514985 515189 515874 516899 518274 520013 521992 524062 526186 528357
59645E28357K038J537O85l42j388k310k904l014k826k772k935k795j960r58p32
$$ 528357 530395 531932 532617 532275 530887 528577 525673 522659 519833 517061 514126 511331 509371 508413 507681
59630E07681j294j562q10K76N54l5n18k31N46J269J767K091K223K115J738J034
$$ 507681 506387 504825 504015 504291 504845 504810 504292 504061 504607 505876 507643 509734 511957 514072 515810 516844
59614E16844L1j030j960k830l675m071l547k319j180o03l83j47K58Q21J386J569
$$ 516844 516875 515845 513885 511055 507380 503309 499762 497443 496263 495660 495277 495130 495388 496209 497595 499164
59598D99164J087K47l59n98p82r97j025r52j109j308r11J01Q87R52Q39J095J228
$$ 499164 500251 500498 500139 499541 498759 497762 496737 495785 494676 493368 492457 492558 493445 494397 495236 496331 497559
59581D97559M92q14j670j787j881k524l485m295m833n059m695l609k280j412j156
$$ 497559 498051 497237 495567 493780 491899 489375 485890 481595 476762 471703 467008 463399 461119 459707 458551
59566D58551j024n88L1N42R63J409J620J255O60O69J351J596N54j050j735j116
$$ 458551 457527 456939 456970 457512 458475 459884 461504 462759 463419 464088 465439 467035 467589 466539 464804 463688
59550D63688j28M26O85J065J644K376L173L639L380K792K791L615M681N841P874
$$ 463688 463560 463986 464671 465736 467380 469756 472929 476568 479948 482740 485531 489146 493827 499668 507542
59535E07542J1236J5294J9235K2808K5265K4585J9109R841J27o938j0233j0233
$$ 507542 518778 534072 553307 576115 601380 625965 645074 654915 655042 648104 637871 627638
59523F27638p979m568r20K376M855O158O558P003P983Q676P958N947L725J726
$$ 627638 619659 615091 614171 616547 621402 627560 634118 641121 649104 657780 665738 671685 675410 677136
59509F77136n59l268n619p021p918r026j0368j1522j2252j2438j1785j0208q297
$$ 677136 676577 673309 667690 660669 652751 643725 633357 621835 609583 597145 585360 575152 566855
59496E66855o935o474o547o586o278n658m954m406m042l675l149k532j995j560
$$ 566855 559920 553446 546899 540313 534035 528377 523423 519017 514975 511300 508151 505619 503624 502064
59482E02064j023k16P25J359J443J359J803K915M086M824N396O256P056O853N254
$$ 502064 501041 500825 501550 502909 504352 505711 507514 510429 514515 519339 524735 530991 538047 544900 550154
59467E50154K974J153L86L77L19l96j497k003j266K19J445K175L104M711O552
$$ 550154 553128 554281 554667 555044 555363 554967 553470 551467 550201 550420 551865 554040 557144 561855 568407
59452E68407P924Q885J0205J2415J5145J7460J8759J9315J9798K0335K0155J8243
$$ 568407 576331 585216 595421 607836 622981 640441 659200 678515 698313 718648 738803 757046
59440G57046J4154Q173J110n841j1502j5380j7736j8884j8805j7715j6335j5061
$$ 757046 771200 779373 780483 774642 763140 747760 730024 711140 692335 674620 658285 643224
59428F43224j3483j1396r662r051q743p216m426j736K64K480N578Q869J1543J3829
$$ 643224 629741 618345 608683 599632 590889 583673 579247 577511 577775 580255 585833 594702 606245 620074
59414F20074J6213J8534K0585K2764K5306K7749K9778L1501L1835K7881J7684
$$ 620074 636287 654821 675406 698170 723476 751225 781003 812504 844339 872220 889904
59403H89904L358j0109j9035k2950k2893j9742j4515q499k323L854Q375P793O2
$$ 889904 893262 883153 864118 841168 818275 798533 784018 775519 773196 777050 785425 793218 793280
59390G93280j2377k4039l0840l2529l1184k8620k5528k2089j8514j5060j1899
$$ 793280 780903 756864 726024 693495 662311 633691 608163 586074 567560 552500 540601
59379E40601r121o854n343m704m509l915k507q27K60N57N33N13M08K31L24R14
$$ 540601 531480 524626 519283 514579 510070 506155 503648 502821 503081 503638 504171 504684 505092 505323 505647 506561
59363E06561J778K576L102L207K823K289K177K522K745K657K967M249N865O773
$$ 506561 508339 510915 514017 517224 520047 522336 524513 527035 529780 532437 535404 539653 545518 552291
59349E52291P119Q061J0009J2024J3275J4177J5551J7426J9329K1130K2806K3775
$$ 552291 559410 567471 577480 589504 602779 616956 632507 649933 669262 690392 713198 736973
59337G36973K3419K2127K0918K0058J8794J6544J3550J0195O425K335j379m140
$$ 736973 760392 782519 803437 823495 842289 858833 872383 882578 889003 891338 889959 885819
59325H85819o325q731j1411j3599j4792j5424j6224j7166j7400j6319j4452j2981
$$ 885819 879494 870763 859352 845753 830961 815537 799313 782147 764747 748428 733976 720995
59313G20995j2376j1873j0587q723p159o172n331m551m358m828n070m346l028
$$ 720995 708619 696746 686159 677436 670277 664105 658774 654223 649865 645037 639967 635621 632593
59300F32593j876q63N24K180L483M384N580P506R822J2130J4553J7320K0300K3367
$$ 632593 630717 629854 630378 632558 636041 640425 646005 653511 663333 675463 690016 707336 727636 751003
59286G51003K6775L0460L3019L1911K5179J3185j162j3962k2382k5728k4982k1656
$$ 751003 777778 808238 841257 873168 898347 911532 910370 896408 874026 848298 823316 801660
59274H01660j7036j2088p444l294M53L756O291P913R082J0574J2645J4617J5408
$$ 801660 784624 772536 765092 761798 762251 766007 772298 780211 789293 799867 812512 827129 842537
59261H42537J4548J2495R970P109L580n78m652p972j0583j2954j5223j7063j8210
$$ 842537 857085 869580 879550 886659 890239 889661 885009 877037 866454 853500 838277 821214 803004
59248H03004j8673j8516j7783j6644j5370j4066j2659j1124r435p420n086l026
$$ 803004 784331 765815 748032 731388 716018 701952 689293 678169 668734 661314 656228 653202
59236F53202j930j576q60Q44K795L894M122M434N382O488O977O626N677M376K758
$$ 653202 651272 649696 648836 649680 652475 656369 660491 664925 670307 676795 683772 690398 696075 700451 703209
59221G03209P63j638m253o563q039q629q774q940r280r741j0237j0557j0386r511
$$ 703209 703972 702334 698081 691518 683479 674850 666076 657136 647856 638115 627878 617321 606935 597424
59207E97424p993o082m267l264l528m542n040m259k725j484r26o52k95J80P80
$$ 597424 589431 583349 579082 575818 572290 567748 562708 558449 555724 554240 553314 552662 552367 552547 553327
59192E53327J518K129K240J995K027K662L537M203M680N144N474N491N425N675
$$ 553327 554845 556974 559214 561209 563236 565898 569435 573638 578318 583462 588936 594427 599852 605527
59178F05527O187O431O077N468N316N916O722O814N994N279N850P553Q968R149
$$ 605527 611714 618145 624222 629690 635006 640922 647644 654458 660452 665731 671581 679134 688102 697251
59164F97251Q683Q623R074R526J0051J1094J2193J2054J0286Q108O743N742L698
$$ 697251 705934 714557 723631 733157 743208 754302 766495 778549 788835 796943 803686 809428 813126
59151H13126K77l228n369o000o127o735q059r746j1324j2398j2644j1962j0733
$$ 813126 813403 810175 804806 798806 792679 785944 777885 768139 756815 744417 731773 719811 709078
59138G09078r602q705p395n159k684j341j523k076j710m78O41J158J564K484L984
$$ 709078 699476 690771 683376 678217 675533 674192 672669 670593 668883 668405 669046 670204 671768 674252 678236
59123F78236N709P342Q794J0256J1966J3817J5281J6061J6574J7400J8344J8668
$$ 678236 683945 691287 700081 710337 722303 736120 751401 767462 784036 801436 819780 838448
59111H38448J8196J7633J7513J7407J6549J4827J2732J0589Q386O276M721L959
$$ 838448 856644 874277 891790 909197 925746 940573 953305 963894 972280 978556 983277 987236
59099I87236L587K933J710J69j361k890m601o316p465p737p586p639p725p080
$$ 987236 990823 993756 995466 995635 994274 991384 986783 980467 973002 965265 957679 950040 942315 935235
59085I35235n650m584m958o433p871q918j0253j2263j4335j5753j6552j7077j7218
$$ 935235 929585 925001 920043 913610 905739 896821 886568 874305 859970 844217 827665 810588 793370
59072G93370j6709j5868j5308j5119j4836j4171j3177j1747r598o974m818l922
$$ 793370 776661 760793 745485 730366 715530 701359 688182 676435 666837 659863 655045 651123
59060F51123m161m748m974m498l386k158j465j434j576j572j772k458l061k833
$$ 651123 646962 642214 637240 632742 629356 627198 625733 624299 622723 621151 619379 616921 613860 611027
59046F11027k002j535j704j738j099k64J46K82N56P56M85J36N83J947L484M698
$$ 611027 609025 607490 605786 604048 602949 602685 602831 603113 603669 604425 604910 605046 605629 607576 611060 615758
59030F15758N774O756P087O528N909O273P595R044J0233J1560J3267J4980J6340
$$ 615758 621532 628288 635375 641903 647812 654085 661680 670724 680957 692517 705784 720764 737104
59017G37104J7507J8655J9330J8836J7027J4407J1452Q292M970J771r00k826m025
$$ 737104 754611 773266 792596 811432 828459 842866 854318 862610 867580 869351 868451 865625 861600
59004H61600m550m305l174j301Q26K724M260N490O287O462O216O009N879N299
$$ 861600 857050 852745 849571 848270 849096 851820 856080 861570 867857 874319 880535 886544 892423 897722
58990H97722L980K374J073k3j397l125m864o516q318j0346j2336j4072j5478j6300
$$ 897722 901702 904076 905149 905126 903729 900604 895740 889224 880906 870560 858224 844152 828674 812374
58976H12374j6131j4884j2966j0911r096p668o376m554j762J512M286O207P802
$$ 812374 796243 781359 768393 757482 748386 740718 734342 729788 728026 729538 733824 740031 747833
58963G47833R568J1395J2952J3994J4208J3391J1982J0762R717P916M827J025
$$ 747833 757401 768796 781748 795742 809950 823341 835323 846085 855802 863718 868545 869570
58951H69570k784o620j0465j3478j4913j5304j5731j6243j5952j4543j2707j1069
$$ 869570 866786 860166 849701 836223 821310 806006 790275 774032 758080 743537 730830 719761
58939G19761r501p728n900m325l137k421k282k640l230l847m392m758m961n188
$$ 719761 710260 702532 696632 692307 689170 686749 684467 681827 678597 674750 670358 665600 660639 655451
58925F55451n427n347m898m699n256o092o320n798n045m200l018j778j231j410
$$ 655451 650024 644677 639779 635080 629824 623732 617412 611614 606569 602369 599351 597573 596342 594932
58911E94932j380m52R75K237L284M314N100N337N373O036P723R955J1890J3165
$$ 594932 593552 593100 594075 596312 599596 603910 609010 614347 619720 625756 633479 643434 655324 668489
58897F68489J4165J5321J6260J6093J4759J3416J3040J3233J3251J3625J5526
$$ 668489 682654 697975 714235 730328 745087 758503 771543 784776 798027 811652 827178
58886H27178J8806K2010K4438K6786K9367L1023L0591K8378K5327K1609J7035
$$ 827178 845984 867994 892432 919218 948585 979608 1010199 1038577 1063904 1085513 1102548
58875A102548J2103P542L121k043q083j4075j9080k2887k5649k7359k7798k6830
$$ 1102548 1114651 1122193 1125314 1123271 1115188 1101113 1082033 1059146 1033497 1006138 978340 951510
58863I51510k4722k2211k0035j8310j6757j5499j5035j5316j5552j5322j5176
$$ 951510 926788 904577 884542 866232 849475 833976 818941 803625 788073 772751 757575
58852G57575j5558j5985j5884j5565j5443j4944j3268j0910r237q617q075o903
$$ 757575 742017 726032 710148 694583 679140 664196 650928 640018 630781 622164 614089 607186
58840F07186n574m732m218l596k987k706k568k157j580j369j701k146k276k177
$$ 607186 601612 596880 592662 589066 586079 583373 580805 578648 577068 575699 573998 571852 569576 567399
58826E67399k222k525k873l055l057k941k714k415k095j628q08K02Q35Q91R85
$$ 567399 565177 562652 559779 556724 553667 550726 548012 545597 543502 541874 541066 541268 542103 542994 543979
58811E43979J795L026L741L562K951K368J823J315J088J188J329J273R38J69j042
$$ 543979 545774 548800 552541 556103 559054 561422 563245 564560 565648 566836 568165 569438 570376 570545 569503
58796E69503k141k518k375k339k321j777j068j216k086k218r95M26J149J985L757
$$ 569503 567362 564844 562469 560130 557809 556032 554964 553748 551662 549444 548449 548875 550024 552009 555766
58781E55766N552O109N975O559P763Q251P670O906O316N312L791K417J261n09
$$ 555766 561318 567427 573402 579961 587724 595975 603645 610551 616867 622179 625970 628387 629648 629139
58767F29139l075n287o041n490m525l777l425l303k913j980j011o88p50k76R19
$$ 629139 626064 620777 614736 609246 604721 600944 597519 594216 591303 589323 588312 587624 586874 586598 587517
58752E87517K112K937L857N151O353O953O898O212N024M195M820O772Q638R639
$$ 587517 589629 592566 596423 601574 607927 614880 621778 627990 633014 637209 642029 648801 657439 667078
58738F67078J0533J2062J3571J4080J3870J3823J3761J2747J0913R780J0325J1553
$$ 667078 677611 689673 703244 717324 731194 745017 758778 771525 782438 792218 802543 814096
58726H14096J1570R775P442O089N725N124L593J903J108J169J402J816K952M533
$$ 814096 825666 835441 842883 848972 854697 859821 863414 865317 866425 867594 868996 870812 873764 878297
58712H78297N396N120M706N144N999O145N219L738K121L04j890m564p758j1263
$$ 878297 883693 888813 893519 898663 904662 910807 916026 919764 921885 922189 920299 915735 907977 896714
58698H96714j4558j7318j9773k2212k4276k5281k5043k4007k2528k0598j8284
$$ 896714 882156 864838 845065 822853 798577 773296 748253 724246 701718 681120 662836
58687F62836j6035j4235j2689j0900q851p142o249n915n614n378n590n990n638
$$ 662836 646801 632566 619877 608977 600126 592984 586735 580820 575206 569828 564238 558248 552610
58674E52610m253k856k494k735k315r30N39J546K656M582P187R825J2041J3580
$$ 552610 548357 545501 543007 540272 537957 537027 537566 539112 541768 546350 553537 563362 575403 588983
58660E88983J4172J3729J2493J0728Q489N852L000N1k840n088n914n253m048l340
$$ 588983 603155 616884 629377 640105 648594 654446 657446 657497 654657 649569 643655 638402 634354 631014
58646F31014l392l799m126m161l923l664l695l957m031l691l170k733k232j281
$$ 631014 627622 623823 619697 615536 611613 607949 604254 600297 596266 592575 589405 586672 584440 583159
58632E83159L12K384M512O156O938O934O524N966N261M407L516K669J889J178
$$ 583159 583471 585855 590367 596523 603461 610395 616919 622885 628146 632553 636069 638738 640627 641805
58618F41805M94k36q05p53m3N64L58k31n2J349L287M871N704N565M230J978k73
$$ 641805 642299 642063 641258 640505 640462 641026 641384 641153 641101 642450 645737 650608 656312 661877 666107 668085 667812
58601F67812j735k417k813l309m065n053n914o123n605m953m777m988m916l994
$$ 667812 666077 663660 660847 657538 653473 648420 642506 636383 630778 625825 621048 616060 611144 607150
58587F07150k178R9K298M158N805P497R280J0921J2107J2625J2487J1926J1088
$$ 607150 604972 605071 607369 611527 617332 624829 634109 645030 657137 669762 682249 694175 705263
58574G05263R791P939O136N262N368N645N728O221P517R006J0163J1585J3962
$$ 705263 715054 722993 729129 734391 739759 745404 751132 757353 764870 773876 784039 795624 809586
58561H09586J6755J8890K0253K1369K2080K1750K0583J9495J8687J7364J4853
$$ 809586 826341 845231 865484 886853 908933 930683 951266 970761 989448 1006812 1021665
58550A021665J1147O579J792k173m854p161j0102j3068j4604j4637j4580j5269
$$ 1021665 1032812 1039391 1041183 1039010 1034156 1026995 1016893 1003825 989221 974584 960004 944735
58538I44735j6226j7026j7909j8774j8933j8292j7591j7173j6548j5448j4175
$$ 944735 928509 911483 893574 874800 855867 837575 819984 802811 786263 770815 756640
58527G56640j2736j0798q685p198o215m700k401k51J201K392L507M017L862L724
$$ 756640 743904 733106 724421 717223 711008 706308 703907 703656 704857 707249 710756 714773 718635 722359
58513G22359L670K959J680J064J595K252K313K400K965L232K645J977J916J886
$$ 722359 726029 728988 730668 731732 733327 735579 737892 740292 743257 746489 749134 751111 753027 754913
58499G54913J262N82M34K71n66j671k499l456m920o140o225n404m380l286k189
$$ 754913 756175 756757 757191 757462 756896 755225 752726 749270 744350 738210 731985 726581 722201 718915 716726
58484G16726j579j389n19J547L623M483M655N407O827Q152R218J0280J0994J0775
$$ 716726 715147 713758 713239 714786 718409 722892 727547 732954 739781 747933 757151 767431 778425 789200
58470G89200R686Q067N806K938K27j752l417n200o564o880o581o403o305n984
$$ 789200 798886 806953 812759 815697 815924 814172 810755 805555 798991 792111 785530 779127 772822 766838
58456G66838n607n137l842j511P52K032K928M307N704O137N586M460K566m4k181
$$ 766838 761231 756094 752252 750741 751493 753525 756453 760760 766464 772601 778187 782647 785213 785169 782988
58441G82988k891k914l392l946l548k522k008j951j245M33K287L662M446M601
$$ 782988 780097 777183 773791 769845 766297 763775 761767 759816 758571 759004 761291 764953 769399 774000
58427G74000M354M435N185N930O148O489P661R228J0538J1869J3425J4246J3519
$$ 774000 778354 782789 787974 793904 800052 806541 814202 823430 833968 845837 859262 873508 887027
58414H87027J2006J0745R394P330N245L919K448l45l564n429o039o860q042q385
$$ 887027 899033 909778 919172 926502 931747 935666 938114 937769 934205 928776 922737 915877 907835 899450
58400H99450p703p022o591n663m237l163k500j520l33K21K70P93J767K066J344
$$ 899450 891747 884725 878134 872471 868234 865071 862571 861051 860718 860939 861209 862002 863769 865835 867179
58385H67179N36L11L68M02M92N86O53J206K524L744L884L335L078K998K429J776
$$ 867179 867715 868026 868394 868796 869288 869874 870527 871733 874257 878001 881885 885220 888298 891296 893725 895501
58369H95501K049L132M076M732N647O767P650Q514R559J0038R500R193J0340J1888
$$ 895501 897550 900682 904758 909490 915137 921904 929554 938068 947627 957665 967165 976358 986698 998586
58355I98586J1986J1057J1063J2152J2406J0871Q617O702N162M128M053M571M843
$$ 998586 1010572 1021629 1032692 1044844 1057250 1068121 1076738 1083440 1088602 1092730 1096783 1101354 1106197
58342A106197N025N952P472Q694R646J0927J2162J2488J2340J2887J4035J4789
$$ 1106197 1111222 1117174 1124646 1133340 1142986 1153913 1166075 1178563 1190903 1203790 1217825 1232614
58330A232614J5121J5664J6085J5724J5291J5781J6288J5194J3069J1954J2113
$$ 1232614 1247735 1263399 1279484 1295208 1310499 1326280 1342568 1357762 1370831 1382785 1394898
58319A394898J1967J1006J0260J0054R708R442J0158J1346J1581J1077J1373J2571
$$ 1394898 1406865 1417871 1428131 1438185 1447893 1457335 1467493 1478839 1490420 1501497 1512870 1525441
58307A525441J3294J3347J3970J5404J6654J7649J9265K1152K1876K1335K0762
$$ 1525441 1538735 1552082 1566052 1581456 1598110 1615759 1635024 1656176 1678052 1699387 1720149
58296A720149K0496J9950J9580K0351K1562K1604K0718K0512K1175K1691K2377
$$ 1720149 1740645 1760595 1780175 1800526 1822088 1843692 1864410 1884922 1906097 1927788 1950165
58285A950165K4366K6949K8313K8596K9383L0569L0752L0258L0715L1968L2613
$$ 1950165 1974531 2001480 2029793 2058389 2087772 2118341 2149093 2179351 2210066 2242034 2274647
58274B274647L3144L5369L9038M2374M5403M9444N3871N7003N9516O3250O7305
$$ 2274647 2307791 2343160 2382198 2424572 2469975 2519419 2573290 2630293 2689809 2753059 2820364
58263B820364O9390P0367P3108P7372Q0376Q2038Q4873Q8878R1367R2007R3185
$$ 2820364 2889754 2960121 3033229 3110601 3190977 3273015 3357888 3446766 3538133 3630140 3723325
58252C723325R5200R5901R5308R5805R7642R9052J00726J05109J11363J16397
$$ 3723325 3818525 3914426 4009734 4105539 4203181 4302233 4402959 4508068 4619431 4735828
58242D735828J20817J28113J38065J46883J54136J63258J74847J85856J96056
$$ 4735828 4856645 4984758 5122823 5269706 5423842 5587100 5761947 5947803 6143859
58233F143859K08759K24310K39347K53343K69433K88040L06368L24864L47325
$$ 6143859 6352618 6576928 6816275 7069618 7339051 7627091 7933459 8258323 8605648
58224H605648L73893M00958M28535M60511M97273N35746N76830O24709O78769
$$ 8605648 8979541 9380499 9809034 10269545 10766818 11302564 11879394 12504103 13182872
58215A3182872P34904P94894Q65385R47726J038429J139323J257027J393151J546299
$$ 13182872 13917776 14712670 15578055 16525781 17564210 18703533 19960560 21353711 22900010
58206B2900010J723052J935141K187299K481268K830475L256998L777353M408605
$$ 22900010 24623062 26558203 28745502 31226770 34057245 37314243 41091596 45500201
58198D5500201N187118O165019P393547Q930902J0859932J3270004J6219405J9728428
$$ 45500201 50687319 56852338 64245885 73176787 84036719 97306723 113526128 133254556
58190A33254556K3776728K8239213L2788251L6836336L9493932L9533060L5593442
$$ 133254556 157031284 185270497 218058748 254895084 294389016 333922076 369515518
58183C69515518K6878985J4019408p54213j4537017k5105594l1619061l4364852
$$ 369515518 396394503 410413911 409659698 395122681 370017087 338398026 304033174
58176C04033174l4145648l1877084k8402701k4360221k0144715j6009545j2148419
$$ 304033174 269887526 238010442 209607741 185247520 165102805 149093260 136944841
58169A36944841q687268n755851l670867k908143l684872n563769p616505r036942
$$ 136944841 128257573 122501722 118830855 115922712 112237840 106674071 99057566 90020624
58161I0020624r560907r357246q693593p775572o766384n794566m921601m157021
$$ 90020624 80459717 71102471 62408878 54633306 47866922 42072356 37150755 32993734
58153C2993734l506836k977754k551779k195921j893436j641992j430977j245038
$$ 32993734 29486898 26509144 23957365 21761444 19868008 18226016 16795039 15550001
58145A5550001j083211r53305q52069p67620o95920o39590n95421n56367n21248
$$ 15550001 14466790 13513485 12661416 11893796 11197876 10558286 9962865 9406498 8885250
58136H885250m91053m60823m25572l88952l56560l26186k93548k61724k35900
$$ 8885250 8394197 7933374 7507802 7118850 6762290 6436104 6142556 5880832 5644932
58127E644932k14483j94205j78693j72996j74117j75018j73830j71902j67337
$$ 5644932 5430449 5236244 5057551 4884555 4710438 4535420 4361590 4189688 4022351
58118D022351j58069j47391j39332j32087j22262j11734j04110r8207r1139q4138
$$ 4022351 3864282 3716891 3577559 3445472 3323210 3211476 3107366 3009159 2918020 2833882
58108B833882p9504p5488o9850o4833o3021o2010n8751n5369n4970n5318n2668
$$ 2833882 2754378 2678890 2609040 2544207 2481186 2419176 2360425 2305056 2250086 2194768 2142100
58097B142100m8609m7056m7365m6260m4117m3513m3663m1899l8887l7203l6368
$$ 2142100 2093491 2046435 1999070 1952810 1908693 1865180 1821517 1779618 1740731 1703528 1667160
58086A667160l4106l0924k8875k7423k4929k2615k2592k3604k2989k1459k1696
$$ 1667160 1633054 1602130 1573255 1545832 1520903 1498288 1475696 1452092 1429103 1407644 1385948
58075A385948k3588k4902k5413k6369k7089k5996k3959k2968k2508k0751j8303
$$ 1385948 1362360 1337458 1312045 1285676 1258587 1232591 1208632 1185664 1163156 1142405 1124102
58064A124102j7234j7344j6707j5093j3783j2826j1474j0440j0868j1954j2164
$$ 1124102 1106868 1089524 1072817 1057724 1043941 1031115 1019641 1009201 998333 986379 974215
58053I74215j1833j2100j2499j2097j1655j2123j2480j1676j1054j2065j3172
$$ 974215 962382 950282 937783 925686 914031 901908 889428 877752 866698 854633 841461
58042H41461j2083r632q343q411q181p523p509p659o635n076m923o361p982r314
$$ 841461 829378 819746 811403 802992 794811 787288 779779 772120 765485 760409 755486 749125 741143 731829
58028G31829j0783j1934j2079j1930j2254j1982r992p695p221q016p914o716o002
$$ 731829 721046 709112 697033 685103 672849 660867 650875 643180 635959 627943 620029 613313 607311
58015F07311o098n972n528n481n382m366l233l348m024l445j738o91q01j025j043
$$ 607311 601213 595241 589713 584232 578850 574484 571251 567903 563879 560434 558696 558005 557204 556179 555136
58000E55136j403j754j224l04j99n96k38P06J033Q91J530K953M009M604N628O886
$$ 555136 553733 551979 550755 550451 550252 549656 549418 550124 551157 552048 553578 556531 560540 565144 570772 577658
57984E77658P212O555N913N320L897J861M45j63r96k367l595m547n785p078p476
$$ 577658 584870 591425 597338 602658 606555 608416 608861 608698 607702 605335 601740 597193 591408 584330 576854
57969E76854o808n807m845m037m044n234o388o038m699m088m464m561l906l365
$$ 576854 570046 564239 559394 555357 551313 546079 539691 533653 528954 524866 520402 515841 511935 508570
57955E08570l373l492l656m270m993m934m117l425l135k780k222j658q97J84R48
$$ 508570 505197 501705 498049 493779 488786 483852 479735 476310 473175 470395 468173 466515 465618 465802 466750
57940D66750J078J612L455N524O180N793O012P024P488O935O193N589M675L742
$$ 466750 467828 469440 472895 478419 484599 490392 496404 503428 510916 517851 524044 529633 534308 538050
57926E38050L719M453M791M424M060L791K933J481K01q13k161l741m880n769p261
$$ 538050 541769 546222 551013 555437 559497 563288 566221 567702 567903 567090 564929 561188 556308 550539 543278
57911E43278r137j0165j0000r638r798j0052r721q591o866n277m882n765o598
$$ 543278 534141 523976 513976 504338 494540 484488 474767 466176 459310 454033 449151 443386 436788
57898D36788o542o613p807q943q315o488n306m868l861k357j673j687r07O96J479
$$ 436788 430246 423633 415826 406883 398568 392080 386774 381906 378045 375688 374015 372328 371421 372117 373596
57883C73596J076J075K222L328L591L811M454M601L734K768K402K094J497J278
$$ 373596 374672 375747 377969 381297 384888 388699 393153 397754 401488 404256 406658 408752 410249 411527
57869D11527J733K146K227K563K958K104j72k004k014j296j671l099m127l909
$$ 411527 413260 415406 417633 420196 423154 425258 425086 423082 421068 419772 418101 415002 410875 406966
57855D06966k721j136K99J157J543J944K384K445K250K515L315L958M280M908
$$ 406966 404245 403109 403408 404565 406108 408052 410436 412881 415131 417646 420961 424919 429199 434107
57841D34107N825N921M623K850J733J266P96m0j367l167m854n597n436n249n384
$$ 434107 439932 445853 450476 453326 455059 456325 457121 457081 455714 452547 447693 442096 436660 431411 426027
57826D26027n283m726m336m439m427l772k758j785p70L36J299K094K931L590L641
$$ 426027 420744 416018 411682 407243 402816 399044 396286 394501 393731 394067 395366 397460 400391 403981 407622
57811D07622L350L406L698L487K823K516K641K408J629Q64j39k415n677p934q060
$$ 407622 410972 414378 418076 421563 424386 426902 429543 431951 433580 434444 434305 431890 426213 418279 410219
57796D10219p275p155p520p365o689o242o230o364o461o281n472m341l844m142
$$ 410219 402944 395789 388269 380904 374215 367973 361743 355379 348918 342637 337165 332824 328980 324838
57782C24838m079k865j353p62r64r39l46L36P98J190J696K391L297M193M743N035
$$ 324838 320759 317894 316541 315779 314815 313876 313530 313866 314664 315854 317550 319941 323238 327431 332174 337209
57766C37209N531O288O830O902O699O089M527J922j123m161p139r648j0966j1153
$$ 337209 342740 349028 355858 362760 369459 375548 380075 381997 380874 376713 369574 359926 348960 337807
57752C37807j1142j1273j0792r203p159n473m214l191k423j628k59J414K242J830
$$ 337807 326665 315392 304600 295397 288238 282765 278551 275360 272937 271309 271050 272464 274706 276536
57738B76536J243J436J962J906J226M54j56l89J76J409K324K262J833J960K611
$$ 276536 277779 279215 281177 283083 284309 284763 284607 284218 284394 285803 288127 290389 292222 294182 296793
57723B96793L085L006K535K047K007K594L108K519Q75o37j284j540j940k231k179
$$ 296793 299878 302884 305419 307466 309473 312067 315175 317694 318569 317932 316648 315108 313168 310937 308758
57708C08758k086j969j244Q9J037J063R14J316J930K402L287M891O200O233N651
$$ 308758 306672 304703 303459 303548 304585 305648 306562 307878 309808 312210 315497 320388 326588 332821 338472
57693C38472N815O839P648P471O239M070J366r25k165k791l446l834l273j897
$$ 338472 344287 351126 358774 366245 372484 376554 377920 376995 374830 372039 368593 364759 361486 359589
57679C59589m10J009K701M755P120J0214J4645K0561K7894L6944M8020O0843P4948
$$ 359589 359179 360188 362889 367644 374764 384978 399623 420184 448078 485022 533042 593885 668833
57666F68833R0116J05388J17527J21096J10602Q3379M1848o190n0387q2657j00300
$$ 668833 758949 864337 981864 1102960 1213562 1296941 1338789 1332599 1282212 1199555 1099255
57655A099255j05291j01506r2751q1909p0522n9116m8280l9007l1764k6091k1555
$$ 1099255 993964 892458 799707 717798 647276 588160 539880 500873 469109 443018 421463
57644D21463j8317j6150j3957j1122q451o839n714l966j825n64o29j152j189o09
$$ 421463 403146 386996 373039 361917 353466 346627 340913 336947 335122 334558 333929 332777 331588 330979
57630C30979K49R52J102O60J18o7MPj66n95j402k244k376j700j097j214j577j504
$$ 330979 331228 332180 333282 333942 334060 333993 333997 334004 333838 333243 331841 329597 327221 325521 324424 323210 321633 320129
57612C20129j153r60q19o00p47j445j813r32P32J849J840J214P13P76J404J942
$$ 320129 318976 318016 317197 316597 315850 314405 312592 311660 312392 314241 316081 317295 318008 318784 320188 322130
57596C22130J501K01p10n77k95p35j294j125q51j576k906l449k893k081j361m42
$$ 322130 323631 323832 323122 322545 322250 321515 320221 319096 318245 316669 313763 310314 307421 305340 303979 303537
57580C03537L13Pj200k018j768j127r20j206j743k276k238j134M55J228P68Jk11
$$ 303537 303850 303857 302657 300639 298871 297744 296824 295618 293875 291599 289361 288227 288682 289910 290678 290679 290468
57563B90468j45n20j440k346k602j891m90P60J169R13P11R53J553K439L526M412
$$ 290468 290323 289803 288363 286017 283415 281524 281034 281794 282963 283876 284587 285540 287093 289532 293058 297470
57547B97470M643M195L195J504p53k638l218k721k056j425k94J362K837L673M010
$$ 297470 302113 306308 309503 311007 310254 307616 304398 301677 299621 298196 297902 299264 302101 305774 309784
57532C09784L881L081J900J134J077J250J282J385J692J802J348N48r6l11j61
$$ 309784 313665 316746 318646 319780 320857 322107 323389 324774 326466 328268 329616 330164 330068 329757 329596
57517C29596Q0O5k26l14J56Q01Q91K61o15j293j595j373o73J2K16J37K96O82Q48
$$ 329596 329676 329741 329515 329201 329357 330158 331049 331310 330695 329402 327807 326434 325761 325773 325989 326126 326422 327104 327952
57498C27952P10N81M89J66k94m69l02j82k55k31N7M21O76P31L71m98j396j590
$$ 327952 328662 329243 329732 329898 329604 329135 328833 328651 328396 328165 328222 328643 329319 330050 330421 329923 328527 326937
57480C26937r84k75j07m03n89k19O18J315J360J015R91J353J353P61N14J349K506
$$ 326937 325953 325678 325571 325168 324579 324360 324978 326293 327653 328668 329659 331012 332365 333126 333640 334989 337495
57463C37495K862K728L321M730N696N421M496L766L335K984K726K581K380K134
$$ 337495 340357 343085 346406 351136 356832 362253 366749 370515 373850 376834 379560 382141 384521 386655
57449C86655K069K155K147K155K558L243L523L106K563K531K931L216L143K959
$$ 386655 388724 390879 393026 395181 397739 400982 404505 407611 410174 412705 415636 418852 421995 424954
57435D24954L002L252L301K826K069J618J692K000K381K939L428L221K402J997
$$ 424954 427956 431208 434509 437335 439404 441022 442714 444714 447095 450034 453462 456683 459085 461082
57421D61082K496K939K351J385J412K485L409L546L335L161K865K530K688L511
$$ 461082 463578 466517 468868 470253 471665 474150 477559 481105 484440 487601 490466 492996 495684 499195
57407D99195M531N286N658N565M966M255L967M198M682N313N946O057N387M608
$$ 499195 503726 509012 514670 520235 525201 529456 533423 537621 542303 547616 553562 559619 565006 569614
57393E69614M545M975N044M677M588N041N578N914O231O585O792O941P240P462
$$ 569614 574159 579134 584178 588855 593443 598484 604062 609976 616207 622792 629584 636525 643765 651227
57379F51227P291O933O672O119M875L613L415M185M807M762M508M404M347M436
$$ 651227 658518 665451 672123 678242 683117 686730 690145 694330 699137 703899 708407 712811 717158 721594
57365G21594M842N112M678M012M106M895N419N501N866O556O696O164N991O625
$$ 721594 726436 731548 736226 740238 744344 749239 754658 760159 766025 772581 779277 785441 791432 798057
57351G98057P164O949O716P406Q782R916J0359J0236R789R300Q954Q529P755O952
$$ 798057 805221 812170 818886 826292 835074 844990 855349 865585 875374 884674 893628 902157 909912 916864
57337I16864O668O858P208P968R380J0546J0360R419R417J0523J1046J0113Q986
$$ 916864 923532 930390 937598 945566 954946 965492 975852 985271 994688 1005211 1016257 1026370 1035356
57324A035356R013R775J0191J0121R977R800R624R828J0380J0673J0611J0836
$$ 1035356 1044369 1054144 1064335 1074456 1084433 1094233 1103857 1113685 1124065 1134738 1145349 1156185
57312A156185J1392J1414J0807J0813J2063J3310J3256J2424J2082J2346J2556
$$ 1156185 1167577 1178991 1189798 1200611 1212674 1225984 1239240 1251664 1263746 1276092 1288648
57301A288648J2664J2942J3004J2417J1774J1951J2696J3035J2790J2680J3123
$$ 1288648 1301312 1314254 1327258 1339675 1351449 1363400 1376096 1389131 1401921 1414601 1427724
57290A427724J3784J4244J4385J4233J3866J3333J2523J1449J0733J1116J2313
$$ 1427724 1441508 1455752 1470137 1484370 1498236 1511569 1524092 1535541 1546274 1557390 1569703
57279A569703J3175J3289J3438J4077J4459J3917J3032J2748J3180J3966J4964
$$ 1569703 1582878 1596167 1609605 1623682 1638141 1652058 1665090 1677838 1691018 1704984 1719948
57268A719948J5855J6017J5565J5559J6421J7118J6829J6353J6818J7873J8410
$$ 1719948 1735803 1751820 1767385 1782944 1799365 1816483 1833312 1849665 1866483 1884356 1902766
57257A902766J8271J8042J7766J7137J6462J6273J6445J6624J7054J7920J8537
$$ 1902766 1921037 1939079 1956845 1973982 1990444 2006717 2023162 2039786 2056840 2074760 2093297
57246B093297J8242J7578J7453J7636J7333J6810J7076J8188J9077J9054J8414
$$ 2093297 2111539 2129117 2146570 2164206 2181539 2198349 2215425 2233613 2252690 2271744 2290158
57235B290158J7702J7291J7588J8680J9906K0566K0868K1409K2085K2427K2592
$$ 2290158 2307860 2325151 2342739 2361419 2381325 2401891 2422759 2444168 2466253 2488680 2511272
57224B511272K3032K3438K3115K2257K1750K1839K1958K1863K1946K2418K3020
$$ 2511272 2534304 2557742 2580857 2603114 2624864 2646703 2668661 2690524 2712470 2734888 2757908
57213B757908K3583K4080K4236K3837K3364K3464K3946K4089K3768K3489K3441
$$ 2757908 2781491 2805571 2829807 2853644 2877008 2900472 2924418 2948507 2972275 2995764 3019205
57202C019205K3363K3364K3903K4890K5535K5281K4365K3455K3158K3626K4213
$$ 3019205 3042568 3065932 3089835 3114725 3140260 3165541 3189906 3213361 3236519 3260145 3284358
57191C284358K3875K2455K1025K0312J9478J7476J4921J3318J2817J2183J0849
$$ 3284358 3308233 3330688 3351713 3372025 3391503 3408979 3423900 3437218 3450035 3462218 3473067
57180C473067R623R173R176R210R339R492R273Q785Q656Q987R135Q927R066R858
$$ 3473067 3482690 3491863 3501039 3510249 3519588 3529080 3538353 3547138 3555794 3564781 3573916 3582843 3591909 3601767
57166C601767J0492J0218R534R506J0375J1428J1977J1979J1900J2152J2567J2409
$$ 3601767 3612259 3622477 3632011 3641517 3651892 3663320 3675297 3687276 3699176 3711328 3723895 3736304
57154C736304J1232R608Q517Q042P292N662L556J730M83k61o60r77j474j981j917
$$ 3736304 3747536 3757144 3765661 3773703 3780995 3786657 3790213 3791943 3792426 3792165 3791505 3790528 3789054 3787073 3785156
57139C785156r79N09K013L267M240N006N780O772P835Q467Q279P332O026M798
$$ 3785156 3784177 3784686 3786699 3789966 3794206 3799212 3804992 3811764 3819599 3828066 3836345 3843677 3849703 3854501
57125C854501L910L346K992K946L597N250Q004J1935J7110K3262K9837L6512M3213
$$ 3854501 3858411 3861757 3864749 3867695 3871292 3876542 3884546 3896481 3913591 3936853 3966690 4003202 4046415
57112D046415M9601N5215O0388O6277P3603Q2218R2379J05485J22728J43884J68505
$$ 4046415 4096016 4151231 4211619 4277896 4351499 4433717 4526096 4631581 4754309 4898193 5066698
57101E066698J97704K33740K78400L33012L99640M80965N79004O94816Q29067
$$ 5066698 5264402 5498142 5776542 6109554 6509194 6990159 7569163 8263979 9093046
57092I093046R81430J149049J326288J505980J680139J839910J976304K081666
$$ 9093046 10074476 11223525 12549813 14055793 15735932 17575842 19552146 21633812
57084B1633812K149983K175442K150175K061692J890789J614102J214966O98606
$$ 21633812 23783795 25959237 28109412 30171104 32061893 33675995 34890961 35589567
57076C5589567J00574n19752j097585j582037j946352k186479k312828k342484
$$ 35589567 35690141 35170389 34072804 32490767 30544415 28357936 26045108 23702624
57068B3702624k295372k192492k053388j893676j724815j555388j391596j236933
$$ 23702624 21407252 19214760 17161372 15267696 13542881 11987493 10595897 9358964
57060I358964j092890r60450q40494p33165o37845n53920m80909m18006l64133
$$ 9358964 8266074 7305624 6465130 5731965 5094120 4540200 4059291 3641285 3277152
57051C277152l18335k79547k46371k17752j93449j73094j55420j39351j25186
$$ 3277152 2958817 2679270 2432899 2215147 2021698 1848604 1693184 1553833 1428647
57042A428647j13507j03484r3625q3765p4870o7227o0280n3956m8576m3657l8402
$$ 1428647 1315140 1211656 1118031 1034266 959396 892169 831889 777933 729357 685700 647298
57031F47298l3274k9411k6564k3322j9302j5379j1712p456k465K681Q555J6714
$$ 647298 614024 584613 558049 534727 515425 500046 488334 480878 478413 481094 489649 506363
57019E06363K7464M0030N5197P5217J00592J29506J60228J89382K05720J91338
$$ 506363 533827 573857 629054 704271 804863 934369 1094597 1283979 1489699 1681037
57009A681037J35936N0012l9876j09767j50964j67310j66151j53946j36283j17531
$$ 1681037 1816973 1866985 1827109 1717342 1566378 1399068 1232917 1078971 942688 825157
56999H25157r9914q4042p0209n8632m9146m1415l5187l0080k5552k1389j7730
$$ 825157 725243 641201 570992 512360 463214 421799 386612 356532 330980 309591 291861
56988B91861j4493j1265p985n168l265k156j539j442k158l948o775j0150j3210
$$ 291861 277368 266103 258118 252950 249685 247529 245990 244548 242390 238442 231667 221517 208307
56975B08307j5160j5762j5243j3974j2283j0418q440o324m241k477r65O82K534
$$ 208307 193147 177385 162142 148168 135885 125467 117027 110703 106462 103985 103020 103702 106236
56962A06236M239N855Q120J1458J5193J8211J9899J9955J7831J3227O946N24m924
$$ 106236 110475 116330 124450 135908 151101 169312 189211 209166 226997 240224 247170 247694 242770
56949B42770r077j1850j3135j3123j2386j1392j0149q365n896l099o89R71K409
$$ 242770 233693 221843 208708 195585 183199 171807 161658 153293 147397 144298 143609 144580 146989
56936A46989M481P404J0784J4440J8394K1956K3766K3079K0199J5380Q369l60
$$ 146989 151470 158874 169658 184098 202492 224448 248214 271293 291492 306872 315241 314881
56924C14881q901j5426j9635k2006k2470k0985j8696j7071j6149j4762j2423r876
$$ 314881 305980 290554 270919 248913 226443 205458 186762 169691 153542 138780 126357 116481
56912A16481p851o375n380m964m788m074k602j059j57K2k23n60m87M26J977L502
$$ 116481 108630 102255 96875 91911 87123 83049 80447 79388 79231 79253 79030 78470 77983 78409 80386 83888
56896H3888M705N802O767P253P459Q344J0433J2992J4977J6302J7518J8514J8251
$$ 83888 88593 94395 101162 108415 115874 124218 134651 147643 162620 178922 196440 214954 233205
56883B33205J5897J1659O444J135l655p488j0160j1733j2251j1545r605o999m527
$$ 233205 249102 260761 267205 268340 264685 257197 247037 235304 223053 211508 201903 194904 190377
56870A90377k369K4L079O525R934J3386J7280K1722K6609L1926L7375M1864M3860
$$ 190377 188008 188032 191111 197636 207570 220956 238236 259958 286567 318493 355868 397732 441592
56857D41592M2225L6364K6055J2071l132j6277k5245k9785l0538k8274k4198j9805
$$ 441592 483817 520181 546236 558307 555175 538898 513653 483868 453330 425056 400858 381053
56845C81053j5795j1649o748j318M160R860J6439K4276L3253M2906N2521O1316
$$ 381053 365258 353609 346861 345543 349703 359563 376002 400278 433531 476437 528958 590274
56833E90274O8512P2633P1007O1120M3074J9983m246k6690m4980n6882o1649o0917
$$ 590274 658786 731419 802426 863546 906620 926603 922357 895667 850687 793805 732156 671239
56821F71239n7053n1178m3661l5568k8208k1600j4789p500k90O816J4544K3094
$$ 671239 614186 563008 519347 483779 455571 433971 419182 411682 411392 418208 432752 455846
56809D55846L1689L9572M6379N1064N1414M5379L2691J5104m456k2762l7139m6267
$$ 455846 487535 527107 573486 624550 675964 721343 754034 769138 764682 741920 704781 658514
56797F58514n0318n0334m7527m3066l7961l2816k7700k2370j6708j1042o015j955
$$ 658514 608196 557862 510335 467269 429308 396492 368792 346422 329714 318672 312657 310702
56785C10702J640N632J0248J4953J9303K3125K5473K4308J8209Q162l020j2941
$$ 310702 312342 317974 328222 343175 362478 385603 411076 435384 453593 461755 458735 445794
56773D45794k0765k6488l0037l1248l0283k7769k4707k2029j9978j8083j5944
$$ 445794 425029 398541 368504 337256 306973 279204 254497 232468 212490 194407 178463
56762A78463j3822j2095j0610r036p536o500n858n189m441l932l785l721l435
$$ 178463 164641 152546 141936 132900 125364 118864 113006 107817 103376 99444 95659 91938 88503
56749H8503k804j917j138r05j156j252q65n18q10j417j562j131p37p78j006r63
$$ 88503 85699 83782 82644 81739 80583 79331 78466 77948 77138 75721 74159 73028 72291 71513 70507 69544
56733F9544m00O01J506J576P17k07l37J71O21Q49J128J300Q69l2n54j60P56J411
$$ 69544 69144 69745 71251 72827 73544 73337 73000 73171 73792 74641 75769 77069 77938 77906 77352 77192 77948 79359
56715G9359J414R45N11N15Q41R79P67O30Q09P78k6j246k037k152j993j822j589
$$ 79359 80773 81718 82229 82744 83585 84564 85331 85961 86770 87548 87522 86276 84239 82087 80094 78272 76683
56698G6683j354j187q32p0P16R87Q46P35N75N2m23r0Q08J012n7j443j916j435
$$ 76683 75329 74142 73310 73240 73956 74943 75789 76524 77099 77151 76728 76638 77446 78458 78401 76958 75042 73607
56680G3607q50o61o83o90q57j441k346l147l580l842m286m804m856m146k972j849
$$ 73607 72757 72096 71413 70723 69866 68425 66079 62932 59352 55510 51224 46420 41564 37418 34446 32597
56664C2597j187j383k528l792l858k488r95n66q70r71q85j072j077j5J748K795
$$ 32597 31410 30027 27499 23707 19849 17361 16366 15800 14930 13959 13074 12002 10925 10910 12658 15453
56648A5453K670K506L329M705N603N773N749N886N943N486M509L697L858M912
$$ 15453 18123 20629 23958 28663 34266 40039 45788 51674 57617 63103 67612 71309 75167 80079
56634H0079N760N568M738M073L507K523J417J060J523J957J981K091K477K444
$$ 80079 85839 91407 96145 100218 103725 106248 107665 108725 110248 112205 114186 116277 118754 121198
56620A21198J560N30L18R09J507J569J190O99L14J40K14N14Q38P34j88j581k316
$$ 121198 122758 123288 123606 124515 126022 127591 128781 129480 129794 129934 130148 130662 131500 132234 132046 130465 128149
56603A28149j590QJ008N79p11j670j593p26J28M25L99O05R93R58M06k0n0k57q77
$$ 128149 126559 126567 127575 128154 127443 125773 124180 123454 123582 124007 124406 125011 126004 126962 127368 127348 127298 127041 126164
56584A26164j069k39P95R66N48M71O88N31J81L15O24K05o47o01O40J900K370K546
$$ 126164 125095 124856 125651 126617 127165 127636 128324 128855 129036 129351 129975 130180 129533 128932 129572 131472 133842 136388
56566A36388K899L045K837L082M390O180P543Q398R241J0327J1554J2585J2732
$$ 136388 139287 142332 145169 148251 152641 158821 166364 174762 184003 194330 205884 218469 231201
56553B31201J1302Q478N393L089J848J508J774K079J877J309R08O16p8j007j328
$$ 231201 242503 250981 256374 259463 261311 262819 264593 266672 268549 269858 270766 271382 271304 270297 268969
56538B68969r41r08j983l506m347m238l698l255l241l820m729n313n151m441l624
$$ 268969 268028 267120 265137 261631 257284 253046 249348 246093 242852 239032 234303 228990 223839 219398 215774
56523B15774l021k883l252l747l905l789l739l735l591l512l681l547k543j323
$$ 215774 212753 209870 206618 202871 198966 195177 191438 187703 184112 180600 176919 173372 170829 169506
56509A69506j157k018k514j890q91l65k62l78r40j774j988j254m78n14r31q40
$$ 169506 168349 166331 163817 161927 161036 160671 160409 160031 159091 157317 155329 154075 153597 153083 152152 151312
56493A51312k00L10K99j03n45o00o1O13O95K09JN16J240J556J426J024M23q4j67
$$ 151312 151112 151422 151721 151618 151073 150473 150412 151025 151720 151929 151930 152446 153686 155242 156668 157692 158115 158031 157864
56474A57864j42o64j539j731q41M03J335K037K540K470J934J688J938K010J690
$$ 157864 157722 157058 155519 153788 152947 153350 154685 156722 159262 161732 163666 165354 167292 169302 170992
56459A70992J678K144K130J191M21Q29J767K097J911J908J888J202K09r5M10R14
$$ 170992 172670 174814 176944 178135 178556 179385 181152 183249 185160 187068 188956 190158 190367 190272 190682 191596
56443A91596R94J013J198J202P23L6k83M5O19O46j12p84m35M89O61j52p04j81
$$ 191596 192590 193603 194801 196003 196726 196762 196479 196524 197143 197789 197677 196893 196458 196947 197608 197456 196752 196571
56425A96571P62J386K003K895L211K114L11p15n03K12P01P54L64l50j079j681
$$ 196571 197333 198719 200722 203617 206828 208942 209253 208538 208035 208247 208948 209702 210066 209716 208637 206956
56409B06956k275k713k507j624p00j52K47N89M64j24m75k07K08M47Q62J523J877
$$ 206956 204681 201968 199461 197837 197137 196985 197232 197821 198285 198161 197686 197479 197687 198134 198996 200519 202396
56392B02396J974K775M454N638N335M479M400M859M841M368M059L722K775J600
$$ 202396 204370 207145 211599 217237 222572 227051 231451 236310 241151 245519 249578 253300 256075 257675
56378B57675J076J187J261J188J234J050L4j602l169m548n901o728o280m731l055
$$ 257675 258751 259938 261199 262387 263621 264671 264705 263103 259934 255386 249485 242757 236477 231746 228691
56363B28691j966j608j831k077j553k81O28N04J08K86N49J56l70j31M58L60l16
$$ 228691 226725 225117 223286 221209 219656 219375 220003 220507 220615 220901 221450 221606 221236 221105 221563 221923 221607
56346B21607o77o86r43j205p51M9J13m83n26L86J321J538J313J075R49J286K410
$$ 221607 220930 220244 219301 218096 217345 217394 217507 217024 216498 216884 218205 219743 221056 222131 223080 224366 226776
56329B26776L669L915L127K514K718L090L048L019L452L779L182J774M63p4J36
$$ 226776 230445 234360 237487 240001 242719 245809 248857 251876 255328 259107 262289 264063 264526 264452 264588
56314B64588O27Q63M97m43j516k092j738p02O5j52q73r38qJ121J831K359K916
$$ 264588 265215 266078 266575 266132 264616 262524 260786 260084 260149 259997 259124 258186 258178 259299 261130 263489 266405
56297B66405L103K789K574K749K671J842Q05K77K11L73Q75J442J266L12k89m6
$$ 266405 269508 272297 274871 277620 280291 282133 282938 283215 283426 283799 284674 286116 287382 287694 287405 287359
56281B87359k0r06j535o95Q40J604J637J742J623P09m2P52K443L022K040J026
$$ 287359 287339 286433 284898 284203 285043 286647 288284 290026 291649 292358 292316 293068 295511 298533 300573 301599
56265C01599J077J741K375K932L274L060K484K125K055K023K178K629K812K442
$$ 301599 302676 304417 306792 309724 312998 316058 318542 320667 322722 324745 326923 329552 332364 334806
56251C34806K422L559M982N308M787M674N048N017M662M921N690N834N145M671
$$ 334806 337228 340787 345769 351077 355864 360538 365586 370603 375265 380186 385876 391710 396855 401526
56237D01526N050N884O669P067O496M888L433L139L158K125O09K46R16R24j50
$$ 401526 406576 412460 419129 426196 432692 437580 441013 444152 447310 449435 450044 450290 451206 452130 451980
56222D51980r82r13p14p15k96M62N56n4j86M86Q75M59Q9L27O31O75R24J400J353
$$ 451980 450998 450085 449371 448656 448360 448822 449378 449324 449138 449624 450499 450958 451047 451374 452005 452680 453604 455004 456357
56203D56357O62J51J18m0m52m75o3N0j33K50J307K109K282K416K618K309J701
$$ 456357 457019 457170 457288 457248 456796 456321 456258 456308 456175 456425 457732 459841 462123 464539 467157 469466 471167
56186D71167J901L104M192M411M083L477K567K015K666L891M115L250K779L219
$$ 471167 473068 476172 480364 484775 488858 492335 494902 496917 499583 503474 507589 510839 513618 516837
56172E16837L468K991K673K915K874K237J952K458K910K878L091L843M311M201
$$ 516837 520305 523296 525969 528884 531758 533995 535947 538405 541315 544193 547284 551127 555438 559639
56158E59639M384N262O053O367O916Q010Q884R164R433R916J0198J0676J2449
$$ 559639 564023 569285 575338 581705 588621 596631 605515 614679 624112 634028 644226 654902 667351
56145F67351J5249J7325J7995J8622K0375K2852K5455K8281L1012L2871L4525
$$ 667351 682600 699925 717920 736542 756917 779769 805224 833505 864517 897388 931913
56134I31913L8160M4828N3508O3465P5515Q9830J04299J16062J23218J24363J18465
$$ 931913 970073 1014901 1068409 1131874 1207389 1297219 1401518 1517580 1640798 1765161 1883626
56123A883626J06398R1173P5774O1987N1445M5595M3642M2249L8291L0702J9671
$$ 1883626 1990024 2081197 2156971 2218958 2270403 2315998 2359640 2401889 2440180 2470882 2490553
56112B490553O352o213j4372j7381j8033j9414k3108l0711m3917o1724p9927r4812
$$ 2490553 2496905 2490692 2476320 2458939 2440906 2421492 2398384 2367673 2323756 2262032 2182105 2087293
56100B087293j05350j11083j10702j04240r4265q3231p1601n9720m9123m0488
$$ 2087293 1981943 1870860 1760158 1655918 1561653 1478422 1406821 1347101 1297978 1257490
56090A257490l2589k4796j8457j4303j0846o924l622k021j111M45K452M547P232
$$ 1257490 1224901 1200105 1181648 1167345 1156499 1149575 1145953 1143932 1142821 1143266 1145718 1150265 1157497
56077A157497J0107J1332J0488R722J0541J1659J1643J1271J1569J1885J1725
$$ 1157497 1167604 1178936 1189424 1199146 1209687 1221346 1232989 1244260 1255829 1267714 1279439
56066A279439J2166J3649J4623J4317J4466J6433J8872K0199K1109K2650K4056
$$ 1279439 1291605 1305254 1319877 1334194 1348660 1365093 1383965 1404164 1425273 1447923 1471979
56055A471979K4465K4689K5375K5678K5353K5765K7075K7130K4990K2833K2339
$$ 1471979 1496444 1521133 1546508 1572186 1597539 1623304 1650379 1677509 1702499 1725332 1747671
56044A747671K2144K0963K0263K1330K2609K2516K2262K3296K4604K5114K6079
$$ 1747671 1769815 1790778 1811041 1832371 1854980 1877496 1899758 1923054 1947658 1972772 1998851
56033A998851K8611L1480L3805L7001M1638M5407M6882M8111N0829N3366N4238
$$ 1998851 2027462 2058942 2092747 2129748 2171386 2216793 2263675 2311786 2362615 2415981 2470219
56022B470219N5364N8488O1833O3534O5153O8364P1504P2945P4553P8198Q2201
$$ 2470219 2525583 2584071 2645904 2709438 2774591 2842955 2914459 2987404 3061957 3140155 3222356
56011C222356Q4904Q8284R4196J00456J04562J07887J12371J16739J19931J24386
$$ 3222356 3307260 3395544 3489740 3590196 3694758 3802645 3915016 4031755 4151686 4276072
56001D276072J31773J39421J45164J51603J61080J71125J79556J89332K03018
$$ 4276072 4407845 4547266 4692430 4844033 5005113 5176238 5355794 5545126 5748144
55992E748144K17366K29152K41467K58035K76067K91424L06211L24415L44589
$$ 5748144 5965510 6194662 6436129 6694164 6970231 7261655 7567866 7892281 8236870
55983H236870L63878L84954M11821M43095M76296N14006N58792O07455O57660
$$ 8236870 8600748 8985702 9397523 9840618 10316914 10830920 11389712 11997167 12654827
55974A2654827P14402P82195Q57584R37831J029590J139646J265124J403675J564920
$$ 12654827 13369229 14151424 15009008 15946839 16976429 18116075 19381199 20784874 22349794
55965B2349794J760123J989630K254039K568920K954509L421504L984401M679799
$$ 22349794 24109917 26099547 28353586 30922506 33877015 37298519 41282920 45962719
55957D5962719N555283O653203Q026343R755603J1925055J4586903J7765921K1461318
$$ 45962719 51518002 58171205 66197548 75953151 87878206 102465109 120231030 141692348
55949A41692348K5580455K9845956L3747934L6498662L6970258L3849165K6263642
$$ 141692348 167272803 197118759 230866693 267365355 304335613 338184778 364448420
55942C64448420J4613023Q22795j2412734k2878525k9606397l2766414l3105897
$$ 364448420 379061443 379884238 367471504 344592979 314986582 282220168 249114271
55935B49114271l1500296k8753570k5505846k2186806j9045852j6221437j3774700
$$ 249114271 217613975 188860405 163354559 141167753 122121901 105900464 92125764
55928I2125764j1696481r939062q458362p220326o184852n310347m570933l951844
$$ 92125764 80429283 70490221 62031859 54811533 48626681 43316334 38745401 34793557
55920C4793557l432628k989970k611484k292036k020680j783968j577545j402102
$$ 34793557 31360929 28370959 25759475 23467439 21446759 19662791 18085246 16683144
55912A6683144j251667j117043r96918q94605q07102p27508o55169n93798n42121
$$ 16683144 15431477 14314434 13317516 12422911 11615809 10888301 10233132 9639334 9097213
55903I097213m95407m53735m20065l92276l65211l38785l16485k97653k78440
$$ 9097213 8601806 8148071 7728006 7335730 6970519 6631734 6315249 6017596 5739156
55894E739156k58793k41583k26251k09889j93204j79192j67107j53621j38854
$$ 5739156 5480363 5238780 5012529 4802640 4609436 4430244 4263137 4109516 3970662
55885C970662j25608j13649r9995q4011o7311m9513k8773n628J7778M1030O3887
$$ 3970662 3845054 3731405 3631410 3547399 3480088 3430575 3401802 3396174 3413952 3454982 3518869
55874C518869Q2683R2391R1189P9636N7278K4126j6214n8772j00839j39824j70043
$$ 3518869 3601552 3693943 3785132 3864768 3922046 3946172 3929958 3871186 3770347 3630523 3460480
55863C460480j86562j90704j87507j79259j65813j49366j33764j19897j06298
$$ 3460480 3273918 3083214 2895707 2716448 2550635 2401269 2267505 2147608 2041310
55854B041310r3596q3982p7074p0622o4711o1102n8894n5270n0246m6564m4814
$$ 2041310 1947714 1863732 1786658 1716036 1651325 1590223 1531329 1476059 1425813 1379249 1334435
55843A334435m2720l9365l6328l4215l1649k8237k5355k3472k1556j9533j8569
$$ 1334435 1291715 1252350 1216022 1181807 1150158 1121921 1096566 1073094 1051538 1032005 1013436
55832A013436j8683j8521j7775j7357j7247j6507j5368j4938j5044j4671j4246
$$ 1013436 994753 976232 958457 941100 923853 907346 891978 877040 861996 847325 833079
55821H33079j5004j6412j6730j5936j5563j5834j5416j3996j2608j1514j0011
$$ 833079 818075 801663 784933 768997 753434 737600 722184 708188 695580 684066 674055
55810F74055q312p293o506m756k539j547j834j752p29J58M52R05J721K249K576
$$ 674055 665743 658450 651944 647188 644649 643102 641268 639516 638787 638945 639397 640302 642023 644272 646848
55795F46848L381M188L769K349J447J453J294N48J2K0K1j42j40k91j195k483l679
$$ 646848 650229 654417 658186 660535 661982 663435 664729 665277 665289 665309 665330 665188 665048 664757 663562 661079 657400
55778F57400n798j0108j5579j9684k1558k2286k2236k0490j7049j3416j0472p681
$$ 657400 651602 641494 625915 606231 584673 562387 540151 519661 502612 489196 478724 471043
55766D71043m814k682j742j468j502j989k652k947l140l851m683m836m850o010
$$ 471043 466229 463547 461805 460337 458835 456846 454194 451247 448107 444256 439573 434737 429887 423877
55752D23877q149r734j0121j0012r766r058q193p970q203p913p047o351n773m738
$$ 423877 415728 405994 395873 385861 376095 367037 358844 350874 342671 334758 327711 321360 315587 310849
55738C10849l788l940m588m101k525j545j618j419m08K25k09q52j211k087l804
$$ 310849 307061 303121 298533 294432 291907 290362 288744 287325 286917 287142 286933 286081 284870 282783 278979
55723B78979n224n469n092m743m169l261k737k930l136k764k070j264j72Q78J128
$$ 278979 273755 268286 263194 258451 254282 251021 248284 245354 242218 239454 237384 236120 235948 236826 237954
55708B37954Q60J372K942M144L802K422J084N3q83j762k713m071n672o809p148
$$ 237954 238814 240186 243128 247272 251074 253496 254580 254633 253750 251988 249275 245204 239532 232723 225575
55693B25575o915o194m928l625l011l013l081l278l887m286l607k316j598j319
$$ 225575 218660 212466 207538 203913 200902 197889 194808 191530 187643 183357 179750 177434 175836 174517
55679A74517l27J342K339K207J864J656P73j014k708l617l952l715k610j250o79
$$ 174517 174190 175532 177871 180078 181942 183598 184371 183357 180649 177032 173080 169365 166755 165505 164826
55664A64826n13M96J888J771R5q09J99J407J267P53J192J875J643J117J485K361
$$ 164826 164313 164809 166697 168468 168563 167754 167953 169360 170627 171380 172572 174447 176090 177207 178692 181053
55648A81053K663K517K709L187L520L915M463M313K936J290M66L8r74k400l486
$$ 181053 183716 186233 188942 192129 195649 199564 204027 208340 211276 212566 213032 213070 212096 209696 206210
55633B06210m326n365o128n794m609l545l012k817k828k835k408j714j648k307
$$ 206210 201884 196519 190391 184597 179988 176443 173431 170614 167786 164951 162543 160829 159181 156874
55619A56874k351r63N70O64j13M9J340K080J167p03k352l379l904m033l903l628
$$ 156874 154523 153560 154130 154794 154681 154730 156070 158150 159317 158614 156262 152883 148979 144946 141043 137415
55603A37415l112k286j502j240j591k222k643k298r82N93J242P10m8k81l14n15
$$ 137415 134303 132017 130515 129275 127684 125462 122819 120521 119539 120132 121374 122084 122036 121755 121441 120926
55587A20926m73R8N15J47m84m95P7O95J356K270L025L119K930L268M263N448O627
$$ 120926 120453 120551 121066 121213 120729 120234 120311 121006 122362 124632 127657 130776 133706 136974 141237 146685 153312
55570A53312P942R293J0448J1417J2226J2602J2278J1210R194N950K005j285l214
$$ 153312 161254 170547 180995 192412 204638 217240 229518 240728 249922 255872 257877 256592 253378
55557B53378m536o177p985r354j0309j1045j1224j0577r586q722p673o172m859
$$ 253378 248842 242665 234680 225326 215017 203972 192748 182171 172585 163863 156190 150018 145159
55544A45159m384m361m112l753l561l074j841m62K11K70J51l43j242j490k95J284
$$ 145159 140775 136414 132302 128549 124988 121914 120073 119611 119822 120092 120243 119900 118658 117168 116873 118157
55528A18157J592P50J28ln34j432j539o32Ln24j703k894m244n857p276q270r085
$$ 118157 119749 120499 120627 120624 120090 118658 117119 116487 116490 115966 114263 111369 107125 101268 93992 85722 76637
55511G6637r500q779p000n288m235l169j626l62n5K5R90K672L945M333M251L947
$$ 76637 67137 58358 51358 46070 41835 38666 37040 36678 36623 36648 37638 40310 44255 48588 52839 56786
55495E6786L150J847O91L36P90J533K008J910J294N88L10N47P53L26m94p38N4
$$ 56786 59936 61783 62474 62810 63600 65133 67141 69051 70345 70933 71243 71790 72543 72869 72375 71637 71691
55478G1691J021R62o0r06j093j329k035k369j573m22k86j179j847j526o92j9M01
$$ 71691 72712 73674 73614 72708 71615 70286 68251 65882 64309 63887 63601 62422 60575 59049 58357 58338 58739
55461E8739O83P21M33J0k40r6M60J085J253Q84M87M02L62K06L60R46J131K80p45
$$ 58739 59422 60143 60576 60586 60346 60250 60710 61795 63048 63932 64419 64821 65183 65389 65749 66695 67826 68106 67361
55442F7361o34M31J071Q13O30J215J934J882J017j14j037j383j037n40o62j281
$$ 67361 66727 67158 68229 69042 69672 70887 72821 74703 75720 75606 74569 73186 72149 71609 70947 69666
55426F9666j379m68O79J139R88Q38Q64P93N45L55M62R71J824K688L157L181L055
$$ 69666 68287 67819 68498 69637 70625 71463 72327 73120 73665 74020 74482 75453 77277 79965 83122 86303 89358
55409H9358K855K312J325K19o85j363j797j807j422j097j255j780k181k112j637
$$ 89358 92213 94525 95850 96069 95384 94021 92224 90417 88995 87898 86643 84863 82682 80570 78933
55394G8933j106q58r16j021j032j116j369j548j441j192r02l02O61J280Q97l5
$$ 78933 77827 76969 76053 75032 74000 72884 71515 69967 68526 67334 66432 66130 66791 68071 68968 68933
55378F8933m39r4K59K60L59P34P50j6r43j161o24J34Q26J449J810J656J166Q38
$$ 68933 68494 68400 68659 68919 69278 70012 70762 70746 69803 68642 68018 68152 68978 70427 72237 73893 75059 75897
55360G5897R27J264J536J527J148M61l04q11q12l29K73N35L88K20L81P18Q72P46
$$ 75897 76824 78088 79624 81151 82299 82760 82456 81645 80833 80504 80777 81312 81700 81920 82301 83019 83891 84637
55342H4637L53m12j441k118j888j062m62l30j92K53P09Q44P71P74R39J191J287
$$ 84637 84990 84578 83137 81019 79131 78069 77607 77277 77085 77338 78047 78891 79662 80436 81375 82566 83853
55325H3853Q57j54j160j502j285j150j278j209o53J44Q20J129P38m18j521j443
$$ 83853 84710 84556 83396 81894 80609 79459 78181 76972 76319 76463 77283 78412 79150 78732 77211 75768
55309G5768j96R13R01J81l10l22j66k3K7k88j056j819k002j497n04Q00K047K563
$$ 75768 75572 76485 77386 77567 77257 76935 76769 76746 76773 76485 75429 73610 71608 70111 69607 70407 72454 75017
55291G5017K041J104P02J048J509J427P61n0n35n73m32m01l73o0M33O43M29J45
$$ 75017 77058 78162 78864 79912 81421 82848 83609 83559 83024 82451 82019 81618 81245 81185 81618 82261 82690 82835
55273H2835lk91p81q75r4R68J105n3j537k076j413m17kj00J04R48J700J503N89
$$ 82835 82832 82541 81760 80885 80791 81759 82864 82811 81274 79198 77785 77368 77366 77266 77370 78318 80018 81521 82110
55254H2110k3J31N74Q34R80J007N42l35o94P1J153J199J06q62p45L9N41N38M85
$$ 82110 82087 82218 82792 83626 84606 85613 86155 85820 85126 85197 86350 87549 87655 86793 86048 86087 86628 87166 87651
55235H7651N02J19q24j550j088L56J423J170J34n03m60l80o31q12m93K01Q98J416
$$ 87651 88153 88272 87448 85898 84810 85166 86589 87759 87893 87390 86930 86550 85919 85107 84614 84815 85713 87129
55217H7129J674J612J299Q33J45p06j151o30M74J119R16M59K59P2l67p69p77m64
$$ 87129 88803 90415 91714 92547 92692 91986 90835 90205 90679 91798 92714 93173 93432 93504 93137 92368 91591 91127
55199I1127Q5R85J904J942Q06n22r46n93l46n33q45j134j451j560j143m64r1j18
$$ 91127 91212 92197 94101 96043 96849 96327 95381 94788 94442 93909 93064 91930 90479 88919 87776 87312 87221 87103
55181H7103k35l86p23j089j176j070j005p58lQ59J070O68M25N65M89l3l15J11
$$ 87103 86868 86482 85759 84670 83494 82424 81419 80661 80658 81517 82587 83255 83680 84245 84734 84701 84386 84497
55163H4497O73P41O82J177K008K396K236K086J993J399L11l51p8L52m9j051j572
$$ 84497 85170 85911 86593 87770 89778 92174 94410 96496 98489 99888 100199 99848 99770 100122 100073 99022 97450
55146I7450j210n68k10j00j61n48j052r73j04P61Q80N39L88K78l21j089j056j14
$$ 97450 96240 95672 95462 95362 95201 94653 93601 92628 92524 93285 94165 94704 95092 95370 95049 93960 92904 92790
55128I2790P07O80K91K82N17L69k31p30p26l82j57l58q32j025n34L04P24M69M0
$$ 92790 93497 94177 94468 94750 95267 95636 95405 94675 93949 93567 93410 93052 92220 91195 90661 90965 91689 92158 92198
55109I2198p2O2J47J84L36O97J345K230K828K446J148r7n34l89l06m31n81p00
$$ 92198 92126 92188 92335 92519 92855 93552 94897 97127 99955 102401 103549 103452 102918 102529 102223 101792 101211 100511
55091A00511p13l03N86J356J398Q33J11p12j688k270j755l99O85Q20L42k00p76
$$ 100511 99798 99495 100081 101437 102835 103668 103779 103067 101379 99109 97354 96955 97640 98460 98802 98602 97826
55074I7826j496k023j883j163m99k96k94J1O82J304J574J584J391P45l57j199
$$ 97826 96330 94307 92424 91261 90762 90466 90172 90183 90865 92169 93743 95327 96718 97463 97106 95907
55058I5907j075k93K42L39O09J127J056jj198j595j321r24l04P33J482J029k93
$$ 95907 94832 94539 94781 95120 95729 96856 97912 97911 96713 95118 93797 92873 92569 93302 94784 95813 95520
55041I5520j192j106o61m53k95N0K93J71k1J22M90P35Q40J057J333J204L49q54
$$ 95520 94328 93222 92561 92108 91813 91863 92156 92327 92306 92428 92918 93653 94493 95550 96883 98087 98436 97582
55023I7582j509j146k64K40J86J25K88J54n91j245q92L78J595K007J586P37Oj31
$$ 97582 96073 94927 94663 94903 95089 95214 95502 95656 95065 93820 92928 93306 94901 96908 98494 99231 99237 99106
55005I9106K20L35j67o05r9J083J842J757J454J467J548J338R85P94P25O38N51
$$ 99106 99326 99661 99494 98889 98790 99873 101715 103472 104926 106393 107941 109279 110264 111058 111783 112421 112972
54988A12972M74K40j86n47n82l20J7K20J66j07l54l88k94k47j83P2M88Q45J032
$$ 112972 113446 113686 113500 112953 112371 112051 112068 112288 112454 112347 111993 111605 111311 111064 110881 110953 111441 112286 113318
54969A13318J067R80Q62Q38P72L35l78o99k64L72N07K96L10N24M28nk82k25j41
$$ 113318 114385 115365 116227 117065 117837 118172 117794 117095 116831 117203 117710 118006 118316 118840 119268 119263 118981 118756 118615
54950A18615j78j70j07j78l61m85o05p90p66l34N9j5j00M87J330J304K73o43o24
$$ 118615 118437 118267 118160 117982 117621 117136 116531 115741 114975 114641 114700 114685 114585 115072 116402 117706 117979 117336 116712
54931A16712R6J074K133K769K310J108M95J037J780J849J697K096K882L629M697
$$ 116712 116808 117882 120015 122784 125094 126202 126697 127734 129514 131363 133060 135156 138038 141667 146364
54916A46364O625R016J0921J1927J2096J1373R894Q348P104N357K160j978n467
$$ 146364 152989 162005 172926 184853 196949 208322 218216 226564 233668 239025 241185 239207 233740
54903B33740p483q595r532j0224j0247r515q317o998n841m912m099l398l012k864
$$ 233740 226257 217662 208130 197906 187659 178144 169827 162829 156988 152076 147977 144579 141567 138703
54889A38703k373j209N7N70L06m1r3q0j20J44J055K490L997N057N336N048M997
$$ 138703 136330 135121 135178 135748 136054 136013 135920 135840 135720 135864 136919 139409 143406 148463 153799 158847 163844
54872A63844N819P250Q548R520J0579J1715J2036J0528P062K511j796m830o509
$$ 163844 169663 176913 185461 194981 205560 217275 229311 239839 246901 249412 247616 242786 236277
54859B36277p655q992j0196j0308r118p577o721o570o374n606m458l558l368l772
$$ 236277 228622 219630 209434 199126 190008 182431 175710 169140 162766 157160 152702 149144 145776 142004
54845A42004m153m045l667l541l633l297k279j226r35j325j565j108k21M52N70
$$ 142004 137851 133806 130139 126598 122965 119668 117389 116163 115228 113903 112338 111230 111009 111461 112031
54830A12031K87Ml5M5r3m83o67j77P73J376J092K82k43j44J99L08J75Q4R9j2l17
$$ 112031 112318 112322 112287 112332 112239 111756 111089 110912 111685 113061 114153 114435 114192 114048 114247 114555 114730 114814 114913 114901 114584
54809A14584m85j56N44J098J157R16P59O84L03n65j524j974j690q46K64J240J594
$$ 114584 114099 113943 114487 115585 116742 117658 118417 119101 119404 118839 117315 115341 113651 112805 113069 114309 115903
54792A15903J236Q23J060J616J489N27k26q4K54j12q23r16l88l0qL07J130J905
$$ 115903 117139 117962 119022 120638 122127 122654 122428 122344 122598 122486 121663 120747 120359 120329 120321 120628 121758 123663
54774A23663K256K346K248J831J462J844K911L809M193M611N298N731N864O620
$$ 123663 125919 128265 130513 132344 133806 135650 138561 142370 146563 151174 156472 162203 168067 174687
54760A74687Q411J0183J0919J1097J1615J1964J0804P914M239L33l931q090j0837
$$ 174687 183098 193281 204200 215297 226912 238876 249680 257594 261833 262166 258235 250145 239308
54747B39308j1464j0631r441q390p530o897o313n408m162l109k697k749k776k573
$$ 239308 227844 217213 207772 199382 191852 184955 178642 173234 169072 165963 163266 160517 157741 155168
54733A55168k275k053j852j388m85M76P49J92k52L99J865L042L540M068N189O532
$$ 155168 152893 150840 148988 147600 147115 147591 148340 148532 148280 148679 150544 153586 157126 161194 166383 172915
54717A72915P555Q379R397J0481J1022J0527Q777N740J759k271n360p138q054
$$ 172915 180470 188849 198246 208727 219749 230276 239053 244793 246552 244281 238921 231783 223729
54704B23729q778r518r883r439q317p116o201n361m351l457l100l085k782k005
$$ 223729 214951 205433 195550 186111 177794 170678 164477 159116 154765 151308 148208 145123 142341 140336
54690A40336j252j003j243j712k151k185j454j84P49O40l60j568k427k665k121
$$ 140336 139084 138081 136838 135126 132975 130790 129336 129152 129901 130541 130181 128613 126186 123521 121400
54675A21400q97M77J380J617J410R85M35r6m11n17o14o64l34M25R46N39m66r45
$$ 121400 120503 120980 122360 123977 125387 126372 126807 126711 126300 125783 125169 124505 124171 124596 125542 126081 125615 124670
54657A24670m58Q9k37r95j013j76M82M15K46N15P52M51J29N05J266J483R79M12
$$ 124670 124212 124301 124064 123069 122056 121880 122362 122777 123023 123538 124290 124741 124870 125375 126641 128124 129103 129515
54639A29515K92O13J211J685J290j94j655j686m26O27P20O17J058J484R70l30
$$ 129515 129807 130420 131631 133316 134606 134412 132757 131071 130645 131272 131992 132609 133667 135151 136121 135791
54623A35791j388j576j145p55q31j220j314p79j56k27q00q76j57N21N78O07J272
$$ 135791 134403 132827 131682 130927 130096 128876 127562 126783 126627 126400 125600 124724 124567 125088 125666 126273 127545
54606A27545K066K092J431Q11L11m69j223j067NP85M17m74o99RR41J475J568J428
$$ 127545 129611 131703 133134 133945 134256 133787 132564 131497 131502 132287 132704 132230 131531 131540 132481 133956 135524 136952
54588A36952J205J021R12O75J44l80l65J43L52k94j200j259k37R22J290Q92L34
$$ 136952 138157 139178 140090 140765 140909 140529 140164 140307 140659 140365 139165 137906 137669 138591 139881 140773 141107
54571A41107RjL07P35Q42M76J14K41O70R65J215J729K216K044J272O83O94R60
$$ 141107 141116 141115 141422 142157 142999 143475 143589 143830 144500 145465 146680 148409 150625 152669 153941 154624 155318 156278
54553A56278J107J178J159Q07K12j30j10k16n74n41K49J056R08p6q53p01K60J488
$$ 156278 157385 158563 159722 160529 160741 160611 160501 160285 159711 159170 159419 160475 161383 161307 160454 159753 160013 161501
54535A61501K400K560K035J464J395J660J707J388J070J052J268J459J412J119
$$ 161501 163901 166461 168496 169960 171355 173015 174722 176110 177180 178232 179500 180959 182371 183490
54521A83490Q77R63J131P57k48j108j150o08j10J69K96l0j077k241k494j674p27
$$ 183490 184367 185330 186461 187218 186970 185862 184712 184104 183994 184163 184459 184429 183352 181111 178617 176943 176216
54504A76216n02q64j121q68k72J84J22l39o11l67qp2l43j66M71Q02M34rK43J069
$$ 176216 175714 174850 173729 172861 172589 172773 172895 172556 171945 171578 171570 171498 171155 170989 171460 172262 172696 172687 172930 173999
54484A73999J650J512R77P25J061J581J570Q16J5R1J121K254K715K550K276K203
$$ 173999 175649 177161 178138 178863 179924 181505 183075 183891 183906 183997 185118 187372 190087 192637 194913 197116
54468A97116K363K752L305L731L715L252K617K008J427Q56L72J16J46L51M67K46
$$ 197116 199479 202231 205536 209267 212982 216234 218851 220859 222286 223142 223514 223630 223776 224127 224594 224840
54452B24840k87p96q90m74J80O94Q35O10J76k04k41J39N79M77m33j713k631k874
$$ 224840 224553 223757 222867 222393 222573 223267 224102 224712 224888 224684 224443 224582 225161 225638 225205 223492 220861 217987
54434B17987k668k301j854j400j077q35m39K9Rq88k234l114l013k126r52J13Q24
$$ 217987 215319 213018 211164 209764 208687 207852 207413 207442 207451 206563 204329 201215 198202 196076 195124 195237 196061
54417A96061J048Q26L85J8m6K76Q32J338J563J435R63K84k79m65m36n53q17q89
$$ 196061 197109 197935 198320 198338 198292 198568 199400 200738 202301 203736 204699 204983 204704 204239 203803 203250 202433 201544
54399B01544p59q88j351j431n04J001K071K276J965J498R49M60K89L70L15L1p3
$$ 201544 200785 199897 198546 197115 196611 197612 199683 201959 203924 205422 206371 206831 207120 207490 207805 207836 207763
54382B07763L30R32J010J94j039j675j166j30K08n05j347j370q22n87q31r28m77
$$ 207763 208093 209025 210035 210229 209190 207515 206349 206219 206427 205922 204575 203205 202383 201796 200965 200037 199560
54365A99560K96J075J661J674P83n89j431j230m09L81Q47R07O15L81O57J089P09
$$ 199560 199856 200931 202592 204266 205049 204460 203029 201799 201390 201771 202618 203525 204140 204521 205178 206267 206976
54348B06976o82j976k147j604j501k109k610k399j869j789k307k810k610j665
$$ 206976 206294 204318 202171 200567 199066 196957 194347 191948 190079 188290 185983 183173 180563 178898
54334A78898o52k96o07r88j073j090j243j241p62j25O0k79o61q41j089j539j724
$$ 178898 178246 177950 177343 176355 175282 174192 172949 171708 170946 170821 170881 170602 169941 169100 168011 166472 164748
54317A64748j165j75L62J31j85J53Q49R47J93o00p16m52m22m90j12O64J225J361
$$ 164748 163583 163408 163770 163901 163716 163869 164718 165665 165858 165258 164542 164090 163668 163178 163066 163730 164955 166316
54299A66316J340J166N39l04o18k65L6j21k20J13K67l72j259j406q26l84m79p06
$$ 166316 167656 168822 169361 169057 168439 168174 168210 168089 167869 167982 168249 167877 166618 165212 164386 164002 163523 162817
54281A62817p28o40m46K9N50M81l57j311j713j645j623j765j605o49R55K310K450
$$ 162817 162089 161449 161003 161032 161582 162063 161706 160395 158682 157037 155414 153649 152044 151395 152350 154660 157110
54264A57110J306j69j014j173j074p03K24J329J637Q20k64o16k31J75J45j83m78
$$ 157110 158416 158247 157233 156060 154986 154283 154507 155836 157473 158293 158029 157413 157182 157357 157502 157319 156841
54247A56841n09k20J77L10J24pJ46K19k19r15j187q13k28J64L37K58k84j140j536
$$ 156841 156332 156112 156289 156599 156723 156716 156862 157081 156862 155947 154760 153947 153719 153883 154220 154478 154194 153054 151518
54228A51518q66M54J349J216L47n95j161j167o73j39j13o01j003q71m20p1J39
$$ 151518 150652 151106 152455 153671 154018 153423 152262 151095 150422 150283 150170 149569 148566 147695 147275 147204 147343
54211A47343L47M27K62J87N14Q46M70n51j352j416j112r05o85k39J96L33L41M95
$$ 147343 147690 148117 148379 148566 149080 149926 150396 149845 148493 147077 145965 145060 144375 144136 144332 144665 145006 145501
54193A45501O35M71J32n6r1j65k17o6K25N15Q82J275J137O9j272j724j098m16
$$ 145501 146136 146607 146739 146683 146592 146427 146210 146144 146369 146884 147766 149041 150178 150247 148975 147251 146153 145737
54175A45737n03j002j079n02L32R98J206P74j50r68j162q27m19j83q9j69m96q54
$$ 145737 145234 144232 143153 142651 142983 143981 145187 145961 145811 144843 143681 142854 142435 142252 142163 141994 141498 140644
54157A40644p90j23P52J179Q97L27J53N66R72P18l1m77k83j2k48o93n67K75J181
$$ 140644 139854 139731 140483 141662 142559 142886 143039 143605 144577 145295 145264 144787 144504 144492 144244 143551 142984 143259 144440
54138A44440J539J344R60P03P71J207J651J556Q52K45M56J267J656R31n33j714
$$ 144440 145979 147323 148283 148986 149757 150964 152615 154171 155023 155268 155724 156991 158647 159578 159045 157331
54122A57331j948j350m94N8K3n30j173j372q67J20J051J415J053L17j26J28Q00
$$ 157331 155383 154033 153539 153597 153620 153090 151917 150545 149678 149798 150849 152264 153317 153634 153508 153636 154436
54105A54436J265J327J309J352J085L66k11r8K34j18j058j477q33R2M10K72K54
$$ 154436 155701 157028 158337 159689 160774 161140 160929 160831 161065 160947 159889 158412 157579 157671 158081 158353 158607
54088A58607K01m00j313j699j310p92o94q85j064j170j084n14M41J136J149Q42
$$ 158607 158808 158408 157095 155396 154086 153294 152600 151715 150651 149481 148397 147883 148324 149460 150609 151451
54072A51451P75R52J065J081J199J362J330J077Q02O71Q19J333J932J957J133
$$ 151451 152226 153178 154243 155324 156523 157885 159215 160292 161094 161765 162584 163917 165849 167806 168939
54057A68939O8n22p40j105j487j301o29j83r6L07J217J825J613J309J781K684
$$ 168939 169007 168485 167745 166640 165153 163852 163223 163040 162944 163251 164468 166293 167906 169215 170996 173680
54041A73680L051K703K197J782J385J350K164L467M305M431M462M647M477L820
$$ 173680 176731 179434 181631 183413 184798 186148 188312 191779 196084 200515 204977 209624 214101 217921
54027B17921L485M055M987N479N623N894O029N299L716K192J512J637J985J972
$$ 217921 221406 225461 230448 235927 241550 247444 253473 258772 262488 264680 266192 267829 269814 271786
54013B71786J328L89m2M09J002N61j090k943m034m354m382m316m113l826l535
$$ 271786 273114 273503 273461 273870 274872 275433 274343 271400 267366 263012 258630 254314 250201 246375 242840
53998B42840l215k986l210l861m107l103j264j36o57j981k467j611m86k62r35
$$ 242840 239625 236639 233429 229568 225461 222358 221094 220958 220301 218320 215853 214242 213756 213494 212559
53983B12559j800k578l457m180l981k643j089m37p30j080r00n14n50j089j637
$$ 212559 210759 208181 204724 200544 196563 193920 192831 192394 191664 190584 189684 189170 188620 187531 185894
53968A85894j755j448r32k36P83J982K748K629K039J876K335K551J800O06J72
$$ 185894 184139 182691 181759 181523 182306 184288 187036 189665 191704 193580 195915 198466 200266 200872 201044
53953B01044Q87K008K698K801K535K051J592J552J986K330K093J623J720K598
$$ 201044 201931 203939 206637 209438 211973 214024 215616 217168 219154 221484 223577 225200 226920 229518
53939B29518L624M238M615N227O099O854P327P672P896P778P368P158P436P878
$$ 229518 233142 237380 241995 247222 253321 260175 267502 275174 283070 290848 298216 305374 312810 320688
53925C20688Q144Q552R664J1390J3091J4361J5025J4418J1613O757J430k834n812
$$ 320688 328832 337384 347048 358438 371529 385890 400915 415333 426946 433703 435133 432299 426487
53912D26487p895q868q243o387m332k647j181J20R96J469J878K215K023J170O8
$$ 426487 418592 409724 401481 395094 390762 388115 386934 387054 388050 389519 391397 393612 395635 396805 396873
53897C96873r14j714k186k163k035k524l591m323m210l864l958m293m467m799
$$ 396873 395959 394245 392059 389896 387861 385337 381746 377423 373213 369349 365391 361098 356631 351832
53883C51832n715o758p132o916o866p122p040o294n329m551l853l129k637k496
$$ 351832 346117 339359 332227 325311 318445 311323 304283 297989 292660 288109 284256 281127 278490 275994
53869B75994k456k423k699l334l789l691l462l644l956l679k839k238k306k491
$$ 275994 273538 271115 268416 265082 261293 257602 254140 250496 246540 242861 240022 237784 235478 232987
53855B32987k105j241n59n04j047j921k745l038k577j716j004n50r6K95K05l25
$$ 232987 230882 229641 229082 228578 227531 225610 222865 219827 217250 215534 214530 213980 213884 214179 214384 214059
53839B14059n26J26J085J387R07K99j19o78j477j930j607r61p02q39q86p15o46
$$ 214059 213533 213659 214744 216131 217038 217337 217218 216540 215063 213133 211526 210565 209863 209024 208138 207423 206777
53822B06777p20n45J0M84M82K61L57P57R33N61o3m70m86j83M03J107J449J094
$$ 206777 206057 205512 205522 206006 206488 206749 207106 207863 208796 209357 209294 208824 208338 208155 208558 209665 211114 212208
53804B12208N22O48J621K579K909L136L917M756M664L877L703M566N335N099M471
$$ 212208 212730 213378 214999 217578 220487 223623 227540 232296 236960 240837 244540 249106 254441 259540 264011
53789B64011M441M786M608L865L289L111K882K426K035J767J404J125J300J552
$$ 264011 268452 273238 277846 281711 285000 288111 290993 293419 295454 297221 298625 299750 301050 302602
53775C02602R86l76j369j341j156j924l353m188l815k798k049k067k783l628l949
$$ 302602 303588 303212 301843 300502 299346 297422 294069 289881 286066 283268 281219 279152 276369 272741 268792
53760B68792l723l611l932m025l225j998j357j374j246o82k81l02j20P15J705
$$ 268792 265069 261458 257526 253501 250276 248278 246921 245547 244301 243619 243338 243036 242916 243631 245336
53745B45336K312L001M646P258J0143J3004J6149J9469K1770K1326J6979Q974
$$ 245336 247648 250649 255295 262553 272696 285700 301849 321318 343088 364414 381393 390367
53733C90367p79r417j4808j6868j7001j6361j5057j2987j0613q544o877n483m529
$$ 390367 389588 380171 365363 348495 331494 315133 300076 287089 276476 267932 261055 255572 251043
53720B51043m209m234m103l784l558l342k641j320J24J114J489J360R18N34O18
$$ 251043 246834 242600 238497 234713 231155 227813 225172 223852 223976 225090 226579 227939 228857 229391 230009
53705B30009J085J296Q97L74M72J240K037K364K292K119J977J877J870K011K306
$$ 230009 231094 232390 233287 233661 234133 235373 237410 239774 242066 244185 246162 248039 249909 251920 254226
53690B54226K623K669K175J335Q98J441K596L329L020J966P94j89r17j295j339
$$ 254226 256849 259518 261693 263028 263926 265367 267963 271292 274312 276278 277072 276883 275966 274671 273332
53675B73332j300j318j165o59r3Q6l1N6L71K97n44j589j917j322m61RJ11K39M33
$$ 273332 272032 270714 269549 268890 268797 268883 268852 268908 269279 269576 269032 267443 265526 264204 263743 263752 263863 264102 264535
53656B64535K94m95j633k376k240j471p72o05q22r66p61k48L18O05L23m62j186
$$ 264535 264829 264334 262701 260325 258085 256614 255842 255237 254415 253449 252688 252440 252758 253363 253686 253224 252038
53639B52038j203m68L56O17L66K00O04J564K770L894M634M728M191L526L428M094
$$ 252038 250835 250367 250723 251340 251706 251906 252510 254074 256844 260738 265372 270100 274291 277817 281245 285339
53623B85339M920N014M100K729J591Q37K56j81l32m09q58j604j838j024K60R43
$$ 285339 290259 295273 299373 302102 303693 304530 304786 304605 304273 303864 303006 301402 299564 298540 298800 299743
53607B99743P49L72M49R04J388J806K160K238J859J255Q69Q84J035Q86J93q61
$$ 299743 300492 300864 301313 302217 303605 305411 307571 309809 311668 312923 313792 314676 315711 316597 316790 315929
53591C15929j699j771j021P3R13J123N98m13j249j331q86p94j438k120k031j401
$$ 315929 314230 312459 311438 311511 312424 313547 314145 313732 312483 311152 310266 309472 308034 305914 303883 302482
53575C02482j101j352j505j150p05o56p73n12J07N01K74l51q85j084j013p89l89
$$ 302482 301381 300029 298524 297374 296669 296013 295240 294728 294835 295336 295610 295259 294374 293290 292277 291488 291099
53558B91099K23Q81J240J182J040J201J544J566J152Q51J154J734J863J487J431
$$ 291099 291322 292203 293443 294625 295665 296866 298410 299976 301128 301979 303133 304867 306730 308217 309648
53543C09648K317L638M340M172L996M617N700O238N814N033M682M957N627O566
$$ 309648 311965 315603 319943 324115 328111 332728 338428 344666 350480 355513 360195 365152 370779 377345
53529C77345P744Q977J0002J0739J1249J1576J1851J2391J3349J4354J4875J4995
$$ 377345 385089 394066 404068 414807 426056 437632 449483 461874 475223 489577 504452 519447
53517E19447J5361J6365J7726J9045K0370K1842K3155K3843K4012K4314K5076
$$ 519447 534808 551173 568899 587944 608314 630156 653311 677154 701166 725480 750556
53506G50556K5880K6161K5946K5663K5396K4843K3972K3348K3423K3838K3849
$$ 750556 776436 802597 828543 854206 879602 904445 928417 951765 975188 999026 1022875
53495A022875K3414K3284K3935K4855K5233K4978K4604K4349K3941K3144K2107
$$ 1022875 1046289 1069573 1093508 1118363 1143596 1168574 1193178 1217527 1241468 1264612 1286719
53484A286719K1068K0105J9216J8359J7299J5786J3934J2178J0705R332P943O658
$$ 1286719 1307787 1327892 1347108 1365467 1382766 1398552 1412486 1424664 1435369 1444701 1452644 1459302
53472A459302N380L663J360j058l194n388q140j1182j3760j5664j7302j8760j9575
$$ 1459302 1464682 1468345 1469705 1468647 1465453 1460065 1451925 1440743 1426983 1411319 1394017 1375257 1355682
53459A355682j9691j9909k0927k2359k3392k4045k5088k6731k8135k8432k7712
$$ 1355682 1335991 1316082 1295155 1272796 1249404 1225359 1200271 1173540 1145405 1116973 1089261
53448A089261k6623k5433k3975k2327k0980k0278k0033j9766j9101j7822j5933
$$ 1089261 1062638 1037205 1013230 990903 969923 949645 929612 909846 890745 872923 856990
53437H56990j3755j1747j0073q531p026n701m435k648j0K909N224O787Q122R546
$$ 856990 843235 831488 821415 812884 805858 800157 795722 793074 793064 795973 801197 807984 816106 825652
53423H25652J0939J2445J4597J7430K0055K1636K2343K3026K4219K5897K7829
$$ 825652 836591 849036 863633 881063 901118 922754 945097 968123 992342 1018239 1046068
53412A046068K9719L1196L2184L3137L4556L6397L8371M0529M3010M5421M7251
$$ 1046068 1075787 1106983 1139167 1172304 1206860 1243257 1281628 1322157 1365167 1410588 1457839
53401A457839M8882N1272N4424N7002N8032N8279N9186O0883O2167O2299O1933
$$ 1457839 1506721 1557993 1612417 1669419 1727451 1785730 1844916 1905799 1967966 2030265 2092198
53390B092198O2038O2633O3022O2782O1951O0503N8135N4701N0516M6120M1933
$$ 2092198 2154236 2216869 2279891 2342673 2404624 2465127 2523262 2577963 2628479 2674599 2716532
53379B716532L8193L4979L2090K8980K5101K0360J5221J0267N720J387l024p660
$$ 2716532 2754725 2789704 2821794 2850774 2875875 2896235 2911456 2921723 2927443 2928830 2925806 2918146
53367B918146j2638j8274k5002l2938m1535m9780n6872o2590o7020p0066p1545
$$ 2918146 2905508 2887234 2862232 2829294 2787759 2737979 2681107 2618517 2551497 2481431 2409886
53356B409886p1713p1351p1062p0750o9935o8487o6677o4706o2601o0591n9139
$$ 2409886 2338173 2266822 2195760 2125010 2055075 1986588 1919911 1855205 1792604 1732013 1672874
53345A672874n8382n7838n6913n5469n3713n1815m9870m8018m6269m4335m1938
$$ 1672874 1614492 1556654 1499741 1444272 1390559 1338744 1288874 1240856 1194587 1150252 1108314
53334A108314l9150l6187l3064k9798k6800k4457k2425j9888j6674j3561j1228
$$ 1108314 1069164 1032977 999913 970115 943315 918858 896433 876545 859871 846310 835082
53323H35082r436p605n709m045k534r11O04J484J846K571M212O268P805Q580R239
$$ 835082 825646 818041 812332 808287 805753 804842 805446 806930 808776 811347 815559 821827 829632 838212 847451
53308H47451J0536J2527J4516J5803J6483J7393J9104K1178K2830K4050K5465
$$ 847451 857987 870514 885030 900833 917316 934709 953813 974991 997821 1021871 1047336
53297A047336K7170K8465K9038K9627L0989L2762L3997L4398L4393L4193L3565
$$ 1047336 1074506 1102971 1132009 1161636 1192625 1225387 1259384 1293782 1328175 1362368 1395933
53286A395933L2407L0857K8820K6063K2940K0271J8252J6082J3094R708O826M634
$$ 1395933 1428340 1459197 1488017 1514080 1537020 1557291 1575543 1591625 1604719 1614427 1621253 1625887
53274A625887K600L65j956m348p139j0461j3850j6660j8792k0758k3066k5682
$$ 1625887 1628487 1628852 1626896 1622548 1615409 1604948 1591098 1574438 1555646 1534888 1511822 1486140
53262A486140k8155l0208l2058l4035l6088l7868l9246m0346m1078m1006l9977
$$ 1486140 1457985 1427777 1395719 1361684 1325596 1287728 1248482 1208136 1167058 1126052 1086075
53251A086075l8537l7386l6521l5311l3372l1110k9374k8769k9241l0137l0650
$$ 1086075 1047538 1010152 973631 938320 904948 873838 844464 815695 786454 756317 725667
53240G25667l0433k9790k9122k8393k7349k6090k4884k3483k1262j8215j5332
$$ 725667 695234 665444 636322 607929 580580 554490 529606 506123 484861 466646 451314
53229D51314j3542j2691j2010j1219j0573j0022r100p766o663o217o021n560n048
$$ 451314 437772 425081 413071 401852 391279 381257 372157 364391 357728 351511 345490 339930 334882
53216C34882m996n212m994m251l749l977m398m167l228k273j854j932k193k360
$$ 334882 329886 324674 319680 315429 311680 307703 303305 299138 295910 293637 291783 289851 287658 285298
53202B85298k252j839j334j010r23j001j268j754k231k381k210k021j984k060
$$ 285298 283046 281207 279873 278863 277940 276939 275671 273917 271686 269305 267095 265074 263090 261030
53188B61030k262k640k934k728k046j477j381j454j305j076j073j116p95j99J62
$$ 261030 258768 256128 253194 250466 248420 246943 245562 244108 242803 241727 240654 239538 238743 238544 238706
53173B38706R6p8j10j20k15k49j19O4K66O23J063J198Q85N27M64L70k82j352k063
$$ 238706 238802 238724 238614 238494 238279 238030 237911 237975 238241 238864 239927 241125 242010 242537 243001 243371 243089 241737 239674
53154B39674j917j137j88O86J340J566J349J006Q36P70N71K35j06m32o98o14L7
$$ 239674 237757 236620 236432 237118 238458 240024 241373 242379 243215 243985 244556 244791 244685 244253 243555 242941 242978
53137B42978Q99J279R73M55J80Pl81q54j055j021j135j470j589j138l32K70L48
$$ 242978 243877 245156 246129 246584 246764 246771 246390 245536 244481 243460 242325 240855 239266 238128 237796 238066 238414
53120B38414M4k29j14L79P76N36k67q72o20K71R59R33M03j81o00p84o81m86p30
$$ 238414 238458 238229 238115 238494 239270 239806 239539 238667 238047 238318 239277 240210 240613 240432 239832 239048 238367 237881 237151
53101B37151j659k670k878k263j743j864j991j247Q6P86K50q14j340j086n70l03
$$ 237151 235492 232822 229944 227681 225938 224074 222083 220836 220922 221708 221958 221144 219804 218718 218148 217845
53085B17845m61r42j400j357o87J21M38J53l56p13p54m81j48k27q82j568j592
$$ 217845 217384 216442 215042 213685 212998 213119 213557 213710 213354 212641 211887 211406 211258 211031 210149 208581 206989
53068B06989j001m61l10k67j33k34q61j652j932j438n23K79O50N96L03j16o87
$$ 206989 205988 205527 205217 204950 204817 204583 203722 202070 200138 198700 198177 198456 199106 199702 200005 199889 199202
53051A99202j279j455r60j96K28L31N71Q59O06q1r0J110K347K054K90j431k060
$$ 199202 197923 196468 195508 195312 195540 195871 196442 197301 197907 197826 197736 198846 201193 203247 203537 202106 200046
53034B00046j815j215l66M98P65K63l18l50j41k67n64m58j6J16j60k01K67N28
$$ 200046 198231 197016 196650 197148 197913 198176 197858 197508 197367 197100 196536 196078 196062 196178 196018 195817 196084 196612
53016A96612r9j091j258l43N83N37j02j60P64J779J868J102M50N76J168J480J198
$$ 196612 196513 195422 194164 193821 194404 194941 194839 194679 195443 197222 199090 200192 200642 201218 202386 203866 205064
52999B05064O06N2l92p52r24q82q85j194j642j787j531j248j132q30%R85J310
$$ 205064 205670 205722 205330 204578 203654 202772 201887 200693 199051 197264 195733 194485 193353 192523 192523 193508 194818
52982A94818O71l35p84k94O96J371J310Q99Q12J106J138N07l07o35n07l64k67
$$ 194818 195489 195154 194370 194076 194772 196143 197453 198352 199164 200270 201408 201915 201608 200973 200466 200102 199835
52965A99835L3M36O33P59J170J609J375M36l60m50k24k68n76q34q99o70j05L73
$$ 199835 199868 200304 200937 201696 202866 204475 205850 206286 205926 205476 205252 204984 204408 203574 202675 202005 201900 202273
52947B02273O9j038k130k607k637k403j680o10j6k07l72M7K63n62j684j743q11
$$ 202273 202342 201304 199174 196567 193930 191527 189847 189237 189221 189014 188642 188689 188952 188390 186706 184963 184152
52930A84152r6L4L74J158J466O86n52j330j487j337j109r96j088j064n55R2J53
$$ 184152 184056 184090 184464 185622 187088 187774 187222 185892 184405 183068 181959 180963 179875 178811 178256 178348 178501
52913A78501l02m05J39O25N55L92O39R99R87P17N28M05K49J73J15k65r30j302
$$ 178501 178199 177794 177933 178558 179113 179505 180144 181143 182130 182847 183375 183780 184029 184202 184317 184052 183122 181820
52895A81820j165j009j090r35l27M0k73m77K80J388J558P22pr4j03m34o72m53
$$ 181820 180655 179646 178556 177621 177294 177334 177061 176584 176864 178252 179810 180532 180525 180431 180328 179894 179222 178769
52877A78769j06k7j19j44j12K1M53J046J253Q42K80J8j36n11q04m64L57Q65P86
$$ 178769 178663 178636 178517 178373 178261 178282 178735 179781 181034 181876 182156 182174 182038 181527 180723 180259 180616 181481 182267
52858A82267Q60J829L285M050L667K913K673K778K400J333K18m06p24j088j468
$$ 182267 183127 184956 188241 192291 195958 198871 201544 204322 206722 208055 208273 207867 207143 206055 204587
52843B04587j727k031k558l063l192k994k765k464j789p31K25N50J64n23r11o56
$$ 204587 202860 200829 198271 195208 192016 189022 186257 183793 182004 181273 181498 182048 182212 181689 180778 180122
52827A80122N6P61J277J824K485K890K666J944J137M24l05j097j873k517k810
$$ 180122 180178 180939 182216 184040 186525 189415 192081 194025 195162 195586 195281 194184 192311 189794 186984
52812A86984k423j299O5J015J374J461J603J869K217K657L209L808M161L718K073
$$ 186984 184561 183262 183327 184342 185716 187177 188780 190649 192866 195523 198732 202540 206701 210419 212492
52797B12492m23k737m013m214l820l265k842k739k815k647k105j594j419j323
$$ 212492 212069 209332 205319 201105 197285 194020 191178 188439 185624 182977 180872 179278 177859 176536
52783A76536j027p87r35j177r97m72j14m0P0K80L32K09K20M49O36O09M49K44N9
$$ 176536 175509 174722 173787 172610 171613 171141 171027 170987 171057 171337 171669 171878 172098 172547 173183 173792 174241 174485 174544
52764A74544J02M38P13O11M34O54J011Q32J89j2P17J711J996J296qj363k187k060
$$ 174544 174646 175084 175797 176408 176842 177496 178507 179339 179528 179516 180233 181944 183940 185236 185228 183865 181678 179618
52746A79618j141j33L90M02J04k87m06J36J151J864J771J176O69M61M70O32Q43
$$ 179618 178477 178344 178734 179136 179240 178953 178547 178683 179834 181698 183469 184645 185314 185775 186245 186877 187720
52729A87720Q98Q02Q67J224J573J625J486J408J436J486J454J110K38q53j447
$$ 187720 188618 189420 190287 191511 193084 194709 196195 197603 199039 200525 201979 203089 203327 202474 201027
52714B01027j270q54p67r39j113j421k027k564k584k299k226k274j857q66M8L53
$$ 201027 199757 198903 198136 197197 196084 194663 192636 190072 187488 185189 182963 180689 178832 177966 178014 178367
52698A78367K38J29M9k45p02q86m71L48R47Q28J40m73n28j43K56M70O16P67Q30
$$ 178367 178605 178734 178783 178538 177836 176950 176479 176827 177774 178602 178742 178269 177741 177598 177854 178324 178940 179707 180537
52679A80537P29N78N53P16R20R26N75m4n88o31Q9J370K425K358J100k92o62m7
$$ 180537 181266 181844 182397 183113 184033 184959 185534 185490 184902 184271 184360 185730 188155 190513 191613 191321 190659 190612
52661A90612M85K68k62m00j48K1o1k38l89m10oR43K010K633K823K991L140K825
$$ 190612 191097 191365 191103 190703 190555 190576 190515 190277 189888 189478 189472 190415 192425 195058 197881 200872 204012 206837
52643B06837J977J158P40K77p79k068k669k387k078k431k980k849k098j587j598
$$ 206837 208814 209972 210712 210989 210210 208142 205473 203086 201008 198577 195597 192748 190650 189063 187465
52628A87465j400m92N48R94J108J579K232K237J447O57M11L74P5m47r43j309j364
$$ 187465 186065 185573 186121 187115 188223 189802 192034 194271 195718 196375 196786 197160 197235 196788 195845 194536 193172
52611A93172r38l74l44q85j274j108p85n82r8Q90J749J874J498J006J81j012j605
$$ 193172 192234 191860 191516 190631 189357 188249 187464 186882 186784 187674 189423 191297 192795 193801 193982 192970 191365
52594A91365p15R42J783J362O07K63K28M09R92J656J585O48k60m64k99k36n4N33
$$ 191365 190650 191592 193375 194737 195344 195607 195835 196244 197236 198892 200477 201125 200865 200401 200102 199866 199812 200345
52576B00345J103J050N30K90P53J632K252J975O39j132k314k412j806j074m09
$$ 200345 201448 202498 203028 203318 204071 205703 207955 209930 210569 209437 207123 204711 202905 201831 201422
52561B01422R8K27P4K21R14J445R96j88j068j091o06o7M31P54N34k22q43p24j20
$$ 201422 201520 201747 201821 202042 202956 204401 205397 205209 204141 203050 202444 202377 202808 203562 204096 203874 203031 202307 202187
52542B02187K34O7k56m49o48r18r36n18j43l94j028j134k99Q57J551J709J636
$$ 202187 202421 202488 202232 201783 201135 200217 199281 198763 198620 198226 197198 196064 195765 196622 198173 199882 201518
52525B01518J336O91J05K25R65J365O89o50j496j132J08J203J410Q42K31J28N37
$$ 201518 202854 203545 203650 203875 204840 206205 206894 206244 204748 203616 203724 204927 206337 207179 207410 207538 208075
52508B08075J319K453L661M165L433J961P79K76M6k27l83l65m78q67j254j465
$$ 208075 209394 211847 215508 219673 223106 225067 225846 226122 226168 225941 225558 225193 224715 223848 222594 221129
52492B21129j688j975j944j334n23q9j49l27k15K97R33J132N89k37n30j16M03
$$ 221129 219441 217466 215522 214188 213665 213576 213427 213100 212885 213182 214115 215247 215836 215599 215069 214953 215356
52475B15356O31Q93J498K012J831J030K15j98j82K01Q21J408J822K182K538K664
$$ 215356 215987 216880 218378 220390 222221 223251 223466 223268 223086 223287 224108 225516 227338 229520 232058 234722
52459B34722K450K121J822J366P47L56K56k35j588l092l620l042k171j526r86
$$ 234722 237172 239293 241115 242481 243228 243584 243840 243605 242017 238925 235305 232263 230092 228566 227580
52444B27580n11l43m24l64j46j44m17o09o78r73j441j481r14l77l73n07j80N03
$$ 227580 227069 226726 226302 225938 225792 225648 225231 224622 223944 222971 221530 220049 219135 218758 218385 217878 217698 218201
52426B18201R52Q03O3j080k090k207j266p9M88N10O15Q94R17N98L62M64P28J052
$$ 218201 219153 219956 220019 218939 216849 214642 213376 213297 213785 214295 214910 215804 216721 217319 217681 218145 218873 219925
52408B19925J607K304K617K323K025K604M176N953P132P721Q315R081R197P569
$$ 219925 221532 223836 226453 228776 230801 233405 237581 243534 250666 258387 266702 275783 284980 292549
52394B92549M164K25l000n400p430q801q535o501m079k802k696k606j855r00l66
$$ 292549 296713 296938 293938 288538 281108 272307 263772 257271 253192 250390 247694 245088 243233 242333 241967
52379B41967j51J74N57O25L91K94N25P71P56O55P32R22J046J310K065L114L610
$$ 241967 241816 241990 242547 243172 243563 243857 244382 245153 245909 246564 247296 248218 249264 250574 252639 255753 259363
52362B59363K891J231m04j260j340j159j109j122q55j85N82J004R26N26L4l47
$$ 259363 262254 263485 263081 261821 260481 259322 258213 257091 256236 256051 256633 257637 258563 259089 259123 258776
52346B58776l44K23J083J618J563J292J252J301J103Q36J074J916K791L297L718
$$ 258776 258432 258655 259738 261356 262919 264211 265463 266764 267867 268703 269777 271693 274484 277781 281499
52331B81499M322M630L975K652J893K522M097N530O218O285O147O150O477O944
$$ 281499 285821 290451 294426 297078 298971 301493 305590 311120 317338 323623 329770 335920 342397 349341
52317C49341P035O447N522M744M001K881J643J188J866K896L350L189K892K619
$$ 349341 356376 362823 368345 373089 377090 379971 381614 382802 384668 387564 390914 394103 396995 399614
52303C99614K307K218K580K918K543J661J269J764K464K682K579K548K438J875
$$ 399614 401921 404139 406719 409637 412180 413841 415110 416874 419338 422020 424599 427147 429585 431460
52289D31460R09j77j312k361k831k431j665j237j046m28P16J763K333K743L242
$$ 431460 432369 432192 430880 428519 425688 423257 421592 420355 419309 418881 419597 421360 423693 426436 429678
52274D29678L506L262K935L135L734L965L410K487J926J991K382K733L034L510
$$ 429678 433184 436446 439381 442516 446250 450215 453625 456112 458038 460029 462411 465144 468178 471688
52260D71688M226M905N226N143M878M645M497M350M083L675L300L196L389L711
$$ 471688 475914 480819 486045 491188 496066 500711 505208 509558 513641 517316 520616 523812 527201 530912
52246E30912M084M506M649M019K744J763J734K109J959J353J176J726K431K972
$$ 530912 534996 539502 544151 548170 550914 552677 554411 556520 558479 559832 561008 562734 565165 568137
52232E68137L668M544M976M766M687N297N970N872N309N206N699O164O331O428
$$ 568137 571805 576349 581325 586091 590778 596075 602045 607917 613226 618432 624131 630295 636626 643054
52218F43054O363N830N199N327O204O735O201N209M712M784M889M900N088N505
$$ 643054 649417 655247 660446 665773 671977 678712 684913 690122 694834 699618 704507 709407 714495 720000
52204G20000N926O341O902P443P452O671N475M553M318M555M603L998L023K463
$$ 720000 725926 732267 739169 746612 754064 760735 766210 770763 775081 779636 784239 788237 791260 793723
52190G93723K745L463L885L723L270K966K968K999K547J408J24m51j75R8m38j638
$$ 793723 796468 799931 803816 807539 810809 813775 816743 819742 822289 823697 823821 823370 823195 823293 822855 821217
52174H21217k850l849m823n642n910n643n296m978m229k897j678j368j860k292
$$ 821217 818367 814518 809695 804053 798143 792500 787204 782226 777997 775100 773422 772054 770194 767902
52160G67902k025j115P8J307K417L169L353K937K113J165L35k72o45p75o46l52
$$ 767902 765877 764762 764840 766147 768564 771733 775086 778023 780136 781301 781636 781364 780719 779944 779298 778946
52144G78946q6J38O13J538K525K734J747J02j178j563j391j400k054l276m548
$$ 778946 778860 778998 779611 781149 783674 786408 788155 788257 787079 785516 784125 782725 780671 777395 772847
52129G72847n226m950l871k427r34N08J774K773L807N441P742R977J1368J1884
$$ 772847 767621 762671 758800 756373 755439 755947 757721 760494 764301 769742 777484 787461 798829 810713
52115H10713J1926J1604J0798R717Q730P691O103L987J951L10j162k458l088k953
$$ 810713 822639 834243 845041 854758 863488 871179 877282 881269 883220 883530 882368 879910 876822 873869
52101H73869k768l032l224k616j356m1J289K937M634N801O525P342Q152Q248P448
$$ 873869 871101 868069 864845 862229 860873 860832 862121 865058 869692 875493 882018 889360 897512 905760 913208
52086I13208O259M804K594k85k752l994m381m470l941k395n10N79P99J047J732
$$ 913208 919467 924271 926865 926580 923828 919834 915453 910983 907042 904647 904137 904716 905515 906562 908294
52071I08294K307K280J875J509J318J436K076L035L591L293K468J652Q91k6j004
$$ 908294 910601 912881 914756 916265 917583 919019 921095 924130 927721 931014 933482 935134 936025 935999 934995
52056I34995j708k084k406k937l734m646n314n343m725l948l437l170l103l546
$$ 934995 933287 931203 928797 925860 922126 917480 912166 906823 902098 898150 894713 891543 888440 884894
52042H84894m624n592n527m671m273m914n708n560m461l000j316N80J960K011
$$ 884894 880270 874678 869151 864480 860207 855293 849585 844025 839564 836564 835248 835828 837788 839799
$$ [...]
##END NTUPLES=NMR SPECTRUM
##END=
