
##TITLE=AC1342_CMFRS10072_6534272_EPMFhfBqo4
##JCAMPDX= 6.0         $$ Bruker NMR JCAMP-DX V2.0
##DATA TYPE= NMR SPECTRUM
##DATA CLASS= NTUPLES
##ORIGIN= BRUKER
##OWNER= Administrator
$$ 1.72 TOPSPIN		Version 2.1
$$ 2012-07-16 18:34:05.359 -0500  Administrator@TOPSPIN
$$ Compression mode = diff/dup
##.OBSERVE FREQUENCY= 400.02188249412
##.OBSERVE NUCLEUS= ^1H
##.ACQUISITION MODE= SIMULTANEOUS (DQD)
##.ACQUISITION SCHEME= undefined
##.AVERAGES= 64
##.DIGITISER RES= 22
##SPECTROMETER/DATA SYSTEM= spect
##.PULSE SEQUENCE= noesygpps1d.comp
##.SOLVENT NAME= COFFEE_meoh
##.SHIFT REFERENCE= INTERNAL, COFFEE_meoh, 1, 14.96082
##AUDIT TRAIL= $$ (NUMBER, WHEN, WHO, WHERE, PROCESS, VERSION, WHAT)
$$ ##TITLE= Audit trail, TOPSPIN		Version 2.1
$$ ##JCAMPDX= 5.01
$$ ##ORIGIN= Bruker BioSpin GmbH
$$ ##OWNER= Administrator
$$ $$ C:\Bruker\TOPSPIN/data/COFFEE/nmr/AC1342_CMFRS10072_6534272_EPMFhfBqo4/12/pdata/1/auditp.txt
$$ ##AUDIT TRAIL=  $$ (NUMBER, WHEN, WHO, WHERE, PROCESS, VERSION, WHAT)
(   1,<2012-07-16 16:42:42.718 -0500>,<Administrator>,<TOPSPIN>,<go>,<TOPSPIN 2.1>,
      <created by zg
	started at 2012-07-16 16:31:12.343 -0500,
	POWCHK enabled, PULCHK disabled,
       configuration hash MD5:
       6B 1B 68 BB D9 2E 58 E2 7F 35 AD 54 07 DF 0E 41
       data hash MD5: 64K
       DE 8D 3E 74 E9 71 1E 21 69 29 0F 08 00 47 AA C5>)
(   2,<2012-07-16 16:42:49.671 -0500>,<Administrator>,<TOPSPIN>,<audit>,<TOPSPIN 2.1>,
      <user comment:
       ICON-NMR User ID: COFFEE
       data hash MD5: 64K
       DE 8D 3E 74 E9 71 1E 21 69 29 0F 08 00 47 AA C5>)
(   3,<2012-07-16 18:34:02.703 -0500>,<Administrator>,<TOPSPIN>,<proc1d>,<TOPSPIN 2.1>,
      <Start of raw data processing
       efp LB = 0.3 FT_mod = 6 PKNL = 1 PHC0 = 0 PHC1 = 0 SI = 128K 
       data hash MD5: 128K
       8F 48 C8 81 EE BA 4A 21 0C 45 9B 82 92 08 8B 1B>)
(   4,<2012-07-16 18:34:03.921 -0500>,<Administrator>,<TOPSPIN>,<proc1d>,<TOPSPIN 2.1>,
      <pk PHC0 = -1.345825 PHC1 = 0 
       data hash MD5: 128K
       92 49 05 71 06 43 EF 5D CE 15 73 31 29 FA EF 3A>)
(   5,<2012-07-16 18:34:04.343 -0500>,<Administrator>,<TOPSPIN>,<proc1d>,<TOPSPIN 2.1>,
      <abs ABSG = 1 
       data hash MD5: 128K
       D5 1C 2F F4 3D 1C 97 40 47 E5 CA A4 9F 5C FF 91>)
(   6,<2012-07-16 18:34:04.765 -0500>,<Administrator>,<TOPSPIN>,<proc1d>,<TOPSPIN 2.1>,
      <abs ABSG = 2 
       data hash MD5: 128K
       D1 A7 B7 3C DA C0 EC 50 11 51 FF E5 F9 08 08 73>)
(   7,<2012-07-16 18:34:04.906 -0500>,<Administrator>,<TOPSPIN>,<proc1d>,<TOPSPIN 2.1>,
      <abs ABSG = 3 
       data hash MD5: 128K
       E5 AE 50 0C 3E 49 B0 E8 57 3A FE D4 07 69 B6 25>)
(   8,<2012-07-16 18:34:05.046 -0500>,<Administrator>,<TOPSPIN>,<proc1d>,<TOPSPIN 2.1>,
      <abs ABSG = 4 
       data hash MD5: 128K
       7B B5 D9 53 99 96 3C 12 BD 60 6A DA E6 60 91 11>)
(   9,<2012-07-16 18:34:05.187 -0500>,<Administrator>,<TOPSPIN>,<proc1d>,<TOPSPIN 2.1>,
      <abs ABSG = 5 
       data hash MD5: 128K
$$ [...]
##$TP07= 0
##$TPNAME0= <>
##$TPNAME1= <>
##$TPNAME2= <>
##$TPNAME3= <>
##$TPNAME4= <>
##$TPNAME5= <>
##$TPNAME6= <>
##$TPNAME7= <>
##$TPOAL= (0..7)
0.5 0.5 0.5 0.5 0.5 0.5 0.5 0.5
##$TPOFFS= (0..7)
0 0 0 0 0 0 0 0
##$TUNHIN= 0
##$TUNHOUT= 0
##$TUNXOUT= 0
##$USERA1= <user>
##$USERA2= <user>
##$USERA3= <user>
##$USERA4= <user>
##$USERA5= <user>
##$V9= 5
##$VALIST= <valist>
##$VCLIST= <CCCCCCCCCCCCCCC>
##$VD= 0
##$VDLIST= <DDDDDDDDDDDDDDD>
##$VPLIST= <PPPPPPPPPPPPPPP>
##$VTLIST= <TTTTTTTTTTTTTTT>
##$WBST= 2048
##$WBSW= 25
##$XGAIN= (0..3)
0 0 0 0
##$XL= 0
##$YL= 0
##$YMAX_a= 11045246
##$YMIN_a= -8417049
##$ZGOPTNS= <>
##$ZL1= 120
##$ZL2= 120
##$ZL3= 120
##$ZL4= 120
##$ABSF1= 14.96082
##$ABSF2= -5.597362
##$ABSG= 5
##$ABSL= 3
##$ALPHA= 0
##$AQORDER= 0
##$ASSFAC= 0
##$ASSFACI= 0
##$ASSFACX= 0
##$ASSWID= 0
##$AUNMP= <proc_prof1d_extract.lims>
##$AXLEFT= 0
##$AXNAME= <>
##$AXNUC= <1H>
##$AXRIGHT= 0
##$AXTYPE= 0
##$AXUNIT= <>
##$AZFE= 0.1
##$AZFW= 0.1
##$BCFW= 0
##$BC_mod= 0
##$BYTORDP= 0
##$COROFFS= 0
##$CY= 15
##$DATMOD= 1
##$DC= 0
##$DFILT= <>
##$DTYPP= 0
##$F1P= 0
##$F2P= 0
##$FCOR= 0.5
##$FTSIZE= 131072
##$FT_mod= 6
##$GAMMA= 0
##$GB= 0
##$INTBC= 1
##$INTSCL= 1
##$ISEN= 128
##$LB= 0.3
##$LEV0= 0
##$LPBIN= 0
##$MAXI= 10000
##$MC2= 0
##$MEAN= 0
##$ME_mod= 0
##$MI= 0
##$NCOEF= 0
##$NC_proc= -2
##$NLEV= 6
##$NOISF1= 0
##$NOISF2= 0
##$NSP= 0
##$NTH_PI= 0
##$NZP= 0
##$OFFSET= 14.96082
##$PC= 1
##$PHC0= -1.345825
##$PHC1= 0
##$PH_mod= 1
##$PKNL= yes
##$PPARMOD= 0
##$PPDIAG= 0
##$PPIPTYP= 0
##$PPMPNUM= 2147483647
##$PPRESOL= 1
##$PSCAL= 4
##$PSIGN= 0
##$PYNMP= <proc.py>
##$REVERSE= no
##$SF= 400.020009709769
##$SI= 131072
##$SIGF1= 0
##$SIGF2= 0
##$SINO= 400
##$SIOLD= 131072
##$SPECTYP= <>
##$SREGLST= <1H.CDCl3>
##$SSB= 0
##$STSI= 131072
##$STSR= 0
##$SW_p= 8223.68421052631
##$SYMM= 0
##$S_DEV= 0
##$TDeff= 65536
##$TDoff= 0
##$TI= <>
##$TILT= no
##$TM1= 0
##$TM2= 0
##$TOPLEV= 0
##$USERP1= <user>
##$USERP2= <user>
##$USERP3= <user>
##$USERP4= <user>
##$USERP5= <user>
##$WDW= 1
##$XDIM= 131072
##$YMAX_p= 410418686
##$YMIN_p= -15308
##$CURPLOT= <Network HP LaserJet P1505>
##$CURPRIN= <$Network HP LaserJet P1505>
##$DFORMAT= <normdp>
##$LAYOUT= <+/1D_H.xwp>
##$LFORMAT= <normlp>
##$PFORMAT= <normpl>
##$SURQMSG= 1
$$ End of Bruker specific parameters
$$ ---------------------------------
##NTUPLES= NMR SPECTRUM
##VAR_NAME=  FREQUENCY,     SPECTRUM/REAL,   SPECTRUM/IMAG
##SYMBOL=    X,             R,               I
##VAR_TYPE=  INDEPENDENT,   DEPENDENT,       DEPENDENT
##VAR_FORM=  AFFN,          ASDF,            ASDF
##VAR_DIM=   131072,        131072,          131072
##UNITS=     HZ,            ARBITRARY UNITS, ARBITRARY UNITS
##FACTOR=    0.0627417313425164, 1,          1
##FIRST=     8223.62146879497, 56,           -52732
##LAST=      0,             1188,            -53023
##MIN=       0,             -15308,          0
##MAX=       8223.62146879497, 410418686,    0
$$ Real data points
##PAGE= N=1
##DATA TABLE= (X++(R..R)), XYDATA
$$ [...]
63900A282296j13451j01666q9808p7982o7099n8157n1000m4430l7853l2079k7977
63889E80794k5052k2224j9431j7412j6114j4555j2415j0598r781r274q016n984
63877D09938m018k675j974j837k097k169j460q7J301K453L808N786Q179J0361
63863D25509J1851J2648J3313J4644J6973J9749K2190K4238K6432K8833L0720
63852F47100L1609L2005L2698L3676L4302L4263L3740L2704L0695K7541K3797
63841I94130K0180J6855J3513R887N823J106m300r779j4348j7691k0618k4096
63829I70662k7988l1186l2985l3882l4753l5678l6037l5609l4931l4461l3815
63818E99337l2202k9372k5896k2661k0322j8968j8066j6862j5123j3390j2209
$$ plain form
63900 1282296 1168845 1067179 977371 899389 832290 774133 723133 678703 640850 608771 580794
63889 580794 555742 533518 514087 496675 480561 466006 453591 442993 433212 423938 415922 409938
63877 409938 405920 403245 401271 399434 397337 395168 393708 393621 394922 397375 401183 406969 415148 425509
63863 425509 437360 450008 463321 477965 494938 514687 536877 561115 587547 616380 647100
63852 647100 678709 710714 743412 777088 811390 845653 879393 912097 942792 970333 994130
63841 994130 1014310 1031165 1044678 1054565 1060388 1061494 1057194 1047415 1033067 1015376 994758 970662
63829 970662 942674 911488 878503 844621 809868 774190 738153 702544 667613 633152 599337
63818 599337 567135 537763 511867 489206 468884 449916 431850 414988 399865 386475 374266
63807C74266j1325j0007q073o072m538l546l094l343m153m878n039m915n098n689
63793B94496o219o262n757m945m179l749l592l408l145l150l504l685l209k337
63779B37355j618j125o69m94r35j569j585j039q86j546k280k354k025j850j733
63764B15647j259n07J14M44M49m8r11j413j057l80j84l08j5O17P29J27l49j32
63746B11564L11M71O87J341J888J509M21k32K11J299K161K374K060J547J120R17
63730B29649R36J245K029L229M289M609M228L851M157N280O855Q277Q952Q727
63716B96313Q134P900Q074P929O891N225L546J923q1k575m919o280o451o021n788
63701C13820n997o127n565m418l455l148l046k436j270m7J008J988K676K572J809
$$ plain form
63807 374266 362941 352934 344861 338789 334251 330705 327611 324268 320115 315237 310198 305283 300185 294496
63793 294496 288277 282015 276258 271313 267134 263385 259793 256385 253240 250090 246586 242901 239692 237355
63779 237355 235737 234612 233943 233449 232514 230945 229360 228321 227435 225889 223609 221255 219230 217380 215647
63764 215647 214388 213881 213995 214439 214888 214840 213929 212516 211459 211079 210895 210587 210572 211189 211918 212045 211696 211564
63746 211564 211875 212346 213033 214374 216262 217771 218192 217960 218171 219470 221631 224005 226065 227612 228732 229649
63730 229649 230585 231830 233859 237088 241377 245986 250214 254065 258222 263502 270357 278634 287586 296313
63716 296313 304447 312347 320421 328350 335241 340466 344012 345935 345854 343279 338360 332080 325629 319608 313820
63701 313820 307823 301696 296131 291713 288258 285110 282064 279628 278358 278311 279319 281307 283983 286555 288364
63686B88364J300J627K280K498K352K386K552K278J437N28o2l81m18M7R59J924
63670C09671K826L937N177N815N375M424M036M631N657O209N719M299K643J424
63656C71843N84n51k306m225n741o805p579p957p847p498p092o357n145l961l296
63641B96067k746j576l3Q69Q76R72J978L407M195M056L641L615M046M570M838
63626C28775M733M371L969L782M112N131O506P485P698P693Q272R441J0542J1373
63612D23883J2534J4557J7209J9873K2193K4178K6044K8159L0784L3666L6147
63601F89227L7683L7930L6425L2851K7703K2005J6169R863L354j921m787n735
63589I00767o148o667p108p634q920j1193j3942j6681j9337k1721k3306k3758
$$ plain form
63686 288364 289664 291291 293571 296069 298421 300807 303359 305637 307074 307602 307540 307159 306741 306788 307747 309671
63670 309671 312497 316434 321611 327426 332801 337225 341261 345892 351549 357758 363477 367776 370419 371843
63656 371843 372427 371876 369570 365345 359604 352799 345220 337263 329416 321918 314826 308469 303324 299363 296067
63641 296067 293321 291745 291712 292581 293457 294429 296407 299814 304009 308065 311706 315321 319367 323937 328775
63626 328775 333508 337879 341848 345630 349742 354873 361379 368864 376562 384255 392527 401968 412510 423883
63612 423883 436417 450974 468183 488056 510249 534427 560471 588630 619414 653080 689227
63601 689227 726910 764840 801265 834116 861819 883824 899993 909856 913210 911289 906502 900767
63589 900767 894619 887952 880844 873210 864290 853097 839155 822474 803137 781416 758110 734352
63577G34352k3309k2331k0924j9075j6868j4398j1744r120o808m851l072j382
63565E80470K11J846L630N223O044O008N657N441N303N169N348O104P183Q182
63551F51819R153J0522J2502J4891J7405J9999K2969K6771L1662L7327M3079M8278
63539I46377N2166N3219M9405L9899K6400J2236J86q586j3887j5832j5087j3040
63527A113456j1065r711q934q877j0069j2864j6962k1546k5819k9397l2280l4464
63515H91468l5635l5409l3848l1589k9322k7277k5242k2928k0230j7355j4802
63504E97831j3014j1851j0718r319q094p594p691p718p281o508n712n132m965
63491D92234n210n435n118m257l368k927l071l628m040l466j677K56R71N72N11
$$ plain form
63577 734352 711043 688712 667788 648713 631845 617447 605703 596583 589775 584924 581852 580470
63565 580470 580681 582527 586157 591380 597424 603432 609089 614530 619833 625002 630350 636454 643637 651819
63551 651819 660972 671494 683996 698887 716292 736291 759260 786031 817693 855020 898099 946377
63539 946377 998543 1051762 1101167 1141066 1167466 1179702 1179888 1171302 1157415 1141583 1126496 1113456
63527 1113456 1102391 1092680 1083746 1074869 1064800 1051936 1034974 1013428 987609 958212 925932 891468
63515 891468 855833 820424 786576 754987 725665 698388 673146 650218 629988 612633 597831
63504 597831 584817 572966 562248 552929 544835 537241 529550 521832 514551 508043 502331 497199 492234
63491 492234 487024 481589 476471 472214 468846 465919 462848 459220 455180 451714 450037 450293 451264 451836 452347
63476D52347J600L111M246N280O494P099O357M993M198L704K260k36k538l958
63462D94957n102o446p485p764p570p123o091m502l212k824k933l045l335l837
63448D23688l784k682j276m96o6Q74K280L379L911M207M469M906O221Q827J1899
63433D66357J4447J7069K1312K7333L3585L8842M2873M4755M2357L4787K4280
63422H07997J4383O894J555j894k856r51L146Q319J3817J9404K5086L0766L5831
63409I61497L9149L9818L7771L3446K7228J9614J1587M126k421p913j1654j2946
63397A139302j2417j1843j2463j4206j6748k0311k4708k8595l0748l1648l2669
63386I02946l3825l3604l1268k8111k5755k4062k1733j8395j5050j2563j0739
$$ plain form
63476 452347 453947 457058 461304 466584 473078 480177 486534 491527 495725 499429 501689 501453 498915 494957
63462 494957 489855 483409 475924 468160 460590 453467 447376 442874 439662 436838 433905 430860 427525 423688
63448 423688 419904 417222 415946 415450 415384 416258 418538 421917 425828 430035 434504 439410 445631 454458 466357
63433 466357 480804 497873 519185 546518 580103 618945 661818 706573 748930 783717 807997
63422 807997 822380 829274 830829 828935 826079 825128 828274 836593 850410 869814 894900 925666 961497
63409 961497 1000646 1040464 1078235 1111681 1138909 1158523 1170110 1174236 1171815 1163902 1152248 1139302
63397 1139302 1126885 1115042 1102579 1088373 1071625 1051314 1026606 998011 967263 935615 902946
63386 902946 869121 835517 804249 776138 750383 726321 704588 686193 671143 658580 647841
63375F47841q983o998m656j961N11J899K274K852M538O802Q640R998J1456J2980
63361F87193J4064J4856J6222J8569K1437K4296K6947K9184L0925L2847L5913
63350I52453L9816M2695M2883M0347L6001L0385K3691J6400R121K090m426r549
63338A221907j2357j2982j2593j2386j2984j4556j6948j9690k2397k5209k8505
63327A031300l2234l5745l8101l8411l6230l2110k7468k3384j9708j5709j1176
63316G21024o282r93M379Q100P777K604n698j4340k1240k5404k6603k5395k2959
63303E94970k0267j7675j5381j3739j2787j1990j0950r923r258q784q206p700
63291D48310p538p457p043o476o280o494o689o649o497o154n379m372l731l600
$$ plain form
63375 647841 638858 631860 627204 625243 625754 627653 629927 632779 637317 644119 652759 662757 674213 687193
63361 687193 701257 716113 732335 750904 772341 796637 823584 852768 883693 916540 952453
63350 952453 992269 1034964 1077847 1118194 1154195 1184580 1208271 1224671 1233792 1235882 1231456 1221907
63338 1221907 1209550 1196568 1183975 1171589 1158605 1144049 1127101 1107411 1085014 1059805 1031300
63327 1031300 999066 963321 925220 886809 850579 818469 791001 767617 747909 732200 721024
63316 721024 714742 713749 718128 726228 734005 736609 730911 716571 695331 669927 643324 617929 594970
63303 594970 574703 557028 541647 527908 515121 503131 492181 482258 473000 464216 456010 448310
63291 448310 440772 433315 426272 419796 413516 407022 400333 393684 387187 381033 375654 371282 367551 363951
63277C63951l435k832k150j950k160k175j643q93n56r00j538j780j386q69q98
63262C38786j519k202k583k722k693k361j769j330j261j162n22N24J293J336Q15
63247C22630J26n35j139j567j562r93j66K59r7p74q81j99M82L81k80p75r77j310
63229C12623j712j463l26Q59J170O93J51j06j61N8O47J178J069N31L60O62N82
63212C16815k59q48r7J513K428K058J389J584K689L947M700M690L983L060K565
63197C50217K601K628K358K346L230M759O068O706O882O923P089P801R315J1101
63183D30024J2197J2413J2613J3590J5103J6351J6899J6817J6278J5473J4704
63172E92462J4146J3655J3048J2369J1712J0992J0162R330Q371O824M462J692
$$ plain form
63277 363951 360516 357684 355534 353584 351424 349249 347606 346713 346157 345257 343719 341939 340553 339684 338786
63262 338786 337267 335065 332482 329760 327067 324706 322937 321607 320346 319184 318662 319186 320479 321815 322630
63247 322630 322756 322221 321082 319515 317953 316960 316794 317053 316956 316182 315301 315102 315584 315965 315685 314910 313933 312623
63229 312623 310911 309448 309122 309981 311151 311844 311995 311889 311728 311786 312433 313611 314680 315211 315571 316233 316815
63212 316815 316556 315708 315611 317124 319552 321610 322999 324583 327272 331219 335919 340609 344592 347652 350217
63197 350217 352818 355446 357804 360150 363380 368139 374207 380913 387795 394718 401807 409608 418923 430024
63183 430024 442221 454634 467247 480837 495940 512291 529190 546007 562285 577758 592462
63172 592462 606608 620263 633311 645680 657392 668384 678546 687876 696247 703071 707533 709225
63160G09225j037l760o534q858j0360j1688j3874j6838j9351k0523k0533j9804
63148E56065j8447j6788j5547j4956j4357j3241j2022j1167j0220q471o172m240
63136D10437l113k604k607l016l170k359r83k38m32m61N94K125K854K480J845
63121D01352J767K303L081L833M507N106N505N461M880M213M239N234O560P305
63107D65346P260O963O923P052O928O413N892N908O560P323P634P639Q058R245
63093E65144J0666J1575J1942J2350J3051J3557J3282J2265J0999R669P879N189
63081F97568J768j770n031q081j0848j2735j3217j2653j2091j2207j2838j3507
63069E84358j3939j3941j3308j2191j1099j0206r070p476o142n861o238n979m505
$$ plain form
63160 709225 708188 704428 697894 689036 678676 666988 653114 636276 616925 596402 575869 556065
63148 556065 537618 520830 505283 490327 475970 462729 450707 439540 429320 420849 414677 410437
63136 410437 407324 404720 402113 399097 395927 393568 392585 392347 391915 391454 392048 394173 397027 399507 401352
63121 401352 403119 405422 408503 412336 416843 421949 427454 432915 437795 442008 446247 451481 458041 465346
63107 465346 472606 479569 486492 493544 500472 506885 512777 518685 525245 532568 540202 547841 555899 565144
63093 565144 575810 587385 599327 611677 624728 638285 651567 663832 674831 684500 692379 697568
63081 697568 699336 697566 692535 684454 673606 660871 647654 635001 622910 610703 597865 584358
63069 584358 570419 556478 543170 530979 519880 509674 500604 493128 486986 481125 474887 468908 464403
63056D64403k582j204n06KO44J476K526L663M432M524M328M571N432O376O891
63041E04976P006O948O670O039N327N103N529O111O282O100O073O356O449N816
63027E90785M585L339K396J562O01l91j155j556j584j268q47p73j288k061k463
63012E89882k163j284j14J087K068K778L655N328P867J0616J2982J5066J7277
62999F65045J9576K1563K3073K4189K4774K4523K3620K2767K2338K1944K1132
62988I14544K0163J9679J9894K0427K0771K0502J9286J7088J4341J1503Q445M612
62976A111255k70n920j1843j7577k2657k6777l0047l2727l4655l5394l4919l3763
62964H24706l2367l0719k8803k6883k5138k3364k1332j9143j7043j5173j3693
$$ plain form
63056 464403 461821 460617 460111 460113 460757 462233 464759 468422 472854 477378 481706 486277 491709 498085 504976
63041 504976 511982 518930 525600 531639 536966 542069 547598 553709 559991 566091 572164 578520 584969 590785
63027 590785 595370 598709 601105 602667 603268 602877 601722 600166 598582 597314 596467 595694 594406 592345 589882
63012 589882 587719 586435 586321 587408 589476 592254 595909 601237 609104 619720 632702 647768 665045
62999 665045 684621 706184 729257 753446 778220 802743 826363 849130 871468 893412 914544
62988 914544 934707 954386 974280 994707 1015478 1035980 1055266 1072354 1086695 1098198 1106643 1111255
62976 1111255 1110985 1105065 1093222 1075645 1052988 1026211 996164 963437 928782 893388 858469 824706
62964 824706 792339 761620 732817 705934 680796 657432 636100 616957 599914 584741 571048
62953E71048j2757j2178j1523j0782j0456j0619j0500r540q408q205q983r765
62941D47332r935r785r632r229q286p084o120n561n267n070m785m265l646l249
62927C55418l071k680j853j044q67j332j857j917j470q09k93j84m73q55r80p46
62911C34987k68L35R56J375J437J378J736K669L519L344K013N10L7R17K499L977
62895C61421N088O086P351Q974J0496J1125J0538R477R043R368R416Q345O534
62882D73262M877L562K093K42j616l072m095m813n319n718o124o603p214p937
62868D31525q402q098p184o648p094p780p568o545n801n724n548m695l674l188
62854C43576l189l235l192l059k682k082j644j547j431j028o19m66k97J57N49
$$ plain form
62953 571048 558291 546113 534590 523808 513352 502733 492233 482693 474285 466080 457097 447332
62941 447332 437397 427612 417980 408751 400465 393381 387261 381700 376433 371363 366578 362313 358667 355418
62927 355418 352347 349667 347814 346770 345903 344571 342714 340797 339327 338518 338225 338041 337568 336713 335733 334987
62911 334987 334719 335054 336010 337385 338822 340200 341936 344605 348124 351468 353481 353991 354028 354945 357444 361421
62895 361421 366509 372595 379946 388920 399416 410541 421079 430556 439599 448967 458383 466728 473262
62882 473262 478139 481701 483794 484036 482420 479348 475253 470440 465121 459403 453279 446676 439462 431525
62868 431525 423123 415025 407841 401193 394099 386319 378751 372206 366405 360681 355133 350438 346764 343576
62854 343576 340387 337152 333960 330901 328219 326137 324493 322946 321515 320487 319868 319402 319105 319262 319811
62839C19811M71K06K70N13L94o0k21K58J104J960K656L011K818K186J446P38O
62822C37567n52m84M02J717K706K626J212q62k200j996r87o27j299k010j866j151
62806C32196o47n34m21j95k30p92j594k030j776j085m74q6M16J156J574J072k8
62789C26522p22o19l78o60j225j458j323j178r45j33J209K218K252J827K128L606
62773C31121N476O652O829O427N768M841L770K964K525J960Q27n63j511j772j685
62758C73629j595j589j685j911k149k240k265k378k485k406k259k270k287j998
62744C44112j621j806k675l520l675l220k621k136j837j826j940j673p53L62R60
62729C16131Q41L69n0k10o4K65N24O58R30J512K194K687L027L376L689L918M272
$$ plain form
62839 319811 320282 320488 320758 321271 321665 321605 321384 321642 322746 324706 327362 330373 333191 335377 336823 337561 337567
62822 337567 337015 336531 336933 338650 341356 343982 345194 344332 342132 340136 339149 338522 337223 335213 333347 332196
62806 332196 331549 331015 330594 330399 330169 329377 327783 325753 323977 322892 322418 322332 322748 323904 325478 326550 326522
62789 326522 325800 325181 324803 324143 322918 321460 320137 318959 318014 317881 319090 321308 323560 325387 327515 331121
62773 331121 336597 343249 350078 356505 362273 367114 370884 373848 376373 378333 379160 378597 377086 375314 373629
62758 373629 372034 370445 368760 366849 364700 362460 360195 357817 355332 352926 350667 348397 346110 344112
62744 344112 342491 340685 338010 334490 330815 327595 324974 322838 321001 319175 317235 315562 314809 315171 316131
62729 316131 316972 317341 317291 317081 317017 317282 317806 318464 319394 320906 323100 325787 328814 332190 335879 339797 344069
62712C44069M989N978P055Q297R753J0999J1542J1584J1942J3107J4817J6579
62700D70711J8225J9869K1660K3765K6256K8904L1314L3391L5474L7794M0071
62689G87434M1734M2484M2410M1672M0164L7525L3483K8150K1892J4885P055j383
62677A137505r677j7150k3869l0193l5788l9745m1768m2599m2926m2485m0795
62666G70510l8308l6076l4416l2640l0205k7449k4889k2429j9788j7374j5952
62655D70984j5508j5018j3610j1490r454p876o574n477m816m688m791m782m630
62642C62270m494m441m362m066l387k355j268l71M05J187J703J537Q48L49M02
62627C43957O22N41J85l10j021j743j786r84l92j101k579l140k160q24m48q67
$$ plain form
62712 344069 349058 355036 362091 370388 380141 391140 402682 414266 426208 439315 454132 470711
62700 470711 488936 508805 530465 554230 580486 609390 640704 674095 709569 747363 787434
62689 787434 829168 871652 914062 955734 995898 1033423 1066906 1095056 1116948 1131833 1138888 1137505
62677 1137505 1127828 1110678 1086809 1056616 1020828 981083 939315 896716 853790 811305 770510
62666 770510 732202 696126 661710 629070 598865 571416 546527 524098 504310 486936 470984
62655 470984 455476 440458 426848 415358 405904 398028 391454 385977 381161 376473 371682 366900 362270
62642 362270 357776 353335 348973 344907 341520 339165 337897 337526 337931 339118 340821 342358 343206 343555 343957
62627 343957 344579 345120 345305 344995 343974 342231 340445 339461 339069 337968 335389 332249 330089 329265 328817 327950
62611C27950j088q28o68r38j222j052o42n62r17j153p79n5L73L74M28P01O82N0
62593C20654o60q51p85r43r25kJ423K123J830J564J877J964J127Lm63m33n52o79
62575C26272k67M09N70J89q1j33n32j372j981j994j915k273k844l017k536j646
62559C06849q13m14l73j28O71J499J509P48J50J90K48l69j357j837j471p10j29
62542C04263J14K24M60Q97J360J627J655J579J579J909K797M015M803M616L866
62527C35764L359L240L086K873L041L573L957M296N443P535R346R834R676J0370
62513D15393J2317J4654J6685J8499K0256K1793K3118K4557K6118K7178K7065
62502F47633K5755K3796K1760J9808J7611J4660J0787O327J778k500o102q486
$$ plain form
62611 327950 326862 326034 325366 324428 323206 322154 321512 320950 320033 318880 318101 318046 318419 318793 319221 319922 320604 320654
62593 320654 319994 319143 318358 317415 316490 316488 317911 320034 321864 323428 325305 327269 328396 328399 327936 327503 326951 326272
62575 326272 326005 326414 326984 327173 327092 326959 326427 325055 323074 321080 319165 316892 314048 311031 308495 306849
62559 306849 306036 305622 305249 305121 305792 307291 308800 309548 309698 309888 310136 309767 308410 306573 305102 304392 304263
62542 304263 304377 304601 305061 305958 307318 308945 310600 312179 313758 315667 318464 322479 327282 331898 335764
62527 335764 339123 342363 345449 348322 351363 354936 358893 363189 368632 376167 385513 395347 405023 415393
62513 415393 427710 442364 459049 477548 497804 519597 542715 567272 593390 620568 647633
62502 647633 673388 697184 718944 738752 756363 771023 781810 788137 789915 787415 781313 772827
62490G72827r492r643r499q895p310m783j898J097M550Q600J2627J5792J7947
62477G81920J9769K2059K4887K7293K7903K6001K2010J6914J1484O178J255l470
62465I84203q701j4858k1367k7211l1920l5563l8042l9133l9139l8691l7899l6385
62453F15294l4148l1583k8700k5185k1379j8213j5847j3438j0668q517p730p547
62441C92339o816n697n081m959m523l686l211l303l230k568j912j896k266k398
62427C40793k162j783j289n93P9L42J40j71k07O8L10J45l39m81L05J693K574K151
62409C41575P44o13j195j072p12l82M0O90J280J299P00J70L83J140J610J429J170
62392C48256J562K554L436L722L649L785M339M959N275N387N680O251O826P313
$$ plain form
62490 772827 763335 753692 744193 735298 727988 723205 721307 722404 726954 735554 748181 763973 781920
62477 781920 801689 823748 848635 875928 903831 929832 951842 968756 980240 986418 987673 984203
62465 984203 975502 960644 939277 912066 880146 844583 806541 767408 728269 689578 651679 615294
62453 615294 581146 549563 520863 495678 474299 456086 440239 426801 416133 407616 399886 392339
62441 392339 385523 379826 374745 369786 365263 361577 358366 355063 351833 349265 347353 345457 343191 340793
62427 340793 338631 336848 335559 334966 335045 335387 335527 335356 335149 335217 335527 335672 335333 334852 335157 336850 339424 341575
62409 341575 342319 341706 340511 339439 338727 338345 338385 339075 340355 341654 342354 342524 342907 344047 345657 347086 348256
62392 348256 349818 352372 355808 359530 363179 366964 371303 376262 381537 386924 392604 398855 405681 412994
62378D12994P989Q902R533R477R152R326J0082J0885J1505J2295J3441J4610J5508
62365E55699J6266J7030J7716J8455J9813K2204K5403K9017L3064L7722M2817
62354H35206M7980N3074N8080O2703O6484O9101P0237O9231O5375N8549M9361
62343A505381L8671K7307J6058N597l722j1915j9264k6274l3362m0223m5759m9077
62331A363418n0462n0874n0692m9521m7222m4378m1472l8263l4508l0870k8482
62320H96674k7649k7538k7115k6145k5097k4437k4150k3816k3013k1660j9997
62309F26057j8308j6746j5333j4039j2749j1355r957q821q037p344o447n390m413
62296D87118l565k673j682p32O5P39J286J633J841K125K537K919L297L949M864
$$ plain form
62378 412994 420983 429885 439418 448895 458047 467373 477455 488340 499845 512140 525581 540191 555699
62365 555699 571965 588995 606711 625166 644979 667183 692586 721603 754667 792389 835206
62354 835206 883186 936260 994340 1057043 1123527 1192628 1262865 1332096 1397471 1456020 1505381
62343 1505381 1544052 1571359 1587417 1593014 1589292 1577377 1558113 1531839 1498477 1458254 1412495 1363418
62331 1363418 1312956 1262082 1211390 1161869 1114647 1070269 1028797 990534 956026 925156 896674
62320 896674 869025 841487 814372 788227 763130 738693 714543 690727 667714 646054 626057
62309 626057 607749 591003 575670 561631 548882 537527 527570 518749 510712 503368 496921 491531 487118
62296 487118 483553 480880 479198 478466 478531 479270 480556 482189 484030 486155 488692 491611 494908 498857 503721
62281E03721N447N217M594M408M673M554L695K845K745K999K784K316K681M243
62267E56922O106P394Q417J0061J2585J5433J8011K0205K2424K5420K9777L5215
62255G67970M0690M5585N0442N5993O1808O6635O9831P1558P1524O8619O2262
62244A432917N3294M2913L1425J8835O058n492j5395k4382l2959m0763m7432n3146
62232A365873n7916o1053o2015o1269n9681n7432n4227n0214m5962m1659l7089
62221G77356l2415k8260k4894k2020j9481j7518j6080j4641j3072j1907j1309
62210E65759j0493q884p170o309o066n542m749m405m400l782k448j483j356j010
62196D97662N13K573L911M314M455M744N286O404Q199J0017J1254J2264J3540
$$ plain form
62281 503721 509168 514385 518979 523387 528060 532614 536309 539154 541899 544898 547682 549998 552679 556922
62267 556922 563028 570422 578839 588900 601485 616918 634929 655134 677558 702978 732755 767970
62255 767970 808660 854245 904687 960680 1022488 1089123 1158954 1230512 1302036 1370655 1432917
62244 1432917 1486211 1529124 1560549 1579384 1585442 1579950 1564555 1540173 1507214 1466451 1419019 1365873
62232 1365873 1307957 1246904 1184889 1123620 1063939 1006507 952280 902066 856104 814445 777356
62221 777356 744941 716681 691787 669767 650286 632768 616688 602047 588975 577068 565759
62210 565759 555266 546382 539212 532903 526837 521295 516546 512141 507741 503959 501511 500028 498672 497662
62196 497662 498175 500748 504659 508973 513428 518172 523458 529862 538061 548078 559332 571596 585136
62183E85136J4497J4284J3417J3233J3779J3752J2669J1580J1106J0224P995N319
62171G26991L910M217N427O979R033J1783J5313J9941K5836L2341L8390M3538
62159I43699M7944N1477N3501N3494N1219M6371L8868K9527J9816J0754K538m816
62147A344392j1269j7284k3690l0582l6958m1899m5466m7902m8653m7124m4067
62136I49498m1197l9215l7127l3844k9735k5955k2802j9649j6352j3651j1903
62125F58068j0346q253o184n151m966m415l000j427k06J162L129N208O880Q594
62111F39093J1059J4162J7347K0553K3752K5972K5883K3242J8975J4064R336N989
62099H49427N029O002P448Q635R672R782P190J546m880r466j1778j2768j2558
$$ plain form
62183 585136 599633 613917 627334 640567 654346 668098 680767 692347 703453 713677 721672 726991
62171 726991 730901 735118 740545 747524 756557 768340 783653 803594 829430 861771 900161 943699
62159 943699 991643 1043120 1096621 1150115 1201334 1247705 1286573 1316100 1335916 1346670 1349208 1344392
62147 1344392 1333123 1315839 1292149 1261567 1224609 1182710 1137244 1089342 1040689 993565 949498
62136 949498 908301 869086 831959 798115 768380 742425 719623 699974 683622 669971 658068
62125 658068 647722 639469 633285 628134 623168 618753 615753 614326 614120 615282 618411 623619 630499 639093
62111 639093 650152 664314 681661 702214 725966 751938 777821 801063 820038 834102 843438 849427
62099 849427 854456 860458 867906 876541 886213 895995 903185 904731 899851 890385 878607 865839 853281
62086H53281j0520p017l451n54K168N137P962J0315J2576J5233J8192K1050K3576
62073I47948K5661K7252K8518K9657L0446L0453K9759K8966K8356K7598K6616
62062A261230K6128K6916K8861L1132L3022L4131L4051L2352K8999K4345J8783
62051A579950J2610O245K17n249j0402j5593k0868k6093l1283l6537m1600m5813
62039A365584m8704n0411n1315n1433n0488m8546m6068m3293l9983l6056l2042
62028H67245k8587k5727k3019k0211j7426j4843j2575j0801r674r142r034r202
62016F77004r439r523r568j0053j1094j1957j1769j0521q894p324n792m399l381
62003E63290k533j301M00K058L476N091P109Q813R366Q845Q001P157N855L679
$$ plain form
62086 853281 842761 835744 832293 831739 833907 839044 847006 857321 869897 885130 903322 924372 947948
62073 947948 973609 1000861 1029379 1059036 1089482 1119935 1149694 1178660 1207016 1234614 1261230
62062 1261230 1287358 1314274 1343135 1374267 1407289 1441420 1475471 1507823 1536822 1561167 1579950
62051 1579950 1592560 1598805 1599022 1593773 1583371 1567778 1546910 1520817 1489534 1452997 1411397 1365584
62039 1365584 1316880 1266469 1215154 1163721 1113233 1064687 1018619 975326 935343 899287 867245
62028 867245 838658 812931 789912 769701 752275 737432 724857 714056 704382 695240 686206 677004
62016 677004 667565 658042 648474 638421 627327 615370 603601 593080 584186 576862 571070 566671 563290
62003 563290 560757 559456 559856 561914 565390 570481 577590 586403 595769 604614 612615 619772 625627 629306
61989F29306J031j097k106k467l316n235p654r568j0663j1330j1822j1952j1663
61976E41464j1258j0897j0337r406q362p522o851o145n357m590l956l550l294
61963D49939k849k037j239r17q64n35j6J11j5N64K191L913M789N051N416O011
61947D69513O672P595Q829R792J0208J1027J3373J6839J9960K2132K4070K6425
61935F46435K8997L1489L3889L5858L6590L5800L4269L2999L2203L1374K9889
61924A009792K7365K3851J9863J5822J1430O178M50m584q370j1493j4452j6613
61912A059239j6935j5230j2128q199l664J288O463J1845J7345K2446K6402K8770
61900A117642K9470K8472K5759K1481J5890R124J378o747j4251k0275k4635k7823
$$ plain form
61989 629306 630337 629240 627134 624667 621351 616116 608462 598894 588231 576901 565079 553127 541464
61976 541464 530206 519309 508972 499566 491204 483682 476831 470686 465329 460739 456783 453233 449939
61963 449939 447090 445053 443814 442897 442033 441498 441482 441593 441578 442142 444333 448246 453035 458086 463502 469513
61947 469513 476185 483780 492609 502401 512609 523636 537009 553848 573808 595940 620010 646435
61935 646435 675432 706921 740810 776668 813258 849058 883327 916326 948529 979903 1009792
61924 1009792 1037157 1061008 1080871 1096693 1108123 1114301 1114751 1110167 1101797 1090304 1075852 1059239
61912 1059239 1042304 1027074 1014946 1006747 1003083 1004371 1010834 1022679 1040024 1062470 1088872 1117642
61900 1117642 1147112 1175584 1201343 1222824 1238714 1247838 1249216 1242469 1228218 1207943 1183308 1155485
61888A155485l0483l2770l4254l4477l3514l1851k9859k7707k5665k4101k3093
61877H27711k2391k1816k1394k1009k0376j9422j8342j7130j5453j3221j0923
61866F26234r051p473n663l373q55J393L009M087N323P497J0633J3997J7098K0331
61852F83187K4262K8711L3048L7165M1607M6686N1915N6377N9417O0932O1195
61841A184502O0454N8592N5191M9952M2905L4183K3919J2609J344q623j6520k2125
61829A476383k5398k6323k4973k1464j5921q675m40P918J5697K2356K7399L0450
61817A457009L1271K9521K4784J7053P065m131j5674k6805l6631m4500n0449n4865
61805A333648n7759n8850n8258n6629n4495n1890m8684m4967m0938l6760l2626
$$ plain form
61888 1155485 1125002 1092232 1057978 1023501 989987 958136 928277 900570 874905 850804 827711
61877 827711 805320 783504 762110 741101 720725 701303 682961 665831 650378 637157 626234
61866 626234 617183 609710 604047 600674 599819 601212 604221 608308 613631 621128 631761 645758 662856 683187
61852 683187 707449 736160 769208 806373 847980 894666 946581 1002958 1062375 1123307 1184502
61841 1184502 1244956 1303548 1358739 1408691 1451596 1485779 1509698 1522307 1523651 1515028 1498508 1476383
61829 1476383 1450985 1424662 1399689 1378225 1362304 1353629 1353189 1361107 1376804 1399160 1426559 1457009
61817 1457009 1488280 1517801 1542585 1559638 1566703 1562572 1546898 1520093 1483462 1438962 1388513 1333648
61805 1333648 1275889 1217039 1158781 1102152 1047657 995767 947083 902116 861178 824418 791792
61794G91792k8782k5413k2601k0372j8556j6719j4594j2547j1221j0661j0134
61783F00192r027p526o176n122m120l130k459k307k406k311j954j730k033k712
61769E47179l138k775j660k33J123K274L137L516L225K317J175L56K03N07P30
61754E57936O32N44Q54J382J594J288Q04N09L98K81J38Q2P6j57q39j754k297k060
61736E59411j356r51j197j721k045k099j965j548r01n11o92r13l53R85K316L133
61720E49593L625L984M053L867L878M248M498M229L721L380K978K043O45p00j722
61705E92320k501l029l235l338l681m173m349m032l535l143k836k631k720l040
61691E46077l044k296j094j93Kj93j22N99J741K567K443J467M53R3L23O06O47
$$ plain form
61794 791792 763010 737597 714996 694624 676068 659349 644755 632208 620987 610326 600192
61783 600192 591165 583639 577463 572341 568221 565091 562632 560325 557919 555608 553654 551924 549891 547179
61769 547179 544041 541266 539606 539373 540496 542770 545907 549423 552648 554965 556140 556496 556699 557206 557936
61754 557936 558568 559112 559966 561348 562942 564230 565034 565543 565941 566222 566360 566442 566518 566361 565522 563768 561471 559411
61736 559411 558055 557104 555907 554186 552141 550042 548077 546529 545628 545117 544425 543512 543159 544144 546460 549593
61720 549593 553218 557202 561255 565122 569000 573248 577746 581975 585696 589076 592054 594097 594742 594042 592320
61705 592320 589819 586790 583555 580217 576536 572363 568014 563982 560447 557304 554468 551837 549117 546077
61691 546077 543033 540737 539643 539450 539452 539259 539137 539736 541477 544044 546487 547954 548407 548500 548823 549429 550076
61674E50076N13K14l20q26p53M7R23J143P31K68j2m59j289k103k414k403k727
61657E40609l568m232l909k692j503r41n63L70J661K326K046J789K467L502L540
61642E40902K400J466J955L536N011N654N413M374K771J270M49J5r09k634m494
61627E67179n688o094o074n859n391m649l882l443l415l437l051k263j527j020
61613E11386l49O88J426J033k24j185j384j748l301n642p314p477o698o065n957
61598D67189n881n330m505m078m309m610m225l221k501k699l357l483k741j788
61584D14461j408j667k088k388k674k970k977k585k299k644l300l368k640k038
61570C79415k429l464m002l444k162q95k26m65j367k013j605m90Q5m99j493j748
$$ plain form
61674 550076 550589 550803 550483 549657 548904 548951 549874 551017 551748 552016 552004 551545 550256 548153 545739 543336 540609
61657 540609 537041 532809 528900 526208 524705 523764 523201 523571 525232 527558 529604 531393 533860 537362 540902
61642 540902 543302 544768 546723 550259 555270 560924 566337 570711 573482 574752 575201 575216 574307 571673 567179
61627 567179 561491 555397 549323 543464 538073 533424 529542 526099 522684 519247 516196 513933 512406 511386
61613 511386 511037 511725 513151 514184 513960 512775 511391 509643 506342 500700 493386 485909 479211 473146 467189
61598 467189 461308 455978 451473 447395 443086 438476 434251 431030 428529 425830 422473 418990 416249 414461
61584 414461 413053 411386 409298 406910 404236 401266 398289 395704 393405 390761 387461 384093 381453 379415
61570 379415 376986 373522 369520 366076 363914 363019 362793 362328 360961 358948 357343 356853 356938 356439 354946 353198
61554C53198r80J19P47N80r7n82k88O00J223J004L08j40j98k67m77m05K37J052
61536C55634J378J121Q86J226J979K508K505K263K194K334K500K585K432J703
61522C83248K96j251k242k625k899l236l236k640j846j440j573j978k350k505
61508C53723k352j934j412r10n36m09m95n52m77n56r32j098n58K08K33n21j088
61491C40334j015r12j151j035k4J143J488J283J424J751J283m8r97o45N12J438
61475C44829J786J832J748J488J064O03J84j63m30o72q82q67m85j8M2l72p87q36
61457C48064p29q88j324j599j330n85K14P00Q64Q90Q27O15M89Q70J689K157J685
61440C52609P59L87Q44J487J806K051K635L444M046M240M148L924L630L335L163
$$ plain form
61554 353198 352218 352337 353084 353664 353567 352985 352697 353297 354520 355524 355832 355692 355494 355227 354750 354345 354582 355634
61536 355634 357012 358133 359019 360245 362224 364732 367237 369500 371694 374028 376528 379113 381545 383248
61522 383248 383544 382293 380051 377426 374527 371291 368055 365415 363569 362129 360556 358578 356228 353723
61508 353723 351371 349437 348025 347115 346579 346170 345675 345123 344646 344090 343158 342060 341502 341710 341943 341422 340334
61491 340334 339319 338407 337256 336221 336197 337340 338828 340111 341535 343286 344569 344521 343524 342879 343391 344829
61475 344829 346615 348447 350195 351683 352747 353350 353534 353371 352941 352269 351387 350520 350035 350017 350059 349687 348900 348064
61457 348064 347335 346447 345123 343524 342194 341609 341823 342523 343387 344277 345104 345719 346208 347078 348767 350924 352609
61440 352609 353368 353755 354599 356086 357892 359943 362578 366022 370068 374308 378456 382380 386010 389345 392508
61425C92508L216L439L542L200K507K045K206K654K791K674K897L626M286M410
61411D36001M232M078L612K293L27j361k181k517l115m117m953n152m982n058
61397D17107n429n410m501l210k583k977l644l600k643j425p39q13j190j210o98
61382C77035j37pj50n2L77O97O29L54J15k9J46J054K515L453K933J377J98K25
61364C90733J006J672J978K168K276K068J597J354J686K346K887L307L996M996
61350D24070N762N852N684O172P632R411J0706J1472J2230J3223J4095J4410J4190
61337E54909J3767J3316J2722J1785J0345Q238N514K739P58j92r10k355m431o096
61323F20109o727o784o957p197p050o561o203o105n894n333m618l988l421k856
$$ plain form
61425 392508 395724 399163 402705 405905 408412 410457 412663 415317 418108 420782 423679 427305 431591 436001
61411 436001 440233 444311 447923 450216 450543 449182 447001 444484 441369 437252 432299 427147 422165 417107
61397 417107 411678 406268 401767 398557 395974 392997 389353 385753 383110 381685 380946 380133 378943 377733 377035
61382 377035 376898 376891 376741 376689 377066 377763 378392 378746 378861 378832 378978 380032 382547 386000 388933 390310 390508 390733
61364 390733 391739 393411 395389 397557 399833 401901 403498 404852 406538 408884 411771 415078 419074 424070
61350 424070 429832 435684 441368 447540 455172 464583 475289 486761 498991 512214 526309 540719 554909
61337 554909 568676 581992 594714 606499 616844 625082 630596 633335 634093 633901 632991 630636 626205 620109
61323 620109 613382 606598 599641 592444 585394 578833 572630 566525 560631 555298 550680 546692 543271 540415
61309E40415k394k078j763j352r51p21o93p39n73J75J649L497N155O367P176P492
61293E60662P030N762M030K041k80k812m912n993o176o055n943n686n090m255
61279E32323l458k832k227j287K02J925L168L544L439L608M427N766P413R211
61265E65222J0797J1589J1307J0336R409Q955Q855Q770Q621Q767R739J1680J4068
61252F98115J6100J7488J8667K0074K1256K1065J8800J4922J0472N969J249l714
61240H60463q215j1348j2978j3922j5021j6207j6582j5518j3461j1454r967q614
61228G07176p109n978n852o393o600o055n202m327l075j265M74J448J790K028
61214F61060K119J540K15j305k503l212l277k450q31R32K096K271J525K52j000
$$ plain form
61309 540415 538021 535943 534180 532828 531877 531156 530463 529724 529151 529326 530975 534472 539627 545994 553170 560662
61293 560662 567692 573454 577484 579525 579245 576433 571521 565528 559352 553297 547354 541668 536578 532323
61279 532323 528865 526033 523806 522519 522721 524646 527814 531358 534797 538405 542832 548598 556011 565222
61265 565222 576019 587608 598915 609251 618660 627615 636470 645240 653861 662628 672367 684047 698115
61252 698115 714215 731703 750370 770444 791700 812765 831565 846487 856959 862928 864177 860463
61240 860463 852248 840900 827922 814000 798979 782772 766190 750672 737211 725757 715790 707176
61228 707176 700067 694089 688237 681844 675244 669189 663987 659660 656585 655320 655794 657242 659032 661060
61214 661060 663179 664719 664934 663629 661126 657914 654637 652187 651356 652288 654384 656655 658180 658432 657432
61199F57432j831k195k258k057j468l78J303L606O288Q817J0922J3019J5641J8589
61185G25430K1052K2630K3691K4510K4511K2810J9469J5837J3424J2527J2178
61174I38069J1439J0487J0102J0358J0475R867Q683P080M761J699j359l766n852
61161A012043q284j0968j3293j5062j6398j7091j7025j6961j7821j9165j9527
61150H40448j8394j6785j5556j4161j1792q787o123m040k075r4J433K215K477
61137G48766K428J785M6k861o275r162j0748j0941j0167q952p682o456n039l116
61123F71626q43J179K710M269O404Q923J1318J3485J5505J7145J8325J9731K2028
61110H11805K4654K6277K6380K5651K4889K4454K4667K5636K6626K6498K5070
$$ plain form
61199 657432 655601 653406 651148 649091 647623 647245 648548 652154 658442 667259 678181 691200 706841 725430
61185 725430 746482 769112 792803 817313 841824 864634 884103 899940 913364 925891 938069
61174 938069 949508 959995 970097 980455 990930 1000797 1009480 1016560 1021321 1023020 1021661 1017895 1012043
61161 1012043 1003759 992791 979498 964436 948038 930947 913922 896961 879140 859975 840448
61150 840448 822054 805269 789713 775552 763760 754973 748850 744810 742735 742641 744074 746289 748766
61137 748766 751194 752979 753025 750164 743889 734727 723979 713038 702871 693919 686237 679781 674742 671626
61123 671626 670783 671962 674672 678941 685345 694268 705586 719071 734576 751721 770046 789777 811805
61110 811805 836459 862736 889116 914767 939656 964110 988777 1014413 1041039 1067537 1092607
61099A092607K3203K1519J9890J8272J6908J5434J2906R070M673J46m877j0317
61087A219434j5045j8216k0267k1959k3309k4146k4833k5638k6104k5843k5245
61076I68829k4706k3832k2209k0300j8785j7508j5915j4039j2334j0926r657q495
61064G70123p349n950m365l146k428j581k13J139J924K464L293M289N204O351
61050G69755P997R659J0792J1677J2858J4254J5510J6776J8414K0352K2341K4356
61038I54741K6242K7560K8270K8982L0090L1362L2690L4329L5975L6777L6793
61027A303811L7229L8612M0097M1329M3447M7192N1484N5154N8631O2557O6061
61016A845604O7950O8320O7822O6794O6577O9863P7892Q8853J00834J14395J30182
$$ plain form
61099 1092607 1115810 1137329 1157219 1175491 1192399 1207833 1220739 1229809 1234482 1234628 1229751 1219434
61087 1219434 1204389 1186173 1165906 1143947 1120638 1096492 1071659 1046021 1019917 994074 968829
61076 968829 944123 920291 898082 877782 858997 841489 825574 811535 799201 788275 778618 770123
61064 770123 762774 756824 752459 749313 746885 745304 745091 746230 748154 750618 753911 758200 763404 769755
61050 769755 777752 787411 798203 809880 822738 836992 852502 869278 887692 908044 930385 954741
61038 954741 980983 1008543 1036813 1065795 1095885 1127247 1159937 1194266 1230241 1267018 1303811
61027 1303811 1341040 1379652 1419749 1461078 1504525 1551717 1603201 1658355 1716986 1779543 1845604
61016 1845604 1913554 1981874 2049696 2116490 2183067 2252930 2330822 2419675 2520509 2634904 2765086
61005B765086J46248J60535J74180J89783K08834K34211K72483L29308M04834
60996D885502M98752O17799P72480R69084J212674J515579J891533K338978K836685
60987A7539066L345987L786731M000361L782459L025356J863963O55908k25053
60979C7774778n99717n14585j21350M13853Q86860J031846O28758l19791j539543
60970C7641109k645720l371686l666775l625783l372349l004278k595121k198301
60962A3161096j841449j530906j266345j046912q67364p18794n95551m96531m19426
60953D377818l58805l10350k72360k42441k16765j93514j73394j56009j39012
60944B315168j21610j05665r2379q0888p1063o4815o3186o4468o6325o7781o8228
$$ plain form
61005 2765086 2911334 3071869 3246049 3435832 3644666 3878877 4151360 4480668 4885502
60996 4885502 5384254 6002053 6774533 7743617 8956291 10471870 12363403 14702381 17539066
60987 17539066 20885053 24671784 28672145 32454604 35479960 37343923 37999831 37774778
60979 37774778 37175061 36660476 36539126 36952979 37839839 38871685 39500443 39180652 37641109
60970 37641109 34995389 31623703 27956928 24331145 20958796 17954518 15359397 13161096
60962 13161096 11319647 9788741 8522396 7475484 6608120 5889326 5293775 4797244 4377818
60953 4377818 4019013 3708663 3436303 3193862 2977097 2783583 2610189 2454180 2315168
60944 2315168 2193558 2087893 1995514 1914626 1843563 1778748 1715562 1651094 1584769 1516988 1448760
60933A448760o6734o3475n9993n7029n3708m9600m5687m2508l9219l5426l2149
60922I03232k9995k8065k5675k3514k2101k0692j8742j6920j5672j4315j2584
60911F74957j1481j1358j0783q693o226m912m271k917j049k7j43m07k33J14M46
60896F13017Q78J192R89L33m60j309k062k162j396n15l64q40j369j896k684l602
60880E97750m397n208o062o363n690m740m611n454o536p345p876q077p820p335
60866E10236p036o951o737o164n218l964k642j604r38n00l79p26r78j03J924L745
60850D71965M348M249M285M204L474K705K927L917M550M601M913N766O279N657
60836E33840M105K242M13j099j909j973j730j534j320j035r22j131j402j329q11
$$ plain form
60933 1448760 1382026 1318551 1258558 1201529 1147821 1098221 1052534 1010026 970807 935381 903232
60922 903232 873237 845172 819497 795983 773882 753190 734448 717528 701856 687541 674957
60911 674957 663476 652118 641335 632642 626416 621504 617233 614316 613267 613240 613097 612690 612457 612571 613017
60896 613017 613895 615087 616076 616409 615949 614640 612578 610416 609020 608505 608141 607301 605932 604036 601352 597750
60880 597750 593353 588145 582083 575720 570030 565290 560679 555225 548689 541344 533468 525391 517571 510236
60866 510236 503200 496249 489512 483348 478130 474166 471524 469920 468982 468482 468103 467377 466399 466296 468220 471965
60850 471965 476313 480562 484847 489051 492525 495230 498157 502074 506624 511225 516138 521904 528183 533840
60836 533840 537945 540187 540600 539501 537592 535619 533889 532355 531035 530000 529078 527947 526545 525216 524405
60821E24405j12L90M66K31J5l6j58n81j199j842k686l996n604o935p579p651p616
60804D79512p893q452q703p989o381m730l817l681l905m140m158l810l291l113
60790D05449l399l511k782j417l26j58p38j295j098j25Q14R54N57N48J123J466
60774C96062J093O53Q93J616K342L274M683N953O222N715N492N985O698P226P740
60759D61647Q347Q725Q541P778O573N218M207L795L563K981K225J897K032K062
60745E29591J770J539J584J601J307P66k6j264k828m168m989n685o702p837q504
60730D96155q479q114p807p507o869n855n008m893n315n491n105m670m582m396
60716D12064l599k584k094j964j241M06K129K874K454J507R40J379K764M266N041
$$ plain form
60821 524405 524293 524683 525149 525380 525395 525359 525201 524620 523421 521579 518893 514897 509293 502358 494779 487128 479512
60804 479512 471619 463167 454464 446475 440094 435364 431547 427866 423961 419821 415663 411853 408562 405449
60790 405449 402050 398539 395757 394340 394014 393856 393118 391823 390725 390600 391414 392368 392925 393473 394596 396062
60774 396062 397155 397808 398701 400317 402659 405933 410616 416569 422791 428506 433998 439983 446681 453907 461647
60759 461647 469994 478719 487260 495038 501611 506829 511036 514831 518394 521375 523600 525497 527529 529591
60745 529591 531361 532900 534484 536085 537392 538158 538132 536868 534040 529872 524883 519198 512496 504659 496155
60730 496155 487676 479562 471755 464248 457379 451524 446516 441623 436308 430817 425712 421042 416460 412064
60716 412064 408465 405881 403787 401823 400582 400988 403117 405991 408445 409952 410892 412271 415035 419301 424342
60701D24342N148N364O129P028P370O944O140N579N649O120O325N926N296M845
60687E08205M314L226J772O31M1l13o46r12j196j535j411k05J744L304M000M492
60671E25511N382O284O614O593O905P673Q488R161R934J0947J1950J2664J3225
60658F41331J4057J5281J6368J6636J6107J5582J5587J5603J4738J2840J0485
60647H04615Q080N630L235J134p46k755n003p406j0090j3139j5870j7191j6804
60634G33690j5515j4200j3112j2286j1870j1687j1129r878q335p065o227n611
60622F06775m809l355j316K40K46p72j063J7J039M32j540l457m597n201n479n433
60606E71727n333n412n311m583l677l530m241m960n067m850m808m983n146n154
$$ plain form
60701 424342 429490 434854 440983 448011 455381 462325 468465 474044 479693 485813 492138 498064 503360 508205
60687 508205 512519 515745 517517 518148 518189 517876 517230 516318 515122 513587 512176 511971 513715 517019 521019 525511
60671 525511 530893 537177 543791 550384 557289 564962 573450 582611 592545 603492 615442 628106 641331
60658 641331 655388 670669 687037 703673 719780 735362 750949 766552 781290 794130 804615
60647 804615 812695 818325 821560 822694 821948 819193 814190 806784 796694 783555 767685 750494 733690
60634 733690 718175 703975 690863 678577 666707 655020 643891 634013 625678 618613 612386 606775
60622 606775 601966 598611 597295 597535 597781 597009 595946 595963 597002 597434 595894 592437 587840 582639 577160 571727
60606 571727 566394 560982 555671 551088 547411 543881 539640 534680 529613 524763 519955 514972 509826 504672
60592E04672m868m152l178k412k124k052j765j192p03p14j181j495j025J06J056
60577D78973J218R86J229K200L393M348N177O162P258Q256R282J0774J2917J5364
60563E67537J7750K0350K3850K8245L2265L4241L3355K9865K4372J7424R642J594
60551H40490o425j3959j9802k2612k2341k0372j7943j5075j1317o818k133K539
60539F84232P304J2130J6996K2126K7690L3480L9092M3994M7154M7325M4196L8698
60527A064417L1647K2772J1870L10r666j6844k1300k3138k2171j9055j5556j3182
60515I90104j2084j1544j1021j0343r417q155o569m719k717o98J321L473N660
60502I23291P444Q653R900J2070J5508K0250K6704L5359M5875N7176O8539P9889
$$ plain form
60592 504672 499804 495652 492474 490062 487938 485886 484121 482929 482226 481512 480331 478836 477811 477917 478973
60577 478973 480191 481177 482406 484606 487999 492347 497524 503686 510944 519200 528482 539256 552173 567537
60563 567537 585287 605637 629487 657732 689997 724238 757593 787458 811830 829254 838896 840490
60551 840490 834065 820106 800304 777692 755351 734979 717036 701961 690644 683826 681693 684232
60539 684232 691536 703666 720662 742788 770478 803958 843050 887044 934198 981523 1025719 1064417
60527 1064417 1096064 1118836 1130706 1131016 1121350 1104506 1083206 1060068 1037897 1018842 1003286 990104
60515 990104 978020 966476 955455 945112 935695 927540 920971 916252 913535 912837 914158 917631 923291
60502 923291 930735 939388 949288 961358 976866 997116 1023820 1059179 1105054 1162230 1230769 1310658
60490A310658R0882J00405J07171J10321J09271J03570R3313P9397O3205M6228
60480B214421K9821J4680M03j3962k8799m3754n8559p3169q6893r8142j05573
60469A750474j09003j08870j05442r9056r0707q1721p2977o4760n7122n0120m3855
60458H66841l8554l4283l0549k6652k2693j9644j8052j7255j6327j5221j4259
60447F13352j3100j1195q992p618p314p076o069m591l274k108q79O7K01k36l79
60432E40789J65Q42R12K55o99j555k294l186m508o167p466p541o254m493l269
60417D95531k668k003q82L52J240J737J962J861J471J116R65P79M57M91J280K270
60401E05959K412J477K91l31l35l8M16R97J565K052K494K832K883K624K168J507
$$ plain form
60490 1310658 1401540 1501945 1609116 1719437 1828708 1932278 2025591 2104988 2168193 2214421
60480 2214421 2244242 2258922 2259325 2245363 2216564 2172810 2114251 2041082 1954189 1856047 1750474
60469 1750474 1641471 1532601 1427159 1328103 1237396 1155675 1082698 1017938 960816 910696 866841
60458 866841 828287 794004 763455 736803 714110 694466 676414 659159 642832 627611 613352
60447 613352 600252 589057 580065 572447 565133 558057 551988 547397 544123 542015 541136 541203 541404 541168 540789
60432 540789 540954 541796 542708 542963 542264 540709 538415 535229 530721 524554 517088 509547 503293 498800 495531
60417 495531 492863 490860 489978 490330 491570 493307 495269 497130 498601 499717 500682 501461 501918 502409 503689 505959
60401 505959 508371 509848 510139 509808 509473 509435 509851 510848 512413 514465 516959 519791 522674 525298 527466 528973
60385E28973P30M09J130K477L210K760J895J533J566J469J411J937K848L282K927
60370E58557K407K416L008L851M680N292N557N602N776O223O716O967O866O458
60356F30376N903N520N489N500M942L636K154J246J125J530K241L327M938P095
60342F85022R741J2826J6255J9849K3451K6923K9790L0949K9243K4579J8222J1513
60330I38363M586l104j1164j7995k2331k4339k4809k4022k2056j9584j7448j5689
60318G40408j3820j1921j0619r928q947o975m239j330J437L792N397O465Q038
60305F97758J1021J5278K0128K5438L1694L9210M7638N5847O1743O2682N7180
60294A125617M6342L2852J8231J905j6608l5294n0235n8460n9766n5998m9277
$$ plain form
60385 528973 529703 530112 531242 533719 536929 539689 541584 543117 544683 546152 547563 549500 552348 555630 558557
60370 558557 560964 563380 566388 570239 574919 580211 585768 591370 597146 603369 610085 617052 623918 630376
60356 630376 636279 641799 647288 652788 657730 661366 663520 664766 665891 667421 669662 672989 677927 685022
60342 685022 694763 707589 723844 743693 767144 794067 823857 854806 884049 908628 926850 938363
60330 938363 942949 939845 928681 910686 888355 864016 839207 815185 793129 773545 756097 740408
60318 740408 726588 714667 704048 694120 685173 678198 673959 672629 674066 677858 683255 689720 697758
60305 697758 708779 724057 744185 769623 801317 840527 888165 944012 1005755 1068437 1125617
60294 1125617 1171959 1204811 1223042 1224947 1208339 1173045 1122810 1064350 1004584 948586 899309
60283H99309m0993l1840k2301j3077n093R77N147P793Q933Q066M905L9n374j0439
60269H06052j4900j8765k1741k3211k2790k0914j8638j6698j4846j2454r623p266
60257F04206o012n503n004m292l583k990k534k464k982l734m091l934l687l527
60243E49869l104k205j235p28o95p38n90l26k01l94q20j042n88N36J828K865L687
60226E46119M513N368O112O665P025P175P070O544N358L599K051J633K265K791
60212F14288K266R69j71p22r16j035j117j055o21M14J779K537J976N56m73l58
60196F18317N83J470J580P31m76r39j41J087J449P37j01l44j33L48J310K544L066
60179F31088K327J193R07J416J521N57q94j981k499k683k610k176j280J07J827
$$ plain form
60283 899309 858316 826476 804175 791098 786005 786982 792129 799922 808855 816921 821826 821865 816491 806052
60269 806052 791152 772387 750646 727435 704645 683731 665093 648395 633549 621095 611472 604206
60257 604206 598194 592691 587687 583395 579812 576822 574288 571824 568842 565108 561017 557083 553396 549869
60243 549869 546765 544560 543325 542597 541902 541164 540574 540248 540047 539653 538833 537791 537203 537739 539567 542432 546119
60226 546119 550632 556000 562112 568777 575802 582977 590047 596591 601949 605548 607599 609232 611497 614288
60212 614288 616554 617523 617352 616630 615714 614679 613562 612507 611886 612300 614079 616616 618592 619148 618675 618317
60196 618317 618900 620370 621950 622681 622205 621266 621125 622212 623661 624398 624297 623953 623820 624168 625478 628022 631088
60179 631088 633415 634608 635515 636931 638452 639009 638115 636134 633635 630952 628342 626166 624886 624993 626820
60164F26820L288L839L597L594M743O783Q548R122Q490P142N497L690J665o80
60150F96138l165n195o109n924n390n149m995m270k826j247l3J029K525M652P069
60135F67110R350J1359J3158J4750J5863J5931J4350J1004O587K213j463m672
60123G75540p942j1195j3558j4219j3259j1482r524p448n308l663l065l159k870
60110F68848j661j52P27R26J137J766K487K904L182L863N237P100Q933J0169J0389
60095G25855R542Q051O630N811N501N038L836K115Q65R01J937K841K847K376K414
60080G86560L171L740L185J703K82o62j709l369n160o324p071q316j0243j1953
60066G43834j2660j2587j2263j1599j0223q320o524n239m491m237m291m202l705
$$ plain form
60164 626820 630108 633947 637544 641138 645881 652664 661212 670334 678824 685966 691463 695153 696818 696138
60150 696138 692973 687778 681669 675745 670355 665206 660211 655941 653115 651868 651835 652864 655389 660041 667110
60135 667110 676460 687819 700977 715727 731590 747521 761871 772875 779462 781675 780212 775540
60123 775540 767598 756403 742845 728626 715367 703885 694361 686913 681605 677942 674877 671718 668848
60110 668848 667187 667035 667762 668688 669825 671591 674078 676982 680164 684027 689264 696364 705297 715466 725855
60095 725855 735397 743448 750078 755889 761390 766428 770264 772379 773244 774145 776082 778923 781770 784146 786560
60080 786560 789731 793471 796656 798359 798641 797979 796270 792901 787741 781417 774346 766030 755787 743834
60066 743834 731174 718587 706324 694725 684502 676182 669658 664419 659928 655691 651400 647198 643493
60053F43493l185l231l874m706n488o184o539o372o038n948n654m306k133n08
60039E79327j94l42K09J383K311K745L159L696L926L661L276L035K644J787O94
60024F11317j24n41q98j519k312k945l324l760m573n603o286o227n525m532l556
60009E59592k918k862l202l298k785k054j687j601j221m34L04Q22J582K814L911
59994E46963M199L956M056M755N471N703N515M966L787K051N91J21K59Q3n30q35
59978E91111m45R6J50k42p80j450k282k951l121k891k545k153j809j873k423k756
59962E63636k052m35J167K104K452K501K366K126J805J248M18k66m25m74j181
59947E74990k420l143k665j345J77J592K554K551J748J157J349J546P55p23j769
$$ plain form
60053 643493 640308 637077 633203 628497 623009 616825 610286 603914 597876 591928 586274 581968 579835 579327
60039 579327 579133 578791 579000 580383 582694 585439 588598 592294 596220 599881 603157 606192 608836 610623 611317
60024 611317 611193 610652 609754 608235 605923 602978 599654 595894 591321 585718 579432 573205 567680 563148 559592
60009 559592 556674 553812 550610 547312 544527 542473 540786 539185 537964 537530 537834 538656 540238 543052 546963
59994 546963 551162 555118 559174 563929 569400 575103 580618 585584 589371 591422 592013 592134 592393 592476 591946 591111
59978 591111 590666 590762 590912 590670 589890 588440 586158 583207 580086 577195 574650 572497 570688 568815 566392 563636
59962 563636 561584 561149 562316 564420 566872 569373 571739 573865 575670 576918 577336 577070 576645 576171 574990
59947 574990 572570 569427 566762 565417 565594 567186 569740 572291 574039 575196 576545 578091 578846 578123 576354
59932E76354k023k109k383k454k073j643j531j402p38L77J301J531J127N49K78
59917E65161M57Q06R18O60K49m5j16L2L70P53Q77M67l88j145j172l58O74J155
59899E69355R41N42M24N11N16L94L44N49J072J830K533K870K919L175L930M874
59883E96779N499N749N949O235O408O339O264O581P392Q248Q394P397N609L798
59869F86641K383J125l53k068l761n190o204o725o860o812o573n953n019m157
59855F30474l602l205k875k833l155l383l001k083j195p77p82p11J49K233N177
59840F10431Q080J0468J2666J4956J6792J7158J5451J1817P083K656om33O42K352
59826G30113M465O579P223M741q85p688j3252j6307j7098j6840j6721j7000j6982
$$ plain form
59932 576354 574331 572222 569839 567385 565312 563669 562138 560736 559998 560375 561676 563207 564334 564883 565161
59917 565161 565618 566424 567342 568002 568251 568206 568090 568122 568492 569245 570122 570589 570201 569056 567884 567526 568200 569355
59899 569355 570296 570838 571262 571773 572289 572683 573027 573576 574648 576478 579011 581881 584800 587975 591905 596779
59883 596779 602278 608027 613976 620211 626619 632958 639222 645803 653195 661443 669837 677234 682843 686641
59869 686641 689024 690149 689796 687728 683967 678777 672573 665848 658988 652176 645603 639650 634631 630474
59855 630474 626872 623667 620792 617959 614804 611421 608420 606337 605142 604365 603583 602872 603021 605254 610431
59840 610431 618511 628979 641645 656601 673393 690551 706002 717819 724902 727558 727552 727119 727761 730113
59826 730113 734578 741157 748380 753121 752236 744548 731296 714989 697891 681051 664330 647330 630348
59813F30348j6048j4448j2840j1487j0275r114p865o328m722l685l308k810j842
59800E25576j291j927k988l242k859k918l489l720l589l917m599m442l169j991
59786D81435j733j727j275q10q07o89J41J088J221O52J60K8M4J52L12J51n27j299
59768D76517j740k011k276k100j162M1Q17J172J398J307P07J10J75P57J234J482
59752D76428J783K135K399K771L380L754L464K966K996L423L564L395L454L656
59738E19568L196J791K05o84p42m28k90o39j226j307o15j2n20j844k725k634k255
59721E08839k226k363k371k417k585k517k010j365p93o4Q41J334J031M94O09J518
59705D95955K583L249L470L452L363L275L230L297L597M092M382M011L096K332
$$ plain form
59813 630348 614300 599852 587012 575525 565250 556136 548271 541943 537221 533536 530228 527418 525576
59800 525576 524285 522358 519370 516128 513269 510351 506862 503142 499553 495636 491037 486595 483426 481435
59786 481435 479702 477975 476700 475890 475083 474394 474535 475623 476844 477496 477656 477684 477728 477880 478192 478343 477816 476517
59768 476517 474777 472766 470490 468390 467228 467269 468086 469258 470656 471963 472670 472780 472955 473712 474946 476428
59752 476428 478211 480346 482745 485516 488896 492650 496114 499080 502076 505499 509063 512458 515912 519568
59738 519568 522764 524555 524760 524076 523334 522906 522616 521977 520751 519444 518829 518817 518297 516453 513728 511094 508839
59721 508839 506613 504250 501879 499462 496877 494360 492350 490985 490192 490128 490969 492303 493334 493828 494437 495955
59705 495955 498538 501787 505257 508709 512072 515347 518577 521874 525471 529563 533945 537956 541052 543384
59691E43384K255K720L168L148K501J318o0j247k101k655k794k333j466p63n54
59676E44521o31o74o42n67l91k20l98j032j712j994j948j941k098k241k247k156
59660E23629k015j830j632j399j020m29K05O85J026J376J738J980K071K123K171
59645E28679K038J537O85l42j388k310k904l013k826k772k934k794j960r58p31
59630E08007j295j561q10K77N54l5n17k30N46J269J767K091K223K115J738J034
59614E17173L1j031j959k830l675m071l547k318j180o02l83j46K58Q21J388J569
59598D99498J087K47l59n97p82r97j025r52j108j308r10J00Q88R53Q39J094J228
59581D97896M92q14j670j787j881k524l485m295m832n059m694l609k278j411j155
$$ plain form
59691 543384 545639 548359 551527 554675 557176 558494 558434 557187 555086 552431 549637 547304 545838 545075 544521
59676 544521 543890 543216 542574 542007 541616 541396 540998 539966 538254 536260 534312 532371 530273 528032 525785 523629
59660 523629 521614 519784 518152 516753 515733 515304 515509 516194 517220 518596 520334 522314 524385 526508 528679
59645 528679 530717 532254 532939 532597 531209 528899 525995 522982 520156 517384 514450 511656 509696 508738 508007
59630 508007 506712 505151 504341 504618 505172 505137 504620 504390 504936 506205 507972 510063 512286 514401 516139 517173
59614 517173 517204 516173 514214 511384 507709 503638 500091 497773 496593 495991 495608 495462 495720 496541 497929 499498
59598 499498 500585 500832 500473 499876 499094 498097 497072 496120 495012 493704 492794 492894 493782 494735 495574 496668 497896
59581 497896 498388 497574 495904 494117 492236 489712 486227 481932 477100 472041 467347 463738 461460 460049 458894
59566D58894j024n89L2N43R64J409J621J255O61O70J351J596N54j049j735j115
59550D64038j27M27O85J066J646K377L173L640L381K792K792L616M682N843P874
59535E07905J1237J5296J9235K2809K5265K4585J9106R839J25o939j0234j0234
59523F27995p978m568r19K376M857O158O558P003P982Q676P957N946L724J725
59509F77492n60l269n620p022p919r026j0369j1522j2252j2438j1785j0207q296
59496E67207o936o472o546o586o277n657m954m404m042l674l149k531j994j558
59482E02427j023k15P26J360J443J361J803K916M087M824N398O256P056O854N254
59467E50527K974J153L86L78L18l95j497k003j266K20J446K176L104M713O552
$$ plain form
59566 458894 457870 457281 457313 457856 458820 460229 461850 463105 463766 464436 465787 467383 467937 466888 465153 464038
59550 464038 463911 464338 465023 466089 467735 470112 473285 476925 480306 483098 485890 489506 494188 500031 507905
59535 507905 519142 534438 553673 576482 601747 626332 645438 655277 655402 648463 638229 627995
59523 627995 620017 615449 614530 616906 621763 627921 634479 641482 649464 658140 666097 672043 675767 677492
59509 677492 676932 673663 668043 661021 653102 644076 633707 622185 609933 597495 585710 575503 567207
59496 567207 560271 553799 547253 540667 534390 528733 523779 519375 515333 511659 508510 505979 503985 502427
59482 502427 501404 501189 501915 503275 504718 506079 507882 510798 514885 519709 525107 531363 538419 545273 550527
59467 550527 553501 554654 555040 555418 555736 555341 553844 551841 550575 550795 552241 554417 557521 562234 568786
59452E68786P925Q887J0205J2416J5146J7460J8760J9315J9798K0334K0154J8242
59440G57428J4153Q170J107n842j1505j5381j7738j8884j8806j7714j6335j5061
59428F43592j3482j1394r661r051q741p215m425j733K65K482N579Q872J1545J3829
59414F20462J6215J8535K0587K2764K5306K7749K9777L1500L1834K7877J7681
59403H90287L354j0113j9037k2951k2894j9743j4514q499k323L854Q375P791O0
59390G93647j2380k4041l0840l2530l1184k8619k5527k2088j8512j5059j1896
59379E40971r120o853n341m702m508l914k505q26K61N59N33N14M09K32L25R15
59363E06950J779K577L104L208K823K291K177K522K746K658K969M249N867O774
$$ plain form
59452 568786 576711 585598 595803 608219 623365 640825 659585 678900 698698 719032 739186 757428
59440 757428 771581 779751 780858 775016 763511 748130 730392 711508 692702 674988 658653 643592
59428 643592 630110 618716 609055 600004 591263 584048 579623 577890 578155 580637 586216 595088 606633 620462
59414 620462 636677 655212 675799 698563 723869 751618 781395 812895 844729 872606 890287
59403 890287 893641 883528 864491 841540 818646 798903 784389 775890 773567 777421 785796 793587 793647
59390 793647 781267 757226 726386 693856 662672 634053 608526 586438 567926 552867 540971
59379 540971 531851 524998 519657 514955 510447 506533 504028 503202 503463 504022 504555 505069 505478 505710 506035 506950
59363 506950 508729 511306 514410 517618 520441 522732 524909 527431 530177 532835 535804 540053 545920 552694
59349E52694P120Q063J0010J2025J3276J4178J5553J7427J9329K1131K2807K3775
59337G37388K3419K2126K0918K0056J8794J6541J3549J0193O423K332j380m144
59325H86215o326q733j1413j3600j4793j5425j6224j7166j7400j6320j4451j2980
59313G21384j2376j1872j0586q723p157o171n330m551m358m827n069m345l026
59300F32993j874q61N25K181L485M385N582P507R823J2132J4554J7321K0301K3369
59286G51423K6776L0460L3018L1910K5177J3181j165j3965k2384k5729k4983k1655
59274H02064j7035j2088p442l292M53L757O293P913R083J0574J2647J4616J5408
59261H42951J4547J2494R969P107L578n79m655p974j0584j2955j5224j7064j8211
$$ plain form
59349 552694 559814 567877 577887 589912 603188 617366 632919 650346 669675 690806 713613 737388
59337 737388 760807 782933 803851 823907 842701 859242 872791 882984 889407 891739 890359 886215
59325 886215 879889 871156 859743 846143 831350 815925 799701 782535 765135 748815 734364 721384
59313 721384 709008 697136 686550 677827 670670 664499 659169 654618 650260 645433 640364 636019 632993
59300 632993 631119 630258 630783 632964 636449 640834 646416 653923 663746 675878 690432 707753 728054 751423
59286 751423 778199 808659 841677 873587 898764 911945 910780 896815 874431 848702 823719 802064
59274 802064 785029 772941 765499 762207 762660 766417 772710 780623 789706 800280 812927 827543 842951
59261 842951 857498 869992 879961 887068 890646 890067 885412 877438 866854 853899 838675 821611 803400
59248H03400j8673j8516j7783j6643j5370j4065j2657j1124r433p419n085l025
59236F53607j927j576q58Q45K796L895M123M434N383O488O978O625N678M375K758
59221G03624P63j639m253o564q041q629q773q941r279r741j0236j0557j0385r510
59207E97839p992o081m266l264l528m540n039m258k724j484r25o51k94J82P80
59192E53755J520K129K241J996K028K664L539M203M681N145N475N492N426N675
59178F05969O188O432O078N468N316N917O723O815N994N279N851P553Q970R149
59164F97702Q684Q624R074R526J0051J1094J2193J2054J0285Q107O741N741L698
59151H13574K76l229n370o001o127o736q060r746j1324j2398j2644j1961j0732
$$ plain form
59248 803400 784727 766211 748428 731785 716415 702350 689693 678569 669136 661717 656632 653607
59236 653607 651680 650104 649246 650091 652887 656782 660905 665339 670722 677210 684188 690813 696491 700866 703624
59221 703624 704387 702748 698495 691931 683890 675261 666488 657547 648268 638527 628291 617734 607349 597839
59207 597839 589847 583766 579500 576236 572708 568168 563129 558871 556147 554663 553738 553087 552793 552975 553755
59192 553755 555275 557404 559645 561641 563669 566333 569872 574075 578756 583901 589376 594868 600294 605969
59178 605969 612157 618589 624667 630135 635451 641368 648091 654906 660900 666179 672030 679583 688553 697702
59164 697702 706386 715010 724084 733610 743661 754755 766948 779002 789287 797394 804135 809876 813574
59151 813574 813850 810621 805251 799250 793123 786387 778327 768581 757257 744859 732215 720254 709522
59138G09522r602q704p392n158k683j340j521k075j710m76O42J160J564K486L985
59123F78698N711P343Q796J0257J1967J3819J5282J6061J6575J7400J8345J8668
59111H38922J8196J7633J7512J7407J6548J4826J2730J0587Q386O274M720L958
59099I87699L586K932J709J67j362k892m601o318p465p738p587p639p725p080
59085I35686n651m585m958o434p871q919j0253j2265j4336j5753j6552j7077j7218
59072G93814j6709j5867j5309j5118j4835j4170j3176j1745r597o972m817l921
59060F51578m160m747m973m496l387k157j463j434j574j571j772k456l061k831
59046F11496k001j534j703j736j098k63J47K83N59P57M85J38N84J948L486M699
$$ plain form
59138 709522 699920 691216 683824 678666 675983 674643 673122 671047 669337 668861 669503 670663 672227 674713 678698
59123 678698 684409 691752 700548 710805 722772 736591 751873 767934 784509 801909 820254 838922
59111 838922 857118 874751 892263 909670 926218 941044 953774 964361 972747 979021 983741 987699
59099 987699 991285 994217 995926 996093 994731 991839 987238 980920 973455 965717 958130 950491 942766 935686
59085 935686 930035 925450 920492 914058 906187 897268 887015 874750 860414 844661 828109 811032 793814
59072 793814 777105 761238 745929 730811 715976 701806 688630 676885 667288 660316 655499 651578
59060 651578 647418 642671 637698 633202 629815 627658 626195 624761 623187 621616 619844 617388 614327 611496
59046 611496 609495 607961 606258 604522 603424 603161 603308 603591 604150 604907 605392 605530 606114 608062 611548 616247
59030F16247N776O757P088O529N911O273P597R045J0234J1562J3267J4981J6341
59017G37608J7508J8655J9331J8835J7027J4405J1452Q291M969J770r02k827m025
59004H62097m550m304l174j301Q27K724M260N491O287O462O216O009N878N299
58990H98221L979K375J072k4j397l126m865o517q319j0346j2336j4073j5477j6301
58976H12866j6130j4883j2965j0909r096p666o375m552j760J514M287O208P804
58963G48343R569J1396J2953J3994J4209J3390J1981J0762R716P916M824J025
58951H70078k786o621j0466j3479j4913j5305j5731j6243j5951j4542j2706j1068
58939G20267r500p727n898m324l136k420k281k640l229l846m392m756m960n187
$$ plain form
59030 616247 622023 628780 635868 642397 648308 654581 662178 671223 681457 693019 706286 721267 737608
59017 737608 755116 773771 793102 811937 828964 843369 854821 863112 868081 869851 868949 866122 862097
59004 862097 857547 853243 850069 848768 849595 852319 856579 862070 868357 874819 881035 887044 892922 898221
58990 898221 902200 904575 905647 905623 904226 901100 896235 889718 881399 871053 858717 844644 829167 812866
58976 812866 796736 781853 768888 757979 748883 741217 734842 730290 728530 730044 734331 740539 748343
58963 748343 757912 769308 782261 796255 810464 823854 835835 846597 856313 864229 869053 870078
58951 870078 867292 860671 850205 836726 821813 806508 790777 774534 758583 744041 731335 720267
58939 720267 710767 703040 697142 692818 689682 687262 684981 682341 679112 675266 670874 666118 661158 655971
58925F55971n427n345m898m698n254o092o318n797n044m198l017j777j228j410
58911E95468j377m52R77K238L286M315N102N338N375O038P724R958J1891J3167
58897F69048J4167J5322J6261J6094J4760J3417J3041J3233J3252J3626J5527
58886H27748J8807K2011K4438K6787K9367L1022L0590K8377K5324K1607J7032
58875A103110J2100P540L118k046q087j4078j9083k2888k5651k7361k7799k6830
58863I52045k4721k2212k0035j8309j6757j5498j5035j5316j5551j5322j5175
58852G58114j5557j5984j5883j5564j5442j4943j3266j0907r236q616q073o902
58840F07741n572m730m217l594k986k705k566k156j579j367j700k146k274k176
$$ plain form
58925 655971 650544 645199 640301 635603 630349 624257 617939 612142 607098 602900 599883 598106 596878 595468
58911 595468 594091 593639 594616 596854 600140 604455 609557 614895 620270 626308 634032 643990 655881 669048
58897 669048 683215 698537 714798 730892 745652 759069 772110 785343 798595 812221 827748
58886 827748 846555 868566 893004 919791 949158 980180 1010770 1039147 1064471 1086078 1103110
58875 1103110 1115210 1122750 1125868 1123822 1115735 1101657 1082574 1059686 1034035 1006674 978875 952045
58863 952045 927324 905112 885077 866768 850011 834513 819478 804162 788611 773289 758114
58852 758114 742557 726573 710690 695126 679684 664741 651475 640568 631332 622716 614643 607741
58840 607741 602169 597439 593222 589628 586642 583937 581371 579215 577636 576269 574569 572423 570149 567973
58826E67973k221k524k872l054l056k939k713k413k094j627q07K03Q37Q91R86
58811E44570J796L028L743L563K951K370J824J316J088J189J331J273R39J71j041
58796E70111k141k517k374k338k321j776j066j215k085k216r94M28J150J987L758
58781E56391N554O110N976O561P764Q252P670O907O317N312L791K418J261n09
58767F29775l075n287o040n489m524l775l425l301k912j978j010o86p49k74R20
58752E88170K114K940L858N153O355O954O900O212N026M196M822O773Q640R640
58738F67753J0535J2063J3572J4082J3870J3824J3762J2748J0915R780J0325J1554
58726H14783J1570R775P442O089N725N123L593J903J107J170J402J817K953M533
$$ plain form
58826 567973 565752 563228 560356 557302 554246 551307 548594 546181 544087 542460 541653 541856 542693 543584 544570
58811 544570 546366 549394 553137 556700 559651 562021 563845 565161 566249 567438 568769 570042 570981 571152 570111
58796 570111 567970 565453 563079 560741 558420 556644 555578 554363 552278 550062 549068 549496 550646 552633 556391
58781 556391 561945 568055 574031 580592 588356 596608 604278 611185 617502 622814 626605 629023 630284 629775
58767 629775 626700 621413 615373 609884 605360 601585 598160 594859 591947 589969 588959 588273 587524 587250 588170
58752 588170 590284 593224 597082 602235 608590 615544 622444 628656 633682 637878 642700 649473 658113 667753
58738 667753 678288 690351 703923 718005 731875 745699 759461 772209 783124 792904 803229 814783
58726 814783 826353 836128 843570 849659 855384 860507 864100 866003 867110 868280 869682 871499 874452 878985
58712H78985N396N120M707N143O000O145N218L738K121L03j891m565p759j1263
58698H97398j4560j7318j9774k2212k4276k5280k5042k4005k2527k0596j8282
58687F63526j6033j4233j2686j0899q849p140o247n913n612n376n588n988n637
58674E53325m251k854k492k732k313r28N42J548K659M584P189R828J2043J3582
58660E89730J4173J3731J2495J0728Q489N853L001N1k840n087n912n252m047l339
58646F31774l391l798m124m160l921l663l693l955m030l689l167k731k231j278
58632E83943L14K386M514O157O940O936O526N967N263M408L517K671J889J180
58618F42611M96k35q04p52m0N65L61k30n0J351L289M873N706N566M231J979k71
$$ plain form
58712 878985 884381 889501 894208 899351 905351 911496 916714 920452 922573 922876 920985 916420 908661 897398
58698 897398 882838 865520 845746 823534 799258 773978 748936 724931 702404 681808 663526
58687 663526 647493 633260 620574 609675 600826 593686 587439 581526 575914 570538 564950 558962 553325
58674 553325 549074 546220 543728 540996 538683 537755 538297 539845 542504 547088 554277 564105 576148 589730
58660 589730 603903 617634 630129 640857 649346 655199 658200 658251 655411 650324 644412 639160 635113 631774
58646 631774 628383 624585 620461 616301 612380 608717 605024 601069 597039 593350 590183 587452 585221 583943
58632 583943 584257 586643 591157 597314 604254 611190 617716 623683 628946 633354 636871 639542 641431 642611
58618 642611 643107 642872 642068 641316 641276 641841 642202 641972 641922 643273 646562 651435 657141 662707 666938 668917 668646
58601F68646j734k416k811l308m063n051n913o121n603m951m775m985m914l991
58587F08010k176J02K302M161N806P501R282J0924J2109J2627J2490J1927J1090
58574G06155R794P941O137N264N370N648N730O223P520R008J0166J1587J3965
58561H10508J6757J8892K0255K1371K2081K1751K0583J9496J8687J7364J4852
58550A022597J1148O577J792k173m854p162j0102j3068j4604j4636j4579j5268
58538I45668j6225j7026j7908j8771j8932j8289j7590j7169j6546j5445j4172
58527G57595j2733j0795q681p194o212m696k397k48J205K395L509M020L865L727
58513G23360L673K962J682J067J598K255K315K403K968L234K648J980J919J889
$$ plain form
58601 668646 666912 664496 661685 658377 654314 649263 643350 637229 631626 626675 621900 616915 612001 608010
58587 608010 605834 605936 608238 612399 618205 625706 634988 645912 658021 670648 683138 695065 706155
58574 706155 715949 723890 730027 735291 740661 746309 752039 758262 765782 774790 784956 796543 810508
58561 810508 827265 846157 866412 887783 909864 931615 952198 971694 990381 1007745 1022597
58550 1022597 1033745 1040322 1042114 1039941 1035087 1027925 1017823 1004755 990151 975515 960936 945668
58538 945668 929443 912417 894509 875738 856806 838517 820927 803758 787212 771767 757595
58527 757595 744862 734067 725386 718192 711980 707284 704887 704639 705844 708239 711748 715768 719633 723360
58513 723360 727033 729995 731677 732744 734342 736597 738912 741315 744283 747517 750165 752145 754064 755953
58499G55953J264N85M36K74n64j668k497l454m917o137o222n401m376l283k186
58484G17807j575j385n15J550L627M488M658N411O831Q156R222J0283J0997J0778
58470G90333R690Q069N809K940K29j750l412n199o561o877o576o400o301n981
58456G68013n602n133l837j507P57K037K931M312N708O140N590M464K570m1k177
58441G84225k887k910l388l941l544k517k003j947j239M37K294L667M451M606
58427G75304M358M440N190N936O153O494P667R233J0543J1874J3430J4251J3523
58414H88396J2011J0749R399P334N249L923K452l40l560n424o034o856q037q379
58400I00883p698p017o585n656m230l157k494j513l26K28K76P99J775K073J351
$$ plain form
58499 755953 757217 757802 758238 758512 757948 756280 753783 750329 745412 739275 733053 727652 723276 719993 717807
58484 717807 716232 714847 714332 715882 719509 723997 728655 734066 740897 749053 758275 768558 779555 790333
58470 790333 800023 808092 813901 816841 817070 815320 811908 806709 800148 793271 786695 780295 773994 768013
58456 768013 762411 757278 753441 751934 752691 754728 757659 761971 767679 773819 779409 783873 786443 786402 784225
58441 784225 781338 778428 775040 771099 767555 765038 763035 761088 759849 760286 762580 766247 770698 775304
58427 775304 779662 784102 789292 795228 801381 807875 815542 824775 835318 847192 860622 874873 888396
58414 888396 900407 911156 920555 927889 933138 937061 939513 939173 935613 930189 924155 917299 909262 900883
58400 900883 893185 886168 879583 873927 869697 866540 864046 862533 862207 862435 862711 863510 865285 867358 868709
58385H68709N43L18L75M10M99N93O60J214K532L752L891L343L086L005K437J784
58369H97151K058L141M085M740N656O776P659Q523R568J0047R510R200J0349J1898
58355A000361J1996J1065J1073J2161J2415J0881Q626O712N172M138M062M583
58343A103245M853N037N963P484Q706R658J0939J2173J2500J2353J2899J4047
58331A219857J4801J5134J5677J6097J5736J5305J5794J6301J5207J3082J1967
58320A384958J2127J1981J1020J0274J0070R722R457J0173J1362J1597J1094J1390
58308A515225J2588J3311J3365J3988J5422J6673J7667J9285K1171K1895K1356
58297A701946K0782K0516J9972J9600K0373K1584K1627K0740K0536K1199K1715
$$ plain form
58385 868709 869252 869570 869945 870355 870854 871447 872107 873321 875853 879605 883496 886839 889925 892930 895367 897151
58369 897151 899209 902350 906435 911175 916831 923607 931266 939789 949357 959404 968914 978114 988463 1000361
58355 1000361 1012357 1023422 1034495 1046656 1059071 1069952 1078578 1085290 1090462 1094600 1098662 1103245
58343 1103245 1108098 1113135 1119098 1126582 1135288 1144946 1155885 1168058 1180558 1192911 1205810 1219857
58331 1219857 1234658 1249792 1265469 1281566 1297302 1312607 1328401 1344702 1359909 1372991 1384958
58320 1384958 1397085 1409066 1420086 1430360 1440430 1450152 1459609 1469782 1481144 1492741 1503835 1515225
58308 1515225 1527813 1541124 1554489 1568477 1583899 1600572 1618239 1637524 1658695 1680590 1701946
58297 1701946 1722728 1743244 1763216 1782816 1803189 1824773 1846400 1867140 1887676 1908875 1930590
58286A930590K2402K4392K6974K8340K8623K9410L0597L0781L0287L0744L1998
58275B245138L2644L3176L5402L9072M2408M5438M9479N3908N7041N9554O3290
58264B756550O7344O9431P0408P3150P7415Q0420Q2083Q4919Q8926R1414R2056
58253C634116R3236R5251R5954R5362R5861R7699R9110J00788J05173J11429J16465
58242D740444J20887J28187J38140J46961J54217J63342J74933J85946J96150
58233F149207K08855K24410K39452K53451K69545K88157L06489L24990L47457
58224H612013L74032M01102M28685M60669M97440N35918N77012O24901O78969
58215A3190741P35116P95118Q65622R47975J038695J139606J257328J393470J546642
$$ plain form
58286 1930590 1952992 1977384 2004358 2032698 2061321 2090731 2121328 2152109 2182396 2213140 2245138
58275 2245138 2277782 2310958 2346360 2385432 2427840 2473278 2522757 2576665 2633706 2693260 2756550
58264 2756550 2823894 2893325 2963733 3036883 3114298 3194718 3276801 3361720 3450646 3542060 3634116
58253 3634116 3727352 3822603 3918557 4013919 4109780 4207479 4306589 4407377 4512550 4623979 4740444
58242 4740444 4861331 4989518 5127658 5274619 5428836 5592178 5767111 5953057 6149207
58233 6149207 6358062 6582472 6821924 7075375 7344920 7633077 7939566 8264556 8612013
58224 8612013 8986045 9387147 9815832 10276501 10773941 11309859 11886871 12511772 13190741
58215 13190741 13925857 14720975 15586597 16534572 17573267 18712873 19970201 21363671 22910313
58206B2910313J723419J935536K187723K481727K830969L257534L777935M409235
58198D5514391N187804O165763P394352Q931766J0860845J3270950J6220348J9729312
58190A33275531K3777472K8239696L2788319L6835791L9492563L9530674L5589942
58183C69529988K6874471J4014227p59542j4541960k5109766l1622277l4367099
58176C04018042l4147024l1877740k8402805k4359930k0144164j6008850j2147685
58169A36929844q686579n755291l670518k908053l685015n564036p616755r037075
58161I0006522r560883r357074q693302p775195o765954n794112m921141m156568
58153C2982293l506400k977340k551387k195551j893087j641665j430670j244748
$$ plain form
58206 22910313 24633732 26569268 28756991 31238718 34069687 37327221 41105156 45514391
58198 45514391 50702195 56867958 64262310 73194076 84054921 97325871 113546219 133275531
58190 133275531 157053003 185292699 218081018 254916809 294409372 333940046 369529988
58183 369529988 396404459 410418686 409659144 395117184 370007418 338385141 304018042
58176 304018042 269871018 237993278 209590473 185230543 165086379 149077529 136929844
58169 136929844 128243265 122487974 118817456 115909403 112224388 106660352 99043597 90006522
58161 90006522 80445639 71088565 62395263 54620068 47854114 42060002 37138861 32982293
58153 32982293 29475893 26498553 23947166 21751615 19858528 18216863 16786193 15541445
58145A5541445j082940r53050q51832p67396o95710o39394n95234n56189n21080
58136H878620m90891m60668m25422l88809l56422l26055k93420k61602k35783
58127E639548k14372j94099j78592j72899j74025j74930j73744j71820j67255
58118D017812j57991j47314j39257j32015j22191j11666j04044r8142r1077q4077
58108B830038p9445p5431o9795o4780o2969o1959n8702n5320n4924n5272n2626
58097B138815m8565m7014m7325m6220m4078m3474m3626m1862l8851l7168l6334
58086A664298l4072l0890k8844k7391k4897k2584k2564k3575k2961k1431k1670
58075A383419k3562k4876k5388k6344k7065k5972k3934k2945k2484k0729j8280
$$ plain form
58145 15541445 14458505 13505455 12653623 11886227 11190517 10551123 9955889 9399700 8878620
58136 8878620 8387729 7927061 7501639 7112830 6756408 6430353 6136933 5875331 5639548
58127 5639548 5425176 5231077 5052485 4879586 4705561 4530631 4356887 4185067 4017812
58118 4017812 3859821 3712507 3573250 3441235 3319044 3207378 3103334 3005192 2914115 2830038
58108 2830038 2750593 2675162 2605367 2540587 2477618 2415659 2356957 2301637 2246713 2191441 2138815
58097 2138815 2090250 2043236 1995911 1949691 1905613 1862139 1818513 1776651 1737800 1700632 1664298
58086 1664298 1630226 1599336 1570492 1543101 1518204 1495620 1473056 1449481 1426520 1405089 1383419
58075 1383419 1359857 1334981 1309593 1283249 1256184 1230212 1206278 1183333 1160849 1140120 1121840
58064A121840j7213j7322j6685j5072j3763j2806j1454j0420j0850j1936j2145
58053I72174j1816j2082j2481j2080j1638j2106j2464j1660j1038j2049j3157
58042H39603j2068r617q328q395q166p508p496p645o621n062m911o348p969r302
58028G30167j0771j1921j2067j1918j2242j1969r980p683p210q004p902o705n991
58015F05804o087n961n518n470n371m356l223l338m013l435j728o82p91j016j033
58000E53782j394j745j215k93j91n87k29P14J042Q99J539K961M017M613N635O894
57984E76442P219O563N920N327L903J867M52j57r89k362l588m542n779p072p469
57969E75735o803n800m838m031m039n227o383o032m692m082m458m555l900l358
$$ plain form
58064 1121840 1104627 1087305 1070620 1055548 1041785 1028979 1017525 1007105 996255 984319 972174
58053 972174 960358 948276 935795 923715 912077 899971 887507 875847 864809 852760 839603
58042 839603 827535 817918 809590 801195 793029 785521 778025 770380 763759 758697 753786 747438 739469 730167
58028 730167 719396 707475 695408 683490 671248 659279 649299 641616 634406 626402 618500 611795 605804
58015 605804 599717 593756 588238 582768 577397 573041 569818 566480 562467 559032 557304 556622 555831 554815 553782
58000 553782 552388 550643 549428 549135 548944 548357 548128 548842 549884 550783 552322 555283 559300 563913 569548 576442
57984 576442 583661 590224 596144 601471 605374 607241 607693 607536 606547 604185 600597 596055 590276 583204 575735
57969 575735 568932 563132 558294 554263 550224 544997 538614 532582 527890 523808 519350 514795 510895 507537
57955E07537l367l487l650m264m987m928m111l418l130k774k216j653q91J90R54
57940D65805J082J619L460N530O185N798O017P029P493O938O198N593M678L747
57926E37172L724M456M795M428M064L795K936J484K05q10k157l739m877n766p257
57911E42453r134j0162r995r635r794j0049r716q588o861n273m878n761o595o538
57897D29474o609p803q940q310o484n302m864l857k353j668j684r03P00J483J080
57882C73960J079K226L331L595L814M457M605L737K772K405K098J500J281J735
57868D12595K150K230K566K962K107j70k001k011j294j668l096m124l907k717
57854D03622j133L02J160J547J946K388K447K253K517L318L960M283M911N827
$$ plain form
57955 507537 504170 500683 497033 492769 487782 482854 478743 475325 472195 469421 467205 465552 464661 464851 465805
57940 465805 466887 468506 471966 477496 483681 489479 495496 502525 510018 516956 523154 528747 533425 537172
57926 537172 540896 545352 550147 554575 558639 562434 565370 566854 567059 566249 564092 560353 555476 549710 542453
57911 542453 533319 523157 513162 503527 493733 483684 473968 465380 458519 453246 448368 442607 436012 429474
57897 429474 422865 415062 406122 397812 391328 386026 381162 377305 374952 373284 371600 370697 371397 372880 373960
57882 373960 375039 377265 380596 384191 388005 392462 397067 400804 403576 405981 408079 409579 410860 412595
57868 412595 414745 416975 419541 422503 424610 424440 422439 420428 419134 417466 414370 410246 406339 403622
57854 403622 402489 402791 403951 405498 407444 409832 412279 414532 417049 420367 424327 428610 433521 439348
57840D39348N924M624K852J735J268P98l8j365l165m851n595n434n247n381n280
57825D20193m724m333m437m424l770k756j781p67L38J301K097K933L594L643L352
57810D10459L408L700L489K825K517K643K409J630Q66j38k414n676p932q058p274
57795D02454p153p518p362o688o239o228o361o459o279n470m339l842m140m076
57781C20300k862j350p60r62r36l44L39P99J193J699K393L299M195M746N036N533
57765C42318O291O830O904O700O090M528J923j122m160p138r648j0964j1151j1141
57751C26260j1271j0790r201p155n470m211l189k421j625k57J416K245J832J245
57737B77408J438J965J907J228M56j55l87J79J411K325K264J836J961K612L086
$$ plain form
57840 439348 445272 449896 452748 454483 455751 456549 456511 455146 451981 447130 441535 436101 430854 425473 420193
57825 420193 415469 411136 406699 402275 398505 395749 393968 393201 393539 394840 396937 399870 403464 407107 410459
57810 410459 413867 417567 421056 423881 426398 429041 431450 433080 433946 433808 431394 425718 417786 409728 402454
57795 402454 395301 387783 380421 373733 367494 361266 354905 348446 342167 336697 332358 328516 324376 320300
57781 320300 317438 316088 315328 314366 313430 313086 313425 314224 315417 317116 319509 322808 327003 331749 336785 342318
57765 342318 348609 355439 362343 369043 375133 379661 381584 380462 376302 369164 359516 348552 337401 326260
57751 326260 314989 304199 294998 287843 282373 278162 274973 272552 270927 270670 272086 274331 276163 277408
57737 277408 278846 280811 282718 283946 284402 284247 283860 284039 285450 287775 290039 291875 293836 296448 299534
57722B99534L007K538K048K009K596L109K521Q76o36j282j539j938k230k175k085
57707C06353j965j243R1J039J066R15J318J933K404L290M893O202O235N652N818
57692C44001O840P649P473O241M070J367r23k163k790l444l833l271j894m07J012
57677C59928K704M758P124J0218J4649K0565K7899L6949M8025O0847P4953R0118
57665G58737J05389J17526J21092J10593Q3368M1833o204n0401q2667j00308j05295
57654I93663j01508r2751q1907p0520n9113m8276l9003l1761k6086k1553j8314
57643D02871j6146j3955j1119q447o837n711l964j822n61o28j149j188o07K52
57629C30989R55J104O62J20o6ORj65n94j400k243k375j698j096j213j575j502
$$ plain form
57722 299534 302541 305079 307127 309136 311732 314841 317362 318238 317602 316320 314781 312843 310613 308438 306353
57707 306353 304388 303145 303236 304275 305341 306256 307574 309507 311911 315201 320094 326296 332531 338183 344001
57692 344001 350841 358490 365963 372204 376274 377641 376718 374555 371765 368321 364488 361217 359323 358916 359928
57677 359928 362632 367390 374514 384732 399381 419946 447845 484794 532819 593666 668619 758737
57665 758737 864126 981652 1102744 1213337 1296705 1338538 1332334 1281933 1199266 1098958 993663
57654 993663 892155 799404 717497 646977 587864 539588 500585 468824 442738 421185 402871
57643 402871 386725 372770 361651 353204 346367 340656 336692 334870 334309 333681 332532 331344 330737 330989
57629 330989 331944 333048 333710 333830 333764 333770 333779 333614 333020 331620 329377 327002 325304 324208 322995 321420 319918
57612C19918j152r58q18n99p45j444j811r30P33J850J840J216P14P77J406J944
57596C21941J501K02p09n76k93p34j294j124q49j574k905l448k891k080j359m41
57580C03367L14Qj199k016j767j126r19j205j742k274k237j132M56J229P69Lk10
57563B90319j43n20j439k345k601j889m88P61J171R14P12R54J555K441L527M413
57547B97342M645M196L196J505p53k637l217k719k055j423k93J364K838L674M011
57532C09674L883L082J901J135J076J252J283J386J694J802J348N49r5l11j59
57517C29500Q1O6k24l14J57Q02Q93K62o13j293j592j372o72J3K17J39K97O83Q49
57498C27879P11N83M90J67k93m68l01j81k54k30N9M22O78P31L72m97j396j588
$$ plain form
57612 319918 318766 317808 316990 316391 315646 314202 312391 311461 312194 314044 315884 317100 317814 318591 319997 321941
57596 321941 323442 323644 322935 322359 322066 321332 320038 318914 318065 316491 313586 310138 307247 305167 303808 303367
57580 303367 303681 303689 302490 300474 298707 297581 296662 295457 293715 291441 289204 288072 288528 289757 290526 290529 290319
57563 290319 290176 289656 288217 285872 283271 281382 280894 281655 282826 283740 284452 285406 286961 289402 292929 297342
57547 297342 301987 306183 309379 310884 310131 307494 304277 301558 299503 298080 297787 299151 301989 305663 309674
57532 309674 313557 316639 318540 319675 320751 322003 323286 324672 326366 328168 329516 330065 329970 329659 329500
57517 329500 329581 329647 329423 329109 329266 330068 330961 331223 330610 329317 327725 326353 325681 325694 325911 326050 326347 327030 327879
57498 327879 328590 329173 329663 329830 329537 329069 328768 328587 328333 328103 328162 328584 329262 329993 330365 329868 328472 326884
57480C26884r83k73j06m02n88k17O19J317J361J015R93J354J356P61N16J350K508
57463C37465K864K729L322M732N697N423M496L767L337K986K727K582K381K136
57449C86644K069K156K149K156K559L245L523L107K564K532K933L217L144K960
57435D24958L004L253L302K826K071J619J693K002K382K941L429L222K404J998
57421D61104K497K940K352J387J413K486L410L548L337L161K867K531K689L513
57407D99235M533N287N659N565M968M256L969M199M681N316N946O059N388M609
57393E69670M548M976N045M678M590N043N580N915O232O586O793O943P241P463
57379F51303P292O934O674O119M876L614L417M186M808M763M510M404M349M437
$$ plain form
57480 326884 325901 325628 325522 325120 324532 324315 324934 326251 327612 328627 329620 330974 332330 333091 333607 334957 337465
57463 337465 340329 343058 346380 351112 356809 362232 366728 370495 373832 376818 379545 382127 384508 386644
57449 386644 388713 390869 393018 395174 397733 400978 404501 407608 410172 412704 415637 418854 421998 424958
57435 424958 427962 431215 434517 437343 439414 441033 442726 444728 447110 450051 453480 456702 459106 461104
57421 461104 463601 466541 468893 470280 471693 474179 477589 481137 484474 487635 490502 493033 495722 499235
57407 499235 503768 509055 514714 520279 525247 529503 533472 537671 542352 547668 553614 559673 565061 569670
57393 569670 574218 579194 584239 588917 593507 598550 604130 610045 616277 622863 629656 636599 643840 651303
57379 651303 658595 665529 672203 678322 683198 686812 690229 694415 699223 703986 708496 712900 717249 721686
57365G21686M842N114M679M013M108M896N420N503N867O557O698O165N993O626
57351G98167P166O951O717P408Q784R917J0360J0238R790R302Q954Q531P756O953
57337I16994O669O860P209P970R382J0546J0362R420R418J0525J1047J0113Q988
57324A035503R014R776J0192J0122R979R801R626R829J0381J0674J0613J0838
57312A156348J1393J1416J0808J0815J2064J3311J3258J2424J2084J2348J2557
57301A288826J2665J2943J3005J2418J1775J1953J2697J3036J2791J2681J3124
57290A427914J3785J4246J4385J4234J3867J3333J2525J1450J0734J1117J2314
57279A569904J3177J3290J3439J4078J4461J3918J3034J2749J3181J3967J4966
$$ plain form
57365 721686 726528 731642 736321 740334 744442 749338 754758 760261 766128 772685 779383 785548 791541 798167
57351 798167 805333 812284 819001 826409 835193 845110 855470 865708 875498 884800 893754 902285 910041 916994
57337 916994 923663 930523 937732 945702 955084 965630 975992 985412 994830 1005355 1016402 1026515 1035503
57324 1035503 1044517 1054293 1064485 1074607 1084586 1094387 1104013 1113842 1124223 1134897 1145510 1156348
57312 1156348 1167741 1179157 1189965 1200780 1212844 1226155 1239413 1251837 1263921 1276269 1288826
57301 1288826 1301491 1314434 1327439 1339857 1351632 1363585 1376282 1389318 1402109 1414790 1427914
57290 1427914 1441699 1455945 1470330 1484564 1498431 1511764 1524289 1535739 1546473 1557590 1569904
57279 1569904 1583081 1596371 1609810 1623888 1638349 1652267 1665301 1678050 1691231 1705198 1720164
57268A720164J5856J6018J5566J5561J6422J7120J6829J6354J6820J7874J8411
57257A902995J8272J8043J7767J7138J6462J6275J6445J6626J7053J7922J8538
57246B093536J8243J7579J7453J7638J7334J6811J7078J8189J9077J9055J8415
57235B290408J7704J7292J7588J8682J9907K0567K0869K1410K2086K2428K2593
57224B511534K3033K3437K3116K2259K1749K1840K1959K1864K1947K2418K3021
57213B758177K3584K4081K4235K3838K3365K3464K3947K4089K3767K3489K3442
57202C019478K3363K3365K3903K4891K5534K5282K4365K3455K3158K3626K4213
57191C284633K3875K2454K1025K0311J9477J7476J4920J3318J2816J2183J0849
$$ plain form
57268 1720164 1736020 1752038 1767604 1783165 1799587 1816707 1833536 1849890 1866710 1884584 1902995
57257 1902995 1921267 1939310 1957077 1974215 1990677 2006952 2023397 2040023 2057076 2074998 2093536
57246 2093536 2111779 2129358 2146811 2164449 2181783 2198594 2215672 2233861 2252938 2271993 2290408
57235 2290408 2308112 2325404 2342992 2361674 2381581 2402148 2423017 2444427 2466513 2488941 2511534
57224 2511534 2534567 2558004 2581120 2603379 2625128 2646968 2668927 2690791 2712738 2735156 2758177
57213 2758177 2781761 2805842 2830077 2853915 2877280 2900744 2924691 2948780 2972547 2996036 3019478
57202 3019478 3042841 3066206 3090109 3115000 3140534 3165816 3190181 3213636 3236794 3260420 3284633
57191 3284633 3308508 3330962 3351987 3372298 3391775 3409251 3424171 3437489 3450305 3462488 3473337
57180C473337R623R172R176R210R340R492R274Q784Q657Q988R135Q928R067R858
57166C602041J0493J0220R534R508J0376J1429J1978J1981J1901J2155J2568J2411
57154C736595J1233R609Q519Q043P293N663L558J732M85k59o57r75j472j977j914
57139C785476r75N13K018L272M244N011N785O778P841Q473Q286P338O032M806
57125C854898L917L355L000K957L606N263Q016J1948J7125K3277K9853L6528M3232
57112D046975M9619N5234O0408O6300P3626Q2244R2406J05514J22760J43918J68542
57101E067546J97745K33784K78447L33063L99693M81023N79066O94879Q29131
57092I094377R81493J149108J326340J506021J680165J839919J976289K081626
$$ plain form
57180 3473337 3482960 3492132 3501308 3510518 3519858 3529350 3538624 3547408 3556065 3565053 3574188 3583116 3592183 3602041
57166 3602041 3612534 3622754 3632288 3641796 3652172 3663601 3675579 3687560 3699461 3711616 3724184 3736595
57154 3736595 3747828 3757437 3765956 3773999 3781292 3786955 3790513 3792245 3792730 3792471 3791814 3790839 3789367 3787390 3785476
57139 3785476 3784501 3785014 3787032 3790304 3794548 3799559 3805344 3812122 3819963 3828436 3836722 3844060 3850092 3854898
57125 3854898 3858815 3862170 3865170 3868127 3871733 3876996 3885012 3896960 3914085 3937362 3967215 4003743 4046975
57112 4046975 4096594 4151828 4212236 4278536 4352162 4434406 4526812 4632326 4755086 4899004 5067546
57101 5067546 5265291 5499075 5777522 6110585 6510278 6991301 7570367 8265246 9094377
57092 9094377 10075870 11224978 12551318 14057339 15737504 17577423 19553712 21635338
57084B1635338K149915K175342K150040K061520J890577J613852J214681O98294
57076C5589559J00250n20074j097887j582307j946583k186667k312974k342588
57068B3700729k295442k192530k053400j893667j724789j555350j391550j236880
57060I357121j092834r60390q40433p33104o37786n53862m80854m17953l64083
57051C275822l18287k79502k46328k17712j93411j73058j55385j39318j25155
57042A427666j13478j03456r3597q3740p4844o7203o0257n3934m8555m3637l8382
57031F46583l3256k9392k6546k3305j9285j5363j1695p441k450K697Q571J6729
57019E05847K7479M0046N5212P5233J00607J29517J60238J89388K05720J91330
$$ plain form
57084 21635338 23785253 25960595 28110635 30172155 32062732 33676584 34891265 35589559
57076 35589559 35689809 35169735 34071848 32489541 30542958 28356291 26043317 23700729
57068 23700729 21405287 19212757 17159357 15265690 13540901 11985551 10594001 9357121
57060 9357121 8264287 7303897 6463464 5730360 5092574 4538712 4057858 3639905 3275822
57051 3275822 2957535 2678033 2431705 2213993 2020582 1847524 1692139 1552821 1427666
57042 1427666 1314188 1210732 1117135 1033395 958551 891348 831091 777157 728602 684965 646583
57031 646583 613327 583935 557389 534084 514799 499436 487741 480300 477850 480547 489118 505847
57019 505847 533326 573372 628584 703817 804424 933941 1094179 1283567 1489287 1680617
57009A680617J35921M9994l9895j09782j50974j67314j66152j53942j36277j17524
56999H24672r9906q4033p0200n8623m9138m1405l5179l0072k5545k1381j7722
56988B91468j4486j1258p979n163l259k149j534j437k155l944o771j0146j3205
56975B07982j5156j5757j5239j3970j2277j0412q435o319m236k473r60O87K539
56962A05974M243N860Q125J1462J5197J8214J9903J9957J7833J3229O946N25m922
56949B42546r076j1849j3133j3120j2384j1389j0146q361n893l095o86R74K413
56936A46801M484P408J0788J4443J8397K1959K3767K3081K0199J5380Q368l60
56924C14715q902j5426j9635k2005k2468k0983j8694j7069j6146j4760j2420r872
$$ plain form
57009 1680617 1816538 1866532 1826637 1716855 1565881 1398567 1232415 1078473 942196 824672
56999 824672 724766 640733 570533 511910 462772 421367 386188 356116 330571 309190 291468
56988 291468 276982 265724 257745 252582 249323 247174 245640 244203 242048 238104 231333 221187 207982
56975 207982 192826 177069 161830 147860 135583 125171 116736 110417 106181 103708 102748 103435 105974
56962 105974 110217 116077 124202 135664 150861 169075 188978 208935 226768 239997 246943 247468 242546
56949 242546 233470 221621 208488 195368 182984 171595 161449 153088 147195 144100 143414 144388 146801
56936 146801 151285 158693 169481 183924 202321 224280 248047 271128 291327 306707 315075 314715
56924 314715 305813 290387 270752 248747 226279 205296 186602 169533 153387 138627 126207 116335
56912A16335p849o374n376m962m786m070k600j055j56K6k21n58m84M29J980L505
56896H3784M708N805O769P256P461Q347J0435J2995J4979J6304J7520J8514J8252
56883B33129J5898J1659O444J135l656p487j0159j1732j2251j1543r603o996m525
56870A90313k366K8L082O528R937J3390J7283K1724K6612L1929L7378M1865M3861
56857D41564M2224L6362K6052J2067l135j6279k5247k9786l0537k8274k4196j9802
56845C81013j5792j1646o745j314M164R864J6442K4280L3256M2910N2524O1318
56833E90274O8512P2633P1003O1115M3067J9975m253k6697m4986n6886o1650o0918
56821F71189n7052n1177m3658l5565k8205k1596j4785p496k86O820J4547K3098
$$ plain form
56912 116335 108486 102112 96736 91774 86988 82918 80318 79263 79107 79133 78912 78354 77870 78299 80279 83784
56896 83784 88492 94297 101066 108322 115783 124130 134565 147560 162539 178843 196363 214877 233129
56883 233129 249027 260686 267130 268265 264609 257122 246963 235231 222980 211437 201834 194838 190313
56870 190313 187947 187975 191057 197585 207522 220912 238195 259919 286531 318460 355838 397703 441564
56857 441564 483788 520150 546202 558269 555134 538855 513608 483822 453285 425011 400815 381013
56845 381013 365221 353575 346830 345516 349680 359544 375986 400266 433522 476432 528956 590274
56833 590274 658786 731419 802422 863537 906604 926579 922326 895629 850643 793757 732107 671189
56821 671189 614137 562960 519302 483737 455532 433936 419151 411655 411369 418189 432736 455834
56809D55834L1692L9574M6381N1064N1412M5376L2686J5100m462k2766l7144m6269
56797F58478n0320n0334m7528m3064l7959l2814k7697k2367j6705j1039o011j952
56785C10688J643N634J0251J4955J9305K3126K5473K4307J8208Q159l022j2944
56773D45783k0766k6490l0037l1249l0282k7768k4705k2027j9978j8081j5942
56762A78458j3820j2093j0608r034p534o500n856n187m439l930l783l719l433
56749H8522k803j915j136r04j154j251q62n18q07j418j560j130p36p76j005r62
56733F9585l98O03J506J577P18k06l36J72O23Q50J129J301Q70l1n53j59P58J412
56715G9421J416R45N12N16Q42R81P68O30Q10P79k5j245k036k152j992j821j587
$$ plain form
56809 455834 487526 527100 573481 624545 675957 721333 754019 769119 764657 741891 704747 658478
56797 658478 608158 557824 510296 467232 429273 396459 368762 346395 329690 318651 312640 310688
56785 310688 312331 317965 328216 343171 362476 385602 411075 435382 453590 461749 458727 445783
56773 445783 425017 398527 368490 337241 306959 279191 254486 232459 212481 194400 178458
56762 178458 164638 152545 141937 132903 125369 118869 113013 107826 103387 99457 95674 91955 88522
56749 88522 85719 83804 82668 81764 80610 79359 78497 77979 77172 75754 74194 73064 72328 71552 70547 69585
56733 69585 69187 69790 71296 72873 73591 73385 73049 73221 73844 74694 75823 77124 77994 77963 77410 77251 78009 79421
56715 79421 80837 81782 82294 82810 83652 84633 85401 86031 86841 87620 87595 86350 84314 82162 80170 78349 76762
56698G6762j353j187q30o9P17R87Q47P36N75N3m22q8Q08J013n5j442j915j435
56680G3702q49o59o82o89q56j441k344l147l579l841m285m803m855m145k970j849
56664C2708j185j382k527l791l856k487r94n67q68r70q83j071j076j3J750K796
56648A5584K672K507L330M707N604N776N750N887N943N488M510L697L860M913
56634H0228N760N569M739M073L508K524J416J061J524J958J982K092K477K444
56620A21355J561N31L19R10J507J570J190P00L15J41K15N14Q39P36j87j580k316
56603A28320j589J0J008N80p10j669j593p25J30M25M00O07R94R58M07j9m9k57
56585A27228q76j068k38P96R68N48M73O89N31J82L17O25K06o45o00O42J901K371
$$ plain form
56698 76762 75409 74222 73392 73323 74040 75027 75874 76610 77185 77238 76816 76728 77536 78549 78494 77052 75137 73702
56680 73702 72853 72194 71512 70823 69967 68526 66182 63035 59456 55615 51330 46527 41672 37527 34557 32708
56664 32708 31523 30141 27614 23823 19967 17480 16486 15919 15051 14081 13198 12127 11051 11038 12788 15584
56648 15584 18256 20763 24093 28800 34404 40180 45930 51817 57760 63248 67758 71455 75315 80228
56634 80228 85988 91557 96296 100369 103877 106401 107817 108878 110402 112360 114342 116434 118911 121355
56620 121355 122916 123447 123766 124676 126183 127753 128943 129643 129958 130099 130314 130828 131667 132403 132216 130636 128320
56603 128320 126731 126741 127749 128329 127619 125950 124357 123632 123762 124187 124587 125194 126188 127146 127553 127534 127485 127228
56585 127228 126352 125284 125046 125842 126810 127358 127831 128520 129051 129233 129550 130175 130381 129736 129136 129778 131679 134050
56567A34050K547K902L046K839L083M391O181P545Q399R242J0328J1555J2586
56554B18694J2733J1302Q477N392L090J848J508J775K079J877J310R08O16p7j007
56539B70525j328r40r08j982l505m347m237l698l254l240l819m730n312n149m441
56524B19635l623l020k881l252l746l904l788l738l734l591l511l679l546k541
56510A71081j322j156k017k513j888q90l65k61l76r39j773j988j252m77n12r31
56494A52421q38j99L11L00j02n43n99o0O15O95K11KN17J241J557J427J025M24
56476A58405q3j66j41o63j537j730q40M05J336K038K543K471J935J690J939K011
56460A69613J691J679K146K131J191M23Q30J768K099J912J909J889J204K10r4
$$ plain form
56567 134050 136597 139499 142545 145384 148467 152858 159039 166584 174983 184225 194553 206108 218694
56554 218694 231427 242729 251206 256598 259688 261536 263044 264819 266898 268775 270085 270993 271609 271532 270525
56539 270525 269197 268257 267349 265367 261862 257515 253278 249580 246326 243086 239267 234537 229225 224076 219635
56524 219635 216012 212992 210111 206859 203113 199209 195421 191683 187949 184358 180847 177168 173622 171081
56510 171081 169759 168603 166586 164073 162185 161295 160930 160669 160293 159354 157581 155593 154341 153864 153352 152421
56494 152421 151583 151384 151695 151995 151893 151350 150751 150691 151306 152001 152212 152214 152731 153972 155529 156956 157981 158405
56476 158405 158322 158156 158015 157352 155815 154085 153245 153650 154986 157024 159567 162038 163973 165663 167602 169613
56460 169613 171304 172983 175129 177260 178451 178874 179704 181472 183571 185483 187392 189281 190485 190695 190601
56445A90601M11R15R95J013J200J203P24L7k82M6O21O47j11p83m33M91O62j51
56427A97806p03j79P64J386K005K896L212K116L11p13n02K13P03P54L65l48j078
56410B09008j680k274k712k506j622o99j50K49N90M66j23m73k06K09M50Q64J525
56393B00916J878J976K776M457N639N337M480M402M860M842M368M061L723K776
56379B56491J601J078J188J262J189J235J051L5j602l168m547n900o726o279m729
56364B32179l053j965j605j829k075j551k79O29N06J09K88N51J58l69j29M60L62
56347B22387l15o75o85r41j202p49N0J14m81n24L88J323J540J315J077R51J288
56330B24861K413L671L917L130K515K720L092L050L022L453L781L183J776M65
$$ plain form
56445 190601 191012 191927 192922 193935 195135 196338 197062 197099 196817 196863 197484 198131 198020 197237 196804 197295 197957 197806
56427 197806 197103 196924 197688 199074 201079 203975 207187 209303 209614 208901 208399 208612 209315 210069 210434 210086 209008
56410 209008 207328 205054 202342 199836 198214 197515 197365 197614 198204 198670 198547 198074 197868 198077 198527 199391 200916
56393 200916 202794 204770 207546 212003 217642 222979 227459 231861 236721 241563 245931 249992 253715 256491
56379 256491 258092 259170 260358 261620 262809 264044 265095 265130 263528 260360 255813 249913 243187 236908 232179
56364 232179 229126 227161 225556 223727 221652 220101 219822 220451 220957 221066 221354 221905 222063 221694 221565 222025 222387
56347 222387 222072 221397 220712 219771 218569 217820 217870 217984 217503 216979 217367 218690 220230 221545 222622 223573 224861
56330 224861 227274 230945 234862 237992 240507 243227 246319 249369 252391 255844 259625 262808 264584 265049
56316B65049p2J37O29Q65M98m40j514k091j736p00O7j50q71r36oJ124J833K362
56298B64048K918L105K791K576K751K673J845Q07K80K12L77Q77J445J267L14k86
56282B88000m4j8r04j532o92Q42J607J639J745J624P11m0P55K446L024K042J030
56265C02235J079J744K378K934L277L063K487K128K057K027K181K631K815K445
56251C35481K425L562M985N310M790M678N051N020M663M924N693N837N148M673
56237D02240N053N887O672P068O499M891L435L143L160K128O11K49R19R27j47
56222D52735r79r09p11p11k93M65N59n1j82M90Q79M63R2L30O36O78R27J404J355
56203D57177O66J55J22l6m49m70n9N4j28K53J312K113K287K421K623K313J706
$$ plain form
56316 265049 264977 265114 265743 266608 267106 266666 265152 263061 261325 260625 260692 260542 259671 258735 258729 259853 261686 264048
56298 264048 266966 270071 272862 275438 278189 280862 282707 283514 283794 284006 284383 285260 286705 287972 288286 288000
56282 288000 287956 287938 287034 285502 284810 285652 287259 288898 290643 292267 292978 292938 293693 296139 299163 301205 302235
56265 302235 303314 305058 307436 310370 313647 316710 319197 321325 323382 325409 327590 330221 333036 335481
56251 335481 337906 341468 346453 351763 356553 361231 366282 371302 375965 380889 386582 392419 397567 402240
56237 402240 407293 413180 419852 426920 433419 438310 441745 444888 448048 450176 450787 451036 451955 452882 452735
56222 452735 451756 450847 450136 449425 449132 449597 450156 450105 449923 450413 451292 451755 451847 452177 452813 453491 454418 455822 457177
56203 457177 457843 457998 458120 458084 457635 457165 457106 457160 457032 457285 458597 460710 462997 465418 468041 470354 472060
56186D72060J905L109M197M415M088L481K572K020K671L896M119L255K784L224
56172E17796L474K995K678K920K879K242J958K464K915K884L098L848M318M207
56158E60676M390N268O061O374O923Q016Q891R171R441R921J0206J0684J2456
56145F68478J5258J7332J8004J8630K0384K2860K5463K8291L1021L2879L4534
56134I33134L8170M4838N3518O3476P5526Q9840J04308J16071J23224J24366J18467
56123A884938J06399R1173P5773O1985N1444M5596M3641M2248L8290L0700J9669
56112B491856O350o215j4373j7381j8032j9414k3109l0710m3918o1724p9928r4810
56100B088592j05347j11077j10693j04230r4253q3219p1586n9706m9109m0474
$$ plain form
56186 472060 473965 477074 481271 485686 489774 493255 495827 497847 500518 504414 508533 511788 514572 517796
56172 517796 521270 524265 526943 529863 532742 534984 536942 539406 542321 545205 548303 552151 556469 560676
56158 560676 565066 570334 576395 582769 589692 597708 606599 615770 625211 635132 645338 656022 668478
56145 668478 683736 701068 719072 737702 758086 780946 806409 834700 865721 898600 933134
56134 933134 971304 1016142 1069660 1133136 1208662 1298502 1402810 1518881 1642105 1766471 1884938
56123 1884938 1991337 2082510 2158283 2220268 2271712 2317308 2360949 2403197 2441487 2472187 2491856
56112 2491856 2498206 2491991 2477618 2460237 2442205 2422791 2399682 2368972 2325054 2263330 2183402 2088592
56100 2088592 1983245 1872168 1761475 1657245 1562992 1479773 1408187 1348481 1299372 1258898
56090A258898l2573k4782j8441j4288j0831o910l608k007j096M60K466M562P247
56077A159097J0121J1347J0502R737J0556J1675J1657J1287J1583J1901J1740
56066A281203J2183J3666J4640J4334J4483J6451J8889K0217K1127K2669K4074
56055A473936K4484K4708K5395K5697K5372K5785K7096K7150K5010K2854K2360
56044A749847K2165K0986K0285K1354K2633K2541K2287K3322K4630K5140K6108
56033B001298K8639L1509L3835L7032M1670M5438M6915M8144N0864N3400N4274
56022B473018N5399N8527O1871O3572O5193O8405P1546P2987P4597P8243Q2248
56011C225606Q4952Q8333R4246J00509J04615J07942J12427J16797J19991J24447
$$ plain form
56090 1258898 1226325 1201543 1183102 1168814 1157983 1151073 1147465 1145458 1144362 1144822 1147288 1151850 1159097
56077 1159097 1169218 1180565 1191067 1200804 1211360 1223035 1234692 1245979 1257562 1269463 1281203
56066 1281203 1293386 1307052 1321692 1336026 1350509 1366960 1385849 1406066 1427193 1449862 1473936
56055 1473936 1498420 1523128 1548523 1574220 1599592 1625377 1652473 1679623 1704633 1727487 1749847
56044 1749847 1772012 1792998 1813283 1834637 1857270 1879811 1902098 1925420 1950050 1975190 2001298
56033 2001298 2029937 2061446 2095281 2132313 2173983 2219421 2266336 2314480 2365344 2418744 2473018
56022 2473018 2528417 2586944 2648815 2712387 2777580 2845985 2917531 2990518 3065115 3143358 3225606
56011 3225606 3310558 3398891 3493137 3593646 3698261 3806203 3918630 4035427 4155418 4279865
56001D279865J31837J39486J45233J51674J61153J71200J79634J89414K03103
55992E752599K17453K29242K41562K58133K76169K91530L06320L24529L44708
55983H242245L64002L85085M11958M43240M76447N14165N58960O07633O57847
55974A2661582P14600P82403Q57806R38065J029839J139911J265408J403978J565245
55965B2358837J760473J990006K254444K569358K954984L422020L984960M680408
55957D5975490N555946O653918Q027114R756421J1925905J4587754J7766726K1462003
55949A41711277K5580916K9846049L3747483L6497464L6968125L3845986K6259481
55942C64456781J4608174Q17730j2417510k2882626k9609627l2768745l3107410
$$ plain form
56001 4279865 4411702 4551188 4696421 4848095 5009248 5180448 5360082 5549496 5752599
55992 5752599 5970052 6199294 6440856 6698989 6975158 7266688 7573008 7897537 8242245
55983 8242245 8606247 8991332 9403290 9846530 10322977 10837142 11396102 12003735 12661582
55974 12661582 13376182 14158585 15016391 15954456 16984295 18124206 19389614 20793592 22358837
55965 22358837 24119310 26109316 28363760 30933118 33888102 37310122 41295082 45975490
55957 45975490 51531436 58185354 66212468 75968889 87894794 102482548 120249274 141711277
55949 141711277 167292193 197138242 230885725 267383189 304351314 338197300 364456781
55942 364456781 379064955 379882685 367465175 344582549 314972922 282204177 249096767
55935B49096767l1501127k8753874k5505764k2186459j9045336j6220821j3774035
55928I2109351j1695800r938385q457703p219693o184250n309776m570396l951339
55920C4782009l432156k989528k611069k291648k020318j783627j577225j401802
55912A6674636j251384j116778r96667q94370q06880p27297o54971n93610n41943
55903I090736m95240m53576m19912l92132l65074l38653l16359k97533k78324
55894E733933k58681k41476k26148k09789j93109j79098j67017j53534j38770
55885C966311j25527j13570r9918q3936o7238m9443k8704n562J7840M1090O3944
55874C515287Q2735R2437R1232P9672N7309K4153j6189n8748j00816j39801j70017
$$ plain form
55935 249096767 217595640 188841766 163336002 141149543 122104207 105883386 92109351
55928 92109351 80413551 70475166 62017463 54797770 48613520 43303744 38733348 34782009
55920 34782009 31349853 28360325 25749256 23457608 21437290 19653663 18076438 16674636
55912 16674636 15423252 14306474 13309807 12415437 11608557 10881260 10226289 9632679 9090736
55903 9090736 8595496 8141920 7722008 7329876 6964802 6626149 6309790 6012257 5733933
55894 5733933 5475252 5233776 5007628 4797839 4604730 4425632 4258615 4105081 3966311
55885 3966311 3840784 3727214 3627296 3543360 3476122 3426679 3397975 3392413 3410253 3451343 3515287
55874 3515287 3598022 3690459 3781691 3861363 3918672 3942825 3926636 3867888 3767072 3627271 3457254
55863C457254j86534j90674j87474j79225j65777j49331j33728j19861j06262
55854B038388r3560q3948p7042p0589o4680o1071n8864n5241n0215m6535m4786
55843A331857m2693l9339l6301l4190l1623k8213k5332k3447k1534j9510j8548
55832A011127j8661j8500j7755j7337j7226j6488j5349j4920j5025j4652j4229
55821H30985j4987j6396j6713j5919j5547j5817j5401j3979j2593j1498r996q296
55809F63843p278o492m742k524j533j822j738p17J72M64R18J733K260K588L393
55794F48525M199L780K359J458J464J304N58K1K9L0j32j31k83j186k475l671n791
55777F50058j0101j5572j9676k1550k2278k2228k0482j7039j3408j0463p672m805
$$ plain form
55863 3457254 3270720 3080046 2892572 2713347 2547570 2398239 2264511 2144650 2038388
55854 2038388 1944828 1860880 1783838 1713249 1648569 1587498 1528634 1473393 1423178 1376643 1331857
55843 1331857 1289164 1249825 1213524 1179334 1147711 1119498 1094166 1070719 1049185 1029675 1011127
55832 1011127 992466 973966 956211 938874 921648 905160 889811 874891 859866 845214 830985
55821 830985 815998 799602 782889 766970 751423 735606 720205 706226 693633 682135 672139 663843
55809 663843 656565 650073 645331 642807 641274 639452 637714 636997 637169 637633 638551 640284 642544 645132 648525
55794 648525 652724 656504 658863 660321 661785 663089 663647 663668 663697 663727 663595 663464 663181 661995 659520 655849 650058
55777 650058 639957 624385 604709 583159 560881 538653 518171 501132 487724 477261 469589 464784
55765D64784k674j734j459j495j981k645k940l133l843m676m830m843o004q142
55751D14385r727j0115j0006r759r051q186p964q197p906p041o344n766m732l782
55737C05809l934m581m095k519j539j613j412m03K30k04q47j205k081l799n219
55722B72588n464n087m738m163l256k731k925l131k759k065j260j66Q83J133Q64
55707B37723J376K947M148L807K425J088N7q79j758k709m068n669o804p144o911
55692B17629o190m923l621l006l009l078l273l884m282l602k312j595j315l23
55678A73216J346K343K211J867J659P76j011k706l614l948l711k606j247o75n10
55663A63390N00J891J774R9q06K03J411J270P56J195J879J645J120J488K364K666
$$ plain form
55765 464784 462110 460376 458917 457422 455441 452796 449856 446723 442880 438204 433374 428531 422527 414385
55751 414385 404658 394543 384537 374778 365727 357541 349577 341380 333474 326433 320089 314323 309591 305809
55737 305809 301875 297294 293199 290680 289141 287528 286116 285713 285943 285739 284892 283687 281606 277807 272588
55722 272588 267124 262037 257299 253136 249880 247149 244224 241093 238334 236269 235009 234843 235726 236859 237723
55707 237723 239099 242046 246194 250001 252426 253514 253571 252692 250934 248225 244157 238488 231684 224540 217629
55692 217629 211439 206516 202895 199889 196880 193802 190529 186645 182363 178761 176449 174854 173539 173216
55678 173216 174562 176905 179116 180983 182642 183418 182407 179701 176087 172139 168428 165822 164575 163900 163390
55663 163390 163890 165781 167555 167654 166848 167051 168462 169732 170488 171683 173562 175207 176327 177815 180179 182845
55647A82845K520K712L190L523L918M464M316K937J293M68M0r71k399l484m323
55632B01049n364o125n791m606l541l010k814k826k832k405j712j644k305k347
55618A53727r61N73O66j11N2J342K082J169p01k351l377l901m032l900l625l110
55602A33542k284j499j240j589k219k641k295r80N96J244P12m5k79l12n13m70
55586A19728R9N19J49m82m92P8O98J359K271L027L121K932L270M266N450O630
55570A52623P943R296J0450J1418J2228J2603J2280J1211R194N951K004j284l214
55557B52703m535o177p984r353j0309j1043j1223j0575r585q720p671o171m857
55544A44500m382m359m111l751l559l072j839m60K13K71J52l41j239j489k92J284
$$ plain form
55647 182845 185365 188077 191267 194790 198708 203172 207488 210425 211718 212186 212226 211255 208856 205372 201049
55632 201049 195685 189560 183769 179163 175622 172612 169798 166972 164140 161735 160023 158379 156074 153727
55618 153727 152766 153339 154005 153894 153946 155288 157370 158539 157838 155487 152110 148209 144177 140277 136652 133542
55602 133542 131258 129759 128519 126930 124711 122070 119775 118795 119391 120635 121347 121302 121023 120711 120198 119728
55586 119728 119827 120346 120495 120013 119521 119599 120297 121656 123927 126954 130075 133007 136277 140543 145993 152623
55570 152623 160566 169862 180312 191730 203958 216561 228841 240052 249246 255197 257201 255917 252703
55557 252703 248168 241991 234007 224654 214345 203302 192079 181504 171919 163199 155528 149357 144500
55544 144500 140118 135759 131648 127897 124338 121266 119427 118967 119180 119451 119603 119262 118023 116534 116242 117526
55528A17526J594P52J29jn33j431j538o31Nn23j702k893m243n857p275q268r084
55511G6027r499q777o998n285m234l167j624l60n2K7R92K675L946M335M253L948
55495E6207L151J849O92L38P91J534K009J911J296N89L11N48P54L27m93p36N5
55478G1133J021R63n8r05j092j328k035k367j572m20k85j178j845j525o91j7M02
55461E8201O84P23M33J2k38r6M62J086J254Q85M87M03L63K07L62R47J132K81p44
55442F6844o33M33J071Q15O31J217J935J883J018j14j035j383j036n38o62j280
55426F9166j377m67O80J140R89Q39Q64P94N46L56M63R73J825K690L157L183L056
55409H8877K855K312J326K20o84j362j797j806j420j097j254j779k180k112j636
$$ plain form
55528 117526 119120 119872 120001 120000 119467 118036 116498 115867 115872 115349 113647 110754 106511 100654 93379 85111 76027
55511 76027 66528 57751 50753 45468 41234 38067 36443 36083 36031 36058 37050 39725 43671 48006 52259 56207
55495 56207 59358 61207 61899 62237 63028 64562 66571 68482 69778 70367 70678 71226 71980 72307 71814 71078 71133
55478 71133 72154 73117 73059 72154 71062 69734 67699 65332 63760 63340 63055 61877 60032 58507 57816 57799 58201
55461 58201 58885 59608 60041 60053 59815 59719 60181 61267 62521 63406 63893 64296 64659 64866 65228 66175 67307 67588 66844
55442 66844 66211 66644 67715 68530 69161 70378 72313 74196 75214 75100 74065 72682 71646 71108 70446 69166
55426 69166 67789 67322 68002 69142 70131 70970 71834 72628 73174 73530 73993 74966 76791 79481 82638 85821 88877
55409 88877 91732 94044 95370 95590 94906 93544 91747 89941 88521 87424 86170 84391 82211 80099 78463
55394G8463j105q57r15j020j032j116j367j548j440j190r01l00O61J281Q97l4
55378F8477m38r3K60K61L61P35P50j5r42j160o23J35Q27J450J810J657J168Q38
55360G5458R28J265J536J527J149M61l03q10q11l28K73N36L88K22L82P18Q73P47
55342H4211L53m11j441k117j888j061m60l30j92K55P09Q45P72P74R41J191J287
55325H3438Q58j54j159j502j284j150j277j208o52J44Q21J130P39m17j520j442
55309G5365j96R15R01J81l09l21j66k2K8k87j056j818k001j497n04Q01K048K563
55291G4625K042J105P02J049J510J428P61m9n35n72m31m01l71o0M34O43M30J46
55273H2456lk91p80q74r3R68J107n2j537k077j412m16kr9J05R49J701J503N89
$$ plain form
55394 78463 77358 76501 75586 74566 73534 72418 71051 69503 68063 66873 65972 65672 66333 67614 68511 68477
55378 68477 68039 67946 68206 68467 68828 69563 70313 70298 69356 68196 67573 67708 68535 69985 71795 73452 74620 75458
55360 75458 76386 77651 79187 80714 81863 82324 82021 81211 80400 80072 80345 80881 81269 81491 81873 82591 83464 84211
55342 84211 84564 84153 82712 80595 78707 77646 77186 76856 76664 76919 77628 78473 79245 80019 80960 82151 83438
55325 83438 84296 84142 82983 81481 80197 79047 77770 76562 75910 76054 76875 78005 78744 78327 76807 75365
55309 75365 75169 76084 76985 77166 76857 76536 76370 76348 76376 76089 75033 73215 71214 69717 69213 70014 72062 74625
55291 74625 76667 77772 78474 79523 81033 82461 83222 83173 82638 82066 81635 81234 80863 80803 81237 81880 82310 82456
55273 82456 82453 82162 81382 80508 80415 81383 82490 82438 80901 78824 77412 76996 76994 76895 77000 77949 79650 81153 81742
55254H1742k2J32N74Q35R81J007N43l34o94P2J154J199J06q61p45M0N42N39M85
55235H7295N02J20q25j549j087L57J423J170J35n02m60l80o30q12m92K01R00J416
55217H6782J675J612J298Q34J46p06j150o29M75J119R17M59K60P3l68p68p76m64
55199I0789Q5R86J904J943Q06n22r45n92l46n33q45j131j452j559j142m64r0j17
55181H6775k35l86p23j087j176j069j005p58kQ59J070O69M25N66M89l2l15J11
55163H4176O74P41O83J178K009K396K237K086J994J398L12l50p8L52m7j051j571
55146I7139j210n67k10r9j62n48j051r73j04P62Q80N39L90K78l22j087j057j12
55128I2486P07O81K92K82N18L69k30p30p26l81j57l58q31j024n34L05P24M69L9
$$ plain form
55254 81742 81720 81852 82426 83261 84242 85249 85792 85458 84764 84836 85990 87189 87295 86434 85689 85729 86271 86810 87295
55235 87295 87797 87917 87092 85543 84456 84813 86236 87406 87541 87039 86579 86199 85569 84757 84265 84466 85366 86782
55217 86782 88457 90069 91367 92201 92347 91641 90491 89862 90337 91456 92373 92832 93092 93165 92797 92029 91253 90789
55199 90789 90874 91860 93764 95707 96513 95991 95046 94454 94108 93575 92730 91599 90147 88588 87446 86982 86892 86775
55181 86775 86540 86154 85431 84344 83168 82099 81094 80336 80334 81193 82263 82932 83357 83923 84412 84380 84065 84176
55163 84176 84850 85591 86274 87452 89461 91857 94094 96180 98174 99572 99884 99534 99456 99808 99761 98710 97139
55146 97139 95929 95362 95152 95053 94891 94343 93292 92319 92215 92977 93857 94396 94786 95064 94742 93655 92598 92486
55128 92486 93193 93874 94166 94448 94966 95335 95105 94375 93649 93268 93111 92753 91922 90898 90364 90669 91393 91862 91901
55109I1901p0O2J47J84L37O98J345K230K829K446J149r8n33l88l05m31n81o99
55091A00223p13l02N86J356J399Q32J12p13j687k270j754m00O86Q20L42j99p76
55074I7542j496k023j882j162m99k95k94J2O84J303J575J584J392P45l57j198
55058I5631j075k92K42L40O09J127J057jj199j595j321r23l04P34J483J029k93
55041I5249j192j105o61m52k95N2K93J71k0J22M92P35Q41J057J333J205L48q53
55023I7320j509j145k64K40J86J26K88J55n91j245q92L79J596K007J586P38Oj31
55005I8850K22L35j67o05r8J084J843J757J454J469J547J338R87P93P26O37N52
54988A12724M73K40j86n46n81l20J7K20J67j06l54l88k94k45j83P3M88Q45J032
$$ plain form
55109 91901 91831 91893 92040 92224 92561 93259 94604 96834 99663 102109 103258 103160 102627 102239 101934 101503 100922 100223
55091 100223 99510 99208 99794 101150 102549 103381 103493 102780 101093 98823 97069 96669 97355 98175 98517 98318 97542
55074 97542 96046 94023 92141 90979 90480 90185 89891 89903 90587 91890 93465 95049 96441 97186 96829 95631
55058 95631 94556 94264 94506 94846 95455 96582 97639 97638 96439 94844 93523 92600 92296 93030 94513 95542 95249
55041 95249 94057 92952 92291 91839 91544 91596 91889 92060 92040 92162 92654 93389 94230 95287 96620 97825 98173 97320
55023 97320 95811 94666 94402 94642 94828 94954 95242 95397 94806 93561 92669 93048 94644 96651 98237 98975 98981 98850
55005 98850 99072 99407 99240 98635 98537 99621 101464 103221 104675 106144 107691 109029 110016 110809 111535 112172 112724
54988 112724 113197 113437 113251 112705 112124 111804 111821 112041 112208 112102 111748 111360 111066 110821 110638 110711 111199 112044 113076
54969A13076J068R80Q62Q39P72L36l79o99k63L71N08K95L10N25M28mk83k25j40
54950A18377j78j70j07j78l60m84o04p90p65l34O0j5j00M88J331J303K74o43o23
54931A16482R6J074K133K769K312J107M96J038J780J850J697K096K883L630M697
54916A46140O627R017J0921J1928J2097J1372R893Q348P103N356K159j979n468
54903B33514p484q595r533j0225j0247r515q316o998n840m912m098l398l011k863
54889A38479k373j207N7N70L08m0r3q0j19J45J055K492L997N057N338N048M998
54872A63632N819P250Q547R520J0580J1715J2035J0528P060K510j797m831o511
54859B36057p655q993j0195j0309r116p577o721o570o374n605m458l557l367l772
$$ plain form
54969 113076 114144 115124 115986 116825 117597 117933 117554 116855 116592 116963 117471 117766 118076 118601 119029 119025 118742 118517 118377
54950 118377 118199 118029 117922 117744 117384 116900 116296 115506 114741 114407 114467 114452 114352 114840 116171 117474 117748 117105 116482
54931 116482 116578 117652 119785 122554 124866 125973 126469 127507 129287 131137 132834 134930 137813 141443 146140
54916 146140 152767 161784 172705 184633 196730 208102 217995 226343 233446 238802 240961 238982 233514
54903 233514 226030 217435 207902 197677 187430 177915 169599 162601 156761 151849 147751 144353 141342 138479
54889 138479 136106 134899 134956 135526 135834 135794 135701 135621 135502 135647 136702 139194 143191 148248 153586 158634 163632
54872 163632 169451 176701 185248 194768 205348 217063 229098 239626 246686 249196 247399 242568 236057
54859 236057 228402 219409 209214 198905 189789 182212 175491 168921 162547 156942 152484 148927 145560 141788
54845A41788m152m045l666l541l632l298k278j225r36j324j565j106k21M53N70
54830A11822K87Ml5M6r2m82o67j77P74J376J092K83k43j44K00L08J75Q5R9j2l18
54809A14381m84j56N45J098J157R17P59O84L03n65j524j973j690q44K65J241J594
54792A15708J236Q24J060J617J490N26k25q4K54j12q23r16l87k9qL07J130J906
54774A23474K257K346K249J831J462J845K912L809M195M611N298N732N865O620
54760A74506Q411J0184J0918J1097J1616J1963J0803P913M237L31l932q092j0838
54747B39117j1464j0631r441q389p532o896o313n408m161l109k695k749k775k572
54733A54982k275k053j851j388m84M77P49J93k52L99J866L042L540M069N189O534
$$ plain form
54845 141788 137636 133591 129925 126384 122752 119454 117176 115951 115015 113691 112126 111020 110799 111252 111822
54830 111822 112109 112113 112078 112124 112032 111550 110883 110706 111480 112856 113948 114231 113988 113844 114044 114352 114527 114612 114711 114699 114381
54809 114381 113897 113741 114286 115384 116541 117458 118217 118901 119204 118639 117115 115142 113452 112608 112873 114114 115708
54792 115708 116944 117768 118828 120445 121935 122461 122236 122152 122406 122294 121471 120555 120168 120139 120131 120438 121568 123474
54774 123474 125731 128077 130326 132157 133619 135464 138376 142185 146380 150991 156289 162021 167886 174506
54760 174506 182917 193101 204019 215116 226732 238695 249498 257411 261648 261979 258047 249955 239117
54747 239117 227653 217022 207581 199192 191660 184764 178451 173043 168882 165773 163078 160329 157554 154982
54733 154982 152707 150654 148803 147415 146931 147408 148157 148350 148098 148497 150363 153405 156945 161014 166203 172737
54717A72737P555Q379R397J0481J1022J0527Q776N739J758k272n361p139q055
54704B23544q778r518r883r440q316p116o201n360m351l456l100l086k782k004
54690A40153j251j003j243j711k151k185j453j84P49O41l60j567k426k664k120
54675A21225q97M78J380J618J409R86M36r7m10n17o14o64l34M25R46N39m66r44
54657A24499m58R0k37r95j013j76M83M15K48N15P52M52J28N06J267J483R79M12
54639A29350K92O14J211J685J290j95j655j686m26O28P20O17J059J484R69l29
54623A35628j388j576j144p54q31j220j314p78j56k26q00q77j56N22N77O08J273
54606A27388K066K091J432Q10L12m69j223j067NP85M18m74o98QR42J476J568J429
$$ plain form
54717 172737 180292 188671 198068 208549 219571 230098 238874 244613 246371 244099 238738 231599 223544
54704 223544 214766 205248 195365 185925 177609 170493 164292 158932 154581 151125 148025 144939 142157 140153
54690 140153 138902 137899 136656 134945 132794 130609 129156 128972 129721 130362 130002 128435 126009 123345 121225
54675 121225 120328 120806 122186 123804 125213 126199 126635 126538 126128 125611 124997 124333 123999 124424 125370 125909 125443 124499
54657 124499 124041 124131 123894 122899 121886 121710 122193 122608 122856 123371 124123 124575 124703 125209 126476 127959 128938 129350
54639 129350 129642 130256 131467 133152 134442 134247 132592 130906 130480 131108 131828 132445 133504 134988 135957 135628
54623 135628 134240 132664 131520 130766 129935 128715 127401 126623 126467 126241 125441 124564 124408 124930 125507 126115 127388
54606 127388 129454 131545 132977 133787 134099 133630 132407 131340 131345 132130 132548 132074 131376 131384 132326 133802 135370 136799
54588A36799J205J023R12O74J44l80l64J43L52k94j200j258k38R23J289Q93L33
54571A40956R%L07P35Q42M77J14K41O70R67J215J729K216K045J273O83O94R60
54553A56133J107J178J160Q07K11j29j11k16n73n41K49J056R08p6q52p02K61J489
54535A61359K399K560K037J463J395J661J707J388J070J052J268J459J413J119
54521A83350Q76R64J131P56k48j109j150o07j10J68K97l0j077k241k494j674p26
54504A76076n01q64j121q67k72J84J23l38o12l66qp1l44j66M72Q01M35rK44J068
54484A73864J651J512R77P26J061J581J570Q16J5R2J122K254K716K550K276K204
54468A96987K362K753L305L731L715L252K616K007J428Q56L72J15J46L52M66K46
$$ plain form
54588 136799 138004 139027 139939 140613 140757 140377 140013 140156 140508 140214 139014 137756 137518 138441 139730 140623 140956
54571 140956 140965 140965 141272 142007 142849 143326 143440 143681 144351 145318 146533 148262 150478 152523 153796 154479 155173 156133
54553 156133 157240 158418 159578 160385 160596 160467 160356 160140 159567 159026 159275 160331 161239 161163 160311 159609 159870 161359
54535 161359 163758 166318 168355 169818 171213 172874 174581 175969 177039 178091 179359 180818 182231 183350
54521 183350 184226 185190 186321 187077 186829 185720 184570 183963 183853 184021 184318 184288 183211 180970 178476 176802 176076
54504 176076 175575 174711 173590 172723 172451 172635 172758 172420 171808 171442 171434 171363 171019 170853 171325 172126 172561 172552 172796 173864
54484 173864 175515 177027 178004 178730 179791 181372 182942 183758 183773 183865 184987 187241 189957 192507 194783 196987
54468 196987 199349 202102 205407 209138 212853 216105 218721 220728 222156 223012 223384 223499 223645 223997 224463 224709
54452B24709k87p96q90m74J81O93Q37O09J75k04k41J39N81M76m33j713k632k873
54434B17857k668k301j854j400j078q34m39K9Rq88k234l114l012k126r52J13Q26
54417A95934J048Q26L86J8m6K76Q33J338J563J435R62K85k79m66m36n53q17q88
54399B01419p60q87j351j431n04J002K071K276J965J499R49M60K90L69L16L2p4
54382B07641L30R32J010J94j039j675j166j31K09n04j348j370q22n86q32r27m77
54365A99439K96J075J662J674P82n87j431j230m08L80Q47R08O14L82O57J088P09
54348B06857o82j976k148j604j501k109k610k399j868j789k307k810k610j664
54334A78780o52k96o06r88j074j089j243j241p61j25O0k79o60q41j088j539j725
$$ plain form
54452 224709 224422 223626 222736 222262 222443 223136 223973 224582 224757 224553 224312 224451 225032 225508 225075 223362 220730 217857
54434 217857 215189 212888 211034 209634 208556 207722 207283 207312 207321 206433 204199 201085 198073 195947 194995 195108 195934
54417 195934 196982 197808 198194 198212 198166 198442 199275 200613 202176 203611 204573 204858 204579 204113 203677 203124 202307 201419
54399 201419 200659 199772 198421 196990 196486 197488 199559 201835 203800 205299 206248 206708 206998 207367 207683 207715 207641
54382 207641 207971 208903 209913 210107 209068 207393 206227 206096 206305 205801 204453 203083 202261 201675 200843 199916 199439
54365 199439 199735 200810 202472 204146 204928 204341 202910 201680 201272 201652 202499 203407 204021 204403 205060 206148 206857
54348 206857 206175 204199 202051 200447 198946 196837 194227 191828 189960 188171 185864 183054 180444 178780
54334 178780 178128 177832 177226 176238 175164 174075 172832 171591 170830 170705 170765 170486 169826 168985 167897 166358 164633
54317A64633j165j76L63J31j84J52Q49R48J93o00p16m52m21m89j12O64J226J361
54299A66205J340J166N39l04o18k65L7j22k20J13K67l72j259j406q26l83m79p06
54281A62707p28o40m45K8N51M81l57j310j713j645j623j765j604o48R55K310K450
54264A57004J306j69j015j173j074p02K25J329J637Q20k65o15k31J75J46j83m78
54247A56737n09k19J77L10J24oJ45K19k18r15j187q13k27J63L37K58k84j140j535
54228A51417q67M55J350J215L47n94j162j166o73j38j12o01j003q71m20p1J39
54211A47245L48M26K63J87N14Q46M69n50j352j415j112r05o84k40J97L33L42M95
54193A45407O35M71J33n6r1j64k19o5K26N16Q81J276J137O8j272j724j098m16
$$ plain form
54317 164633 163468 163292 163655 163786 163602 163754 164603 165551 165744 165144 164428 163976 163555 163066 162954 163618 164844 166205
54299 166205 167545 168711 169250 168946 168328 168063 168100 167978 167758 167871 168138 167766 166507 165101 164275 163892 163413 162707
54281 162707 161979 161339 160894 160922 161473 161954 161597 160287 158574 156929 155306 153541 151937 151289 152244 154554 157004
54264 157004 158310 158141 157126 155953 154879 154177 154402 155731 157368 158188 157923 157308 157077 157252 157398 157215 156737
54247 156737 156228 156009 156186 156496 156620 156614 156759 156978 156760 155845 154658 153845 153618 153781 154118 154376 154092 152952 151417
54228 151417 150550 151005 152355 153570 153917 153323 152161 150995 150322 150184 150072 149471 148468 147597 147177 147106 147245
54211 147245 147593 148019 148282 148469 148983 149829 150298 149748 148396 146981 145869 144964 144280 144040 144237 144570 144912 145407
54193 145407 146042 146513 146646 146590 146499 146335 146116 146051 146277 146793 147674 148950 150087 150155 148883 147159 146061 145645
54175A45645n02j002j079n02L32R99J206P74j50r68j162q27m17j83q9j69m96q53
54157A40557p90j22P52J180Q97L27J54N65R71P18l0m77k83j2k48o92n67K75J182
54138A44357J539J344R60P04P72J207J651J556Q52K45M56J267J656R30n33j713
54122A57250j949j350m95O0K2n30j172j372q67J20J052J414J054L17j26J30Q00
54105A54358J265J327J310J352J085L65k11r8K35j18j058j478q33R3M10K72K54
54088A58530K01m00j312j699j309p92o94q85j063j169j084n13M41J136J149Q43
54072A51380P75R53J064J082J199J363J329J077Q02O72Q18J334J932J956J133
54057A68869O8n22p40j105j486j301o28j83r5L07J218J825J613J310J781K685
$$ plain form
54175 145645 145143 144141 143062 142560 142892 143891 145097 145871 145721 144753 143591 142764 142347 142164 142075 141906 141410 140557
54157 140557 139767 139645 140397 141577 142474 142801 142955 143520 144491 145209 145179 144702 144419 144407 144159 143467 142900 143175 144357
54138 144357 145896 147240 148200 148904 149676 150883 152534 154090 154942 155187 155643 156910 158566 159496 158963 157250
54122 157250 155301 153951 153456 153516 153538 153008 151836 150464 149597 149717 150769 152183 153237 153554 153428 153558 154358
54105 154358 155623 156950 158260 159612 160697 161062 160851 160753 160988 160870 159812 158334 157501 157594 158004 158276 158530
54088 158530 158731 158331 157019 155320 154011 153219 152525 151640 150577 149408 148324 147811 148252 149388 150537 151380
54072 151380 152155 153108 154172 155254 156453 157816 159145 160222 161024 161696 162514 163848 165780 167736 168869
54057 168869 168937 168415 167675 166570 165084 163783 163155 162972 162877 163184 164402 166227 167840 169150 170931 173616
54041A73616L051K703K196J782J385J352K163L468M305M432M462M647M477L820
54027B17859L485M056M986N481N622N894O029N299L716K191J512J636J985J972
54013B71723J327L90m4M09J001N61j090k944m035m354m381m317m113l826l535
53998B42772l214k987l209l860m108l102j264j36o57j980k466j612m86k61r35
53983B12495j801k578l457m179l981k642j089m37p29j081q99n13n51j088j636
53968A85834j753j447r32k36P84J982K749K630K039J877K335K551J800O06J71
53953B00990Q88K009K698K801K535K052J592J552J987K330K094J623J722K598
53939B29471L625M239M615N227O099O855P327P673P896P777P368P157P435P878
$$ plain form
54041 173616 176667 179370 181566 183348 184733 186085 188248 191716 196021 200453 204915 209562 214039 217859
54027 217859 221344 225400 230386 235867 241489 247383 253412 258711 262427 264618 266130 267766 269751 271723
54013 271723 273050 273440 273396 273805 274806 275367 274277 271333 267298 262944 258563 254246 250133 246307 242772
53998 242772 239558 236571 233362 229502 225394 222292 221028 220892 220235 218255 215789 214177 213691 213430 212495
53983 212495 210694 208116 204659 200480 196499 193857 192768 192331 191602 190521 189622 189109 188558 187470 185834
53968 185834 184081 182634 181702 181466 182250 184232 186981 189611 191650 193527 195862 198413 200213 200819 200990
53953 200990 201878 203887 206585 209386 211921 213973 215565 217117 219104 221434 223528 225151 226873 229471
53939 229471 233096 237335 241950 247177 253276 260131 267458 275131 283027 290804 298172 305329 312764 320642
53925C20642Q145Q552R664J1390J3091J4361J5024J4417J1611O755J429k834n814
53912D26433p896q868q244o387m332k647j180J20R96J468J878K214K022J170O7
53897C96814r15j713k188k163k035k524l592m324m210l864l959m291m468m799
53883C51769n715o759p132o916o866p122p039o295n328m552l853l129k636k496
53869B75931k456k423k698l334l789l691l461l644l956l679k837k238k305k491
53855B32929k105j240n58n05j047j920k744l037k579j715j004n49r6K95K06l24
53839B14007n26J27J084J387R08K99j19o77j476j930j607r61p00q39q85p15o47
53822B06730p19n44RM85M81K62L57P58R33N62o4m69m86j82M03J108J449J096N22
$$ plain form
53925 320642 328787 337339 347003 358393 371484 385845 400869 415286 426897 433652 435081 432247 426433
53912 426433 418537 409669 401425 395038 390706 388059 386879 386999 387995 389463 391341 393555 395577 396747 396814
53897 396814 395899 394186 391998 389835 387800 385276 381684 377360 373150 369286 365327 361036 356568 351769
53883 351769 346054 339295 332163 325247 318381 311259 304220 297925 292597 288045 284192 281063 278427 275931
53869 275931 273475 271052 268354 265020 261231 257540 254079 250435 246479 242800 239963 237725 235420 232929
53855 232929 230824 229584 229026 228521 227474 225554 222810 219773 217194 215479 214475 213926 213830 214125 214331 214007
53839 214007 213481 213608 214692 216079 216987 217286 217167 216490 215014 213084 211477 210516 209816 208977 208092 207377 206730
53822 206730 206011 205467 205476 205961 206442 206704 207061 207819 208752 209314 209250 208781 208295 208113 208516 209624 211073 212169 212691
53803B12691O48J621K580K908L137L918M756M664L878L704M565N335N099M471
53789B63975M441M786M608L865L289L110K883K425K035J767J404J125J301J551
53775C02565R86l77j369j341j157j923l354m187l816k798k049k067k783l628l949
53760B68753l723l611l931m025l224j998j357j374j244o81k80l02j20P17J705
53745B45305K312L002M647P260J0143J3005J6148J9470K1769K1325J6977Q971
53733C90334p81r419j4809j6869j7002j6362j5057j2986j0613q542o876n483m528
53720B51007m209m233m103l783l558l341k641j319J25J114J489J361R18N34O20
53705B29981J084J297Q97L75M72J240K038K364K294K119J977J878J869K012K306
$$ plain form
53803 212691 213339 214960 217540 220448 223585 227503 232259 236923 240801 244505 249070 254405 259504 263975
53789 263975 268416 273202 277810 281675 284964 288074 290957 293382 295417 297184 298588 299713 301014 302565
53775 302565 303551 303174 301805 300464 299307 297384 294030 289843 286027 283229 281180 279113 276330 272702 268753
53760 268753 265030 261419 257488 253463 250239 248241 246884 245510 244266 243585 243305 243003 242883 243600 245305
53745 245305 247617 250619 255266 262526 272669 285674 301822 321292 343061 364386 381363 390334
53733 390334 389553 380134 365325 348456 331454 315092 300035 287049 276436 267894 261018 255535 251007
53720 251007 246798 242565 238462 234679 231121 227780 225139 223820 223945 225059 226548 227909 228827 229361 229981
53705 229981 231065 232362 233259 233634 234106 235346 237384 239748 242042 244161 246138 248016 249885 251897 254203
53690B54203K623K670K175J334Q99J440K596L329L020J967P93j89r17j294j340
53675B73309j300j318j166o58r3Q7l0N6L71K97n44j589j916j322m61RJ12K38M33
53656B64515K94m95j633k375k240j470p72o05q22r66p59k49L19O07L22m61j186
53639B52024j202m68L56O18L66K01O05J565K769L894M636M728M190L527L429M094
53623B85332M919N015M099K730J590Q38K56j81l33m08q57j603j839j023K60R44
53607B99739P49L72M49R04J388J807K161K238J860J254Q70Q83J036Q86J93q61
53591C15928j698j771j020P3R14J123N99m13j249j331q86p93j438k121k030j401
53575C02486j100j352j504j150p04o55p72n12J08N01K74l50q84j083j012p88l89
$$ plain form
53690 254203 256826 259496 261671 263005 263904 265344 267940 271269 274289 276256 277049 276860 275943 274649 273309
53675 273309 272009 270691 269525 268867 268774 268861 268831 268887 269258 269555 269011 267422 265506 264184 263723 263732 263844 264082 264515
53656 264515 264809 264314 262681 260306 258066 256596 255824 255219 254397 253431 252672 252423 252742 253349 253671 253210 252024
53639 252024 250822 250354 250710 251328 251694 251895 252500 254065 256834 260728 265364 270092 274282 277809 281238 285332
53623 285332 290251 295266 299365 302095 303685 304523 304779 304598 304265 303857 303000 301397 299558 298535 298795 299739
53607 299739 300488 300860 301309 302213 303601 305408 307569 309807 311667 312921 313791 314674 315710 316596 316789 315928
53591 315928 314230 312459 311439 311512 312426 313549 314148 313735 312486 311155 310269 309476 308038 305917 303887 302486
53575 302486 301386 300034 298530 297380 296676 296021 295249 294737 294845 295346 295620 295270 294386 293303 292291 291503 291114
53558B91114K24Q82J240J184J041J201J544J567J153Q52J154J736J864J487J431
53543C09674K318L639M342M173L997M618N702O239N815N034M683M957N629O567
53529C77387P745Q979J0004J0739J1249J1578J1853J2392J3350J4355J4877J4996
53517E19504J5362J6366J7727J9046K0371K1843K3157K3844K4013K4314K5077
53506G50624K5880K6162K5947K5662K5397K4842K3972K3346K3423K3838K3848
53495A022941K3414K3284K3934K4854K5232K4978K4602K4347K3941K3142K2105
53484A286774K1067K0103J9214J8357J7297J5783J3932J2175J0703R329P940O655
53472A459329N376L661J357j061l197n391q143j1185j3762j5667j7304j8762j9577
$$ plain form
53558 291114 291338 292220 293460 294644 295685 296886 298430 299997 301150 302002 303156 304892 306756 308243 309674
53543 309674 311992 315631 319973 324146 328143 332761 338463 344702 350517 355551 360234 365191 370820 377387
53529 377387 385132 394111 404115 414854 426103 437681 449534 461926 475276 489631 504508 519504
53517 519504 534866 551232 568959 588005 608376 630219 653376 677220 701233 725547 750624
53506 750624 776504 802666 828613 854275 879672 904514 928486 951832 975255 999093 1022941
53495 1022941 1046355 1069639 1093573 1118427 1143659 1168637 1193239 1217586 1241527 1264669 1286774
53484 1286774 1307841 1327944 1347158 1365515 1382812 1398595 1412527 1424702 1435405 1444734 1452674 1459329
53472 1459329 1464705 1468366 1469723 1468662 1465465 1460074 1451931 1440746 1426984 1411317 1394013 1375251 1355674
53459A355674j9692j9912k0927k2360k3394k4046k5088k6731k8136k8432k7712
53448A089244k6623k5432k3975k2326k0979k0277k0031j9765j9099j7820j5931
53437H56986j3753j1744j0071q528p024n699m431k645pK911N228O789Q125R548
53423H25685J0942J2448J4600J7431K0059K1638K2346K3026K4222K5900K7831
53412A046128K9721L1198L2186L3140L4558L6399L8373M0531M3012M5423M7252
53401A457921M8882N1273N4425N7002N8033N8278N9185O0882O2165O2298O1931
53390B092275O2035O2630O3020O2778O1947O0499N8129N4695N0511M6114M1927
53379B716560L8186L4973L2084K8972K5094K0352J5213J0259N713J378l032p669
$$ plain form
53459 1355674 1335982 1316070 1295143 1272783 1249389 1225343 1200255 1173524 1145388 1116956 1089244
53448 1089244 1062621 1037189 1013214 990888 969909 949632 929601 909836 890737 872917 856986
53437 856986 843233 831489 821418 812890 805866 800167 795736 793091 793084 795995 801223 808012 816137 825685
53423 825685 836627 849075 863675 881106 901165 922803 945149 968175 992397 1018297 1046128
53412 1046128 1075849 1107047 1139233 1172373 1206931 1243330 1281703 1322234 1365246 1410669 1457921
53401 1457921 1506803 1558076 1612501 1669503 1727536 1785814 1844999 1905881 1968046 2030344 2092275
53390 2092275 2154310 2216940 2279960 2342738 2404685 2465184 2523313 2578008 2628519 2674633 2716560
53379 2716560 2754746 2789719 2821803 2850775 2875869 2896221 2911434 2921693 2927406 2928784 2925752 2918083
53367B918083j2647j8283k5010l2947m1542m9789n6879o2597o7026p0071p1550
53356B409742p1717p1354p1065p0753o9936o8488o6678o4706o2602o0591n9139
53345A672713n8383n7837n6912n5468n3713n1813m9869m8017m6266m4334m1934
53334A108167l9148l6184l3061k9795k6797k4453k2423j9884j6670j3557j1226
53323H34969r432p602n707m041k532r08O07J486J848K573M215O271P807Q582R241
53308H47377J0539J2529J4518J5805J6484J7396J9105K1179K2833K4051K5466
53297A047282K7171K8466K9039K9627L0989L2763L3996L4398L4390L4191L3564
53286A395876L2405L0855K8817K6060K2937K0268J8248J6079J3091R704O822M630
$$ plain form
53367 2918083 2905436 2887153 2862143 2829196 2787654 2737865 2680986 2618389 2551363 2481292 2409742
53356 2409742 2338025 2266671 2195606 2124853 2054917 1986429 1919751 1855045 1792443 1731852 1672713
53345 1672713 1614330 1556493 1499581 1444113 1390400 1338587 1288718 1240701 1194435 1150101 1108167
53334 1108167 1069019 1032835 999774 969979 943182 918729 896306 876422 859752 846195 834969
53323 834969 825537 817935 812228 808187 805655 804747 805354 806840 808688 811261 815476 821747 829554 838136 847377
53308 847377 857916 870445 884963 900768 917252 934648 953753 974932 997765 1021816 1047282
53297 1047282 1074453 1102919 1131958 1161585 1192574 1225337 1259333 1293731 1328121 1362312 1395876
53286 1395876 1428281 1459136 1487953 1514013 1536950 1557218 1575466 1591545 1604636 1614340 1621162 1625792
53274A625792K597L61j959m352p144j0465j3853j6664j8796k0761k3070k5686
53262A486000k8158l0211l2061l4037l6089l7872l9247m0347m1080m1007l9977
53251A085914l8538l7387l6521l5309l3372l1109k9374k8769k9240l0137l0649
53240G25509l0433k9789k9122k8391k7347k6090k4882k3481k1260j8212j5331
53229D51171j3540j2689j2009j1217j0572j0020r098p763o662o214o021n558n047
53216C34761m994n211m993m250l748l976m398m165l227k273j852j931k192k359
53202B85192k252j837j334j009r22j000j267j753k230k380k211k018j984k059
53188B60936k262k639k934k727k046j476j380j453j305j075j072j116p95j98J63
$$ plain form
53274 1625792 1628389 1628750 1626791 1622439 1615295 1604830 1590977 1574313 1555517 1534756 1511686 1486000
53262 1486000 1457842 1427631 1395570 1361533 1325444 1287572 1248325 1207978 1166898 1125891 1085914
53251 1085914 1047376 1009989 973468 938159 904787 873678 844304 815535 786295 756158 725509
53240 725509 695076 665287 636165 607774 580427 554337 529455 505974 484714 466502 451171
53229 451171 437631 424942 412933 401716 391144 381124 372026 364263 357601 351387 345366 339808 334761
53216 334761 329767 324556 319563 315313 311565 307589 303191 299026 295799 293526 291674 289743 287551 285192
53202 285192 282940 281103 279769 278760 277838 276838 275571 273818 271588 269208 266997 264979 262995 260936
53188 260936 258674 256035 253101 250374 248328 246852 245472 244019 242714 241639 240567 239451 238656 238458 238621
53173B38621R7p8j08j20k15k47j19O4K67O24J063J198Q86N26M63L70k81j351k063
53154B39597j917j136j88O87J340J567J349J006Q37P69N72K35j05m31o98o13L7
53137B42908Q99J280R72M55J81Ol81q53j055j021j135j469j590j137l32K71L48
53120B38347M4k28j13L80P76N36k67q72o19K71R59R32M03j81o00p83o81m86p30
53101B37088j659k670k877k264j742j864j991j245Q6P87K49q13j340j086n70l03
53085B17786m59r43j400j358o86J22M38J52l55p13p53m81j48k27q82j567j592
53068B06934j000m61l10k66j34k33q61j652j931j438n24K80O50N96L03j15o88
53051A99150j278j455r59j96K28L32N70Q60O08q1r0J110K347K054K90j431k060
$$ plain form
53173 238621 238718 238640 238532 238412 238197 237950 237831 237895 238162 238786 239849 241047 241933 242459 242922 243292 243011 241660 239597
53154 239597 237680 236544 236356 237043 238383 239950 241299 242305 243142 243911 244483 244718 244613 244182 243484 242871 242908
53137 242908 243807 245087 246059 246514 246695 246701 246320 245467 244412 243391 242256 240787 239197 238060 237728 237999 238347
53120 238347 238391 238163 238050 238430 239206 239742 239475 238603 237984 238255 239214 240146 240549 240368 239768 238985 238304 237818 237088
53101 237088 235429 232759 229882 227618 225876 224012 222021 220776 220862 221649 221898 221085 219745 218659 218089 217786
53085 217786 217327 216384 214984 213626 212940 213062 213500 213652 213297 212584 211831 211350 211202 210975 210093 208526 206934
53068 206934 205934 205473 205163 204897 204763 204530 203669 202017 200086 198648 198124 198404 199054 199650 199953 199838 199150
53051 199150 197872 196417 195458 195262 195490 195822 196392 197252 197860 197779 197689 198799 201146 203200 203490 202059 199999
53034A99999j814j216l64M97P65K62l17l50j40k68n64m56j6J16j60k00K67N29
53016A96570r9j091j257l43N83N37j02j59P64J779J868J102M50N76J169J479J199
52999B05025O06N1l92p51r25q82q85j193j642j786j531j248j132q29%R86J309
52982A94781O70l34p84k94O97J371J311Q99Q11J107J138N07l07o36n06l63k66
52965A99802L2M36O34P59J170J610J374M36l61m50k25k68n76q34q99o70j04L72
52947B02238P0j038k131k606k637k403j678o10j7k06l72M7K63n61j684j745q10
52930A84120r5L3L75J158J466O86n51j330j488j336j109r97j087j064n54R3J53
52913A78473l02m05J40O25N55L92O40R98R88P17N28M04K49J72J16k65r30j302
$$ plain form
53034 199999 198185 196969 196605 197102 197867 198129 197812 197462 197322 197054 196490 196034 196018 196134 195974 195774 196041 196570
53016 196570 196471 195380 194123 193780 194363 194900 194798 194639 195403 197182 199050 200152 200602 201178 202347 203826 205025
52999 205025 205631 205682 205290 204539 203614 202732 201847 200654 199012 197226 195695 194447 193315 192486 192486 193472 194781
52982 194781 195451 195117 194333 194039 194736 196107 197418 198317 199128 200235 201373 201880 201573 200937 200431 200068 199802
52965 199802 199834 200270 200904 201663 202833 204443 205817 206253 205892 205442 205217 204949 204373 203539 202640 201970 201866 202238
52947 202238 202308 201270 199139 196533 193896 191493 189815 189205 189188 188982 188610 188657 188920 188359 186675 184930 184120
52930 184120 184025 184058 184433 185591 187057 187743 187192 185862 184374 183038 181929 180932 179845 178781 178227 178320 178473
52913 178473 178171 177766 177906 178531 179086 179478 180118 181116 182104 182821 183349 183753 184002 184174 184290 184025 183095 181793
52895A81793j165j009j090r35l25L9k73m76K81J388J558P22or4j03m35o72m53
52877A78745j05k7j19j44j12K2M53J046J253Q43K79K0j36n11q04m64L57Q65P87
52858A82248Q60J830L284M050L668K912K673K778K400J332K19m07p23j088j468
52843B04568j727k031k557l063l192k994k765k464j788p30K24N50J64n23r10o57
52827A80105N6P62J278J824K485K890K666J944J137M23l04j096j873k517k810
52812A86970k423j299O6J015J374J462J602J869K217K657L209L808M162L717K073
52797B12479m24k737m014m213l820l265k841k739k815k647k105j592j419j323
52783A76525j027p87r35j178r96m71j15l9P0K79L33K09K20M49O37O08M50K44N9
$$ plain form
52895 181793 180628 179619 178529 177594 177269 177308 177035 176559 176840 178228 179786 180508 180502 180408 180305 179870 179198 178745
52877 178745 178640 178613 178494 178350 178238 178260 178713 179759 181012 181855 182134 182154 182018 181507 180703 180239 180596 181461 182248
52858 182248 183108 184938 188222 192272 195940 198852 201525 204303 206703 208035 208254 207847 207124 206036 204568
52843 204568 202841 200810 198253 195190 191998 189004 186239 183775 181987 181257 181481 182031 182195 181672 180762 180105
52827 180105 180161 180923 182201 184025 186510 189400 192066 194010 195147 195570 195266 194170 192297 189780 186970
52812 186970 184547 183248 183314 184329 185703 187165 188767 190636 192853 195510 198719 202527 206689 210406 212479
52797 212479 212055 209318 205304 201091 197271 194006 191165 188426 185611 182964 180859 179267 177848 176525
52783 176525 175498 174711 173776 172598 171602 171131 171016 170977 171047 171326 171659 171868 172088 172537 173174 173782 174232 174476 174535
52764A74535J02M38P14O11M34O54J011Q32J88j1P17J711J996J296qj363k187k060
52746A79610j140j34L91M02J04k86m06J37J151J864J771J176O69M62M70O31Q43
52729A87715Q98Q03Q67J223J573J626J486J408J436J485J455J109K38q52j447
52714B01023j270q54p67r39j113j421k027k565k584k299k225k275j856q66M9L53
52698A78364K38J29M9k45p01q86m71L50R46Q28J41m73n28j42K55M71O15P67Q31
52679A80538P29N77N54P16R20R26N75m3n88o32Q9J372K426K359J100k93o62m7
52661A90616M87K67k61m00j49K1o1k38l89m09oR44K010K633K823K991L139K825
52643B06843J977J159P40K76p79k068k669k387k078k431k981k849k097j588j597
$$ plain form
52764 174535 174637 175075 175789 176400 176834 177488 178499 179331 179519 179508 180225 181936 183932 185228 185220 183857 181670 179610
52746 179610 178470 178336 178727 179129 179233 178947 178541 178678 179829 181693 183464 184640 185309 185771 186241 186872 187715
52729 187715 188613 189416 190283 191506 193079 194705 196191 197599 199035 200520 201975 203084 203322 202470 201023
52714 201023 199753 198899 198132 197193 196080 194659 192632 190067 187483 185184 182959 180684 178828 177962 178011 178364
52698 178364 178602 178731 178780 178535 177834 176948 176477 176827 177773 178601 178742 178269 177741 177599 177854 178325 178940 179707 180538
52679 180538 181267 181844 182398 183114 184034 184960 185535 185492 184904 184272 184361 185733 188159 190518 191618 191325 190663 190616
52661 190616 191103 191370 191109 190709 190560 190581 190520 190282 189893 189484 189478 190422 192432 195065 197888 200879 204018 206843
52643 206843 208820 209979 210719 210995 210216 208148 205479 203092 201014 198583 195602 192753 190656 189068 187471
52628A87471j400m92N49R94J108J580K232K237J447O57M10L76P5m47r43j309j364
52611A93181r38l74l44q85j274j108p85n82r8Q91J749J875J497J007J81j012j605
52594A91376p14R41J784J362O08K63K28M09R92J657J585O47k59m65k98k37n4N34
52576B00359J103J050N29K90P53J633K252J975O40j133k314k411j807j073m09
52561B01437R8K27P2K22R14J446R96j89j068j091o06o6M32P54N35k23q42p25j18
52542B02205K33O7k55m49o48r18r35n19j43l94j028j133k99Q57J551J709J636
52525B01537J337O91J05K25R66J364O90o50j497j131J08J204J409Q43K31J27N37
52508B08096J319K454L661M165L433J961P79K76M6k27l83l65m78q67j254j464
$$ plain form
52628 187471 186071 185579 186128 187122 188230 189810 192042 194279 195726 196383 196793 197169 197244 196797 195854 194545 193181
52611 193181 192243 191869 191525 190640 189366 188258 187473 186891 186793 187684 189433 191308 192805 193812 193993 192981 191376
52594 191376 190662 191603 193387 194749 195357 195620 195848 196257 197249 198906 200491 201138 200879 200414 200116 199879 199825 200359
52576 200359 201462 202512 203041 203331 204084 205717 207969 209944 210584 209451 207137 204726 202919 201846 201437
52561 201437 201535 201762 201834 202056 202970 204416 205412 205223 204155 203064 202458 202392 202824 203578 204113 203890 203048 202323 202205
52542 202205 202438 202505 202250 201801 201153 200235 199300 198781 198638 198244 197216 196083 195784 196641 198192 199901 201537
52525 201537 202874 203565 203670 203895 204861 206225 206915 206265 204768 203637 203745 204949 206358 207201 207432 207559 208096
52508 208096 209415 211869 215530 219695 223128 225089 225868 226144 226190 225963 225580 225215 224737 223870 222616 221152
52492B21152j688j975j944j334n23q8j50l27k15K98R33J132N89k37n29j16M04
52475B15382O31Q94J497K013J831J031K15j98j82K02Q20J409J823K182K537K663
52459B34750K450K121J822J366P47L56K56k36j588l092l620l041k171j525r86
52444B27609n11l43m23l64j45j44m18o10o77r74j440j481r12l77l73n07j80N04
52426B18234R52Q03O3j080k089k207j265p9M89N11O14Q95R17N97L63M64P28J053
52408B19963J608K304K618K322K026K604M177N953P132P722Q314R083R197P568
52394B92591M163K23l001n401p430q802q537o500m079k801k696k605j855r00l66
52379B42004j49J74N57O25L92K94N26P72P56O55P32R22J047J310K064L114L612
$$ plain form
52492 221152 219464 217489 215545 214211 213688 213600 213450 213123 212908 213206 214139 215271 215860 215623 215094 214978 215382
52475 215382 216013 216907 218404 220417 222248 223279 223494 223296 223114 223316 224136 225545 227368 229550 232087 234750
52459 234750 237200 239321 241143 242509 243256 243612 243868 243632 242044 238952 235332 232291 230120 228595 227609
52444 227609 227098 226755 226332 225968 225823 225679 225261 224651 223974 223000 221560 220079 219167 218790 218417 217910 217730 218234
52426 218234 219186 219989 220052 218972 216883 214676 213411 213332 213821 214332 214946 215841 216758 217355 217718 218182 218910 219963
52408 219963 221571 223875 226493 228815 230841 233445 237622 243575 250707 258429 266743 275826 285023 292591
52394 292591 296754 296977 293976 288575 281145 272343 263806 257306 253227 250426 247730 245125 243270 242370 242004
52379 242004 241855 242029 242586 243211 243603 243897 244423 245195 245951 246606 247338 248260 249307 250617 252681 255795 259407
52362B59407K891J230m04j259j341j159j109j121q55j84N82J004R26N28L4l47
52346B58823l43K24J082J620J562J293J251J302J103Q37J073J917K792L297L719
52331B81552M322M631L975K652J893K523M099N530O218O286O147O150O478O944
52317C49400P034O446N522M745M001K881J642J188J867K896L350L188K893K618
52303C99671K308K218K580K918K543J661J269J765K464K683K578K548K438J875
52289D31519R09j78j312k361k831k430j665j237j045m28P17J763K334K744L242
52274D29741L506L263K935L135L734L966L409K487J926J991K382K734L034L511
52260D71754M225M905N226N143M878M646M497M350M084L675L299L196L390L711
$$ plain form
52362 259407 262298 263528 263124 261865 260524 259365 258256 257135 256280 256096 256678 257682 258608 259136 259170 258823
52346 258823 258480 258704 259786 261406 262968 264261 265512 266814 267917 268754 269827 271744 274536 277833 281552
52331 281552 285874 290505 294480 297132 299025 301548 305647 311177 317395 323681 329828 335978 342456 349400
52317 349400 356434 362880 368402 373147 377148 380029 381671 382859 384726 387622 390972 394160 397053 399671
52303 399671 401979 404197 406777 409695 412238 413899 415168 416933 419397 422080 424658 427206 429644 431519
52289 431519 432428 432250 430938 428577 425746 423316 421651 420414 419369 418941 419658 421421 423755 426499 429741
52274 429741 433247 436510 439445 442580 446314 450280 453689 456176 458102 460093 462475 465209 468243 471754
52260 471754 475979 480884 486110 491253 496131 500777 505274 509624 513708 517383 520682 523878 527268 530979
52246E30979M084M505M648M020K743J764J733K110J959J353J176J726K431K972
52232E68203L669M544M976M767M687N297N969N873N309N206N699O163O332O427
52218F43121O364N829N199N327O204O734O202N208M712M783M889M899N089N505
52204G20065N927O340O902P443P451O671N474M551M319M555M602L998L022K462
52190G93782K745L463L884L722L270K966K967K998K547J408J23m51j76R7m38j639
52174H21268k851l851m823n643n910n643n297m977m229k897j678j368j860k291
52160G67950k025j115P8J308K417L170L352K937K112J166L34k72o46p76o46l52
52144G78992q6J39O13J538K525K734J746J02j178j564j391j399k054l277m549
$$ plain form
52246 530979 535063 539568 544216 548236 550979 552743 554476 556586 558545 559898 561074 562800 565231 568203
52232 568203 571872 576416 581392 586159 590846 596143 602112 607985 613294 618500 624199 630362 636694 643121
52218 643121 649485 655314 660513 665840 672044 678778 684980 690188 694900 699683 704572 709471 714560 720065
52204 720065 725992 732332 739234 746677 754128 760799 766273 770824 775143 779698 784300 788298 791320 793782
52190 793782 796527 799990 803874 807596 810866 813832 816799 819797 822344 823752 823875 823424 823248 823345 822907 821268
52174 821268 818417 814566 809743 804100 798190 792547 787250 782273 778044 775147 773469 772101 770241 767950
52160 767950 765925 764810 764888 766196 768613 771783 775135 778072 780184 781350 781684 781412 780766 779990 779344 778992
52144 778992 778906 779045 779658 781196 783721 786455 788201 788303 787125 785561 784170 782771 780717 777440 772891
52129G72891n225m950l870k427r34N09J774K774L807N442P743R977J1368J1885
52115H10764J1927J1604J0797R717Q729P690O104L985J950L09j162k459l088k955
52101H73912k768l033l224k615j356m2J290K938M633N801O526P342Q151Q248P447
52086I13250O259M804K593k87k752l995m382m470l941k395n11N80P99J047J732
52071I08331K306K280J875J508J318J436K076L034L590L293K468J651Q90k6j005
52056I35025j709k086k406k938l734m647n314n343m726l948l437l171l103l546
52042H84917m624n592n528m670m273m914n708n560m460l000j315N79J960K012
$$ plain form
52129 772891 767666 762716 758846 756419 755485 755994 757768 760542 764349 769791 777534 787511 798879 810764
52115 810764 822691 834295 845092 854809 863538 871228 877332 881317 883267 883576 882414 879955 876867 873912
52101 873912 871144 868111 864887 862272 860916 860874 862164 865102 869735 875536 882062 889404 897555 905803 913250
52086 913250 919509 924313 926906 926619 923867 919872 915490 911020 907079 904684 904173 904753 905552 906599 908331
52071 908331 910637 912917 914792 916300 917618 919054 921130 924164 927754 931047 933515 935166 936056 936030 935025
52056 935025 933316 931230 928824 925886 922152 917505 912191 906848 902122 898174 894737 891566 888463 884917
52042 884917 880293 874701 869173 864503 860230 855316 849608 844048 839588 836588 835273 835852 837812 839824
$$ [...]
##END NTUPLES=NMR SPECTRUM
##END=
