
##TITLE=AC1342_CMFRS10072_6666387_mMnFdqPqDc
##JCAMPDX= 6.0         $$ Bruker NMR JCAMP-DX V2.0
##DATA TYPE= NMR SPECTRUM
##DATA CLASS= NTUPLES
##ORIGIN= BRUKER
##OWNER= Administrator
$$ 1.72 TOPSPIN		Version 2.1
$$ 2012-08-13 18:39:44.296 -0500  Administrator@TOPSPIN
$$ Compression mode = diff/dup
##.OBSERVE FREQUENCY= 400.02188249412
##.OBSERVE NUCLEUS= ^1H
##.ACQUISITION MODE= SIMULTANEOUS (DQD)
##.ACQUISITION SCHEME= undefined
##.AVERAGES= 8
##.DIGITISER RES= 22
##SPECTROMETER/DATA SYSTEM= spect
##.PULSE SEQUENCE= zg30
##.SOLVENT NAME= COFFEE_meoh
##.SHIFT REFERENCE= INTERNAL, COFFEE_meoh, 1, 14.98509
##AUDIT TRAIL= $$ (NUMBER, WHEN, WHO, WHERE, PROCESS, VERSION, WHAT)
$$ ##TITLE= Audit trail, TOPSPIN		Version 2.1
$$ ##JCAMPDX= 5.01
$$ ##ORIGIN= Bruker BioSpin GmbH
$$ ##OWNER= Administrator
$$ $$ C:\Bruker\TOPSPIN/data/COFFEE/nmr/AC1342_CMFRS10072_6666387_mMnFdqPqDc/10/pdata/1/auditp.txt
$$ ##AUDIT TRAIL=  $$ (NUMBER, WHEN, WHO, WHERE, PROCESS, VERSION, WHAT)
(   1,<2012-08-13 18:39:34.640 -0500>,<Administrator>,<TOPSPIN>,<go>,<TOPSPIN 2.1>,
      <created by zg
	started at 2012-08-13 18:38:27.984 -0500,
	POWCHK enabled, PULCHK disabled,
       configuration hash MD5:
       6B 1B 68 BB D9 2E 58 E2 7F 35 AD 54 07 DF 0E 41
       data hash MD5: 64K
       F9 C8 EF 76 4F 47 7D E8 10 3E 30 D5 34 BC 8C FC>)
(   2,<2012-08-13 18:39:38.515 -0500>,<Administrator>,<TOPSPIN>,<proc1d>,<TOPSPIN 2.1>,
      <Start of raw data processing
       efp LB = 0 FT_mod = 6 PKNL = 1 PHC0 = 0 PHC1 = 0 SI = 32K 
       data hash MD5: 32K
       8D 0A 97 18 AA 78 9D ED C7 F9 8F D3 C5 9F 89 BC>)
(   3,<2012-08-13 18:39:38.906 -0500>,<Administrator>,<TOPSPIN>,<proc1d>,<TOPSPIN 2.1>,
      <pk PHC0 = 179.8682 PHC1 = 0 
       data hash MD5: 32K
       21 64 2D 70 D5 D9 91 CE D0 63 E3 7C 23 3B E1 03>)
(   4,<2012-08-13 18:39:38.968 -0500>,<Administrator>,<TOPSPIN>,<proc1d>,<TOPSPIN 2.1>,
      <abs ABSG = 1 
       data hash MD5: 32K
       9E BF E8 B3 DF AD 2F 6D 5C 79 00 E9 B8 C6 F4 EB>)
(   5,<2012-08-13 18:39:39.000 -0500>,<Administrator>,<TOPSPIN>,<proc1d>,<TOPSPIN 2.1>,
      <abs ABSG = 2 
       data hash MD5: 32K
       8B 2C 8B B5 4A C2 73 38 6E 55 DC 21 98 A2 75 52>)
(   6,<2012-08-13 18:39:39.031 -0500>,<Administrator>,<TOPSPIN>,<proc1d>,<TOPSPIN 2.1>,
      <abs ABSG = 3 
       data hash MD5: 32K
       D0 32 74 07 63 92 2A 06 D9 73 4B 49 8A 0E CF A7>)
(   7,<2012-08-13 18:39:39.062 -0500>,<Administrator>,<TOPSPIN>,<proc1d>,<TOPSPIN 2.1>,
      <abs ABSG = 4 
       data hash MD5: 32K
       12 C3 D0 01 E6 96 FD C4 96 BB C7 10 7F 9B 1A 7E>)
(   8,<2012-08-13 18:39:39.093 -0500>,<Administrator>,<TOPSPIN>,<proc1d>,<TOPSPIN 2.1>,
      <abs ABSG = 5 
       data hash MD5: 32K
       72 F5 31 1A 8D 7A E6 FD E7 DC 4B 89 DD 5D 2A 78>)
$$ ##END=
$$ 
$$ $$ hash MD5
$$ $$ F3 5C C8 B2 5C 1A 6E 0D 9F 15 0D AE 38 4C 7C 7A
##$RELAX= 
##$RELAX= 
##$RELAX= 
##$RELAX= 
##$RELAX= 
##$RELAX= 
##$RELAX= 
$$ Bruker specific parameters
$$ --------------------------
$$ [...]
150 150 150 150 150 150 150 150
##$TP07= 0
##$TPNAME0= <>
##$TPNAME1= <>
##$TPNAME2= <>
##$TPNAME3= <>
##$TPNAME4= <>
##$TPNAME5= <>
##$TPNAME6= <>
##$TPNAME7= <>
##$TPOAL= (0..7)
0.5 0.5 0.5 0.5 0.5 0.5 0.5 0.5
##$TPOFFS= (0..7)
0 0 0 0 0 0 0 0
##$TUNHIN= 0
##$TUNHOUT= 0
##$TUNXOUT= 0
##$USERA1= <user>
##$USERA2= <user>
##$USERA3= <user>
##$USERA4= <user>
##$USERA5= <user>
##$V9= 5
##$VALIST= <valist>
##$VCLIST= <CCCCCCCCCCCCCCC>
##$VD= 0
##$VDLIST= <DDDDDDDDDDDDDDD>
##$VPLIST= <PPPPPPPPPPPPPPP>
##$VTLIST= <TTTTTTTTTTTTTTT>
##$WBST= 1024
##$WBSW= 4
##$XGAIN= (0..3)
0 0 0 0
##$XL= 0
##$YL= 0
##$YMAX_a= 498129
##$YMIN_a= -644375
##$ZGOPTNS= <>
##$ZL1= 120
##$ZL2= 120
##$ZL3= 120
##$ZL4= 120
##$ABSF1= 14.98509
##$ABSF2= -5.573092
##$ABSG= 5
##$ABSL= 3
##$ALPHA= 0
##$AQORDER= 0
##$ASSFAC= 0
##$ASSFACI= 0
##$ASSFACX= 0
##$ASSWID= 0
##$AUNMP= <proc_prof1d_extract_pilot.lims>
##$AXLEFT= 0
##$AXNAME= <>
##$AXNUC= <1H>
##$AXRIGHT= 0
##$AXTYPE= 0
##$AXUNIT= <>
##$AZFE= 0.1
##$AZFW= 0.1
##$BCFW= 0
##$BC_mod= 0
##$BYTORDP= 0
##$COROFFS= 0
##$CY= 15
##$DATMOD= 1
##$DC= 0
##$DFILT= <>
##$DTYPP= 0
##$F1P= 0
##$F2P= 0
##$FCOR= 0.5
##$FTSIZE= 32768
##$FT_mod= 6
##$GAMMA= 0
##$GB= 0
##$INTBC= 1
##$INTSCL= 1
##$ISEN= 128
##$LB= 0
##$LEV0= 0
##$LPBIN= 0
##$MAXI= 10000
##$MC2= 0
##$MEAN= 0
##$ME_mod= 0
##$MI= 0
##$NCOEF= 0
##$NC_proc= -8
##$NLEV= 6
##$NOISF1= 0
##$NOISF2= 0
##$NSP= 0
##$NTH_PI= 0
##$NZP= 0
##$OFFSET= 14.98509
##$PC= 1
##$PHC0= 179.8682
##$PHC1= 0
##$PH_mod= 1
##$PKNL= yes
##$PPARMOD= 0
##$PPDIAG= 0
##$PPIPTYP= 0
##$PPMPNUM= 2147483647
##$PPRESOL= 1
##$PSCAL= 4
##$PSIGN= 0
##$PYNMP= <proc.py>
##$REVERSE= no
##$SF= 400.02
##$SI= 32768
##$SIGF1= 0
##$SIGF2= 0
##$SINO= 400
##$SIOLD= 32768
##$SPECTYP= <>
##$SREGLST= <1H.CDCl3>
##$SSB= 0
##$STSI= 32768
##$STSR= 0
##$SW_p= 8223.68421052631
##$SYMM= 0
##$S_DEV= 0
##$TDeff= 65536
##$TDoff= 0
##$TI= <>
##$TILT= no
##$TM1= 0
##$TM2= 0
##$TOPLEV= 0
##$USERP1= <user>
##$USERP2= <user>
##$USERP3= <user>
##$USERP4= <user>
##$USERP5= <user>
##$WDW= 1
##$XDIM= 32768
##$YMAX_p= 474089111
##$YMIN_p= -782573
##$CURPLOT= <Network HP LaserJet P1505>
##$CURPRIN= <$Network HP LaserJet P1505>
##$DFORMAT= <normdp>
##$LAYOUT= <+/1D_H.xwp>
##$LFORMAT= <normlp>
##$PFORMAT= <normpl>
##$SURQMSG= 1
$$ End of Bruker specific parameters
$$ ---------------------------------
##NTUPLES= NMR SPECTRUM
##VAR_NAME=  FREQUENCY,     SPECTRUM/REAL,   SPECTRUM/IMAG
##SYMBOL=    X,             R,               I
##VAR_TYPE=  INDEPENDENT,   DEPENDENT,       DEPENDENT
##VAR_FORM=  AFFN,          ASDF,            ASDF
##VAR_DIM=   32768,         32768,           32768
##UNITS=     HZ,            ARBITRARY UNITS, ARBITRARY UNITS
##FACTOR=    0.250966925370066, 1,           1
##FIRST=     8223.43324360094, -122530,      -59653
##LAST=      0,             982,             -239715
##MIN=       0,             -782573,         0
##MAX=       8223.43324360094, 474089111,    0
$$ Real data points
##PAGE= N=1
##DATA TABLE= (X++(R..R)), XYDATA
$$ [...]
$$ plain form
19468 -247655 -93418 -97725 178658 -31385 -152069 -234624 -9631 -184885 31530 -135690 47612
19456 381146 -105170 -112547 -8468 -347357 228037 138487 30942 259956 216500 -86219 -202591
19445 -202591 11750 -285325 -206574 -68111 -48545 242205 -21203 -223143 -63619 23256 106404
19434 106404 -103784 75168 189259 114094 69526 -210107 -120566 81931 189542 22070 176217
19423 176217 -424329 -438391 -79693 22788 264479 18758 212570 -81588 -39003 74014 18064
19411 -351946 -171511 164007 -76257 -111192 100753 -50185 7480 220654 -191822 -53081 -219665
19400 -219665 -304937 118022 211084 -288690 -84646 -24310 -157805 -128674 142287 127933 -262455
19388 -224996 227370 -165978 -179842 -135906 -16508 -196384 79330 98098 -144134 -20316 -15385
$$ packed form
19468b47655i3418m307A78658c1385j20684q2555i631j75254C1530a35690D7612
19456C81146a05170p377h468l38889B28037q9550C0942K29014m3456h6219j16372
19445b02591A1750b85325P8751f8111J9566B42205b1203k01940f3619B3256Q3148
19434A06404a03784G5168J14091p5165m4568b10107Q9541H1931J07611B2070J54147
19423A76217d24329j4062g9693B2788K41691A8758J93812h1588c9003G4014A8064
19411c51946a71511A64007g6257l4935A00753e0185G480K13174a91822e3081j66584
19400b19665q5272A18022R3062b88690h4646b4310j33495K9131A42287j4354b62455
19388b24996B27370a65978j3864M3936a6508j79876G9330J8768a44134b0316M931
$$ plain form
19377 -15385 -34758 -248916 -160415 -83759 12360 -296024 91456 146124 -142823 -136633 -324200
19366 -324200 353563 108045 -251294 -130443 -128671 237697 -44887 23945 133654 -97328
19355 143299 -110526 84803 -441315 -243355 121032 196323 -131354 -81993 -69049 40955
19344 -249832 4680 -392413 -90220 -290353 -3557 -256082 -403303 399534 -294328 -286164 -87640
19332 -205983 -260428 -17486 233633 -274902 -262918 -287805 -40352 179299 -156985 -126496 -224657
19321 -224657 -21813 38950 -186152 -31663 196594 334996 -95790 -46554 -139789 -56521 199202
19309 -294886 -427252 357063 -20485 74256 -63194 -87962 48833 -178901 -117219 -11516 -33748
19298 -33748 83806 356595 -233467 235059 -171752 128332 129245 -175769 -232267 -304543 -217331
$$ packed form
19377a5385j9373k14158Q8501P6656A2360b96024I1456N4668a42823O190j87567
19366c24200C53563A08045b51294J20851J772B37697d4887B3945J09709i7328
19355A43299a10526H4803d41315J97960A21032P5291a31354M9361J2944D0955
19344b49832D680c92413i0220k00133c557k52525j47221C99534b94328Q164h7640
19332b05983n4445a7486B33633b74902J1984k4887d0352A79299a56985L0489r8161
19321b24657b1813C8950a86152c1663A96594J38402i5790d6554r3235e6521A99202
19309b94886j32366C57063b0485G4256f3194k4768D8833a78901O1682a1516k2232
19298c3748H3806K72789b33467B35059a71752A28332R13a75769n6498p2276Q7212
$$ plain form
19287 -217331 -25492 -94685 -234525 -180857 -154407 -177396 162145 -17828 -188715 -146393 -80933
19276 -80933 292595 -108931 -356571 -395754 -157291 -122783 -106414 -82050 -30743 67100 -63314
19264 -279207 234715 -159761 -331241 123122 -190107 76035 46130 -366473 -267685 -171644
19254 -171644 -94557 -76071 -119603 -76502 -141652 67207 -335915 13627 131369 -190702 -356644
19243 -356644 -218741 -75712 -185572 -30154 -97391 47539 58984 209495 255950 -20812 -92520
19232 -92520 -44286 -58096 -195614 -66183 -90388 -314878 -62736 -84141 32716 -241535 -266194
19221 -266194 456136 -128176 -42184 -57635 -203942 62847 138516 -153961 81596 24609 -285106
19209 -203151 -36581 -75820 45079 -95565 -215475 -463979 721 264405 -125201 158719 -131898
$$ packed form
19287b17331b5492o9193j39840N3668K6450k2989A62145a7828j70887M2322O5460
19276h0933B92595a08931k47640l9183a57291L4508J6369K4364c0743F7100f3314
19264b79207B34715a59761j71480A23122a90107G6035k9905c66473R8788R6041
19254a71644P7087J8486m3532M3101o5150F7207c35915A3627J17742a90702j65942
19243c56644J37903g5712j09860c0154o7237D7539J1445J50511M6455b0812p1708
19232i2520d4286j3810j37518f6183k4205k24490f2736k1405C2716b41535k4659
19221b66194D56136a28176d2184j5451j46307F2847P5669a53961H1596B4609b85106
19209b03151c6581l9239D5079i5565j19910k48504G21K63684a25201A58719a31898
$$ plain form
19197 28884 145594 110614 82134 179098 -353734 314708 300480 -143153 289377 -224779
19186 118643 200103 268439 -455474 -27059 115270 -244534 -60691 243060 -88563 -31783 135017
19174 23340 -110959 98164 -463249 -84074 43529 -182193 -130904 -25587 -304231 -248015 -308294
19163 -308294 -185157 -103742 -251630 174852 -47496 -509816 140765 -350009 -168081 -180494
19153 -180494 -168712 -276695 -75657 -232839 6097 -42320 -20543 59648 155608 168961 122461
19142 122461 71570 -306339 39857 -204481 -43287 -291206 89626 276532 65803 -38271 -188962
19131 -188962 156264 -162107 -190549 -106236 -231246 -148772 119062 405630 -227296 -108513
19120 72535 -231523 -180127 -465438 68712 -329581 328758 212842 -239979 -143826 -92521
$$ packed form
19197B8884J16710l4980k8480R6964c53734C14708j4228a43153B89377b24779
19186A18643Q1460O8336d55474b7059A15270b44534f0691B43060h8563c1783A35017
19174B3340a10959I8164d63249h4074D3529a82193N1289b5587k78644N6216o0279
19163c08294J23137Q1415j47888A74852d7496m62320A40765c50009a68081j2413
19153a80494J1782j07983g5657j57182F097d2320b0543E9648R5960J3353m6500
19142A22461n0891c06339C9857b04481d3287k47919H9626J86906F5803c8271j50691
19131a88962A56264a62107k8442Q4313j25010Q2474A19062K86568b27296a08513
19120G2535b31523N1396k85311F8712c29581C28758j15916b39979R6153N1305
$$ plain form
19110 -92521 -56079 109643 59048 133515 -80737 -56107 -391673 -235343 48280 -200535 -200220
19099 -200220 -139449 394641 -272632 -334473 -96439 -126911 89768 -185524 133206 79349 -194151
19087 -50942 -85444 -29020 -65162 100527 -183467 236743 -47458 -32981 -302287 -204912 -103590
19076 -103590 48886 -242846 -206215 -91132 9102 -166237 209847 -213941 59337 -73656 -25818
19064 -29876 61439 74424 81418 -15685 269157 -151924 249544 143372 -128534 -311128 54780
19052 -83024 -257252 271033 -311141 -7003 -52539 -468477 15707 -123933 -164036 -105118 -169165
19041 -169165 133572 -343263 -252796 297430 -139703 -61793 -78660 -87239 -51622 -194393 -223325
19030 -223325 130974 -83450 155844 -34341 15359 216433 -65563 207756 219171 205721 -209566
$$ packed form
19110i2521L6442A09643n0595P4467h0737K4630l35566J56330D8280b00535L15
19099b00220O0771C94641b72632o1841i6439l0472H9768a85524A33206n3857a94151
19087e0942l4502b9020l6142A00527a83467B36743d7458J4477k69306R7375J01322
19076a03590D8886b42846L6631i1132I102a66237B09847b13941E9337g3656b5818
19064b9876F1439J2985O994a5685B69157a51924B49544j06172a28534j82594E4780
19052h3024j74228B71033c11141g003m5536m15938A5707a23933m0103N8918o4047
19041a69165A33572c43263R0467B97430a39703f1793j6867q579L5617j42771k8932
19030b23325A30974h3450A55844c4341A5359K01074f5563B07756J1415j3450b09566
$$ plain form
19018 -280557 -488764 -223520 -36078 73155 88391 -91624 35075 -227627 -298395 22249 -384177
19006 -140319 27252 -28334 -133839 23534 15979 3129 -28175 139569 295096 447697 161166
18994 57018 -19111 -6336 -35567 80630 -220673 -108505 -86384 -155499 -106158 2307 -87305 -156126
18982 -156126 -222968 98899 181635 145673 -116989 -294952 -32689 154069 -221276 109653
18971 -20543 -425302 11894 -26357 -232248 -16118 468598 -187147 128428 -51107 249968
18960 -178131 48031 89070 153200 34412 605421 144162 -23638 103685 -97765 267483 369630
18949 369630 -51564 -352167 -454261 89126 19286 -322979 -264630 10838 -219306 -151733 -175487
18938 -175487 91501 -134508 -172593 -53036 59897 -60315 83955 314912 87316 -160468 -373643
$$ packed form
19018b80557k08207b23520c6078G3155J5236i1624C5075b27627p0768B2249c84177
19006a40319B7252b8334j05505B3534p555C129b8175A39569J55527J52601A61166
18994E7018a9111f336k9231H0630b20673a08505K2121o9115M9341B307h7305o8821
18982a56126o6842I8899Q2736l5962a16989j77963c2689A54069b21276A09653
18971b0543m04759A1894b6357k05891a6118D68598a87147A28428e1107B49968
18960a78131D8031M1039O4130C4412N71009A44162b3638A03685i7765B67483J02147
18949C69630e1564l00603j02094H9126A9286c22979N8349A0838b19306O7573k3754
18938a75487I1501a34508l8085e3036E9897f0315H3955K30957H7316a60468k13175
$$ plain form
18927 -373643 181991 62746 -267702 135910 120620 -109675 -37423 123854 -82517 -124220
18917 -124220 189249 454600 -155224 83494 -113495 -147362 -229781 -199355 -19663 -228320
18907 -228320 76420 -140942 -98133 7204 -170949 32751 -235197 -191955 -72459 48742 126876
18896 126876 -22173 282472 221448 51597 276216 39640 -90865 -33691 -261561 -66306 156015
18884 193412 -189944 -53872 28797 114735 -5491 18669 -282903 72623 -20141 -195226 -247668
18873 -247668 -96575 258799 57943 298619 -26154 65354 -328681 -15243 -195772 -343377
18863 -343377 -114105 86699 -386257 74031 -100740 120570 -253499 -330673 -246093 -51705
18852 69128 52082 167425 -148832 -167600 81148 446996 -383313 77328 -169287 295993
$$ packed form
18927c73643A81991F2746b67702A35910j5290a09675c7423A23854h2517m1703
18917a24220A89249K65351a55224H3494a13495l3867q2419L0426a9663k08657
18907b28320G6420a40942M2809G204a70949C2751b35197M3242g2459D8742P8134
18896A26876b2173B82472o1024E1597K24619C9640i0865c3691k27870f6306A56015
18884A93412a89944e3872B8797Q5938e491A8669b82903G2623b0141j75085n2442
18873b47668i6575B58799E7943K40676b6154F5354c28681a5243j80529j47605
18863c43377a14105H6699c86257G4031a00740A20570b53499p7174Q4580e1705
18852F9128j7046J15343a48832j8768H1148L65848c83313G7328a69287B95993
$$ plain form
18841 139687 -224589 208556 88929 -148715 -358455 83788 81130 267854 168602 118769 171155
18830 171155 -355856 -142857 55589 3771 204565 103147 -8694 141094 166724 -408381 -67476
18818 -179115 120796 -167113 -310870 -203942 134830 63020 34970 203535 -181253 -48276
18807 -226862 269689 51516 -61394 -169635 -164711 -155465 -130015 121218 -181371 -117234 -59980
18796 -59980 101999 310673 -69046 263152 -102655 116272 -342617 -28087 -335862 54962
18785 85797 -3524 -226822 -25394 -121016 -31911 -140372 100839 330835 85032 -93496 -121912
18774 -121912 -278828 162447 -361924 -72587 82585 41931 -102719 -62163 -91223 -79663 -196358
18763 -196358 -367631 -178448 50361 160505 -166441 -297583 99803 33759 66513 -212997
$$ packed form
18841A39687b24589B08556H8929a48715k09740H3788k658J86724r9252m9833N2386
18830A71155c55856a42857E5589C771K00794j01418h694A41094K5630d08381f7476
18818a79115A20796a67113j43757J06928A34830F3020k8050J68565a81253d8276
18807b26862B69689E1516f1394j08241M924R246K5450A21218a81371O4137N7254
18796e9980A01999K08674f9046B63152a02655A16272c42617b8087l07775E4962
18785H5797c524k23298b5394r5622c1911j08461A00839K29996H5032i3496k8416
18774a21912j56916A62447c61924g2587H2585m0654a02719M0556k9060J1560j16695
18763a96358j71273a78448E0361J10144a66441j31142I9803C3759L2754b12997
$$ plain form
18752 40223 -480616 143559 -78449 -195525 12973 -181262 -32570 49535 110413 -13626 143984
18740 164690 -52388 -70641 169770 -40379 -76946 -116546 -165987 -98608 216863 67614 -146973
18728 86917 373618 20722 -76933 248505 56269 193280 -176370 -410595 86258 38298 101056
18717 101056 -73843 -122093 -174937 170116 105470 -8601 -35263 -437456 -406892 -220712 207006
18705 200991 204080 -238485 85420 -50515 -203312 14343 -7689 -71883 -98546 13080 -196774
18693 -364621 68319 -50229 -111118 -104997 -3406 184692 -308231 42867 136874 -162513 24494
18681 166282 -250219 -90414 198631 104895 145860 -56494 -201021 -246831 148816 37091 -183340
18669 16924 -201589 -61402 103819 -221292 218662 141131 -188606 107357 -43488 357318
$$ packed form
18752D0223d80616A43559g8449j17076A2973a81262c2570D9535O0878a3626A43984
18740A64690e2388j8253A69770d0379l6567l9600m9441O7379B16863F7614a46973
18728H6917K86701B0722g6933B48505E6269J37011a76370k34225H6258C8298O2758
18717A01056g3843m8250n2844A70116o4646h601k6662m02193L0564J86180B07006
18705B00991L089b38485H5420e0515j52797A4343g689o4194k6663A3080a96774
18693c64621F8319e0229o0889O121c406A84692c08231D2867R4007a62513B4494
18681A66282b50219i0414A98631r3736M0965e6494j44527m5810A48816C7091a83340
18669A6924b01589f1402A03819b21292B18662p7531a88606A07357d3488C57318
$$ plain form
18658 4102 -120088 -21568 33090 33465 98515 -366085 -132910 -298496 -137019 111941 -33746
18646 -76331 -285063 261493 230470 -107419 -277242 -97596 -429172 -3519 -94453 -4109 79810
18634 -154616 92145 -482954 116448 -104754 -113168 -112611 167744 242486 -3044 -11125 -169509
18623 -169509 335550 -183773 -105323 -58608 -83957 -144506 74686 -120916 144518 -48581 -160661
18612 -160661 -15661 -295461 -186924 -55357 57712 -46218 287701 -52799 -141701 10219 -292312
18600 196644 118852 -63417 -256382 184606 -212385 189263 -185000 73987 -23669 -556421
18590 -556421 25737 -57686 -126070 -210550 -366936 -80846 310161 -459574 -86255 27244 27032
18579 27032 -91736 -434646 -259459 -6219 -206208 -316569 149879 82116 -98646 -208448 20881
$$ packed form
18658D102a20088b1568C3090L75O5050c66085a32910j65586a37019A11941c3746
18646g6331k08732B61493l1023a07419j69823i7596l31576c519r0934d109G9810
18634a54616I2145d82954A16448a04754q414N57A67744P4742c044q081j58384
18623a69509C35550a83773P8450M6715k5349o0549G4686a20916A44518d8581j12080
18612a60661a5661k79800J08537e5357E7712d6218B87701e2799q8902A0219b92312
18600A96644p7792f3417j92965A84606b12385A89263a85000G3987b3669n32752
18590e56421B5737e7686o8384q4480j56386h0846C10161d59574h6255B7244k12
18579B7032i1736l42910J75187f219j99989j10361A49879o7763i8646j09802B0881
$$ plain form
18567 -114318 189165 -385128 -332972 188298 -11960 140119 -14940 -7726 89839 51827 -31490
18555 60133 -127715 -52099 -103009 85869 116712 152660 -264404 41113 -231083 -74179 372954
18543 -58444 213668 149733 121673 -108627 356521 6308 -187177 -37334 -233794 -81875 -137371
18532 -137371 -5206 -3115 -14029 -78171 -267887 -33092 -164009 451635 -71475 151258 84768
18521 84768 -63100 -397364 -289049 334765 184275 -231583 160202 132525 -68748 260861
18510 -179795 -195777 161008 -76810 -169515 254292 -130139 -311602 -464886 196914 -42882
18499 -214317 -18635 -353588 76313 -536850 -97810 -173240 22395 155361 9851 190579 -173270
18487 -301759 -35601 -358512 -320702 48804 12562 48593 -174384 -204118 -175578 -50852 -274457
$$ packed form
18567a14318A89165c85128N2156A88298a1960A40119a4940P214H9839l8012c1490
18555F0133a27715e2099n0910H5869L0843L5948b64404D1113b31083g4179C72954
18543e8444B13668o3935k8060a08627C56521F308a87177c7334j96460h1875n5496
18532a37371e206K091j0914o4142j89716c3092j30917D51635g1475A51258o6490
18521H4768f3100l34264J08315C34765j50490b31583A60202k7677f8748B60861
18510a79795j5982A61008g6810r2705B54292a30139j81463j53284A96914d2882
18499b14317a8635l34953G6313e36850i7810p5430B2395J32966I851J80728a73270
18487c01759c5601l22911L7810D8804A2562L6031a74384k9734K8540e0852k23605
$$ plain form
18476 -274457 17614 63992 22067 -65048 100376 169585 144611 -145932 -242247 41196 -176434
18464 58841 168881 40058 39812 -484973 178774 296956 183108 93212 -84389 -55202 -274707
18453 -274707 -246424 87282 -10579 188708 41678 -193967 129772 -65763 147571 -126044
18442 104021 43159 -253799 -14433 -109760 221226 -114791 -34611 382860 66682 81932 -54579
18430 -296827 68486 -345533 -378689 -292470 -8933 -133575 268349 -230106 -7022 -182956 -162327
18419 -162327 -473574 -299553 -291043 -111189 -114929 52030 42723 -242273 -312583 -42052 -123082
18408 -123082 -185866 169465 -268601 163372 89474 229062 -207233 153727 -65893 -376656
18398 -376656 -138637 -24435 -46951 -92726 83013 -319374 -165081 274800 -153105 64263
$$ packed form
18476b74457A7614M6378B2067f5048A00376O9209k4974a45932r6315D1196a76434
18464E8841J10040D0058k46d84973A78774J18182j13848q9896h4389K9187k19505
18453b74707K8283H7282a0579A88708D1678a93967A29772f5763A47571a26044
18442A04021D3159b53799a4433r5327B21226a14791c4611C82860F6682J5250e4579
18430b96827F8486c45533l3156Q6219h933j24642B68349b30106g022j75934K0629
18419a62327l11247J74021Q510a11189l740E2030r307b42273p0310d2052q1030
18408a23082o2784A69465b68601A63372p3898J39588b07233A53727f5893l10763
18398c76656a38637b4435k2516m5775H3013c19374J54293B74800a53105F4263
$$ plain form
18387 65710 -34548 -41945 -55646 14026 -18126 37978 343515 132332 -164015 202467 287987
18376 287987 -136253 192673 -376353 -15881 -107643 37469 189196 183952 -145186 68289 75412
18365 75412 -74220 81331 -147365 -245116 -44743 -11469 -91110 -162038 270981 16766 119829
18354 119829 233338 64270 -200867 113523 225503 14077 -72001 219105 -22478 -272123
18344 -272123 141547 54842 -126235 -108192 -65202 800 172391 -39916 22667 -127614 -254143
18333 -254143 -96789 -294458 -102335 -109904 10442 -8953 -88294 32506 -232726 33199 -91085
18321 -136076 67075 52421 -183044 -35695 -62919 -18951 235497 -84675 99237 161957 -309203
18309 -191346 -146988 252689 -53967 -120090 -156448 -3398 -223536 -36963 150595 32734 35168
$$ packed form
18387F5710c4548p397j3701A4026a8126C7978L05537A32332a64015B02467Q5520
18376B87987a36253A92673c76353a5881r1762C7469J51727n244a45186F8289P123
18365G5412g4220H1331a47365r7751d4743a1469p9641p0928B70981A6766J03063
18354A19829J13509F4270b00867A13523J11980A4077g2001B19105b2478k49645
18344b72123A41547E4842a26235J8043M2990H00J71591c9916B2667a27614j26529
18333b54143i6789j97669a02335p569A0442h953p9341C2506b32726C3199i1085
18321a36076F7075j4654a83044c5695k7224a8951B35497h4675I9237O2720c09203
18309a91346M4358B52689e3967o6123l6358c398k20138c6963A50595C2734K434
$$ plain form
18298 35168 39631 -84459 -271884 162747 -300802 131287 -14893 -161505 -226748 52732 215601
18287 215601 31213 -131052 -264640 -75186 34368 -26950 -10800 272014 -78863 290431 -62255
18275 139331 -93952 -134489 148906 356443 -65476 213381 -366115 10099 -29244 -179467
18265 -179467 -308597 -357562 95289 32794 -255294 -108367 -163990 125510 -174589 -146614
18255 -146614 -25668 -103100 109966 -91257 167827 -190850 55580 -200289 127860 -67730
18244 305513 81953 -259093 -123077 -130140 -22208 -193603 190106 -324190 -171937 -310967
18234 -310967 -294182 -264650 2371 57089 95637 -27604 -84072 -61909 -74704 364959 -46815
18222 -258452 22621 -7821 -225212 -113552 -16651 158958 -62128 390002 197188 182722 57946
$$ packed form
18298C5168M463h4459j87425A62747c00802A31287a4893j46612o5243E2732J62869
18287B15601C1213a31052j33588g5186C4368b6950a0800B72014g8863B90431f2255
18275A39331i3952m0537A48906K07537f5476B13381c66115A0099b9244j50223
18265a79467j29130m8965I5289C2794b55294a08367n5623A25510a74589K7975
18255a46614b5668p7432A09966i1257A67827a90850E5580b00289A27860f7730
18244C05513H1953b59093a23077p063b2208j71395A90106c24190J52253j39030
18234c10967J6785K9532B371N4718L8548b7604n6468K2163j2795C64959d6815
18222b58452B2621g821k17391J11660a6651A58958f2128C90002j92814j4466E7946
$$ plain form
18210 135352 57083 -220987 -198912 -83743 -332354 -28937 105690 -160454 280067 294973
18200 294973 22133 72284 -203260 16479 -246353 -291056 385870 -234711 -46218 -294833
18190 -294833 -90279 141432 -183634 -247578 25822 96547 -158318 83403 -36422 -63254 273540
18178 -87649 -5017 -484181 -112276 -73061 -252606 -306322 -84766 258586 260305 97734 -345671
18166 -193129 -107873 -3192 -59808 -126936 -200848 159676 -10290 34099 -249056 -267131 -212523
18155 -212523 -335276 189810 164957 255609 -54658 -19305 -168023 276439 59392 110249 62084
18144 62084 320900 102872 -150188 265794 -65372 65600 -41588 143574 -40059 195653
18133 -10208 301789 238 162326 27415 113327 111167 125768 -96306 18530 92087 87134 -167478
$$ packed form
18210A35352E7083b20987K2075h3743k48611b8937A05690a60454B80067J4906
18200B94973B2133N0151b03260A6479b46353m4703C85870b34711d6218k48615
18190b94833i0279A41432a83634o3944B5822P0725a58318H3403c6422k6832B73540
18178h7649e017m79164a12276L9215j79545n3716h4766B58586J719I7734c45671
18166a93129Q5256c192n6616o7128p3912A59676a0290C4099b49056j8075N4608
18155b12523j22753A89810k4853R0652e4658a9305j48718B76439E9392N0857m8165
18144F2084K58816A02872a50188B65794f5372F5600d1588A43574d0059A95653
18133a0208C01789B38J62088B7415Q5912k160J4601i6306A8530P3557m953a67478
$$ plain form
18120 -35800 -48845 372103 166907 -118861 -404469 -145996 -174339 -353579 -33803 -126341
18110 -126341 -9414 -448459 -144628 287552 -69981 -23147 88560 470490 -237295 -108089
18099 225950 -191334 43233 10248 100103 -214208 1174 147021 -4107 143390 -61645 199904
18087 -31372 -78913 -223481 295981 130034 5148 134180 -173826 98806 325224 80029 -66144
18075 -188576 -4587 131233 98772 4977 137092 267071 -302848 44633 -412521 -74111 -166375
18064 -166375 126808 126067 122137 -91309 -382151 -178057 -260344 21767 319603 110129 163024
18053 163024 32524 -108089 121710 -387691 87367 323303 -127173 -55482 102311 -603470
18042 -21465 153797 93677 -200334 -50952 -80741 -171153 92704 20444 49151 -63415 -160279
$$ packed form
18120c5800j3045C72103A66907a18861k85608a45996k8343j79240c3803r2538
18110a26341i414m39045a44628B87552f9981b3147H8560L81930b37295a08089
18099B25950a91334D3233A0248Q9855b14208A174J45847d107A43390f1645A99904
18087c1372m7541j44568B95981A30034E148J29032a73826I8806K26418H0029f6144
18075a88576d587A31233l2461D977J32115J29979c02848D4633d12521g4111r2264
18064a66375A26808p41l930i1309k90842a78057q2287B1767K97836A10129N2895
18053A63024C2524a08089A21710c87691H7367K35936a27173e5482A02311f03470
18042b1465A53797o0120b00334e0952k9789r0412I2704B0444K8707f3415r6864
$$ plain form
18031 -160279 285004 144676 -292293 410029 -37002 -43796 -120263 83053 22049 -162400 403523
18019 154827 331138 -195371 -83368 -78422 -42242 -82309 100097 -402615 108664 -35714 118953
18007 -191833 -12161 -17917 45346 230650 -112757 -218303 -46801 -250664 14392 -15137 -139481
17996 -139481 60449 -1518 -25401 293504 -16606 -25249 123439 -97737 22319 -542666 -102815
17984 51680 -144841 -345279 258902 -393027 -284432 -104628 296762 159958 -204298 -303195
17974 -303195 53309 56237 185433 -129599 -121847 68139 -46263 -353592 -219169 62109 -311682
17962 -56415 -123105 208178 -15476 115740 277894 -111163 -58476 -4829 28475 86015 -81592
17950 73897 114090 -52334 -321668 38985 -181744 133869 142893 -192059 -45273 158057 171292
$$ packed form
18031a60279B85004j40328b92293D10029c7002o794p6467H3053B2049a62400D03523
18019A54827J76311a95371h3368M946L6180m0067A00097d02615A08664c5714A18953
18007a91833a2161n756D5346J85304a12757j05546d6801k03863A4392a5137j24344
17996a39481F0449a518k3883B93504a6606q643A23439i7737B2319e42666a02815
17984E1680a44841k00438B58902c93027J08595a04628B96762j36804b04298r8897
17974c03195E3309K928J29196a29599P752F8139d6263l07329J34423F2109c11682
17962e6415o6690B08178a5476A15740J62154a11163N2687d829B8475N7540h1592
17950G3897M0193e2334k69334C8985a81744A33869R024a92059d5273A58057J3235
$$ plain form
17939 171292 -183047 -47387 320733 -127261 -77395 -200052 -77503 -294660 449072 365653
17929 365653 208148 239851 1194 -34304 -53348 -44356 140274 15945 -171537 104225 -153975
17917 84958 287352 40281 1465 285600 -221618 168112 557455 -145985 135275 -9852 37656
17905 -92594 -211285 124131 -40882 -139106 -10920 288005 -252567 83831 132087 -51055 320392
17893 165814 -186028 -200102 -172076 153802 -46741 415941 36251 348638 -327789 220283
17882 91959 206848 147052 60068 242346 -28269 5242 40343 77090 337195 3221 -220079
17870 266276 262473 -52631 -143377 178324 17312 -6076 79291 216656 -29362 192933 141396
17859 141396 -100172 -89018 247088 237943 139761 69215 -242821 654405 -269950 10973 30629
$$ packed form
17939A71292a83047d7387C20733a27261M9866j22657g7503k17157D49072q3419
17929C65653j57505L1703A194c4304j9044Q992A40274A5945a71537A04225a53975
17917H4958K02394D0281A465K84135b21618A68112L89343a45985A35275i852C7656
17905i2594j18691A24131d0882r8224a0920B88005b52567H3831M8256e1055C20392
17893A65814a86028j4074K8026A53802d6741D15941C6251L12387c27789B20283
17882I1959J14889n9796F0068J82278b8269E242L5101L6747K60105C221b20079
17870B66276l803e2631r0746A78324A7312f076G9291J37365b9362A92933n1537
17859A41396a00172J1154B47088r145r8182F9215b42821F54405b69950A0973J9656
$$ plain form
17848 30629 381048 -283073 -144004 192803 -261273 -119883 -121127 -27865 -181060 -252325
17838 -252325 347948 -62546 227459 162881 122297 67349 -188339 111792 16442 111281 -400396
17826 -87431 251199 -60639 45073 -237050 92729 -331153 -55295 -40437 -382135 136626 269111
17815 269111 54974 -72395 -243337 207089 -267585 6827 23480 23630 275322 71373 101321
17804 101321 240072 276016 -60090 17970 -341727 -481651 -70644 269920 17613 217849
17794 217849 255132 -37134 -41939 113297 -264154 59680 127735 123948 42980 9979 4389 185920
17782 185920 101420 12776 3169 -15297 -64852 -255663 -18987 -92037 301619 546775 -114602
17770 -16584 7949 240424 235319 7179 -98940 193854 -127240 -395177 66042 4196 -171076
$$ packed form
17848C0629L50419b83073J39069A92803b61273a19883j244b7865j53195p1265
17838b52325C47948f2546B27459o4578m0584n4948a88339A11792A6442R4839d00396
17826h7431B51199f0639D5073b37050I2729c31153e5295J4858l41698A36626J32485
17815B69111E4974g2395j70942B07089b67585F827J6653J50K51692G1373K9948
17804A01321J38751L5944f0090A7970c41727j39924g0644B69920A7613K00236
17794B17849L7283c7134m805A13297b64154E9680O8055l787D2980I979D389J81531
17782A85920q4500A2776C169a5297m9555j90811a8987p3050C01619K45156a14602
17770a6584G949K32475n105G179i8940A93854a27240k67937F6042D196a71076
$$ plain form
17758 267115 -29942 -213589 108331 262222 5829 146513 25511 -57441 223433 124803 -119180
17746 -132875 119883 147650 20593 -61499 -318112 -39000 216858 249038 -49270 166826 524241
17735 524241 235050 295863 -82097 7673 178372 115267 -225498 117807 197242 40952 -35730
17723 324559 -169875 291129 261862 -110881 143726 -243102 273162 -227182 58334 -160707
17712 187591 -182459 176139 -24745 178496 221386 7012 118388 224203 -233639 78248
17701 -239279 -196908 -170707 -129508 330493 105443 210272 -34149 149164 137675 139965 -15726
17689 34467 222076 -48445 37253 -50647 18691 132998 180244 129116 136209 206399 256575
17678 256575 177433 199902 172920 54134 104257 -78913 255055 48142 -31505 131058 330998
$$ packed form
17758B67115b9942j83647A08331J53891E829J40684B5511e7441B23433r8630a19180
17746a32875A19883K7767B0593f1499k56613c9000B16858L2180d9270A66826L57415
17735E24241B35050O0813h2097G673J70699o3105b25498A17807P9435D0952c5730
17723C24559a69875B91129k9267a10881A43726b43102B73162b27182E8334a60707
17712A87591a82459A76139b4745A78496M2890G012J11376J05815b33639G8248
17701b39279M2371K6201M1199C30493A05443J04829c4149A49164j1489K290a5726
17689C4467J87609d8445C7253e0647A8691J14307M7246n1128P093P0190N0176
17678B56575p9142K2469k6982E4134N0123g8913B55055D8142c1505A31058J99940
$$ plain form
17667 330998 -127874 -83633 260387 117215 -67285 -115894 159743 224150 115046 46790
17656 -195836 234481 185730 28553 120822 53144 -316063 242853 190381 -113765 46771 330610
17645 330610 336574 168611 -179833 75474 138866 63724 -39280 -246885 -95739 -125125 89426
17633 -74118 -144418 -214987 -124363 -64123 28103 -25915 171719 -95256 -13688 -4448 -78317 490056
17620 26521 91251 61280 169698 37672 82866 243513 213494 -33310 30465 352792 -31101
17608 370551 276235 167970 101608 -180923 -70573 -72368 -776 34831 -120257 58795 53800 121649
17596 121649 -135279 234028 5198 175424 497305 160273 24939 132878 281320 273052
17586 273052 751 128928 -258609 13642 -108271 75953 258082 211429 -56447 -283345 161752
$$ packed form
17667C30998a27874M4241B60387A17215f7285m8609A59743O4407j09104D6790
17656a95836B34481m8751B8553R2269E3144c16063B42853n2472a13765D6771K83839
17645C30610N964j67963a79833G5474O3392F3724c9280k07605i5739k9386H9426
17633g4118p0300p0569R0624O0240B8103b5915A71719i5256a3688d448p3869D90056
17620B6521O4730k9971J08418C7672M5194J60647l0019c3310C0465L22327c1101
17608C70551r4316j08265o6362a80923g0573j795g76C4831a20257E8795m995O7849
17596A21649a35279B34028E198J70226L21881A60273B4939J07939J48442q268
17586B73052G51J28177b58609A3642a08271G5953J82129m6653e6447k26898A61752
$$ plain form
17574 -61621 217928 410129 89741 217405 149647 248450 398313 233405 -97570 -273551
17564 -273551 66719 61868 220673 -30238 386207 272423 23666 221556 155385 -16528 -76481
17553 -76481 -48708 311484 -155249 263089 165183 -8417 576600 -47977 114792 140971 275348
17542 275348 39278 -373408 166345 287964 171764 175752 -33196 270865 192281 383783
17532 383783 5712 263612 162931 238772 378544 -115539 91545 421705 473964 353950
17522 353950 72685 196579 206613 378070 -39255 538560 187718 255244 115102 164369
17512 164369 159096 159669 325289 -26141 174143 273960 501300 147166 288104 270239 577599
17501 577599 294438 189062 432676 206399 364351 411471 180733 -39919 139269 345863
$$ packed form
17574f1621B17928J92201H9741J27664o7758R8803J49863j64908i7570j75981
17564b73551F6719m851J58805c0238C86207j13784B3666J97890o6171a6528n9953
17553g6481K7773C11484a55249B63089r7906h417E76600d7977A14792K6179J34377
17542B75348C9278c73408A66345J21619j16200L988c3196B70865p8584J91502
17532C83783E712K57900j00681P5841J39772a15539I1545L30160N2259j20014
17522C53950G2685J23894J0034J71457c9255E38560A87718O7526A15102M9267
17512A64369n273N73J65620b6141A74143R9817K27340A47166J40938j7865L07360
17501E77599k83161j05376K43614B06399J57952M7120A80733c9919A39269K06594
$$ plain form
17491 345863 176323 227485 756012 89680 77110 329218 39719 322845 253929 -49677 171904
17479 117411 183712 600655 151236 -4226 -154920 172428 220906 72872 499845 392093
17469 392093 440076 515869 288291 -18063 418198 -84558 211763 348819 245448 103754
17458 318772 -48927 249234 412482 392332 159254 264171 116114 264949 408606 101122
17447 436273 402594 346244 607391 294728 682636 307871 483157 138814 39889 -57923
17436 289082 255381 135104 6425 89789 140480 150123 563661 321514 468343 434993 244713
17425 244713 611183 264960 560027 432220 299276 46269 292265 391311 576318 358169
17415 358169 160884 422477 225465 845842 576227 336596 483035 259795 439137 138250
$$ packed form
17491C45863j69540N1162N28527H9680j2570K52108C9719K83126o8916d9677A71904
17479A17411O6301M16943A51236d226j50694A72428M8478G2872M26973j07752
17469C92093M7983P5793k27578a8063D18198h4558B11763J37056j03371A03754
17458C18772d8927B49234J63248k0150A59254J04917A16114J48835J43657A01122
17447D36273l3679n6350K61147B94728L87908C07871J75286A38814C9889e7923
17436B89082l3701j20277F425Q3364N0691R643M13538k42147J46829l3350j90280
17425B44713L66470B64960K95067j27807j32944D6269K45996R9046J85007k18149
17415C58169A60884K61593j97012O20377k69615k39631J46439k23240J79342A38250
$$ plain form
17404 97735 404417 380072 55383 328242 152566 354990 191437 112995 198961 278041 250530
17393 250530 316883 187310 351837 385626 255351 -89624 92280 -147020 -57383 46130 201819
17382 201819 544562 321177 296960 67839 201482 275552 210487 235276 297235 220342 219691
17371 219691 282511 240929 136139 174810 66106 204398 461486 496467 101864 505879
17361 505879 240837 193518 -81577 92386 136010 114102 81642 19088 147355 33779 322912
17350 322912 385196 301362 160394 294479 418184 345917 688744 -146610 485614 323807
17340 323807 119914 234432 107885 152183 308862 160027 373245 234847 70664 204904
17330 204904 29592 343694 277064 210736 -35177 298233 4736 247466 251826 -31176 513944
$$ packed form
17404I7735L06682k4345E5383K72859A52566K02424j63553p8442Q5966P9080k7511
17393B50530O6353j29573J64527L3789j30275h9624I2280a47020e7383D6130J55689
17382B01819L42743k23385k4217F7839J33643P4070o5065K4789O1959p6893o51
17371B19691O2820m1582j04790L8671F6106J38292K57088L4981A01864M04015
17361E05879B40837m7319h1577I2386M3624k1908l2460A9088J28267C3779K89133
17350C22912O2284q3834j40968J34085J23705p2267L42827a46610D85614j61807
17340C23807A19914J14518A07885M4298J56679j48835K13218j38398G0664J34240
17330B04904B9592L14102o6630o6328c5177B98233D736K42730M360c1176E13944
$$ plain form
17318 393694 84338 -52702 -8837 312418 102256 -337744 82594 211947 232172 213715 145192
17307 145192 233290 158580 400691 93360 166319 151557 96678 329837 411981 40480 155162
17296 155162 242263 592619 501296 288585 -27947 255224 37401 294240 123071 62237
17286 62237 123336 179634 337823 510290 156218 79821 -76403 175201 83559 -29762 252371
17274 643663 379314 285506 543617 103303 122961 315025 237522 274230 -235823 462400
17263 270637 379759 210089 376405 243453 220436 334208 120486 443612 217424 296786
17253 296786 94268 163113 70265 98934 43012 194688 229822 473264 113354 201863 136263
17242 136263 521461 -60384 -54086 636981 -15647 105457 330727 414428 198790 135204 414237
$$ packed form
17318C93694H4338e2702h837C12418A02256c37744H2594J29353K0225j8457o8523
17307A45192Q8098p4710K42111I3360P2959j4762n4879K33159Q2144D0480J14682
17296A55162Q7101L50356r1323k12711b7947B55224C7401K56839A23071o0834
17286F2237O1099N6298J58189J72467A56218p6397g6403A75201H3559b9762B52371
17274F43663k64349r3808K58111A03303J9658J92064p7503L6708b35823D62400
17263B70637J09122j69670J66316j32952k3017J13772A20486L23126B17424P9362
17253B96786I4268O8845G0265K8669D3012J51676L5134K43442A13354Q8509o5600
17242A36263L85198f0384O298F36981a5647A05457K25270Q3701A98790o3586K79033
$$ plain form
17231 414237 415370 506435 274423 86146 408498 81406 455299 504818 80810 411953 254437
17220 254437 423737 341366 414616 301262 12838 -43424 420061 -8812 536672 566827 318386
17209 318386 473198 344912 270252 56313 125913 437053 117689 458040 245385 382111
17199 382111 758697 209882 391263 486384 422486 380956 326216 84904 384042 -8549 491699
17187 260668 348646 124468 157908 480543 310716 329710 64490 223169 465270 91551
17176 682804 607434 179690 503728 257304 283558 437979 285887 171090 267449 207281
17166 207281 26224 441470 53311 122123 470920 362128 247454 322050 374592 407165 168879
17154 395709 449342 370833 684888 464692 317544 278221 228470 400378 484647 818893
$$ packed form
17231D14237J133R1065k32012H6146L22352H1406L73893M9519H0810L31143j57516
17220B54437J69300q2371P3250j13354A2838d3424D20061h812E36672L0155k48441
17209C18386J54812j28286p4660E6313O9600L11140A17689L40351k12655J36726
17199C82111L76586B09882J81381R5121o3898m1530n4740H4904K99138h549D91699
17187B60668Q7978A24468L3440L22635j69827J8994F4490J58679K42101I1551
17176F82804p5370A79690L24038k46424K6254J54421j52092j14797R6359o0168
17166B07281B6224M15246E3311O8812L48797j08792j14674P4596N2542L2573A68879
17154C95709N3633p8509L14055k20196j47148l9323m9751J71908Q4269L34246
$$ plain form
17144 818893 616166 219743 671925 437893 29447 380912 308693 788914 758855 775787
17134 775787 272937 558880 223758 400033 141313 389411 361598 580589 412233 68562
17123 620195 440398 112029 810199 370247 783646 556537 194305 705390 487743 722027
17113 722027 253790 492717 634436 621829 541415 573827 567630 549040 406028 634593 612756
17102 612756 526474 726318 231476 327484 425146 528890 375902 401180 298092 155432
17092 155432 393205 225342 400785 679064 635664 418341 765337 351698 372529 514958
17082 514958 534301 899641 725458 750882 748500 876379 926327 406140 586222 736735
17072 736735 922185 543077 957277 407354 454753 443832 768877 505779 714958 785892
$$ packed form
17144H18893k02727B19743M52182k34032B9447L51465p2219M80221l0059J6932
17134G75787B72937K85943B23758J76275A41313K48098k7813K18991j68356F8562
17123F20195j79797A12029O98170C70247M13399k27109A94305N11085k17647K34284
17113G22027B53790K38927J41719j2607q0414L2412o197j8590j43012K28565k1837
17102F12756q6282J99844B31476R6008R7662J03744j52988K5278j03088j42660
17092A55432K37773j67863J75443K78279m3400k17323L46996C51698K0831J42429
17082E14958J9343L65340j74183K5424k382J27879M9948D06140J80082J50513
17072G36735J85450l79108M14200D07354M7399j0921L25045k63098K09179P0934
$$ plain form
17062 785892 700220 345244 730212 678701 763097 718791 651587 761996 730624 467525 986476
17051 986476 742160 786417 985870 743858 708593 583689 687606 631186 814009 692295
17041 692295 803768 957267 420067 573237 834149 562416 970656 511992 837660 654268
17031 654268 763046 767804 675262 913028 894768 604717 902857 667064 788185 453147
17021 453147 798789 774063 1158291 754950 956156 1039854 1095085 866665 947845 769334
17011 769334 936726 839881 1125071 1038174 1000760 740685 954133 895906 1066602 847142
17001 847142 928506 825672 767225 997648 1109192 1043233 919766 979781 984266 1079307 990353
16990 990353 1050149 1094970 973384 1085802 1126667 1307229 1165074 777915 840020 1211264
$$ packed form
17062G85892q5672C45244L84968n1511Q4396m4306o7204J10409l1372k63099N18951
17051I86476k44316M4257J99453k42012l5265j24904J03917n6420J82823j21714
17041F92295J11473J53499D20067J53170K60912k71733M08240m58664L25668j83392
17031F54268J08778M758r2542K37766j8260k90051K98140k35793J21121l35038
17021D53147L45642k4726L84228m03341K01206Q3698N5231k28420Q1180j78511
17011G69334J67392r6845K85190q6897l7414k60075K13448n8227J70696k19460
17001H47142Q1364j02834n8447K30423J11544o5959j23467O0015M485R5041q8954
16990I90353N9796M4821j21586J12418M0865J80562j42155l87159O2105L71244
$$ plain form
16980 1211264 1282074 791160 1259198 1006015 1070852 1135385 1240340 1069735 1288020 1308707
16970 1308707 1161195 1307065 960114 1262654 1401235 1560046 1296164 1238532 1359154 1465878
16960 1465878 1306495 1397141 1252941 1212175 1597499 1183988 1614057 1302785 1455021 1417583
16950 1417583 1185633 1456345 1549490 1693709 1323552 1229469 1512041 1583269 1746052 1468229
16940 1468229 1653010 1921473 1963977 1617952 1457350 1614551 1624545 1540019 1724742 2006267
16930 2006267 1485690 1811075 1715118 1694020 1701731 1874839 1672947 1647335 1696924 1931773
16920 1931773 1945912 2128870 1988303 1867582 1918263 2187615 2003763 1757797 1669069 2167704
16910 2167704 2377580 2292236 2415417 2479562 2208775 2509946 2056023 2256492 2068287 2414381
$$ packed form
16980A211264P0810m90914M68038k53183O4837O4533J04955j70605K18285K0687
16970A308707j47512J45870l46951L02540J38581J58811k63882n7632J20622J06724
16960A465878j59383R0646j44200m0766L85324m13511M30069l11272J52236l7438
16950A417583k31950K70712R3145J44219l70157r4083K82572P1228J62783k77823
16940A468229J84781K68463M2504l46025j60602J57201R994q4526J84723K81525
16930B006267n20577L25385r5957k1098P711J73108k01892k5612M9589K34849
16920A931773J4139J82958j40567j20721N0681K69352j83852k45966q8728M98635
16910B167704K09876q5344J23181O4145k70787L01171m53923K00469j88205L46094
$$ plain form
16900 2414381 2286345 2326799 2356269 2721794 2273465 2583390 2435086 2919290 2487616 2602529
16890 2602529 2621502 2546980 2455097 2904385 3001628 2839755 2851178 2829645 2854267 2929212 2829841
16879 2829841 2901484 2982593 2977681 2690997 2982007 3036209 3165938 2941161 3190537 3431706
16869 3431706 3510314 3508920 3760604 3679796 3632769 3597564 3593976 3809073 3655431 4004967 3813155
16858 3813155 3773913 4282590 4481084 4294135 4247543 4441532 4349020 4408209 4333958 4809911
16848 4809911 4967741 4689029 4824849 4660375 4647281 4743561 4804282 5066279 5561642 5218053
16838 5218053 5359193 5395858 5563477 5452917 5312194 6265947 6161294 5572332 5945261 6046200
16828 6046200 6283968 6473901 6370968 6786363 7085779 7215352 7009982 7185540 7357300
$$ packed form
16900B414381j28036M0454K9470L65525m48329L09925j48304M84204m31674J14913
16890B602529J8973p4522r1883M49288R7243j61873J1423k1533K4622P4945r9371
16879B829841P1643Q1109m912k86684K91010N4202J29729k24777K49376K41169
16869C431706P8608j394K51684q0808m7027l5205l588K15097j53642L49536j91812
16858C813155l9242N08677J98494j86949m6592J93989r2512N9189p4251M75953
16848D809911J57830k78712J35820j64474j3094R6280O0721K61997M95363l43589
16838E218053J41140L6665J67619j10560j40723R53753j04653n88962L72929J00939
16828F046200K37768J89933j02933M15395K99416J29573k05370J75558J71760
$$ plain form
16819 7357300 7602805 7413700 7850789 7764033 8190946 8082761 8312821 8306672 8692076 8861820
16809 8861820 9136029 9330728 9365740 9107921 10340465 9873600 10046761 10767222 10873534
16800 10873534 10913233 11678398 11470012 11751474 11990794 12259228 12749590 13061757 13352473
16791 13352473 13519187 13965174 14397911 14857864 15299018 15690276 16090577 16105087 16807352
16782 16807352 17321071 17693220 18158760 18714837 19281825 19969374 20731707 21302090 21737467
16773 21737467 22742414 23159225 23901004 24741491 25220838 26322326 27028722 27946582 29159433
16764 29159433 30120306 31175671 32414822 33593150 34539895 35968063 37178958 38372096
16756 38372096 39797718 42003996 43373693 45254499 46730154 49000421 50611753 52959429
$$ packed form
16819G357300K45505j89105M37089q6756M26913j08185K30060o149L85404J69744
16809H861820K74209J94699L5012k57819J232544m66865J73161P20461J06312
16800A0873534L9699P65165k08386K81462K39320K68434M90362L12167K90716
16791A3352473J66714M45987M32737M59953M41154L91258M00301J4510P02265
16782A6807352N13719L72149M65540N56077N66988O87549P62333N70383M35377
16773B1737467J004947M16811P41779Q40487M79347J101488P06396R17860J212851
16764B9159433R60873J055365J239151J178328R46745J428168J210895J193138
16756C8372096J425622K206278J369697J880806J475655K270267J611332K347676
$$ plain form
16748 52959429 55179644 57425553 59837524 62412485 65456479 68113605 70565325 74171659
16740 74171659 77504583 80804086 84303020 88119295 91633323 95673652 99780122 103491522
16732 103491522 107633436 111802520 115880729 119749047 123722332 127413717 131342573 134306396
16724 134306396 137184857 139454227 141977042 143765308 144882038 145681008 145520771 145246741
16716 145246741 144499555 142874526 140714321 138430133 135625173 132671421 129053222 125272133
16708 125272133 121567360 117898398 113687418 109605982 105450736 101181862 97324933 93360711
16700 93360711 89553111 85550695 82119773 78653451 75421082 72181544 68936040 66242572
16692 66242572 63046500 59941747 57875695 55365144 53115890 51025518 48857293 46672288
$$ packed form
16748E2959429K220215K245909K411971K574961L043994K657126K451720L606334
16740G4171659L332924L299503L498934L816275L514028M040329M106470L711400
16732A03491522M141914M169084M078209L868318L973285L691385L928856K963823
16724A34306396K878461K269370K522815J788266J116730P98970j60237k74030
16716A45246741p47186j625029k160205k284188k804960k953752l618199l781089
16708A25272133l704773l668962m210980m081436m155246m268874l856929l964222
16700I3360711l807600m002416l430922l466322l232369l239538l245504k693468
16692F6242572l196072l104753k066052k510551k249254k090372k168225k185005
$$ plain form
16684 46672288 44883740 43008263 41250783 39505881 38230535 36764347 35402326 34217124
16676 34217124 32532731 31618918 30225517 29465786 27968749 27421935 26352591 25276419
16668 25276419 23968013 23507104 23157315 22258582 21532857 20741619 20379087 19641233 19238741
16659 19238741 18394852 17990335 17483158 17164201 16400445 15857710 15762363 15187279 14646484
16650 14646484 13892043 14356044 13421855 13190740 13074355 12415284 12266675 12217412 11864492
16641 11864492 11333950 11542804 10618415 10276650 10380209 9903568 10147288 9750629 9030888
16632 9030888 9204981 9137719 8720571 8490421 8739377 8237304 7932052 7993946 7989890 7433608
16622 7433608 7373731 7486205 7124864 6856591 6861579 6975143 7104152 6579739 6512900 6128428
$$ packed form
16684D6672288j788548j875477j757480j744902j275346j466188j362021j185202
16676C4217124j684393r13813j393401p59731j497037n46814j069344j076172
16668B5276419j308406m60909l49789q98733p25725p91238l62532p37854m02492
16659A9238741q43889m04517n07177l18957p63756n42735r5347n75084n40795
16650A4646484p54441M64001r34189k31115j16385o59071j48609m9263l52920
16641A1864492n30542K08854r24389l41765J03559m76641K43720l96659p19741
16632I030888J74093o7262m17148k30150K48956n02073l05252O1894m056n56282
16622G433608n9877J12474l61341k68273M988J13564J29009n24413o6839l84472
$$ plain form
16612 6128428 6023450 5724494 6081160 6000828 5591840 5506305 5083734 5223556 5668938 5219240
16602 5219240 4936576 5064684 4968357 4726138 4966180 4743375 4746926 4491983 4137706 4547724
16592 4547724 4120760 4464615 4458701 3963720 3923192 4113273 4139284 4025461 4014258 3870382
16582 3870382 4017781 3703550 3497329 3734640 3585192 3225222 3582209 3455577 3393173 3491985
16572 3491985 3351688 3060558 3204494 3145838 3112739 2867834 3001599 3008735 2947510 2925740
16562 2925740 2975410 2579902 2813518 2576543 2823547 2791998 2469807 2655834 2620636 2637235
16552 2637235 2394723 2588343 2439205 2389475 2596444 2360875 2314231 2116497 2245734 2275412
16542 2275412 2359918 2413155 2376248 2280609 2144161 1767080 1749919 1842218 1809917 1878941 2070278
$$ packed form
16612F128428j04978k98956L56666q0332m08988q5535m22571J39822M45382m49698
16602E219240k82664J28108r6327k42219K40042k22805L551k54943l54277M10018
16592D547724m26964L43855n914m94981m0528J90081K6011j13823j1203j43876
16582C870382J47399l14231k06221K37311j49448l59970L56987j26632o2404R8812
16572C491985j40297k91130J43936n8656l3099k44905J33765P136o1225k1770
16562B925740M9670l95508K33616k36975K47004l1549l22191J86027l5198J6599
16552B637235k42512J93620j49138m9730K06969k35569m6644j97734J29237K9678
16542B275412Q4506N3237l6907r5639j36448l77081j7161R2299l2301O9024J91337
$$ plain form
16531 2070278 2066078 2050930 1744705 1746264 1999972 2035036 1734495 1732093 1594794 1482596 1484423
16520 1484423 1700852 1650613 1671611 1770872 1739140 1668086 1647143 1665973 1835335 1811224 1567560
16509 1567560 1474072 1780025 1382704 1467251 1712195 1648597 1525107 1469530 1622106 1473566
16499 1473566 1338276 1581373 1399512 1407416 1331256 1278870 1261865 1499720 1550006 1400551
16489 1400551 1065429 973070 1223494 1509232 992988 1619389 1252608 1437955 1352733 1510383
16479 1510383 1062542 1150492 1151856 929333 1189995 1307758 1304126 1121883 1084460 960070
16469 960070 1200605 963974 1070132 1052402 716422 1106848 829850 1174320 936429 1172472
16459 1172472 765192 1299876 1259295 938244 833004 928631 1107810 1011356 822259 1108459
$$ packed form
16531B070278m200j5148l06225J559K53708L5064l00541k402j37299j12198J827
16520A484423K16429n0239K0998R9261l1732p1054k0943J8830J69362k4111k43664
16509A567560r3488L05953l97321Q4547K44944o3598j23490n5577J52576j48540
16499A473566j35290K43097j81861P904p6160n2386j7005K37855N0286j49455
16489A400551l35122r2359K50424K85738n16244O26401l66781J85347q5222J57650
16479A510383m47841Q7950J364k22523K60662J17763l632j82243l7423j24390
16469I60070K40535k36631J06158j7730l35980L90426k76998L44470k37891K36043
16459A172472m07280N34684m0581l21051j05240R5627J79179r6454j89097K86200
$$ plain form
16449 1108459 980154 1309437 734990 812593 960281 1054022 659212 1244748 1122873 632951
16439 632951 813660 866794 1011863 630626 735700 463357 1143957 816177 449387 623248
16429 623248 1151643 948443 885307 485703 872385 1011250 585017 576432 836196 802964
16419 802964 880078 945521 635530 890794 545432 589323 881657 777406 711204 879350
16409 879350 522690 638643 716375 782457 641618 578963 764778 558079 657423 963916
16399 963916 729430 656393 242431 685494 266682 312383 726147 563155 711400 728644
16389 728644 515451 354183 680546 549486 626247 731199 765567 567908 513278 769675
16379 769675 830706 592534 484971 384118 329215 558023 535620 556610 634723 445886
$$ packed form
16449A108459j28305L29283n74447P7603J47688R3741l94810N85536j21875m89922
16439F32951J80709N3134J45069l81237J05074k72343O80600l27780l66790J73861
16429F23248N28395k03200o3136l99604L86682J38865m26233q585K59764l3232
16419H02964P7114O5443l09991K55264l45362M3891K92334j04251o6202J68146
16409H79350l56660J15953P7732O6082j40839o2655J85815k06699R9344L06493
16399I63916k34486p3037B42431M43063B66682M5701M13764j62992J48245J7244
16389G28644k13193j61268L26363j31060P6761J04952L4368j97659n4630K56397
16379G69675O1031k38172j07563j00853n4903K28808k2403K0990P8113j88837
$$ plain form
16369 445886 773956 278634 233589 549912 850494 717802 137551 613283 596487 547106
16359 547106 133647 755689 643950 516798 535836 416598 514514 742508 285760 625203
16349 625203 640082 891291 610434 382105 406677 568652 389493 449049 439783 493853 385272
16338 385272 658612 235062 493753 542914 625307 452370 205367 359764 315734 309930
16328 309930 576724 503841 -5300 588509 367007 317391 808881 877850 195988 519305
16318 519305 168900 544116 619138 426266 720253 360886 335133 343384 315271 589984
16308 589984 476594 288431 207667 286954 357267 544709 619249 154999 593746 361484
16298 361484 709415 297582 667348 237722 692355 -67145 33776 192448 549384 352571
$$ packed form
16369D45886L28070B78634m5045L16323L00582j32692A37551M75732j6796m9381
16359E47106A33647O22042j11739j27152J9038j19238R7916K27994B85760L39443
16349F25203J4879K51209k80857k28329K4572J61975j79159N9556r266N4070j08581
16338C85272K73340B35062K58691M9161Q2393j72937B05367J54397m4030n804
16328C09930K66794p2883e300E88509k21502m9616M91490O8969A95988L23317
16318E19305A68900L75216P5022j92872K93987l59367k5753Q251k8113K74713
16308E89984j13390j88163q0764P9287P0313J87442P4540A54999M38747k32262
16298C61484L47931B97582L69766B37722M54633f7145C3776J58672L56936j96813
$$ plain form
16288 352571 235422 192025 -88278 526357 49080 201344 353762 349419 609386 208924
16277 264798 352732 375527 290536 203559 508909 635652 557660 375092 300771 470880 638813
16266 638813 418533 338823 -60091 208166 -36248 774476 321141 77787 104578 482251
16256 482251 123799 143210 158654 86715 157541 158534 555362 289428 111446 184136 707160
16245 707160 -133223 297831 246539 318078 67298 267114 65792 306795 -9075 185155 214228
16234 214228 242534 28684 43524 212774 204505 60949 297869 108900 156513 136076 316661
16223 316661 425453 -42084 207425 118046 -47774 151559 103744 452976 202309 220452
16213 220452 52978 80306 358459 176431 107030 94943 168897 156075 174821 99825 227514
$$ packed form
16288C52571j17149m3397h8278E26357D9080J52264J52418m343K59967B08924
16277B64798Q7934K2795q4991q6977L05350J26743p7992j82568p4321J70109J67933
16266F38813k20280p9710f0091B08166c6248G74476C21141G7787K6791L77673
16256D82251A23799J9411J5444p1939P0826R93L96828k65934A11446P2690N23024
16245G07160a33223B97831n1292P1539F7298J99816F5792K41003i075A85155K9073
16234B14228K8306B8684J4840J69250q269F0949K36920A08900M7613k0437J80585
16223C16661J08792d2084B07425q9379d7774A51559m7815L49232B02309J8143
16213B20452E2978K7328K78153A76431o9401j2087P3954j2822J8746p4996J27689
$$ plain form
16202 227514 123878 244534 77475 211944 323835 239613 311321 -122082 117276 57728
16191 278490 456668 91797 261710 317783 268144 -252189 -25687 397869 199143 -25452
16180 174344 4110 194221 -116514 144632 327746 542652 -34848 325908 239817 147143
16170 147143 565183 -86369 -369797 155585 -51112 95310 270654 361604 141292 280486
16160 280486 41494 61094 -314055 368072 69000 -14894 -17737 133031 -102123 120637 -3027
16148 123413 102511 269535 32883 61754 531485 175131 109484 203951 105066 159494 207909
16137 207909 284875 92701 76459 54377 261029 -53757 -55718 -162643 -51422 240753 26984
16125 -23595 3553 298271 -146351 8075 95445 103769 89238 185521 -195275 -143346 315707
$$ packed form
16202B27514j03636J20656G7475J34469J11891q4222P1708a22082A17276E7728
16191B78490J78178I1797J69913N6073m9639b52189b5687C97869j98726b5452
16180A74344D110J90111a16514A44632J83114K14906c4848C25908q6091r2674
16170A47143M18040h6369k83428A55585e1112I5310J75344R0950A41292J39194
16160B80486D1494J9600c14055C68072F9000a4894k843A33031a02123A20637c027
16148A23413k0902J67024C2883K8871M69731A75131o5647R4467r8885N4428M8415
16137B07909P6966I2701j6242k2082K06652e3757j961j06925e1422B40753B6984
16125b3595C553K94718a46351H075Q7370Q324j4531R6283a95275N1929C15707
$$ plain form
16113 283171 23654 89573 258184 -95972 143534 174773 -106575 24227 357023 70856 17815
16101 159653 38314 124013 192485 142913 77847 19715 -95638 495043 -186403 -58007 -201279
16090 -201279 -157960 342129 72553 22041 -101318 373239 92196 -343225 198491 55336
16079 154151 126376 159780 -86688 40048 -72905 -319723 -11487 -179985 -68705 -50428 -2943
16067 -184166 156130 248909 88586 -166816 -121854 -298332 -58351 80762 -48764 145179 82924
16056 82924 3309 20977 60511 -68617 269892 361245 -52371 -28751 -258509 180716 -50447
16044 333651 -63348 -31627 26922 192803 71923 50871 -155376 -68275 -414992 -112330 -135645
16033 -135645 163290 15053 -87462 248287 293466 -36744 344207 408112 -194573 52997 -78344
$$ packed form
16113B83171B3654O5919J68611i5972A43534L1239a06575B4227L32796G0856A7815
16101A59653C8314Q5699O8472m9572o5066A9715i5638D95043a86403e8007j43272
16090b01279M3319C42129G2553B2041a01318C73239I2196c43225A98491E5336
16079A54151k7775L3404h6688D0048g2905k46818a1487j68498f8705J8277b943
16067a84166A56130R2779H8586a66816M4962j76478e8351H0762d8764A45179o2255
16056H2924C309J7668L9534f8617B69892R1353e2371K3620k29758A80716e0447
16044C33651f3348c1627B6922J65881G1923k1052a55376f8275l46717a12330k3315
16033a35645A63290A5053h7462B48287M5179c6744C44207O3905a94573E2997g8344
$$ plain form
16021 49630 -126141 317629 -126315 -45800 108663 196958 82452 -149076 163604 101158
16011 101158 26358 -139949 82488 -37891 62812 -42155 -66195 -215914 88141 -276369 -150479
16000 -150479 -333384 -49854 -142017 81728 -59875 129746 300312 -113297 114057 -14280
15989 -166366 -110529 124627 -270485 58827 92043 -140741 295456 180329 361798 324630
15979 324630 551837 573685 744236 590879 41094 -54300 -11921 104151 462011 -16119
15968 -82642 232563 -258575 -26046 60350 87078 -141291 135533 -304697 -148605 124780
15957 -147014 -88681 -14014 -407339 144454 -91179 -93246 -101951 207755 212372 -151389 75346
15945 -55551 -102212 143065 43513 -249819 105853 -245247 -292269 86011 -77706 321790 -1125
$$ packed form
16021D9630a26141C17629a26315d5800A08663Q8295H2452a49076A63604o2446
16011A01158B6358a39949H2488c7891F2812d2155k4040j49719H8141b76369J25890
16000a50479j82905d9854r2163H1728e9875A29746J70566a13297A14057a4280
15989a66366N5837A24627b70485E8827L3216a40741B95456j15127J81469l7168
15979C24630K27207K1848J70551j53357D1094e4300a1921A04151L57860a6119
15968h2642B32563b58575b6046F0350K6728a41291A35533c04697a48605A24780
15957a47014N8333a4014l93325A44454i1179k067q705B07755M617a51389G5346
15945e5551m6661A43065D3513b49819A05853b45247m7022H6011g7706C21790a125
$$ plain form
15933 -43921 67874 162526 96409 -286487 94124 50329 193734 172525 -32645 -329115 5648
15921 -96490 -57736 -31859 6802 212748 274143 108559 -134567 -37219 136788 -170379 -377015
15910 -377015 -84185 -30486 -289849 70462 -61263 -198277 -345207 232789 55691 30697 -160345
15898 -197262 40650 -90831 -373784 280772 -59702 -3922 -84732 276444 83502 -73710 -29708
15886 -367157 69884 -25269 34942 76157 -56901 -169203 278102 -1908 -13534 -93155 -378598
15875 -378598 -320173 395817 -215628 -77075 157991 64717 -193954 -179183 -284659 167838
15864 58713 -211279 2424 -57553 76025 276354 149741 -282245 323162 216682 -47025 179129
15852 -89905 123255 -42062 169397 20548 -267552 -184213 -16148 11384 -188077 -90375 131399
$$ packed form
15933d3921F7874R4652o6117b86487I4124m3795J43405k1209c2645k96470E648
15921i6490L8754K5877F802K05946O1395A08559a34567c7219A36788a70379k06636
15910c77015h4185c0486k59363G0462f1263j37014j46930B32789E5691k4994a60345
15898a97262D0650i0831k82953B80772e9702c922q0810B76444H3502g3710b9708
15886c67157F9884b5269C4942M1215e6901j12302B78102a908j1626p9621k85443
15875c78598N8425C95817b15628g7075A57991F4717a93954J4771j05476A67838
15864E8713b11279B424e7553G6025K00329j26613b82245C23162j06480d7025A79129
15852h9905A23255d2062A69397B0548b67552Q3339a6148A1384a88077i0375A31399
$$ plain form
15840 124563 308287 79428 -177424 -84986 -21010 -82581 122116 107782 145575 -33586 137823
15828 -205184 -117140 -216715 473965 -317648 41963 193125 -193862 179431 -272451 -243231
15818 -243231 -316326 -85461 154236 200122 -70813 -81611 -55603 -342538 -88239 3252 23205
15807 23205 -146888 4213 -103533 131686 51903 163066 156325 70289 183684 -91917 -154518
15796 -154518 80030 98257 157786 -11491 251646 -43335 -55832 27971 -107019 95943 -133142
15784 180111 37970 299597 154532 -49649 -101168 94645 250308 155777 280938 63768 272437
15773 272437 134845 -148186 88208 -139946 209519 -361477 473965 -239963 -114984 159317
15762 -63579 -243642 87799 -231179 -245024 -402264 702 -308359 86183 -70272 -233358 -123121
$$ packed form
15840A24563J83724G9428a77424h4986b1010o1571A22116j4334L7793c3586A37823
15828b05184Q8044r9575D73965c17648D1963J51162a93862A79431b72451K9220
15818b43231p3095h5461A54236M5886g0813j0798K6008k86935h8239C252J9953
15807B3205a46888D213a03533A31686E1903J11163o741G0289J13395i1917o2601
15796a54518H0030J8227N9529a1491B51646d3335j2497B7971a07019I5943a33142
15784A80111C7970K61627j45065d9649n1519I4645J55663r4531J25161F3768K08669
15773B72437A34845a48186H8208a39946B09519c61477D73965b39963a14984A59317
15762f3579j80063H7799b31179j3845j57240G02c08359H6183g0272j63086J10237
$$ plain form
15751 -123121 26691 -24709 22081 -281161 -169293 -5152 214531 -170387 136997 -34885 58846
15739 -257539 -13958 -14346 84830 105324 91737 169546 78281 -317475 -20691 64276 -13467 -228697
15727 -228697 28026 -168238 55422 -66867 78261 -9962 38282 -177533 -348416 -223498 8865
15715 339964 -120784 156140 273919 53973 -46811 -350481 77560 -254519 -231897 -303992
15705 -303992 -57733 98502 -156116 -55705 79723 -25150 -160856 -67281 -514650 -259566 126
15693 -305272 -71443 58938 -114353 5644 -97547 149610 57230 20953 161057 -474465 -157851
15681 -135593 -18964 -11266 50709 -173395 -26631 221271 59634 -198760 -128884 -201830 -42936
15669 -7941 -400781 -114806 25289 -147395 -19843 -5605 12503 -20955 -116912 -35461 -1463 -349157
$$ packed form
15751a23121B6691b4709B2081b81161J11868e152B14531a70387A36997c4885E8846
15739b57539a3958l88H4830K0494j3587P7809G8281c17475b0691F4276a3467k15230
15727b28697B8026a68238E5422f6867G8261i962C8282a77533j70883J24918H865
15715C39964a20784A56140J17779E3973d6811l03670G7560b54519K2622p2095
15705c03992e7733I8502a56116e5705G9723b5150j35706f7281m47369K55084A26
15693c05272g1443E8938a14353E644i7547A49610E7230B0953J40104d74465a57851
15681a35593a8964P698E0709a73395b6631B21271E9634a98760O9876p2946d2936
15669g941l92840a14806B5289a47395a9843e605A2503b0955r5957c5461a463l47694
$$ plain form
15657 -349157 304517 -90042 203624 118656 -217402 -43084 -278429 -421496 -123585 -16107
15646 20745 79716 -109554 -233818 137451 -103545 -93958 247113 182997 25298 -167586 110100
15634 -276412 -201973 -60411 -341354 65637 420499 -76276 -1446 204737 11772 -85709 80079
15622 332000 -317090 -290964 251072 258761 137344 75640 6370 -77391 247353 405069 -222170
15610 13657 -90281 55999 -204091 -182266 -61970 91222 -237959 -364343 -101570 176143 -139023
15598 -39001 -85639 -33486 75517 14018 -144010 -260990 3804 -111826 -283764 -160302 84624
15586 227443 144394 -174118 244824 -92643 104421 -103663 -152742 30561 -221656 64111
15575 -90814 119265 -18089 -55407 -158700 81897 -51650 -172950 -210149 -138802 -129545 117625
$$ packed form
15657c49157C04517i0042B03624q4968b17402d3084k35345j43067a23585a6107
15646B0745N8971a09554j24264A37451a03545R587B47113o4116B5298a67586A10100
15634b76412P4439f0411k80943F5637L54862g6276a446B04737A1772h5709H0079
15622C32000c17090K6126B51072P689j21417o1704F370g7391B47353J57716b22170
15610A3657i0281E5999b04091K1825f1970I1222b37959j26384a01570A76143a39023
15598c9001m6638c3486G5517A4018a44010j16980C804a11826j71938J23462H4624
15586B27443q3049a74118B44824i2643A04421a03663m9079C0561b21656F4111
15575i0814A19265a8089l7318j03293H1897e1650j21300l7199P1347R257A17625
$$ plain form
15563 48996 -27123 96086 131497 476058 -3918 874 116042 348882 368765 -286908 258158
15551 275410 144240 58519 282031 134265 452270 80986 147564 32710 272529 381153
15541 381153 -228206 260820 242764 41579 174872 150059 50210 -191094 384518 38456
15530 364240 463352 -89236 33341 -40292 18679 144772 438911 -49043 -262239 -272199 8443
15518 196417 -319108 -166616 205784 365872 -124440 140455 -22650 42897 8958 -14084
15507 32301 57294 109884 210776 207249 -165504 286200 879 205452 15282 13158 39404 142068
15495 142068 -86504 19910 -184644 -224881 -12809 286100 25124 30393 34000 408207 -241910
15483 228692 -175690 -267978 -78740 270210 129607 52141 217027 -196757 37286 -97005
$$ packed form
15563D8996b7123I6086L5411L44561c918H74J15168K32840J9883b86908B58158
15551B75410j31170E8519K23512A34265L18005H0986O6578C2710K39819J08624
15541C81153b28206B60820j8056D1579J33293k4813E0210a91094C84518C8456
15530C64240R9112h9236C3341d0292A8679J26093K94139d9043k13196r960H443
15518A96417c19108J52492B05784J60088a24440A40455b2650D2897H958a4084
15507C2301K4993N2590J00892l527a65504B86200H79K04573A5282k124K6246J02664
15495A42068h6504A9910a84644m0237a2809B86100B5124N269L607L74207b41910
15483B28692a75690r2288g8740B70210A29607E2141J64886a96757C7286i7005
$$ plain form
15472 97692 14146 210942 -325483 66665 8824 -137680 -15387 82932 -277869 241496 -4884
15460 232041 309708 144007 -367458 74276 -102758 157985 284245 209215 133855 389820
15450 389820 -117533 280442 91041 -103586 -367357 48682 213078 -130297 -177354 135260
15439 245201 29581 342228 -90647 241210 207963 -141001 -44918 85263 79162 -461474 -11712
15427 -54035 99545 -249382 -232218 -6104 -227373 21686 -307779 139706 -200130 21406 -160443
15415 -1129 154296 -61280 57626 -206167 214089 44043 -170038 112846 -156173 120111
15404 -140485 68395 17963 -305457 -92400 -30112 331191 228640 131411 -355585 -315547 -316488
15393 -316488 -6494 -151285 -179528 -125766 -101832 348258 357494 48139 125265 -45184 -47310 49385
$$ packed form
15472I7692A4146J96796c25483F6665H824a37680a5387H2932b77869B41496d884
15460B32041P7667A44007c67458G4276a02758A57985J26260p5030p5360K55965
15450C89820a17533B80442I1041a03586k63771D8682J64396a30297m7057A35260
15439B45201B9581L12647i0647B41210l3247a41001d4918H5263o101d61474a1712
15427e4035I9545b49382J7164f104k21269B1686c07779A39706b00130B1406a60443
15415a129A54296f1280E7626b06167B14089D4043a70038A12846a56173A20111
15404a40485F8395A7963c05457i2400c0112C31191j02551r7229c55585M0038r41
15393c16488f494j44791k8243N3762K3934C48258R236D8139P7126d5184k126D9385
$$ plain form
15380 -292051 -43473 -174290 -36980 337526 120078 -305930 224370 -32202 402948 37236
15369 277325 17649 81397 76523 78321 -97417 153788 104889 -224484 44561 -26405 -64433
15358 -64433 -56843 280856 134519 139660 534284 279662 430940 200151 -59513 89521 23802
15346 293579 -99815 213181 194854 99527 -213081 135663 33297 219993 176023 81977 -125813
15334 13879 -119542 -141073 133668 -155045 30748 -1255 692872 57615 -16618 87684 -117715
15322 118112 168903 68394 94729 153458 -124146 -167553 -41533 -27173 203296 -173285 -184457
15311 -184457 176018 -11395 226942 92934 229861 -166427 167192 -113005 170843 333308
15301 333308 -267272 86465 48663 85760 63229 -6298 194564 -85703 39934 -39200 63306
$$ packed form
15380b92051d3473j30817c6980C37526A20078c05930B24370c2202D02948C7236
15369B77325A7649O3748m874J798i7417A53788m8899b24484D4561b6405l8028
15358f4433P590B80856A34519N141L94624k54622J51278B00151e9513H9521B3802
15346B93579i9815B13181j8327r5327b13081A35663C3297J86696m3970H1977a25813
15334A3879a19542k1531A33668a55045C0748a255F92872E7615a6618H7684a17715
15322A18112N0791F8394K6335N8729a24146m3407d1533J4360B03296a73285j1172
15311a84457A76018a1395B26942I2934J36927a66427A67192a13005A70843J62465
15301C33308b67272H6465l7802L7097k2531f298A94564h5703C9934c9200F3306
$$ plain form
15289 28565 137284 98435 356334 118846 -21357 -101886 101453 -112148 21577 -275264
15278 -202860 89619 200897 -115684 45110 208674 -145848 -28113 30621 -141052 179052
15267 113412 -2961 192113 -51776 3218 303636 97475 61528 -93848 49174 80167 -66999
15255 113721 70054 107296 -244791 79222 66227 284684 -198794 -86844 123767 111994 193543
15244 193543 130431 517630 312230 339669 217668 492930 765859 1320839 3287627 2720059
15234 2720059 2123407 3305890 1553993 364349 -124969 150098 -11352 9634 209639 175669
15224 175669 407049 79447 199478 -162762 143227 555153 270928 80371 -12153 89508
15213 48912 194445 62690 124475 -108800 99983 222442 -49749 -146980 -268261 149545 376348
$$ packed form
15289B8565J08719l8849K57899A18846b1357q0529A01453a12148B1577b75264
15278b02860H9619J11278a15684D5110J63564a45848b8113C0621a41052A79052
15267A13412b961A92113e1776C218L00418I7475l5947i3848D9174L0993f6999
15255A13721m3667L7242b44791G9222j2995K18457a98794h6844A23767j1773Q1549
15244A93543o3112L87199k05400K7439j22001K75262K72929N54980J966788n67568
15234B720059n96652J182483A553993C64349a24969A50098a1352I634K00005l3970
15224A75669K31380G9447J20031a62762A43227M11926B70928H0371a2153H9508
15213D8912J45533F2690O1785a08800I9983J22459d9749r7231j21281A49545K26803
$$ plain form
15202 376348 -82391 -157617 80377 -165348 396359 199411 147645 315639 -62988 130006
15191 69562 211900 237523 103890 150012 219883 -120362 32961 -609 161364 137999 -8308
15179 -170464 164343 126661 186869 -73877 179827 -51759 -13093 171318 -5887 37641 26063
15168 26063 186383 -157356 -207642 -24404 83487 178559 57057 219520 -23208 269378 -87075
15156 92736 110457 284204 17144 83357 -195156 -75992 265361 584180 204438 -194833
15145 270913 137899 224773 148889 249357 420337 167454 -386521 86773 154751 -135108
15134 -96929 -32673 -95665 -206726 239808 283931 43575 177904 77219 -207357 32219 529403
15123 529403 162962 222971 12153 107220 151659 158253 406834 334595 115479 -292939 286679
$$ packed form
15202C76348h2391p5226H0377a65348C96359j96948n1766J67994f2988A30006
15191F9562J42338K5623A03890M6122O9871a20362C2961f09A61364k3365h308
15179a70464A64343l7682O0208g3877A79827e1759a3093A71318e887C7641j1578
15168B6063J60320a57356n0286b4404H3487R5072E7057J62463b3208B69378h7075
15156I2736J7721J73747A7144O6213a95156g5992B65361L18819B04438a94833
15145B70913j33014Q6874p5884J00468J70980A67454c86521H6773O7978a35108
15134i6929c2673o2992j11061B39808M4123D3575J34329G7219b07357C2219M97184
15123E29403A62962O0009A2153R5067M4439O594K48581p2239A15479b92939B86679
$$ plain form
15111 51370 83276 121472 320077 298315 372292 124479 387653 477290 496637 805273 288528
15099 119472 391633 421447 176715 334461 468962 -102623 -59982 158214 30873 321357
15089 321357 296567 206279 88292 -257831 153851 303870 -4027 62077 207593 191255 241082
15078 241082 148196 -35389 -10052 -27890 531652 158733 204438 356043 302432 9805 382404
15067 382404 1613 107655 6869 169426 34280 6520 237748 233106 413922 292402 309862
15056 309862 255650 542374 442347 123683 189187 184134 26277 370527 28844 211442 212106
15045 212106 97486 33810 235203 293288 -45912 176257 112106 191041 -54045 338779 208484
15034 208484 206517 47882 274241 457640 149010 394824 422340 489227 -110267 313383
$$ packed form
15111E1370L1906L8196J98605k1762P3977A24479K63174Q9637J9347L08636B88528
15099A19472K72161K9814A76715J57746J34501a02623M2641A58214C0873K90484
15089C21357k4790r0288H8292b57831A53851J50019d027F2077J45516j6338M9827
15078B41082r2886c5389a0052j7838E31652A58733M5705J51605n3611I805L72599
15067C82404A613J06042F869J62557C4280F520K31228m642J80816j21520J7460
15056C09862n4212K86724j00027A23683O5504n053B6277L44250B8844J82598O64
15045B12106I7486C3810K01393N8085d5912A76257o4151P8935e4045C38779j30295
15034B08484j967D7882K26359J83399A49010K45814K7516O6887a10267C13383
$$ plain form
15023 390751 558564 322343 432029 282011 494387 714702 207263 109757 -109081 36415
15012 344437 74544 -131526 370751 109213 442944 517356 490804 243899 165297 285639
15002 285639 83650 25654 318095 391654 206998 249854 565019 287153 162987 230214
14992 230214 352880 385005 126838 277973 664059 499673 115816 623713 436358 283110
14982 283110 452504 444248 119733 585797 521183 434896 10185 360217 475913 452426 614429
14971 614429 431198 288679 202304 146065 255042 330952 329133 646493 254342 319096 93507
14959 394449 252787 190834 226400 373174 76433 612340 366040 -74501 549386 286107
14949 286107 212004 287822 572316 165542 204769 359942 306636 185815 462943 27695
$$ packed form
15023C90751J67813k36221J09686j50018K12376K20315B07263r7506a09081C6415
15012C44437G4544a31526C70751A09213L33731P4412k6552B43899p8602J20342
15002B85639H3650B5654K92441P3559j84656M2856L15165k77866j24166O7227
14992B30214J22666L2125A26838J51135L86086j64386A15816N07897j87355j53248
14982B83110J69394q256A19733M66064o4614q6287A0185L50032J15696k3487J62003
14971F14429j83231j42519q6375n6239J08977P5910j819L17360B54342O4754I3507
14959C94449j41662o1953L5566J46774G6433N35907k46300g4501E49386k63279
14949B86107p4103P5818K84494A65542L9227J55173n3306j20821K77128B7695
$$ plain form
14938 423881 192178 159410 322335 268793 520307 217078 240531 336761 430710 154831
14927 652539 695268 476888 463228 716592 628550 225463 570256 589283 880695 470409
14917 470409 692994 324987 593149 490262 504372 1051992 823147 818809 223054 521339
14907 521339 217999 120515 375367 770022 -126852 398972 602020 298569 82520 264567
14897 264567 389553 318836 460592 319789 137487 566442 186353 142803 434463 367215
14887 367215 105080 199659 162114 409581 590002 536060 593440 -65236 572206 92892 214792
14876 214792 406997 816195 623198 573364 360585 568773 614626 696948 393412 443840
14866 443840 261498 342545 353909 420949 534896 599742 380951 544467 519386 382300
$$ packed form
14938D23881A92178l2768J62925n3542K51514B17078K3453R6230R3949A54831
14927F52539M2729k18380j3660K53364q8042B25463L44793J9027K91412m10286
14917D70409K22585C24987K68162j02887J4110N47620k28845m338B23054K98285
14907E21339B17999r7484K54852L94655a26852C98972K03048B98569H2520J82047
14897B64567J24986p0717J41756j40803A37487M28955A86353m3550K91660o7248
14887C67215A05080R4579l7545K47467J80421n3942N7380f5236E72206I2892J21900
14876B14792J92205M09198j92997m9834k12779K08188M5853Q2322l03536N0428
14866D43840j82342Q1047J1364O7040J13947O4846k18791J63516k5081j37086
$$ plain form
14856 382300 285495 583275 485460 541477 535627 357295 556801 595767 444343 607936 533886
14845 533886 524340 506757 538036 461290 849066 621553 521600 815135 693932 436169 657315
14834 657315 1108125 512647 505943 528429 708807 468399 350582 487671 338014 644552
14824 644552 710652 269030 844658 553752 327530 460684 592003 727264 482122 397374
14814 397374 639012 912919 609703 745891 899340 306409 948426 999832 561347 669875
14804 669875 518812 911957 479362 331202 504983 847128 869573 753063 427806 511983
14794 511983 714003 724557 937530 822529 345479 461400 690775 588702 738964 549632
14784 549632 378328 948784 481820 597250 341565 358668 311686 943815 733785 541940
$$ packed form
14856C82300r6805K97780r7815N6017n850j78332J99506L8966j51424J63593p4050
14845E33886r546j7583L1279p6746L87776k27513r9953K93535j21203k57763K21146
14834F57315M50810E12647o704K2486J80378k40408j17817J37089j49657L06538
14824F44552O6100B69030N75628k90906k26222J33154J31319J35261k45142q4748
14814C97374K41638K73907l03216J36188J53449C06409O42017N1406m38485J08528
14804F69875j51063L93145m32595j48160J73781L42145K2445j16510l25257Q4177
14794E11983K02020J0554K12973j15001C45479J15921K29375j02073J50262j89332
14784E49632j71304N70456m66964J15430k55685J7103m6982O32129k10030j91845
$$ plain form
14774 541940 780543 784713 973859 832206 915076 704459 706918 667559 415251 614757 763650
14763 763650 618481 777588 916823 434044 811720 1108806 524590 859721 1059059 729357
14753 729357 525176 756725 784075 768504 367443 432476 456511 665692 720615 794731 981040
14742 981040 573929 969938 615863 504485 826533 457583 722541 816857 592939 360423
14732 360423 629275 709897 1030243 866057 819550 713649 1003705 536273 1017470 885257
14722 885257 628616 838524 1041329 1381282 1139436 791924 886417 861574 780529 920967
14712 920967 935532 959643 930238 942622 858401 866139 931881 1200907 807285 545524 703100
14701 703100 895148 823390 954928 1097574 1208137 1264084 768022 1043488 968734 957688
$$ packed form
14774E41940K38603M170J89146j41653Q2870k10617K459l9359k52308J99506J48893
14763G63650j45169J59107J39235D34044L77676K97086E24590L35131J99338l29702
14753G29357k04181K31549K7350j5571C67443O5033K4035K09181N4923P4116J86309
14742I81040m07111L96009l54075j11378L22048l68950K64958R4316k23918k32516
14732C60423K68852Q0622L20346j64186m6507j05901K90056m67432M81197j32213
14722H85257k56641K09908K02805L39953k41846l47512R4493k4843q1045J40438
14712I20967J4565K4111k9405J2384q4221P738O5742K69026l93622k61761J57576
14701G03100J92048p1758J31538J42646J10563N5947m96062K75466p4754j1046
$$ plain form
14691 957688 872196 1209298 913944 971122 1146951 733589 706559 1033259 981376 1006073
14681 1006073 1099294 972450 1494854 857228 842164 1040620 950420 1044014 1015555 879682
14671 879682 1192468 852176 714086 1201796 1129300 1447599 987421 1129957 1364074 1314949
14661 1314949 988843 1127412 1152829 1107245 1330546 1086686 1129072 1186219 1172114 1311268
14651 1311268 989627 963361 1370655 1065066 1120864 1333022 1193346 1380950 1366899 1216880
14641 1216880 1264186 1304536 1228115 1536573 1330382 1345618 1296579 1352754 1370757 1329120 1344424
14630 1344424 1422274 1360356 1620453 1151985 1098741 1089725 1260385 1307909 1417253 1283745
14620 1283745 1507870 1227488 1669192 1638386 1765458 1562117 1414242 1472836 1536100 1501294
$$ packed form
14691I57688q5492L37102k95354N7178J75829m13362k7030L26700n1883K4697
14681A006073R3221j26844N22404o37626j5064J98456r0200R3594k8459j35873
14671H79682L12786l40292j38090M87710p2496L18299m60178J42536K34117m9125
14661A314949l26106J38569K5417m5584K23301k43860M2386N7147j4105J39154
14651A311268l21641k6266M07294l05589N5798K12158j39676J87604j4051j50019
14641A216880M7306M0350p6421L08458k06191J5236m9039N6175J8003m1637J5304
14630A344424P7850o1918K60097m68468n3244r016J70660M7524J09344j33508
14620A283745K24125k80382M41704l0806J27072k03341j47875N8594O3264l4806
$$ plain form
14610 1501294 1727212 1321672 1420572 1873946 1558384 1643278 1725474 1608925 1513798 1409476
14600 1409476 1275246 1693785 2038861 1978783 1541968 1930197 1725559 1916194 1568272 1882353
14590 1882353 1638629 1980029 1838721 1968993 1575941 1888671 2059537 1797113 1936159
14581 1936159 2118532 2064165 1606305 2086279 1981585 2193855 2092929 2058458 2212134 2218176
14571 2218176 2635175 1973079 2217500 2245678 2226355 2315326 2437040 2633448 2438183 2853079
14561 2853079 2453633 2723024 2997146 2816817 3195917 3426498 3373114 3776490 4095210 4534887
14551 4534887 5135994 6641473 8746355 12670926 20029097 36163547 39913445 17659220
14542 7988082 4740800 4015926 3208096 3067062 3071134 2780389 2715330 2965094 3176286 3664262
$$ packed form
14610A501294K25918m05540R8900M53374l15562Q4894Q2196j16549r5127j04322
14600A409476j34230M18539L45076o0078m36815L88229k04638J90635l47922L14081
14590A882353k43724L41400j41308J30272l93052L12730J70866k62424J39046
14581A936159J82373n4367m57860M79974j04694K12270j00926l4471J53676O042
14571B218176M16999o62096K44421K8178j9323Q8971J21714J96408j95265M14896
14561B853079l99446K69391K74122j80329L79100K30581n3384M03376L18720M39677
14551D534887O01107J505479K104882L924571P358171J6134450L749898A7659220
14542G988082l247282p24874q07830j41034M072k90745o5059K49764K11192M87976
$$ plain form
14532 3664262 4957906 8530685 5785485 3070056 2431319 2645467 2656788 2735859 2661844
14523 2661844 2701369 2484081 2746520 3080248 2675855 2618335 2743275 2781565 2548086 2549413
14513 2549413 2745471 2787590 2569960 2804498 3059159 3197315 2897625 3114393 3219353 3160078
14503 3160078 3162957 2854710 3133479 3398680 3539035 3216108 3261619 3465288 3468020 3537714
14493 3537714 3283800 3642318 3342611 3400358 3759962 3736546 3730724 3667266 3611345 4088211
14483 4088211 3864137 3950313 3897299 4024391 3965124 4141458 4048994 3963400 4194784 4209066
14473 4209066 4300049 4231429 4374294 4333323 4445111 4325224 4749700 4949192 4678091 4997968
14463 4997968 4884651 4955206 4920246 4884845 5327236 4826521 5439003 5152118 5320883 5095587
$$ packed form
14532C664262J293644L572779k745200k715429o38737K14148J1321P9071p4015
14523B661844L9525k17288K62439L33728m04393n7520J24940L8290k33479J327
14513B549413J96058M2119k17630K34538K54661J38156k99690K16768J04960n9275
14503C160078K879l08247K78769K65201J40355l22927M5511K03669K732O9694
14493C537714k53914L58518k99707N7747L59604k3416n822o3458n5921M76866
14483D088211k24074Q6176n3014J27092n9267J76334r2464q5594K31384J4282
14473D209066R0983o8620J42865m0971J11788j19887M24476J99492k71101L19877
14463D997968j13317P0555l4960l5401M42391n00715O12482k86885J68765k25296
$$ plain form
14453 5095587 5277372 5650322 5635573 5514051 5489750 6029016 5684548 5673514 6150280 6246901
14443 6246901 5939951 6200467 6250063 6438359 6527868 6671155 6715172 6522740 6859389 6708011
14433 6708011 6879715 6762827 7244657 7104098 7084704 7071684 7291962 7495329 7646395 7603539
14423 7603539 7680513 8129684 8317572 8265572 8398321 8271971 8524261 8568499 9178060 9159939
14413 9159939 9663364 9303995 9203250 9819566 9996984 9765267 10015999 9997409 10167397 10318457
14403 10318457 10696180 10701312 11032653 11341684 11015303 11388449 12097921 12399526 12137672 12166883
14393 12166883 12431994 12524042 12899758 12885278 13344841 13595101 14026124 14115410 14197477 14601628
14383 14601628 14561265 14933238 15075630 15330165 15968994 16339261 16490329 16778163 16884688
$$ packed form
14453E095587J81785L72950j4749j21522k4301N39266l44468j1034M76766R6621
14443F246901l06950K60516M9596J88296Q9509J43287M4017j92432L36649j51378
14433F708011J71704j16888M81830j40559j9394j3020K20278K03367J51066m2856
14423G603539P6974M49171J87888n2000J32749j26350K52290M4238O09561j8121
14413I159939N03425l59369j00745O16316J77418k31717K50732j8590J69988J51060
14403A0318457L77723N132L31341L09031l26381L73146P09472L01605k61854K9211
14393A2166883K65111R2048L75716j4480M59563K50260M31023Q9286Q2067M04151
14383A4601628m0363L71973J42392K54535O38829L70267J51068K87834J06525
$$ plain form
14374 16884688 17515891 17569350 18082001 18330898 18701853 19060505 19691062 20069494 20144246 21125165
14364 21125165 21153199 21719080 22065529 22586742 23326992 23672951 24232673 24861114 25257560
14355 25257560 25853967 26414753 26886690 27476791 28379705 28735556 29548976 30158565 31527945
14346 31527945 32057229 32545045 33713756 34453433 35116881 36299511 37273054 38368263 38784648
14337 38784648 40374707 41575197 42586213 44080111 45418995 46567886 48055787 49140038
14329 49140038 51115858 52737870 54372356 55896144 57923722 59621105 62045449 63873844
14321 63873844 66266361 68473251 70613917 73128119 76338168 78605028 81531384 84299639
14313 84299639 87798228 91481608 95209739 98713130 102838642 107224195 111871490 116074927
$$ packed form
14374A6884688O31203N3459N12651K48897L70955L58652O30557L78432P4752R80919
14364B1125165K8034N65881L46449N21213P40250L45959N59722O28441L96446
14355B5257560N96407N60786M71937N90101R02914L55851Q13420O09589J369380
14346C1527945N29284M87816J168711P39677O63448J182630R73543J095209M16385
14337C8784648J590059J200490J011016J493898J338884J148891J487901J084251
14329D9140038J975820J622012J634486J523788K027578J697383K424344J828395
14321F3873844K392517K206890K140666K514202L210049K266860K926356K768255
14313H4299639L498589L683380L728131L503391M125512M385553M647295M203437
$$ plain form
14305 116074927 121040409 126408844 131997969 138279405 143959480 150898703 157964589 165749614
14297 165749614 173684257 181912222 191043066 199969542 209763858 220129530 231803947 243381536
14289 243381536 255700646 268254711 281641670 296054789 310627954 325463144 340907032
14282 340907032 356591697 372533374 388160181 403656750 418574754 432823529 445337614
14275 445337614 455839911 462978298 466717435 469822612 471742865 473515851 474089111 468727457
14267 468727457 461451527 451319356 439671978 426446926 412755033 397772878 382279482
14260 382279482 367399986 352306394 337676627 324195708 311599068 298441200 284953434
14253 284953434 272118125 259371894 247330618 235626036 223866762 212650331 202002282
$$ packed form
14305A16074927M965482N368435N589125O281436N680075O939223P065886P785025
14297A65749614P934643Q227965R130844Q926476R794316J0365672J1674417J1577589
14289B43381536J2319110J2554065J3386959J4413119J4573165J4835190J5443888
14282C40907032J5684665J5941677J5626807J5496569J4918004J4248775J2514085
14275D45337614J0502297P138387L739137L105177J920253J772986N73260n361654
14267D68727457p275930j0132171j1647378j3225052j3691893j4982155j5493396
14260C82279482j4879496j5093592j4629767j3480919j2596640j3157868j3487766
14253B84953434j2835309j2746231j2041276j1704582j1759274j1216431j0648049
$$ plain form
14246 202002282 192194218 182512888 173997012 165949859 161344172 153054906 145475464 138415434
14238 138415434 131922682 126270735 120530276 114825271 110149354 105329948 101132194 97055530
14230 97055530 93288615 89250975 85794841 82324800 78839398 76170989 73052651 70569521
14222 70569521 68199794 65926933 63676140 61635466 59108348 56949654 55152656 53517659
14214 53517659 51964753 50525868 48976910 47279052 45907435 44438665 43220438 42550933
14206 42550933 41432457 39773531 38512389 37553970 36764706 36162793 35161141 34093731
14198 34093731 32684761 31954949 31263471 30535156 30099102 29250754 28115898 27328976 26800823
14189 26800823 26485773 25783947 24966473 24314951 23964622 23282501 22738292 22392494 22162390
$$ packed form
14246B02002282r808064r681330q515876q047153m605687q289266p579442p060030
14238A38415434o492752n651947n740459n705005m675917m819406m197754m076664
14230I7055530l766915m037640l456134l470041l485402k668409l118338k483130
14222G0569521k369727k272861k250793k040674k527118k158694j796998j634997
14214E3517659j552906j438885j548958j697858j371617j468770j218227o69505
14206D2550933j118476j658926j261142r58419p89264o01913j001652j067410
14198C4093731j408970p29812o91478p28315m36054q48348j134856p86922n28153
14189B6800823l15050p01826q17474o51522l50329o82121n44209l45798k30104
$$ plain form
14180 22162390 21488787 20684345 20217131 20186373 19464004 19326925 18916802 18320843 18063179
14171 18063179 17753396 17679253 17277333 16728682 16568724 16252934 15785045 15546150 14987586
14162 14987586 14922296 14532479 14435231 14098335 14031764 13736477 13173889 13474827 12963225 12696007
14152 12696007 12565809 12474871 12291679 12486629 11680392 11420110 11166975 10900256 10867325 10855232
14142 10855232 10344125 10516956 10308977 10432275 10119219 9879334 9787528 9671517 9244553
14133 9244553 9159133 9111609 9151943 8966595 8945585 8690458 8384053 8195202 8278917 8219914
14123 8219914 8470832 8086836 7750813 7877231 7831147 7614875 7416909 7377584 7281556 7418888
14113 7418888 7044036 7146820 6954670 7189397 6823238 6899365 6581933 6782807 6312605 6185014
$$ packed form
14180B2162390o73603q04442m67214l0758p22369j37079m10123n95959k57664
14171A8063179l09783p4143m01920n48651j59958l15790m67889k38895n58564
14162A4987586o5290l89817r7248l36896o6571k95287n62588L00938n11602k67218
14152A2696007j30198r0938j83192J94950q06237k60282k53135k66719l2931j2093
14142A0855232n11107J72831k07979J23298l13056k39885r1806j16011m26964
14133I244553q5420m7524M0334j85348k1010k55127l06405j88851Q3715n9003
14123H219914K50918l83996l36023J26418m6084k16272j97966l9325r6028J37332
14113G418888l74852J02784j92150K34727l66159P6127l17432K00874m70202j27591
$$ plain form
14103 6185014 6686721 6205329 6119203 6075013 5875583 5992301 5944236 6140817 6005310 5807909
14093 5807909 5413512 5621883 5534572 5657140 5616731 5438417 5418975 5362631 5175637 5087746
14083 5087746 5013541 4738736 4964734 5197753 5163986 4970341 4791630 4631212 4586227 4628318
14073 4628318 4581474 4403880 4212205 4458967 4210416 4479057 4334307 4065333 4390387 4282345
14063 4282345 3879117 4250717 4116809 3983616 4170955 4153725 3899719 4067987 3709352 3444831
14053 3444831 3497381 3655245 3770878 3787736 3460152 3441564 3533689 3360450 3452034 3690607
14043 3690607 3595576 3404877 3268120 3029739 3535711 3288971 2826315 3382681 2990494 2972556
14033 2972556 3320611 2720911 3030769 3183381 3059081 3085948 3113640 2847311 3127978 2919041
$$ packed form
14103F185014N01707m81392q6126m4190j99430J16718m8065J96581j35507j97401
14093E807909l94397K08371q7311J22568m0409j78314j9442n6344j86994q7891
14083E087746p4205k74805K25998K33019l3767j93645j78711j60418m4985M2091
14073D628318m6844j77594j91675K46762k48551K68641j44750k68974L25054j08042
14063D282345m03228L71600j33908j33193J87339j7230k54006J68268l58635k64521
14053C444831N2550J57864J15633J6858l27584j8588R2125j73239R1584K38573
14043C690607r5031j90699j36757k38381N05972k46740m62656N56366l92187j7938
14033B972556L48055n99700L09858J52612j24300K6867K7692k66329K80667k08937
$$ plain form
14023 2919041 2978836 2851868 2735710 2495767 2655845 2740907 2448211 2575808 2825379 2568235
14013 2568235 2469631 2671556 2547071 2625170 2411527 2558258 2174341 2234139 2388814 2396687
14003 2396687 2207948 2330064 2037214 2293440 2100982 2652488 1973822 1834651 2611177
13994 2611177 2425555 2481857 2117444 2652578 3385056 4915111 7623849 14207756 29461932
13985 29461932 42538009 23490372 12421692 8201135 6428704 5327466 4779551 4167963
13977 4167963 3735910 3534919 3076100 3489353 2668755 2728012 2860263 2823169 2755166 2461092
13967 2461092 2374365 2411913 2596164 2517668 2466566 2310698 2354149 2011309 2148799 2188585
13957 2188585 2337037 2433550 1999536 2158668 1608515 1953799 1907662 2057865 1853807 1758241
$$ packed form
14023B919041N9795j26968j16158k39943J60078Q5062k92696J27597K49571k57144
14013B568235r8604K01925j24485P8099k13643J46731l83917N9798J54675P873
14003B396687j88739J22116k92850K56226j92458N51506o78666j39171P76526
13994B611177j85622N6302l64413N35134P32478J530055K708738O583907J5254176
13985B9461932J3076077j9047637j1068680m220557j772431j101238n47915o11588
13977D167963m32053k00991m58819M13253q20598N9257J32251l7094o8003k94074
13967B461092q6727L7548J84251p8496n1102j55868M3451l42840J37490L9786
13957B188585J48452R6513m34014J59132n50153L45284m6137J50203k04058r5566
$$ plain form
13947 1758241 1700275 1939612 2014886 1660978 1842309 1766322 1601263 2001069 1934178 1675007
13937 1675007 1576815 1811870 1573457 1593176 1469118 1959383 1634581 1326309 1878238 1574092
13927 1574092 2000628 1267729 1804115 1913237 1645566 1407855 1384102 1170582 1803574 1495206
13917 1495206 1496747 1450832 1575279 1411848 1641314 1302357 1379488 1193719 1478566 1084361
13907 1084361 1443800 1219000 1419249 1745929 1659548 1342749 1200422 1602909 1165833 1312109
13897 1312109 888830 1174077 1535409 1330219 1427776 1326406 1510079 1339768 1306227 1062239
13887 1062239 1456760 1452860 1182023 947899 936453 1020775 954676 1044674 681423 1322227
13877 1322227 1389692 1053838 1385551 1302010 1124635 1283266 928740 1257798 1378790 1113422
$$ packed form
13947A758241n7966K39337P5274l53908J81331p5987j65059L99806o6891k59171
13937A675007r8192K35055k38413J9719j24058M90265l24802l08272N51929l04146
13927A574092M26536p32899N36386J09122k67671k37711k3753k13520O32992l08368
13917A495206J541m5915J24447j63431K29466l38957P7131j85769K84847l94205
13907A084361L59439k24800K00249L26680q6381l16799j42327M02487m37076J46276
13897A312109m23279K85247L61332k05190R7557j01370J83673j70311l3541k43988
13887A062239L94521l900k70837k34124j1446Q4322o6099Q9998l63251O40804
13877A322227O7465l35854L31713q3541j77375J58631l54526L29058J20992k65368
$$ plain form
13867 1113422 1252931 1034309 863071 976635 1179085 1274453 1495658 727549 1182647 1117691
13857 1117691 1278960 1190457 969503 893793 1273978 1237616 1025412 861058 961835 1202240
13847 1202240 1319555 870212 1070036 656314 676926 905398 995530 955953 1059682 1076769
13837 1076769 930905 837956 1215125 685551 1060936 817374 768602 1078350 960253 736503
13827 736503 1006991 1091032 667096 849992 944428 741903 886297 535444 650572 1025834
13817 1025834 753796 1063225 864121 586351 838528 759529 867268 850986 720367 1086532
13807 1086532 871820 691362 1058402 451821 1088553 910562 788890 855561 508333 816501
13797 816501 748528 427894 923082 643715 666110 510135 646605 780681 423669 810252
$$ packed form
13867A113422J39509k18622j71238J13564K02450R5368K21205G27549M55098o4956
13857A117691J61269q8503k20954p5710L80185l6362k12204j64354J00777K40405
13847A202240J17315m49343J99824m13722K0612K28472R0132l9577J03729J7087
13837A076769j45864r2949L77169n29574L75385k43562m8772L09748j18097k23750
13827G36503K70488Q4041m23936J82896R4436k02525J44394l50853J15128L75262
13817A025834k72038L09429j99104k77770K52177p8999J07739j6282j30619L66165
13807A086532k14712j80458L67040D51821O36732j77991j21672O6671l47228L08168
13797H16501o7973l20634M95188k79367K2395j55975J36470J34076l57012L86583
$$ plain form
13787 810252 434670 761766 1058478 755625 612975 666749 628152 747673 811270 883197
13777 883197 816698 963738 682211 448170 611491 508852 467214 478302 583389 683570
13767 683570 631840 383558 626381 775385 723854 717608 213265 539466 512805 650460
13757 650460 512651 515933 311320 931938 683427 305059 520822 425716 607469 686832
13747 686832 872886 496137 792484 467239 427127 561060 677401 712215 486313 547879
13737 547879 262191 721951 827662 625482 355684 493062 738920 531489 823286 196841
13726 358474 556056 633300 620982 285871 414880 682598 775589 838923 532388 656003
13716 656003 492172 362345 513594 282355 657124 589229 295783 334605 357851 560502
$$ packed form
13787H10252l75582L27096K96712l02853j42650N3774l8597J19521O3597P1927
13777H83197o6499J47040k81527k34041J63321j02639m1638J1088J05087J00181
13767F83570n1730k48282K42823J49004n1531o246B13265L26201k6661J37655
13757F50460j37809L282k04613O20618k48511C05059K15763r5106J81753P9363
13747F86832J86054l76749K96347l25245m0112J33933J16341L4814k25902O1566
13737E47879B62191M59760J05711k02180k69798J37378K45858k07431K91797A96841
13726C58474J97582P7244j2318B85871J29009K67718R2991O3334l06535J23615
13716F56003j63831j29827J51249k31239L74769o7895k93446L8822K3246K02651
$$ plain form
13706 560502 507340 395779 444080 763051 632768 571392 350707 385387 632326 441714
13696 441714 409712 696582 589976 521874 552674 482391 349519 398025 430437 558712 378779
13685 378779 485614 584367 483937 848377 459452 404851 144113 575959 721184 282910
13674 453836 485791 463520 474338 649514 537478 448282 514302 477083 310808 361713 505865
13663 505865 290703 385769 420121 604942 717471 421050 431799 238884 493153 784872
13653 784872 292448 289356 262541 248239 595541 362205 488156 448902 601581 -45412 454227
13641 510588 497759 618403 515717 612816 168093 540853 241363 379534 627608 515393
13631 515393 161648 397099 370375 302867 465858 671090 525500 172067 252780 383058
$$ packed form
13706E60502n3162j11561M8301L18971j30283o1376k20685L4680K46939j90612
13696D41714l2002K86870j06606o8102L0800p0283j32872M8506L2412J28275j79933
13685C78779J06835R8753j00430L64440l88925n4601A44113M31846J45225B82910
13674D53836L1955k2271J0818J75176j12036q9196O6020l7219j66275N0905J44152
13663E05865k15162R5066L4352J84821J12529k96421J0749j92915K54269K91719
13653G84872B92448l092k6815j4302L47302k33336J25951l9254J52679d5412D54227
13641E10588j2829J20644j02686R7099A68093L72760B41363J38171K48074j12215
13631E15393A61648K35451k6724o7508J62991K05232j45590A72067Q0713J30278
$$ plain form
13621 383058 494341 271013 274419 409519 119354 334976 307474 167075 480331 189111
13610 311200 290662 271536 383700 230677 257021 345437 635201 371933 49012 131812 183211
13599 183211 187077 246492 255433 343379 94216 15273 205652 460789 467327 519913 687842
13588 687842 399211 550679 285232 137659 446636 507877 323178 505129 345178 395933
13578 395933 536941 94561 246362 703609 111145 31398 259255 369121 253901 571319
13568 571319 329429 542715 346687 131531 442797 261422 182072 92270 88979 296358
13558 296358 149186 6189 151234 487937 312270 74065 212240 341061 523212 312630
13548 312630 142119 362583 506932 61460 227171 529562 167299 275734 757246 325713
$$ packed form
13621C83058J11283k23328L406J35100A19354K15622k7502j40399L13256A89111
13610C11200k0538j9126J12164j53023K6344Q8416K89764k63268D9012Q2800N1399
13599A83211L866N9415Q941Q7946I4216A5273J90379K55137O538N2586J67929
13588F87842k88631J51468k65447A37659L08977O1241j84699J81951j59951N0755
13578C95933J41008I4561J51801M57247A11145C1398K27857J09866j15220L17418
13568E71319k41890K13286j96028A31531L11266j81375p9350q9802l291K07379
13558B96358j47172F189J45045L36703j75667G4065J38175J28821J82151k10582
13548C12630A42119K20464J44349F1460J65711L02391A67299J08435M81512C25713
$$ plain form
13537 92763 378205 245248 348549 -11985 262827 310082 -139195 114757 90482 -176677
13526 390469 237186 98910 403880 180620 575051 321045 347337 298191 326113 125309
13515 362462 98965 346936 118169 -107232 274165 257788 431444 256122 58875 36616
13505 36616 233199 365665 76881 179666 262337 657778 310721 264841 201812 2007 274583
13494 274583 398736 -10005 105697 292771 215645 270847 365419 142147 382723 268850
13484 268850 99545 199234 317959 327738 466513 292325 259208 99395 250932 247637 229760
13473 229760 224818 327204 166336 253859 64442 42743 273408 209148 128921 62055 338615
13462 338615 235113 -6777 668785 62428 28657 477808 489269 -225301 305571 -7534 225063
$$ packed form
13537I2763K85442j32957J03301a1985B62827M7255a39195A14757k4275a76677
13526C90469j53283I8910L04970A80620L94431k54006K6292m9146K7922A25309
13515C62462I8965K47971A18169a07232B74165j6377J73656j75322E8875k2259
13505C6616J96583J32466G6881J02785Q2671L95441C10721m5880o3029B007K72576
13494B74583J24153a0005A05697J87074p7126N5202R4572A42147K40576j13873
13484B68850I9545R9689J18725R779J38775j74188l3117I9395J51537l295j7877
13473B29760m942J02386j60868Q7523F4442k1699K30665o4260q0227F2055K76560
13462C38615j03502f777F68785F2428B8657M49151J1461b25301C05571g534B25063
$$ plain form
13450 5984 449047 496760 46583 282332 -53652 -99545 216543 455166 160326 73518 -44497
13438 389684 236018 361864 425452 -275248 356974 16049 204191 320238 215963 170938
13428 170938 215712 377723 304273 275124 135968 379752 -150853 494241 -205398 501772
13417 280273 -177780 234123 -90395 217150 99118 -14385 453465 286619 179168 115326
13407 115326 104082 10840 201280 141872 421785 94 93524 83516 92845 -140848 151902
13395 192380 329533 159517 -150783 -114775 206322 303892 -133213 196770 -61786 318979
13384 -238249 -194141 391060 192971 256926 294102 136469 -90010 337530 263611 485426
13374 485426 164533 466295 204949 -70843 523979 236406 387368 366973 48819 251750
$$ packed form
13450E984M43063M7713D6583K35749e3652m5893B16543K38623A60326G3518d4497
13438C89684j53666J25846O3588b75248C56974A6049J88142J16047j04275m5025
13428A70938M4774J62011p3450k9149A35968K43784a50853D94241b05398E01772
13417B80273a77780B34123i0395B17150I9118a4385D53465j66846j07451o3842
13407A15326j1244A0840J90440n9408K79913I4R3430j0008R329a40848A51902
13395A92380J37153A59517a50783L6008B06322R7570a33213A96770f1786C18979
13384b38249M4108C91060A92971O3955L7176A36469i0010C37530p3919K21815
13374D85426A64533L01762B04949g0843E23979B36406J50962k0395D8819K02931
$$ plain form
13364 251750 294349 347327 213730 551902 340485 377704 340408 191120 366883 -111812
13353 211592 398518 102664 532386 103330 230602 291566 227542 205754 241662 305878
13343 305878 228330 380713 249854 128675 258580 314212 -129262 380274 95795 398545
13333 398545 415170 -25219 -38188 -121428 246696 141870 265876 427524 174828 77538
13322 284768 304114 265675 352707 248384 358759 172600 36602 164886 268890 253673
13312 253673 168426 252490 174628 59856 120511 -162117 140411 385896 122110 65757 -156457
13300 144471 2124 63644 -8212 426237 -9787 57503 -14438 211235 14351 5997 207842 91690
13287 -225859 200325 223950 -35866 -76433 274499 302815 42841 115344 60965 109692 -39364
$$ packed form
13364B51750M2599N2978j33597L38172k11417L7219l7296j49288J75763a11812
13353B11592J86926A02664M29722A03330J27272O0964o4024k1788L5908O4216
13343C05878p7548J52383j30859j21179J29905N5632a29262C80274I5795L02750
13333C98545J6625b5219j2969q3240B46696j04826J24006J61648A74828G7538
13322B84768J9346l8439Q7032j04323J10375A72600C6602J28284J04004j5217
13312B53673q5247Q4064p7862E9856O0655a62117A40411K45485A22110n6353a56457
13300A44471B124O1520h212D26237i787E7503a4438B11235A4351E997K01845I1690
13287b25859B00325K3625c5866m0567B74499K8316D2841P2503n4379M8727c9364
$$ plain form
13275 174036 -256619 6261 392276 -45021 342351 261388 -121805 66681 128130 -208065 133237
13263 190243 -55162 -35619 -65370 295140 65199 -17019 361322 173408 99307 241769 255905
13252 255905 189798 -193873 318341 -163080 74331 259905 107552 74078 -111614 186244
13241 54532 151013 -291290 35541 150189 47086 -81695 237560 265244 95564 77331 87410
13230 87410 93883 -67161 361600 128149 353363 97899 143545 -146952 200880 188775 -151131
13218 14558 -118285 -98095 165468 20870 189259 69246 390373 -254987 141477 427244
13208 427244 363260 7715 -32848 166999 197733 -145743 115793 6932 92833 172685 -60004
13196 38349 -35778 217376 -141767 188217 85149 175105 184374 20514 332589 -104314 -50060
$$ packed form
13275A74036b56619F261L86015d5021C42351q0963a21805F6681O1449b08065A33237
13263A90243e5162J9543k9751B95140F5199a7019C61322A73408p4101J42462J4136
13252B55905o6107a93873C18341a63080G4331J85574A07552l3474a11614A86244
13241E4532R6481b91290C5541J14648D7086h1695B37560K7684I5564j8233J0079
13230H7410O473f7161C61600A28149K25214I7899M5646a46952B00880j2105a51131
13218A4558a18285K0190A65468B0870J68389F9246L21127b54987A41477K85767
13208D27244o3984G715c2848A66999L0734a45743A15793F932Q5901P9852f0004
13196C8349c5778B17376a41767A88217H5149Q9956R269B0514L12075a04314e0060
$$ plain form
13184 -150522 126622 -38713 204861 205785 -128345 -191079 -82834 382186 73167 190599 100198
13173 100198 -59008 -262627 -30839 33762 88702 329323 1299 9748 106760 199218 406843
13162 406843 17166 254235 149828 -36455 -491333 249317 302652 179887 77717 206741
13152 206741 169436 159600 219740 -144379 -167316 -54570 185330 39314 -211474 160905 -54113
13140 301211 10839 -70498 -68126 -228940 23622 278857 631955 -4100 -78048 28601 -136848
13128 97223 -136219 234786 135103 40630 -62222 -59247 -4867 32029 -185908 -207915 327119
13116 231445 210453 355964 -206441 -99345 -168714 55175 -248842 13366 -172529 -119559 203844
13104 97629 281862 258275 -156292 -85445 149577 268560 398249 277071 18939 -176709
$$ packed form
13184a50522A26622c8713B04861R24a28345o2734h2834C82186G3167J17432r0401
13173A00198e9008k03619c0839C3762N4940K40621A299Q449R7012R2458K07625
13162D06843A7166K37069j04407c6455m54878B49317N3335j22765G7717J29024
13152B06741l7305r836O0140a44379k2937e4570A85330C9314b11474A60905e4113
13140C01211A0839g0498K372j60814B3622K55235L53098d100p3948B8601a36848
13128I7223a36219B34786r9683D0630f2222K975d867C2029a85908k2007C27119
13116B31445k0992J45511b06441i9345o9369E5175b48842A3366a72529N2970B03844
13104I7629J84233k3587a56292P0847A49577J18983J29689j21178A8939a76709
$$ plain form
13093 281914 51424 -30092 164735 -35055 198507 -113393 -59609 -5041 21599 -180421 41236
13081 239025 -310693 239494 303346 355143 -98235 177768 -104348 64066 297424 63900
13070 96946 175913 22041 22955 -115845 103404 143951 -117962 -121170 372630 157733 -239835
13058 89397 -175852 294059 3620 138689 23074 -330513 192674 85484 84528 -172886 -195186
13047 -195186 107208 222943 263579 -178589 -32199 -32838 96013 -139367 -67040 140985 -26568
13035 -292222 133712 -174120 -91474 99807 -52479 227581 -38870 -227813 -117903 205648
13024 -221927 -151149 -369212 74540 308285 177242 -166897 -87226 -72133 -171348 -371439
13014 -371439 -57893 185529 -100239 32377 160274 282321 61431 264223 369897 36172
$$ packed form
13093B81914E1424c0092A64735c5055A98507a13393N3784e041B1599a80421D1236
13081B39025c10693B39494O3852N1797i8235A77768a04348F4066K33358F3900
13070I6946P8967B2041R14a15845A03404M0547a17962l208C72630A57733b39835
13058H9397a75852B94059C620J35069B3074c30513A92674H5484r56a72886k2300
13047a95186A07208J15735M0636a78589c2199o39I6013a39367f7040A40985b6568
13035b92222A33712a74120Q2646I9807e2479B27581c8870j88943J09910B05648
13024b21927P0778k18063G4540K33745j31043a66897P9671J5093r9215k00091
13014c71439e7893A85529a00239C2377J27897J22047F1431K02792J05674C6172
$$ plain form
13003 -259264 -38284 -425 -233772 208590 -151626 -223227 93771 -22140 198738 -61702 -244658
12992 -244658 122082 121048 276211 -192635 97130 306137 -105915 94384 171141 -150555
12981 526252 -126902 79132 205892 147460 -262449 95395 -163993 25733 237781 -153786
12970 -30397 -30091 26929 -213342 118209 -291816 41362 231307 -87395 63065 -191791 -111156
12959 -111156 94401 -150562 247529 -6051 37688 353856 -53557 -35584 -310038 89072 122162
12948 122162 62897 269251 -72407 133586 -394923 -151561 41375 164859 -38674 33605
12937 -248648 44672 -5274 -93599 570133 -37404 93082 32359 101839 -232867 175054 -35547
12925 -143853 83363 -227531 21647 73636 221912 34377 -120087 -47950 186989 159064 -277505
$$ packed form
13003b59264c8284d25k33347B08590a51626p1601I3771b2140A98738f1702j82956
12992b44658A22082j034J55163a92635I7130K09007a05915I4384P6757a50555
12981E26252a26902G9132J26760n8432b62449I5395a63993B5733K12048a53786
12970c0397L06B6929b13342A18209b91816D1362J89945h7395F3065a91791Q0635
12959a11156I4401a50562B47529f051C7688L16168e3557J7973k74454H9072L3090
12948A22162n9265K06354g2407A33586c94923a51561D1375J23484c8674C3605
12937b48648D4672e274q8325E70133c7404I3082C2359O9480b32867A75054c5547
12925a43853H3363b27531B1647N1989J48276C4377a20087d7950A86989k7925b77505
$$ plain form
12913 296011 -217201 139355 75255 -46314 -204206 -13493 -81192 -1211 23027 -66323 -46732
12902 -46732 -130709 -160062 -6794 -293229 -143193 75453 -187392 -204676 -49968 -11631 275277
12890 -197230 -190803 -26114 -182003 -1061 -167556 55657 227526 2047 81102 64490 -75075
12878 315478 548691 -228125 -66000 876 -49010 218703 -16442 169013 130825 -366312 23129
12866 -42210 -138541 224538 230332 88096 54552 203440 -180486 -93928 -160210 -75109 26677
12854 -109297 -349341 278013 -225172 308496 60817 157479 89996 -82631 -53314 334453
12843 -15064 -242014 -93805 -128696 -159345 84357 -4691 -12436 -265212 -191974 109056 24637
12831 -42365 -100226 -273495 -46395 -100840 51133 -211822 -129820 91301 170055 143898 -127189
$$ packed form
12913B96011b17201A39355o4100d6314j57892a3493o7699a211B3027f6323J9591
12902d6732q3977k9353f794k86435a43193G5453a87392j7284d9968a1631B75277
12890a97230O427b6114j55889a061j66495E5657J71869B047P9055j6612g5075
12878C15478K33213b28125f6000H76d9010B18703a6442A69013l8188c66312B3129
12866d2210r6331B24538N794H8096l3544J48888a80486Q6558o6282g5109B6677
12854a09297k40044B78013b25172C08496F0817R6662o7483h2631K9317C34453
12843a5064k26950i3805l4891l0649H4357d691p745k52776P3238A09056B4637
12831d2365n7861j73269d6395n4445E1133b11822Q2002I1301P8754k6157a27189
$$ plain form
12819 180149 -304838 69457 -318799 -38744 71846 -5390 209557 -204642 119122 -47880 -256601
12808 -256601 -108521 -264478 967 -128504 26812 122072 -30134 285072 114876 34864 -49622
12796 63688 -163581 -101959 -343965 -217455 161769 -43910 118172 75428 -261082 84894
12785 21913 343543 -19190 261658 143674 -118437 -35982 33374 77615 104194 -157086 13877
12773 254450 -218486 -226617 -7738 42281 -227513 -123179 464009 280988 -191467 41766 39909
12762 39909 103877 -112170 133614 -13383 95886 -146540 -291636 -293646 -60625 148017 -101277
12750 428453 149148 -13451 93018 254177 -188967 -185957 -1326 -232706 -81701 -306778 255188
12738 -34479 114388 89256 -951 275393 61322 -219170 61352 -42384 -82880 163851 185527
$$ packed form
12819A80149c04838F9457c18799c8744G1846e390B09557b04642A19122d7880k08721
12808b56601a08521j55957I67a28504B6812R5260c0134B85072A14876C4864d9622
12796F3688a63581O1622k42006J26510A61769d3910A18172m2744b61082H4894
12785B1913L21630a9190B61658j17984a18437c5982C3374M4241K6579a57086A3877
12773B54450b18486q131g738D2281b27513J04334D64009j83021a91467D1766j857
12762C9909O3968a12170A33614a3383I5886a46540j45096k010f0625A48017a01277
12750D28453A49148a3451I3018J61159a88967L010a326k31380h1701k25077B55188
12738c4479A14388k5132i51B75393F1322b19170F1352d2384m0496A63851K1676
$$ plain form
12727 185527 207738 -251608 91212 -130630 16606 -20852 140398 58010 -71915 -162322 57726
12715 -38249 -35934 -214539 -42793 319745 28647 -10205 380365 244762 270879 148106 153622
12704 153622 89974 31580 107395 78003 -353423 -24693 -207856 -460108 186333 -22533 -8394
12692 -57518 -105622 213372 182208 -185538 355600 -290570 -24379 -212344 91629 140412 -78201
12680 -152431 60152 64542 231324 233002 129064 -189663 -128724 -62608 -124671 -939 124084
12668 255692 118191 -155422 -122457 -81851 -56741 -126693 -36866 261137 8429 -58127 -179346
12657 -179346 -147251 109188 228615 -99876 -184291 162382 377526 123219 5306 178202
12647 178202 193442 159061 -334351 94110 75780 -144456 -166167 -64950 52580 -261019 109336
$$ packed form
12727A85527K2211b51608I1212a30630A6606b0852A40398E8010g1915r0407E7726
12715c8249K315j78605d2793C19745B8647a0205C80365j35603K6117j22773N516
12704A53622o3648C1580P5815k9392c53423b4693j83163k52252A86333b2533h394
12692e7518m8104B13372l1164a85538C55600b90570b4379j87965I1629M8783g8201
12680a52431F0152M390J66782J678j03938a89663O0939f2608o2063i39A24084
12668B55692A18191a55422L2965M0606K5110o9952c6866B61137H429e8127j21219
12657a79346L2095A09188J19427i9876q4415A62382K15144A23219E306J72896
12647A78202J5240l4381c34351I4110j8330a44456k1711f4950E2580b61019A09336
$$ plain form
12635 64985 171404 25353 213287 -71274 273656 191780 438249 432199 165824 176350 276686
12624 276686 242003 -181236 91365 -34187 226168 376093 40848 -57670 297148 81087 -92693
12612 67918 -93967 14062 -78979 74616 -143206 20641 -118428 204978 -359833 57975 -2708
12600 12726 -110677 296041 322311 57937 100292 62845 62586 229488 -50399 272486 29833
12588 266586 427298 -257579 308314 9197 215924 381934 -164292 252521 -102245 -278
12577 -2929 36386 43885 96773 154442 127925 -128835 -20009 -117731 122624 10680 213478
12566 213478 261617 -279948 -261925 -292918 -119740 -56072 152854 165590 -84742 201755 -135032
12554 -205653 -98848 238226 -19937 -38472 -309443 -145794 144701 265679 -85982 -34800
$$ packed form
12635F4985J06419B5353J87934g1274B73656q1876K46469o050A65824J0526J00336
12624B76686l4683a81236I1365c4187B26168J49925D0848e7670B97148H1087i2693
12612F7918i3967A4062g8979G4616a43206B0641a18428B04978c59833E7975b708
12600A2726a10677B96041K6270E7937M2355l7447k59J66902e0399B72486B9833
12588B66586J60712b57579C08314I197K06727J66010a64292B52521a02245b78
12577b929C6386P499N2888N7669k6517a28835b0009r7722A22624A0680K02798
12566B13478M8139b79948J8023l0993a19740e6072A52854J2736h4742B01755a35032
12554b05653i8848B38226a9937j8535k70971a45794A44701J20978h5982c4800
$$ plain form
12543 -109249 173990 192769 29277 188890 39893 268995 39525 131754 -231370 218140
12532 -46567 -155548 -219951 259279 28894 163686 -85476 -51773 -331031 -35221 21861 95456
12521 95456 79537 -288730 240226 -16326 -181174 -313213 -74243 -41468 234107 -29876 131568
12509 357641 190462 341067 41888 -97888 391278 325622 79876 -108652 -64426 -189219
12499 -189219 8459 -326705 110546 58819 -203197 -143585 19286 -70998 185366 96128 179348
12488 179348 151280 -77557 -178087 56209 439387 354652 126510 18135 132274 358446
12478 358446 150853 51929 293067 105814 103024 43904 -290537 -80790 86427 32781 -35189
12466 -237278 142420 97356 -2312 -15597 299117 -91044 -193392 -163549 200669 155435 129643
$$ packed form
12543a09249A73990J8779B9277J59613C9893K29102C9525R2229b31370B18140
12532d6567j08981o4403B59279B8894J34792h5476L3703k79258c5221B1861P3595
12521I5456j5919b88730B40226a6326j64848j32039g4243L2775B34107b9876A31568
12509C57641j67179J50605D1888i7888C91278o5656G9876a08652M4226j24793
12499a89219H459c26705A10546n1727b03197N9612A9286g0998A85366q9238Q3220
12488A79348k8068g7557j00530E6209L83178q4735A26510A8135J14139K26172
12478C58446A50853E1929K41138A05814k790D3904b90537h0790H6427C2781c5189
12466b37278A42420m5064b312j3285B99117i1044j02348K9843B00669m5234k5792
$$ plain form
12455 129643 139 -177872 -48911 100233 177363 348176 93504 250898 25762 70376 16883
12443 -11201 -111242 224529 -70929 7518 237468 -87398 -116364 -12598 14596 153292 -34958
12431 115592 8678 83525 -96214 -93269 -128941 270582 43013 80657 244454 48910 31635
12420 31635 278938 57291 189511 214421 14420 -144944 -306541 -358098 324172 75627 -34161
12408 122035 -1753 24825 397073 -303317 -57574 59853 -42727 174414 61388 -96845 -22841
12396 -42688 -17911 274500 104302 82555 -78137 15020 181463 168066 78670 113918 -1127
12384 317883 -140054 158226 -73773 -327570 200255 220049 -138513 -175716 114897 80870
12374 80870 -6894 -332169 -68917 -219124 48022 265742 -372766 -4590 59851 -26820 289676
$$ packed form
12455A29643A39a77872d8911A00233P7130J70813I3504J57394B5762M4614A6883
12443a1201j00041B24529g0929G518K29950h7398k8966a2598A4596J38696c4958
12431A15592H678P4847i6214K945l5672B70582D3013L7644J63797D8910j7275
12420C1635K47303E7291J32220K4910A4420a44944j61597n1557C24172G5627c4161
12408A22035a753B4825L72248c03317e7574E9853d2727A74414F1388i6845b2841
12396d2688a7911B74500A04302k1747g8137A5020J66443j3397G8670L5248a127
12384C17883a40054A58226g3773k53797B00255J9794a38513l7203A14897l4027
12374H0870f894l25275f8917j50207D8022K17720c72766d590E9851b6820B89676
$$ plain form
12362 -134477 113910 -198806 333182 -49438 129697 -200232 63853 -169317 260511 -105013
12351 75947 172291 78068 227190 131365 -168519 94535 -323929 221299 -58392 -26467 -124747
12340 -124747 11011 -202838 157684 14626 -37585 186972 25380 6189 -70304 93349 -233733
12328 -72057 25377 157374 119469 -5916 96327 198840 -348688 -159923 102694 233457 163855
12317 163855 174274 -135590 -53574 307074 143017 -31494 -91216 207410 -355816 170425
12306 -8502 2897 -171609 144906 101485 99337 -283111 203851 79825 433379 296710 -50335
12294 10009 -139127 -176717 -60105 -9646 -228787 171806 339018 8519 210591 251620 -31142
12282 112640 120512 294558 -303153 33303 -104773 366213 240682 21368 88571 -37307 -115812
$$ packed form
12362a34477A13910a98806C33182d9438A29697b00232F3853a69317B60511a05013
12351G5947R6344G8068J49122r5825a68519I4535c23929B21299e8392b6467r8280
12340a24747A1011b02838A57684A4626c7585A86972B5380F189g0304I3349b33733
12328g2057B5377J31997l7905e916I6327J02513c48688a59923A02694J30763o9602
12317A63855J0419a35590e3574C07074A43017c1494n9722B07410c55816A70425
12306h502B897a71609A44906m3421k148b83111B03851G9825L53554j36669e0335
12294A0009a39127l7590f0105i646k19141A71806J67212H519K02072M1029c1142
12282A12640P872J74046c03153C3303a04773C66213j25531B1368O7203c7307p8505
$$ plain form
12271 -115812 -297639 178873 12924 190468 245462 -25090 -103159 194674 18538 143875
12261 143875 264403 270606 255329 117203 -159871 117858 63625 28923 -244674 124887
12250 382023 -223467 14957 378896 -756 -81039 -11139 113621 405146 304336 410479 223747
12239 223747 112861 260758 79745 120033 -109561 82802 -125382 361506 284046 27088
12228 95052 287582 -57140 300813 104941 338300 199564 248963 32911 336191 102202
12217 361489 279162 -33154 353813 445100 -206186 143798 87593 317818 267031 -17734 605672
12205 434241 295794 181755 159029 19096 68253 434538 505917 307899 217028 -76131 163252
12193 424999 204714 283205 322830 203521 553543 289793 153549 217374 343212 52986
$$ packed form
12271a15812j81827A78873A2924J77544N4994b5090p8069A94674A8538J25337
12261A43875J20528O203j5277A17203a59871A17858n4233B8923b44674A24887
12250C82023b23467A4957L63939g56q0283a1139A13621K91525j00810J06143j86732
12239B23747j10886J47897G9745M0288a09561H2802a25382C61506p7460B7088
12228I5052J92530e7140C00813A04941K33359j38736M9399C2911L03280A02202
12217C61489q2327c3154C53813R1287b06186A43798n6205K30225n0787a7734F05672
12205D34241j38447j14039k2726A9096M9157L66285P1379j98018r0871g6131A63252
12193D24999B04714P8491L9625j19309L50022k63750j36244O3825J25838E2986
$$ plain form
12182 -33865 203924 182458 318418 3139 -112272 1236 313325 -49901 290471 -207873 -47165
12170 -23817 -133242 320795 124326 226450 341787 166864 400917 377084 193003 285022
12160 285022 -138109 284636 218997 138714 134903 -11888 129834 -159997 174093 31155 64405
12149 64405 -54557 103981 8219 -66804 298568 375483 189632 116168 444160 -14309 191909
12137 156662 259064 124904 -185045 155473 61156 188909 266248 354289 204816 25741
12126 390217 59598 -283906 23028 104987 -140356 -108678 154199 222155 -44541 391312 182116
12114 23716 210737 334273 111587 -28213 -14986 -87433 262264 101577 63250 18361 -162472
12102 -221597 295074 187131 16867 -258103 128870 -57465 264331 -32810 -15353 99857
$$ packed form
12182c3865B03924k1466J35960C139a12272A236L12089d9901B90471b07873d7165
12170b3817j09425C20795A24326J02124J15337A66864K34053k3833j84081R2019
12160B85022a38109B84636o5639q0283l811a1888A29834a59997A74093C1155L3250
12149F4405e4557A03981H219f6804B98568P6915j85851p3464L27992a4309A91909
12137A56662J02402A24904a85045A55473F1156J27753P7339Q8041j49473B5741
12126C90217E9598b83906B3028Q1959a40356L1678A54199O7956d4541C91312A82116
12114B3716J87021J23536A11587b8213J3227p2447B62264A01577l8327A8361a62472
12102b21597B95074j07943A6867b58103A28870e7465B64331c2810a5353I9857
$$ plain form
12091 -227088 -87279 -42647 -133903 70704 43408 224842 65698 18843 136584 99161 167225
12080 167225 -24451 293908 -296962 -119958 83236 -1481 174189 92855 -199442 -167256 -89197
12069 -89197 72148 138011 -115834 -34276 32859 -176203 88842 -227299 -215213 -216055 272408
12057 -203969 -324426 192654 99861 -2888 56743 292213 -224603 106333 36773 353612
12047 353612 -307310 -216458 46523 22267 -1554 -36243 -99999 -223563 -284838 128330 55398
12035 -37982 -76345 -166190 -114350 -223938 -70120 -179749 25331 -70556 -96812 -157696 -144758
12024 -144758 185149 270794 24768 -48661 110760 -92717 -118012 1869 58649 59896 -153387
12012 -184351 -338112 74812 93772 64742 41581 -103670 -7007 -118414 -84211 -203157 158955
$$ packed form
12091b27088h7279d2647r1256G0704k7296J81434F5698A8843J17741l7423O8064
12080A67225b4451B93908b96962a19958H3236a481A74189q1334a99442L2186P8059
12069h9197G2148O5863a15834c4276C2859a76203H8842b27299J2086q42B72408
12057b03969j20457A92654r2793b888E6743K35470b24603A06333C6773L16839
12047C53612c07310R0852D6523B2267a554l4689o3756j23564o1275A28330E5398
12035c7982l8363q9845N1840j09588g0120j09629B5331g0556k6256o0884J2938
12024a44758A85149Q5645B4768d8661A10760i2717k5295A869N6780J247a53387
12012a84351j53761G4812J8960k9030k3161a03670g007j11407L4203j18946A58955
$$ plain form
12000 -242503 8070 -80581 -296629 -99901 -415356 -55719 -266061 -139660 99164 -404937 -50306
11988 227416 -381031 -155251 -171227 -210913 -110824 -262790 -227005 55540 -5376 25441 110409
11977 110409 143328 5653 201467 -5514 43186 41025 -9226 -273982 -370721 181322 176890 -208797
11964 -66609 129535 -67270 78458 1603 -405234 -116950 -273414 14068 -112760 308887 -116708
11952 -319552 182568 38004 -175396 105602 145681 140133 -17554 -309773 2374 -307214 78773
11940 413389 -76271 171975 -118630 -310642 202700 170605 346029 -24161 206249 -205959
11929 -56826 103891 -90281 -153051 85291 -169901 -56685 -203670 158227 100108 -66620 -150905
11918 -150905 15787 116083 -36813 -5186 58602 -146606 -42139 48302 -139410 -202882 199852
$$ packed form
12000b42503H070h0581k16048i9901l15455e5719k10342J26401I9164d04937e0306
11988B27416c81031a55251j5976l9686J00089j51966L5785E5540e376B5441Q4968
11977A10409L2919E653J95814e514D3186k161i226k64756r6739A81322m432b08797
11964f6609A29535f7270G8458A603d05234a16950j56464A4068a12760C08887a16708
11952c19552A82568C8004a75396A05602M0079n548a7554k92219B374c07214G8773
11940D13389g6271A71975a18630j92012B02700l2095J75424b4161B06249b05959
11929e6826A03891i0281o2770H5291a69901e6685j46985A58227n8119f6620q4285
11918a50905A5787J00296c6813e186E8602a46606d2139D8302a39410o3472A99852
$$ plain form
11906 274024 -90885 361784 -226499 -147368 125446 -354537 -131399 2948 -226316 11282
11895 170682 -2989 -61469 149080 -339586 97642 -88575 108410 -23258 -212910 -7634 67977
11883 147227 78261 301167 83133 -142509 -208517 -235830 239402 502 13792 -231177 204823
11871 -87033 73990 85631 -116755 -367195 51456 -215976 -323990 -217165 50454 151503
11861 151503 -214364 123199 27188 303112 300797 -104647 -131273 -287712 -266577 -369072
11851 -369072 44990 48251 -26077 -314515 212073 -36085 -301013 126396 -269826 -872 23617
11839 -264746 -124883 -95945 -280127 -149566 -3386 140396 -182036 8876 26180 24911 -98036
11827 -61689 298686 -267894 -2142 172783 -153206 -237257 121220 -35053 -40561 -467559 -290490
$$ packed form
11906B74024i0885C61784b26499P9131A25446c54537a31399B948b26316A1282
11895A70682b989n8480A49080c39586I7642h8575A08410b3258j89652g634F7977
11883A47227o8966K22906H3133a42509o6008k7313B39402E02J3290b31177B04823
11871h7033G3990J1641a16755k50440E1456b15976j08014J06825E0454J01049
11861A51503b14364A23199B7188K75924k315a04647k6626j56439K1135j02495
11851c69072D4990L261b6077k88438B12073c6085k64928A26396b69826h72B3617
11839b64746a24883K8938j84182J30561c386A40396a82036H876J7304j269i8036
11827f1689B98686b67894b142A72783a53206q4051A21220c5053n508m26998J77069
$$ plain form
11816 -290490 -110904 -213028 -10588 -132359 -101467 -130069 -255903 -73637 -343833 -351790 19915
11804 -231680 157241 -291870 55256 -3002 -225058 -300146 -53989 177313 39129 259244 38566
11792 -320126 -62552 258905 87863 161729 -56453 -185629 34964 -242032 -169323 128608 -403388
11780 221549 -72148 170258 61363 27361 -126403 -75578 -173310 -104935 -133316 208069 214209
11769 214209 -71754 44600 -495822 -41829 -125941 -112035 193174 80 -68175 -153748 -117721 -222431
11757 -222431 69668 -24840 118363 170503 -183736 75947 -96123 -144653 -51844 339719 362074
11746 362074 -172560 55234 83849 -101167 -78435 63480 -514228 -101162 -253988 33396
11735 -296086 15433 -393280 -152209 -272200 -17259 160432 -77399 -31446 -250933 -380346
$$ packed form
11816b90490a10904j02124a0588j21771L0892k8602j25834g3637k70196p957A9915
11804b31680A57241b91870E5256c002k22056p5088e3989A77313C9129K20115C8566
11792c20126f2552B58905H7863P3866e6453j29176C4964b42032P2709A28608d03388
11780B21549g2148A70258F1363B7361a26403N0825r7732O8375k8381B08069O140
11769B14209g1754D4600d95822d1829q4112J3906A93174H0f8175q5573L6027j04710
11757b22431F9668b4840A18363N2140a83736G5947i6123m8530e1844C39719K2355
11746C62074a72560E5234K8615a01167K2732F3480e14228a01162j52826C3396
11735b96086A5433c93280a52209j19991a7259A60432g7399c1446k19487j29413
$$ plain form
11725 -380346 -157163 101650 -124526 192028 -36014 -306459 -6789 40003 -143389 -109938
11715 -109938 -307535 -81391 189893 -148535 -81035 58891 -54615 69591 45637 73903 -423736
11703 121461 -95841 -353037 -17793 -52719 9481 3825 -172049 157438 -172553 22314 -13954
11691 -201442 134644 128986 -58989 69765 -185525 104902 -250105 -324655 173758 -336558
11680 -37072 -39151 -249861 -185867 -54055 -219739 -96213 12509 -25769 -81913 4027 -98484 -151652
11668 -151652 17187 -36617 158135 154138 -284806 -550508 159713 264600 -298889 -192431
11658 -192431 223455 -25647 -238807 192531 34232 -24759 -37626 217858 -212072 -5267 -16686
11647 -16686 12642 -266268 55383 -360487 -54071 -143518 -49375 -187069 112940 146250 -265971
$$ packed form
11725c80346a57163A01650a24526A92028c6014k70445f789D0003a43389L3451
11715a09938j97597h1391A89893a48535O7500E8891e4615F9591k3954K8266d23736
11703A21461i5841k57196a7793l4926I481C825a72049A57438a72553B2314a3954
11691b01442A34644n658e8989F9765a85525A04902b50105p4550A73758c36558
11680c7072k079k10710O3994e4055j65684i6213A2509b5769n6144D027i8484n3168
11668a51652A7187c6617A58135l997b84806k65702A59713J04887b98889J06458
11658a92431B23455b5647k13160A92531C4232b4759j2867B17858b12072e267j1419
11647a6686A2642b66268E5383c60487e4071q9447d9375j37694A12940L3310b65971
$$ plain form
11635 -97259 86302 300994 13422 -2201 35448 -193452 142268 -189662 -258401 17205 -307138
11623 229324 -211406 68596 -117025 143693 93 -51262 -92996 191560 -209855 -144909 180115
11611 58945 -277567 59445 287527 -64264 147779 45261 173558 -105630 68993 -409867
11600 -159153 29960 110741 -15938 -126901 81143 -332177 209064 -174160 38196 -100504
11589 323462 -127646 269621 80302 -213990 4623 -244031 -294240 187352 -164446 144867
11578 81145 167759 103796 57984 -203384 -42044 -195611 -83126 -154800 -133565 104841 142646
11567 142646 -27484 275565 163975 -5871 207552 323927 -97111 121198 -445280 -76913
11556 19526 -144038 319037 -21404 460990 -29436 118791 -291940 -247942 -338192 -86205 254977
$$ packed form
11635i7259H6302K14692A3422b201C5448a93452A42268a89662o8739A7205c07138
11623B29324b11406F8596a17025A43693I3e1262m1734A91560b09855O4946A80115
11611E8945b77567E9445K28082f4264A47779D5261J28297a05630F8993d09867
11600a59153B9960Q0781a5938j10963H1143c32177B09064a74160C8196a00504
11589C23462a27646B69621H0302b13990D623b44031n0209A87352a64446A44867
11578H1145Q6614o3963m5812b03384d2044j53567h3126p1674K1235A04841L7805
11567A42646b7484B75565j11590e871B07552J16375i7111A21198d45280g6913
11556A9526a44038C19037b1404D60990b9436A18791b91940M3998r0250h6205B54977
$$ plain form
11544 -407431 -3534 52080 127147 207314 -54567 -112837 -346663 -121906 -104247 -33929 21706
11532 35170 119395 -46985 206300 305319 -8063 4571 -77430 74526 185401 300742 172141
11521 172141 -13033 82296 -140517 159849 418524 -248896 6574 75622 241919 147138 284351
11510 284351 85383 -42687 -61164 104053 73074 -199659 130991 81858 101391 -18092 164126
11498 196973 167590 -13062 -243717 257685 -292448 202301 25351 124457 79086 155711 171176
11487 171176 229253 382379 60576 -13950 170483 183688 51612 171669 43466 77070 -123155
11475 238647 -73452 -58234 43282 -52383 -74464 557929 -127103 247044 58182 304259 92228
11463 392413 166104 168268 174029 142121 167955 264040 -59056 321077 321923 93385 276150 -292023
$$ packed form
11544d07431c534E2080P5067Q0167e4567n8270k33826a21906J7659c3929B1706
11532C5170Q4225d6985B06300R9019h063D571g7430G4526J10875J15341j28601
11521A72141a3033H2296a40517A59849K58675b48896F574O9048J66297r4781J37213
11510B84351H5383d2687j8477A04053l0979a99659A30991m9133J9533a8092A64126
11498A96973k9383a3062k30655B57685b92448B02301B5351R9106m5371P6625J5465
11487A71176N8077J53126F0576a3950A70483J3205E1612J20057D3466L3604a23155
11475B38647g3452J5218D3282e2383k2081E57929a27103B47044E8182K46077I2228
11463C92413A66104K164N761l1908K5834R6085e9056C21077Q46I3385J82765b92023
$$ plain form
11450 -117008 169620 -48097 -35302 451490 36 -41161 3711 95845 201691 -34248 -24468 331742
11437 180942 -128799 -286714 -227261 141278 -59053 300106 174693 22822 86693 219213
11427 219213 -199806 -48289 113500 88046 -243311 -18474 -14642 -43329 -251037 -47364 -24532
11416 -24532 44806 235791 -220048 445732 -73376 -106109 -199603 124665 194924 -135490 -204048
11405 -204048 95942 4084 -88549 75696 -318372 44756 -47592 60139 -161716 28729 -187618
11393 104975 134982 91812 -122337 -76807 -142158 -89455 196364 -157434 54478 61896 214479
11382 214479 -257001 85740 -152073 -7992 -189354 54094 53909 -216165 27479 -305054 121051
11370 21754 170497 -21145 48609 -51153 69457 -71385 167370 -79447 -38882 38244 99485
$$ packed form
11450a17008A69620d8097J2795D51490C6d1161C711R2134J05846c4248R780C31742
11437A80942a28799j57915N9453A41278e9053C00106j25413B2822O3871J32520
11427B19213a99806d8289A13500k5454b43311a8474L832k8687k07708d7364K2832
11416b4532D4806J90985b20048D45732g3376l2733r3494A24665P0259a35490o8558
11405b04048I5942D084h8549G5696c18372D4756d7592F0139a61716B8729a87618
11393A04975L0007m3170a22337M5530o5351N2703A96364a57434E4478P418J52583
11382B14479b57001H5740a52073g992j81362E4094j85b16165B7479c05054A21051
11370B1754J48743b1145D8609e1153F9457g1385A67370g9447c8882C8244O1241
$$ plain form
11359 99485 -116108 168682 57531 47116 -261294 -89658 82832 -18603 95842 -169243 -110592
11348 -110592 -81623 -49256 29993 20098 4761 -178953 76239 -330961 57315 -295783 -476367
11337 -476367 -83260 137761 -23447 -130179 -21983 177614 -263803 -39772 23264 -22602 -222937
11326 -222937 313904 -223152 -77626 77661 -57100 -160022 56767 -162810 -188232 -83229 -16335
11314 220469 28208 63487 -84666 25727 -187181 -188200 80642 -21538 -172493 -64808 -157180
11303 -157180 -295599 -60266 -223999 39161 37702 -263133 -288156 -133971 10131 110701 -128200
11291 -158974 -217346 -25263 -29745 423735 -206511 -5834 -42811 -273840 -52136 -77536 331284
11279 -115449 10799 20768 -37324 -37576 -93291 -109135 -267573 47708 205104 -30848 -282235
$$ packed form
11359I9485a16108A68682E7531j0415b61294h9658H2832a8603I5842a69243N8651
11348a10592K8969L2367B9993r895D761a78953G6239c30961E7315b95783j80584
11337d76367h3260A37761b3447j06732b1983A77614b63803c9772B3264b2602k00335
11326b22937C13904b23152g7626G7661e7100j02922E6767a62810k5422h3229a6335
11314B20469B8208L5279h4666B5727a87181j019H0642b1538j50955f4808r2372
11303a57180j38419f0266j63733C9161j459b63133k5023a33971A0131J00570a28200
11291a58974n8372b5263m482D23735b06511e834l6977k31029e2136k5400C31284
11279a15449A0799R969c7324k52n5715j5844j58438D7708J57396c0848k51387
$$ plain form
11268 -282235 -234713 231816 76331 -153144 -34183 38715 -169959 62389 -90258 -75817 -69356
11257 -69356 101799 -329455 46925 58888 -24573 -361872 -166612 71353 -51153 69440 47436
11246 47436 -245151 126286 -202937 54594 -136195 -76200 26765 -28867 -78042 -299853 -160673
11235 -160673 -7903 -60357 -139986 608 -330818 -57601 22694 -433108 170992 -192693 -40176
11223 46106 204992 469462 -55650 26599 -207066 226729 -116386 -148061 19490 194135
11213 194135 -195458 -81473 -69504 -167428 -13456 121385 238666 -96490 5143 -530972 -352991
11202 -352991 123237 -46997 -53044 144593 -12418 16916 181246 -61643 -143839 98919 282216
11191 282216 88907 -374850 478497 6682 -153281 -296272 9298 -243321 228419 96154 -137642
$$ packed form
11268b82235M7522B31816G6331a53144c4183C8715a69959F2389i0258J4441O461
11257f9356A01799c29455D6925J1963b4573l37299a66612G1353e1153F9440k2004
11246D7436b45151A26286b02937E4594a36195N9995B6765b8867m9175k21811J39180
11235a60673g903n2454p9629F08c30818e7601B2694d33108A70992a92693d0176
11223D6106J58886K64470e5650B6599b07066B26729a16386l1675A9490J74645
11213A94135a95458h1473J1969r7924a3456A21385J17281i6490E143e30972J77981
11202c52991A23237d6997o047A44593a2418A6916J64330f1643q2196I8919J83297
11191B82216H8907c74850D78497F682a53281j42991I298b43321B28419I6154a37642
$$ plain form
11179 -77073 67342 -80179 -165620 70951 -126038 -341983 104289 -17570 90492 103466 41077
11167 40728 -92448 -209370 -47095 18725 58216 105336 205339 39146 144541 -70801 176439
11155 -82744 295001 -20524 125529 -53104 -82793 34955 -254 -259279 6831 -306056 194385
11143 -10031 -146333 86269 164572 1395 -235214 155393 -86576 335116 94572 -187635 -204593
11132 -204593 58197 49955 -187032 -76940 -136842 -197626 -94967 193592 246435 269449 -125553
11120 -265349 296339 136768 -91483 49836 65393 -194926 -28424 373360 260029 213204
11110 213204 148032 -35946 -60113 -120321 2325 72015 -197864 -80636 384705 104446 188060
11099 188060 225068 82040 1815 120742 16703 -10593 289884 446772 -32230 369308 41079
$$ packed form
11179g7073F7342h0179q5441G0951a26038k15945A04289a7570I0492J2974D1077
11167D0728i2448j16922d7095A8725L9491M7120J00003C9146J05395g0801A76439
11155h2744B95001b0524A25529e3104k9689C4955b54k59025F831c06056A94385
11143a0031j36302H6269P8303A395b35214A55393h6576C35116I4572a87635j6958
11132b04593E8197q242a87032g6940n9902o0784i4967A93592N2843K3014a25553
11120b65349B96339A36768i1483D9836J5557a94926b8424C73360j13331m6825
11110B13204o5172c5946k4167o0208B325O9690a97864h0636C84705A04446Q3614
11099A88060L7008H2040A815J18927A6703a0593B89884J56888c2230C69308D1079
$$ plain form
11087 92709 31326 108319 253632 688305 195176 199491 278472 485706 199643 354750 128740
11075 187638 226375 251657 121902 118778 6448 307123 338518 266175 422701 301559 553494
11064 553494 421544 613983 250943 791173 627625 579178 481190 255649 472552 726794
11054 726794 464563 805798 803693 450184 469794 857399 656596 241556 837783 573633
11044 573633 351679 640484 1062294 1133435 1078192 1109661 930742 512684 875390 710962
11034 710962 934771 996311 867290 813120 968924 649422 996674 885718 903566 1070974
11024 1070974 1207461 809685 874458 891920 751034 791013 920602 381848 646320 756396
11014 756396 847185 620964 587924 632021 770542 838934 523789 595674 589702 609051 792060
$$ packed form
11087I2709C1326P6993J45313M34673A95176M315P8981K07234A99643J55107A28740
11075A87638L8737K5282A21902l124F448L00675L1395p2343J56526j21142K51935
11064E53494j31950J92439B50943N40230j63548m8447r7988k25541K16903K54242
11054G26794k62231L41235k105l53509J9610L87605k00803B41556N96227k64150
11044E73633k21954K88805M21810P1141n5243L1469j78919m18058L62706j64428
11034G10962K23809O1540j29021n4170J55804l19502L47252j10956J7848J67408
11024A070974J36487l97776O4773J7462j40886L9979J29589C81848K64472J10076
11014G56396R0789k26221l3040M4097J38521O8392l15145P1885n972J9349J83009
$$ plain form
11003 792060 527347 933936 857686 997718 855651 652056 770068 410996 681648 561480
10993 561480 549254 381566 663610 277677 1196955 761501 368176 845777 1383164 1464382
10983 1464382 1067412 1251182 1077160 1061208 1024539 937375 1162758 1681288 1516832 1595440
10973 1595440 1879503 2043639 2875685 2529513 2642694 3359934 3392173 3302706 3211155 3154687
10963 3154687 2918385 2170241 2007924 1432393 1161913 1046202 1039125 878704 1119940 1025593
10953 1025593 865730 704240 690364 392371 322064 416916 172204 554318 471188 22011
10942 -2569 337488 231850 94776 190453 14924 64270 66134 -20133 123831 257933 218305
10931 218305 183951 136147 -259030 341895 -41394 -23195 -221965 -56763 199513 24213 257005
$$ packed form
11003G92060k64713M06589p6250J40032j42067k03595J18012l59072K70652j20168
10993E61480j2226j67688K82044B77677R19278m35454C68176M77601N37387Q1218
10983A464382l96970J83770j74022j5952l6669q7164K25383N18530j64456P8608
10973A595440K84063J64136Q32046l46172J13181P17240L2239q9467r1551n6468
10963C154687k36302p48144j62317n75531k70480j15711p077j60421K41236r4347
10953A025593j59863j61490j3876k97993p0307R4852A72204L82114q3130B2011
10942b569C37488j05638I4776R5677A4924M9346J864b0133A23831J34102l9628
10931B18305l4354m7804b59030C41895d1394J8199j98770e6763A99513B4213K32792
$$ plain form
10920 257005 63294 -19245 107526 -93200 -234725 -174450 269157 -17478 -53572 -406178 -6181
10908 -233695 -57919 -149184 182060 -65205 -187748 207527 -33407 167238 3625 71443 -199748
10896 21776 -105645 -147548 40824 -183123 -36880 117876 184693 312059 36438 -119763 69156
10884 -424149 32345 79375 97982 79066 53646 -76971 159417 122463 -32347 -14769 -300251
10873 -300251 13910 163129 149716 -476364 -200729 -111712 -232901 167791 183117 -403884
10862 -128643 -320118 -59824 20471 50261 111648 -164744 -113606 55143 -323059 167772 185668
10851 185668 -113689 160074 7586 76461 -183284 -295265 -97165 -163488 -306219 -155320
10841 -155320 -206141 1488 22847 -220460 112407 -19677 -295450 107420 20124 252494 -235774
$$ packed form
10920B57005F3294a9245A07526i3200j41525O0275B69157a7478l6094l52606f181
10908b33695e7919r1265A82060f5205j22543B07527c3407A67238C625O7818a99748
10896B1776a05645m1903D0824a83123c6880A17876O6817J27366C6438a19763F9156
10884d24149C2345M7030J8607j8916k5420g6971A59417l6954c2347a4769k85482
10873c00251A3910J49219j3413d76364b00729Q9017j21189A67791J5326d03884
10862a28643j91475e9824B0471K9790O1387a64744N1138E5143c23059A67772J7896
10851A85668a13689A60074G586O8875a83284j11981i7165o6323j42731J50899
10841a55320n0821A488K1359b20460A12407a9677k75773A07420B0124K32370b35774
$$ plain form
10829 165775 -376197 -626261 -142109 -175111 18308 37952 19644 27418 407869 -87177 147981
10817 25774 -269372 -69511 165872 197230 -17011 126695 -70607 -268167 348889 62947 -56358
10805 -180512 66035 -266890 -133739 27612 6396 -225629 139799 125126 -84320 282951 43189
10793 -338117 -164665 -175732 34374 -182690 108319 -235912 -132337 116310 -264327 -154983
10783 -154983 -220922 -215568 -40299 271722 238490 -174944 -184171 -326278 26655 -66343 7010
10771 216208 15168 66057 253878 109065 -19984 -178078 -136254 -272314 358480 73026
10760 -151944 -83275 -211587 58633 21818 -21697 -130663 -112963 -13213 -134918 -91312 -196617
10749 -196617 151063 -63778 -123231 -271766 -186163 -79929 73222 -230796 -227778 -211375 -125646
$$ packed form
10829A65775c76197k50064a42109l3002A8308J9644j8308P774L80451h7177A47981
10817B5774b69372f9511A65872L1358a7011A26695g0607j97560C48889F2947e6358
10805a80512F6035b66890J33151B7612F396b25629A39799j4673h4320B82951D3189
10793c38117a64665j1067C4374a82690A08319b35912J03575A16310b64327J09344
10783a54983o5939N354d0299B71722l3232a74944r227j42107B6655f6343G010
10771B16208A5168N0889J87821A09065a9984j58094M1824j36060C58480G3026
10760a51944O8669j28312E8633B1818b1697j08966J7700a3213j21705M3606j05305
10749a96617A51063f3778n9453j48535Q5603g9929G3222b30796L018J6403Q5729
$$ plain form
10738 -125646 -218604 -199635 97007 -11348 175295 84341 -41283 -124673 144956 56222 -232381
10726 87992 -124845 -190549 142000 55832 -133551 -72575 -17255 -22397 -166560 -281600 166982
10714 -119863 153811 -120647 238356 49991 27103 -71898 -64487 -67994 -225775 -202188 -32791
10702 -8340 183103 118210 -110998 -110761 169375 -157116 -124190 -96181 -83682 -233139 -164124
10691 -164124 -148515 -68771 127306 -194619 -3763 -82235 -145061 -251273 -55385 -341003 -249004
10680 -249004 -84224 163484 -120720 -258314 5313 86486 -28639 71351 -61648 -378303 339264
10668 179252 -62403 -146977 -2960 -6790 68488 -70321 -213767 -95051 -12414 -247022 -23815
10656 -345749 -123653 111890 99960 -28687 109597 -208979 -82057 31824 -23903 232339
$$ packed form
10738a25646r2958J8969I7007a1348A75295H4341d1283q3390A44956E6222b32381
10726H7992a24845o5704A42000E5832a33551O0976a7255n142j44163j15040A66982
10714a19863A53811a20647B38356D9991k2888g1898P411l507j57781K3587c2791
10702h340A83103o4893a10998K37A69375a57116L2926K8009J2499j49457O9015
10691a64124J5609f8771A27306a94619c763p8472o2826j06212e5385k85618R1999
10680b49004h4224A63484a20720j37594E313Q1173b8639G1351f1648l16655C39264
10668A79252f2403q4574b960l830F8488g0321j43446i5051a2414k34608b3815
10656c45749a23653A11890j1930b8687A09597b08979h2057C1824b3903B32339
$$ plain form
10645 -126696 207356 -370168 132036 74177 11280 -134682 -227467 24702 -104063 -77472
10635 -77472 -81287 -23959 -126041 204604 -303999 -215934 -159795 -244016 85115 -13751 319104
10623 -384945 -162775 -144695 -136948 -363685 38452 3930 57552 116296 42742 -80573 -319257
10612 -319257 -45029 -82353 -106264 -158284 -120072 222240 212996 -66306 15617 -258257 22736
10600 311177 -499409 -170144 -65431 -344642 -39395 33660 -46410 -152587 21414 145273
10590 145273 -100351 13819 133310 -321022 -219995 -218317 -84173 4883 -119754 -12450 -367854
10579 -367854 17441 -157991 192586 52461 35253 302680 -27970 18607 173231 -82480 330693
10567 16681 -123090 -51358 114034 33974 -134163 -78408 -113046 185820 -311690 -146458
$$ packed form
10645a26696B07356c70168A32036n7859A1280a34682r2785B4702a04063K6591
10635g7472l815b3959j02082B04604c03999Q8065N6139q4221H5115a3751C19104
10623c84945a62775J8080P747k26737C8452C930N3622N8744D2742h0573k38684
10612c19257d5029l7324k3911n2020L8212B22240r244f6306A5617b58257B2736
10600C11177d99409a70144f5431k79211c9395C3660d6410j06177B1414J23859
10590A45273a00351A3819J19491c21022J01027J678h4173D883a19754a2450l55404
10579c67854A7441a57991A92586E2461j7208K67427b7970A8607J54624h2480C30693
10567A6681a23090e1358A14034C3974a34163N5755l4638A85820c11690a46458
$$ plain form
10556 -22292 -117551 -183301 108705 -89065 -147341 -39232 57805 102614 -106126 -40547 204077
10544 88709 -103233 80446 -306852 16558 -69215 219587 156796 -57413 39953 -338790 109540
10532 -154016 10473 -60478 12287 -195225 130875 -15672 -362630 94364 -147872 88315 -84387
10520 -282505 -48199 -267728 -217492 -299606 -229716 -465851 -26977 208836 346405 290769 -26607
10508 191187 78639 -229377 -162836 -31577 183884 -20883 -160914 -469209 -93270 171336
10497 -249968 -122369 80812 144263 -121062 289056 -62339 -262422 -99600 -112004 183805
10486 144515 -194000 -309044 210199 263573 -226669 18888 -72088 -17846 22657 -229541
10475 -163642 109921 -5326 -150080 -329169 -230292 -29967 -269539 -86377 391576 154740
$$ packed form
10556b2292r5259o5750A08705h9065n8276c9232E7805M4809a06126d0547B04077
10544H8709a03233H0446c06852A6558f9215B19587o2791e7413C9953c38790A09540
10532a54016A0473f0478A2287a95225A30875a5672l46958I4364a47872H8315h4387
10520b82505d8199k19529N0236q2114O9890k36135b6977B08836J37569n5636b6607
10508A91187G8639b29377O6541c1577A83884b0883j40031l08295i3270A71336
10497b49968a22369H0812O3451a21062B89056f2339k00083i9600j2404A83805
10486A44515a94000j15044B10199N3374b26669A8888g2088a7846B2657b29541
10475a63642A09921e326j44754j79089R8877b9967k39572h6377C91576A54740
$$ plain form
10464 -217211 -116552 -155130 8040 35477 -275255 102104 41296 -133342 -425874 -90826 -214678
10453 -214678 64418 -361585 -121107 -72018 -46214 38123 -121091 54246 53265 61755 42623
10442 42623 -7029 -107967 -333303 -249409 273062 -188286 -68950 -180 73696 -362089 -77838
10430 156145 -91256 -478959 328225 -24612 277662 65193 12843 -144454 -129136 -56746 -76319
10419 -76319 149524 -81415 -423843 198614 -113401 89466 -250379 200968 -154746 156884
10408 -2053 -52552 68787 3736 -12077 76961 138718 -9931 -27620 -117795 -222723 347016 -177606
10395 -206331 73937 327691 -27691 171177 142120 197216 290088 218079 -267679 251379 308500
10384 308500 -161330 -72216 34956 201883 177430 28157 297808 324989 95264 422462 -102681
$$ packed form
10464b17211J00659l8578H040K7437b75255A02104D1296a33342k92532i0826j23852
10453b14678F4418c61585a21107M9089K5804C8123a21091E4246r81Q490j9132
10442D2623g029j00938k25336Q3894B73062a88286f8950a80G3696c62089g7838
10430A56145i1256l87703C28225b4612B77662F5193A2843a44454J5318e6746j9573
10419g6319A49524h1415l42428A98614a13401H9466b50379B00968a54746A56884
10408b053n0499F8787C736a2077G6961O1757i931j7689r0175j04928C47016a77606
10395b06331G3937K53754b7691A71177k9057N5096R2872p2009b67679B51379N7121
10384C08500a61330g2216C4956J66927k4453B8157K69651K7181I5264L27198a02681
$$ plain form
10372 -35634 573235 271226 368505 -30216 282379 369721 219723 384365 436889 422914 475939
10361 475939 369564 459332 -202887 456990 219654 -135772 218901 171375 -73920 149536
10350 342154 583025 497223 807084 679073 474739 359619 184567 343541 44524 -44397
10339 21269 40833 57827 123573 269445 -88086 192394 272465 148600 -33947 27134 90211
10328 90211 -23863 207438 -4397 226250 34743 414834 30435 305668 367510 632831 85141
10316 180732 -193717 117414 16544 7212 32165 -197778 90119 107608 -318569 34934 -214966
10304 -210241 272019 80952 124657 -110743 30688 120122 202678 -171870 -203089 -189695 -74384
10292 367141 -254335 532955 -12360 291360 141784 270084 -213604 80889 -150833 -18389
$$ packed form
10372c5634E73235B71226R7279c0216B82379Q7342j49998J64642N2524j3975N3025
10361D75939j06375Q9768b02887D56990B19654a35772B18901m7526g3920A49536
10350C42154K40871q5802L09861j28011k04334j15120j75052J58974D4524d4397
10339B1269J9564J6994O5746J45872h8086A92394Q0071j23865c3947B7134O3077
10328I0211b3863B07438d397B26250C4743L80091C0435K75233O1842K65321H5141
10316A80732a93717A17414A6544G212K4953a97778I0119J7489c18569C4934b14966
10304b10241B72019H0952M3705a10743C0688Q9434Q2556a71870l1219J3394g4384
10292C67141b54335E32955a2360B91360A41784J28300b13604H0889a50833a8389
$$ plain form
10281 -521165 -72287 -20226 -46347 -186666 -111100 129761 103964 32127 50807 -288924 -93955
10269 36211 -215419 -41916 113897 93760 95189 120807 53873 -59698 334245 -110198 -245133
10258 -245133 -57760 -137016 43973 -170927 -6897 39924 -210510 183718 -84506 155974 119567
10247 119567 -18683 -141022 115097 179292 164325 -109145 209212 -7290 -70042 -173527 140829
10235 -71708 -209036 -245399 193436 -16957 -102224 -71661 72944 123891 386042 -73477 -19499
10223 -38052 20806 116605 -44706 140832 121632 73189 267237 -145851 -29576 -3457 -58059
10212 -58059 -208811 -245761 -134162 42622 63552 120514 78657 16798 -51593 10988 -260283
10200 108621 -180641 -47870 188447 -141090 229589 -504172 96938 -107372 -59242 -200432
$$ packed form
10281e21165g2287b0226k6121j40319P5566A29761k5797C2127J8680b88924i3955
10269C6211b15419d1916A13897k0137J429K5618E3873e9698C34245a10198j34935
10258b45133e7760p9256D3973a70927f897C9924b10510A83718h4506A55974l6407
10247A19567a8683j22339A15097O4195j4967a09145B09212g290o2752j03485A40829
10235g1708j37328l6363A93436a6957q5267L0563G2944N0947K62151g3477a9499
10223c8052B0806R5799d4706A40832j9200m8443J94048a45851b9576c457n4602
10212e8059j50752l6950J11599D2622K0930N6962m1857A6798e1593A0988b60283
10200A08621a80641d7870A88447a41090B29589e04172I6938a07372M8130j41190
$$ plain form
10190 -200432 -135703 -173314 236109 -193975 11585 -246862 2766 20914 220897 264814 -107503
10178 189542 -107341 -43020 -273055 -169036 254581 -133942 -242803 -243045 -367715 952 -92949
10166 -193588 29225 18872 -25062 42385 99801 257734 -266025 297730 -119585 123982
10155 4073 -340443 -195665 -119355 109601 -234523 -281114 133956 -65517 181141 -161046
10144 -83468 -179930 -96900 7781 108865 54071 154323 -278979 131821 44177 -221162 -94507
10132 23102 350202 -75361 -191507 -49425 127385 182565 148893 5607 227679 -173072 -13130
10120 -378976 -130114 -245253 -59920 158587 12258 27129 -50848 -44598 -159576 4475 -100136
10108 143219 134129 -207080 11760 183099 -1086 -185472 6752 8982 92320 236280 251880
$$ packed form
10190b00432O4729l7611B36109a93975A1585b46862B766J8148J99983M3917a07503
10178A89542a07341d3020k30035J04019B54581a33942j08861k42j24670I52i2949
10166a93588B9225j0353b5062D2385N7416J57933b66025B97730a19585A23982
10155D073c40443J44778P6310A09601b34523m6591A33956f5517A81141a61046
10144h3468r6462Q3030G781J01084E4071J00252b78979A31821D4177b21162i4507
10132B3102L27100g5361j16146d9425A27385N5180l3672E607K22072a73072a3130
10120c78976a30114j15139e9920A58587A2258J4871e0848O250j14978D475a00136
10108A43219r090b07080A1760J71339a086j84386F752K230Q3338J43960J5600
$$ plain form
10097 251880 -65855 -92776 172616 -286343 -95228 -406087 -131612 33343 170830 -251844
10086 -23252 -76377 -30577 123788 -139971 -244821 -213939 -385838 17364 -133688 -225457 -23938
10074 -543409 79363 51944 -230717 16274 -16525 -4922 -268901 -204323 76991 47461 -79839
10062 -212085 -1709 -30427 179263 -72555 -21360 64699 -24935 -139373 -226852 156686 -161946
10050 94834 4394 90814 -257840 -113301 -37026 -255781 -213754 -13327 -293861 -100310 -111572
10039 -111572 -205890 5574 -7064 199881 -48530 -253296 108777 -194607 -201174 -178338 -71874
10027 98211 -157641 67202 -190494 105793 -105535 10137 -2679 -14747 -313592 185801 -306695
10015 -61536 -131588 214250 159592 -183228 -124719 -55304 67016 -182463 -26438 -151417 86499
$$ packed form
10097B51880f5855k6921A72616b86343i5228l10859a31612C3343J37487b51844
10086b3252n3125c0577A23788a39971j04850L0882j71899A7364a33688r1769b3938
10074e43409G9363k7419b30717A6274a6525d922k63979O4578G6991k9530g9839
10062b12085a709k8718A79263g2555b1360F4699b4935j14438q7479A56686a61946
10050I4834D394Q6420b57840a13301c7026k18755M2027a3327k80534a00310j1262
10039a11572r4318E574g064A99881d8530k04766A08777a94607o567K2836g1874
10027I8211a57641F7202a90494A05793a05535A0137b679j2068k98845A85801c06695
10015f1536p0052B14250n4658a83228N8509e5304F7016a82463b6438j24979H6499
$$ plain form
10003 -65493 -77607 353640 245829 -203676 -15186 -110387 -103379 -270558 -223550 28453 -197699
9991 6896 -219508 122279 -87858 16305 207234 234294 -74135 -65058 -266031 158881 -67090
9979 -157065 2410 -241069 -273211 -74318 107493 -125575 24808 189350 -161060 -52132 -219503
9968 -219503 -69995 123295 -144468 -70538 -133196 44298 -138576 -175587 -226825 184566 -242036
9956 -278629 -142528 -132750 -132297 96769 -167121 -318946 -106699 -134005 -299579 -119193 -152265
9945 -152265 68771 206917 -328487 191307 -49566 -335860 -207758 -74577 -113615 -51225 -81733
9934 -81733 173702 -5566 -144480 50013 -3844 142037 -227540 -44909 -393794 298465 -74964
9922 -237266 -25762 161642 -63515 135537 -68168 144369 -91574 329566 -265733 -112503
$$ packed form
10003f5493j2114C53640j07811b03676a5186r5201P008j67179M7008B8453a97699
9991F896b19508A22279h7858A6305J90929K7060g4135R077k00973A58881f7090
9979a57065B410b41069l2142g4318A07493a25575B4808J64542a61060e2132j67371
9968b19503f9995A23295a44468g0538o2658D4298a38576l7011n1238A84566b42036
9956b78629J36101R778M53I6769a67121j51825a06699k7306j65574a19193l3072
9945a52265F8771J38146c28487A91307d9566k86294J28102g4577l9038e1225l0508
9934h1733A73702e566j38914E0013c844A42037b27540d4909l48885B98465g4964
9922b37266b5762A61642f3515A35537f8168A44369i1574C29566b65733a12503
$$ plain form
9911 188053 78115 -82047 -35287 31003 -183682 -178998 -216342 -254990 -109462 -193147 -75171
9899 -110987 27394 -483236 194504 12789 -84234 -124546 -16791 19961 101591 -34647 -232844
9888 -232844 75169 173643 -298366 -139282 -164055 -128588 20786 -514478 124410 -396467 140862
9876 -123190 -72306 86790 -131966 -8941 -28376 -363458 245034 133630 -344367 -101278 122
9864 -83567 -74073 -70923 -159872 -105583 -170018 65269 -460886 -115274 -183246 157586 -48555 -53382
9852 -53382 -27396 265822 -340703 213042 162249 163906 -153866 -195492 40970 260274 -81425
9840 -204610 93852 -15521 -174417 -403546 -359513 -91991 198189 -199760 -218113 -115214 -27508
9828 -163181 -184242 -318903 -113551 -385907 164866 -56458 -232722 -354193 -234251 -350345
$$ packed form
9911A88053G8115h2047c5287C1003a83682M684l7344l8648a09462q3685g5171
9899a10987B7394d83236A94504A2789h4234m0312a6791A9961Q1630c4647j98197
9888b32844G5169R8474b98366a39282k4773L5467B0786e14478A24410c96467A40862
9876a23190N0884H6790a31966h941j9435l35082B45034j11404c44367a01278A22
9864h3567R494L150q8949N4289o4435F5269d60886a15274o7972A57586d8555m827
9852e3382K5986B65822c40703B13042n0793J657a53866m1626D0970K19304h1425
9840b04610I3852a5521j58896k29129M4033i1991A98189a99760j8353J02899b7508
9828a63181k1061j34661a13551k72356A64866e6458j76264j21471J19942j16094
$$ plain form
9818 -350345 -414 59695 -145856 -385582 3165 -8290 216242 160321 -40750 -162980 -197181 35006
9805 -139446 59120 -282571 -1155 76761 -205711 -96569 344236 49228 -60143 -84698 -167159
9794 -167159 35933 130688 30862 3505 -354596 74066 -119063 43519 -167167 -147249 -73584
9782 207140 136043 50630 -268771 -66734 -129918 123739 -181736 -309432 -194915 -237140 -23123
9770 110764 -69730 -1136 -207481 121160 169249 22845 156664 -158534 -50801 -75688 -14708
9758 115292 -209021 -240278 -65555 -121239 -88781 29304 47360 -192752 95484 -38170 130184
9746 94425 -579499 -136795 -213266 -373498 18828 356368 -107582 -21572 -92308 -74852 -75784
9735 -75784 -76418 315491 -221486 29068 -530211 130019 -11725 135933 -137217 -132715 34185
$$ packed form
9818c50345d14E9695a45856k39726C165h290B16242n5921d0750j22230l4201C5006
9805a39446E9120b82571a155G6761b05711i6569C44236D9228f0143k4555q2461
9794a67159C5933R4755C0862C505c54596G4066a19063D3519a67167J9918g3584
9782B07140p1097E0630b68771f6734o3184A23739a81736j27696J14517m2225b3123
9770A10764f9730a136k06345A21160M8089B2845J33819a58534e0801k4887a4708
9758A15292b09021l1257f5555n5684L2458B9304J8056a92752I5484c8170A30184
9746I4425e79499a36795p6471j60232A8828L37540a07582b1572p0736J7456r32
9735g5784o34C15491b21486B9068e30211A30019a1725A35933a37217M502C4185
$$ plain form
9723 -137505 59301 -186735 2828 -45733 53822 -239515 -111194 -8696 -273449 -264123 55081
9711 76496 -28358 108955 -58356 100555 269524 282028 -91370 -181745 29679 -290744 -101428
9699 -297650 -39022 -296721 -74064 225218 -37082 -227996 176781 -9455 -138512 114410 -42398
9687 96313 99779 -178959 122500 -128529 1290 70026 -129931 -150980 206230 -168686 156840
9675 -64160 -90160 -89361 -128524 -382748 -58484 -164681 477707 -108064 -480569 -61944 -12435
9663 -135961 102530 -273484 124937 -38056 -126311 -205264 160228 -217440 -198084 -21751 -227021
9652 -227021 -23094 -337727 -412211 -58907 -161129 -122800 222232 9135 142352 -513505 -445408
9641 -445408 -137544 270465 -198098 -118576 -308212 -360616 -186112 -208175 -97461 -136119 -30346
$$ packed form
9723a37505E9301a86735B828d5733E3822b39515a11194h696k64753R326E5081
9711G6496b8358A08955e8356A00555J68969J2504i1370r0375B9679b90744a01428
9699b97650c9022k57699g4064B25218c7082j90914A76781i455j29057A14410d2398
9687I6313L466a78959A22500a28529A290O8736a29931k1049B06230a68686A56840
9675f4160k6000P99l9163k54224e8484j06197D77707a08064l72505f1944a2435
9663a35961A02530b73484A24937c8056q8255p8953A60228b17440J9356b1751k05270
9652b27021b3094l14633p4484e8907j02222L8329B22232I135J33217e13505O8097
9641d45408a37544B70465a98098P9522j89636n2404J74504k2063i7461l8658c0346
$$ plain form
9629 -153832 -3783 -249331 -153899 -647445 -83050 50456 -370787 -159811 -160205 24709 13611
9618 13611 -59133 133119 -138192 64062 60304 -68429 7622 -120088 -233670 -123658 -187614
9607 -187614 -248399 134928 81073 -121278 -213041 105625 -71465 120803 172616 -32957 33193
9595 199403 58456 56438 -111674 131966 -23239 330601 -252346 -137396 -203648 -270616 116154
9583 -37089 -344132 -108772 -240593 -93228 355866 -21891 331240 -11136 255350 -29037 -436715
9572 -436715 -175729 12209 -232741 128005 174639 -184902 -126563 -204958 -124607 66410 135607
9561 135607 -98472 82263 -127593 -122300 64723 -203319 -236632 -10288 195921 -34104 -158687
9550 -158687 -334403 -194276 -143032 30000 113627 24993 25346 82554 -174034 90414 -213071
$$ packed form
9629a53832c783k45548R5432m93546h3050E0456c70787a59811l94B4709j1098
9618A3611e9133A33119a38192F4062l758f8429G622a20088j13582J10012o3956
9607a87614o0785A34928n3855a21278r1763A05625g1465A20803N1813c2957C3193
9595A99403E8456k018a11674A31966b3239C30601b52346J14950o6252o6968A16154
9583c7089l07043a08772j31821i3228C55866b1891C31240a1136B55350b9037m07678
9572d36715a75729A2209b32741A28005M6634a84902N8339p8395Q0351F6410O9197
9561A35607i8472H2263a27593N293F4723b03319l3313a0288A95921c4104j24583
9550a58687j75716J40127N1244C0000Q3627B4993L53N7208a74034I0414b13071
$$ plain form
9538 -253533 -337071 -333405 -194821 -160805 -90938 12817 96340 -112701 -292279 -113231 -91847
9527 -91847 -208968 -186903 76905 -145929 -37012 -105031 -357824 36760 5723 -317509 -20017
9515 62349 -133043 -385030 31529 40870 -30085 -309117 -110607 -199828 177466 12033 -394412
9503 -21139 5651 126713 -168025 126843 3490 99598 -260626 -1529 -132421 -165970 -120046
9492 -120046 21168 -273334 -46142 -262615 -190122 -69204 -323508 51489 78876 34614 110391
9481 110391 -96244 5955 37018 -73982 14485 67951 147932 210503 -198024 -151966 216945
9469 -154273 -355783 -124461 -235416 -177684 -185277 94630 -352733 -3057 -184582 -158274 -165713
9458 -165713 -96887 -544647 -207023 -189220 -112389 124028 -244343 65612 -24153 -177674 154868
$$ packed form
9538b53533q3538L666J38584L4016O9867A2817Q3523a12701j79578a13231K1384
9527i1847j17121K2065G6905a45929c7012o8019k52793C6760E723c17509b0017
9515F2349a33043k51987C1529R341c0085k79032a10607q9221A77466A2033c94412
9503b1139E651J21062a68025A26843C490R6108b60626a529j30892l3549M5924
9492a20046B1168b73334d6142k16473P2493f9204k54304E1489K7387C4614P5777
9481A10391i6244E955L1063g3982A4485N3466P9981O2571a98024M6058B16945
9469a54273k01510a24461j10955N7732p593I4630c52733c057j81525K6308p439
9458a65713O8826m47760b07023J7803P6831A24028b44343F5612b4153j53521A54868
$$ plain form
9446 99462 -102713 68999 -137225 -86670 33713 -91257 31510 -408727 -258520 -122233 -18671
9434 -36766 -53926 -190042 -220287 114389 -517042 -74183 32919 -222315 -125025 -87870 -393774
9423 -393774 -219661 -25797 -158431 541 -104660 41173 -407831 -273307 -23456 -12863 158036
9411 76648 -25645 271562 -183930 67091 -23697 90021 204299 -454204 163838 -47453 -139206
9400 -139206 261569 114839 164644 -282511 236293 -357014 161568 -48197 -377762 -262609
9390 -262609 64307 120060 -477063 -71846 185913 312545 39439 -269561 -53625 129189 -286312
9378 78894 -11337 33048 -175143 4055 -238741 -229440 -124676 -249239 -85110 20560 -114110
9366 -64363 -80468 -116898 256929 -103161 374640 -289767 -137603 -122391 -133753 -26810 -160937
$$ packed form
9446I9462a02713F8999a37225N0555C3713i1257C1510d08727J50207a22233a8671
9434c6766j7160j36116l0245A14389e17042g4183C2919b22315R7290L7155l05904
9423c93774J74113b5797j32634E41a04660D1173d07831J34524b3456J0593A58036
9411G6648b5645B71562a83930F7091b3697I0021J14278d54204A63838d7453r1753
9400a39206B61569A14839M9805b82511B36293c57014A61568d8197l29565J15153
9390b62609F4307N5753d77063g1846A85913J26632C9439b69561e3625A29189b86312
9378G8894a1337C3048a75143D055b38741R301J04764j24563h5110B0560a14110
9366f4363j6105l6430B56929a03161C74640b89767a37603J5212j1362b6810j34127
$$ plain form
9355 -160937 -79808 -87125 116475 -206159 118841 -85348 -130387 69087 -138763 -31409 -9652
9343 81103 -136053 -151479 -262728 123589 4470 -74839 108830 12939 78616 38831 -109038
9331 195589 -110717 -158660 -212401 97865 155997 166660 155496 -251263 84200 48091 -73244
9319 202517 -193672 -78040 -40533 -203143 -342187 -91787 -166381 -110999 -68243 36649 -206799
9307 153218 -188321 218109 -70228 -333653 -371673 -227520 -82432 -237063 -167051 -149686 -29409
9295 -147786 -14472 26554 -79715 72181 371450 32109 62670 90770 14714 -119684 -399381
9284 -399381 -86794 87601 -94092 -35516 43639 81833 -109426 -122803 144350 -96550 -165663
9273 -165663 -8481 -61304 78354 -91311 -117139 39655 38100 -273900 -403380 50209 -137006
$$ packed form
9355a60937g9808p317A16475b06159A18841h5348m5039F9087a38763c1409i652
9343H1103a36053j5426j11249A23589D470g4839A08830A2939O5677C8831a09038
9331A95589a10717m7943n3741I7865N8132J0663j1164b51263H4200l6109g3244
9319B02517a93672g8040L7507j62610j39044i1787p4594N5382M2756C6649b06799
9307A53218a88321B18109g0228k63425l8020J44153h2432j54631P0012J7365b9409
9295a47786a4472B6554g9715G2181K99269C2109L0561K8100A4714a19684k79697
9284c99381h6794H7601i4092c5516D3639L8194a09426j3377A44350i6550o9113
9273a65663h481n2823G8354i1311k5828C9655j555b73900j29480E0209a37006
$$ plain form
9261 -375536 -83324 -187720 -335665 84368 -50155 -126385 -154482 -68135 -471001 -176987 -60897
9249 -76983 -140023 -273611 20017 177400 41303 392002 -139615 -172283 18014 129484 -103630
9237 -160993 -2333 -30717 56691 242046 -37376 -64744 119783 -275540 -163781 -331983 -162445
9225 -47654 -224323 -84616 -93639 -16131 -199660 247576 -68396 -14122 -34194 -41356 188981
9213 -99723 91864 -8296 15323 152785 -408513 -81180 -191073 180008 -74966 -136986 88483
9201 -90963 -54551 -111406 278583 -328699 -141734 -43157 -283364 -341913 -54256 182440 125828
9190 125828 304668 189169 51117 20566 -225294 162247 233666 -151469 -193907 121155
9179 58202 -12044 52390 217281 -279614 257004 91437 55311 -261249 -389821 63315 -130871
$$ packed form
9261c75536h3324j04396j47945H4368e0155p6230k8097f8135m02866a76987f0897
9249g6983o3040j33588B0017J57383D1303L50699a39615l2668A8014J11470a03630
9237a60993b333k8384E6691J85355c7376k7368A19783b75540J11759j68202a62445
9225d7654j76669h4616r023a6131j83529B47576f8396a4122k0072p162A88981
9213i9723I1864h296A5323J37462d08513h1180j09893A80008g4966o2020H8483
9201i0963L6412n6855B78583c28699a41734d3157k40207n8549e4256A82440n6612
9190A25828J78840j15499E1117B0566b25294A62247P1419a51469m2438A21155
9179E8202a2044E2390J64891b79614B57004I1437l6126b61249j28572F3315a30871
$$ plain form
9167 -99727 -194490 -547930 -168025 199711 -196618 -127953 48671 79541 -394699 319801 -301033
9155 -39701 -36179 -58036 -298059 -148245 -371587 27736 -242895 -94063 53563 52957 -4250 -16363
9143 -16363 252241 60492 193609 164508 -22650 -86420 -30899 -175795 -40929 -331022 -187400
9132 -187400 -51642 -254178 -267903 -143120 2308 -124408 28256 -9156 -211978 142177 -275096
9120 60156 206426 -106893 78965 358176 -202683 -428765 101030 114635 -87913 -181091 -161035
9109 -161035 -230103 93710 226880 -124322 -124839 -86907 -421 -85510 -596878 -151689 -72711 -57924
9097 -57924 -130688 240239 -51303 -72541 156863 81491 68597 -225679 -43390 176321 212762
9086 212762 -280987 -127335 106051 -89247 -362535 122739 -111308 65068 84395 -78808
$$ packed form
9167i9727r4763l53440a68025A99711a96618O8665D8671L0870c94699C19801c01033
9155c9701L522k1857k40023a48245k23342B7736b42895i4063E3563o06d250j2113
9143a6363B52241F0492J33117k9101b2650o3770c0899j44896d0929k90093J43622
9132a87400e1642k02536j3725J24783B308a24408B8256i156k02822A42177b75096
9120F0156J46270a06893G8965K79211b02683k26082A01030J3605h7913r3178K0056
9109a61035o9068I3710J33170a24322n17L7932d21q5089n11368a51689g2711J4787
9097e7924p2764B40239e1303k1238A56863p5372j2894b25679d3390A76321L6441
9086B12762b80987a27335A06051h9247k73288A22739a11308F5068J9327g8808
$$ plain form
9075 -48135 34032 10193 176071 -326904 -34422 190348 -172773 176504 190530 -243363 71646
9063 161469 -24213 25726 -133117 135406 64441 -118553 -91389 -124078 171617 -207317 -192973
9052 -192973 -113529 67842 23737 -30805 72919 -112424 61068 135220 77076 196821 15806
9040 1933 123091 -184314 102381 -14190 -121195 -12184 -73467 -114491 12261 -112367 -441983
9029 -441983 -79556 -137553 -31585 -263020 -89494 -30802 -159119 -186810 -45465 175741 134596
9018 134596 -126957 290784 -370913 -173539 -9188 -73883 246594 -83889 263495 -208936
9007 111183 84626 -221795 -344731 154563 -87818 303173 32684 -213634 -62758 142039
8996 -7487 67236 -240631 196756 -121325 -108408 -322128 233257 -175735 -204826 -185983 -184778
$$ packed form
9075d8135C4032A0193J65878c26904c4422A90348a72773A76504J4026b43363G1646
9063A61469b4213B5726a33117A35406F4441a18553K7164l2689A71617b07317J4344
9052a92973P9444F7842B3737c0805G2919a12424F1068P4152n8144J19745A5806
9040A933J21158a84314A02381a4190j07005a2184o1283m1024A2261a12367l29616
9029d41983g9556n7997c1585k31435h9494c0802j28317k7691d5465A75741m1145
9018A34596a26957B90784c70913a73539i188o4695B46594h3889B63495b08936
9007A11183k6557b21795j22936A54563h7818C03173C2684b13634f2758A42039
8996g487F7236b40631A96756a21325J2917k13720B33257a75735k9091J8843J205
$$ plain form
8985 -184778 -45267 -93968 192235 -129995 -41746 -174752 48184 -119516 -278513 -379746
8975 -379746 19522 168812 -111800 274149 -35370 -70361 -221647 -99887 15404 -230839 184296
8963 -413869 -24359 -148246 78370 -27786 -127320 321109 -29240 -5643 162037 180934 -22468
8951 -267516 218664 -247308 308837 -333510 -71654 122265 -239237 361627 31441 -23185
8940 34647 -273041 -131681 35638 -352044 -285075 240668 -20490 589588 -81637 194767 -329277
8928 22168 11468 -71445 60917 364892 799490 1233410 1945270 4448088 15286032 7878872
8918 7878872 1691772 879162 610215 356687 331828 -76537 52161 -234368 23676 -49845
8907 180783 495666 355904 -92965 -98020 153085 -2134 -176956 2464 99920 -15711 -64562
$$ packed form
8985a84778d5267m8701A92235a29995d1746j33006D8184a19516j58997j01233
8975c79746A9522J49290a11800B74149c5370l4991j51286i9887A5404b30839A84296
8963d13869b4359j23887G8370b7786r9534C21109b9240e643A62037J8897b2468
8951b67516B18664b47308C08837c33510g1654A22265b39237C61627C1441b3185
8940C4647b73041a31681C5638c52044O6969B40668b0490E89588h1637A94767c29277
8928B2168j0700g1445F0917L03975M34598M33920P11860K502818J0837944p407160
8918G878872A691772q12610k68947k53528k4859g6537E2161b34368B3676d9845
8907A80783L14883j39762i2965n055A53085b134j74822B464R7456a5711m8851
$$ plain form
8896 -64562 31169 -653057 -86798 143403 -89058 -86895 80889 150549 -6320 -196464 -99587 -188254
8884 -188254 -78226 -4528 -90989 -192956 73420 -24806 69461 -80819 -18873 -116706 -248607
8873 -248607 -146563 21756 -8858 173093 -301406 -76330 42908 -33645 -205225 -42630 161046
8861 156233 -39877 -39126 31600 -131270 59498 -301027 34276 -72813 101937 46466 26896
$$ packed form
8896f4562C1169f53057h6798A43403h9058K163H0889O9660f320j90144R6877q8667
8884a88254g8226d528q6461j01967G3420b4806F9461h0819a8873r7833j31901
8873b48607J02044B1756h858A73093c01406g6330D2908c3645j71580d2630A61046
8861A56233c9877P51C1600a31270E9498c01027C4276g2813A01937D6466j9570
$$ [...]
##END NTUPLES=NMR SPECTRUM
##END=
