
##TITLE=AC1342_CMFRS10072_6666387_mMnFdqPqDc
##JCAMPDX= 6.0         $$ Bruker NMR JCAMP-DX V2.0
##DATA TYPE= NMR SPECTRUM
##DATA CLASS= NTUPLES
##ORIGIN= BRUKER
##OWNER= Administrator
$$ 1.72 TOPSPIN		Version 2.1
$$ 2012-08-13 18:52:49.687 -0500  Administrator@TOPSPIN
$$ Compression mode = diff/dup
##.OBSERVE FREQUENCY= 400.02188249412
##.OBSERVE NUCLEUS= ^1H
##.ACQUISITION MODE= SIMULTANEOUS (DQD)
##.ACQUISITION SCHEME= undefined
##.AVERAGES= 64
##.DIGITISER RES= 22
##SPECTROMETER/DATA SYSTEM= spect
##.PULSE SEQUENCE= noesygpps1d.comp
##.SOLVENT NAME= COFFEE_meoh
##.SHIFT REFERENCE= INTERNAL, COFFEE_meoh, 1, 14.96197
##AUDIT TRAIL= $$ (NUMBER, WHEN, WHO, WHERE, PROCESS, VERSION, WHAT)
$$ ##TITLE= Audit trail, TOPSPIN		Version 2.1
$$ ##JCAMPDX= 5.01
$$ ##ORIGIN= Bruker BioSpin GmbH
$$ ##OWNER= Administrator
$$ $$ C:\Bruker\TOPSPIN/data/COFFEE/nmr/AC1342_CMFRS10072_6666387_mMnFdqPqDc/12/pdata/1/auditp.txt
$$ ##AUDIT TRAIL=  $$ (NUMBER, WHEN, WHO, WHERE, PROCESS, VERSION, WHAT)
(   1,<2012-08-13 18:52:44.484 -0500>,<Administrator>,<TOPSPIN>,<go>,<TOPSPIN 2.1>,
      <created by zg
	started at 2012-08-13 18:41:14.218 -0500,
	POWCHK enabled, PULCHK disabled,
       configuration hash MD5:
       6B 1B 68 BB D9 2E 58 E2 7F 35 AD 54 07 DF 0E 41
       data hash MD5: 64K
       20 9E 7A 09 9C 03 B6 6E F6 0B 12 91 F5 B7 4F 30>)
(   2,<2012-08-13 18:52:47.484 -0500>,<Administrator>,<TOPSPIN>,<proc1d>,<TOPSPIN 2.1>,
      <Start of raw data processing
       efp LB = 0.3 FT_mod = 6 PKNL = 1 PHC0 = 0 PHC1 = 0 SI = 128K 
       data hash MD5: 128K
       D7 C0 FE A4 38 0A 8C 62 8D 8A 88 90 DF E6 DF DA>)
(   3,<2012-08-13 18:52:48.609 -0500>,<Administrator>,<TOPSPIN>,<proc1d>,<TOPSPIN 2.1>,
      <pk PHC0 = 2.647705 PHC1 = 0 
       data hash MD5: 128K
       D3 30 33 B8 AD 67 D0 6B 4C 96 BD BD 9D B8 64 3A>)
(   4,<2012-08-13 18:52:49.343 -0500>,<Administrator>,<TOPSPIN>,<proc1d>,<TOPSPIN 2.1>,
      <abs ABSG = 1 
       data hash MD5: 128K
       B8 7C 97 69 D7 54 68 AA 1E 1F 2D 1E 38 1C 88 00>)
(   5,<2012-08-13 18:52:49.406 -0500>,<Administrator>,<TOPSPIN>,<proc1d>,<TOPSPIN 2.1>,
      <abs ABSG = 2 
       data hash MD5: 128K
       6E 85 D3 4A A2 D8 40 00 C5 E5 2D ED 59 46 CB CE>)
(   6,<2012-08-13 18:52:49.468 -0500>,<Administrator>,<TOPSPIN>,<proc1d>,<TOPSPIN 2.1>,
      <abs ABSG = 3 
       data hash MD5: 128K
       4E 3F 78 DF AA E4 87 D3 1F 0F C3 72 99 12 49 DE>)
(   7,<2012-08-13 18:52:49.531 -0500>,<Administrator>,<TOPSPIN>,<proc1d>,<TOPSPIN 2.1>,
      <abs ABSG = 4 
       data hash MD5: 128K
       16 E7 0A 3A 86 80 63 33 C6 F7 1E 3E DE 8B 3C 51>)
(   8,<2012-08-13 18:52:49.593 -0500>,<Administrator>,<TOPSPIN>,<proc1d>,<TOPSPIN 2.1>,
      <abs ABSG = 5 
       data hash MD5: 128K
       14 FF 7B 61 E9 5C 53 CA C5 5E 19 11 5F B8 EE 7D>)
$$ ##END=
$$ 
$$ $$ hash MD5
$$ $$ D1 EA 73 9F 59 74 C2 2D EB AD 16 39 09 38 84 66
##$RELAX= 
##$RELAX= 
##$RELAX= 
##$RELAX= 
##$RELAX= 
##$RELAX= 
##$RELAX= 
##$RELAX= 
$$ Bruker specific parameters
$$ [...]
150 150 150 150 150 150 150 150
##$TP07= 0
##$TPNAME0= <>
##$TPNAME1= <>
##$TPNAME2= <>
##$TPNAME3= <>
##$TPNAME4= <>
##$TPNAME5= <>
##$TPNAME6= <>
##$TPNAME7= <>
##$TPOAL= (0..7)
0.5 0.5 0.5 0.5 0.5 0.5 0.5 0.5
##$TPOFFS= (0..7)
0 0 0 0 0 0 0 0
##$TUNHIN= 0
##$TUNHOUT= 0
##$TUNXOUT= 0
##$USERA1= <user>
##$USERA2= <user>
##$USERA3= <user>
##$USERA4= <user>
##$USERA5= <user>
##$V9= 5
##$VALIST= <valist>
##$VCLIST= <CCCCCCCCCCCCCCC>
##$VD= 0
##$VDLIST= <DDDDDDDDDDDDDDD>
##$VPLIST= <PPPPPPPPPPPPPPP>
##$VTLIST= <TTTTTTTTTTTTTTT>
##$WBST= 1024
##$WBSW= 4
##$XGAIN= (0..3)
0 0 0 0
##$XL= 0
##$YL= 0
##$YMAX_a= 14403490
##$YMIN_a= -8637045
##$ZGOPTNS= <>
##$ZL1= 120
##$ZL2= 120
##$ZL3= 120
##$ZL4= 120
##$ABSF1= 14.96197
##$ABSF2= -5.596211
##$ABSG= 5
##$ABSL= 3
##$ALPHA= 0
##$AQORDER= 0
##$ASSFAC= 0
##$ASSFACI= 0
##$ASSFACX= 0
##$ASSWID= 0
##$AUNMP= <proc_prof1d_extract.lims>
##$AXLEFT= 0
##$AXNAME= <>
##$AXNUC= <1H>
##$AXRIGHT= 0
##$AXTYPE= 0
##$AXUNIT= <>
##$AZFE= 0.1
##$AZFW= 0.1
##$BCFW= 0
##$BC_mod= 0
##$BYTORDP= 0
##$COROFFS= 0
##$CY= 15
##$DATMOD= 1
##$DC= 0
##$DFILT= <>
##$DTYPP= 0
##$F1P= 0
##$F2P= 0
##$FCOR= 0.5
##$FTSIZE= 131072
##$FT_mod= 6
##$GAMMA= 0
##$GB= 0
##$INTBC= 1
##$INTSCL= 1
##$ISEN= 128
##$LB= 0.3
##$LEV0= 0
##$LPBIN= 0
##$MAXI= 10000
##$MC2= 0
##$MEAN= 0
##$ME_mod= 0
##$MI= 0
##$NCOEF= 0
##$NC_proc= -2
##$NLEV= 6
##$NOISF1= 0
##$NOISF2= 0
##$NSP= 0
##$NTH_PI= 0
##$NZP= 0
##$OFFSET= 14.96197
##$PC= 1
##$PHC0= 2.647705
##$PHC1= 0
##$PH_mod= 1
##$PKNL= yes
##$PPARMOD= 0
##$PPDIAG= 0
##$PPIPTYP= 0
##$PPMPNUM= 2147483647
##$PPRESOL= 1
##$PSCAL= 4
##$PSIGN= 0
##$PYNMP= <proc.py>
##$REVERSE= no
##$SF= 400.02000924852
##$SI= 131072
##$SIGF1= 0
##$SIGF2= 0
##$SINO= 400
##$SIOLD= 131072
##$SPECTYP= <>
##$SREGLST= <1H.CDCl3>
##$SSB= 0
##$STSI= 131072
##$STSR= 0
##$SW_p= 8223.68421052631
##$SYMM= 0
##$S_DEV= 0
##$TDeff= 65536
##$TDoff= 0
##$TI= <>
##$TILT= no
##$TM1= 0
##$TM2= 0
##$TOPLEV= 0
##$USERP1= <user>
##$USERP2= <user>
##$USERP3= <user>
##$USERP4= <user>
##$USERP5= <user>
##$WDW= 1
##$XDIM= 131072
##$YMAX_p= 379606310
##$YMIN_p= -12391
##$CURPLOT= <Network HP LaserJet P1505>
##$CURPRIN= <$Network HP LaserJet P1505>
##$DFORMAT= <normdp>
##$LAYOUT= <+/1D_H.xwp>
##$LFORMAT= <normlp>
##$PFORMAT= <normpl>
##$SURQMSG= 1
$$ End of Bruker specific parameters
$$ ---------------------------------
##NTUPLES= NMR SPECTRUM
##VAR_NAME=  FREQUENCY,     SPECTRUM/REAL,   SPECTRUM/IMAG
##SYMBOL=    X,             R,               I
##VAR_TYPE=  INDEPENDENT,   DEPENDENT,       DEPENDENT
##VAR_FORM=  AFFN,          ASDF,            ASDF
##VAR_DIM=   131072,        131072,          131072
##UNITS=     HZ,            ARBITRARY UNITS, ARBITRARY UNITS
##FACTOR=    0.0627417313425164, 1,          1
##FIRST=     8223.62146879497, 1785,         -58636
##LAST=      0,             3448,            -58796
##MIN=       0,             -12391,          0
##MAX=       8223.62146879497, 379606310,    0
$$ Real data points
##PAGE= N=1
##DATA TABLE= (X++(R..R)), XYDATA
$$ [...]
61078E18140k992k471j842j117k51P11J709K736L718M508N043N373N453N232M935
61063E48885M949N322N678N817N949O233O458O350N838M817L268J880J755K906
61049F16105L718K851J201P50J791K596K020J017R59J685K191K397K987L981M677
61034F50926M850N004N308N289M852M776N750P423Q886R647R834R834J0085J0901
61020G53365J2060J2873J3023J3107J3912J5288J6281J6320J5876J5804J6377
61009I14286J7078J7218J6537J5352J4214J3503J3281J3444J3921J4665J5664
60998A079163J6948J8569K0505K2737K5337K8359L1609L4812L7965M1283M4812
60987A402099M8441N2398N7267O3328P0178P7301Q4692R2605J00903J08982J16132
$$ y = [518140, 515148, 512677, 510835, 509718, 509467, 510178, 511887, 514623, 518341, 522849, 527892, 533265, 538718, 543950, 548885, 553834, 559156, 564834, 570651, 576600, 582833, 589291, 595641, 601479, 606296, 609564, 611444, 613199, 616105, 619823, 622674, 623875, 624625, 626416, 629012, 631032, 632049, 633008, 634693, 636884, 639281, 642268, 646249, 650926, 655776, 660780, 666088, 671377, 676229, 681005, 686755, 694178, 703064, 712711, 722545, 732379, 742464, 753365, 765425, 778298, 791321, 804428, 818340, 833628, 849909, 866229, 882105, 897909, 914286, 931364, 948582, 965119, 980471, 994685, 1008188, 1021469, 1034913, 1048834, 1063499, 1079163, 1096111, 1114680, 1135185, 1157922, 1183259, 1211618, 1243227, 1278039, 1316004, 1357287, 1402099, 1450540, 1502938, 1560205, 1623533, 1693711, 1771012, 1855704, 1948309, 2049212, 2158194, 2274326]
60976B274326J21889J26349J30561J36415J45866J60218J79888K04336K32156
60967C712004K61837K92679L24707L58176L94422M37162M91236N59418O42032
60958G473673P40354Q58593J002375J179028J401124J684709K040170K471292
60950A8851318K989070L607616M284886M844352M988091M460739L259974J698293
60942D8984339K40165p45252j111586q97323k52190N65812J183122J218140M90644
60933D9675871q41714k362414l634306m404938m650346m489543m079843l557916
60925B1654851l020997k525131k092984j728250j427257j182500r83561q20756
60917G873415o88490n84026n03921m42828l95007l55960l22913k94437k69512
$$ y = [2274326, 2396215, 2522564, 2653125, 2789540, 2935406, 3095624, 3275512, 3479848, 3712004, 3973841, 4266520, 4591227, 4949403, 5343825, 5780987, 6272223, 6831641, 7473673, 8214027, 9072620, 10074995, 11254023, 12655147, 14339856, 16380026, 18851318, 21840388, 25448004, 29732890, 34577242, 39565333, 44026072, 47286046, 48984339, 49224504, 48479252, 47367666, 46470343, 46218153, 46783965, 47967087, 49185227, 49675871, 48834157, 46471743, 42837437, 38432499, 33782153, 29292610, 25212767, 21654851, 18633854, 16108723, 14015739, 12287489, 10860232, 9677732, 8694171, 7873415, 7184925, 6600899, 6096978, 5654150, 5259143, 4903183, 4580270, 4285833, 4016321]
60908D016321k46799k25096k04198j84569j66255j49056j33741j22052j14964
60899B469591j11616j10043j08378j05378j00745r5290r0037q4971p9305p2933
60889A510895o6732o1300n6439n2105m8761m6379m4114m1503l9059l7090l4966
60878I82447l2213k9586k8054k7434k6800k5748k4403k2715k0654j8825j7948
60867G08067j7805j7390j6182j4701j3735j3447j3267j2532j1164r768q914q405
60855E50757p595o312m926l605k241j171j072j823k364k091j506j040j77J407
60841E16241K850L189K789K596K532J749J89j291k232k976l720m049l562k384
60827E11921j017q7rl69L4J808L916M783M147L049K246J650J249J448K265L050
$$ y = [4016321, 3769522, 3544426, 3340228, 3155659, 2989404, 2840348, 2706607, 2584555, 2469591, 2357975, 2247932, 2139554, 2034176, 1933431, 1838141, 1748104, 1663133, 1583828, 1510895, 1444163, 1382863, 1326424, 1274319, 1225558, 1179179, 1135065, 1093562, 1054503, 1017413, 982447, 950234, 920648, 892594, 865160, 838360, 812612, 788209, 765494, 744840, 726015, 708067, 690262, 672872, 656690, 641989, 628254, 614807, 601540, 589008, 577844, 568076, 559162, 550757, 543162, 536850, 531924, 528319, 526078, 524907, 523835, 522012, 519648, 517557, 516051, 515011, 514834, 516241, 519091, 522280, 525069, 527665, 530197, 531946, 532135, 530844, 528612, 525636, 521916, 517867, 514305, 511921, 510904, 510817, 510808, 510439, 510473, 512281, 516197, 520980, 525127, 528176, 530422, 532072, 533321, 534769, 537034, 540084]
60811E40084L253K853J932N15j074k416l633n154o782p848q272q652r077q827
60797D86902p564n996m995m721m978n570n951n404m076l123l210l631l499l031
60783D21153k917l052k839k316j987j821j293l94K09J05l99p53n84K56J596K843
60767D07807L500L666L676L412K647J886K027L112M122M280L839L311K588J489
60753D51362N26M04Q99R59l6j620k922l519l466k907k071j445j562k558m077n596
60737D22371o767p480p794p848p721p351o660n780n017m572m377m261m148m044
60723C38551l944l800l529l007k239j573j476j958k365k004q74M40J411J887J936
60708C17456J717J489J383J136M15n50j050p90l09k09k81J66J207K070K102J611
$$ y = [540084, 543337, 546190, 548122, 548637, 547563, 545147, 541514, 536360, 529578, 521730, 513458, 504806, 495729, 486902, 479338, 473342, 468347, 463626, 458648, 453078, 447127, 441723, 437647, 434524, 431314, 427683, 424184, 421153, 418236, 415184, 412345, 410029, 408042, 406221, 404928, 404534, 404743, 404848, 404449, 403696, 403112, 403368, 404964, 407807, 411307, 414973, 418649, 422061, 424708, 426594, 428621, 431733, 435855, 440135, 443974, 447285, 449873, 451362, 451888, 452292, 453191, 454150, 454114, 452494, 449572, 446053, 442587, 439680, 437609, 436164, 434602, 432044, 427967, 422371, 415604, 408124, 400330, 392482, 384761, 377410, 370750, 364970, 359953, 355381, 351004, 346743, 342595, 338551, 334607, 330807, 327278, 324271, 322032, 320459, 318983, 317025, 314660, 312656, 311782, 312222, 313633, 315520, 317456, 319173, 320662, 322045, 323181, 323596, 323046, 321996, 321206, 320897, 320688, 320407, 320573, 321780, 323850, 325952, 327563]
60692C27563J397J692J963J787J473J519J716J339K82n20j10J292K504K657J944
60677C48498J177J006J605K755L953M625M537L978L507L421L536L523L395L593
60663C93109M446N650O445O290N213L573J872P56O83J308J601R46j27o61l64L45
60647D31085J046J489J350M78o64j422j772k243k937l328l142k824k866l123l102
60632D08025k621j923j432j432j695j479k88J270J973J470P30P71J498K169K471
60617D09507K676L044L508L808L714L350L413M571O444P693P573O809O497O669
60603D79276O603O166O003O577P710R054J0335J1147J1222J0951J1132J1982J2856
60590F01014J3052J2351J0661P694L416j477n927r345j1886j3981j5767j6930
$$ y = [327563, 328960, 330652, 332615, 334402, 335875, 337394, 339110, 340449, 340731, 340211, 340101, 341393, 343897, 346554, 348498, 349675, 350681, 352286, 355041, 358994, 363619, 368156, 372134, 375641, 379062, 382598, 386121, 389516, 393109, 397555, 403205, 409650, 415940, 421153, 424726, 426598, 427354, 428037, 429345, 430946, 431892, 431765, 431104, 430740, 431085, 432131, 433620, 434970, 435448, 434784, 433362, 431590, 429347, 426410, 423082, 419940, 417116, 414250, 411127, 408025, 405404, 403481, 402049, 400617, 398922, 397443, 397155, 398425, 400398, 401868, 402598, 403369, 404867, 407036, 409507, 412183, 415227, 418735, 422543, 426257, 429607, 433020, 437591, 444035, 451728, 459301, 466110, 472607, 479276, 485879, 492045, 498048, 504625, 512335, 521389, 531724, 542871, 554093, 565044, 576176, 588158, 601014, 614066, 626417, 637078, 644772, 648188, 646711, 640784, 631439, 619553, 605572, 589805, 572875]
60578E72875j7133j6546j5737j4947j3774j1874r705q057o992n834m255k779j973
60565D43269j741j664j582j433r53o1P24Q42N29N60J174J818K069K226K696L188
60549D51661L097K466K033K285K864L107K837K402K153K173K412K813L310L914
60535D89527M742N864P073Q089Q872R597J0264J0686J0846J1024J1463J2138J2993
60522F13178J4204J5950J8101K0270K2224K4138K6489K9689L3752L8458M3891
60511I00344N0517N8414O6767P4737Q2824R2596J04921J19074J33725J47818J59839
60500A991576J66957J65955J54912J33542J02475O3329J9381k4841o5038r7978
60490B610270j21322j33866j36345j31174j20818j06800r0281p2682n5066l7534
$$ y = [572875, 555742, 539196, 523459, 508512, 494738, 482864, 473159, 465102, 458110, 452276, 448021, 445242, 443269, 441528, 439864, 438282, 436849, 435896, 435835, 436559, 437401, 437930, 438490, 439664, 441482, 443551, 445777, 448473, 451661, 454758, 457224, 459257, 461542, 464406, 467513, 470350, 472752, 474905, 477078, 479490, 482303, 485613, 489527, 494269, 500133, 507206, 515295, 524167, 533764, 544028, 554714, 565560, 576584, 588047, 600185, 613178, 627382, 643332, 661433, 681703, 703927, 728065, 754554, 784243, 817995, 856453, 900344, 950861, 1009275, 1076042, 1150779, 1233603, 1326199, 1431120, 1550194, 1683919, 1831737, 1991576, 2158533, 2324488, 2479400, 2612942, 2715417, 2778746, 2798127, 2773286, 2708248, 2610270, 2488948, 2355082, 2218737, 2087563, 1966745, 1859945, 1769664, 1696982, 1641916, 1604382]
60480A604382j9923k667J3643K9134M4168N8027O8778P4493P4035O6808N2584
60469B063462L2137P670j7812m1489o1152p5276q3259q5492q2902p6459o7318
60458A512110n7018m6908l7234k7325j6879o783J595P609J1538J3860J4821J4659
60446A384045J3749J2391J0753R225Q521R256J1506J4965J9408K4968L2107M1331
60434A592225N2689O5453P8619R1908J06044J21950J40019J60307J83054K08532
60424B800800K36674K67287L00391L35818L72436M07951M39158M61831M70493
60415F092839M59204M23294L60834K73189J65028M3865q1066k00146l04299l85967
60405F846775m40885m69398m75490m64124m39702m06616l69613l32504k96927
$$ y = [1604382, 1584459, 1581792, 1595435, 1624569, 1668737, 1726764, 1795542, 1870035, 1944070, 2010878, 2063462, 2095599, 2103269, 2085457, 2043968, 1982816, 1907540, 1824281, 1738789, 1655887, 1579428, 1512110, 1455092, 1408184, 1370950, 1343625, 1326746, 1319963, 1321558, 1329167, 1340705, 1354565, 1369386, 1384045, 1397794, 1410185, 1420938, 1430163, 1438684, 1447940, 1459446, 1474411, 1493819, 1518787, 1550894, 1592225, 1644914, 1710367, 1788986, 1880894, 1986938, 2108888, 2248907, 2409214, 2592268, 2800800, 3037474, 3304761, 3605152, 3940970, 4313406, 4721357, 5160515, 5622346, 6092839, 6552043, 6975337, 7336171, 7609360, 7774388, 7818253, 7737187, 7537041, 7232742, 6846775, 6405890, 5936492, 5461002, 4996878, 4557176, 4150560, 3780947, 3448443, 3151516]
60396C151516k63186k31897k04070j79926j58645j39424j22183j07094r4113q3160
60386A567818p4270o7226o1402n6210n1484m7208m3131l8998l4995l1681k9390
60375A031823k7868k6533k5029k3463k2144k1135k0170j8955j7429j5680j3855
60364G99562j2234j1089j0203q831o589m280l237l741m635m750m203l897m219
60351G17654m784n227n563n735n545n177n199n726o029n436m294l457l023k262
60337F50197o72J442L628N947Q703J1855J5106J8273K1324K4180K6694K8596K9323
60324H44596K8235K5212K0761J5259Q584R25o508j2296j6095j8414j9389j8707
60312H52163j6777j4953j4191j4205j4340j4567j5127j5838j6444j7107j7859
$$ y = [3151516, 2888330, 2656433, 2452363, 2272437, 2113792, 1974368, 1852185, 1745091, 1650978, 1567818, 1493548, 1426322, 1364920, 1308710, 1257226, 1210018, 1166887, 1127889, 1092894, 1061213, 1031823, 1003955, 977422, 952393, 928930, 906786, 885651, 865481, 846526, 829097, 813417, 799562, 787328, 776239, 766036, 757205, 750616, 746336, 743099, 739358, 734723, 729973, 725770, 721873, 717654, 712870, 707643, 702080, 696345, 690800, 685623, 680424, 674698, 668669, 663233, 658939, 655482, 652459, 650197, 649525, 650967, 654595, 660542, 669245, 681100, 696206, 714479, 735803, 759983, 786677, 815273, 844596, 872831, 898043, 918804, 934063, 942647, 943572, 937064, 924768, 908673, 890259, 870870, 852163, 835386, 820433, 806242, 792037, 777697, 763130, 748003, 732165, 715721, 698614, 680755]
60301F80755j8002j6856j4881j3194j2105j0902r110p151n696m983n014n650o259
60288E50952n927m576l312l192l962m578m542m182l786l231k508j997j933k009
60274E01217j795j323r08o08j84M49J042J422J807K513L435M052M019L504K870
60259E21512K246J501O36j25m44l0J170K701L765M050M310N585P774R573J0101
60244E74325J0060J0802J2628J4627J5986J6807J7627J8743K0247K2231K4534
60233G58617K6632K8110K9107K9986L0633L0500K9306K7455K5505K3485K1004
60222A060340J7999J4957J2179R201N497J639j009k028k647m039n440n055k562
60209A099032L89K436M111O584R757J2521J4372J5661J6568J6838J6588J6469
$$ y = [680755, 662753, 645897, 631016, 617822, 605717, 594815, 585705, 578554, 572858, 567875, 562861, 557211, 550952, 545025, 540449, 537137, 533945, 529983, 525405, 520863, 516681, 512895, 509664, 507156, 505159, 503226, 501217, 499422, 498099, 497191, 496583, 496399, 496848, 497890, 499312, 501119, 503632, 507067, 511119, 515138, 518642, 521512, 523758, 525259, 525895, 525770, 525326, 525296, 526466, 529167, 532932, 536982, 541292, 546877, 554651, 564224, 574325, 584385, 595187, 607815, 622442, 638428, 655235, 672862, 691605, 711852, 734083, 758617, 785249, 813359, 842466, 872452, 903085, 933585, 962891, 990346, 1015851, 1039336, 1060340, 1078339, 1093296, 1105475, 1114676, 1120173, 1121812, 1120803, 1118775, 1116128, 1112089, 1106649, 1101594, 1099032, 1099421, 1101857, 1105968, 1112552, 1122309, 1134830, 1149202, 1164863, 1181431, 1198269, 1214857, 1231326]
60197A231326J6872J7678J8886K0749K2997K4685K5214K4944K4407K3501K1941
60186A473200J9889J7562J4601J0530N619O41m086q764j3326j7201j9965k1691
60174A457009k2499k2199k0611j7934j4665j1313q232n382k177K151P816J4200
60162A356164K0292K5385K9445L3149L7431M2531M7538N1217N3393N5073N7088
60151A808706N9113O0171N9574N6970N1921M4098L3868K2262J0395p73j0254j7046
60139B179005k0545k0792j8210j3267o432J652J0108J7932K4202K8360L0394L0809
60127B243216L0407K9926K9817L0335L1920L5191M0225M6039N1201N5047N7858
60116B681182N9752O0050N8105N4226M9192M3221L6053K7823J9057R845k33j1131
$$ y = [1231326, 1248198, 1265876, 1284762, 1305511, 1328508, 1353193, 1378407, 1403351, 1427758, 1451259, 1473200, 1493089, 1510651, 1525252, 1535782, 1541401, 1542042, 1537956, 1529192, 1515866, 1498665, 1478700, 1457009, 1434510, 1412311, 1391700, 1373766, 1359101, 1347788, 1339556, 1334174, 1331997, 1334148, 1341964, 1356164, 1376456, 1401841, 1431286, 1464435, 1501866, 1544397, 1591935, 1643152, 1696545, 1751618, 1808706, 1867819, 1927990, 1987564, 2044534, 2096455, 2140553, 2174421, 2196683, 2207078, 2206305, 2196051, 2179005, 2158460, 2137668, 2119458, 2106191, 2099759, 2101411, 2111519, 2129451, 2153653, 2182013, 2212407, 2243216, 2273623, 2303549, 2333366, 2363701, 2395621, 2430812, 2471037, 2517076, 2568277, 2623324, 2681182, 2740934, 2800984, 2859089, 2913315, 2962507, 3005728, 3041781, 3069604, 3088661, 3098506, 3098273, 3087142]
60104C087142k1956l1822m0590m8342n4641n8828o0778o0950n9820n7670n4771
60093B536974n1414m7837m4386m1580l9502l7313l3903k9092k3635j7976j1584
60082B158752m009L919J0514J4808J7205J8566J9109J8364J5912J1867O766J242
60070B293015m194r249j3875j8140k1935k4841k6433k6876k7074k7937k9479l0842
60058B032140l1204l0455k8923k6896k4587k2279k0043j7559j4574j1370q299
60047A795951m959m21N580J2187J8351K3836K9025L4221L9448M4697M9869N4548
60035B102333N8109O0054O0064N7996N3990M8462M1831L4415K6734J9571J3491
60024B577050Q468M283Q92j849m460p320j0139j2534j4963j8439k3346k9036l4524
$$ y = [3087142, 3065186, 3033364, 2992774, 2944432, 2889791, 2830963, 2770185, 2709235, 2649415, 2591745, 2536974, 2485560, 2437723, 2393337, 2351757, 2312255, 2274942, 2241039, 2211947, 2188312, 2170336, 2158752, 2154743, 2158662, 2169176, 2183984, 2201189, 2219755, 2238864, 2257228, 2273140, 2285007, 2291773, 2293015, 2288821, 2279572, 2265697, 2247557, 2225622, 2200781, 2174348, 2147472, 2120398, 2092461, 2062982, 2032140, 2000936, 1970481, 1941558, 1914662, 1890075, 1867796, 1847753, 1830194, 1815620, 1804250, 1795951, 1790992, 1790571, 1796151, 1808338, 1826689, 1850525, 1879550, 1913771, 1953219, 1997916, 2047785, 2102333, 2160442, 2220496, 2280560, 2338556, 2392546, 2441008, 2482839, 2517254, 2543988, 2563559, 2577050, 2585518, 2589801, 2590693, 2588844, 2584384, 2577064, 2566925, 2554391, 2539428, 2520989, 2497643, 2468607, 2434083]
60011B434083l9068m2054m3088m2334m0330l7263l2953k7638k2112j6770j1186
60000B079287m964J506P619J3296J8640K3189K6255K7748K8109K7443K5271K1176
59988B294575J5380Q656J948m123r698j5561k2197k9048l4956l9284m2243m4233
59976B079216m5187m4646m2231l8060l2884k7661k2764j7802j2451p112k324K172
59964A788266P123J2611J7909K2523K6637L0437L3627L6037L8063M0042M1610
59953B094885M2177M1777M0886L9673L7935L5689L3263L0713K7616K3595J8739
59942B466948J3357P663J913l290p172r264r552q137m918K49P168J5301K4223
59929B494489L3924M4490N5432O5598P3905Q0131Q4693Q7635Q7933Q4150P5723
$$ y = [2434083, 2395015, 2352961, 2309873, 2267539, 2227209, 2189946, 2156993, 2129355, 2107243, 2090473, 2079287, 2074323, 2075829, 2083448, 2096744, 2115384, 2138573, 2164828, 2192576, 2220685, 2248128, 2273399, 2294575, 2309955, 2318611, 2320559, 2316436, 2306738, 2291177, 2268980, 2239932, 2204976, 2165692, 2123449, 2079216, 2034029, 1989383, 1947152, 1909092, 1876208, 1848547, 1825783, 1807981, 1795530, 1788418, 1786094, 1788266, 1795389, 1808000, 1825909, 1848432, 1875069, 1905506, 1939133, 1975170, 2013233, 2053275, 2094885, 2137062, 2178839, 2219725, 2259398, 2297333, 2333022, 2366285, 2396998, 2424614, 2448209, 2466948, 2480305, 2487968, 2489881, 2486591, 2479419, 2470155, 2460603, 2452466, 2447548, 2447797, 2454965, 2470266, 2494489, 2528413, 2572903, 2628335, 2693933, 2767838, 2847969, 2932662, 3020297, 3108230, 3192380, 3268103]
59918C268103O3375M8084L0046R153j3584l5793n5274p1348q4318r4125j00292
59907B964027j02948j03013j01079r6868r0167q1710p2697o3789n5075m6673l8685
59896B111323l0791k2554j4160o280Q95P910J5090K1862K7352L1379L4399L6639
59884B213064L7615L6584L3217K7824K1004J3083L866o833j8444k9610l9108m6695
59872B245567n2825n7808o1457o3441o3688o2557o0907n9846n9904o0348n9834
59861A582952n7844n5124n2519m9812m6135m1119l5232k9147k3289j7997j3563
59850A161171j0008p029m330j865K34J712K271J987J650K269M025O085P665Q884
59836A174721J0209J1429J1812J1209J0446J0389J0851J0708Q952N492J046l521
$$ y = [3268103, 3331478, 3379562, 3409608, 3418761, 3405177, 3369384, 3314110, 3242762, 3158444, 3064319, 2964027, 2861079, 2758066, 2656987, 2560119, 2469952, 2388242, 2315545, 2251756, 2196681, 2150008, 2111323, 2080532, 2057978, 2043818, 2037538, 2038433, 2046343, 2061433, 2083295, 2110647, 2142026, 2176425, 2213064, 2250679, 2287263, 2320480, 2348304, 2369308, 2382391, 2386257, 2379424, 2360980, 2331370, 2292262, 2245567, 2192742, 2134934, 2073477, 2010036, 1946348, 1883791, 1822884, 1763038, 1703134, 1642786, 1582952, 1525108, 1469984, 1417465, 1367653, 1321518, 1280399, 1245167, 1216020, 1192731, 1174734, 1161171, 1151163, 1144134, 1139804, 1137939, 1138173, 1139885, 1142156, 1144143, 1145793, 1148062, 1152087, 1158172, 1165837, 1174721, 1184930, 1196359, 1208171, 1219380, 1229826, 1240215, 1251066, 1261774, 1270726, 1276218, 1277264, 1273743]
59824A273743p680j1241j4074j5995j6907j7046j6916j6945j7138j7101j6511
59813A106189j5608j5087j5288j5514j4467j1531p432l467j86K980O869J1643
59801A029101J6755K1612K6001K9800L2390L2612K9560K3522J6078R123L805L71
59789A270730j228r73P51K635K891N84l540p658j0244j0738r164n759j051M208
59775A231444R653J5583K2246K9199L5875M2547N0061N8657O7693P6542Q5052
59764A724552R2711R7898R8332R2046P7940N6212K8904l77k7956n1348o9074q0008
59752B039832q3750q1425p5363o7777o0018n2766m6191l9888l3293k6468k0102
59741A452791j4635r854n482j632J668N006R110J3939J8706K2831K6567L0530
$$ y = [1273743, 1266063, 1254822, 1240748, 1224753, 1207846, 1190800, 1173884, 1156939, 1139801, 1122700, 1106189, 1090581, 1075494, 1060206, 1044692, 1030225, 1018694, 1011262, 1007795, 1007609, 1010589, 1017458, 1029101, 1045856, 1067468, 1093469, 1123269, 1155659, 1188271, 1217831, 1241353, 1257431, 1266554, 1270359, 1270730, 1269502, 1268529, 1269280, 1271915, 1274806, 1275390, 1271850, 1264192, 1253948, 1243210, 1234046, 1228287, 1227236, 1231444, 1241097, 1256680, 1278926, 1308125, 1344000, 1386547, 1436608, 1495265, 1562958, 1639500, 1724552, 1817263, 1915161, 2013493, 2105539, 2183479, 2239691, 2268595, 2268218, 2240262, 2188914, 2119840, 2039832, 1956082, 1874657, 1799294, 1731517, 1671499, 1618733, 1572542, 1532654, 1499361, 1472893, 1452791, 1438156, 1428302, 1422820, 1421188, 1422856, 1427862, 1436972, 1450911, 1469617, 1492448, 1519015, 1549545]
59729A549545L4901L9386M3920M8962N4873O1325O7727P4076Q0941Q8639R6979
59718B241274J05916J15784J26565J37563J48163J58324J67736J75054J78863
59709C555242J79032J76313J70904J62466J51583J40064J29514J20448J13107
59700D898673J08222J06254J06490J07589J08600J08882J07422J02976R4941Q3580
59690E933629O9520N3352L5733J7484m66j7105l1422m2691n0638n5160n6079n3336
59678E802821m7224l8227k6716j3043K329J8990L6810N5720P5373R5278J15122
59667F077233J34744J53819J71724J87612K00332K08338K09944K03682J88357
59658G735785J62955J26957Q1095K7820k9136q5873j39210j86730k26223k55537
$$ y = [1549545, 1584446, 1623832, 1667752, 1716714, 1771587, 1832912, 1900639, 1974715, 2055656, 2144295, 2241274, 2347190, 2462974, 2589539, 2727102, 2875265, 3033589, 3201325, 3376379, 3555242, 3734274, 3910587, 4081491, 4243957, 4395540, 4535604, 4665118, 4785566, 4898673, 5006895, 5113149, 5219639, 5327228, 5435828, 5544710, 5652132, 5755108, 5850049, 5933629, 6003149, 6056501, 6092234, 6109718, 6109252, 6092147, 6060725, 6018034, 5967396, 5912236, 5856157, 5802821, 5755597, 5717370, 5690654, 5677611, 5679940, 5698930, 5735740, 5791460, 5866833, 5962111, 6077233, 6211977, 6365796, 6537520, 6725132, 6925464, 7133802, 7343746, 7547428, 7735785, 7898740, 8025697, 8106792, 8134612, 8105476, 8019603, 7880393, 7693663, 7467440, 7211903]
59648G211903k73416k80381k78347k69290k54544k35365k13462j90681j68653
59639E047764j49295j35150j28537j30217j39170j53315j69793j84869j94856
59630C662562j97980j95030j87860j77586j64660j50089j35581j22297j10103
59621B221376r8401q7210p7029o8030o0017n3079m7538m3134l8816l3854k8726
59610A585542k4502k1570j9442j7658j6254j5298j4571j3967j3798j4366j5469
59599A398647j6569j7340j7866j8481j9552k1190k2956k4009k3805k2622k1215
59588A173042k0068j9117j8114j6985j5831j4736j3634j2345j0733q889p031n300
59576A010259l717k285r93K59J598L031M506O076P738R145R797R628R107Q721
$$ y = [7211903, 6938487, 6658106, 6379759, 6110469, 5855925, 5620560, 5407098, 5216417, 5047764, 4898469, 4763319, 4634782, 4504565, 4365395, 4212080, 4042287, 3857418, 3662562, 3464582, 3269552, 3081692, 2904106, 2739446, 2589357, 2453776, 2331479, 2221376, 2122975, 2035765, 1958736, 1890706, 1830689, 1777610, 1730072, 1686938, 1648122, 1614268, 1585542, 1561040, 1539470, 1520028, 1502370, 1486116, 1470818, 1456247, 1442280, 1428482, 1414116, 1398647, 1382078, 1364738, 1346872, 1328391, 1308839, 1287649, 1264693, 1240684, 1216879, 1194257, 1173042, 1152974, 1133857, 1115743, 1098758, 1082927, 1068191, 1054557, 1042212, 1031479, 1022590, 1015559, 1010259, 1006542, 1004257, 1003264, 1003523, 1005121, 1008152, 1012658, 1018734, 1026472, 1035617, 1045414, 1055042, 1064149, 1072870]
59562A072870Q631Q979J0060J1926J4057J5781J6914J7789J8772K0004K1484K3208
59550A260475K5227K7716L0876L4615L8450M1877M4833M7704N0913N4481N7963
59539A715130O0885O3270O5526O7557O8426O7487O5559O4113O2936N9548N1488
59528B411925L8845K4097R979j928j1113j7727k2433k6039k8926l0986l2066l2136
59516B281492l1094k8673k4684j9253j2820n938J192Q980J7974K7952L7900M7028
59504B300056N5374O3004O9055P2004P0633O4523N4010M0143K4218O865j1988
59493B807897l1861n0945o7351q0548r0835r7773j00422r8963r4938q9669q3361
59482A921231p5990o8098o0346n2962m5965l9298l2531k5229j7810j1242n594
$$ y = [1072870, 1081501, 1090480, 1100540, 1112466, 1126523, 1142304, 1159218, 1177007, 1195779, 1215783, 1237267, 1260475, 1285702, 1313418, 1344294, 1378909, 1417359, 1459236, 1504069, 1551773, 1602686, 1657167, 1715130, 1776015, 1839285, 1904811, 1972368, 2040794, 2108281, 2173840, 2237953, 2300889, 2360437, 2411925, 2450770, 2474867, 2484846, 2482918, 2471805, 2454078, 2431645, 2405606, 2376680, 2345694, 2313628, 2281492, 2250398, 2221725, 2197041, 2177788, 2164968, 2159030, 2160222, 2169202, 2187176, 2215128, 2253028, 2300056, 2355430, 2418434, 2487489, 2559493, 2630126, 2694649, 2748659, 2788802, 2813020, 2819885, 2807897, 2776036, 2725091, 2657740, 2577192, 2486357, 2388584, 2288162, 2189199, 2094261, 2004592, 1921231, 1845241, 1777143, 1716797, 1663835, 1617870, 1578572, 1546041, 1520812, 1503002, 1491760, 1486166]
59471A486166K00O654J2796J7632K1675K6094L1044L5891M0548M5428N0203N3815
59459A828146N5805N6715N6933N5931N2968M7811M0542L1254K0485R278j658j2461
59447B241749k3297l3364m1394m7014n0927n3741n5181n4746n2585m9334m5402
59436A734764m0948l6363l2231k8683k5216k1311j6914j2188p236k356J811M861
59424A517990P165R397J1705J3791J5689J7873K0563K3434K6098K8469L0552L2416
59412A755142L4483L7299M0785M4335M7818N1687N5422N6566N2588M3772L3580
59401B253477K5888K2375K2436K4686K8069L2113L6784M1849M5939M6534M1637
59390B621787L1685J9562Q650J038k803l453k085rJ975L825N678P352Q756J0578
$$ y = [1486166, 1486366, 1493020, 1505816, 1523448, 1545123, 1571217, 1602261, 1638152, 1678700, 1724128, 1774331, 1828146, 1883951, 1940666, 1997599, 2053530, 2106498, 2154309, 2194851, 2226105, 2246590, 2255868, 2254210, 2241749, 2218452, 2185088, 2143694, 2096680, 2045753, 1992012, 1936831, 1882085, 1829500, 1780166, 1734764, 1693816, 1657453, 1625222, 1596539, 1571323, 1550012, 1533098, 1520910, 1513674, 1511318, 1513129, 1517990, 1525155, 1534552, 1546257, 1560048, 1575737, 1593610, 1614173, 1637607, 1663705, 1692174, 1722726, 1755142, 1789625, 1826924, 1867709, 1912044, 1959862, 2011549, 2066971, 2123537, 2176125, 2219897, 2253477, 2279365, 2301740, 2324176, 2348862, 2376931, 2409044, 2445828, 2487677, 2533616, 2580150, 2621787, 2653472, 2673034, 2681684, 2682722, 2679919, 2676466, 2674381, 2674372, 2676347, 2680172, 2685850, 2693202, 2701958, 2712536]
59376B712536J3841J8753K4489L0160L5533M0695M5728N1077N7678O6073P5706
59365C172269Q5685R5933J07017J18944J30718J41125J49370J54925J57353J56537
59355D469876J52731J46182J37076J26021J14190J02735R2155Q2443P3523O5314
59345E562246N7422M8944L8626K5413R012j0157l1682n5560q1508j08122j33297
59334E321337j55509j74204j89014j99348k04948k06241k03748j97657j88338
59325C602330j76909j64853j53286j42772j33438j24908j16479j07813r9291r1485
59315B291096q4494p8086p2187o6857o1957n7197n2375m7433m2501l7985l4328
59304A655696l1429k8708k5882k3294k1126j8927j6385j4110j2891j2462j1691
$$ y = [2712536, 2726377, 2745130, 2769619, 2799779, 2835312, 2876007, 2921735, 2972812, 3030490, 3096563, 3172269, 3257954, 3353887, 3460904, 3579848, 3710566, 3851691, 4001061, 4155986, 4313339, 4469876, 4622607, 4768789, 4905865, 5031886, 5146076, 5248811, 5340966, 5423409, 5496932, 5562246, 5619668, 5668612, 5707238, 5732651, 5741663, 5731506, 5699824, 5644264, 5562756, 5454634, 5321337, 5165828, 4991624, 4802610, 4603262, 4398314, 4192073, 3988325, 3790668, 3602330, 3425421, 3260568, 3107282, 2964510, 2831072, 2706164, 2589685, 2481872, 2382581, 2291096, 2206602, 2128516, 2056329, 1989472, 1927515, 1870318, 1817943, 1770510, 1728009, 1690024, 1655696, 1624267, 1595559, 1569677, 1546383, 1525257, 1506330, 1489945, 1475835, 1462944, 1450482, 1438791]
59293A438791r942p554n139k948j031N98K087L640N306P216R851J3498J7511K0814
59279A492698K3252K5768K9079L2851L6497M0061M3814M7512N0712N3489N6142
59268A931875N8325N9185N8415N6534N3979N0415M5383L9236L2918K6951K1105
59257B434321J5165R517M744J007j668k781j604J830O507J1479J6729K2799K9731
59244B547776L6527M1250M1459L5220K2686O722q482j9759k6067k7910k6527k3564
59232B599331k0590j8285j6371j4517j3008j2205j1764j0846q988o376l322J45
59220B463204M090Q319J2485J6527K0954K6516L3523M1506M9671N7650O5621P3815
59208B873881Q2141R0336R8108J04891J09739J11703J10258J05105R5807Q2002
$$ y = [1438791, 1428849, 1421295, 1416156, 1413208, 1412177, 1412775, 1414862, 1418502, 1423808, 1431024, 1440875, 1454373, 1471884, 1492698, 1515950, 1541718, 1570797, 1603648, 1640145, 1680206, 1724020, 1771532, 1822244, 1875733, 1931875, 1990200, 2049385, 2107800, 2164334, 2218313, 2268728, 2314111, 2353347, 2386265, 2413216, 2434321, 2449486, 2459003, 2463747, 2464754, 2463086, 2460305, 2458701, 2460531, 2467038, 2478517, 2495246, 2518045, 2547776, 2584303, 2625553, 2667012, 2702232, 2724918, 2731640, 2723158, 2703399, 2677332, 2649422, 2622895, 2599331, 2578741, 2560456, 2544085, 2529568, 2516560, 2504355, 2492591, 2481745, 2472757, 2466381, 2463059, 2463204, 2467294, 2475613, 2488098, 2504625, 2525579, 2552095, 2585618, 2627124, 2676795, 2734445, 2800066, 2873881, 2956022, 3046358, 3144466, 3249357, 3359096, 3470799, 3581057, 3686162, 3781969, 3863971]
59198C863971O4022M2990K0216l314k6759m9032o8895q5387r8015j06634j11383
59187C441780j12768j11602j08746j04996j01073r7373r3631q9198q3982p8846
59177B459565p4741p1664o8939o6349o4430o3567o3379o3218o2742o1790o0175
59166A738571n8047n6037n4533n3078n0936m8106m5222m2649m0283l8081l6163
59155A215436l4311l1984k9143k6530k4767k3489k1836j9623j7562j6260j5357
59144I54574j3935j1719r542q351p941p081n030k437m35P65J835L196M614N930
59130I04443P477R512J1756J3755J5372J6694J7839J9094K0851K3109K5355K7199
59118A112456K8855L0625L2235L3046L2862L2117L1395L0991L0842L0607K9899
$$ y = [3863971, 3927993, 3970983, 3991199, 3987885, 3961126, 3912094, 3843199, 3757812, 3659797, 3553163, 3441780, 3329012, 3217410, 3108664, 3003668, 2902595, 2805222, 2711591, 2622393, 2538411, 2459565, 2384824, 2313160, 2244221, 2177872, 2113442, 2049875, 1986496, 1923278, 1860536, 1798746, 1738571, 1680524, 1624487, 1569954, 1516876, 1465940, 1417834, 1372612, 1329963, 1289680, 1251599, 1215436, 1181125, 1149141, 1119998, 1093468, 1068701, 1045212, 1023376, 1003753, 986191, 969931, 954574, 940639, 928920, 919378, 911027, 903086, 896005, 890975, 888538, 888103, 888868, 890703, 893899, 898513, 904443, 911920, 921432, 933188, 946943, 962315, 979009, 996848, 1015942, 1036793, 1059902, 1085257, 1112456, 1141311, 1171936, 1204171, 1237217, 1270079, 1302196, 1333591, 1364582, 1395424, 1426031, 1455930]
59107A455930K8737K7594K6751K5747K3803K0677J6743J2435Q110M487K586K918
59095A656518N063Q261J2089J6304K0299K3202K4409K3816K1572J7805J2586N960
59083A847884j967j0810j9820k8234l5739m2473m8544n3723n7588n9835o0408
59072A428743n9507n7473n4639n1221m7438m3635m0142l6984l3997l1162k8618
59061I43927k6316k3962k1446j9067j7101j5334j3353j1132r043p341n920m544
59049G69368l147j925j210j163j382j035K48J869K976L599M524O125P960R691
59035G96498J1722J4470J7603K0500K3200K6162K9171L1143L1218K9651K7326
59024A058664K4653K1291J6934J2072P619L937O18k621n240o515o589o241n668
$$ y = [1455930, 1484667, 1512261, 1539012, 1564759, 1588562, 1609239, 1625982, 1638417, 1646527, 1651014, 1653600, 1656518, 1661581, 1669842, 1681931, 1698235, 1718534, 1741736, 1766145, 1789961, 1811533, 1829338, 1841924, 1847884, 1845917, 1835107, 1815287, 1787053, 1751314, 1708841, 1660297, 1606574, 1548986, 1489151, 1428743, 1369236, 1311763, 1257124, 1205903, 1158465, 1114830, 1074688, 1037704, 1003707, 972545, 943927, 917611, 893649, 872203, 853136, 836035, 820701, 807348, 796216, 787173, 779832, 773912, 769368, 766221, 764296, 763086, 761923, 760541, 759506, 759754, 761623, 764599, 768198, 772722, 778847, 786807, 796498, 808220, 822690, 840293, 860793, 883993, 910155, 939326, 970469, 1001687, 1031338, 1058664, 1083317, 1104608, 1121542, 1133614, 1141233, 1145170, 1145788, 1143167, 1137927, 1131412, 1124823, 1118582, 1112914]
59011A112914m261j715J346M214O916R687J2209J3977J5091J5916J6202J5169
58999A217665J2405Q180K935k978r186j5331k1224k6535l0588l2989l4221l4953
58987A033180l4964l3484l0617k7499k4853k2253j9158j5871j3044j0793q938
58976G91706p524o509n256l097j98K660N034P062Q891J0420J1613J2620J3431
58963H40853J3743J3336J2321J0961R393P551N261K466n09k916m087m026l340
58950I01007k577j699k80J936M700P419R638J1322J2700J3821J4508J4723J4789
58937A002007J4918J4736J3598J1555R558Q499Q218P880P269P222Q580J1065J3650
58924A138755J5828J8045K0858K4176K7517L0559L3192L5405L7497L9963M2762
$$ y = [1112914, 1108653, 1106938, 1108284, 1112498, 1119414, 1129101, 1141310, 1155287, 1170378, 1186294, 1202496, 1217665, 1230070, 1238250, 1241185, 1238207, 1229021, 1213690, 1192466, 1165931, 1135343, 1102354, 1068133, 1033180, 998216, 964732, 934115, 906616, 881763, 859510, 840352, 824481, 811437, 800644, 791706, 784182, 777673, 772417, 769320, 769122, 771782, 776816, 783878, 792769, 803189, 814802, 827422, 840853, 854596, 867932, 880253, 891214, 900607, 908158, 913419, 915885, 915376, 912460, 908373, 904347, 901007, 898430, 896731, 896451, 898387, 903087, 910506, 920144, 931466, 944166, 957987, 972495, 987218, 1002007, 1016925, 1031661, 1045259, 1056814, 1066372, 1074871, 1083089, 1090969, 1098238, 1105460, 1114040, 1125105, 1138755, 1154583, 1172628, 1193486, 1217662, 1245179, 1275738, 1308930, 1344335, 1381832, 1421795, 1464557]
58913A464557M5081M6376M7463M9870N4199N9770O5843P2403P9572Q7006R4463
58902B166603J02327J10983J19966J28333J35664J42147J47713J51757J53759
58893C359252J53677J51364J45967J36398J22310J04310Q3186N9353L3252N999
58883D355068k0917m6555p0685r2835j11618j25503j34180j38858j41163j41980
58873C330774j41231j38529j33975j28368j22557j16661j10262j03486r7258r2066
58863B146381q6999q0821p3685o6953o1416n6679n2408m9087m7078m5771m4302
58852A481182m2549m0744l8620l5770l2557k9849k7807k5596k2492j8794j5432
58841A150972j2934j1107r558q275p495p092o422n001l162j615m57R68L080N496
$$ y = [1464557, 1509638, 1556014, 1603477, 1653347, 1707546, 1767316, 1833159, 1905562, 1985134, 2072140, 2166603, 2268930, 2379913, 2499879, 2628212, 2763876, 2906023, 3053736, 3205493, 3359252, 3512929, 3664293, 3810260, 3946658, 4068968, 4173278, 4256464, 4315817, 4349069, 4355068, 4334151, 4287596, 4216911, 4124076, 4012458, 3886955, 3752775, 3613917, 3472754, 3330774, 3189543, 3051014, 2917039, 2788671, 2666114, 2549453, 2439191, 2335705, 2238447, 2146381, 2059382, 1978561, 1904876, 1837923, 1776507, 1719828, 1667420, 1618333, 1571255, 1525484, 1481182, 1438633, 1397889, 1359269, 1323499, 1290942, 1261093, 1233286, 1207690, 1185198, 1166404, 1150972, 1138038, 1126931, 1117373, 1109098, 1101603, 1094511, 1088089, 1083088, 1079926, 1078311, 1077854, 1078822, 1081902, 1087398]
58827A087398P634R492J1465J3714J6042J8228K0179K1969K3963K6632K9916L2978
58815A319610L5050L6375L7988M0572M3872M7248N0482N3839N7643O1964O6828
58804A851471P2393P8747Q5529R2122R8402J04982J12431J20384J27818J33995
58794B878274J38692J41764J42966J42127J38803J31816J19965J03345Q3296O0869
58784D081917L6087R065j8902m5935p0722r2596j10994j25423j35691j41812j44038
58773C240956j43269j40882j37646j33325j27751j21623j15676j09606j02664
58764B108514r4926q7197p9914p2904o6106n9803n4219m9282m4703l9922l4494
58753A425044k8866k4262k1110j8236j4463j0361p298n192k700N63L509N584P808
$$ y = [1087398, 1095032, 1104524, 1115989, 1129703, 1145745, 1163973, 1184152, 1206121, 1230084, 1256716, 1286632, 1319610, 1354660, 1391035, 1429023, 1469595, 1513467, 1560715, 1611197, 1665036, 1722679, 1784643, 1851471, 1923864, 2002611, 2088140, 2180262, 2278664, 2383646, 2496077, 2616461, 2744279, 2878274, 3016966, 3158730, 3301696, 3443823, 3582626, 3714442, 3834407, 3937752, 4021048, 4081917, 4118004, 4127069, 4108167, 4062232, 3991510, 3898914, 3787920, 3662497, 3526806, 3384994, 3240956, 3097687, 2956805, 2819159, 2685834, 2558083, 2436460, 2320784, 2211178, 2108514, 2013588, 1926391, 1846477, 1773573, 1707467, 1647664, 1593445, 1544163, 1499460, 1459538, 1425044, 1396178, 1371916, 1350806, 1332570, 1318107, 1307746, 1300448, 1295256, 1292556, 1293119, 1296628, 1302212, 1310020]
58740A310020J1192J5191J8550K0756K1831K1341J8577J3468O668j041q871j5861
58728A431821k1192k4679k6589k7026k5927k3618k1049j9276j8823j9566k1140
58717A182936k3355k6208k9566l2989l5898l7741l8089l6935l5015l3328l2014
58706H21798l0227k7466k4448k2074k0131j7913j5594j3838j2285r798o393l646
58694F17985k653k608k068q42J41J84n96j621k308k497k856m326o711q459q378
58679E72387p028n732m739l253r60J459L356M839O368Q222J0539J3286J5918J7530
58665F32192J7621J6473J4568J1916Q308M024m5l161n410p426r476j1085j1705
58652F56794j1516j1252j1397j1872j2372j2601j2198j1003r558q783q858q801
$$ y = [1310020, 1321212, 1336403, 1354953, 1375709, 1397540, 1418881, 1437458, 1450926, 1457594, 1456553, 1447682, 1431821, 1410629, 1385950, 1359361, 1332335, 1306408, 1282790, 1261741, 1242465, 1223642, 1204076, 1182936, 1159581, 1133373, 1103807, 1070818, 1034920, 997179, 959090, 922155, 887140, 853812, 821798, 791571, 764105, 739657, 717583, 697452, 679539, 663945, 650107, 637822, 628024, 621631, 617985, 615332, 612724, 610656, 609814, 609955, 610139, 609543, 607922, 605614, 603117, 600261, 595935, 589224, 580765, 572387, 565359, 559627, 554888, 551635, 550675, 552134, 555490, 560329, 566697, 574919, 585458, 598744, 614662, 632192, 649813, 666286, 680854, 692770, 701078, 705102, 705057, 701896, 696486, 689060, 679584, 668499, 656794, 645278, 634026, 622629, 610757, 598385, 585784, 573586, 562583, 553025, 544242, 535384, 526583]
58640E26583p561n279l156k187k290k532j986n10J147K107K269K295K701L315
58626E14916L734L891L915L841L758M001M887O351Q110R949J1722J3285J4685
58613F07045J6117J7563J8735J9620K0703K2347K4257K5945K7447K9196L1429
58602H60404L4091L7170M0590M3866M6365M7988M9232N0468N1313N0823M8129
58591A360439M2967L5723K7102J7744Q136j257j0068j8172k5365l0921l3929l4331
58579A338068l3175l1490k9325k6258k2420j8515j4987j1749q638n677k885k19
58567A132730K270M552O825R410J2369J5551J8867K2224K5136K6600K5441K0806
58555A322781J2623J819j0030k1547l1910m0430m6291m9161m9726m9035m7485
$$ y = [526583, 519022, 513743, 510587, 508400, 506110, 503578, 501592, 501082, 502229, 504336, 506605, 508900, 511601, 514916, 518650, 522541, 526456, 530297, 534055, 538056, 542943, 549294, 557404, 567353, 579075, 592360, 607045, 623162, 640725, 659460, 679080, 699783, 722130, 746387, 772332, 799779, 828975, 860404, 894495, 931665, 972255, 1016121, 1062486, 1110474, 1159706, 1210174, 1261487, 1312310, 1360439, 1403406, 1439129, 1466231, 1483975, 1492111, 1490854, 1480786, 1462614, 1437249, 1406328, 1372399, 1338068, 1304893, 1273403, 1244078, 1217820, 1195400, 1176885, 1161898, 1150149, 1141511, 1135834, 1132949, 1132730, 1135000, 1139552, 1146377, 1155787, 1168156, 1183707, 1202574, 1224798, 1249934, 1276534, 1301975, 1322781, 1335404, 1337223, 1327193, 1305646, 1273736, 1233306, 1187015, 1137854, 1088128, 1039093, 991608]
58544I91608m4919m1470l7677l3881l0142k6787k4272k2267j9689j6057j2426
58533F82021j0333j0141j0801j1088j0543r323p743o173n021m424m109l796l604
58520E84922l820m301m460l997l261k720k335j819j187o23L2J092K331L180L672
58505E66706M469N715O592O529O152O358O956P153P027P450Q597R561R841J0302
58491F69408J2048J4922J7806K0089K2068K3981K5275K5195K3715K1446J8768
58480H94721J5406J1093O244J673k340o278j0609j5065j8986k2060k4370k5819
58468H03610k5979k4689k2455k0050j7779j5416j2842j0484q854p826o724n246
58456F25266l842k875j947n95P79J443J638K337L546M018L148K130K425L797M924
$$ y = [991608, 946689, 905219, 867542, 833661, 803519, 776732, 752460, 730193, 710504, 694447, 682021, 671688, 661547, 650746, 639658, 629115, 619792, 612049, 605876, 600855, 596431, 592322, 588526, 584922, 581102, 576801, 572341, 568344, 565083, 562363, 560028, 558209, 557022, 556399, 556431, 557523, 559854, 563034, 566706, 571175, 576890, 583482, 590011, 596163, 602521, 609477, 616630, 623657, 631107, 639704, 649265, 659106, 669408, 681456, 696378, 714184, 734273, 756341, 780322, 805597, 830792, 854507, 875953, 894721, 910127, 921220, 927464, 929137, 926797, 920519, 909910, 894845, 875859, 853799, 829429, 803610, 777631, 752942, 730487, 710437, 692658, 677242, 664400, 653916, 645062, 637236, 630512, 625266, 621424, 618549, 616602, 616007, 616786, 618229, 619867, 622204, 625750, 629768, 632916, 635046, 637471, 641268, 646192]
58441F46192N405O001P088Q084Q573R002R849J0823J1360J1376J1171J0981J0945
58428G66850J1092J1016R841P006L020q41l573n075n862o379o679o622o219n629
58414G61946m829l588j824J70K018L582M868N916O959Q383J0170J1709J2521J2936
58400H30937J3554J4172J3861J2046R092N791K721J28j967l648m828n122m318
58387H82419k913j738j106o52N3J180K781M689O169O306M929K755N47j394k776
58372I01249l018j836K55K429M261N748O839P424P613P750Q081Q609R159R537
58358I74100R647R607R718J0236J1181J2308J3275J3954J4614J5611J6813J7730
58346A128794J8335J9288K0818K1844K0981J8267J5077J2339R774P078M912M013
$$ y = [646192, 651597, 657598, 664686, 672770, 681343, 690345, 700194, 711017, 722377, 733753, 744924, 755905, 766850, 777942, 788958, 798799, 805805, 808825, 807984, 804411, 799336, 793474, 787095, 780416, 773794, 767575, 761946, 757117, 753529, 751705, 751875, 753893, 757475, 762343, 768259, 775218, 783601, 793771, 805480, 818001, 830937, 844491, 858663, 872524, 884570, 893662, 899453, 902174, 902302, 900335, 896687, 891859, 886737, 882419, 879506, 877768, 876662, 876010, 876063, 877243, 880024, 884713, 890882, 897188, 902117, 904872, 905419, 904025, 901249, 898231, 896395, 896650, 899079, 903340, 909088, 915927, 923351, 930964, 938714, 946795, 955404, 964563, 974100, 983747, 993354, 1003072, 1013308, 1024489, 1036797, 1050072, 1064026, 1078640, 1094251, 1111064, 1128794, 1147129, 1166417, 1187235, 1209079, 1230060, 1248327, 1263404, 1275743, 1285517, 1292595, 1297507, 1301520]
58334A301520L977L727L033K790L805N788P808R340J0587J1891J3208J4319J5341
58321A407134J6582J7913J8774J9007J9304K0376K2028K3527K4587K5469K6334
58310A641035K7105K7891K8874K9756K9857K8808K6734K3856K0576J7801J6396
58299A918689J6230J6427J6716J7689J9621K1863K3798K5582K7524K9402L0983
58288B164524L2547L4428L6411L8184L9928M1993M4320M6607M8819N1099N3550
58277B632410N6439O0239O5005P0026P4437P8062Q1330Q4557Q7525Q9532Q9808
58266C469370Q8154Q5096Q1023P5406O7678N8831N1066M5687M2385M0880M1898
58255D147474M5742N1108N6491O2043O8914P7351Q6453R5362J03674J11131J17798
$$ y = [1301520, 1305497, 1309224, 1312257, 1315047, 1318852, 1324640, 1332448, 1341788, 1352375, 1364266, 1377474, 1391793, 1407134, 1423716, 1441629, 1460403, 1479410, 1498714, 1519090, 1541118, 1564645, 1589232, 1614701, 1641035, 1668140, 1696031, 1724905, 1754661, 1784518, 1813326, 1840060, 1863916, 1884492, 1902293, 1918689, 1934919, 1951346, 1968062, 1985751, 2005372, 2027235, 2051033, 2076615, 2104139, 2133541, 2164524, 2197071, 2231499, 2267910, 2306094, 2346022, 2388015, 2432335, 2478942, 2527761, 2578860, 2632410, 2688849, 2749088, 2814093, 2884119, 2958556, 3036618, 3117948, 3202505, 3290030, 3379562, 3469370, 3557524, 3642620, 3723643, 3799049, 3866727, 3925558, 3976624, 4022311, 4064696, 4105576, 4147474, 4193216, 4244324, 4300815, 4362858, 4431772, 4509123, 4595576, 4690938, 4794612, 4905743, 5023541]
58244E023541J24315J31179J38207J45296J53083J61996J71354J80468J89973
58235F419412K00968K13434K26617K40498K55594K71805K88704L06643L26372
58226H750047L47983L71264L96611M24457M54508M86784N22568N63072O08222
58217A2925516O58280P15252P80731Q53976R34662J026105J132873J256928J399790
58208B1684113J566975J765972K001106K275351K596005K972590L409741L908744
58200D2180597M475821N122168N857642O695965P669833Q834657J0260732J2033354
58192A03130769J4250938J6991450K0272063K4056863K8250697L2505835L5858701
58185B75317316L6613359L2931600K3977929J0766106m074391j7506039k7369795
$$ y = [5023541, 5147856, 5279035, 5417242, 5562538, 5715621, 5877617, 6048971, 6229439, 6419412, 6620380, 6833814, 7060431, 7300929, 7556523, 7828328, 8117032, 8423675, 8750047, 9098030, 9469294, 9865905, 10290362, 10744870, 11231654, 11754222, 12317294, 12925516, 13583796, 14299048, 15079779, 15933755, 16868417, 17894522, 19027395, 20284323, 21684113, 23251088, 25017060, 27018166, 29293517, 31889522, 34862112, 38271853, 42180597, 46656418, 51778586, 57636228, 64332193, 72002026, 80836683, 91097415, 103130769, 117381707, 134373157, 154645220, 178702083, 206952780, 239458615, 275317316, 311930675, 344862275, 368840204, 379606310, 375531919, 358025880, 330656085]
58178C30656085l2941055l4671959l3587872l0785608k7172590k3386450j9812165
58171A28298386j6640979j3933636j1672913r806083q273560p018725n988450
58164E4964040n137102m430620l842394l347579k925616k564262k255108j987618
58156B8473741j752224j545065j363432j199928j047233r05317p77643o63833
58148A9219066n62284m75198m02470l33917k55997j63639n7990O2716K00573L51402
58138A7582262N12614O94534R13676J181841J515155J942979K487157L146959
58130B9977177L936927M910689O044787P033870P271445O186985L708792M11753
58122F9482425k807057n227048o574904o961152o668586n988849n152228m310649
$$ y = [330656085, 297715030, 263043071, 229455199, 198669591, 171497001, 148110551, 128298386, 111657407, 97723771, 86050858, 76244775, 67971215, 60952490, 54964040, 49826938, 45396318, 41553924, 38206345, 35280729, 32716467, 30461359, 28473741, 26721517, 25176452, 23813020, 22613092, 21565859, 20660542, 19882899, 19219066, 18656782, 18181584, 17779114, 17445197, 17189200, 17025561, 16967571, 17030287, 17230860, 17582262, 18094876, 18789410, 19703086, 20884927, 22400082, 24343061, 26830218, 29977177, 33914104, 38824793, 44869580, 51903450, 59174895, 65361880, 69070672, 69482425, 66675368, 61448320, 54873416, 47912264, 41243678, 35254829, 30102601, 25791952]
58114B5791952l545995k892607k357885j932150j595681j328062j113306r38102
58106A0088164p91053o66052n62937m82382m21857l76972l44095l20514l03791
58097E818511k91692k81424k68878k50558k26415j99372j72123j45973j22478
58088C859598j04196r3348r0844r6337j07734j20840j31160j36415j36628j32405
58078B709691j24647j15410j07078j00321r4153q7944q2145p7069p2318o7591
58068A781015o2961n8323n3565m9231m5928m3180l9949l6204l2937l0653k8983
58057A299101k7679k6925k6657k6535k6601k6952k6919k5638k3405k1344j9862
58046A020584j8547j7485j7295j7703j7534j6407j5284j4786j4260j3043j1602
$$ y = [25791952, 22245957, 19353350, 16995465, 15063315, 13467634, 12139572, 11026266, 10088164, 9297111, 8631059, 8068122, 7585740, 7163883, 6786911, 6442816, 6122302, 5818511, 5526819, 5245395, 4976517, 4725959, 4499544, 4300172, 4128049, 3982076, 3859598, 3755402, 3662054, 3571210, 3474873, 3367139, 3246299, 3115139, 2978724, 2842096, 2709691, 2585044, 2469634, 2362556, 2262235, 2168082, 2080138, 1997993, 1920924, 1848606, 1781015, 1718054, 1659731, 1606166, 1556935, 1511007, 1467827, 1427878, 1391674, 1358737, 1328084, 1299101, 1271422, 1244497, 1217840, 1191305, 1164704, 1137752, 1110833, 1085195, 1061790, 1040446, 1020584, 1002037, 984552, 967257, 949554, 932020, 915613, 900329, 885543, 871283, 858240, 846638]
58035H46638j0676j0133r460q707q280q287q609r196r818j0020r668r207r042
58022G25535r094r195r367r462r037p957o697n761n171m778m543m233l385j892
58008F34963k08J285K664L947M830N293N948P290R071J0843J2665J4682J6336
57995G29609J6726J5575J3324J0350O664K421j730n021p082q051q319q259q135
57982G48072q246q955j0352j1893j2749j2677j2220j1889j1525j0681r354p867
57970F19664o297m398k150QJ612K668L640M915O231O728N773L753J686l0k023
57955F41780m841p918j0152j1212j1641j1786j1257r725p674o006n105m553l687
57942E36223k220l86J353K695L632M275M772N463O869R071J1292J2615J3185J4036
$$ y = [846638, 835962, 825829, 816369, 807662, 799382, 791095, 782486, 773290, 763472, 753452, 743784, 734577, 725535, 716441, 707246, 697879, 688417, 679380, 671423, 664726, 658965, 653794, 649016, 644473, 640240, 636855, 634963, 634755, 636040, 638704, 642651, 647481, 652774, 658722, 666012, 675083, 685926, 698591, 713273, 729609, 746335, 761910, 775234, 785584, 792248, 794669, 792939, 787918, 780836, 772785, 764466, 756207, 748072, 739826, 730871, 720519, 708626, 695877, 683200, 670980, 659091, 647566, 636885, 627531, 619664, 613367, 608969, 606819, 606827, 608439, 611107, 614747, 619662, 625893, 632621, 638394, 642147, 643833, 643803, 641780, 636939, 629021, 618869, 607657, 596016, 584230, 572973, 563248, 555574, 549568, 544463, 539910, 536223, 534003, 533617, 534970, 537665, 541297, 545572, 550344, 555807, 562676, 571747, 583039, 595654, 608839, 622875]
57928F22875J5553J6696J6319J4652J2753J0928Q592N606K676J31k699o375j0342
57915G07365j3646j6178j8446k0449k1504k1105j9407j6950j4386j2221j0385
57904E22688q277n834m191m440n950o923o609n957n837n733m784l171j697o13
57890D52672L19J028J254J268J699K738M011N197O244P067P462P372O834N790
57876E10955M243K578J310N47o8q88j916k863l364l302l062l215l730l887l208
57861D90130k148j415r59r0J545L662N795P564Q637Q963R033R408R981J0125R548
57846E69779Q602P784P247O771N885M143J681o82k245l194m119n071n617n719
57832E85245n832o166o490o629o557o018m717k999j617q00j44O00J351K345L953
$$ y = [622875, 638428, 655124, 671443, 686095, 698848, 709776, 718368, 723974, 726650, 726781, 724082, 717707, 707365, 693719, 677541, 659095, 638646, 617142, 596037, 576630, 559680, 545294, 533073, 522688, 514411, 508577, 504386, 499946, 493996, 487073, 480464, 474507, 468670, 462937, 458153, 454982, 453285, 452672, 452991, 454019, 455273, 456541, 458240, 460978, 464989, 470186, 476430, 483497, 490959, 498331, 505165, 510955, 515198, 517776, 519086, 519633, 519565, 518677, 516761, 513898, 510534, 507232, 504170, 500955, 497225, 493338, 490130, 487982, 486567, 485608, 485518, 487063, 490725, 496520, 504084, 512721, 521684, 530717, 540125, 550106, 560231, 569779, 578381, 586165, 593412, 600183, 606068, 610211, 611892, 611210, 608965, 605771, 601652, 596581, 590964, 585245, 579413, 573247, 566757, 560128, 553571, 547553, 542836, 539837, 538220, 537420, 537276, 537876, 539227, 541572, 545525]
57817E45525N662O294N656M946M881M535K933Q33k89m81j113k713m333n141n388
57802E61807n484n276m693m235m127l696k307m21R92J741K474L573M691N433N999
57787E56471O973Q651J0582J1770J1463R949Q289P127O169N099M514N208O881
57774F59146Q319Q859Q812Q397P209N143L071J938J726J764J531P14r17k972m350
57759G08390m540m528n483o899p201o052m729m079l451k203j037r76j787k342
57745F53083k090j348m85M40J415K371L273L930M061L735L404L112K269O89p42
57730F77117j108p14n23o98n37L70J683K925L862M308M299M401N263O767Q162
57715G15577Q940R121Q786P968O992O358O263O640P482Q663R647J0073J0480J1776
$$ y = [545525, 551187, 557481, 563137, 568083, 572964, 577499, 580432, 581265, 580976, 580495, 579382, 576669, 572336, 567195, 561807, 556323, 551047, 546354, 542119, 537992, 534296, 531989, 531568, 532560, 534301, 536775, 540348, 545039, 550472, 556471, 563444, 572095, 582677, 594447, 605910, 615859, 624148, 631275, 637444, 642543, 647057, 652265, 659146, 667465, 676324, 685136, 693533, 700742, 705885, 708956, 710894, 712620, 714384, 715915, 716629, 715712, 712740, 708390, 703850, 699322, 693839, 686940, 679739, 673687, 668958, 664879, 661428, 659225, 658188, 657212, 655425, 653083, 650993, 649645, 649160, 649600, 651015, 653386, 656659, 660589, 664650, 668385, 671789, 674901, 677170, 677859, 677117, 676009, 675295, 674772, 674074, 673537, 673907, 675590, 678515, 682377, 686685, 690984, 695385, 700648, 707415, 715577, 724517, 733638, 742424, 750392, 757384, 763742, 770005, 776645, 784127, 792790, 802437, 812510, 822990, 834766]
57701H34766J4095J6852J9736K2875K6072K8858L1303L3892L6317L7132L4942
57690A136840K9350K0795J0369jq160j3165j5617j6325j5293j2279p658k211L431
57677A110076Q846J3985J9467K6117L3841M1663M9250N7619O7890Q0115R3997
57666A602866J10013J28993J50647J72466J88979J91843J72717J28899O7069P28
57656B915220n6945r8583j23167j33528j33832j28065j19233j09238r9159q9549
57646A823921q0593p2336o4718n7462n0307m3520l7797l3304k9326k5179k1066
57635A308313j7506j4481j1721r412p809o423m429j790O31K142K765K908L036
57622A246224L715N259P200Q594R015Q915Q990R655J1107J3371J6094J8583K0352
$$ y = [834766, 848861, 865713, 885449, 908324, 934396, 963254, 994557, 1028449, 1064766, 1101898, 1136840, 1166190, 1186985, 1197354, 1197353, 1189193, 1176028, 1160411, 1144086, 1128793, 1116514, 1108856, 1106645, 1110076, 1118922, 1132907, 1152374, 1178491, 1212332, 1253995, 1303245, 1360864, 1428754, 1508869, 1602866, 1712879, 1841872, 1992519, 2164985, 2353964, 2545807, 2718524, 2847423, 2914492, 2915220, 2858275, 2759692, 2636525, 2502997, 2369165, 2241100, 2121867, 2012629, 1913470, 1823921, 1743328, 1670992, 1606274, 1548812, 1498505, 1454985, 1417188, 1383884, 1354558, 1329379, 1308313, 1290807, 1276326, 1264605, 1255193, 1247384, 1240961, 1236532, 1234742, 1235373, 1237515, 1240280, 1243188, 1246224, 1249939, 1255198, 1262398, 1270992, 1280007, 1288922, 1297912, 1307567, 1318674, 1332045, 1348139, 1366722, 1387074]
57609A387074K1475K2496K4032K6383K9220L1882L4083L6102L7989L8983L8225
57598A727944L5757L2284K8113K2878J6223Q266m51r011j6307k1784k5964k9601
57586A768347l2483l3616l2632l0321k7790k5652k4045k2750k1143j8704j5788
57575A483423j3349j1699j0181q236o179m618l667l080k697k312j585m80N38J072
57561A416950J292J583K046K706L762N227O539P098P017O889O910O720O124N566
57547A486429N632O353P227P894Q540R534J0770J1672J1900J1772J1795J2003
57535A601521J2118J2156J2427J3016J3698J4381J5092J5566J5358J4580J4024
57524A753937J4302J5284J6515J7778J8874J9421J9339J9286K0044K1647K3514
$$ y = [1387074, 1408549, 1431045, 1455077, 1481460, 1510680, 1542562, 1576645, 1612747, 1650736, 1689719, 1727944, 1763701, 1795985, 1824098, 1846976, 1863199, 1871465, 1871014, 1862003, 1845696, 1823912, 1797948, 1768347, 1735864, 1702248, 1669616, 1639295, 1611505, 1585853, 1561808, 1539058, 1517915, 1499211, 1483423, 1470074, 1458375, 1448194, 1439958, 1433779, 1429161, 1425494, 1422414, 1419717, 1417405, 1415820, 1415340, 1415878, 1416950, 1418242, 1419825, 1421871, 1424577, 1428339, 1433566, 1440105, 1447203, 1454220, 1461109, 1468019, 1474739, 1480863, 1486429, 1492061, 1498414, 1505641, 1513535, 1522075, 1531609, 1542379, 1554051, 1565951, 1577723, 1589518, 1601521, 1613639, 1625795, 1638222, 1651238, 1664936, 1679317, 1694409, 1709975, 1725333, 1739913, 1753937, 1768239, 1783523, 1800038, 1817816, 1836690, 1856111, 1875450, 1894736, 1914780, 1936427, 1959941]
57513A959941K5312K7194K9275L1371L3256L4817L5861L6157L5782L5077L4008
57502B318051L1914K8165K2944J7077J1140N156q03o131j0107j2626j4140j4968
57490B375672j5084j4476j3293j1578r348p070n462m529l307j076J615L737N132
57477B300933O425P843Q975R674J0386J1380J2388J3230J4120J5127J5891J6223
57465B442595J6489J7073J7898J8738J9638K0618K1466K2189K3287K5135K7391
57454B672517K9403L0967L2347L3792L5447L7460L9783M1983M3539M4196M3846
57443C085280M2412M0054L7148L3651K8908K2616J5629R225L800r89n033p542
57431C305159q295q249q461q784q190o154l302o67J338L062M933O833Q264R026
$$ y = [1959941, 1985253, 2012447, 2041722, 2073093, 2106349, 2141166, 2177027, 2213184, 2248966, 2284043, 2318051, 2349965, 2378130, 2401074, 2418151, 2429291, 2434447, 2433644, 2427513, 2417406, 2404780, 2390640, 2375672, 2360588, 2346112, 2332819, 2321241, 2311893, 2304823, 2299361, 2294832, 2291525, 2290449, 2292064, 2295801, 2300933, 2307358, 2315201, 2324176, 2333850, 2344236, 2355616, 2368004, 2381234, 2395354, 2410481, 2426372, 2442595, 2459084, 2476157, 2494055, 2512793, 2532431, 2553049, 2574515, 2596704, 2619991, 2645126, 2672517, 2701920, 2732887, 2765234, 2799026, 2834473, 2871933, 2911716, 2953699, 2997238, 3041434, 3085280, 3127692, 3167746, 3204894, 3238545, 3267453, 3290069, 3305698, 3314923, 3318723, 3317734, 3312701, 3305159, 3296864, 3288615, 3280154, 3271370, 3263180, 3257026, 3253724, 3253057, 3254395, 3257457, 3262390, 3269223, 3277487, 3286513]
57417C286513R524J0308J1475J2682J3647J4402J5078J5683J6172J6610J7091
57406C439185J7569J7892J8082J8525J9662K1384K2907K3561K3626K4022K5065
57395C671480K5916K5567K4136K2841K2741K3780K5053K5799K5999K6123K6420
57384C945855K6651K6577K6486K6863K7594K7953K7490K6632K6126K6193K6492
57373D240912K6656K6603K6408K6219K6228K6486K6789K6871K6730K6670K7074
57362D533646K8051K9142K9511K8764K7524K6837K7003K7493K7982K8686K9522
57351D844161K9831K9446K9291L0100L1264L1786L1864L2381L3164L3057L1841
57340E188186L0813L1094L2284L3320L3809L3939L3741L3176L2563L2234L2087
$$ y = [3286513, 3296037, 3306345, 3317820, 3330502, 3344149, 3358551, 3373629, 3389312, 3405484, 3422094, 3439185, 3456754, 3474646, 3492728, 3511253, 3530915, 3552299, 3575206, 3598767, 3622393, 3646415, 3671480, 3697396, 3722963, 3747099, 3769940, 3792681, 3816461, 3841514, 3867313, 3893312, 3919435, 3945855, 3972506, 3999083, 4025569, 4052432, 4080026, 4107979, 4135469, 4162101, 4188227, 4214420, 4240912, 4267568, 4294171, 4320579, 4346798, 4373026, 4399512, 4426301, 4453172, 4479902, 4506572, 4533646, 4561697, 4590839, 4620350, 4649114, 4676638, 4703475, 4730478, 4757971, 4785953, 4814639, 4844161, 4873992, 4903438, 4932729, 4962829, 4994093, 5025879, 5057743, 5090124, 5123288, 5156345, 5188186, 5218999, 5250093, 5282377, 5315697, 5349506, 5383445, 5417186, 5450362, 5482925, 5515159, 5547246]
57329E547246L2007L2414L3692L5257L5872L5014L3438L2272L1895L1978L2234
57318E913319L2774L3679L4563L4768L4091L3130L2698L2979L3438L3564L3385
57307F282388L3231L3274L3456L3648L3689L3402L2819L2213L1812L1574L1356
57296F642862L1182L1133L1158L1148L1125L1115L0956L0500K9919K9597K9664
57285F980359K9874L0021L0249L0774L1468L1906L1829L1400L0916L0425K9733
57274G318954K8802K7929K7465K7324K6907K5596K3429K1177J9567J8463J7057
57263G582670J5028J3058J1942J1478J0887J0111R892J0446J0954J0801J0592
57252G707859J1143J2030J2075J1063J0032R771R901R668R007Q483Q558R244J0081
$$ y = [5547246, 5579253, 5611667, 5645359, 5680616, 5716488, 5751502, 5784940, 5817212, 5849107, 5881085, 5913319, 5946093, 5979772, 6014335, 6049103, 6083194, 6116324, 6149022, 6182001, 6215439, 6249003, 6282388, 6315619, 6348893, 6382349, 6415997, 6449686, 6483088, 6515907, 6548120, 6579932, 6611506, 6642862, 6674044, 6705177, 6736335, 6767483, 6798608, 6829723, 6860679, 6891179, 6921098, 6950695, 6980359, 7010233, 7040254, 7070503, 7101277, 7132745, 7164651, 7196480, 7227880, 7258796, 7289221, 7318954, 7347756, 7375685, 7403150, 7430474, 7457381, 7482977, 7506406, 7527583, 7547150, 7565613, 7582670, 7597698, 7610756, 7622698, 7634176, 7645063, 7655174, 7665066, 7675512, 7686466, 7697267, 7707859, 7719002, 7731032, 7743107, 7754170, 7764202, 7773973, 7783874, 7793542, 7802549, 7811032, 7819590, 7828834, 7838915]
57239G838915J0303R376P543N551L762J934n4j848l219m480o084q123j0482j2948
57225G830146j4995j6028j6236j6581j7465j8033j7455j6374j6141j6887j7398
57214G646553j6938j6167j5905j5822j5015j3425j1972j1410j1569j1829j1918
57203G494583j2062j2499j3135j3711j4148j4649j5512j6890j8651k0378k1621
57192G321327k2377k3207k4595k6329k7848k9179l0967l3450l5958l7697l8671
57181F991049l9470m0587m2190m4171m5971m6838m6724m6518m6909m7435m7214
57170F497022m6179m4848m3302m1374l9499l8303l7403l5789l3549l1980l1638
57159F073158l1453l0483k9407k9405l0358l1262l1929l3169l5480l8642m2502
$$ y = [7838915, 7849218, 7858594, 7866137, 7871688, 7875450, 7877384, 7877330, 7875482, 7872263, 7867783, 7861699, 7853576, 7843094, 7830146, 7815151, 7799123, 7782887, 7766306, 7748841, 7730808, 7713353, 7696979, 7680838, 7663951, 7646553, 7629615, 7613448, 7597543, 7581721, 7566706, 7553281, 7541309, 7529899, 7518330, 7506501, 7494583, 7482521, 7470022, 7456887, 7443176, 7429028, 7414379, 7398867, 7381977, 7363326, 7342948, 7321327, 7298950, 7275743, 7251148, 7224819, 7196971, 7167792, 7136825, 7103375, 7067417, 7029720, 6991049, 6951579, 6910992, 6868802, 6824631, 6778660, 6731822, 6685098, 6638580, 6591671, 6544236, 6497022, 6450843, 6405995, 6362693, 6321319, 6281820, 6243517, 6206114, 6170325, 6136776, 6104796, 6073158, 6041705, 6011222, 5981815, 5952410, 5922052, 5890790, 5858861, 5825692, 5790212, 5751570, 5709068]
57148E709068m7194n2409n7279o1241o4455o7179o9364p1061p2560p3672p3361
57137D999293p0635o5583n9200n2394m5598l9156l3584k9245k6094k3929k2742
57126D531133k2709k3865k5910k8213k9888k9906k7423k2189j4638n458M832J5806
57114D321572K6820L7124M6382N4971O3865P4373Q7925J05647J28044J55248J87647
57103E289618K25974K70859L22912L83574M55609N42340O46551P70274R15232
57094I822943J083209J276138J495989J743916K018656K315173K624149K931947
57086B5312120L221167L472464L666325L781942L794544L677585L412528K998005
57078E3336680K448120J782500J021504J92787o60739j483726k220850k828194
$$ y = [5709068, 5661874, 5609465, 5552186, 5490945, 5426490, 5359311, 5289947, 5218886, 5146326, 5072654, 4999293, 4928658, 4863075, 4803875, 4751481, 4705883, 4666727, 4633143, 4603898, 4577804, 4553875, 4531133, 4508424, 4484559, 4458649, 4430436, 4400548, 4370642, 4343219, 4321030, 4306392, 4300934, 4305766, 4321572, 4348392, 4385516, 4431898, 4486869, 4550734, 4625107, 4713032, 4818679, 4946723, 5101971, 5289618, 5515592, 5786451, 6109363, 6492937, 6948546, 7490886, 8137437, 8907711, 9822943, 10906152, 12182290, 13678279, 15422195, 17440851, 19756024, 22380173, 25312120, 28533287, 32005751, 35672076, 39454018, 43248562, 46926147, 50338675, 53336680, 55784800, 57567300, 58588804, 58781591, 58120852, 56637126, 54416276, 51588082]
57070E1588082l277935l559237l678076l654457l516615l295326l020629k719454
57062B4866353k413055k115870j836995j582286j354905j155149r81262q30758
57054A2596073p00957n89036m92540m09854l39831k81122k32084j90893j55363
57045I204393j23186r2976o4848l9493j7035K656J9145L1883M1245M8121N2433
57034I062338N3049M9396M2486L4022K5222J6492P202m675k1424m2852o5106q3282
57022I072868r5192j01996j05697j07275j07256j06652j06436j06683j06861j06734
57012H022086j06580j06871j08172j11049j15578j21106j26804j32176j36729
57003F957021j39464j39467j36906j32832j27860j21718j14377j07028j01302
$$ y = [51588082, 48310147, 44750910, 41072834, 37418377, 33901762, 30606436, 27585807, 24866353, 22453298, 20337428, 18500433, 16918147, 15563242, 14408093, 13426831, 12596073, 11895116, 11306080, 10813540, 10403686, 10063855, 9782733, 9550649, 9359756, 9204393, 9081207, 8988231, 8923383, 8883890, 8866855, 8869511, 8888656, 8920539, 8961784, 9009905, 9062338, 9115387, 9164783, 9207269, 9241291, 9266513, 9283005, 9290207, 9285532, 9264108, 9221256, 9156150, 9072868, 8977676, 8875680, 8769983, 8662708, 8555452, 8448800, 8342364, 8235681, 8128820, 8022086, 7915506, 7808635, 7700463, 7589414, 7473836, 7352730, 7225926, 7093750, 6957021, 6817557, 6678090, 6541184, 6408352, 6280492, 6158774, 6044397, 5937369, 5836067]
56994E836067r7661r5083r2362q9190q5703q1404p5149o6247n4986m1754k6144
56983E030384p577J3636L6926O3222R4920J34100J82568K44106L21999M07558
56973F521842M69516M61675L51266J46344j03120l32316m94017n73475n82461
56964E865254n44447m82491m13421l47094k88223k38540j97952j65292j39420
56955C048374j19944j06736r9026r5338r4108r3882r3278r1492q8795q5942q3055
56944A996778p9531p5031o9892o4471n8707n2613m6653m1184l5884l0164k3912
56933A418736j7530j1468o134k250r51l389j0073k0295l2027m2704n0489n4868
56921A166558n6136n4794n1652m7925m4503m1279l7718l3975l0781k8254k5614
$$ y = [5836067, 5738406, 5643323, 5550961, 5461771, 5376068, 5294664, 5219515, 5153268, 5098282, 5056528, 5030384, 5022807, 5036443, 5073369, 5136591, 5231511, 5365611, 5548179, 5792285, 6114284, 6521842, 6991358, 7453033, 7804299, 7950643, 7847523, 7515207, 7021190, 6447715, 5865254, 5320807, 4838316, 4424895, 4077801, 3789578, 3551038, 3353086, 3187794, 3048374, 2928430, 2821694, 2722668, 2627330, 2533222, 2439340, 2346062, 2254570, 2165775, 2079833, 1996778, 1917247, 1842216, 1772324, 1707853, 1649146, 1596533, 1549880, 1508696, 1472812, 1442648, 1418736, 1401206, 1389738, 1383604, 1381354, 1380403, 1377014, 1366941, 1346646, 1314619, 1271915, 1221426, 1166558, 1110422, 1055628, 1003976, 956051, 911548, 870269, 832551, 798576, 767795, 739541, 713927]
56910G13927k2396j9294j7245j6148j5118j3787j2650j2107j1806j1209j0375
56899E51792r742r340q631p144n015k825r97N10K093M169O876R942J2792J4915
56885E59395J6076J6117J4499J0416L656m619j2262j7527k0029k0435j9554j7895
56873E07838j5735j3166r960n858j143L289O782R797J3623J9076K5660L2233L8381
56860F10817M4545N0512N4051N1771M1709K5053N422j3234k8057l7574m1612m1130
56848G22273l7591l2105k5293j7798j0510l967K133Q538J5627K3292L1439M0311
56836G16349N0162O0929P2032Q2079Q8275Q6549P3315M8185J5260j8559m6946
56825A227630o6436p6444p8186p3909o6252n7296m7933l8395k9125k0689j3053
$$ y = [713927, 691531, 672237, 654992, 638844, 623726, 609939, 597289, 585182, 573376, 562167, 551792, 542050, 532710, 524079, 516935, 511920, 509095, 508098, 508608, 510701, 514870, 521746, 531688, 544480, 559395, 575471, 591588, 606087, 616503, 620159, 615540, 603278, 585751, 565722, 545287, 525733, 507838, 492103, 478937, 468977, 463119, 461976, 465265, 472047, 481844, 495467, 514543, 540203, 572436, 610817, 655362, 705874, 759925, 811696, 853405, 878458, 883880, 870646, 842589, 805015, 763403, 722273, 684682, 652577, 627284, 609486, 598976, 595009, 597142, 605680, 621307, 644599, 676038, 716349, 766511, 827440, 899472, 981551, 1069826, 1156375, 1229690, 1277875, 1293135, 1274576, 1227630, 1161194, 1084750, 1006564, 932655, 866403, 809107, 761174, 722779, 693654, 672965, 659912]
56814F59912n576K185J0234J8657K7766L7418M6705N4438N9322N9411N2213L6477
56802A059162J3895j1295l4388n1870o1991o4941o2692n7826n1919m5134l7403
56791E93598k9491k2589j7147j2461p425j601M511J0137J5100J9847K4538K8288
56779F05305K9388K6186J7878N087r848k3548l3368l8816m1026m1078l9211l5544
56767D21405l0825k6106k2080j8893j6365j4214j2305j0778r722q813p700o718
56755B36886o584p172p257n963m074l181l793m858n137m411l244k147j322q88
56741A76855r06j224j590j904k141k119j614q19l12l81o48o68o32j013j668j935
56725A57281j646j443j784k228k119j539j039p98o32n13n35n19k67J9M8m7n1j58
$$ y = [659912, 654336, 656521, 666755, 685412, 713178, 750596, 797301, 851739, 911061, 970472, 1022685, 1059162, 1073057, 1061762, 1027374, 975504, 913513, 848572, 785880, 728054, 676135, 631001, 593598, 564107, 541518, 524371, 511910, 504485, 502884, 507395, 517532, 532632, 552479, 577017, 605305, 634693, 660879, 678757, 683844, 673996, 650448, 617080, 578264, 537238, 496160, 456949, 421405, 390580, 364474, 342394, 323501, 307136, 292922, 280617, 269839, 260117, 251304, 243604, 236886, 230302, 223130, 215873, 209910, 205836, 202655, 198862, 194004, 188867, 184456, 181212, 179065, 177743, 176855, 175949, 174725, 173135, 171231, 169090, 166971, 165357, 164538, 164226, 163845, 163197, 162529, 161897, 160884, 159216, 157281, 155635, 154192, 152408, 150180, 148061, 146522, 145483, 144685, 144053, 143540, 143005, 142486, 142219, 142238, 142286, 142239, 142188, 142030]
56707A42030m75m04N56J643J581M30m67m71k69k60K33J344J748N21j111j239Q2
56690A45472J137J011L71j05n84j064q41L81J730K179J763J184P30J91l49l62
56674A52844L98J377J684R89j53q81q08q8R75K081K741K517J696J195J561K336
56658A70464K710K455J877J320J135J689K824L672L565K879K370K044J342K25
56644B00571p09j102j138j060j001j180j588j664j082o66j500l122l720k487p34
56629A77818j57p87j399j280p77m79n46p77q40n85k97m54j026j375j109o11m51
56612A64868o45r05j238j784k299k312j707q47r7M53Q27R57P02O1n91o12K26J269
56594A56326J551R03Q4k41j79j10m3K59Q61J597K197K360K034J658J651J694J199
$$ y = [142030, 141555, 141151, 141707, 143350, 144931, 145361, 144894, 144423, 144154, 143894, 144127, 145471, 147219, 147740, 146629, 145390, 145472, 146609, 147620, 147991, 147886, 147302, 146238, 145397, 145778, 147508, 149687, 151450, 152634, 153364, 153555, 153206, 152844, 153242, 154619, 156303, 157292, 157139, 156258, 155450, 155362, 156337, 158418, 161159, 163676, 165372, 166567, 168128, 170464, 173174, 175629, 177506, 178826, 179961, 181650, 184474, 188146, 191711, 194590, 196960, 199004, 200346, 200571, 199862, 198760, 197622, 196562, 195561, 194381, 192793, 191129, 190047, 189381, 187881, 184759, 181039, 178552, 177818, 177661, 176874, 175475, 174195, 173418, 172939, 172393, 171616, 170776, 170191, 169894, 169440, 168414, 167039, 165930, 165319, 164868, 164223, 163318, 162080, 160296, 157997, 155685, 153978, 153131, 153034, 153487, 154314, 155271, 155973, 156034, 155443, 154831, 155057, 156326, 157877, 158780, 158864, 158623, 158444, 158334, 158291, 158550, 159411, 161008, 163205, 165565, 167599, 169257, 170908, 172602, 173801]
56577A73801M95O47J754K531K172J657K289L669M332L860L217L156L472L769L990
56562B14811M018L723L522M047N133N940O256O814Q001R080R191Q492P799P585
56548C04412P784Q122Q238P784O798N613M280K567P68k47k83m62j860l979n474
56533C44061o032o564p597q525q677q359q243q386q343p947p458p072o707o241
56519B37910n677n044m353l672l138k895l042l491l822l565k774k129k203k735
56505A89370k981k601j873j114l39M09Q58Q38N30J54j79j93N27J786K460J571
56489A89223m96k349l035k604j461O3J421J954J612J045P23N42N11J017J919K194
56473A92279J263Q6lQ99J620J784K114K891L402L226K968L111L173K726K485L265
$$ y = [173801, 174296, 174943, 176697, 179228, 181400, 183057, 185346, 189015, 193347, 197207, 200424, 203580, 207052, 210821, 214811, 218829, 222552, 226074, 230121, 235254, 241194, 247450, 254264, 262265, 271345, 280536, 289028, 296827, 304412, 312196, 320318, 328556, 336340, 343138, 348751, 353031, 355598, 356366, 356119, 355836, 355374, 353514, 349535, 344061, 338029, 331465, 323868, 315343, 306666, 298307, 290064, 281678, 273335, 265388, 257930, 250858, 244151, 237910, 232233, 227189, 222836, 219164, 216026, 213131, 210089, 206598, 202776, 199211, 196437, 194308, 192105, 189370, 186389, 183788, 181915, 180801, 180462, 180871, 181729, 182567, 183097, 183251, 183072, 182879, 183406, 185192, 187652, 189223, 188727, 186378, 183343, 180739, 179278, 179341, 180762, 182716, 184328, 185373, 186096, 186638, 187149, 188166, 190085, 192279, 193542, 193628, 193625, 194524, 196144, 197928, 200042, 202933, 206335, 209561, 212529, 215640, 218813, 221539, 224024, 227289]
56457B27289M467M685L693K754K895L715M186L937L395L108L290L705L764L017
56443B77900J710N92P8k4M6K83M80J15q25j482j140k60J00l08q76j266j853k819
56425B70451l648l825l541l312l216k988k563k192k080k229k507k691k532k006
56411B31121j349p35j34M27O53L80r5k95j50J4k7j34o3J80K71j64j119k082k518
56392B24181k484k446k496k204j428p44p00j055j233j172j196j363j450j430j319
56377B01461p83M98K145L416M153M758N247N112M257L310K724K183J295K94l64
56362B39706o28o62m53k5K33J7m06n50l40J1N37J482K748L800M173L792K856J695
56344B57986P60M92R95J950K861L326L130K266J039L8k09K74Q33P85J35m90o04
$$ y = [227289, 231756, 236441, 240134, 242888, 245783, 249498, 253684, 257621, 261016, 264124, 267414, 271119, 274883, 277900, 279610, 280202, 280280, 280256, 280302, 280585, 281065, 281180, 280355, 278873, 277733, 277473, 277573, 277265, 276389, 275123, 273270, 270451, 266803, 262978, 259437, 256125, 252909, 249921, 247358, 245166, 243086, 240857, 238350, 235659, 233127, 231121, 229772, 229037, 228903, 229330, 229983, 230363, 230268, 229973, 229823, 229837, 229810, 229676, 229613, 229793, 230064, 229900, 228781, 226699, 224181, 221697, 219251, 216755, 214551, 213123, 212379, 211679, 210624, 209391, 208219, 207023, 205660, 204210, 202780, 201461, 200678, 201176, 203321, 206737, 210890, 215648, 220895, 226007, 230264, 233574, 236298, 238481, 239776, 240070, 239706, 239078, 238416, 237963, 237938, 238171, 238188, 237782, 237232, 236892, 236903, 237440, 238922, 241670, 245470, 249643, 253435, 256291, 257986, 258746, 259238, 260233, 262183, 265044, 268370, 271500, 273766, 274805, 274843, 274634, 274908, 275741, 276526, 276661, 276171, 275567]
56327B75567k50M07J424K713L758M088L867L617L548L574L681L765L416K448J494
56312C17117J447K273L039L090K634K138J824J839K285K902L220L122K823K347
56298C52100J594Q06L57R3l36o77m52o3l75j163j241l92J83j28l13M76J385J253
56280C53107M62J96N97J007J407K234L139L277K704K250K118J684Q29L07O22J401
56264C77341K160K914L757M435M704M663M600M768N303O037O503O531O624P269
56250D47609Q124Q416Q024P564P504P763Q078Q190P726O541N223M657M968N363
56236E45750N085M165L182K610K508K515K219J647J239J209J264J183J168J255
56222E76999R20r0j033r56j0P34N84k12j030j363r63m1P29Q63N66K82R0l1J75
$$ y = [275567, 275317, 275724, 277148, 279861, 283619, 287707, 291574, 295191, 298739, 302313, 305994, 309759, 313175, 315623, 317117, 318564, 320837, 323876, 326966, 329600, 331738, 333562, 335401, 337686, 340588, 343808, 346930, 349753, 352100, 353694, 354500, 354857, 354950, 354614, 353937, 353485, 353422, 353047, 351884, 350643, 350251, 350434, 350306, 349993, 350469, 351854, 353107, 353569, 353765, 354362, 355369, 356776, 359010, 362149, 365426, 368130, 370380, 372498, 374182, 375011, 375318, 375940, 377341, 379501, 382415, 386172, 390607, 395311, 399974, 404574, 409342, 414645, 420682, 427185, 433716, 440340, 447609, 455733, 464149, 472173, 479737, 487241, 495004, 503082, 511272, 518998, 525539, 530762, 535419, 540387, 545750, 550835, 555000, 558182, 560792, 563300, 565815, 568034, 569681, 570920, 572129, 573393, 574576, 575744, 576999, 577919, 577829, 576796, 575840, 575830, 576564, 577148, 576936, 575906, 574543, 573580, 573539, 574268, 575131, 575697, 575979, 576069, 576038, 576213]
56203E76213P81J345J527J590J702J484Q87Q05J757K691K264Q67L6K23N18M38
56187E95128N26J136J828K298K707L006K918K727L061L730L925L676L957N015
56173F35638N788N424M445L858L941M314M581M541M356M643N788P212Q051Q427
56159G11007R074R816R702Q772Q327R067J0230J1045J1841J3054J4232J4875J5373
56146H56415J6335J7687J9083K0622K2501K4528K6512K8645L1086L3751L6856
56135A134021M1126M7071N4616O3749P4886Q8402J04413J23164J44781J68208
56125B044437J90963K10099K22794K26189K18159J99077J72365J42980J15739
56116C742802R4666Q1916P6172P2626O5630N1695L0770O069j7059l3730m2485
$$ y = [576213, 576994, 578339, 579866, 581456, 583158, 584642, 585529, 586334, 588091, 590782, 593046, 593913, 593949, 594172, 594690, 595128, 595654, 596790, 598618, 600916, 603623, 606629, 609547, 612274, 615335, 619065, 622990, 626666, 630623, 635638, 641426, 646850, 651295, 655153, 659094, 663408, 667989, 672530, 676886, 681529, 687317, 694529, 702580, 711007, 720081, 729897, 739599, 748371, 756698, 765765, 775995, 787040, 798881, 811935, 826167, 841042, 856415, 872750, 890437, 909520, 930142, 952643, 977171, 1003683, 1032328, 1063414, 1097165, 1134021, 1175147, 1222218, 1276834, 1340583, 1415469, 1503871, 1608284, 1731448, 1876229, 2044437, 2235400, 2445499, 2668293, 2894482, 3112641, 3311718, 3484083, 3627063, 3742802, 3837468, 3919384, 3995556, 4068182, 4133812, 4185507, 4216277, 4222346, 4205287, 4171557, 4129072]
56105D129072m5897m8496n4721o8125r0353j19525j50434j77223j95711k03700
56095B974887k00814j88841j71095j50465j28662j07305q8230p2115n8104m5569
56085A763687l5074k6885j9953j3450q128m995l526k394j242o67j002j995l233
56072A641143m199m391l865l060j866K81L063N198O195P045Q579J0350J1812J3334
56058A689619J5208J6827J7755J8608J9947K1297K2033K2385K2892K3760K5275
56047A915606K7761L0564L2385L3138L4137L5869L7204L7510L7910L9346M1106
56036B302536M2253M3094M4079M4825M5249M6183M7747M8829M9233N0575N3771
56025B818374N7386N9906O1889O4456O7305O9800P2343P5183P7521P9177Q1400
$$ y = [4129072, 4083175, 4034679, 3979958, 3911833, 3821480, 3701955, 3551521, 3374298, 3178587, 2974887, 2774073, 2585232, 2414137, 2263672, 2135010, 2027705, 1939475, 1867360, 1809256, 1763687, 1728613, 1701728, 1681775, 1668325, 1660197, 1655202, 1651676, 1649282, 1648040, 1647373, 1646371, 1644376, 1641143, 1636944, 1632553, 1628688, 1625628, 1623762, 1624043, 1627106, 1632304, 1638499, 1645544, 1654123, 1664473, 1676285, 1689619, 1704827, 1721654, 1739409, 1758017, 1777964, 1799261, 1821294, 1843679, 1866571, 1890331, 1915606, 1943367, 1973931, 2006316, 2039454, 2073591, 2109460, 2146664, 2184174, 2222084, 2261430, 2302536, 2344789, 2387883, 2431962, 2476787, 2522036, 2568219, 2615966, 2664795, 2714028, 2764603, 2818374, 2875760, 2935666, 2997555, 3062011, 3129316, 3199116, 3271459, 3346642, 3424163, 3503340, 3584740]
56014C584740Q4648Q7571Q9694R2858R8255J04246J09152J13929J19935J26272
56004D611300J31697J37101J43666J50605J57115J64446J73537J82883J91323
55995F043673K00662K12674K25911K38491K51699K67538K85044L02450L20899
55986H349041L42449L66488L91551M18614M49070M81777N15634N52677N95073
55977A2462374O41794O92180P49801Q18517Q97924R87096J089526J209677J348520
55968B0897409J507748J694474J916224K175753K476719K829169L242551L719035
55960D0459082M261377M881122N591576O402684P336278Q441314R786105J1447131
55952I8606669J3512719J6070438J9163525K2773844K6836996L1130422L4931367
$$ y = [3584740, 3669388, 3756959, 3846653, 3939511, 4037766, 4142012, 4251164, 4365093, 4485028, 4611300, 4742997, 4880098, 5023764, 5174369, 5331484, 5495930, 5669467, 5852350, 6043673, 6244335, 6457009, 6682920, 6921411, 7173110, 7440648, 7725692, 8028142, 8349041, 8691490, 9057978, 9449529, 9868143, 10317213, 10798990, 11314624, 11867301, 12462374, 13104168, 13796348, 14546149, 15364666, 16262590, 17249686, 18339212, 19548889, 20897409, 22405157, 24099631, 26015855, 28191608, 30668327, 33497496, 36740047, 40459082, 44720459, 49601581, 55193157, 61595841, 68932119, 77373433, 87159538, 98606669, 112119388, 128189826, 147353351, 170127195, 196964191, 228094613, 263025980]
55945B63025980L6744446L4648332K7361736J5304753P13681j3368332k4451173
55938C39979423l1383740l4294265l4058897l1768112k8395953k4662329k1023734
55931A34392393j7727906j4877458j2480431j0493803q859237p519783o421250
55924E6012525n514383m760585m131450l603178l155826k776224k455585k183984
55916B7431310j950861j749547j576578j427135j295121j177077j072202r79132
55908A6203657q95824q21811p57280p00647o49751o04495n65475n31138m99119
55899A0178117m69313m42952m19541l97548l77168l59758l45199l32155l20039
55890F714444l08507k95915k80809k64257k48462k33810k19195k04466j90409
$$ y = [263025980, 299770426, 334418758, 361780494, 377085247, 377798928, 364430596, 339979423, 308595683, 274301418, 240242521, 208474409, 180078456, 155416127, 134392393, 116664487, 101787029, 89306598, 78812795, 69953558, 62433775, 56012525, 50498142, 45737557, 41606107, 38002929, 34847103, 32070879, 29615294, 27431310, 25480449, 23730902, 22154324, 20727189, 19432068, 18254991, 17182789, 16203657, 15307833, 14486022, 13728742, 13028095, 12378344, 11773849, 11208374, 10677236, 10178117, 9708804, 9265852, 8846311, 8448763, 8071595, 7711837, 7366638, 7034483, 6714444, 6405937, 6110022, 5829213, 5564956, 5316494, 5082684, 4863489, 4659023, 4468614]
55881D468614j77039j63916j51406j39844j28245j15783j03535r2931q3273p2672
55871C239970o0593m7606l3527j7951k187J0882J8381J7720O820j3815l9913o6120
55859C012061q9405j08654j22509j29665j30501j26438j18365j07390r6061q6693
55849A896380p9173p2155o5631o0354n5681n0316m4623m0031l6549l2880k8617
55838A330370k4300j9738j4350q797m133N09P038J5053K1274K2576J8108Q643
55826A352253m053j6813k6109l0416l0728k8713k5553k2459k0698k0640k1731
55815A104340k3462k5480k7066k7702k7892k8277k8269k6965k4904k3349k2119
55804H18855j9905j6638j3671j1506r080n700k052J046L479M993M964L579K034
$$ y = [4468614, 4291575, 4127659, 3976253, 3836409, 3708164, 3592381, 3488846, 3395915, 3312642, 3239970, 3179377, 3131771, 3098244, 3080293, 3078106, 3088988, 3107369, 3125089, 3131909, 3118094, 3078181, 3012061, 2922656, 2814002, 2691493, 2561828, 2431327, 2304889, 2186524, 2079134, 1983073, 1896380, 1817207, 1745052, 1679421, 1619067, 1563386, 1513070, 1468447, 1428416, 1391867, 1358987, 1330370, 1306070, 1286332, 1271982, 1263185, 1259052, 1259561, 1266599, 1281652, 1302926, 1325502, 1343610, 1352253, 1348200, 1331387, 1305278, 1274862, 1244134, 1215421, 1189868, 1167409, 1146711, 1126071, 1104340, 1080878, 1055398, 1028332, 1000630, 972738, 944461, 916192, 889227, 864323, 840974, 818855, 798950, 782312, 768641, 757135, 748055, 742355, 740303, 741349, 744828, 749821, 754785, 758364, 760398]
55791G60398J007J9j338k526k923k615j885p73O42K235M195O609Q653R106P758
55776G88562N388K372j753p198j3361j9430k4604k7881k8570k7196k4966k2391
55764E98972j9348j6225j3785j1992j0207q682q508r842j1376j1994j1956j2061
55752D52996j2526j3002j2962j1880r755p489o019n251m635m469n370o822p580
55739C45236p522p615q077q066p375o810o519n540l579j822j214j235j127j113
55725B77622j677k636l680m863n926o143n478m874m797m589l919l682m460n194
55711B15704m534k751j178l82P5N52J010J538K228K730K544J613J20j914m336
55696B13019o510p768p942p184n715m080l125l111l316k838j536P7J381J894J615
$$ y = [760398, 761405, 761424, 760086, 757560, 754637, 752022, 750137, 749364, 750006, 752241, 756436, 763045, 771698, 780804, 788562, 793950, 796322, 794569, 787371, 774010, 754580, 729976, 702095, 673525, 646329, 621363, 598972, 579624, 563399, 549614, 537622, 527415, 518733, 510225, 500383, 489007, 477013, 465057, 452996, 440470, 427468, 414506, 402626, 392871, 385382, 379363, 374112, 369477, 365008, 359638, 352816, 345236, 337714, 330099, 322022, 313956, 306581, 299771, 293252, 287712, 284133, 282311, 281097, 279862, 278735, 277622, 275945, 273309, 269629, 264766, 258840, 252697, 247219, 242345, 237548, 232959, 229040, 225358, 220898, 215704, 211170, 208419, 207241, 206859, 206934, 207486, 208496, 210034, 212262, 214992, 217536, 219149, 219269, 217355, 213019, 206509, 198741, 190799, 183615, 177900, 173820, 170695, 167584, 164268, 161430, 159894, 159971, 161352, 163246, 164861]
55681A64861J419K401M480O313O931O728O441N983M947L560K405J678J223Q23
55667B20193j0j839m371o365p046p041p282p669p557o954o344n719m702l322k000
55652A41972q67K74J441K376K776K374J166j93p64m79k50n52o32K04J331J624
55636A51801R69O1q17j819k699k924k493j894j378r82j000j616k262k137j269
55621A29541l91J65O37J042R73K32q50j847k496k659k460k319k388k187j411o66
55605A12916p00j223j338r77p70o37K89J987L018K349Q68K49Q60J631J715J358
55589A21595J131J097J056J120J551K221K687K911L502M953O901Q585R829J1124
55575A80263J2781J4572J6427J8819K2130K6069L0160L4351L8786M3351M7787
$$ y = [164861, 166280, 168681, 173161, 179474, 186405, 193133, 199574, 205557, 210504, 214064, 216469, 218147, 219370, 220193, 220183, 218344, 213973, 207608, 200562, 193521, 186239, 178570, 171013, 164059, 157715, 151996, 147294, 143972, 141972, 141105, 141379, 142820, 145196, 147972, 150346, 151512, 151319, 150555, 150076, 149826, 149274, 148642, 148846, 150177, 151801, 152770, 152831, 152014, 150195, 147496, 144572, 142079, 140185, 138807, 137825, 136825, 135209, 132947, 130810, 129541, 129150, 129315, 129952, 130994, 131967, 132199, 131349, 129502, 127006, 124347, 121887, 119568, 117180, 114993, 113582, 112916, 112216, 110993, 109655, 108678, 107908, 107271, 107560, 109547, 112565, 114914, 115782, 116031, 116891, 118522, 120237, 121595, 122726, 123823, 124879, 125999, 127550, 129771, 132458, 135369, 138871, 143824, 150725, 159310, 169139, 180263, 193044, 207616, 224043, 242862, 264992, 291061, 321221, 355572, 394358, 437709, 485496]
55564D85496N1733N4094N2835M6309L4726J9922L870j1979k6323l7991m6488n1955
55552E74249n4437n3768n0295m5254m0080l5535l1490k7388k2952j8719j5669
55541A78662j4035j2842j1085r059p786p386o888n697m320l413k921k647k868
55528H7715l784m820n091m363l131j912q95j00M84Q69R90P91N60Q66J852K869
55512G2900L203K986K919L094K719J209q48k238k470k137j959j840j236r2J008
55497G7218J581J671J392N93p14j959k599k878l476m471n184n156m687m229l692
55482D3410k754j540n52j20k25p01j226j305p30n3j21r47j559j220m14k09q68
55465B8866j645j883j687j448j196p31p0N88J053J078M47n53j087o93J17N46N76
$$ y = [485496, 537229, 591323, 644158, 690467, 725193, 745115, 748985, 737006, 710683, 672692, 626204, 574249, 519812, 466044, 415749, 370495, 330415, 294880, 263390, 236002, 213050, 194331, 178662, 164627, 151785, 140700, 131641, 123855, 116469, 109581, 103884, 99564, 96151, 93230, 90583, 87715, 83931, 79111, 74020, 69657, 66526, 64614, 63719, 63619, 64103, 64972, 65962, 66753, 67313, 68179, 70031, 72900, 76103, 79089, 82008, 85102, 87821, 89030, 88182, 85944, 83474, 81337, 79378, 77538, 76302, 76210, 77218, 78799, 80470, 81862, 82455, 81741, 79782, 77183, 74305, 70829, 66358, 61174, 56018, 51331, 47102, 43410, 40656, 39116, 38564, 38444, 38219, 37518, 36292, 34987, 34257, 34204, 34083, 33136, 31577, 30357, 29943, 29734, 28866, 27221, 25338, 23651, 22203, 21007, 20276, 20206, 20794, 21847, 22925, 23372, 22819, 21732, 21039, 21156, 21702, 22278]
55448B2278O95Q84P11L24M61J184J493O57o77j287q25O5P08R38Q17L96k13q11
55430B7798j148j005m16J68K89J50L69R09Q94j00j143j046O7J017J177J043J214
55413C0237J535J438P69J7o3R11K497L735M166M276M660M999M465K973J366L56
55397F8337j24m33p39j241k254l591m379l989k903k140j984j866j494j399k010
55382C7791k710k434j124J07L76Nk58l63o57r29o01J52M55K3l76j31L52M37K49
55363C0364K22K33j20p36j162j373j684k096k253j981j371n05M13Q82O11K2l00
55346A9166m64q93j358j172l19M17O52Q85J571K354K646K426J964J258K38p57
55330B8614j207j072p83o54n79l61r7q7m34q31q31k93M77J034J133Q07L31J31
$$ y = [22278, 22973, 23857, 24568, 24892, 25353, 26537, 28030, 28687, 28010, 26723, 25898, 25963, 26671, 27609, 28426, 28822, 28609, 27798, 26650, 25645, 25229, 25397, 25686, 25836, 26205, 27114, 28008, 27908, 26765, 25719, 25786, 26803, 27980, 29023, 30237, 31772, 33210, 33979, 33996, 33933, 34844, 37341, 41076, 45242, 49518, 54178, 59177, 63642, 66615, 67981, 68337, 68213, 67780, 67041, 65800, 63546, 59955, 55576, 51587, 48684, 46544, 44560, 42694, 41200, 39801, 37791, 35081, 32647, 31523, 31630, 32006, 32011, 31753, 31390, 30733, 29804, 29203, 29355, 29810, 29833, 29457, 29326, 29678, 30115, 30364, 30586, 30819, 30699, 29963, 28801, 27428, 25744, 23648, 21395, 19414, 18043, 17538, 17951, 18833, 19444, 19466, 19166, 18702, 17809, 16451, 15279, 14960, 15377, 16029, 16914, 18485, 20839, 23485, 25911, 27875, 29133, 29371, 28614, 27407, 26335, 25552, 24898, 24319, 23958, 23861, 23774, 23340, 22509, 21678, 21385, 21862, 22896, 24029, 24836, 25167, 25298]
55312B5298M21Q39O97k26j390k128k208j680n80P84J702J614O65n98j670k076
55296A9464j470k30O06O11N95J230J746J076k05m56O02J455J062J39k86m06q31
55279B4702j282j115n64l90n68l02O47J532J672J351J265J469J366O46k55p52
55263B9422r24j187j417r71J88J126J135O51M08K37m05j159j123l74%m99j152
55246B3956j236r48p77p89r27j195j246n56N82J071N44j9K19O58L37m68p09k01
55228A8296K10L0l15k58J72N78O95N84N76R18J332J209M66j97k39k8j41l97k32
55209B3259L39P84Q90Q54P09L19j24k46j77m05r74j332j145o90l36n7K79N12L84
55190B2843j26p46j091q63p4Q88J502J472Q77J01l44k14J09j5n75p30K8R39Q48
$$ y = [25298, 25719, 26558, 27255, 27029, 25639, 23511, 21303, 19623, 19043, 19827, 21529, 23143, 23808, 23210, 21540, 19464, 17994, 17764, 18370, 18981, 19576, 20806, 22552, 23628, 23423, 22967, 23569, 25024, 26086, 26225, 25939, 25533, 24702, 23420, 22305, 21741, 21351, 20783, 20481, 21128, 22660, 24332, 25683, 26948, 28417, 29783, 30429, 30174, 29422, 28498, 27311, 25894, 24923, 25111, 26237, 27372, 28023, 28431, 28668, 28263, 27104, 25981, 25607, 25607, 25108, 23956, 22720, 21772, 20995, 20206, 19279, 18084, 16838, 16282, 16864, 17935, 18479, 18460, 18679, 19337, 19674, 19206, 18497, 18296, 18506, 18536, 18221, 17963, 18135, 18713, 19408, 19992, 20568, 21486, 22818, 24027, 24493, 24296, 24057, 24029, 23888, 23491, 23259, 23598, 24382, 25272, 26126, 26835, 27154, 27030, 26784, 26607, 26202, 25228, 23896, 22751, 22061, 21725, 21668, 21947, 22459, 22843, 22717, 21971, 20880, 20017, 19943, 20831, 22333, 23805, 24682, 24783, 24439, 24225, 24334, 24319, 23744, 23014, 23042, 23981, 24829]
55171B4829k50j171j042k39L30L12J12K56Q12J267J016J14n87m08K42L36m42j359
55153B4128j657j399j016n73J44J062J698J586O75n53j302j065j24O87Q51O04
55137B3746L84K05j48n07m19J02L97Ro50q17m03oL2O0M13Q22R66J056J366J454
55117B8062P35l81p41jR52J347J458J768K016J816J535J692J914J407K48o35p38
55100D2454m27j31J05J70k82j172j804j691j178q95r33q72m47J40M89M15J64K09
55082C4314O85J082Q29R6l31n7M06L51k29p03n88j8M19J95p42j866k422k014r36
55063B8471N6L43j25q44j184r07k50L73O78N49O5m00l79K29J036J655J956J809
55045C3131J005j99r12n46L86Q96P69N69O11O13M02K39K70K76J42P9J70J65n6
$$ y = [24829, 24579, 23408, 22366, 22127, 22457, 22769, 22881, 23137, 23949, 25216, 26232, 26346, 25759, 25351, 25593, 25929, 25487, 24128, 22471, 21072, 20056, 19483, 19627, 20689, 22387, 23973, 24648, 24095, 22793, 21728, 21604, 22291, 23142, 23746, 24130, 24335, 24187, 23680, 23261, 23363, 23760, 23769, 23119, 22302, 21899, 21893, 21925, 21985, 22398, 23220, 24186, 25242, 26608, 28062, 28797, 28416, 27675, 27674, 28626, 29973, 31431, 33199, 35215, 37031, 38566, 40258, 42172, 43579, 43827, 43192, 42454, 42027, 41896, 42001, 42171, 41889, 40717, 38913, 37222, 36044, 35149, 34216, 33344, 32897, 33037, 33526, 33941, 34105, 34314, 34999, 36081, 36910, 37006, 36675, 36618, 37024, 37375, 37146, 36443, 35855, 35837, 36256, 36451, 35709, 33843, 31421, 29407, 28471, 28527, 28870, 28745, 27901, 26717, 25810, 25560, 25933, 26611, 27160, 27225, 26825, 26446, 26675, 27711, 29366, 31322, 33131, 34136, 33937, 33025, 32479, 32865, 33761, 34530, 35099, 35710, 36323, 36725, 36964, 37234, 37510, 37652, 37731, 37901, 38066, 38010]
55026C8010k80l83n04n22N3J312K471K700K112J545J504J760J772J196J55p60
55010E2141r22l62J94K93L75J018J896K179J808J658K194K709K295J094R5j14
54994F8551J51L11J90j05m87q07p17o3O78O83k91j566k263k158j635j027l45L40
54976E9440P29O49L49K12K76K63l1m88q20p87l77J19K36k28q44q84j12Q89J430
54957F0021J541J755K151K176J545Q95R68J565J847J596J499K105L129L985M488
54942I1266M638M281L450K705K687L464M712O227P846R183R973J0520J1309J2226
54928A84487J2642J2174J0838Q566N120O86l932p841j0573j2090j2677j2843j2919
54915A61638j2679j1763j0403r283q555p580n887l902k429j721j439j248j096
$$ y = [38010, 37730, 37347, 36843, 36321, 36374, 37686, 40157, 42857, 44969, 46514, 48018, 49778, 51550, 52746, 52901, 52141, 51219, 50857, 51051, 51344, 51719, 52737, 54633, 56812, 58620, 60278, 62472, 65181, 67476, 68570, 68665, 68551, 68702, 69013, 69203, 69098, 68611, 67804, 67087, 67024, 67702, 68385, 68094, 66528, 64265, 62107, 60472, 59445, 59100, 59440, 60169, 60818, 61167, 61379, 61655, 61918, 61887, 61399, 60579, 59792, 59415, 59534, 59770, 59542, 58698, 57814, 57702, 58591, 60021, 61562, 63317, 65468, 67644, 69189, 70084, 71052, 72617, 74464, 76060, 77559, 79664, 82793, 86778, 91266, 95904, 100185, 103635, 106340, 109027, 112491, 117203, 123430, 131276, 140459, 150432, 160952, 172261, 184487, 197129, 209303, 220141, 228707, 233827, 234513, 230581, 222740, 212167, 200077, 187400, 174557, 161638, 148959, 137196, 126793, 117510, 108955, 101375, 95488, 91586, 89157, 87436, 85997, 84749, 83653]
54902H3653j019r56p45k03P13J768K672L437M341N429O392P076P813R020J0623
54887A40014J2108J3092J3576J3616J2834J0558O606J813k562o071r214j2207
54875A94163j4134j3993j2139j0035q674q042p846p802p196n279k521n52k82p93
54861I4875o83J38Q21J066J372J987K552K788K896L111L289L108K386J263J88
54846A21157m03o69j350k880m761o130o707o708o221n233m170l694l898m149l820
54831F0364k840j563m96o4k68n64n13m16q39j596j899j473r05o83o14m41l70m99
54813D4321l35N41J661K120J684R30M31L21N66J056J429J297P92M69N40O27M65
54796E8915M01Q44J573J991J963J866J904J842J550J436K053L470N248O888Q111
$$ y = [83653, 82634, 81678, 80933, 80730, 81443, 83211, 85883, 89320, 93661, 99090, 105482, 112558, 120371, 129391, 140014, 152122, 165214, 178790, 192406, 205240, 215798, 222404, 224217, 221655, 215584, 206370, 194163, 180029, 166036, 153897, 143862, 135188, 127146, 119300, 111498, 104302, 99023, 96502, 95950, 95668, 94875, 94192, 94330, 95151, 96217, 97589, 99576, 102128, 104916, 107812, 110923, 114212, 117320, 119706, 120969, 121157, 120754, 120085, 118735, 115855, 111094, 104964, 98257, 91549, 85328, 80095, 75925, 72231, 68333, 64184, 60364, 57524, 55961, 55465, 55401, 55133, 54569, 54056, 53640, 52801, 51205, 49306, 47833, 46928, 46245, 45631, 45190, 44820, 44321, 43986, 44527, 46188, 48308, 49992, 50922, 51353, 51674, 52240, 53296, 54725, 56022, 56814, 57283, 57823, 58450, 58915, 59316, 60160, 61733, 63724, 65687, 67553, 69457, 71299, 72849, 74285, 76338, 79808, 85056, 91944, 100055]
54781A00055Q859R291R801J0749J2195J3904J5536J6620J6584J5162J2764J0071
54769B51591P260L954J56l261n399o324o794p046o552n056l334k430k382k330
54755B12053j797j318j570k370l064l572m448n868p151p555p076o170n032l540
54741A51522j725O2J434K248K772L665N427P622R102R381R344R965J0737J0158
54727B31714P634L980R5l928q017j1408j3278j3634j3084j2118j1040j0164r606
54714A37146r071q286p389o625n888m927l764k679j894j563j715k083k183j815
54700G7264j191m69L95J113J068K24m91k62N56J022Q50M35O2j70Q7J059K156K430
54682H6138J754R17M66K17N1L46J276K246K489J989J385J224J511J813J607P55
$$ y = [100055, 108914, 118205, 128006, 138755, 150950, 164854, 180390, 197010, 213594, 228756, 241520, 251591, 258851, 262805, 262961, 259700, 254301, 247977, 241183, 234137, 227585, 222529, 219195, 216765, 214383, 212053, 210256, 208938, 207368, 204998, 201934, 198362, 193914, 188046, 180895, 173340, 166264, 160094, 155062, 151522, 149797, 149859, 151293, 153541, 156313, 159978, 165405, 173027, 182129, 191510, 200854, 210819, 221556, 231714, 239348, 243328, 243423, 239495, 231478, 220070, 206792, 193158, 180074, 167956, 156916, 146752, 137146, 128075, 119789, 112400, 105775, 99887, 94960, 91196, 88517, 86623, 85060, 83345, 81262, 79079, 77264, 76073, 75604, 75999, 77112, 78180, 78404, 77913, 77651, 78207, 79229, 80079, 80514, 80576, 80406, 80493, 81552, 83708, 86138, 87892, 88809, 89275, 89492, 89543, 89889, 91165, 93411, 95900, 97889, 99274, 100498, 102009, 103822, 105429, 106184]
54666A06184k32n93j02P10J259J540J909K490L040L399L775M525N652O764P522
54651A47842Q095Q920J0097J1294J2181J2593J2137J0319P314M121J415j218m333
54638B40777p408r381j0100j0284j0178r286p578n943n057m603m066l560l342
54625A49991l109k436j543r94q88q62p48p63j089j653k222k543k487k230k154
54610A24270k373k593k571k475k589k937l338l586l386k533j428r45j352j784
54596I0380j299j81M78K65j96l45l38l93k38L23P51L89m91q15K0J384K131J773
54578I3598P98M4lN88J307J475P79k92p98l30N65J111J187J148J027N59j06l26
54560A02331J83R43J387J527J709K050K476K962L381L417K979K518K485K716K746
$$ y = [106184, 105952, 105359, 105257, 105967, 107226, 108766, 110675, 113165, 116205, 119604, 123379, 127904, 133556, 140320, 147842, 155937, 164857, 174954, 186248, 198429, 211022, 223159, 233478, 240792, 244913, 246328, 245110, 240777, 233369, 223988, 213888, 203604, 193426, 184140, 176562, 170619, 165562, 160959, 156893, 153333, 149991, 146882, 144446, 142903, 141909, 141021, 140159, 139411, 138648, 137559, 135906, 133684, 131141, 128654, 126424, 124270, 121897, 119304, 116733, 114258, 111669, 108732, 105394, 101808, 98422, 95889, 94461, 93516, 92164, 90380, 89081, 88900, 89378, 89643, 89447, 89102, 88764, 88371, 88133, 88456, 89207, 89596, 89105, 88290, 88310, 89694, 91825, 93598, 94396, 94440, 94437, 95025, 96332, 97807, 98586, 98294, 97496, 97166, 97731, 98842, 100029, 101177, 102204, 102763, 102657, 102331, 102514, 103457, 104844, 106371, 108080, 110130, 112606, 115568, 118949, 122366, 125345, 127863, 130348, 133064, 135810]
54545A35810K596K736L331M034M549M980N473N926O212O366O371O010N159L958
54531B03511K560R04j016k865m226n045n611o105o395o285n798n128m468l894
54517A50139l374k861k394k103k011j874j377n83m1k67j162k041k249j635m72
54502A25695Q21J811K149J841J332J114J258J453J472J445J578J815J871J543
54488A47198R65O27J017K108L147L272K514J864K105K731K535J257R8K79J509
54473A73226K415K306J755J432J144N38J13O18J753K326J810R40N17L92P7k89
54457A91073k36J90M93M81M03M41N87Q51J136J082M91k17n31o84j402k818m193
54440A87147m783m449l463k289j646k056k998l178k015m53J51m72j478k029j935
$$ y = [135810, 138406, 141142, 144473, 148507, 153056, 158036, 163509, 169435, 175647, 182013, 188384, 194394, 199553, 203511, 206071, 206975, 205959, 203094, 198868, 193823, 188212, 182107, 175712, 169427, 163629, 158501, 154033, 150139, 146765, 143904, 141510, 139407, 137396, 135522, 134145, 133562, 133521, 133254, 132092, 130051, 127802, 126167, 125695, 126516, 128327, 130476, 132317, 133649, 134763, 136021, 137474, 138946, 140391, 141969, 143784, 145655, 147198, 148163, 148790, 149807, 151915, 155062, 158334, 160848, 162712, 164817, 167548, 170083, 171340, 171438, 171717, 173226, 175641, 177947, 179702, 181134, 182278, 182816, 182929, 183547, 185300, 187626, 189436, 190376, 190893, 191285, 191362, 191073, 190837, 191027, 191520, 192001, 192404, 192845, 193432, 194283, 195419, 196501, 196992, 196775, 196244, 195560, 194158, 191340, 187147, 182364, 177915, 174452, 172163, 170517, 168461, 165463, 162285, 160270, 159817, 159968, 159496, 158018, 155989, 154054]
54425A54054j402p05r9K08J92j7j75m1M08Q08P55L59J52L59O29O61P24J245K158
54406A60273K941L154K763K065J436R76L62o51j592j590n37N84P83P5q60j509
54390A68673j666j216l69K34J46l67q73j417k120k516k060j126o70q84r41k69
54374A52559O09Q21K57m37o32j97N15R28O78K2l65j75J89K08j9J15R94K304L269
54355A61643L302K443J309N54L51L97L33M0m54j120j884k528k843k851k817k928
54339A52947l059l026k977l254l760l799k940j779j351j839k505k811k979l198
54325A13670l050k239j286q95r75r61q15r50j335j381q31j62N4k36p28j148j269
54308I5463r77n30m81j085j861j949r81M42J226Q47r2n69l36o0k62p01j023j375
$$ y = [154054, 152652, 151947, 151848, 152056, 152248, 152231, 152056, 152015, 152423, 153231, 153986, 154345, 154497, 154856, 155485, 156146, 156870, 158115, 160273, 163214, 166368, 169131, 171196, 172632, 173608, 173970, 173319, 171727, 170137, 169600, 170184, 170967, 171042, 170182, 168673, 167007, 165791, 165422, 165656, 165802, 165435, 164562, 163145, 161025, 158509, 156449, 155323, 154653, 153769, 152828, 152559, 153168, 153989, 154246, 153809, 153177, 152980, 153495, 154423, 155101, 155123, 154758, 154583, 154772, 154980, 154961, 155076, 156070, 158374, 161643, 164945, 167388, 168697, 169251, 169602, 169999, 170332, 170372, 169918, 168798, 166914, 164386, 161543, 158692, 155875, 152947, 149888, 146862, 143885, 140631, 136871, 133072, 130132, 128353, 127002, 125163, 122658, 119847, 116868, 113670, 110620, 108381, 107095, 106200, 105225, 104264, 103449, 102499, 101164, 99783, 98952, 98790, 98844, 98608, 97880, 96732, 95463, 94486, 93956, 93475, 92390, 90529, 88580, 87599, 88041, 89267, 90114, 90022, 89453, 89117, 89057, 88795, 88094, 87071, 85696]
54290H5696j908k171j766j179j208j794k209k237k313k548k448j810j118q01p39
54275E9447p42q61r84p48j82J85J49K44Q37J428J349P41K74K14L30M52O16P65
54257F3514P55O45O46P91R24R22P66M01k18r34j373j127m2J484K559K428J175
54240G3316m11j616k161j942j016N5M50j0o68r03p79n76k72R0J07l87q30o58j53
54221F1636M6n7j0J03k75j145j716j448p73m23n06n74l54p7q4l47n00l88l81q24
54201E1903j286q55N01J527J097l26j346j371r84p07m13n4n9n93j080r94o34n68
54183D3758p49p42n31m62n36l55J70N52L65k05o88q89r46r68q99p06m82k96mN70
54163C5957J319J833J814J387R19N91L90L40M86N95K60n01j049q00RN81M94R0
$$ y = [85696, 83788, 81617, 79851, 78672, 77464, 75670, 73461, 71224, 68911, 66363, 63915, 62105, 60987, 60186, 59447, 58705, 57844, 56860, 56112, 55930, 56115, 56264, 56508, 57345, 58773, 60122, 60863, 61137, 61351, 61681, 62133, 62749, 63514, 64269, 64914, 65560, 66351, 67275, 68197, 68963, 69364, 69146, 68212, 66839, 65712, 65670, 67154, 69713, 72141, 73316, 72905, 71289, 69128, 67186, 66170, 66225, 66675, 66665, 65997, 65094, 64315, 63739, 63467, 63557, 63664, 63277, 62447, 61789, 61636, 61682, 61625, 61615, 61718, 61443, 60298, 58582, 57134, 56361, 55938, 55432, 54858, 54504, 54427, 54343, 53996, 53496, 53108, 52727, 51903, 50617, 49762, 50263, 51790, 52887, 52561, 51215, 49844, 48860, 48153, 47740, 47686, 47627, 47034, 45954, 44960, 44326, 43758, 43009, 42267, 41736, 41274, 40738, 40383, 40553, 41105, 41470, 41265, 40577, 39688, 38742, 37774, 36875, 36169, 35687, 35391, 35387, 35957, 37276, 39109, 40923, 42310, 43229, 43820, 44210, 44550, 45036, 45631, 45891, 45390, 44341, 43541, 43550, 44131, 44625, 44715]
54145D4715j11k0J16J72K71N03P53Q62Q05O89N72L78l0o08j065j085p01l03k22
54126D5691l66m01j77J54L99M60K29l90j253j912j957j349l88M84Q74P24M82P06
54108D2010J283J323K11j441k314j806n45M68Q36P65N81M95O19Q45Q59M45j72
54091D4462m51n4P66J298J042L14qN45J434J735J195L39k99o21p20o65o23p41
54073D8948q39o05j29J63K27M84J039J399J252R52Q30O12K9m70k92L67Q49R79
54055E5795R99Q26J52o86q22j8R41J314J235J225J311J138N74j52p44r37m89N47
54037F2209J645K208K230K306K958M043M904N041M552L923L459L088K718K559
54023A07843K882L581M178M271L857L260K830K619K344J720J001Q54J581K582
$$ y = [44715, 44604, 44584, 44700, 44872, 45143, 45646, 46399, 47261, 48066, 48755, 49327, 49705, 49675, 49067, 48002, 46917, 46216, 45913, 45691, 45325, 44924, 44747, 44901, 45300, 45760, 45989, 45599, 44346, 42434, 40477, 39128, 38740, 39224, 40098, 40822, 41304, 42010, 43293, 44616, 44827, 43386, 41072, 39266, 38721, 39189, 40025, 40790, 41371, 41866, 42485, 43330, 44189, 44634, 44462, 44011, 43957, 44723, 46021, 47063, 47377, 47369, 47914, 49348, 51083, 52278, 52617, 52318, 51697, 50977, 50312, 49689, 48948, 48109, 47504, 47375, 47538, 47765, 48249, 49288, 50687, 51939, 52891, 53721, 54333, 54362, 53892, 53600, 53967, 54816, 55795, 56794, 57620, 57772, 57086, 56264, 56246, 57187, 58501, 59736, 60961, 62272, 63410, 63984, 63832, 63088, 62151, 61662, 62209, 63854, 66062, 68292, 70598, 73556, 77599, 82503, 87544, 92096, 96019, 99478, 102566, 105284, 107843, 110725, 114306, 118484, 122755, 126612, 129872, 132702, 135321, 137665, 139385, 140386, 141240, 142821, 145403]
54009A45403K941K391J368K97p28j554j788j291n73m16j190k568l854m489m321
53994A29628l623k856k467k716l432l913l463k239j199r69j123r25m57l54p51
53979I9141j168j400j702k056k020j535j202j322j304n12P06J388J082J70p38
53964H7528j259j264q31k06M47J121J705J904J643J360J519K060K513K581K336
53949A03157K022J909K194K766L243L438L594L900M068L797L417L611M536N659
53935A51311O452O820O844O585O234O117O280O294N672M342K632R22o35k070l369
53920B10431m247m308l599k796k521k558k128r25M88J417J786J954K127K255K380
53905A99756K750L557M652N567N799N219M204L239K450J679R68N93N38L53k04
$$ y = [145403, 148344, 150735, 152103, 152400, 151672, 150118, 148330, 147039, 146466, 146050, 144860, 142292, 138438, 133949, 129628, 126005, 123149, 120682, 117966, 114534, 110621, 107158, 104919, 103720, 102751, 101628, 100703, 100246, 99892, 99141, 97973, 96573, 94871, 92815, 90795, 89260, 88058, 86736, 85432, 84920, 85626, 87014, 88096, 88266, 87528, 86269, 85005, 84174, 83968, 84415, 85536, 87241, 89145, 90788, 92148, 93667, 95727, 98240, 100821, 103157, 105179, 107088, 109282, 112048, 115291, 118729, 122323, 126223, 130291, 134088, 137505, 141116, 145652, 151311, 157763, 164583, 171427, 178012, 184246, 190363, 196643, 202937, 208609, 212951, 215583, 216505, 215870, 213800, 210431, 206184, 201876, 198277, 195481, 192960, 190402, 188274, 187349, 187837, 189254, 191040, 192994, 195121, 197376, 199756, 202506, 206063, 210715, 216282, 222081, 227300, 231504, 234743, 237193, 238872, 239840, 240433, 240971, 241324, 241120]
53890B41120p24p60o23j022k006k795k824k462k401k738l061l257l705m618n584
53875B02540o004n787n343n014m738m302l744l304l031k710k288k198k853l820
53861A47404l986k882j507j261k213l088l061k744l005l509l307k436j913k126
53847A10366k198j380k20K28r4l05R5O10N46o3n37l53L29Q77Q63N50M63O08M31
53828A10816k82r52r96o72n26m42Q8P86P20k80j167j127p27r55j624j628n82O18
53810A01068J003O05P4j80j32J97P09J065R26M73L46J017K264L391L889L847L748
53793A24310L902M169M250M062L753L441L200L190L474L729L489K797K288K353
53779A72407K609K430J734Q75M9o45q95n54k54q56k134k790k161j220j296k329
$$ y = [241120, 240396, 239636, 239013, 237991, 235985, 233190, 230366, 227904, 225503, 222765, 219704, 216447, 212742, 208124, 202540, 196536, 190749, 185406, 180392, 175654, 171352, 167608, 164304, 161273, 158563, 156275, 154077, 151224, 147404, 143418, 140536, 139029, 137768, 135555, 132467, 129406, 126662, 123657, 120148, 116841, 114405, 112492, 110366, 108168, 106788, 106568, 106796, 106702, 106397, 106492, 107102, 107648, 107585, 107048, 106695, 107024, 107901, 108764, 109314, 109777, 110385, 110816, 110534, 109582, 108586, 107914, 107388, 106946, 107034, 107820, 108540, 108260, 107093, 105966, 105239, 104284, 102660, 101032, 100450, 101068, 102071, 102676, 102750, 102570, 102438, 102635, 103344, 104409, 105335, 105808, 106154, 107171, 109435, 112826, 116715, 120562, 124310, 128212, 132381, 136631, 140693, 144446, 147887, 151087, 154277, 157751, 161480, 164969, 167766, 170054, 172407, 175016, 177446, 179180, 180055, 180104, 179459, 178564, 178010, 177756, 176900, 174766, 171976, 169815, 168595, 167299, 164970]
53763A64970l115k942k169j339n61J06M03K95J64K57L56K75K51M30M12k40j193
53746A56360j611j201o05o42j448k471l083l086k764k551k669k966l073k767k162
53731A23261j590j228q86k82M43P50L97r9r4K27J07n86r87m14O04J012N64r0m63
53712A20646o89r66j090q60m43j29Pnj98m42l43L04J151J674J882K194K693K882
53694A28268K403J622J190J209J249J108J154J614K004J632O39L6N91J941K987
53679A49647L013K272J582J537K026K356J954R59J23j2L55O54P29R41J553K257
53663A71946K463J917R70K10k3J40L37L40J62m7j81k84n38j094j750j953j387
53646A71228m63M2q7l50l55l76q30j532j862j509o83K46R53J153P71J95RL71Q55
$$ y = [164970, 161855, 158913, 156744, 155405, 154844, 154950, 155353, 155648, 155812, 156069, 156425, 156700, 156951, 157381, 157793, 157553, 156360, 154749, 153548, 152943, 152301, 150853, 148382, 145299, 142213, 139449, 136898, 134229, 131263, 128190, 125423, 123261, 121671, 120443, 119557, 119275, 119718, 120468, 120865, 120766, 120672, 120899, 121006, 120420, 119433, 119019, 119623, 120635, 121199, 121109, 120646, 119957, 118991, 117901, 117041, 116598, 116469, 116476, 116471, 116273, 115831, 115488, 115792, 116943, 118617, 120499, 122693, 125386, 128268, 130671, 132293, 133483, 134692, 135941, 137049, 138203, 139817, 141821, 143453, 144092, 144128, 144719, 146660, 149647, 152660, 154932, 156514, 158051, 160077, 162433, 164387, 165346, 165469, 165457, 165812, 166466, 167195, 168136, 169689, 171946, 174409, 176326, 177296, 177506, 177483, 177623, 177960, 178300, 178462, 178415, 178234, 177950, 177412, 176318, 174568, 172615, 171228, 170765, 170807, 170720, 170370, 170015, 169639, 168809, 167277, 165415, 163906, 163223, 163469, 164422, 165575, 166346, 166541, 166550, 166921, 167776]
53627A67776R54O07K38L35Q92J272Q02l18j069q02k7L75M36Q86J914K786K871
53610A79928K318J601R70O94J193K523M020M929N087M760M110L263K588K456K765
53595B23205L114L295L349L250K932K531K288K182J982J587J129P63O03P55J158
53580B54123J449J348J105J194J525J398M59o96j181q85n04o02r75j078q11o04
53564B55265q20j281j506j281q57n66m01j03L75O36K02q53j763j716o81N82J349
53547B46581J567J572J460J103O39M91Q32J364J766K036K291K526K734L036L486
53532B73484L990M496N078N684O062O142O188O414O729P077P664Q589R554J0251
53518C67402J0819J1554J2468J3451J4495J5354J5442J4666J4045J4702J6433
$$ y = [167776, 168730, 169337, 169575, 169910, 170802, 172074, 172876, 172558, 171489, 170687, 170660, 171035, 171471, 172357, 174271, 177057, 179928, 182246, 183847, 184817, 185511, 186704, 189227, 193247, 198176, 203263, 208023, 212133, 215396, 217984, 220440, 223205, 226319, 229614, 232963, 236213, 239145, 241676, 243964, 246146, 248128, 249715, 250844, 251607, 252210, 252965, 254123, 255572, 256920, 258025, 259219, 260744, 262142, 262601, 261905, 260724, 259839, 259335, 258733, 257758, 256680, 255869, 255265, 254445, 253164, 251658, 250377, 249520, 248954, 248553, 248450, 248825, 249461, 249663, 248810, 247047, 245331, 244650, 245232, 246581, 248148, 249720, 251180, 252283, 252922, 253413, 254245, 255609, 257375, 259411, 261702, 264228, 266962, 269998, 273484, 277474, 281970, 287048, 292732, 298794, 304936, 311124, 317538, 324267, 331344, 339008, 347597, 357151, 367402, 378221, 389775, 402243, 415694, 430189, 445543, 460985, 475651, 489696, 504398, 520831]
53507E20831J8030J8927J9680K0783K1975K2962K4003K5315K6565K7431K8087
53496G74589K8678K8838K8261K7316K6629K6426K6675K7336K8003K7936K7148
53485A077835K6913K8313L0624L2113L2174L1741L1577L1331L0445K9036K7371
53474A409473K5295K2765K0338J8543J7162J5704J4217J3142J2656J2572J2702
53463A594569J2832J2525J1404R536P200M444J262k013m910p395r842j2441j5018
53450A602153j7336j9321k0929k2235k3572k5202k6796k7675k7700k7565k8014
53439A335808k9030l0003l0414l0188k9498k8590k7702k6957k6270k5444k4363
53428A027349k3111k1855k0662j9363j7698j5629j3375j1049q412n267j967Q55
$$ y = [520831, 538861, 557788, 577468, 598251, 620226, 643188, 667191, 692506, 719071, 746502, 774589, 803267, 832105, 860366, 887682, 914311, 940737, 967412, 994748, 1022751, 1050687, 1077835, 1104748, 1133061, 1163685, 1195798, 1227972, 1259713, 1291290, 1322621, 1353066, 1382102, 1409473, 1434768, 1457533, 1477871, 1496414, 1513576, 1529280, 1543497, 1556639, 1569295, 1581867, 1594569, 1607401, 1619926, 1631330, 1640866, 1648066, 1652510, 1653772, 1651759, 1646849, 1639454, 1629612, 1617171, 1602153, 1584817, 1565496, 1544567, 1522332, 1498760, 1473558, 1446762, 1419087, 1391387, 1363822, 1335808, 1306778, 1276775, 1246361, 1216173, 1186675, 1158085, 1130383, 1103426, 1077156, 1051712, 1027349, 1004238, 982383, 961721, 942358, 924660, 909031, 895656, 884607, 876195, 870928, 868961, 869816]
53416H69816L079N259P823J0518J2927J5191J7767K0603K3026K4542K5463K6476
53404A062490K7906K9599L1388L3251L5010L6292L7127L8327M0743M4169M7439
53393A463741M9763N1533N3572N6043N8606O1222O4083O6904O8967O9956P0221
53382B134611P0150O9885O9714P0087P0982P1803P2091P1758P0434O7409O2705
53371B901629N7478N2777M8465M4008L9600L5687L1986K8080K4498K2057K0324
53360C306589J7993J4658J0982P006J741n146j2700k0381k9093l9467n0251n9598
53348C142333o7239p3993p9736q3317q4444q4288q4002q3645q2864q1649q0136
53337B257020p8388p6736p5668p5049p4128p2587p1032o9974o8933o7073o4195
$$ y = [869816, 872895, 878154, 885977, 896495, 909422, 924613, 942380, 962983, 986009, 1010551, 1036014, 1062490, 1090396, 1119995, 1151383, 1184634, 1219644, 1255936, 1293063, 1331390, 1372133, 1416302, 1463741, 1513504, 1565037, 1618609, 1674652, 1733258, 1794480, 1858563, 1925467, 1994434, 2064390, 2134611, 2204761, 2274646, 2344360, 2414447, 2485429, 2557232, 2629323, 2701081, 2771515, 2838924, 2901629, 2959107, 3011884, 3060349, 3104357, 3143957, 3179644, 3211630, 3239710, 3264208, 3286265, 3306589, 3324582, 3339240, 3350222, 3357228, 3358969, 3353823, 3341123, 3320742, 3291649, 3252182, 3201931, 3142333, 3075094, 3001101, 2921365, 2838048, 2753604, 2669316, 2585314, 2501669, 2418805, 2337156, 2257020, 2178632, 2101896, 2026228, 1951179, 1877051, 1804464, 1733432, 1663458, 1594525, 1527452, 1463257]
53326A463257o0690n6914n3205n0096m7806m5659m2646l8597l4333l0557k7037
53315I75717k3075j8547j4185j0782q339o145l789j742o08k4J056K963M921O273
53301I03694P353Q657R922J0767J1655J3198J4874J5657J5833J6931J9559K2489
53289A070589K4480K5926K7821L0001L1521L2293L3146L4418L5564L6211L6522
53278A418492L6342L5044L2732L0708K9946K9706K8505K6033K3334K1199J9340
53267A731381J7333J5526J4506J4077J3313J1562Q985O132L232M3l785q260j2935
53254A811110j7264k1073k4714k8670l3011l7216m0637m3102m5076m7079m9039
53243A424229n0394n0828n0595m9965m8648m6268m3181m0324l8182l6441l4866
$$ y = [1463257, 1402567, 1345653, 1292448, 1242352, 1194546, 1148887, 1106241, 1067644, 1033311, 1002754, 975717, 952642, 934095, 919910, 909128, 900789, 894644, 890855, 889113, 888505, 888481, 889537, 892500, 897421, 903694, 911047, 919704, 929626, 940393, 952048, 965246, 980120, 995777, 1011610, 1028541, 1048100, 1070589, 1095069, 1120995, 1148816, 1178817, 1210338, 1242631, 1275777, 1310195, 1345759, 1381970, 1418492, 1454834, 1489878, 1522610, 1553318, 1583264, 1612970, 1641475, 1667508, 1690842, 1712041, 1731381, 1748714, 1764240, 1778746, 1792823, 1806136, 1817698, 1826683, 1832815, 1836047, 1836090, 1832305, 1824045, 1811110, 1793846, 1772773, 1748059, 1719389, 1686378, 1649162, 1608525, 1565423, 1520347, 1473268, 1424229, 1373835, 1323007, 1272412, 1222447, 1173799, 1127531, 1084350, 1044026, 1005844, 969403, 934537]
53232I34537l3894l3957l4649l5249l5720l6502l7369l7345l5967l3923l2015
53221E47947l0049k7390k4132k1043j8531j6375j4458j3067j2249j1543j0671
53210C48439r985r759r497q510o955n708n256n256n220n133n230n561o001o362
53196B54006o327n605m447l666l827m569m998m641l787l034k787l068l494l594
53182A96162l358l364l976m669m600l795l130l075l112k673k043j800j854j655
53168A53058j187r70j164j304j141j168j852k776l016k315j385j006j141j216
53154A31417r96q53j129j555j560j024m68m48r42j519j852j898j659j091k50N49
53138A14722R60Q56L69k40o96q07n83k56j00j21MN36J204J303M23r84j990k096
$$ y = [934537, 900643, 866686, 832037, 796788, 761068, 724566, 687197, 649852, 613885, 579962, 547947, 517898, 490508, 466376, 445333, 426802, 410427, 395969, 382902, 370653, 359110, 348439, 338454, 328695, 319198, 310688, 303733, 298025, 292769, 287513, 282293, 277160, 271930, 266369, 260368, 254006, 247679, 242074, 237627, 233961, 230134, 225565, 220567, 215926, 212139, 209105, 206318, 203250, 199756, 196162, 192804, 189440, 185464, 180795, 176195, 172400, 169270, 166195, 163083, 160410, 158367, 156567, 154713, 153058, 151871, 150901, 149737, 148433, 147292, 146124, 144272, 141496, 138480, 136165, 134780, 133774, 132633, 131417, 130421, 129568, 128439, 126884, 125324, 124300, 123832, 123384, 122442, 120923, 119071, 117173, 115514, 114423, 114173, 114722, 115682, 116538, 116907, 116667, 115971, 115164, 114581, 114325, 114225, 114104, 114108, 114644, 115848, 117151, 117574, 116590, 114600, 112504]
53120A12504j579r65m53K0M42O65N85K37j85l32M3P07J057Q47M84L99M30J86k72
53101A14820o16q94j345j769j725j349j258j596j898k075k562l212k979j497p6
53086H9969j06j043j167o7Q99P52J91L60J247K055K357K230J719Q97J77p2k8l1
53068A00339N4N76J362J865J938J932K059K142K070J945J745J372J077J321J932
53053A23729K048J193l1p95j165j768k585k817k066j083r55j843k861l107k549
53038A03345j875j718k138k761l158l069k445j509p40n50q34j076r83q57j171
53023G8461j874k350k048j038R3P13N43k13r92j187n83M14R89N49p41k087k812
53006F5837k853k488j820q16K58R13R89P99N81K10l59p70o66j88K87N85O97N06
$$ y = [112504, 110925, 109960, 109507, 109527, 109969, 110634, 111219, 111456, 111271, 110939, 110982, 111689, 112746, 113593, 114077, 114476, 114906, 115092, 114820, 114204, 113310, 111965, 110196, 108471, 107122, 105864, 104268, 102370, 100295, 97733, 94521, 91542, 90045, 89969, 89863, 88820, 87653, 87586, 88485, 89237, 89428, 89788, 91035, 93090, 95447, 97677, 99396, 100293, 100470, 100398, 100370, 100339, 100393, 100969, 102331, 104196, 106134, 108066, 110125, 112267, 114337, 116282, 118027, 119399, 120476, 121797, 123729, 125777, 126970, 126939, 126144, 124979, 123211, 120626, 117809, 115743, 114660, 113705, 111862, 109001, 105894, 103345, 101470, 99752, 97614, 94853, 91695, 88626, 86181, 84672, 83932, 83382, 82548, 81472, 80489, 79632, 78461, 76587, 74237, 72189, 71151, 71244, 71957, 72500, 72287, 71295, 70108, 69525, 69939, 70928, 71477, 70736, 68649, 65837, 62984, 60496, 58676, 57860, 58118, 59031, 60020, 60819, 61400, 61610, 61251, 60481, 59815, 59627, 59914, 60499, 61196, 61702]
52988F1702nn12o64m88k09L9L1o40j831k450j575J69J213R94M11J86q3q37j472
52969E3979j161j48O42Q77R39R98P95K14m26p40n38J19P75P49p8r07r78n77n09
52950E4025q27q99n95m42n36k12Q13J789J931J447J048R16P96P07Q69J060P43
52933F2633j00p67o45J5M25J69l49m33M8N21M64Q1l5K65N78O60P18R61J233J416
52913F7858J769K501L290L538L008J989R94N06P43J353J541Q34l58j214j379j108
52897H5865p57n43o01q90j088r95j021j778l116m028l676k293q41j00j91p01j004
52880F2242p23j29J01k82p12n61q4j29r54j763j731j036n55o92r83q85m75j45
52862E0504LJ50K96K41L6N3M69R93J260J304J404J674J969K120K024J567O89m13
$$ y = [61702, 61697, 61185, 60521, 60033, 59824, 59863, 59894, 59254, 57423, 54973, 53398, 53567, 54780, 55774, 56185, 56371, 56288, 55451, 53979, 52818, 52670, 53312, 54189, 55128, 56126, 56921, 57135, 56709, 55969, 55431, 55550, 56325, 57074, 56996, 56089, 55111, 54534, 54025, 53198, 52299, 51704, 51262, 50726, 50514, 51327, 53116, 55047, 56494, 57542, 58458, 59254, 59961, 60830, 61890, 62633, 62533, 61766, 61121, 61136, 61561, 61730, 61381, 60948, 60996, 61517, 61981, 62062, 62027, 62292, 62870, 63530, 64248, 65209, 66442, 67858, 69627, 72128, 75418, 78956, 81964, 83953, 84947, 85453, 86196, 87549, 89090, 89924, 89566, 88352, 86973, 85865, 85108, 84565, 83964, 83074, 81986, 80991, 79970, 78192, 75076, 71048, 67372, 65079, 64238, 64138, 63947, 63246, 62242, 61519, 61390, 61491, 61209, 60497, 59936, 59852, 59723, 58769, 57006, 55275, 54239, 53684, 52992, 52009, 51124, 50649, 50504, 50507, 50657, 50953, 51194, 51230, 51283, 51752, 52745, 54005, 55309, 56713, 58387, 60356, 62476, 64500, 66067, 66756, 66343]
52844F6343j309j631j369q54n38o45j017j222r47k98K60K89k42q81j112q91o75
52827E3261p88r21n55K60R29J093R13N67o9q76j199n35P26J654J741J177M31m6
52809E7763J16Q76J617J659R95J97l47o78r20j036j019q47l04O97J627J761J186
52792F3343Q64J418K354K807K602K168J770J348R10O29N50N27M40K10k63r09j328
52775G9440j152n96l52q53j827k595k633j844n64N44Q22J27r72j655j607j215
52759F3068j005j009q91n60l59n03o94n76k53m8J11M70P84M05o77j527j315l18
52741E5103M84N53J42k85n49p21q18o76p4Q36J345Q70r5l06O56J667J457K18q48
52722E8959j233j426j679j517o70M15J312K152K967L147K252R03J55K74O60Q42
$$ y = [66343, 65034, 63403, 62034, 61180, 60642, 59997, 58980, 57758, 56811, 56513, 56773, 57062, 56820, 55939, 54827, 53936, 53261, 52473, 51552, 50997, 51257, 52186, 53279, 54192, 54759, 54690, 53814, 52615, 52080, 52806, 54460, 56201, 57378, 57809, 57763, 57879, 58755, 60372, 62031, 63026, 63223, 62876, 62198, 61278, 60242, 59223, 58376, 58072, 58769, 60396, 62157, 63343, 64207, 65625, 67979, 70786, 73388, 75556, 77326, 78674, 79584, 80213, 80763, 81290, 81730, 81940, 81677, 80768, 79440, 78288, 77692, 77340, 76487, 74660, 72065, 69432, 67588, 67024, 67568, 68390, 68517, 67545, 65890, 64283, 63068, 62063, 61054, 60163, 59603, 59244, 58741, 58047, 57471, 57218, 57170, 57281, 57751, 58535, 58940, 58263, 56736, 55421, 55103, 55587, 56140, 56282, 55997, 55448, 54727, 53909, 53233, 53159, 53995, 55340, 56210, 56115, 55809, 56465, 58132, 59589, 59807, 58959, 57726, 56300, 54621, 53104, 52434, 52849, 54161, 56313, 59280, 62427, 64679, 65582, 65737, 66011, 66671, 67513]
52706F7513P96M52l96j516k109j719r16p10j378k149k129j294m51j76j49K52Q69
52689E4790P82l64j623j792q89m9k8m38n42j98K78P07J064J169Q21J49m21n48
52671E2868j63N78J346J697J344M28o05j299j370p79J55R31J258J240J003N37
52655E9169M2O4P63J392J098J74k50K43R27J137J123J238J183P37N56J305K350
52638G3251K431J475P31R65J522J536J112P30K10q41j974k214j286Q7J120J589
52622H0444J509Q61j65j088j562j626j475j308j483k348l594m200l484j987q70
52607E7624n73n44k55R4J06q7p8J28J33j68l89k25J35L17K17n9m08o28l67M87
52587E5460J382J490O04n88j224j045m15K08O40Q96R61O99Q7m77l93L76R68N07
$$ y = [67513, 68309, 68761, 68365, 66849, 64740, 63021, 62105, 61395, 60017, 57868, 55739, 54445, 53994, 53818, 53669, 53921, 54790, 55572, 55208, 53585, 51793, 50904, 50855, 50827, 50389, 49847, 49649, 49927, 50634, 51698, 52867, 53688, 53837, 53416, 52868, 52705, 53283, 54629, 56326, 57670, 58098, 57493, 56194, 54824, 54045, 54200, 55131, 56389, 57629, 58632, 59169, 59211, 59275, 60038, 61430, 62528, 62702, 62452, 62695, 63622, 64759, 65882, 67120, 68303, 69040, 69596, 70901, 73251, 75682, 77157, 77888, 78853, 80375, 81911, 83023, 83753, 83963, 83122, 81148, 78934, 77648, 77735, 78855, 80444, 81953, 82814, 82649, 81561, 79999, 78373, 76898, 75590, 74107, 71759, 68165, 63965, 60481, 58494, 57624, 57051, 56507, 56252, 56346, 56452, 56365, 56287, 56415, 56548, 56380, 55991, 55766, 55901, 56218, 56435, 56376, 55968, 55340, 54973, 55460, 56842, 58332, 58936, 58348, 57124, 56079, 55664, 55872, 56512, 57408, 58369, 59068, 59155, 58678, 58285, 58661, 59629, 60136]
52569F0136o79j304p36K01L65k07n37j19N20P46O62P89J259J630J407O06j75k86
52551F4278K40O35K72n08q10l89K7k28q40r67l55M25P36N06P7k02j29L12Q12Q50
52531F4742K13o16q57k09Q74J737K041J787J097K80j53N6N23O48L71J22Rm24j405
52512G0836k354k451j581l31P17J322J420J068N63K38Q1j98o96j148j310j290
52496F4886j387j713k003j848j161l42K29P50J637K563K547J276k29q01m48J43
52480F4099P63J471J704Q34n67j175q19o71j249j483m04J280K193K022J376N82
52464F9956l03q19n13J88L92p4o38r66j140j043m68J81K88R0M66J429J781P48
52446F9555q48j622j243m36K05P29J296J783J957J756J223M33m48j050j001l57
$$ y = [60136, 59457, 58153, 57417, 57618, 57983, 57776, 57239, 57120, 57640, 58386, 59048, 59837, 61096, 62726, 64133, 64739, 64564, 64278, 64518, 65153, 65425, 64917, 64107, 63718, 63745, 63517, 62677, 61710, 61355, 61780, 62516, 63022, 63099, 62897, 62768, 63080, 63892, 64742, 64955, 64339, 63482, 63273, 64147, 65884, 67925, 69712, 70809, 71089, 70936, 70992, 71515, 72163, 72534, 72656, 72665, 72241, 70836, 68482, 66031, 64450, 64119, 64836, 66158, 67578, 68646, 69209, 69447, 69528, 69330, 68634, 67486, 66176, 64886, 63499, 61786, 59783, 57935, 56774, 56432, 56661, 57411, 59048, 61611, 64158, 65434, 65205, 64404, 63956, 64099, 64862, 66333, 68037, 68871, 68304, 67129, 66310, 65639, 64390, 62907, 62503, 63783, 65976, 67998, 69374, 69956, 69653, 68834, 68321, 68509, 68901, 68827, 68189, 67223, 66083, 65040, 64572, 64753, 65041, 65131, 65597, 67026, 68807, 69555, 68707, 67085, 65842, 65406, 65611, 66340, 67636, 69419, 71376, 73132, 74355, 74788, 74340, 73290, 72289, 71932]
52430G1932K33J55l18k63N83J221O92m84r66m46Q9k5k23J93R13J119O01j68o97
52411G4141p55l08L83Q61Q86N85P4o09j080p49K45R58Q75N92P24Q47L58k62j08
52392G7658N71O10k92j135j125o16k01K02Q09J257J023K30m91o97l19M83J271
52375G9238J444Q18k0l02Q7O53R50R32P47N07K47r4n52r18q00j41N44O66K71q8
52355H4189m2K25L60K73J85L63Q75J431J522R01k7m85j63M15N08N5k83j3O09R96
52335I1894J022J021J075P75j19j118j471j017k25M13P55Q49Q25R34J279J460
52319I8352R31j41p99l81O87J463J570J363J241J266J384J596J835J934J815J549
52303A15665J272J155J342J760K010J784J341J288J857K654L213L528L880M360
$$ y = [71932, 72165, 72320, 72002, 71739, 72322, 73543, 74235, 73751, 72785, 72339, 72428, 72403, 72180, 72373, 73286, 74405, 75006, 74838, 74141, 73386, 73078, 73461, 74322, 75208, 75793, 75867, 75258, 74178, 73429, 73674, 74632, 75507, 76099, 76823, 77670, 78028, 77766, 77658, 78229, 78839, 78547, 77412, 76287, 75671, 75470, 75672, 76481, 77738, 78761, 78991, 78500, 77803, 77484, 77967, 79238, 80682, 81500, 81480, 81178, 81265, 81918, 82868, 83800, 84547, 85054, 85301, 85207, 84655, 83737, 82937, 82796, 83340, 84006, 84277, 84189, 84147, 84372, 84732, 85005, 85190, 85553, 86428, 87859, 89381, 90282, 90255, 89770, 89607, 90022, 90530, 90585, 90302, 90289, 90898, 91894, 92916, 93937, 95012, 95787, 95668, 94550, 93079, 92062, 91837, 92250, 93005, 93854, 94679, 95613, 96892, 98352, 99283, 99142, 98343, 97962, 98649, 100112, 101682, 103045, 104286, 105552, 106936, 108532, 110367, 112301, 114116, 115665, 116937, 118092, 119434, 121194, 123204, 124988, 126329, 127617, 129474, 132128, 135341, 138869, 142749, 147109]
52289A47109M711M553L655K156O69j9L96J365K004J977J717J766K102K282K091
52274A78534J723J333P39j81r88r71m9R13R70J48n83l93N59J385J390O46k23o32
52256A84320l69M52J547K510K932K726K294K122K202K097J648J228J139J080O76
52241B08604K64N87J656K553K574K104J938K121K072J599J206J268J532J639J728
52226B33445K087K566K787K746K738K690K193J302P60J118J954K482K646L066
52212B64580L970M772M877M441M033L875L763L531L258L062L018L212L644M058
52198C18094M162L959L768L786L873L775L430K990K660K512K458K360K266K375
52184C62468K657K647K022J222J133J914K678K548J782J318J459J592J250Q59
$$ y = [147109, 151820, 156373, 160028, 162184, 162853, 162834, 163230, 164595, 166599, 168576, 170293, 172059, 174161, 176443, 178534, 180257, 181590, 182329, 182148, 181160, 180189, 180140, 181053, 182023, 182171, 181588, 181195, 181754, 183139, 184529, 185175, 184952, 184320, 183951, 184403, 185950, 188460, 191392, 194118, 196412, 198534, 200736, 202833, 204481, 205709, 206848, 207928, 208604, 208868, 209455, 211111, 213664, 216238, 218342, 220280, 222401, 224473, 226072, 227278, 228546, 230078, 231717, 233445, 235532, 238098, 240885, 243631, 246369, 249059, 251252, 252554, 253314, 254432, 256386, 258868, 261514, 264580, 268550, 273322, 278199, 282640, 286673, 290548, 294311, 297842, 301100, 304162, 307180, 310392, 314036, 318094, 322256, 326215, 329983, 333769, 337642, 341417, 344847, 347837, 350497, 353009, 355467, 357827, 360093, 362468, 365125, 367772, 369794, 371016, 372149, 374063, 376741, 379289, 381071, 382389, 383848, 385440, 386690, 387549]
52170C87549J037J573J588O75o20j522j839j841j700j388j075j083j384j451r05
52155C77614j20J05n35j511k091k125k050k240k490k264j387l58R6k66j058j748
52139C57572k070j967j465q24n46q88j490j802j798j898k211k355k124j928k209
52124C31997k777l048k790k286j848j536j357j403j656j844j692j250r05j016
52110C06589j518j901j689j007n11o12r16o60M06J713K402J991O62q12j501j049
52094C01587j7P86J252J883K749L162K709K052K162L019L692L597L068K635K368
52079C36704K126J988K033K050J869J730J985K503K788K583K045J357N69j05k02
52064C62023M82J468J984J765J316J300J839K470K758K736K656K431J730O30r2
$$ y = [387549, 388586, 390159, 391747, 392422, 391802, 390280, 388441, 386600, 384900, 383512, 382437, 381354, 379970, 378519, 377614, 377494, 377599, 377064, 375553, 373462, 371337, 369287, 367047, 364557, 362293, 360906, 360548, 360644, 360378, 359320, 357572, 355502, 353535, 352070, 351246, 350700, 349812, 348322, 346520, 344722, 342824, 340613, 338258, 336134, 334206, 331997, 329220, 326172, 323382, 321096, 319248, 317712, 316355, 314952, 313296, 311452, 309760, 308510, 307605, 306589, 305071, 303170, 301481, 300474, 299963, 299351, 298435, 297775, 298181, 299894, 302296, 304287, 304949, 304137, 302636, 301587, 301570, 302356, 303608, 305491, 308240, 311402, 314111, 316163, 318325, 321344, 325036, 328633, 331701, 334336, 336704, 338830, 340818, 342851, 344901, 346770, 348500, 350485, 352988, 355776, 358359, 360404, 361761, 362330, 362225, 362023, 362505, 363973, 365957, 367722, 369038, 370338, 372177, 374647, 377405, 380141, 382797, 385228, 386958, 387588, 387496]
52049C87496K59J360K056J612M37m32m15J97O46L29o99j671j673n63P42J085K03
52032C90969j093j817j695j230j111j604k389k952l098l087l152l107k624j791
52018C60219j158j121j499j802j711j255o91l00k39m14n61m61r5M15Q55R76O30
52001C51788k1o22j024j392j883k370k700k975l349l657l639l522l950n097o210
51986C09377o402n824n590o403p668q211p644o619n962n956o484p341q185q572
51972B12516q411q114p947p521o360m783l723l694m395n276n979o097n218l564
51958A31434k163j896k570l247l288k767k057j511j383j604j648j047j40J24p24
51943A05513j986k504j844o78n4m32j313j755j262k08O14P97N83L93L29K22J9
$$ y = [387496, 387755, 389115, 391171, 392783, 393220, 392788, 392373, 392570, 393216, 393545, 392846, 391175, 389502, 388939, 389681, 390766, 390969, 389876, 388059, 386364, 385134, 384023, 382419, 380030, 377078, 373980, 370893, 367741, 364634, 362010, 360219, 359061, 357940, 356441, 354639, 352928, 351673, 350982, 350682, 350443, 350029, 349468, 349007, 348912, 349327, 350182, 351158, 351788, 351767, 351145, 350121, 348729, 346846, 344476, 341776, 338801, 335452, 331795, 328156, 324634, 320684, 315587, 309377, 302975, 297151, 291561, 285158, 277490, 269279, 261635, 255016, 249054, 243098, 236614, 229273, 221088, 212516, 204105, 195991, 188044, 180523, 174163, 169380, 165657, 161963, 157568, 152292, 146313, 140216, 134998, 131434, 129271, 127375, 124805, 121558, 118270, 115503, 113446, 111935, 110552, 108948, 107300, 106253, 106113, 106237, 105513, 103527, 101023, 99179, 98501, 98447, 98015, 96702, 94947, 93685, 93477, 94091, 94888, 95471, 95864, 96193, 96415, 96434]
51926I6434n3K31P38R88O44m4m30k16K13L41K47M23R92J446J330P91K86k1l21
51907A04019p32j183j599j952k066j664p74J19N55O10O44O19P3j047j941j758
51891I1923p05J32J22k96m38l56n43r93j086m36N79J172Q96L1n90l39M91Q28L7
51872I0429j250j808j261l53J00K4k04l15j82K07O11O57L91L12O34Q68N01k04
51854H9157n26k18L08O35P48P98Q15P59P08Q45J272J787J915J390O67N84J327
51837A02971K077K059J541J377J783K178K171K068K305K901L643M423N164N673
51823A42334N816N615M997L759J886k30k078l296l667l204k397k016k361k887
51809A42271k907k354j654j027m07M2p6q01j521j592j039m44k13k00%M91R49R55
$$ y = [96434, 96381, 96612, 97350, 98338, 98982, 98938, 98508, 98292, 98505, 98846, 99093, 99516, 100508, 101954, 103284, 104075, 104361, 104340, 104019, 103287, 102104, 100505, 98553, 96487, 94823, 94049, 94168, 94723, 95333, 95977, 96596, 96669, 95622, 93681, 91923, 91218, 91350, 91472, 91176, 90738, 90382, 89839, 88846, 87760, 87324, 87903, 89075, 89971, 90002, 89412, 89073, 89564, 90392, 90429, 89179, 87371, 86110, 85757, 85857, 85881, 85677, 85362, 85180, 85387, 85998, 86655, 87046, 87358, 87992, 88860, 89361, 89157, 88631, 88413, 88721, 89356, 90104, 90902, 91717, 92476, 93184, 94029, 95301, 97088, 99003, 100393, 101060, 101644, 102971, 105048, 107107, 108648, 110025, 111808, 113986, 116157, 118225, 120530, 123431, 127074, 131497, 136661, 142334, 148150, 153765, 158762, 162521, 164407, 164177, 162099, 158803, 155136, 151932, 149535, 147519, 145158, 142271, 139364, 137010, 135356, 134329, 133922, 133964, 133888, 133087, 131566, 129974, 128935, 128491, 128278, 128078, 128078, 128569, 129518, 130473]
51791A30473M47j70l20K38J125J606J251L70l30n28n99r91j562j744j273m60K43
51774A27776O54Q00P72O95O52M91j4p39j248j390j484j739j767j131r8N58M86
51757A23274Nm40p46r27r34q24p88p91n11P4L81j31j091j483q11L45J140J336
51739A17078J176O61m09j714k346j839q72m91q12r95m40M50Q28L31o73j458j426
51722A07049n97K40K67l32m78L60J400J637J213J054J473J976K257K536K798K548
51706A25401J612N87om55j284k323k895k713k130j621j360j280j287j338j463
51691A07445j592j410o92J63L16m51j215q23P40K330K874K385J794J996L042M033
51675A20935L897K380K23j701l125m134m639m469l733k632j174N31J868K197J662
$$ y = [130473, 130920, 130750, 130430, 130668, 131793, 133399, 134650, 135020, 134690, 134162, 133563, 132572, 131010, 129266, 127993, 127533, 127776, 128430, 129230, 130002, 130697, 131349, 131840, 131826, 131087, 129839, 128449, 126965, 125226, 123459, 122328, 122230, 122788, 123274, 123279, 122839, 122093, 121166, 120232, 119408, 118620, 117829, 117318, 117392, 117773, 117642, 116551, 115068, 114257, 114602, 115742, 117078, 118254, 118915, 118506, 116792, 114446, 112607, 111735, 111244, 110432, 109437, 108997, 109447, 110275, 110606, 109933, 108475, 107049, 106452, 106692, 106959, 106627, 106149, 106509, 107909, 109546, 110759, 111813, 113286, 115262, 117519, 120055, 122853, 125401, 127013, 127600, 127594, 127139, 125855, 123532, 120637, 117924, 115794, 114173, 112813, 111533, 110246, 108908, 107445, 105853, 104443, 103751, 103914, 104230, 103779, 102564, 101741, 102481, 104811, 107685, 110070, 111864, 113860, 116902, 120935, 124832, 127212, 127435, 125734, 122609, 118475, 113836, 109367, 105634, 103002, 101828, 102359, 104227, 106424, 108086]
51660A08086J083J016J392J915K321K260J542O89O56J752L184L892L490K322J029
51645A36629K15R8K30o1q20j408j509j520j704j572p33J78J80o91j420j395j066
51628A23631j134j599j899j654j024m53k16j58N3L76L30l01r63r06j81L24j11
51611A14115j279k303k378j400j05M37j64j169j549j104m25L7L23L83l3p72j160
51594A01454r07n87q19j353j473j002l14L75J155J848J959J330N04J45L57P04
51578A03376O68O7q06j340j119m34j1q6k3P77J858K092J152O8k2P28J255J105
51560A09305Q91J124J360R54J49k18Q0M62M83L67M53O52P69Q94J166J448J549
51543A21888J501J359J016N29K89N44R75J168J277J639K060K023J544J142R72
$$ y = [108086, 109169, 110185, 111577, 113492, 115813, 118073, 119615, 120304, 120960, 122712, 125896, 129788, 133278, 135600, 136629, 136844, 136942, 137172, 137111, 136291, 134883, 133374, 131854, 130150, 128578, 127845, 128023, 128203, 127512, 126092, 124697, 123631, 122497, 120898, 118999, 117345, 116321, 115868, 115652, 115494, 115547, 115923, 116253, 115952, 114989, 114083, 113902, 114226, 114115, 112836, 110533, 108155, 106755, 106650, 107087, 106923, 105754, 104205, 103101, 102676, 102713, 103036, 103419, 103386, 102614, 101454, 100547, 99960, 99141, 97788, 96315, 95313, 94999, 95374, 96529, 98377, 100336, 101666, 102170, 102315, 102672, 103376, 104044, 104111, 103305, 101965, 100846, 100412, 100401, 100315, 100292, 101069, 102927, 105019, 106171, 106239, 106217, 106945, 108200, 109305, 110196, 111320, 112680, 113634, 113783, 113565, 113645, 114107, 114590, 114957, 115410, 116062, 116831, 117725, 118891, 120339, 121888, 123389, 124748, 125764, 126293, 126582, 127126, 128101, 129269, 130546, 132185, 134245, 136268, 137812, 138954, 139926]
51528A39926O26L8j74L96J218J548J424J331J250P90J07j08K93N36j0r54j451
51511A46786j286r12o69m96l28k60k22KL43L51j90q85j189j040p45m57j11J97
51493A38889J51m29j326k159k632k634k329k127k255k362j895j012o14j179j955
51478A14132j863r47k79m52q97q97o52p71j179j160m51L44N76L26P4o6m15j105
51460A04318j745j804j174l13K19K08j37n33q92j272j653j917j944j626q65K13
51444H9083J122J379J000M14j49p66j266j114k16O59P72M46N07R56J008M66J27
51427I4428N25J048Q74J90j74J09P30J466K255K698K210Q23o61j447j321n26M64
51410A03691J052R38N74P29J423J833J430O62K22J04j32n62q48q50p81q84j204
$$ y = [139926, 140552, 140590, 140416, 140812, 142030, 143578, 145002, 146333, 147583, 148373, 148480, 148372, 148665, 149201, 149191, 148237, 146786, 145500, 144588, 143919, 143423, 143095, 142835, 142613, 142615, 142958, 143309, 143119, 142234, 141045, 140005, 139260, 138803, 138692, 138889, 139040, 138611, 137285, 135126, 132494, 129860, 127531, 125404, 123149, 120787, 118892, 117880, 117266, 116087, 114132, 112269, 111322, 111043, 110591, 109694, 108797, 108145, 107374, 106195, 105035, 104584, 104928, 105504, 105830, 105904, 105838, 105423, 104318, 102573, 100769, 99595, 99282, 99501, 99709, 99572, 99039, 98147, 96875, 95222, 93305, 91361, 89735, 88870, 89083, 90205, 91584, 92584, 92998, 92849, 92083, 90817, 89703, 89487, 90146, 90918, 91364, 91871, 92827, 93835, 94301, 94428, 94953, 96001, 96875, 97065, 96891, 97000, 97730, 99196, 101451, 104149, 106359, 107182, 106521, 105074, 103753, 103227, 103691, 104743, 105681, 106255, 106984, 108407, 110240, 111670, 112332, 112554, 112658, 112526, 111964, 111116, 110266, 109485, 108601, 107397]
51393A07397j660k051k080j709j337j394j722j690r49R2N96J35p91j116l26P55
51377I2150P64n36j819j770o54J80O1m57o90p04q99j245j327q95j34N42P70N17
51359H3854J15j07j92l60n11k84L53R39J053O69r3j157k193k586k027r49m1N09
51341G6992R19J249J280R30L70k16o88p93l26N14J238J572J553J169L28o42j017
51324H4432n77j40o32j802k415j811o99k06n05q39n79J20O85P35L38j05j39L35
51306G6196Q89J034Q14O86P68O45R1m19k73M27R48P88J34m63o03k45K93N10J84
51287H2404l05l84m5N8n46j508k019j724j000m30j91j7L53Q08J014Q62N99M39
51269G8368K52j64o33p54m43n1J58L04N86R43J215J373J434J313R95O61M74L99
$$ y = [107397, 105737, 103686, 101606, 99897, 98560, 97166, 95444, 93754, 92805, 92897, 93493, 93628, 92837, 91721, 91395, 92150, 92914, 92378, 90559, 88789, 88135, 88315, 88376, 87919, 87229, 86525, 85626, 84381, 83054, 82159, 82025, 82567, 83337, 83854, 83969, 83862, 83670, 83310, 82799, 82515, 82868, 83807, 84860, 85529, 85436, 84279, 82086, 79500, 77473, 76524, 76483, 76992, 77911, 79160, 80440, 81370, 81740, 81524, 80836, 80043, 79717, 80231, 81469, 83041, 84594, 85763, 86091, 85449, 84432, 83855, 83715, 83083, 81281, 78866, 77055, 76356, 76150, 75645, 74806, 74227, 74347, 75032, 75767, 76105, 76000, 75861, 76196, 77085, 78119, 78933, 79619, 80387, 81032, 81123, 80704, 80431, 80858, 81806, 82594, 82728, 82265, 81662, 81417, 81710, 82220, 82404, 82099, 81715, 81670, 81728, 81182, 79674, 77655, 75931, 74931, 74501, 74310, 74293, 74646, 75454, 76468, 77330, 77929, 78368, 78620, 78456, 77823, 77069, 76626, 76575, 76733, 77037, 77623, 78566, 79781, 81154, 82588, 83901, 84896, 85557, 86031, 86430]
51251H6430L82M83O18M34j88p25n91J3K98%k59M6O00P92O06M21K53j92p54q04
51231H7863j78M92O42N20O43R27Q35L00k16m59o20p41m54L01Q47N42l11p90n15
51212H9628L3L15L93O03R40J097Q82M25p7n41r21j057p45o8N25O43M72O32J332
51193I4511J942J678N84n02q88o17j39K17K91m8p80j584k012j794r83O3Q27J002
51175I1768P65N41M02k2q66j571j481o84P3L42M21P50J236J434J220R02O74L49
51157I6253j87n33j71P24J302J084O20P73J515J904J334L08k84k83k53n08o79
51140A02919l90R1J75k23o28p52p99r56r28m14L05O41M93L05L32L86L39L65N22
51121A01783N19K28p0j73k76m56l65J60O85Q87J150J737J932R26p59j784j760
$$ y = [86430, 86812, 87295, 87913, 88347, 88159, 87434, 86843, 86856, 87154, 87154, 86895, 86941, 87541, 88333, 88939, 89360, 89613, 89421, 88667, 87863, 87685, 88177, 88819, 89339, 89982, 90909, 91744, 92044, 91828, 91369, 90749, 90008, 89554, 89855, 90702, 91244, 90933, 90143, 89628, 89661, 89976, 90369, 90972, 91912, 93009, 93891, 94316, 94239, 93698, 92777, 91720, 90975, 90907, 91432, 92075, 92547, 93179, 94511, 96453, 98131, 98715, 98213, 97325, 96708, 96569, 96786, 97077, 97029, 96249, 94665, 92653, 90859, 89876, 89939, 90766, 91768, 92533, 93074, 93476, 93454, 92588, 91017, 89536, 88852, 88925, 89267, 89688, 90438, 91674, 93108, 94328, 95230, 95904, 96253, 96066, 95533, 95362, 96086, 97388, 98472, 99092, 99865, 101380, 103284, 104618, 104926, 104642, 104359, 104106, 103598, 102919, 102529, 102620, 102795, 102572, 101944, 101192, 100393, 99437, 98509, 98095, 98400, 99041, 99534, 99839, 100171, 100557, 100896, 101261, 101783, 102302, 102530, 102460, 102287, 102011, 101555, 101190, 101350, 102035, 102922, 104072, 105809, 107741, 108667, 107908, 106124, 104364]
51104A04364j423j129l73Q70J611J212L52o3p8q2J56R52J745J657P02l35r59j236
51086A07943j275j118r65q37k97Q22J701J381J34q42r69o92l85J84J012J526J437
51069A08760J280J482J539P20o72j427p99O62J707J628Q30K45L07O73Q91R78J104
51052A19908J110Q70P42J111J563J344N99L77J158K127K270J683J250J415J795
51037A39322J843J399O84M7k61k15N1M33Q51J126J146J074J138J200R01K39l88
51020A50590p61j006j150j022p16o22p76p59m56l87r00j571j837j763j651j407
51004A33806q17j68Q0j0o8n4j05K8O49J338J292N12n9K12Q54J062P53M36L77M02
50984A40520L95N66J197K189K980K927J873M06n54m92L37J223J601J468J309J563
$$ y = [104364, 102941, 101812, 101439, 102309, 103920, 105132, 105484, 105421, 105343, 105261, 105417, 106369, 108114, 109771, 110473, 110138, 109179, 107943, 106668, 105550, 104585, 103748, 103451, 104273, 105974, 107355, 107489, 106647, 105678, 104986, 104601, 104785, 105797, 107323, 108760, 110040, 111522, 113061, 113781, 113109, 111682, 110883, 111545, 113252, 114880, 115710, 115955, 116262, 116935, 117826, 118804, 119908, 121018, 121888, 122630, 123741, 125304, 126648, 127247, 127624, 128782, 130909, 133179, 134862, 136112, 137527, 139322, 141165, 142564, 143248, 143295, 143034, 142819, 142870, 143303, 144154, 145280, 146426, 147500, 148638, 149838, 150739, 150978, 150590, 149829, 148823, 147673, 146651, 145935, 145313, 144537, 143778, 143322, 142935, 142035, 140464, 138627, 136864, 135213, 133806, 132989, 132821, 132901, 132891, 132823, 132769, 132664, 132692, 133341, 134679, 135971, 136483, 136424, 136636, 137490, 138552, 139305, 139741, 140118, 140520, 140915, 141481, 142678, 144867, 147847, 150774, 152647, 153053, 152499, 152007, 152344, 153567, 155168, 156636, 157945, 159508]
50968A59508K119K434K236J880J831K056K220K298K563L052L477L721M027M560
50954A97982N077N235N069N002N515O752Q270R252R273Q932R407J1184J3462J4990
50940C15402J5358J5210J5394J6142J7080J7739J7941J7695J6901J5308J2957
50929D93127J0458Q536P216N691L229O4k819m750o073p698j0079j2725j4677j5389
50915D54111j5106j4450j3801j3127j2255j1161r973q830p732o569n302m099l157
50902C28549k434j690q41r9L40N21O19P95J276K214L268L676L137K321K047K193
50886C45892K069J610J474J892K205J894J366J237J364J172O37K22K4m14j366
50871C61278k491l268l539l453l221l032k965k855k464j891j545j510j248k33
$$ y = [159508, 161627, 164061, 166297, 168177, 170008, 172064, 174284, 176582, 179145, 182197, 185674, 189395, 193422, 197982, 203059, 208294, 213363, 218365, 223880, 230632, 238902, 248154, 257427, 266359, 275766, 286950, 300412, 315402, 330760, 345970, 361364, 377506, 394586, 412325, 430266, 447961, 464862, 480170, 493127, 503585, 512121, 519337, 525028, 528257, 528321, 525502, 520752, 514679, 506981, 496902, 484177, 469500, 454111, 439005, 424555, 410754, 397627, 385372, 374211, 364238, 355408, 347676, 341107, 335805, 331706, 328549, 326115, 324425, 323584, 323485, 323825, 324346, 324965, 325760, 327036, 329250, 332518, 336194, 339331, 341652, 343699, 345892, 347961, 349571, 351045, 352937, 355142, 357036, 358402, 359639, 361003, 362175, 362812, 363034, 363058, 362644, 361278, 358787, 355519, 351980, 348527, 345306, 342274, 339309, 336454, 333990, 332099, 330554, 329044, 327796, 327563]
50857C27563J231K205K178J649J483J938K560K968L360M135N266O341P124P806
50843C77807Q646R564J0281J0679J0872J0950J0902J0803J0912J1433J2233J2980
50831E08062J3610J4494J6013J7982J9800K1196K2651K4817K7707L0708L3406
50820G50446L6053L8972M1763M3408M3241M1553L9096L6112L2118K6699K0271
50809A149732J3881Q228L131k077p774j3686j9074k3124k5297k5548k4297k2112
50797A011983j9416j6420j3128r442n432j538J777M632P694J1391J5515J9826
50785A007442K4571K9883L5040L8911M1086M1971M1918M0911L9105L6928L4414
50774A412180L1052K6609K1574J6500J1454O431J800k197o000j0302j5248k0514
$$ y = [327563, 328794, 330999, 333177, 334826, 336309, 338247, 340807, 343775, 347135, 351270, 356536, 362877, 370001, 377807, 386453, 396017, 406298, 416977, 427849, 438799, 449701, 460504, 471416, 482849, 495082, 508062, 521672, 536166, 552179, 570161, 589961, 611157, 633808, 658625, 686332, 717040, 750446, 786499, 825471, 867234, 910642, 953883, 995436, 1034532, 1070644, 1102762, 1129461, 1149732, 1163613, 1171841, 1174972, 1172895, 1165121, 1151435, 1132361, 1109237, 1083940, 1058392, 1034095, 1011983, 992567, 976147, 963019, 953577, 948145, 946607, 948384, 953016, 960710, 972101, 987616, 1007442, 1032013, 1061896, 1096936, 1135847, 1176933, 1218904, 1260822, 1301733, 1340838, 1377766, 1412180, 1443232, 1469841, 1491415, 1507915, 1519369, 1525800, 1527600, 1525403, 1519403, 1509101, 1493853, 1473339]
50762A473339k5803l0884l5332l8804m1378m3230m4128m3727m2207m0133l7856
50751A049857l5453l3067l0774k8213k4986k1400j8221j5682j3269j0514p378
50740H10900l890q7L485O041P671R557J2545J6058J8884K0536K1281K1426K1200
50727I65607K0908K0401J8640J4808R741N354K393l34m115q490j1840j3337j3473
50714A006263j2986j2014j0489q679o986n432l716j658O21K974N458Q230J1320
50701I72906J4563J7697K0403K2327K3142K2721K1227J9007J6400J3600J0690
50690A174683P767N087L039J953J929K879M661P034R606J2056J4446J7058J9793
50677A281991K1947K2822K2529K2013K2436K4610K8813L4790M1951M9787N8169
$$ y = [1473339, 1447536, 1416652, 1381320, 1342516, 1301138, 1257908, 1213780, 1170053, 1127846, 1087713, 1049857, 1014404, 981337, 950563, 922350, 897364, 875964, 857743, 842061, 828792, 818278, 810900, 807010, 806923, 810408, 816449, 824120, 833677, 846222, 862280, 881164, 901700, 922981, 944407, 965607, 986515, 1006916, 1025556, 1040364, 1050105, 1055459, 1057852, 1057518, 1053403, 1044913, 1033073, 1019736, 1006263, 993277, 981263, 970774, 962095, 955109, 949677, 945961, 944303, 944924, 947898, 953356, 961586, 972906, 987469, 1005166, 1025569, 1047896, 1071038, 1093759, 1114986, 1133993, 1150393, 1163993, 1174683, 1182450, 1187537, 1190576, 1192529, 1194458, 1197337, 1201998, 1209032, 1218638, 1230694, 1245140, 1262198, 1281991, 1303938, 1326760, 1349289, 1371302, 1393738, 1418348, 1447161, 1481951, 1523902, 1573689, 1631858]
50666A631858O7080P6048Q4079R0131R3487R3673R0454Q4220P6210O8010O0638
50655B515888N4167M8158M2371L6945L1928K6865K1049J4185O644r84q357j5264
50643B773595k1325k6111k9397l1035l0651k7965k3349j7694j1659n476M29N233
50631B554595Q377J0114J0928J0766R239O357K601j611o152j0893j5626k0211
50619B558484k4447k7772k9415k8886k6168k1536j5543r124l183K014O627J0376
50607B391427J2365J2070R986O882K726l157j0993k0150k9822l9645m9462n8811
50595B223416o6965p3334p7704q0068q0546p9462p7306p4440p0868o6403o1180
50584A415140n5782n0776m6236m1886l7564l3297k8974k4396j9743j5670j2653
$$ y = [1631858, 1698938, 1774986, 1859065, 1949196, 2042683, 2136356, 2226810, 2311030, 2387240, 2455250, 2515888, 2570055, 2618213, 2660584, 2697529, 2729457, 2756322, 2777371, 2791556, 2798200, 2797216, 2788859, 2773595, 2752270, 2726159, 2696762, 2665727, 2635076, 2607111, 2583762, 2566068, 2554409, 2548933, 2549362, 2554595, 2562972, 2573086, 2584014, 2594780, 2604019, 2610376, 2612977, 2611366, 2605214, 2594321, 2578695, 2558484, 2534037, 2506265, 2476850, 2447964, 2421796, 2400260, 2384717, 2375593, 2372410, 2374424, 2381051, 2391427, 2403792, 2415862, 2425848, 2432730, 2435456, 2432299, 2421306, 2401156, 2371334, 2331689, 2282227, 2223416, 2156451, 2083117, 2005413, 1925345, 1844799, 1765337, 1688031, 1613591, 1542723, 1476320, 1415140, 1359358, 1308582, 1262346, 1220460, 1182896, 1149599, 1120625, 1096229, 1076486, 1060816, 1048163]
50573A048163j0352p970n058j871J088L547N598P505R505J1513J3044J3555J3078
50560A101345J2344J2108J2408J2691J2704J3069J4792J8342K3422K9520L6325
50549A299070M3509N0500N6870O2703O8253P3265P6966P8736P8486P6537P3461
50538B038356P0143O7506O5954O5292O5261O5862O7078O8597P0059P1226P1865
50527B787199P1753P1099P0632P1036P2526P5117P8784Q3013Q6690Q8977R0016
50516C646842R0185Q8940Q5099P8236O8994N7846M4209K7306P649j2807l2068
50505D150431m9494o5723q1267r5318j06186j12720j14882j12899j06625r6180
50495C209137q2600o7178n0505l2949j5683l22J2357K2343K8974L0684K6552J7246
$$ y = [1048163, 1037811, 1029841, 1024783, 1022912, 1024000, 1027547, 1033145, 1040650, 1050155, 1061668, 1074712, 1088267, 1101345, 1113689, 1125797, 1138205, 1150896, 1163600, 1176669, 1191461, 1209803, 1233225, 1262745, 1299070, 1342579, 1393079, 1449949, 1512652, 1580905, 1654170, 1731136, 1809872, 1888358, 1964895, 2038356, 2108499, 2176005, 2241959, 2307251, 2372512, 2438374, 2505452, 2574049, 2644108, 2715334, 2787199, 2858952, 2930051, 3000683, 3071719, 3144245, 3219362, 3298146, 3381159, 3467849, 3556826, 3646842, 3737027, 3825967, 3911066, 3989302, 4058296, 4116142, 4160351, 4187657, 4195306, 4182499, 4150431, 4100937, 4035214, 3953947, 3858629, 3752443, 3639723, 3524841, 3411942, 3305317, 3209137, 3126537, 3059359, 3008854, 2975905, 2960222, 2959900, 2972257, 2994600, 3023574, 3054258, 3080810, 3098056]
50483C098056M037j2304l1040n0656o9294q5679r9124j09053j15176j17893j17978
50472B293896j16027j12486j07824j02240r5638q8410q1772p6623p2329o7410
50462A373137o1327n4918m9161m4228l9815l5664l1609k7575k3822k0783j8507
50451I65728j6568j4628j2753j1084r526p935o327m853l670k912k485j982j037
50438H69968K26J402K376L454M926O805Q941J1107J3101J5065J7588K1014K4842
50425A000815K8269L1288L4665L8833M3376M7648N1371N4527N7199N9619O1915
50414A509525O3764O4894O5865O7577O9902P1651P2222P2380P2849P3001P1682
50403B275312O8629O4297N8913N2638M6176M0205L4314K7474J9415J0726J629
$$ y = [3098056, 3102093, 3089789, 3058749, 3008093, 2938799, 2853120, 2753996, 2644943, 2529767, 2411874, 2293896, 2177869, 2065383, 1957559, 1855319, 1759681, 1671271, 1589499, 1512876, 1440547, 1373137, 1311810, 1256892, 1207731, 1163503, 1123688, 1088024, 1056415, 1028840, 1005018, 984235, 965728, 949160, 934532, 921779, 910695, 901169, 893234, 886907, 882054, 878384, 875472, 872987, 871005, 869968, 870194, 871596, 873972, 877426, 882352, 889157, 898098, 909205, 922306, 937371, 954959, 975973, 1000815, 1029084, 1060372, 1095037, 1133870, 1177246, 1224894, 1276265, 1330792, 1387991, 1447610, 1509525, 1573289, 1638183, 1704048, 1771625, 1841527, 1913178, 1985400, 2057780, 2130629, 2203630, 2275312, 2343941, 2408238, 2467151, 2519789, 2565965, 2606170, 2640484, 2667958, 2687373, 2698099, 2699728]
50392B699728q383j9537l1256m2853n4074o4620p3746q0730q5272q7215q6372
50381B065670q2867p7243o9920o0966n0729m0191l0225k0822j1630l133L331O908
50369A628183Q171Q316P427M091k889j2572k2264k9947l5757m0775m5169m8253
50357A418562m9805n0226m9518m7322m4107m1226l9322l7587l5141l2318k9945
50346I62045k8087k6290k4543k3072k1636j9867j8079j6901j6175j5079j3306
50335G39010j1457j0134r261q473p636o844o253n985n875n461m599l884l880m139
50321F45129l677k403j270q65o51Q3J249K398L466M606N714O732Q021R918J2146
50306F90596J4153J5840J7554J9415K1107K2276K2768K2593K1916K1014J9994
$$ y = [2699728, 2691345, 2671808, 2640552, 2597699, 2543625, 2479005, 2405259, 2324529, 2239257, 2152042, 2065670, 1982803, 1905560, 1835640, 1774674, 1723945, 1683754, 1653529, 1632707, 1621077, 1617944, 1621275, 1628183, 1636354, 1644670, 1652097, 1656188, 1653299, 1640727, 1618463, 1588516, 1552759, 1511984, 1466815, 1418562, 1368757, 1318531, 1269013, 1221691, 1177584, 1136358, 1097036, 1059449, 1024308, 991990, 962045, 933958, 907668, 883125, 860053, 838417, 818550, 800471, 783570, 767395, 752316, 739010, 727553, 717419, 708158, 699685, 692049, 685205, 678952, 672967, 667092, 661631, 657032, 653148, 649268, 645129, 641452, 639049, 637779, 636914, 636263, 636346, 637595, 639993, 643459, 648065, 653779, 660511, 668532, 678450, 690596, 704749, 720589, 738143, 757558, 778665, 800941, 823709, 846302, 868218, 889232, 909226]
50295I09226J8596J6478J3679J0697Q245O878O584O489N256K116k571p790j2675
50282I81208j6728j9719k1722k3012k3666k3464k2391k0809j8935j6604j3921
50271G60237j1609j0154r052p586n977m927m324l390k122j497j951k509k037p30
50257F92372K00K4q11j343j161q03j106k052k468j289R65K628K783K148J826J948
50241F93861J971J731J596J824K294K739K944K910K964L384L749L167J558J81
50227G26873K59J397K067J511M29k16l55n44r93j290r86j46P28J295J705K211
50211G33945K572K351J743J584K207K891K906K622K881L693M326M551M936N818
50197G79026O797P407P669P667P298O763O818P960R655J0854J1103J0832J0649
$$ y = [909226, 927822, 944300, 957979, 968676, 976921, 983799, 990383, 996872, 1002128, 1004244, 1001673, 993883, 981208, 964480, 944761, 923039, 900027, 876361, 852897, 830506, 809697, 790762, 774158, 760237, 748628, 738474, 729422, 721836, 715859, 710932, 706608, 703218, 701096, 699599, 697648, 695139, 693102, 692372, 692572, 692596, 691785, 690442, 689281, 688478, 687372, 685320, 682852, 681563, 682528, 685156, 687939, 690087, 691913, 693861, 695832, 697563, 699159, 700983, 703277, 706016, 708960, 711870, 714834, 718218, 721967, 725134, 726692, 726873, 727132, 728529, 730596, 732107, 732536, 732320, 731965, 731421, 730428, 729138, 728152, 728006, 728734, 730029, 731734, 733945, 736517, 738868, 740611, 742195, 744402, 747293, 750199, 752821, 755702, 759395, 763721, 768272, 773208, 779026, 785823, 793230, 800899, 808566, 815864, 822627, 829445, 837405, 847060, 857914, 869017, 879849, 890498]
50184H90498J0754J1024J1351J1806J2575J3813J5520J7523J9562K1448K3264
50173A059138K5480K8626L2709L7183M1795M7143N3948O1935P0095P8017Q6204
50162A622273R4796J02602J07952J10096J09278J05674R8965Q9104P7142O5027
50152B582909N4642M6892M1527L7592L3950K9363K2457J2135j859j8965l8361
50141B802282n9051p9362r7015j10231j18656j22816j23030j19327j12299j03393
50131A757102r4044q4823p5637o6532n8019n0596m4255l8680l3821k9981k7210
50120A153504k4929k2478j9836j7440j5448j3617j1890j0492r378q142o676n368
50108I87810m382l347k132j321j358j735j715j437j530j858j563l59J045J988
$$ y = [890498, 901252, 912276, 923627, 935433, 948008, 961821, 977341, 994864, 1014426, 1035874, 1059138, 1084618, 1113244, 1145953, 1183136, 1224931, 1272074, 1326022, 1387957, 1458052, 1536069, 1622273, 1717069, 1819671, 1927623, 2037719, 2146997, 2252671, 2351636, 2440740, 2517882, 2582909, 2637551, 2684443, 2725970, 2763562, 2797512, 2826875, 2849332, 2861467, 2859608, 2840643, 2802282, 2743231, 2663869, 2566854, 2456623, 2337967, 2215151, 2092121, 1972794, 1860495, 1757102, 1663058, 1578235, 1502598, 1436066, 1378047, 1327451, 1283196, 1244516, 1210695, 1180714, 1153504, 1128575, 1106097, 1086261, 1068821, 1053373, 1039756, 1027866, 1017374, 1007996, 999854, 993178, 987810, 983428, 980081, 977949, 976628, 975270, 973535, 971820, 970383, 968853, 966995, 965432, 965073, 966118, 968106]
50094I68106K594L284M130N016N910O689P074P089P222P898R006J0139J1100J1980
50080A067237J2997J4294J5699J6602J6555J6028J6052J6929J7854J8121J8129
50069A246497J8649J9616K0395K0986K2184K4520K7598L0657L3282L5464L7431
50058A537279L9689M2924M7555N3423O0070O7231P5012Q3736R3733J05150J17915
50047B323717J31754J46192J60403J73210J83296J89378J90320J85527J75665
50038C859462J62727J49081J36389J25552J17097J10845J05313R8167Q7450P1958
50028E024041N0734K3270r268m3889p7566j08724j36652j60155j77896j89729
50018D194166j96748j99901j99364j95297j88384j79345j68619j56890j45226
$$ y = [968106, 970700, 973984, 978114, 983130, 989040, 995729, 1002803, 1009892, 1017114, 1025012, 1034018, 1044157, 1055257, 1067237, 1080234, 1094528, 1110227, 1126829, 1143384, 1159412, 1175464, 1192393, 1210247, 1228368, 1246497, 1265146, 1284762, 1305157, 1326143, 1348327, 1372847, 1400445, 1431102, 1464384, 1499848, 1537279, 1576968, 1619892, 1667447, 1720870, 1780940, 1848171, 1923183, 2006919, 2100652, 2205802, 2323717, 2455471, 2601663, 2762066, 2935276, 3118572, 3307950, 3498270, 3683797, 3859462, 4022189, 4171270, 4307659, 4433211, 4550308, 4661153, 4766466, 4864633, 4952083, 5024041, 5074775, 5098045, 5088777, 5044888, 4967322, 4858598, 4721946, 4561791, 4383895, 4194166, 3997418, 3797517, 3598153, 3402856, 3214472, 3035127, 2866508, 2709618, 2564392]
50009B564392j34181j23223j11654r9728q8464p8565p0086o2877n6741n1219m5860
49998A641794m0822l6733l3804l1505k9298k7257k5721k4626k3663k2905k2786
49987A322674k3351k3837k3397k2149k1134k1065k1302k0601j8712j6784j5904
49976A094438j5731j5126j3788j2528j1899j1388j0319r008q311q265p920o603
49964I63552m843l677l353l177k560j774j381j266p16M88J555J619Q81M12Q99
49949I46659K041L193M191N291O698Q403J0299J2145J3651J4762J5874J7420J9457
49936A080084K1793K4490K7916L2312L7580M3568N0356N8133O6869P6238Q5899
49925A605238R5696J05370J14109J20580J23597J22710J17929J09294R7227Q3301
$$ y = [2564392, 2430211, 2306988, 2195334, 2095606, 2007142, 1928577, 1858491, 1795614, 1738873, 1687654, 1641794, 1600972, 1564239, 1530435, 1498930, 1469632, 1442375, 1416654, 1392028, 1368365, 1345460, 1322674, 1299323, 1275486, 1252089, 1229940, 1208806, 1187741, 1166439, 1145838, 1127126, 1110342, 1094438, 1078707, 1063581, 1049793, 1037265, 1025366, 1013978, 1003659, 994651, 986340, 978075, 970155, 963552, 958709, 955032, 951679, 948502, 945942, 944168, 942787, 941521, 940805, 941293, 942848, 944467, 945348, 945760, 946659, 948700, 951893, 956084, 961375, 968073, 976476, 986775, 998920, 1012571, 1027333, 1043207, 1060627, 1080084, 1101877, 1126367, 1154283, 1186595, 1224175, 1267743, 1318099, 1376232, 1443101, 1519339, 1605238, 1700934, 1806304, 1920413, 2040993, 2164590, 2287300, 2405229, 2514523, 2611750, 2695051]
49915B695051O9930N8918N0618M4653M0740L8158L4890K8296J6817N51j9728m3301
49903C015593o8982r4440j16693j33281j43040j46181j43993j38112j29783j19657
49893A781431j08344r6774q5804p5715o6414n7999n0829m5065m0406l6358l2620
49882A085103k9248k6453k4253k2289k0106j7698j5618j4383j3876j3449j2570
49871H75160j1212r760q656q124q042q032p688o889n901n227n215n646n776m980
49857G74012l462k085j508j594j738j484q44k49k75j114k152k390j542m58j50
49842G52967o29j108j101q98r50j224j319r51k47L62N41M09L54M02J36n19q69
49825G45356l42N03O35P4j17N31J188J039M89M36R35J400J668K036K425K306J529
$$ y = [2695051, 2764981, 2823899, 2874517, 2919170, 2959910, 2998068, 3032958, 3061254, 3078071, 3078622, 3058894, 3015593, 2946611, 2852171, 2735478, 2602197, 2459157, 2312976, 2168983, 2030871, 1901088, 1781431, 1673087, 1576313, 1490509, 1414794, 1348380, 1290381, 1239552, 1194487, 1154081, 1117723, 1085103, 1055855, 1029402, 1005149, 982860, 962754, 945056, 929438, 915055, 901179, 887730, 875160, 863948, 854188, 845532, 837408, 829366, 821334, 813646, 806757, 800856, 795629, 790414, 784768, 778992, 774012, 770550, 768465, 766957, 765363, 763625, 762141, 761297, 761048, 760773, 759659, 757507, 755117, 753575, 753117, 752967, 752338, 751230, 750129, 749231, 748281, 747057, 745738, 744787, 744540, 744902, 745443, 745852, 746206, 746608, 746744, 746225, 745356, 745014, 745517, 746152, 746226, 746109, 746640, 747828, 748867, 749356, 749792, 750727, 752127, 753795, 755831, 758256, 760562, 762091]
49808G62091N51j81n56n09k1M79L42m00r12o15O0L03o6n80q03o53l30k18o10j244
49788G56128j393p81l6J06k23m59o39j255k170k564k128j586j636j992j961j495
49772G35916j086r73r82r55q10l23N67J376J540J286J379J997K475K382K151K185
49756G48125K006J044j37k54J065K809L851M016L673L074K496K490L265M105M165
49741G85793L655L577M236M823M655M104L861L880L715L511L866M855N826O236
49727H46593O129N748N257M997N448O565P617Q056Q146Q399Q728Q656Q099P360
49713I45798O592N804N319N521O101O231N686N213N438N983O129N915N965O453
49699A028148O921P053P040P123P271P489P886Q240P969O931N949N989O999P967
$$ y = [762091, 762642, 762461, 761905, 761396, 761375, 761854, 762196, 761796, 760884, 760269, 760329, 760632, 760566, 759986, 759183, 758530, 758200, 757982, 757372, 756128, 754735, 753954, 753918, 754024, 753801, 753342, 752703, 751448, 749278, 746714, 744586, 743000, 741364, 739372, 737411, 735916, 734830, 733857, 732875, 731920, 731110, 730787, 731354, 732730, 734270, 735556, 736935, 738932, 741407, 743789, 745940, 748125, 750131, 751175, 751038, 750784, 751849, 754658, 758509, 762525, 766198, 769272, 771768, 774258, 777523, 781628, 785793, 789448, 793025, 797261, 802084, 806739, 810843, 814704, 818584, 822299, 825810, 829676, 834531, 840357, 846593, 852722, 858470, 863727, 868724, 874172, 880737, 888354, 896410, 904556, 912955, 921683, 930339, 938438, 945798, 952390, 958194, 963513, 969034, 975135, 981366, 987052, 992265, 997703, 1003686, 1009815, 1015730, 1021695, 1028148, 1035069, 1042122, 1049162, 1056285, 1063556, 1071045, 1078931, 1087171, 1095140, 1102071, 1108020, 1114009, 1121008, 1128975]
49685A128975Q101P533O835O308N958N840O031O406O684O676O382N908N424N168
49671A218229N236N454N504N282M878M304L496K689K432K974L745L773K728J346
49657A272070P33J309K473L229L125K588K349K584K740K297J511J140J510K135
49643A301793K382K252K271K781L573M111M059L538L073L169L834M536M768M575
49629A350715M324M142L834L300K726K301K015J890K062K509K954L242L571M066
49615A393651M401M210L721L544L837M085L825L228K830K911L345L866M302M577
49601A446333M627M372L779L007K349J959J712J480J374J466J575J675K238L568
49587A481514M944N265M672M555N578O626O464N623N585O583P410P338O916O709
$$ y = [1128975, 1137076, 1144609, 1151444, 1157752, 1163710, 1169550, 1175581, 1181987, 1188671, 1195347, 1201729, 1207637, 1213061, 1218229, 1223465, 1228919, 1234423, 1239705, 1244583, 1248887, 1252383, 1255072, 1257504, 1260478, 1264223, 1267996, 1270724, 1272070, 1272803, 1274112, 1276585, 1279814, 1282939, 1285527, 1287876, 1290460, 1293200, 1295497, 1297008, 1298148, 1299658, 1301793, 1304175, 1306427, 1308698, 1311479, 1315052, 1319163, 1323222, 1326760, 1329833, 1333002, 1336836, 1341372, 1346140, 1350715, 1355039, 1359181, 1363015, 1366315, 1369041, 1371342, 1373357, 1375247, 1377309, 1379818, 1382772, 1386014, 1389585, 1393651, 1398052, 1402262, 1405983, 1409527, 1413364, 1417449, 1421274, 1424502, 1427332, 1430243, 1433588, 1437454, 1441756, 1446333, 1450960, 1455332, 1459111, 1462118, 1464467, 1466426, 1468138, 1469618, 1470992, 1472458, 1474033, 1475708, 1477946, 1481514, 1486458, 1491723, 1496395, 1500950, 1506528, 1513154, 1519618, 1525241, 1530826, 1537409, 1544819, 1552157, 1559073, 1565782]
49573A565782O419N840N678O574P951Q648Q459Q240Q650R469J0242J0852J1341
49560A674145J1564J1412J1115J1077J1413J1834J1994J1799J1388J0891J0415
49549A799047J0178J0440J1086J1473J1060J0097R408R435R835J0005R700R059
49537A920823Q364P885P675P424O850O287O434P374Q274Q320P595O779O320O318
$$ y = [1565782, 1572201, 1578041, 1583719, 1590293, 1598244, 1606892, 1615351, 1623591, 1632241, 1641710, 1651952, 1662804, 1674145, 1685709, 1697121, 1708236, 1719313, 1730726, 1742560, 1754554, 1766353, 1777741, 1788632, 1799047, 1809225, 1819665, 1830751, 1842224, 1853284, 1863381, 1872789, 1882224, 1892059, 1902064, 1911764, 1920823, 1929187, 1937072, 1944747, 1952171, 1959021, 1965308, 1971742, 1979116, 1987390, 1995710, 2003305, 2010084, 2016404, 2022722]
$$ [...]
##END NTUPLES=NMR SPECTRUM
##END=
