
##TITLE=AC1344_CHILS11171_7433130_S2orzwPgDc
##JCAMPDX= 6.0         $$ Bruker NMR JCAMP-DX V2.0
##DATA TYPE= NMR SPECTRUM
##DATA CLASS= NTUPLES
##ORIGIN= BRUKER
##OWNER= Administrator
$$ 1.72 TOPSPIN		Version 2.1
$$ 2013-01-29 20:19:29.180 -0500  Administrator@X
$$ Compression mode = diff/dup
##.OBSERVE FREQUENCY= 400.02188249412
##.OBSERVE NUCLEUS= ^1H
##.ACQUISITION MODE= SIMULTANEOUS (DQD)
##.ACQUISITION SCHEME= undefined
##.AVERAGES= 8
##.DIGITISER RES= 22
##SPECTROMETER/DATA SYSTEM= spect
##.PULSE SEQUENCE= zg30
##.SOLVENT NAME= COFFEE_meoh
##.SHIFT REFERENCE= INTERNAL, COFFEE_meoh, 1, 14.98509
##AUDIT TRAIL= $$ (NUMBER, WHEN, WHO, WHERE, PROCESS, VERSION, WHAT)
$$ ##TITLE= Audit trail, TOPSPIN		Version 2.1
$$ ##JCAMPDX= 5.01
$$ ##ORIGIN= Bruker BioSpin GmbH
$$ ##OWNER= Administrator
$$ $$ E:\/data/COFFEE/nmr/AC1344_CHILS11171_7433130_S2orzwPgDc/10/pdata/1/auditp.txt
$$ ##AUDIT TRAIL=  $$ (NUMBER, WHEN, WHO, WHERE, PROCESS, VERSION, WHAT)
(   1,<2013-01-29 20:19:20.789 -0500>,<Administrator>,<X>,<go>,<TOPSPIN 2.1>,
      <created by zg
	started at 2013-01-29 20:18:14.414 -0500,
	POWCHK enabled, PULCHK disabled,
       configuration hash MD5:
       86 BA 57 50 F2 9D 5C 9B 26 00 A9 28 5F 66 2E 89
       data hash MD5: 64K
       00 71 F8 93 F2 CE 61 99 FF C1 3D 52 7A 6A D0 E4>)
(   2,<2013-01-29 20:19:23.852 -0500>,<Administrator>,<X>,<proc1d>,<TOPSPIN 2.1>,
      <Start of raw data processing
       efp LB = 0 FT_mod = 6 PKNL = 1 PHC0 = 0 PHC1 = 0 SI = 32K 
       data hash MD5: 32K
       B4 F6 AF 5A 53 1A 24 C5 E6 A9 65 24 49 33 06 CB>)
(   3,<2013-01-29 20:19:24.477 -0500>,<Administrator>,<X>,<proc1d>,<TOPSPIN 2.1>,
      <pk PHC0 = 99.66248 PHC1 = 0 
       data hash MD5: 32K
       A6 19 18 12 7D 61 55 72 7D 87 16 21 48 F7 BC 8D>)
(   4,<2013-01-29 20:19:24.695 -0500>,<Administrator>,<X>,<proc1d>,<TOPSPIN 2.1>,
      <abs ABSG = 1 
       data hash MD5: 32K
       5B FA 8F 4D 9B 35 2C AB B8 CF 1E 71 DB E5 E8 BA>)
(   5,<2013-01-29 20:19:24.836 -0500>,<Administrator>,<X>,<proc1d>,<TOPSPIN 2.1>,
      <abs ABSG = 2 
       data hash MD5: 32K
       5B 2F F9 25 F6 03 23 51 DB F9 C9 8A CC BE 6E 4D>)
(   6,<2013-01-29 20:19:25.024 -0500>,<Administrator>,<X>,<proc1d>,<TOPSPIN 2.1>,
      <abs ABSG = 3 
       data hash MD5: 32K
       58 C5 36 B3 2A BC 0A EE 8F F8 A0 7C 2B 6D FA C8>)
(   7,<2013-01-29 20:19:25.149 -0500>,<Administrator>,<X>,<proc1d>,<TOPSPIN 2.1>,
      <abs ABSG = 4 
       data hash MD5: 32K
       AB 0F 50 F9 8C 0E 4B 8D D7 79 80 8A 3F B2 3C F8>)
(   8,<2013-01-29 20:19:25.258 -0500>,<Administrator>,<X>,<proc1d>,<TOPSPIN 2.1>,
      <abs ABSG = 5 
       data hash MD5: 32K
       28 1C BA AA AA 67 C7 88 2F 1B C8 A5 25 A0 A2 BD>)
$$ ##END=
$$ 
$$ $$ hash MD5
$$ $$ 86 F3 05 E2 06 0B 89 56 82 31 44 E9 F5 97 7F 87
##$RELAX= 
##$RELAX= 
##$RELAX= 
##$RELAX= 
##$RELAX= 
##$RELAX= 
##$RELAX= 
$$ Bruker specific parameters
$$ --------------------------
##$DU= <E:\>
##$EXPNO= 10
##$NAME= <AC1344_CHILS11171_7433130_S2orzwPgDc>
$$ [...]
150 150 150 150 150 150 150 150
##$TP07= 0
##$TPNAME0= <>
##$TPNAME1= <>
##$TPNAME2= <>
##$TPNAME3= <>
##$TPNAME4= <>
##$TPNAME5= <>
##$TPNAME6= <>
##$TPNAME7= <>
##$TPOAL= (0..7)
0.5 0.5 0.5 0.5 0.5 0.5 0.5 0.5
##$TPOFFS= (0..7)
0 0 0 0 0 0 0 0
##$TUNHIN= 0
##$TUNHOUT= 0
##$TUNXOUT= 0
##$USERA1= <user>
##$USERA2= <user>
##$USERA3= <user>
##$USERA4= <user>
##$USERA5= <user>
##$V9= 5
##$VALIST= <valist>
##$VCLIST= <CCCCCCCCCCCCCCC>
##$VD= 0
##$VDLIST= <DDDDDDDDDDDDDDD>
##$VPLIST= <PPPPPPPPPPPPPPP>
##$VTLIST= <TTTTTTTTTTTTTTT>
##$WBST= 1024
##$WBSW= 4
##$XGAIN= (0..3)
0 0 0 0
##$XL= 0
##$YL= 0
##$YMAX_a= 621092
##$YMIN_a= -529702
##$ZGOPTNS= <>
##$ZL1= 120
##$ZL2= 120
##$ZL3= 120
##$ZL4= 120
##$ABSF1= 14.98509
##$ABSF2= -5.573092
##$ABSG= 5
##$ABSL= 3
##$ALPHA= 0
##$AQORDER= 0
##$ASSFAC= 0
##$ASSFACI= 0
##$ASSFACX= 0
##$ASSWID= 0
##$AUNMP= <proc_prof1d_extract_pilot.lims>
##$AXLEFT= 0
##$AXNAME= <>
##$AXNUC= <1H>
##$AXRIGHT= 0
##$AXTYPE= 0
##$AXUNIT= <>
##$AZFE= 0.1
##$AZFW= 0.1
##$BCFW= 0
##$BC_mod= 0
##$BYTORDP= 0
##$COROFFS= 0
##$CY= 15
##$DATMOD= 1
##$DC= 0
##$DFILT= <>
##$DTYPP= 0
##$F1P= 0
##$F2P= 0
##$FCOR= 0.5
##$FTSIZE= 32768
##$FT_mod= 6
##$GAMMA= 0
##$GB= 0
##$INTBC= 1
##$INTSCL= 1
##$ISEN= 128
##$LB= 0
##$LEV0= 0
##$LPBIN= 0
##$MAXI= 10000
##$MC2= 0
##$MEAN= 0
##$ME_mod= 0
##$MI= 0
##$NCOEF= 0
##$NC_proc= -8
##$NLEV= 6
##$NOISF1= 0
##$NOISF2= 0
##$NSP= 0
##$NTH_PI= 0
##$NZP= 0
##$OFFSET= 14.98509
##$PC= 1
##$PHC0= 99.66248
##$PHC1= 0
##$PH_mod= 1
##$PKNL= yes
##$PPARMOD= 0
##$PPDIAG= 0
##$PPIPTYP= 0
##$PPMPNUM= 2147483647
##$PPRESOL= 1
##$PSCAL= 4
##$PSIGN= 0
##$PYNMP= <proc.py>
##$REVERSE= no
##$SF= 400.02
##$SI= 32768
##$SIGF1= 0
##$SIGF2= 0
##$SINO= 400
##$SIOLD= 32768
##$SPECTYP= <>
##$SREGLST= <1H.CDCl3>
##$SSB= 0
##$STSI= 32768
##$STSR= 0
##$SW_p= 8223.68421052631
##$SYMM= 0
##$S_DEV= 0
##$TDeff= 65536
##$TDoff= 0
##$TI= <>
##$TILT= no
##$TM1= 0
##$TM2= 0
##$TOPLEV= 0
##$USERP1= <user>
##$USERP2= <user>
##$USERP3= <user>
##$USERP4= <user>
##$USERP5= <user>
##$WDW= 1
##$XDIM= 32768
##$YMAX_p= 459193933
##$YMIN_p= -727788
##$CURPLOT= <Network HP LaserJet P1505>
##$CURPRIN= <$Network HP LaserJet P1505>
##$DFORMAT= <normdp>
##$LAYOUT= <+/1D_H.xwp>
##$LFORMAT= <normlp>
##$PFORMAT= <normpl>
##$SURQMSG= 1
$$ End of Bruker specific parameters
$$ ---------------------------------
##NTUPLES= NMR SPECTRUM
##VAR_NAME=  FREQUENCY,     SPECTRUM/REAL,   SPECTRUM/IMAG
##SYMBOL=    X,             R,               I
##VAR_TYPE=  INDEPENDENT,   DEPENDENT,       DEPENDENT
##VAR_FORM=  AFFN,          ASDF,            ASDF
##VAR_DIM=   32768,         32768,           32768
##UNITS=     HZ,            ARBITRARY UNITS, ARBITRARY UNITS
##FACTOR=    0.250966925370066, 1,           1
##FIRST=     8223.43324360094, -41993,       211915
##LAST=      0,             -16943,          -320045
##MIN=       0,             -727788,         0
##MAX=       8223.43324360094, 459193933,    0
$$ Real data points
##PAGE= N=1
##DATA TABLE= (X++(R..R)), XYDATA
$$ [...]
19568b53858k1782O8423e533k8568B14308b9660D5493b14980A42454D9684a86018
19556b2932B89061G0371A8309a09679j65810a6496l19469g5186A05129b41824
19545C50394c12984J55158A75847c54813a27732j08648B057N1772h4602J4465
19535g0137j74511m0887a16078C2504L1781c48026A96906b24745P5440J0511r6046
19524b34840M7637O2188p8819j41644J33804a6195F75a74670k32913e5407A03335
19512A01395E280e8828k19941a0685j24280b2751A13583b97220d008B88815a39267
19500C11017A16406e5663l2408A04854r580c47894i4211E7427d354j87436A77354
19488h2145o2534A39868c53189a142k1462k67983e4659l5320E6632f1269q680
$$ y = [-253858, -275640, -207217, -5533, -34101, 214308, -29660, 45493, -214980, 142454, 49684, -186018, -22932, 289061, 70371, 18309, -109679, -275489, -16496, -335965, -75186, 105129, -241824, 350394, -312984, -157826, 175847, -354813, -127732, -236380, 2057, 53829, -84602, -70137, -244648, -285535, -116078, 32504, 64285, -348026, 196906, -224745, -149305, -138794, -234840, -187203, -125015, -203834, -345478, -211674, -16195, 675, -174670, -407583, -55407, 103335, 101395, 5280, -58828, -278769, -10685, -134965, -22751, 113583, -297220, -4008, 288815, -139267, 311017, 116406, -55663, -88071, 104854, 95274, -347894, -94211, 57427, -4354, -191790, 177354, -82145, -144679, 139868, -353189, -1142, -22604, -290587, -54659, -89979, 56632, -61269, -69949]
19477f9949j51546A77642E3421c369j30708K5305b6889C0724a33813M0045k47515
19466c41283N6443J06293B8094p956a82415l9172A14186D0283a76140p6960b4108
19454d1791l9948k04015c8200A27482J12180a76195C43581a49390A43990a35993
19443a67279c8940P170j3781k06072f0272J5198n2450b7263A2753d5034j91117
19432b36151K5800q1917H1202a83661A32856a77371p7301J27075j7821B64476
19421C0522d41262B21635a88620r6531a35005j05484C66759d41186B344L5161
19411C7505c71679M4075J05442p9625A36972O6632f9738k27318b8813a1783k04193
19400b15976a0156j1729q2127A27828P2824c2802q5781q229B37340a98428h5974
$$ y = [-69949, -221495, 177642, 53421, -3369, -134077, -108772, -26889, 30724, -133813, -93768, -341283, -284840, -178547, 28094, 20138, -182415, -221587, 114186, 40283, -176140, -253100, -24108, -41791, -81739, -285754, -38200, 127482, 239662, -176195, 343581, -149390, 143990, -135993, -167279, -38940, -31770, -45551, -251623, -60272, -45074, -97524, -27263, 12753, -45034, -236151, -210351, -292268, 81202, -183661, 132856, -177371, -254672, -127597, -145418, 264476, 30522, -441262, 221635, -188620, -285151, -135005, -240489, 366759, -441186, 2344, 37505, -371679, -327604, -222162, -301787, 136972, 203604, -69738, -297056, -28813, -11783, -215976, -10156, -21885, -104012, 127828, 200652, -32802, -118583, -126812, 237340, -198428, -85974]
19388a78327n2093l406A20648f7100J6064A65004r014c11960R2376e8127A13560
19376I6275Q1342b0781m5214A59107m0292H265c14715h3289D5662C403O9790M205
19364G7398a3462j06740o0349H6055a70951G5012L1948E0525R3852c7241j5756
19353e2997A21515g6724A37790J89156b65030A86964G8099J02335j3742F8861
19342A0434J41066c03218I5581c51285c4208r9527C8084b9503j78150g1751l6500
19331a08251B42256c05293A26900J9930a96391n0949G4289b09174G2090B1768
19320c39736B8888J7915i6551B20151d35375f5565j39528P4426o1155N0999C58079
19308b80159A42641C4131c19520D1295J16060a07551A34677j697a23494A61083
$$ y = [-178327, -230420, -233826, 120648, -67100, -51036, 165004, 155990, -311960, -219584, -58127, 113560, 96275, 177617, -20781, -65995, 159107, 118815, 8265, -314715, -83289, 45662, 3403, 73193, 77398, -13462, -120202, -180551, 86055, -170951, 75012, 106960, 50525, 144377, -37241, -52997, 121515, -76724, 137790, 326946, -265030, 186964, 78099, 180434, 166692, 68861, 10434, 151500, -303218, 95581, -351285, -34208, -133735, 38084, -29503, -207653, -71751, -108251, 242256, -305293, 126900, 146830, -196391, -247340, 74289, -209174, 72090, 21768, -339736, 28888, 46803, -96551, 220151, -435375, -65565, -205093, -130667, -191822, -140823, 358079, -280159, 142641, 34131, -319520, 41295, 157355, -107551, 134677, 132980, -123494, 161083]
19297a23189G4416K66933b0000A05573d65626a86643A47571m547i1346A22781
19286b05585k977A08016C7594e2946l61997R6376J54659c8529H01a08823B7044
19274f1776A08255P2883g2432A50953n226H451R0851b00338A0109J73960c13090
19262c54597b6180A31325a592A6518d58926A45803a68452C7477Q4460E6041O1354
19251A17395a07055J8617L2101E0771c13286f5846a6235k08643j90159a61573
19240b8355o8748j11235A43894M3639a31299m5176J5237k9229h463A02741A3641
19228H5158b39301c2468k5645F1465J08323C9726h4456C5789d4523G2546b02619
19216c32827a43396k15813g1574E2501b74102e9448j87769O7960A41001b18345
$$ y = [-123189, 74416, 341349, -20000, 105573, -465626, -186643, 147571, 143024, -91346, 122781, -205585, -208562, 108016, 37594, -52946, -414943, -318567, -163908, -38529, 801, -108823, 27044, -61776, 108255, 181138, -72432, 150953, 145727, 8451, 99302, -200338, 10109, 184069, -313090, -354597, -26180, 131325, -1592, 16518, -458926, 145803, -168452, 37477, 121937, 56041, 117395, -107055, -88438, -56337, 50771, -313286, -65846, -16235, -224878, -415037, -161573, -28355, -97103, -208338, 143894, 187533, -131299, -176475, -161238, -190467, -8463, 102741, 13641, 85158, -239301, -32468, -58113, 61465, 169788, 39726, -84456, 35789, -44523, 72546, -202619, -332827, -143396, -359209, -71574, 52501, -274102, -59448, -247217, -179257, 141001, -218345]
19205c0936B61387A26522D037a06056A08082b09001i1977E3897J68694C1085a75444
19193c2807j31774k1222B18432i4057k24278P6191e720o2103A05900a01223L3239
19182f7984C9506L00698d61859i8820A94213a99773e2282c747j70918j6258R4014
19171i6909k9270F5188L35595A50455J7983a61411j110b1233B26820E058J4903
19160A9961b37205B4996f8717J2256H3573C5261K3675b45676D14453a27449H2182
19148B9781c71171i6123A91370a0307A2661N1041N5794G187L8596P6417b30810
19136A3888O8610d4250o9596b9081k02293P8110j74844A31156k2082E062c39786
19124A85713a99832C51137a47073A41829f961A64030H112J61037a26917j4821
$$ y = [-30936, 261387, 126522, 4037, -106056, 108082, -209001, -91977, 53897, 222591, 31085, -175444, -32807, -164581, -185803, 218432, -94057, -318335, -242144, -5720, -67823, 105900, -101223, -67984, 39506, 340204, -461859, -98820, 194213, -199773, -52282, -3747, -174665, -190923, -96909, -126179, 65188, 400783, 150455, 168438, -161411, -162521, -21233, 226820, 5058, 19961, -237205, 24996, -68717, -56461, 83573, 35261, 58936, -245676, 414453, -127449, 82182, 29781, -371171, -96123, 191370, -10307, 12661, 63702, 119496, 7187, 45783, 122200, -230810, 13888, 82498, -44250, -113846, -29081, -231374, -153264, -328108, 131156, 109074, 5062, -339786, 185713, -199832, 351137, -147073, 141829, -6961, 164030, 8112, 169149, -126917, -141738]
19114a41738H6246b48548l4593O4521A65476r447e41595K44804f1415F2144K1309
19103H3453a33478A64691b56606a9446j89644k07385a8769l03740B41914b46575
19092A133J61199G4540a09391L5067j51221J6989B27122D629J54913a19411k56569
19081c75980J26654b721C35588M3084F9645d14489A09015d9456G4521A252a78936
19069c58708A07714a45500M1905b3893j5439i428l07582a54432A09863D8998b96962
19057F050c00846C25532b43415g1313m6899B33845a21048c8185j16448m6206g7280
19045c0775A36145B7738a08368E3812a37459B83296I9634D3476L1489a5579A4332
19033g7352B62510i6151k6235L350A30215c47049B10589F8493d18133a46070E4556
$$ y = [-141738, 86246, -248548, -283141, -218620, 165476, 156029, -541595, -296791, -61415, 62144, 83453, -133478, 164691, -256606, -19446, -209090, -416475, -18769, -322509, 241914, -246575, 1133, 162332, 74540, -109391, -74324, -225545, -208556, 227122, 4629, 159542, -119411, -375980, -249326, -2721, 335588, 378672, 69645, -414489, 109015, -49456, 74521, 1252, -178936, -358708, 107714, -145500, -103595, -23893, -39332, -9428, -317010, -154432, 109863, 48998, -296962, 6050, -300846, 325532, -243415, -71313, -118212, 233845, -121048, -38185, -154633, -200839, -77280, -30775, 136145, 27738, -108368, 53812, -137459, 283296, 99634, 43476, 74965, -15579, 14332, -77352, 262510, -96151, -122386, -119036, 130215, -347049, 210589, 68493, -418133, -146070, 54556]
19021b4682o6494d162C46438f6707J5434r7830c3960D6837d31471E288K44889
19010B50177d2420B24928g4558l8797c0806j32265I1735N2561n3018b06833e4510
18998B33151a61902b2798j51398b311j83578P7047J7170B00842b0083e242C20064
18986D38075a08798b4236H449L6770a64629j57746i5049A05683a09079j42001
18976b51080a05068K5754A5989b89273A37876a41974A97686e1164B48446B4643
18965b47231I14c2586A27655D741b428o5885j09015A7804b11309j55832B53587
18953A158l34a80835M368B57726P3793l3468G3614J71762h6446a4287I2072M9190
18941A41262F892f1479j38826i5072A0946R0270a42164j35006A91338a40955e1116
$$ y = [-24682, -91176, -4162, 346438, -66707, -51273, -149103, -33960, 46837, -431471, 5288, 250177, -42420, 224928, -74558, -113355, -30806, -163071, 91735, 144296, 91278, -206833, -54510, 233151, -161902, -22798, -174196, -2311, -185889, -108842, -91672, 200842, -20083, -5242, 320064, 438075, -108798, -24236, 8449, 45219, -164629, -322375, -95049, 105683, -109079, -251080, -105068, -79314, 15989, -289273, 137876, -141974, 197686, -51164, 248446, 24643, -247231, 914, -32586, 127655, 4741, -2428, -68313, -177328, 17804, -211309, -367141, 253587, 1158, 824, -180835, -176467, 257726, 331519, 298051, 73614, 245376, -86446, -14287, 92072, 141262, 6892, -61479, -200305, -95072, 10946, 101216, -142164, -277170, 191338, -140955, -51116]
18929g1154k17597a24038n0910A27079B2351c9070M644k93819B60618a49096A70517
18917G5670h3053F8510i2706M2286j4356m1464B70582G2943a67029J858A13004
18905b11636k70445E7107O1503a46547M606R029A9947d29252e3906a4276j50352
18894a64628B00008d3973j63384r4054a07375B11477e6924j72944a1463k34628
18884b46091B6120N2116a0041G5462K26664c9162j01184M6155c6384M587C7327
18872a16220H1098a76977A9149J80499a07792k48726a39808j01806B66873b51166
18861a52544P1941j88499a13479O828d8709B29612a98944P3102F5062J00158h6837
18849A45887a07730B0394N2227e2262J3083C8488a98480d8670o2704I6222a17297
$$ y = [-71154, -288751, -124038, -174948, 127079, 22351, -39070, -34426, -328245, 260618, -149096, 170517, 75670, -83053, 68510, -92706, -50420, -64776, -106240, 270582, 72943, -167029, -165171, 113004, -211636, -482081, 57107, 118610, -146547, -141941, -132912, 19947, -429252, -53906, -14276, -164628, 200008, -43973, -207357, -301411, -107375, 211477, -56924, -229868, -11463, -246091, 26120, 78236, -10041, 75462, 302126, -39162, -140346, -94191, -36384, -31797, 37327, -116220, 81098, -176977, 19149, 199648, -107792, -356518, -139808, -241614, 266873, -251166, -152544, -80603, -269102, -113479, -106651, -48709, 229612, -198944, -125842, 65062, 165220, -86837, 145887, -107730, 20394, 72621, -52262, -39179, 38488, -198480, -48670, -111374, 96222, -117297]
18837g8790E4809K25656H6532a50281D1976b89795I9957g8280j53251K455j06889
18826c35965C0813a42034A23359R2132r6975l7923b28385m2817a8484r1645n6511
18815a66640C0798a09260g092A37524l1854a59775C12749j51773d9556A23592
18804d15419A23475a41737E70a85698A04554k6179e25505b07952G2717R3871f9433
18792h1603B27548A8740c59086B24455H9201a55573A29564j1297b24424g8930
18781c4363d820k3188o3839K2471j07357P9376b1064q5493A33524n3873a1944
18769B64914b11232Q093i8336c6741k9825b0742B56101b9259l48253J29645Q9596
18758a58271j71979J06587B7596b76218b3583j83886O7895c0927b436n9150h137
$$ y = [-78790, 54809, 280465, 86532, -150281, 41976, -289795, 99957, -78280, -231531, -229076, -335965, 30813, -142034, 123359, 215491, 118516, 80593, -228385, -271202, -18484, -110129, -166640, 30798, -109260, -7092, 137524, 105670, -159775, 312749, 160976, -49556, 123592, -415419, 123475, -141737, 570, -185698, 104554, 78375, -525505, -207952, 72717, 166588, -69433, -81603, 227548, 18740, -359086, 224455, 89201, -155573, 129564, 118267, -224424, -78930, -34363, -4820, -28008, -91847, -69376, -176733, -97357, -21064, -106557, 133524, 79651, -11944, 264914, -211232, -203139, -98336, -36741, -66566, -20742, 256101, -29259, -377512, -247867, -158271, -330250, -223663, 27596, -276218, -23583, -207469, -139574, -30927, -2436, -61586, -8137]
18746a64042A83061d0464n0074m3782C70493G9979a54122A10569b63113J18166
18736a44947C3860h5931L3151K4007L023c482j36175l7915f5687j73821f1007
18724c7398l68047H8164c7522A60313a51718A79975e6027A54564b32572M5636
18714a86936H9838f2965j36735A43729i2794j08201M6953d9784n2191j53676f2398
18702c90281B84368c4556j40585h525l06420i2460k37136J46734c207j4907A50914
18690d3890C1916c5596A02631b49939H116R4693e763A7713a43140J3798j88724
18679c18066R4405P1451C7343i3610l35946f8969B20741h2522o5158A40712a4182
18667b767k18680Q6592A02162N4233c32397C9779a56596c4900B10296G1963a80085
$$ y = [-164042, 183061, -40464, -90538, -134320, 370493, 79979, -154122, 110569, -263113, -144947, 33860, -85931, -52780, -28773, -25750, -3482, -139657, -177572, -65687, -239508, -61007, -37398, -405445, 88164, -37522, 160313, -151718, 179975, -56027, 154564, -232572, -186936, 89838, -62965, -199700, 143729, -92794, -200995, -154042, -49784, -101975, -255651, -62398, -390281, 284368, -34556, -175141, -8525, -314945, -92460, -329596, -182862, -3207, -18114, 150914, -43890, 31916, -35596, 102631, -249939, 8116, 102809, -5763, 17713, -143140, -129342, -318066, -223661, -152210, 37343, -93610, -429556, -68969, 220741, -82522, -147680, 140712, -14182, -2767, -221447, -134855, 102162, 156395, -332397, 39779, -156596, -34900, 210296, 71963, -180085]
18655A38746b44426N1631Q4489l54068C5825J7123b62828l4450F3099M5626a87223
18643a38055B7491J24362a11886j5368G1835k4390K5566b87582C6321c249A13828
18631b87676a7704F2234h9905B32138a74777g7394j86044B13249a475j27418A09963
18619A27258D0117a03341D2265a84866B05654b79071J22745G3575f6188a7224
18608B87779b38371a10712B09855d5211A77853b3719F4213K93361j17977a32373
18597A03816L3772b39339c0377C83036c26448e7672J6870k12408D6667J54468
18587B01135r0326c624A34730D5237b20347I1496a55656R597M3693a3776m2716
18576e6492B39519b7336A28358d5231o6648A15208G089a79545a7871p2018j76085
$$ y = [138746, -244426, -192795, -108306, -462374, 35825, 52948, -262828, -297278, 63099, 108725, -187223, -138055, 27491, 151853, -111886, -127254, 71835, 47445, 73011, -287582, 36321, -3249, 113828, -287676, -17704, 62234, -89905, 232138, -174777, -77394, -263438, 213249, -1475, -128893, 109963, 127258, 40117, -103341, 42265, -184866, 205654, -279071, -156326, 73575, -66188, -17224, 287779, -238371, -110712, 209855, -45211, 177853, -23719, 64213, 357574, 239597, -132373, 103816, 137588, -239339, -30377, 383036, -326448, -57672, -40802, -253210, 46667, 201135, 110809, -3624, 134730, 45237, -220347, 91496, -155656, -146059, -102366, -13776, -56492, 239519, -27336, 128358, -45231, -111879, 115208, 7089, -179545, -17871, -89889, -265974]
18565b65974a22121A5085J21304a19685N7032C04781d4648r9789P0792I8949A2329
18553D04987F2682a72953E0609a75226h0917C0238a26039D6102b3323l22352d7296
18541A41656J67153b89178A94199C6580M7466C2575K4698A7098R3004c67726a04754
18529g1231k05053J06998D6564c51946a01146j55805a12679j03581i1443p5945
18519a67388D5992b8487p8083j31872j152K9811D09632a0499q6106j93559Q6332
18508b03832B23503a3999A20161g3826B48803a7779B38766a17737d8950A14059
18497a84528g7915C5647a43675A54262b73068e3803j02438M5446k4511j4801A02598
18485B5725K61025b85021A23857a18158A8528L2425j5139N6500J23603f5988k57374
$$ y = [-265974, -122121, 15085, 136389, -119685, -62653, 304781, -44648, -144437, -73645, 98949, 12329, 404987, 62682, -172953, 50609, -175226, -80917, 30238, -126039, 46102, -23323, -345675, -47296, 141656, 308809, -289178, 194199, 36580, 84046, 32575, 57273, 17098, 110102, -367726, -104754, -71231, -276284, -169286, 46564, -351946, -101146, -256951, -112679, -216260, -91443, -167388, 45992, -28487, -106570, -238442, -239594, -209783, 409632, -10499, -96605, -290164, -203832, 223503, -13999, 120161, -73826, 248803, -17779, 238766, -117737, -48950, 114059, -184528, -77915, 35647, -143675, 154262, -273068, -53803, -156241, -110795, -135306, -150107, 102598, 25725, 286750, -285021, 123857, -118158, 18528, 50953, 35814, 92314, 215917, -65988, -323362]
18474c23362i9153j0711c331p2161o8205j06131c073j21252A43650R5316c67317
18462g7329L6715j74820Q502E063d7653B504J30865m4985a00323g063B44805o4600
18450A80205a47972N2325j05397g7781H009f6371j70692r6735A91103a9286q9077
18439a08363n8595r6824B5108J69556b33710g9717c7061B72519j6590b32478n8428
18428b90906a1653F6797k1548d7525l10847M2700a0305j86795N4701D7713d2420
18416C1220N3091O5419b01215B9985J91118c012A23536Q4454o9601b80329g6707
18404a71742B45662f0152A31076A2070b34712H900J81648a0012j10900r2577A97771
18392c31461Q562J22064l8641n538m8662J25007j43847A16888c39608J3358A6369
$$ y = [-323362, -99153, -109864, -3331, -75492, -143697, -249828, -3073, -124325, 143650, 238966, -367317, -77329, -40614, -215434, -206932, 5063, -47653, 2504, 133369, 88384, -100323, -7063, 244805, 180205, -147972, -95647, -201044, -77781, 8009, -66371, -237063, -333798, 191103, -19286, -108363, -166958, -263782, 25108, 194664, -233710, -79717, -37061, 272519, 255929, -232478, -290906, -11653, 66797, 45249, -47525, -358372, -315672, -10305, -197100, -142399, 47713, -42420, 31220, 84311, 149730, -201215, 29985, 221103, -3012, 123536, 207990, 138389, -280329, -76707, -171742, 245662, -60152, 131076, 12070, -234712, 8900, 190548, -10012, -120912, -213489, 197771, -331461, -322899, -200835, -239476, -245014, -293676, -168669, -312516, 116888, -339608, -326250, 16369]
18380b704j34246j5480F0961a44502q8098I1008J94154g0618j68360c8357A5277
18368D84547a48096B0974K21014a00640k37908f4325j1556j9194A23940i9485
18357e282q4228k23296e7293H0764A7747J60285o2366e5098q7257B7495J00057
18346A27552E7021a9076p304o868m3563F5842f408j38007n1469j96309a28094
18334A18406f226n7876k10271L2226a2022m9545k76381F679a8142q1259L2249
18323f7152B9225K68492a97327b8845N117j19824e9328l22236R1593a05182l5537
18312a40719e6407E5097a34255H134b39734J0724l2814B22974d1669B29367a85143
18300A60508a72654P6577q6782D9933a03153B70080A13604C1650K39367a41929
$$ y = [-2704, -136950, -152430, 60961, -144502, -232600, 91008, 285162, -70618, -238978, -38357, 15277, 484547, -148096, 20974, 241988, -100640, -338548, -64325, -75881, -95075, 123940, -99485, -5282, -89510, -312806, -57293, 80764, 17747, 178032, 115666, -55098, -142355, 27495, 127552, 57021, -19076, -26380, -33248, -76811, 65842, -6408, -144415, -195884, -392193, -128094, 118406, -6226, -64102, -274373, -242147, -12022, -61567, -337948, 6679, -18142, -99401, -67152, 29225, 297717, -197327, -28845, -23728, -143552, -59328, -381564, -289971, -105182, -140719, -56407, 55097, -134255, 8134, -239734, -229010, -261824, 222974, -41669, 229367, -185143, 160508, -172654, -96077, -182859, 49933, -103153, 270080, 113604, 31650, 271017, -141929]
18289a8361j78089N3560C7722b9183A96575a52040A38164c84492e9086A7991P4767
18278I2758b2782p4543l10044A74262b17228c1328g755k52531j07186J19679A17834
18266g0613A0265a2031B07632c0438N19q872B76842q7497l6135b98097I9736J2954
18254A12690c3044j06814F2366j599c29851a19411A43605c1143B6072O5284a24149
18242c4066d734j3539r313j04418O1357H9685J01883A3881c2710j00944e909j18689
18230a24598H801a24673k67943c6958E281L73750A17046b15845R8641j12163P2332
18219a57035A7325a41625B32131q1816a01181J6232C8357J12765B7217O879b30377
18207B0293O386d8758A50744g8827B15059d8667A43868D6267b13667f7534j78052
$$ y = [-18361, -196450, -142890, 37722, -29183, 196575, -152040, 138164, -384492, -59086, 17991, 92758, -22782, -97325, -407369, 174262, -217228, -31328, -7755, -260286, -367472, -247793, 117834, -70613, 10265, -12031, 207632, -30438, -29919, -38791, 276842, 189345, 153210, -298097, 99736, 112690, -33044, -139858, 62366, 60767, -329851, -119411, 143605, -31143, 26072, 91356, -124149, -34066, -4734, -18273, -27586, -132004, -70647, 89685, 191568, 13881, -32710, -133654, -5909, -124598, 8801, -124673, -392616, -36958, 5281, 379031, 117046, -215845, -117204, -229367, -157035, 17325, -141625, 232131, 150315, -101181, -84949, 38357, 151122, 27217, 34096, -230377, 20293, 26679, -48758, 150744, -78827, 215059, -48667, 143868, 46267, -213667, -67534, -245586]
18196b45586R6922A07880K14718E6212a03985B91505f4479l22540H2908h604k74038
18185b82642a0498A5166i4635q8028d1289B31686c1863j72184k46548a91344P7479
18174a13865q6799M2054I3581d383j59958R937c8037I7543K35407e43114a41208
18162B1375J37232c0927j38563e3031G4700O1261p288b3568k53433c9365k20231
18151b59596I5293b91415P3445F772P9674a87799H4075F39J60691a69109C23919
18139A89809a50542g2406q3102b9393p9418H8957c3088o4421j32639C4099A0309
18127d9157B7008k666P116b78029C8985a28095J9594D8926a59746J8076b445E5652
18114c43092B65620b22137e7025l7304b1364B05476h0171L0266j16484A00581
$$ y = [-245586, -148664, 107880, 322598, 56212, -103985, 291505, -64479, -387019, 82908, -8604, -282642, -10498, 15166, -94635, -182663, -41289, 231686, -31863, -204047, -450595, -191344, -113865, -200664, -158610, 93581, -4383, -164341, -154404, -38037, 97543, 332950, -543114, -141208, 21375, 158607, -30927, -169490, -53031, 74700, 135961, 128673, -23568, -277001, -39365, -259596, 95293, -291415, -217970, 6772, 86446, -187799, 84075, 639, 161330, -169109, 323919, 189809, -150542, -72406, -155508, -29393, -108811, 88957, -33088, -97509, -230148, 34099, 10309, -49157, 27008, 24342, 31458, -278029, 38985, -128095, -108501, 48926, -159746, -141670, -2445, 55652, -343092, 265620, -222137, -57025, -94329, -21364, 205476, -80171, -49905, -166389, 100581]
18103a54264f9653A08207f694C91096f1861j52656l2682J01811B03802M765b53788
18091H0915a50302c6658E0860f8289l4912B09439d07327J9863J93431A771J4063
18080A5834a51532j17487a01912a1262l14979J62735d8475H6204l3317P9724h9098
18068A60362d20841A84133D9303G418P0306n931g1406j78426l5291G7788e4918
18056D4094Q922a39139a6813A93294a16148A53048N0487a48389k09711c7950m4019
18045h1969A40705c1556l35184A63449o2286i8855A49887D8470N8479a80713n4800
18034b35513i488r9848j18567J01406C9001K47649F7709b48986f4540r7894A44300
18022c44980J60108f8199k67222a51450l6811o3533A52319L5699a71887P4714
$$ y = [-154264, -69653, 108207, -6694, 391096, -61861, -214517, -247199, -145388, 203802, 208567, -253788, 80915, -150302, -36658, 50860, -68289, -103201, 209439, -407327, -387464, -194033, 1771, 15834, -151532, -269019, -101912, -11262, -326241, -163506, -48475, 86204, 52887, 132611, -89098, 160362, -420841, 184133, 49303, 7418, 77724, 71793, -71406, -249832, -285123, 77788, -54918, 44094, 53016, -139139, -16813, 193294, -116148, 153048, 203535, -148389, -358100, -37950, -81969, 140705, -31556, -366740, 163449, 101163, -98855, 149887, 48470, 106949, -180713, -235513, -9488, -109336, -227903, -126497, 39001, 286650, 67709, -248986, -64540, -162434, 144300, -344980, -184872, -68199, -335421, -151450, -188261, -251794, 152319, 188018, -171887, -97173]
18012i7173j43503m6408a02827A41426h8088j86142M0271B5484a34507j06006
18002b40513c2743B31274g5367B51284B1723b48248R2639A94420Q6033a69979
17991e9277j9838m139A91397p283a17808A26300j4136g0409E1322a3598k16299
17980b29897r4740a54999B08768q7943M3976f4931A51362b2503A43691h378j94403
17969b02781A04743h8239B57979j11683b9830J2192b24C59b55613E2043N7736
17958A09779f3918m8341j3798d3393C01235c63066A44548d1066A12927O1748G8790
17946G769L71785i1013j1504A0956c97369A27439c8966e612k5307D3546b3603
17934B4681i2495E0736D579a91398A34787A7510c1876m0083k7129C0670J70709
$$ y = [-97173, -240676, -287084, -102827, 141426, -88088, -274230, -233959, 25484, -134507, -240513, -32743, 231274, -75367, 251284, 21723, -248248, -155609, 194420, 280453, -169979, -59277, -79115, -83254, 191397, 184114, -117808, 126300, 112164, -70409, 51322, -13598, -229897, -324637, -154999, 208768, 120825, 164801, -64931, 151362, -22503, 143691, -8378, -202781, 104743, -88239, 257979, 146296, -29830, -17638, -224, 359, -255613, 52043, 109779, -63918, -112259, -126057, -43393, 301235, -363066, 144548, -41066, 112927, 174675, 78790, 7769, 379554, -91013, -102517, 10956, -397369, 127439, -38966, -5612, -30919, 43546, -23603, 24681, -92495, 50736, 4579, -191398, 134787, 17510, -31876, -71959, -99088, 30670, 201379]
17923B01379G6255B5484J595R0478k2856g1379j75314B79743A10315K743a31547
17911A31595F3587b25896F085A78a57495I6674j9836e1427i663H7325a85536g9068
17898a12498A05538m1751J63969q6170a14362a0805A62780K14978b70387P5634
17888a94753k8714b5416k72476A28517i3065j80064b2360n8670n9228A99276E3333
17876h6683D5533N5801l3038c582o3092Q799p3859A46861L892b20013k31398J17603
17864c33808I5096J03913a64687a9433p449j19292C6485d67141B4337c24816c7132
17852b93317A5267b13449h7757I7043H877a74653c8144A3144P343e1849j49580
17841b01429A55463a84401K1328D4079K71993D9673L1559K22795A2558O8070c62264
$$ y = [201379, 76255, 25484, 27079, 117557, 94701, -71379, -246693, 279743, 110315, 113058, -131547, 131595, 63587, -225896, 6085, 178, -157495, 96674, 76838, -51427, -9663, 87325, -185536, -79068, -112498, 105538, 63787, 227756, 141586, -114362, -10805, 162780, 377758, -270387, -194753, -223467, -25416, -297892, 128517, -93065, -273129, -22360, -81030, -140258, 199276, 53333, -86683, 45533, 101334, 68296, -3582, -66674, -57875, -131734, 146861, 150753, -220013, -451411, -333808, 95096, 199009, -164687, -19433, -26882, -146174, 36485, -467141, 24337, -324816, -37132, -293317, 15267, -213449, -87757, 97043, 8877, -174653, -38144, 13144, 20487, -51849, -201429, 155463, -184401, -163073, 44079, 316072, 49673, 81232, 304027, 12558, 80628, -362264]
17829a10319j99548A67749a62298C77853o3310e3705j06808c6204A97045a36669
17818b06523E1776a88715Q5420A65903N701P4845a59190K7725F7273N6344A3956
17806B61728j5572L527b4336B25845f2721A48457a19507C7244b70642b3285r6481
17795a19766d60H7421C5220b36597g2940A31480e9932B33593F874J24698b15308
17783A4986e5094M525k14771I1824m4308q348c19693a33698o1431L7242K377B23918
17770I945P0733a23317N8569j21600e6103A37769E3210C176R1273e6181A53685
17758a20547G471a4321C5551a19484B07984b00643g7888A53568b3810q9362d0744
17746a38588l2274B44138a65629k9793h2634j52554P7870I0113D3120J79953G1439
$$ y = [-110319, -309867, 167749, -162298, 377853, 314543, -53705, -160513, -36204, 197045, -136669, -206523, 51776, -188715, -103295, 165903, 171604, 246449, -159190, -131465, 67273, 123617, 13956, 261728, 246156, 249683, -24336, 225845, -62721, 148457, -119507, 37244, -270642, -23285, -119766, -460, 87421, 35220, -236597, -72940, 131480, -59932, 233593, 6874, 131572, -215308, 14986, -55094, -50569, -265340, 91824, 47516, 39168, -319693, -133698, -195129, -157887, -155510, 223918, 9945, 80678, -123317, -64748, -186348, -56103, 137769, 53210, 3176, 94449, -56181, 153685, -120547, 7471, -14321, 35551, -119484, 207984, -200643, -77888, 153568, -23810, -113172, -40744, -138588, -170862, 244138, -165629, -195422, -82634, -235188, -157318, 90113, 43120, 223073, 71439]
17734A84872b8493B50021m5047E80O6375b3098A14880I180L20193b76399G2679
17722b7144A31995J19068a24032F399N7887H1a06814D0366a3899A65790n6239
17711A09551R3918a52038O9435A19315b81779A87382G4839L3255l2546a93315
17700H7190b42748C49946C1414c4863I3256K21558a69144J7879B0484J9348c242
17688A38122H99K2897Q5488a33212A53531L7773n1200e4857A7908i2145B58775
17676a923E4430P833f1747A33040c08974L1407e7661C21966A53494N0153m7350
17665A56297l2693K53751r6560E6487J49139a9872A86748h8684C58443G1928J46771
17654B18699a19131q3029C628K11856I1880k3073J69539J94366G5508b4441k64555
$$ y = [184872, -28493, 250021, 204974, 580, 66955, -23098, 114880, 9180, 329373, -276399, 72679, -27144, 131995, 251063, -124032, 6399, 64286, 81, -106814, 40366, -13899, 165790, 109551, 203469, -152038, -82603, 119315, -281779, 187382, 74839, 108094, 75548, -193315, 87190, -242748, 349946, 31414, -34863, 93256, 314814, -169144, -151265, 20484, 39832, -3242, 138122, 899, 23796, 109284, -133212, 153531, 191304, 140104, -54857, 17908, -92145, 258775, -1923, 54430, 62263, -61747, 133040, -308974, -277567, -57661, 321966, 153494, 203647, 156297, 123604, 377355, 280795, 56487, 205626, -19872, 186748, -88684, 358443, 71928, 218699, -119131, -202160, 3628, 215484, 91880, 68807, 238346, 432712, 75508, -24441, -288996]
17643b88996L3977P6870D15443e8525l11026A105J24196d9954j99375g809C2449
17631B3626c54539a51184A01615h0444m76513b15693A35005P0208q2584C5620
17620A38601h6710F0527N7206l2591a19099I8325J10356C4117J5413a20987B20301
17608h0778d762B73494n8986a72211O6664j54933A12004k5464E996J27686c83165
17596g2855C2074e8467m8658c414C86921A34079K38600R6060C0449i6157j31636
17585b27793A94899a68531g7086C056c9215I0559K03572A00334R2540m0363j3853
17574A38658a6061A88181F0104J13691K40765G9777a4117r7200A51695J43980
17564B95675F7201B7074P7665M1196c17830B44530b6616j22254E0677c2776A97629
$$ y = [-288996, -255019, -178149, 415443, -58525, -369551, 1105, 125301, -49954, -249329, -7809, 32449, 23626, -354539, -151184, 101615, -80444, -556957, -215693, 135005, 205213, 122629, 35620, 138601, -86710, 60527, 117733, 85142, -119099, 98325, 208681, 34117, 49530, -120987, 220301, -80778, -4762, 273494, 214508, -172211, -105547, -260480, 112004, 86540, 5996, 133682, -383165, -72855, 32074, -58467, -107125, -3414, 386921, 134079, 372679, 468739, 30449, -96157, -227793, 194899, -168531, -77086, 3056, -39215, 90559, 294131, 100334, 192874, 152511, 138658, -16061, 188181, 60104, 173795, 414560, 79777, -14117, -111317, 151695, 295675, 67201, 27074, 104739, 145935, -317830, 244530, -26616, -148870, 50677, -32776, 197629]
17552B5792L26780c8840B08766o5901C31b53581A01645N5686a64407j74762M5581
17541b93588A85904q9354J35400M3900l4689M4291c82482b3869o6613B29604b56897
17529d01822J98557a7687j03647A89256b78351A67325o7059O4139o6002j1956
17519H6447R5734r262q4390a10784a5942j7844A75721B8807K98020j29065a84285
17507B56348J87039j08260A58271p7157J4553k2699K19873C6499J75946p4994
17497A37451K20881d659H8044A0808b44198B86634P4399B8614J72301K61576i9782
17485A83177k4181M24085B8658Q5629N216a965q024B26573a68658B32338g7080
17473A34457J92538H9845J13576F2701R6866D1052M1920d1872I6816e1308A62626
$$ y = [25792, 352572, -38840, 208766, 142865, 331, -253581, 101645, 157331, -164407, -339169, -293588, 185904, 96550, 231950, 275850, 241161, 285452, -382482, -23869, -90482, 229604, -256897, -401822, -203265, -17687, -121334, 189256, -278351, 167325, 100266, 164405, 98403, 86447, 182181, 172919, 88529, -110784, -15942, -33786, 175721, 28807, 326827, 197762, -184285, 256348, 443387, 335127, 158271, 81114, 95667, 72968, 292841, 36499, 212445, 137451, 358332, -4659, 88044, 10808, -244198, 286634, 361033, 28614, 200915, 462491, -99782, 183177, 158996, 583081, 28658, 114287, 119503, -1965, -9989, 226573, -168658, 232338, -77080, 134457, 326995, 89845, 203421, 62701, 159567, 41052, 82972, -41872, 96816, -51308, 162626]
17461C0548h0092C71832a15420D16623p6934j53808J83890A49127J57258J81757
17451D88142A06860L41146j99993R1462L73654j54477Q148k79537k643p3527Q9298
17440C00391J01562A87396K0839J45921A01492L70643k31498p7783K30952m8509
17430C45297j21912k7453M78650k43618J06161B57028o2115J04940j49090B2939
17419A54016Q3184L1616L9339K08068j36211j4180j09987J16245r1261j06667
17409A74162D0613K80359r9832D0745K26424f1747C1053a71995F8949N3944C3359
17397h3693A02509J177K14779A44306J19610E8861K40177q1396E1537K69156I2709
17385b03811A71493K54030o6600a1096k9032E1067K18545r1736d3002A63003A9416
$$ y = [30548, -80092, 371832, -115420, 416623, 339689, 185881, 369771, 149127, 306385, 488142, 106860, 448006, 248013, 339475, 713129, 558652, 566800, 287263, 284620, 211093, 300391, 401953, 187396, 208235, 354156, 101492, 472135, 240637, 162854, 393806, 345297, 223385, 195932, 674582, 430964, 537125, 257028, 194913, 299853, 150763, 22939, 154016, 237200, 268816, 308155, 516223, 380012, 365832, 255845, 372090, 280829, 174162, 40613, 320972, 221140, 40745, 267169, -61747, 31053, -171995, 68949, 122893, 33359, -83693, 102509, 103686, 318465, 144306, 263916, 58861, 299038, 217642, 51537, 320693, 92709, -203811, 171493, 425523, 358923, -11096, -40128, 51067, 269612, 177876, -43002, 163003, 19416]
17373A03081O9479q1175k3330R6261f6447o1075C19704A28142j3042N3044E6554
17361d6329D1727e1466q4880c468r2134H1667J27367J45938K1487j69531P5127
17350B82055n9208g5146a3320B05231a958A43197M24614a43828A46952f7244A23938
17338d5127A89907b71340I3245O0260J2149C4172K10329a18675A65961l0293J63501
17327B99169A07387J9830N5340K3459r0896J23778k3464j1729n0571e8136B47018
17315E23805k27125b73482C51011E5956N0446K77789M0874c35398e8482A62329
17304D4116K19919A00219M33331A74951Q0430J19109k9366A262N6354K23671j19165
17293A62122Q3119I2820B0301b1608C51772F5403j1413K55657E0817J33308o0019
$$ y = [103081, 172560, 91385, 68055, 164316, -66447, -127522, 319704, 128142, 115100, 168144, 56554, -46329, 41727, -51466, -136346, -3468, -95602, 81667, 209034, 354972, 376459, 206928, 282055, 222847, -75146, -13320, 205231, -1958, 143197, 567811, -143828, 146952, -67244, 123938, -45127, 189907, -271340, 93245, 153505, 165654, 34172, 244501, -118675, 165961, 135668, 299169, 107387, 127217, 182557, 206016, 115120, 238898, 215434, 203705, 153134, -58136, 247018, 523805, 296680, -273482, 351011, 55956, 106402, 384191, 425065, -335398, -58482, 162329, 44116, 264035, 100219, 533550, 174951, 255381, 374490, 345124, 1262, 57616, 281287, 162122, 245241, 92820, 20301, -21608, 351772, 65403, 53990, 309647, 50817, 184125, 124106]
17282A24106P4581k0579C0133L21575g0501A00369K34266f207A86058f2814Q234
17271e4580C1571b0670D2073M6652L2932K172P7387L2675K30913C6650J10286
17260A46936l0130K24170M118Q9710r4290A50419a61419B20266k8549a53943E12056
17248A70542Q7188n9627H382f4016B89475M3438j63219A7774J26214C7372A6801
17236B73584O5886A45397K81431d5545B16848J35034j42397K73970A20673J73900
17226B94573o2679d0455a8836B55317J4396l0912O9818B5761a1379j96504C817
17214a98297A74195K12201j43075J44090j54042J26149c7795C48828E5665K71775
17204C27440n8930A00383J91107K0522D9451c4190E86218B91466I6320J54742
$$ y = [124106, 198687, 178108, 30133, 351708, -70501, 100369, 334635, -6207, 186058, -62814, -54580, 31571, -20670, 42073, 88725, 121657, 123829, 201216, 233891, 464804, 36650, 146936, 116806, 340976, 345094, 434804, 340514, 150419, -161419, 220266, 191717, -153943, 512056, 170542, 257730, 198103, 8382, -64016, 289475, 332913, 169694, 17774, 143988, 37372, 16801, 273584, 339470, 145397, 426828, -45545, 216848, 351882, 209485, 483455, 120673, 294573, 231894, -40455, -18836, 255317, 269713, 238801, 308619, 25761, -11379, -207883, 3817, -198297, 174195, 386396, 243321, 387411, 233369, 359518, -37795, 348828, 55665, 327440, 268510, 100383, 291490, 312012, 49451, -34190, 586218, 291466, 96320, 251062]
17194B51062E3765e126C24008A37710o1043J48377B909L02577A50082F3324J3104
17183G6428M02516B27858l7098a58933C56336R5762N8563B16656M8273b5259A36865
17171B33307j2680J56444A78188F1611K61368p3813R4428j38157K96941A03636
17160A19696D365R3382K25253I882K58627q46p4036k7550J41160L04714B11768
17148C08360L48035C16755l6563J55126q6329A41923F3803Q1693L11610j92966
17138B64140O4205D3011K34988D8132J33563J89597J14273j77302J08243A84066
17127A19758L12237A00930O10599k75952A33839M37995k43881R0474m8109A61610
17116A8785M54833j37752L5601O6480Q0091k56116J04961J75638I2424L84811
$$ y = [251062, 53765, -5126, 324008, 137710, 76667, 225044, 2909, 305486, 150082, 63324, 76428, 478944, 227858, 190760, -158933, 356336, 452098, 510661, 216656, 264929, -25259, 136865, 233307, 220627, 377071, 178188, 61611, 322979, 249166, 343594, 205437, 502378, 103636, 119696, 4365, 97747, 323000, 9882, 268509, 267663, 193627, 166077, 307237, 611951, 211768, 308360, 656395, 316755, 280192, 435318, 348989, 141923, 63803, 145496, 457106, 264140, 328345, 43011, 277999, 48132, 181695, 371292, 485565, 308263, 416506, 184066, 119758, 431995, 100930, 711529, 435577, 133839, 571834, 327953, 418427, 370318, 161610, 18785, 473618, 335866, 371467, 437947, 518038, 261922, 366883, 542521, 92424, 477235]
17106D77235j55645m7111m5776L5925L08215A68263K55851A01653K00995K01572
17096E04220j4946n338j65177A34889L78958j44894J64330E0728M06944k18640
17086B39032J76795J74840B35321K31959A79722L01177j29923Q9583j89273J55004
17076D06290K8213J15930j54520k424J36938j21588j8610J80298P9008j50817
17066D98718m2642j27434J89474m4134A49773R2918J70300j76875r5583O7307
17056B07840N30179B88095J76637K11402j51295B3276N42826k32374K15604O4789
17046F14121B84649K60773J2478q9485j36485K5178J55894B55386K95281K69232
17036H19899j30860J86689m21667K93408k8041K6591j35966K25681l95840J31430
$$ y = [477235, 321590, 274479, 228703, 264628, 572843, 168263, 424114, 101653, 302648, 504220, 489274, 483936, 318759, 134889, 513847, 368953, 533283, 50728, 457672, 239032, 415827, 590667, 235321, 467280, 179722, 480899, 350976, 440559, 251286, 406290, 434503, 550433, 395913, 393489, 530427, 408839, 390229, 570527, 649535, 498718, 456076, 328642, 518116, 473982, 149773, 242691, 412991, 236116, 140533, 207840, 738019, 288095, 464732, 676134, 524839, 23276, 566102, 333728, 549332, 614121, 284649, 545422, 557900, 468415, 331930, 357108, 513002, 255386, 550667, 819899, 689039, 875728, 454061, 747469, 719428, 746019, 610053, 835734, 439894, 571324]
17026E71324j28252J82880k64707K61161L31324l66647L3197m2596M6542L19482
17016I43708k72270K00753j35313J40333l13855L51406j1720j69206j14715o6832
17006E52289M19120k68101p3414K59805k84379N20086k96124l20324q315J67170
16996F67813o7570q8304M64137l62029K9457L55264m97146M71119k71390m3207
16986F58144O2597k8230K5936J76885l79076j83609M43423j03802L13016k4198
16976I61086j71821k0347J59281l4724j9268K4314K34848r0922J10832k03108
16966I50171K817j19675J09416j30873J95569j00096J7824o7280J60674K31080
16956A249627m30374K12499k13674K74188M9173m0350j60999K78861n2957Q7527
$$ y = [571324, 443072, 625952, 361245, 622406, 953730, 587083, 620280, 577684, 624226, 943708, 671438, 872191, 736878, 877211, 563356, 914762, 903042, 733836, 619121, 552289, 971409, 703308, 629894, 889699, 605320, 1125406, 829282, 508958, 500643, 667813, 600243, 511939, 976076, 614047, 643504, 998768, 501622, 972741, 701351, 658144, 720741, 692511, 718447, 895332, 516256, 332647, 776070, 672268, 985284, 961086, 789265, 768918, 928199, 893475, 874207, 898521, 1133369, 1042447, 1153279, 950171, 952988, 833313, 942729, 811856, 1007425, 907329, 925153, 857873, 1018547, 1249627, 819253, 1031752, 818078, 1092266, 1141439, 1101089, 940090, 1218951, 1165994, 1253521]
16946A253521j77811K5841K63687J01768n46496J95833P0354L69597n81283N69766
16936A544777n53890J38656j90692L44816L8046l68410M25558R6280l32605k6093
16926A116443k55015M64812k4938n9297J01154m8147o3454J57079k64048K54572
16916A379161j51690k25665M19307o3124J1284k8115M20716j21493j66209M2999
16906A517171K98747k63852K67096l03754L48266k59767k32911K19791L31296
16897A922083m54029J99966K45797j53367M61119k89097k6309k48540K66071n9916
16887A863778j63055K43566j88469L89990j6217k16763J50704J18253l9436q5379
16877B056972L22270m80631K83614O9199L6492K20195J98533n17112J85433R9559
$$ y = [1253521, 1075710, 1101551, 1365238, 1467006, 920510, 1116343, 1186697, 1556294, 975011, 1544777, 990887, 1129543, 938851, 1283667, 1321713, 953303, 1378861, 1475141, 1142536, 1116443, 861428, 1326240, 1301302, 1242005, 1343159, 1295012, 1231558, 1388637, 1124589, 1379161, 1227471, 1001806, 1421113, 1357989, 1369273, 1341158, 1761874, 1640381, 1474172, 1517171, 1815918, 1552066, 1819162, 1515408, 1863674, 1603907, 1370996, 1590787, 1922083, 1468054, 1668020, 1913817, 1760450, 2221569, 1932472, 1906163, 1657623, 1923694, 1863778, 1700723, 1944289, 1755820, 2145810, 2129593, 1912830, 2063534, 2181787, 2142351, 2056972, 2379242, 1898611, 2182225, 2251424, 2287916, 2508111, 2706644, 2189532, 2374965, 2474524]
16867B474524Q9323j02353O6334j44818K59128m7307K59816J07977n1657n6961
16857B854006l12880J61486J78745J04216N6198J02816J4863o2201k1035J24107
16847C200321J50254j49263J98684j27142M14659r432L21302k03661l02936K74779
16837C767565Q6532K93644j42973K06133J36051J67598n01758M76643Q2365k09138
16827D362662o622K98224L6557K38039K4784N5228K81814l17717N65957k98036
16817E240890M37738m8806N2345K63030j954K90125L44140j57832L2166L12763
16807F764605J47556M86737l16821N94213l62463L88052J88793K28253J0402K18752
16797H348079K1613N28556K71912Q1307j57035L24772M80378K92978L40304J13893
$$ y = [2474524, 2563847, 2461494, 2527828, 2383010, 2642138, 2594831, 2854647, 2962624, 2910967, 2854006, 2541126, 2702612, 2881357, 2985573, 3041771, 3144587, 3159450, 3097249, 3076214, 3200321, 3350575, 3201312, 3399996, 3272854, 3687513, 3678081, 3999383, 3795722, 3492786, 3767565, 3854097, 4147741, 4004768, 4210901, 4346952, 4514550, 4012792, 4489435, 4571800, 4362662, 4356040, 4654264, 4690821, 4928860, 4953644, 5008872, 5290686, 4972969, 5538926, 5240890, 5678628, 5629822, 5682167, 5945197, 5943243, 6233368, 6577508, 6419676, 6451842, 6764605, 6912161, 7398898, 7082077, 7676290, 7313827, 7701879, 7890672, 8118925, 8129327, 8348079, 8369692, 8898248, 9170160, 9251467, 9094432, 9419204, 9899582, 10192560, 10532864, 10646757]
16787A0646757O61063K26920K20404J99236N38391L00351M42514L51986K61731
16778A3849353N21657J65251Q55171K62086M68521P82198P21050O17746L47040
16769A8590073N61285Q68893N77705R23037J024740K04375J482601J130691P31323
16760B6094723J156129J142885J382110J254678J264790J452995J632909J926034
16752C7307253J850326J915268J850908K347856K120975K295585K926302K859418
16744E5473891L153413L193297L296726L958113L939159M371885M366647N245487
16736H6998618N256537N630722N487643N979562O459528O515972O532616P012822
16728A35874020O755623O588426O550405O007482N264183N012644L933323K535187
$$ y = [10646757, 11307820, 11534740, 11755144, 11954380, 12492771, 12793122, 13235636, 13587622, 13849353, 14371010, 14536261, 15391432, 15653518, 16122039, 16904237, 17625287, 18243033, 18590073, 19151358, 20020251, 20597956, 21520993, 22545733, 22750108, 24232709, 25363400, 26094723, 27250852, 28393737, 29775847, 31030525, 32295315, 33748310, 35381219, 37307253, 39157579, 41072847, 42923755, 45271611, 47392586, 49688171, 52614473, 55473891, 58627304, 61820601, 65117327, 69075440, 73014599, 77386484, 81753131, 86998618, 92255155, 97885877, 103373520, 109353082, 115812610, 122328582, 128861198, 135874020, 142629643, 149218069, 155768474, 161775956, 167040139, 172052783, 175986106, 178521293]
16720A78521293J963690N37177k53589j764461k262887l948553m207794n479099
16712A63105777n765490o067782o767100o910171o681016o944848o501967o736472
16704A10730931o179725n949102n629794n246348m857548n323454m038730m596215
16696F8910015l623748l801898l341824l096255k814132k859314k181564k433751
16688D4757529k032481k346727j828787j917056j777822j661303r71939j473186
16680C0748228j561144j246095j152031j146843j008888j031217r30332n75645
16672B2096033j339158m48331j093683m95546q13300p40513n86456n24109n24124
16663A5530813m25113k16109n23414q31827m72145m08459k36510m66590k21865
$$ y = [178521293, 180484983, 181022160, 180768571, 179004110, 176741223, 172792670, 168584876, 163105777, 157340287, 151272505, 144505405, 137595234, 130914218, 123969370, 117467403, 110730931, 104551206, 98602104, 92972310, 87725962, 82868414, 77544960, 73506230, 68910015, 65286267, 61484369, 58142545, 55046290, 52232158, 49372844, 47191280, 44757529, 42725048, 40378321, 38549534, 36632478, 34854656, 33193353, 32221414, 30748228, 29187084, 27940989, 26788958, 25642115, 24633227, 23602010, 22671678, 22096033, 20756875, 20308544, 19214861, 18719315, 17906015, 17165502, 16579046, 16054937, 15530813, 15105700, 14889591, 14366177, 13534350, 13062205, 12653746, 12417236, 11950646, 11728781]
16654A1728781l56953j83900k73329n49176l2609l77292j06158o54723p7206l67792
16644H749643j74021k57815l75434Q537k96069j77695j47505j85355k74997O4988
16634F934277j87575j85236k46145l94811J63113k81700r7648Q8843o7871l83261
16624E341986J26929k55073q6501k19664N4284j14732l24618J07005P2063l37875
16614D363804J09617m46232J63255k7624K2517o196l78111m4858M160P3846l03396
16603C530782Q5307K49952j90888l90102O7538k89373L16838m22589R8176k15887
16593B839754j16804J80417J53437k50267l81738N74879q8160l16435o1937j7972
16583B515174L61201l39054j83678K98924l8559m31937O0437J75998j41748J51864
$$ y = [11728781, 11371828, 11187928, 10914599, 10365423, 10332814, 9955522, 9849364, 9194641, 9117435, 8749643, 8575622, 8317807, 7942373, 7950910, 7654841, 7477146, 7329641, 7144286, 6869289, 6934277, 6746702, 6561466, 6315321, 5920510, 6083623, 5801923, 5704275, 5793118, 5725247, 5341986, 5468915, 5213842, 5127341, 4907677, 4961961, 4847229, 4522611, 4629616, 4701679, 4363804, 4473421, 4027189, 4190444, 4162820, 4185337, 4179141, 3801030, 3756172, 3760332, 3834178, 3530782, 3616089, 3866041, 3675153, 3285051, 3352589, 3063216, 3380054, 2957465, 3055641, 2839754, 2722950, 2903367, 3056804, 2806537, 2424799, 2999678, 2911518, 2595083, 2533146, 2515174, 2876375, 2537321, 2353643, 2652567, 2614008, 2182071, 2242508, 2418506, 2276758, 2428622]
16573B428622j50855m31717J39622k06849M27397q6914n2744P2354k15878K87652
16563B210690j08905m28467O0218J75851p3827n394N756j96261K21759j16630
16553A744790J8636q0706k80363J65545j78935O03015o4871m65778K49507j88420
16543A522420l33995M91041n20761M0263K64573r9995j8630q2262K73842j36378
16533A400118J20527m23453M37865m00582o175j9538O5185p5989K0383J65042
16523A283383o5211K40679o01413J25055K31138l49957L92985q2762n4482L61060
16513A480475l97490l14724N15261k89409L6997p288K59068k87412k43683K97501
16503A049296k61471L30176k66417J39978Q354j49002j25430k32544N02206k19433
$$ y = [2428622, 2277767, 1846050, 1985672, 1778823, 2206220, 2119306, 2066562, 2138916, 1923038, 2210690, 2101785, 1673318, 1733536, 1909387, 1835560, 1830166, 1835922, 1639661, 1861420, 1744790, 1763426, 1682720, 1402357, 1567902, 1388967, 1991982, 1927111, 1461333, 1710840, 1522420, 1188425, 1679466, 1158705, 1198968, 1463541, 1363546, 1344916, 1262654, 1536496, 1400118, 1520645, 1097192, 1535057, 1134475, 1128300, 1108762, 1173947, 1097958, 1118341, 1283383, 1218172, 1458851, 857438, 982493, 1213631, 863674, 1256659, 1173897, 1119415, 1480475, 1082985, 768261, 1283522, 994113, 1031110, 1023822, 1282890, 995478, 751795, 1049296, 787825, 1118001, 851584, 991562, 999916, 850914, 725484, 492940, 995146, 775713]
16493G75713p1558J22476p1664P3969J31432K1770m42773M47322D67247O90716
16483A157963j50799m00543L00610r9736C42211L64083K4898J27529j54104n8941
16473F45676L9323N2063j87487K44175l58596R2407P6766O2678j6915O3132L0287
16462G43509q8362K23176k31423k9236j81066K06189C12991L63178L21166m18320
16452E79015n8014L58507l61682J41956o94r2438N9065L6945k77438O0428L76171
16441H21821q2563J93958m50058J24213J92554k99276K8928j6240j41073J57410
16431E29674M603k9618J0418m6294m8691A34506J01947K02612A38901K94832L1924
16420D65657J68422B78054L89547k18605j8429P5248j45551A72519L16191Q412
$$ y = [775713, 704155, 826631, 754967, 828936, 960368, 982138, 539365, 986687, 467247, 1157963, 1007164, 606621, 907231, 807495, 342211, 706294, 731192, 858721, 704617, 645676, 684999, 737062, 549575, 793750, 435154, 527561, 604327, 667005, 650090, 713222, 743509, 655147, 878323, 646900, 617664, 436598, 642787, 312991, 676169, 997335, 579015, 521001, 879508, 517826, 659782, 659088, 566650, 625715, 662660, 385222, 445650, 821821, 739258, 933216, 483158, 607371, 799925, 500649, 529577, 513337, 372264, 529674, 534277, 504659, 515077, 468783, 420092, 134506, 236453, 439065, 138901, 433733, 465657, 634079, 278054, 667601, 448996, 430567, 505815, 360264, 172519, 488710, 497122]
16410D97122B01649L67257j20923k4403j34119J2422A12419M41579A79029L57836
16400E36865j24146q9406J47313k04977O6219m383k6151J26062r1898J49506O6166
16389E51170A38045M37594C1192M35357p1061L384m5201o7388J65644j85338j29861
16378A36728K0860J03627A29946L05798B17157L38544b5339B19378B5152j1077
16368A4075L59380J49676k22720m2270j28694L1603l792o1461J46860C1347O42161
16357F73508l07476n8667J38688A87460Q1100M5534J3219K30723A4961J60726
16347A75687D3182K55915J13997q9537N8805J07615B26237L48054a5313B88512
16336D66857k24282l0329J53591j79775J84091L2152g2504C11155D8545K61356
$$ y = [497122, 201649, 568906, 447983, 423580, 289461, 301883, 112419, 553998, 179029, 536865, 412719, 323313, 470626, 265649, 331868, 327485, 301334, 427396, 335498, 485004, 551170, 138045, 575639, 31192, 466549, 395488, 398872, 353671, 286283, 451927, 266589, 136728, 157588, 261215, 129946, 435744, 217157, 555701, -25339, 219378, 25152, 14075, 373455, 523131, 300411, 258141, 129447, 161050, 157258, 95797, 242657, 31347, 673508, 366032, 307365, 446053, 187460, 268560, 314094, 327313, 558036, 14961, 175687, 43182, 299097, 413094, 323557, 382362, 489977, 226237, 574291, -15313, 288512, 466857, 242575, 212246, 365837, 186062, 370153, 402305, -72504, 311155, 48545, 309901]
16326C09901o5682a13635A80430G103K69551E3724M41084A96996R9913J05147
16316D02056K17073k04191j53755J44853g4593j5168a1900B08268k2961q7175
16306I8132R0374A6397J7938N67261B99665A12691c9551C14580n7394j08819J58125
16295C06492R5788A00300J49619a59535e2945B42351A00421a1557B39601n0938
16285A88663D7359K03414Q4226A61438n9341P6314J93629H7743K5590J76935b14193
16273B74785B501N7089a2324k6098A1713J40957K4833Q405b20755A58860c4828
16261G5051K76296a30401A71202k9633J71846I6758B7945O1981a5150l1694j03673
16250a50517C53550F4236c4839I5043D5712b67749q7237c7731A61239G3210K07542
$$ y = [309901, 244219, -113635, 180430, 7103, 276654, 53724, 494808, 196996, 296909, 402056, 619129, 414938, 261183, 406036, -74593, -89761, -11900, 208268, 185307, 98132, 188506, 16397, 34335, 601596, 299665, 112691, -39551, 314580, 257186, 148367, 306492, 402280, 100300, 249919, -159535, -52945, 242351, 100421, -11557, 239601, 188663, 47359, 250773, 334999, 161438, 102097, 178411, 372040, 87743, 113333, 290268, -214193, 274785, 2501, 59590, -12324, -38422, 11713, 152670, 177503, 185908, -220755, 158860, -34828, 75051, 351347, -130401, 171202, 141569, 313415, 96758, 27945, 89926, -15150, -46844, -150517, 353550, 64236, -34839, 95043, 45712, -267749, -354986, -37731, 161239, 73210, 280752]
16239B80752a10828b7647J3102A37903b3402A8064J15355J35588P2788r9571c3445
16227F4941J31624j2514J96553A62199o910L3441b6639j5982B69570A4028L07073
16216C21101j2157H1898K28121q1319N2829h4315A19297O8988b21104B136e4422
16204a62910B21247P7634A08265M1583a84706A17717h6992A04067r882a32324
16193B51438L92479C7895L10988q7214e5350E7460e0893F157d9844k07493f8914
16181A28801J34005a6295A53843A7269J00507a0750r8852A4535K00217I4608j1160
16170H3448b8735H2907a81739A7898g2869B37586D6355a76058C3254f4910C52900
16158H1214J1979J23915G9288J07982A7758O4555K08863C9652J20471f840p3741
$$ y = [280752, -110828, -27647, -14545, 137903, -23402, 18064, 133419, 269007, 341795, 242224, -33445, 64941, 196565, 184051, 380604, 162199, 155289, 188730, -26639, -42621, 269570, 14028, 321101, 308944, 81898, 310019, 228700, 281529, -84315, 119297, 188285, -221104, 2136, -54422, -162910, 221247, 298881, 108265, 149848, -184706, 117717, -86992, 104067, 94185, -132324, 251438, 643917, 37895, 348883, 261669, -55350, 57460, -50893, 6157, -49844, -257337, -68914, 128801, 262806, -16295, 153843, 17269, 117776, -10750, -109602, 14535, 214752, 94608, 83448, -28735, 82907, -181739, 17898, -72869, 237586, 46355, -176058, 33254, -64910, 352900, 81214, 93193, 217108, 79288, 187270, 17758, 82313, 291176, 39652, 160123, -6840, -80581]
16147h0581B52091H6125l2782J0742J79933B2523j0008f4330a7245A64287o8674
16136I5613L1538B9818c21586Q8688G9912c09024J46220g1673a3316B08713b21410
16124C4179a28609A09026C8659c6164B323a09817J2624C3039N945P867Q6316n5089
16112G8078a92185A35974o5063K32462b4426C1411G828N1906a90398K7356A84542
16100A32091m1566L2274a39227C39868B234K20700A9705K9044r039a30761E4536
16088A776c4009j62611d8548r7848A35824P2220r4459R9762A00278c63558h751
16076b5600A37194L51819k04603G7835a98463a1061j52232j69848f4120A55940
16065a14896A73513G8639A4001a18818d496A40765b50729E9305L2249j1874J29051
$$ y = [-80581, 252091, 86125, 53343, 64085, 244018, 22523, 12515, -64330, -17245, 164287, 95613, 127151, 29818, -321586, -232898, 79912, -309024, -162804, -71673, -13316, 208713, -221410, 34179, -128609, 109026, 38659, -36164, 2323, -109817, -97193, 33039, 38984, 46851, 133167, 78078, -192185, 135974, 70911, 303373, -24426, 31411, 7828, 59734, -190398, -163042, 184542, 132091, 90525, 122799, -139227, 339868, 2234, 222934, 19705, 48749, 39710, -130761, 54536, 1776, -34009, -196620, -48548, -146396, 135824, 208044, 113585, 213347, 100278, -363558, -8751, -25600, 137194, 489013, 284410, 77835, -198463, -11061, -163293, -333141, -64120, 155940, -114896, 173513, 78639, 14001, -118818, -4496, 140765, -250729, 59305, 91554, 79680, 208731]
16054B08731g1048E481g4898a4561A7134N1748J63045d7724A71697n5849l2696
16043H3152J6354d8906D9193a50922j20213A70964d04144B05963C6030A7141d9306
16031a39416r2395P8874A08024L6052b13928B54219A3993a34170L428j63657f1696
16019f8990o218A34909f598G3330k0136J0335k1606N7322a40840f855A01982a80753
16006G1651l0016A8915b26543a0345m04723I6508h468A11594j1879c5605M187
15995c1418r2443B83309i4519k71336F7569Q9439a04252J8187j04551Q7278B62035
15983a73341h0973j28478i2185j81324B11966J06263a54973d8116E2966F736d50750
15971h452k06837C47243b54936A37654A8694a61097A03347J01785b60131o5699
$$ y = [208731, -71048, 5481, -74898, -14561, 17134, 68882, 231927, -47724, 171697, 115848, 83152, 99506, -48906, 49193, -150922, -271135, 170964, -404144, 205963, 36030, 17141, -49306, -139416, -231811, -152937, 108024, 144076, -213928, 254219, 13993, -134170, -130742, -294399, -61696, -68990, -75208, 134909, -6598, 73330, 53194, 63529, 41923, 99245, -140840, -6855, 101982, -180753, 71651, 41635, 18915, -226543, -10345, -415068, 96508, -8468, 111594, 99715, -35605, -31418, -123861, 283309, -94519, -365855, 67569, 157008, -104252, -86065, -190616, -103338, 262035, -173341, -80973, -209451, -92185, -273509, 211966, 318229, -154973, -48116, 52966, 6736, -450750, -8452, -215289, 347243, -254936, 137654, 18694, -161097, 103347, 205132, -260131, -325830]
15961c25830c2859k02391A02571c06211a46141J1153J5828j8007j33637f0306
15950A63229b56768D10771c14020c3320A28929l8901J56542b6374R726A28076
15939A38228b8692C16004d0125k87978B05042D440N3127b70593A16204a60740
15928B62166l206b78022C66393H448J40579b43561h5441m54211b4664B63778k3733
15917B40045a81542f4627f834j54435E1387Q5853J03946a40492k02296a8582A41382
15905a30833c3039F6031c2447A2822b01017F8705B7758d7899C73662b93976I6809
15893c496A10134a49407B13788h8526e416q9597B4224M6714a31946d1845G4651
15881b0365C83017b00901C4695e8865j61170H7251K8767a428j69800r8520f5786
$$ y = [-325830, -32859, -235250, 102571, -306211, -146141, -134988, -119160, -137167, -270804, -60306, 163229, -256768, 410771, -314020, -33320, 128929, 90028, 246570, -26374, -16648, 128076, 138228, -28692, 316004, -40125, -328103, 205042, 4440, 57567, -270593, 116204, -160740, 262166, 258960, -278022, 366393, 8448, 149027, -243561, -85441, -539652, -24664, 263778, 240045, -181542, -64627, -6834, -161269, 51387, 137240, 241186, -140492, -342788, -18582, 141382, -130833, -33039, 66031, -32447, 12822, -201017, 68705, 27758, -47899, 373662, -293976, 96809, -3496, 110134, -149407, 213788, -88526, -5416, -95013, 24224, 70938, -131946, -41845, 74651, -20365, 383017, -200901, 34695, -58865, -220035, 87251, 116018, -1428, -171228, -269748, -65786]
15869A15317j1361j5904N3968F0687h2918j77970a3418A9931e6627A5942a93662
15857B1666N0440N1104O7221d2695j76841A60799a83630A10015K89463e6144B13554
15845a22378A39562a84037J0818f1653B19383h6538C88959b15910A94564R165
15835B03729a51965A3473J29962B5932L3876K30753h776E0707B3785K9543J52070
15824B05398J1030a6007A35731N1807a6045f065l72559C6667J08956d9939k01874
15813b51813G0253d4502j2181B33313E7031a22489A36702o2076g8808p2197A3017
15801d49103A76951b72916M5794I4414f5599B09749m4952A9389c06285B83870
15790A13644j5684J01242a54911j09511b7096H1394f8140j39429b6313H6347a7036
$$ y = [115317, 103956, 88052, 142020, 60687, -82918, -260888, -13418, 19931, -56627, 15942, -193662, 21666, 72106, 123210, 190431, -42695, -219536, 160799, -183630, 110015, 399478, -56144, 213554, -122378, 139562, -184037, -173219, -61653, 219383, -86538, 388959, -215910, 194564, 203729, -151965, 13473, 143435, 25932, 59808, 290561, -8776, 50707, 23785, 53328, 205398, 216428, -16007, 135731, 187538, -16045, -6065, -378624, 36667, 145623, -49939, -251813, 70253, -44502, -56683, 233313, 57031, -122489, 136702, 74626, -78808, -151005, 13017, -449103, 176951, -272916, -227122, 94414, -65599, 209749, 164797, 19389, -306285, 283870, 113644, 97960, 199202, -154911, -264422, -27096, 81394, -68140, -207569, -26313, 86347, -17036]
15778b58202G5735C5654I379d00221j17387B3869a14176B15295a94208D0855a73535
15766B60644a15517I1111d0152n9631B83O4191b90518b7511A65936c07328N520
15755c01808M0356a8303B9235K26216C3573N0948B1642K54023m8207b34915C13163
15743a21674C91890a69222h4187j13234d0502j4831k7237r0812j8484F0815i2242
15731a62539j16571C4730G937d2659i82q9168C3528a31961A46480b18626M3597
15720a75029h2141B65652a74657A16052b9203I9421f40904A0918J59166d8526
15709H6420l7139a00345M3171n2229B0693b61963A7003J23328b7998m2148m7193
15698a17339I473a65422B8109b29946b1131A36968K32832A61589a10707M2042
$$ y = [-258202, 75735, 35654, 9379, -400221, -517608, 23869, -114176, 215295, -194208, 40855, -173535, 260644, -115517, 91111, -40152, -99783, 283, 64474, -290518, -27511, 165936, -307328, -301808, -261452, -18303, 29235, 255451, 33573, 84521, 21642, 275665, 227458, -234915, 313163, -121674, 391890, -169222, -84187, -197421, -40502, -55333, -82570, -173382, -191866, 60815, -92242, -162539, -279110, 34730, 7937, -42659, -982, -90150, 33528, -131961, 146480, -218626, -175029, -82141, 265652, -174657, 116052, -29203, 99421, -640904, 10918, 170084, -48526, 86420, 49281, -100345, -57174, -109403, 20693, -261963, 17003, 140331, -27998, -70146, -117339, 9473, -165422, 28109, -229946, -21131, 136968, 369800, 161589, -110707, -68665]
15688f8665j14895B03868b46267A40025J00892n2643g9106B21886H0344a9236
15677A21732b87579A87315J7434a44446O0584A09429H553c50485b2625o4862j78766
15666b66253J3499g9633b3214B52409c08149d890F0558b11826C1408c60767B44943
15654a5353j22172n6166c6945G099J46505a08413K6797j37778a9128A99965a51438
15642A83199A0280J42948b21175c7867j45707A33351J18118c94994A8839b28321
15631A19930D9949h5981k18728A4452b97605A85757B1234c45180e2780A1454J41150
15620A52604l1074l0794L8711C8615a38420N8970k30404J48920i008C20414b01545
15608C9900a42537D5405J32193b52313A07801c8358B65887b36201e1968n6914
$$ y = [-68665, -183560, 203868, -246267, 140025, 240917, 188274, -79106, 221886, 80344, -19236, 121732, -287579, 187315, 204749, -144446, -83862, 109429, 8553, -350485, -22625, -87487, -266253, -252754, -79633, -23214, 252409, -308149, -4890, 60558, -211826, 31408, -360767, 244943, -15353, -137525, -193691, -36945, 7099, 153604, -108413, -81616, -219394, -19128, 199965, -151438, 183199, 10280, 153228, -221175, -37867, -183574, 133351, 251469, -394994, 18839, -228321, 119930, 49949, -85981, -304709, 14452, -297605, 185757, 21234, -345180, -52780, 11454, 152604, 121530, 90736, 129447, 38615, -138420, -79450, -309854, -160934, -9008, 320414, -201545, 39900, -142537, 45405, 177598, -252313, 107801, -38358, 265887, -236201, -51968, -108882]
15598a08882n4430j69481h2397l570K6622b2296j22111A5175Q7448a34177k65015
15587c99192I939b4734l2146A50241N2992G2926h2153j05683A78304g1436C45116
15575f0985A94396b39811a07043r5528A81538g8161G1427e68184E4972J40562
15565A95534b22355C9243N7846A2313K06454b16816E9963b82487d5058A42139
15554A20722j1398b00103J2269e9732G9339b03006A32153c22814J11612j09593
15544c20795B833c08929H7445K28149A17353b6165A03556P3170B4681a90910C33092
15532b25356l8545Q4343Q2915k0492k61129C47230A00086a57682a400r7324B36056
15520A67568J0510F6635k9596R5514L39406e0207l1936H1824J77848O5089h0472
$$ y = [-108882, -163312, -332793, -82397, -85967, -59345, -22296, -144407, 15175, 102623, -134177, -399192, 9939, -24734, -56880, 150241, 203233, 72926, -82153, -187836, 178304, -71436, 345116, -60985, 194396, -239811, -107043, -202571, 181538, -78161, 71427, -568184, 54972, 195534, -222355, 39243, 97089, 12313, 218767, -216816, 59963, -282487, -45058, 142139, 120722, 109324, -200103, -187834, -59732, 79339, -203006, 132153, -322814, -211202, -320795, 2833, -308929, 87445, 315594, 117353, -26165, 103556, 176726, 24681, -190910, 333092, -225356, -263901, -179558, -96643, -117135, -378264, 347230, 100086, -157682, -1400, -98724, 236056, 167568, 178078, 66635, 37039, 132553, 471959, -50207, -82143, 81824, 259672, 324761, -80472]
15508b37251J03346N3042A04095f0298b13A09110J73770g0535H2530c86938A72990
15496g5224N715K1462k6760A6133a24158j09177i2290o9814j95499J05651A22618
15484C2688a70822L5394A28206C4174b98207A94811C2394J1442h332A52548D2474
15472A24226N082o3776i3782A71939d5713k06925G2649O1231J24733p651f3074
15460B11833H9252R1388J30887M0073G2683K21357e654A52092J23765b44333c4234
15448b08584b1164n9301B72483a31183m4742l8982d3845l9054A1472J6663J6279
15437D4414b14376B57631L3105j30191b46786B60098J35745a76296g128p3556
15427h0684B08421b4030j2185p9649c5841C67343a4479n9246A53241J31434b10466
$$ y = [-237251, -133905, -80863, 104095, -60298, -213, 109110, 282880, -70535, 82530, -386938, 172990, -75224, -69509, -48047, -74807, 16133, -124158, -233335, -92290, -162104, -357603, -251952, 122618, 32688, -170822, -135428, 128206, 34174, -298207, 194811, 32394, 43836, -8332, 152548, 42474, 124226, 129308, 65532, -93782, 171939, -45713, -252638, 72649, 133880, 258613, 250962, -63074, 211833, 89252, 180640, 311527, 351600, 72683, 294040, -5654, 152092, 275857, -244333, -34234, -208584, -21164, -80465, 272483, -131183, -175925, -214907, -43845, -82899, 11472, 28135, 44414, -214376, 257631, 290736, 160545, -246786, 260098, 395843, -176296, -7128, -80684, 208421, -24030, -36215, -115864, -35841, 367343, -14479, -73725, 153241, 284675, -210466]
15415A34922g9486h001k09272j02326A57572F6869J73753a5071m526E2809f1486
15403b23053A7042J53140G7943a70684c1892k5059q652A648a96937A1907e6908
15391a91359G0994f9321j38139j04192f1603k81362e8747k28159j38767a80150
15380E2911e8179A13702O9523b08046A07769l7213b34750B54341c16322J38971
15370a77351P4185H3016O0049L2106g5130j32262C17137E4960b79066J32103B11599
15358i7235k4828B30041b29A07596P1123B1708a61743F94Q8826a83253I2505B4037
15345B99979F1801b44996a13459M3955j55673D1824R236J83868I5006K47440l5148
15334C07298j17251P6092a71592D2313b20597l8833D22570A643J89820n4452J15831
$$ y = [134922, -79486, -8001, -217273, -319599, 157572, 66869, 240622, -15071, -19597, 52809, -61486, -223053, 17042, 170182, 77943, -170684, -31892, -56951, -65603, 1648, -196937, 11907, -56908, -191359, 70994, -69321, -207460, -311652, -61603, -342965, -58747, -286906, -425673, -180150, 52911, -58179, 113702, 183225, -208046, 107769, 70556, -234750, 254341, -316322, -177351, -103166, 83016, 143065, 175171, -75130, -207392, 317137, 54960, -279066, -146963, 211599, -97235, -122063, 230041, -229, 107596, 178719, 21708, -161743, 694, 89520, -183253, 92505, 24037, 299979, 61801, -244996, -113459, -69504, -225177, 41824, 51060, 234928, 95006, 342446, 307298, 190047, 266139, -171592, 42313, -220597, -259430, 422570, 1643, 191463, 137011, 252842]
15323B52842F4866J4292K3217r820j5621J3688N7681d5363C70808D1039a73695
15311a13786A98973b20055A86529b19157C22880a31756B99384c03663J15323a4627
15300B3198M82846a92899O5918H9277j821P6043G7822a62314A18769B1528Q598
15289C0126i4A00598C5765P0158B4681b58085a4610D6346a79504G885P9460A7336
15276B39210J35486c3478A503h4492A62186D0658M9172P1895J04891b71945a3461
15264a16384M8497d673l00545A48638a38081a2496A42853j3286D1508J89935l346
15253B28097K9146m1689B6089L64097K82579P29247o0654m7428k40641E09710
15242A94573L465M8323q749H9915a6263p7601F6598f2401l0466A51466j1938o5208
$$ y = [252842, 64866, 79158, 102375, 92555, 76934, 90622, 148303, -45363, 370808, 41039, -173695, -113786, 198973, -220055, 186529, -219157, 322880, -131756, 299384, -303663, -188340, -14627, 23198, 506044, -192899, -126981, 89277, 87456, 163499, 77822, -162314, 118769, 21528, 30126, -94, 100598, 35765, 105923, 24681, -258085, -14610, 46346, -179504, 7885, 87345, 17336, 239210, 374696, -33478, 1503, -84492, 162186, 40658, 89830, 161725, 266616, -271945, -13461, -116384, -67887, -4673, -305218, 148638, -138081, -12496, 142853, 129567, 41508, 231443, 228097, 257243, 215554, 26089, 390186, 672765, 1402012, 1341358, 1293930, 1053289, 509710, 194573, 198038, 246361, 237612, 89915, -16263, -93864, 66598, -62401, -92867, 151466, 139528, 74320]
15230G4320a68649O4309C4086J30523C7382e8372C8329a5865j26821L9706d2973
15218f9853h887B42328M1519j07065L7041B8677R0530j1247b41703A64722q2133
15207H2589k93J94627i9318B81948A39321b09612A93009E9718g7030j32669A55030
15195c98238H2580Q9240H334L83774j94129b72585A34670K19804B2937K1082a16511
15183B31006K577a42429D0872L3350J71575C984b12199A02605a03025b8134F943
15171A7635i591B17672E9170a85798C2638f201F3790O3306J20177j0107n4721
15160A82445P3473B194a9589A75921M7348f9178A40058K55790J12604j48920A56438
15148A32051L39864e5310b7321E9073N3259A2833K26967h6455D7458A3008J17784
$$ y = [74320, -168649, -104340, 34086, 164609, 37382, -58372, 38329, -15865, -142686, -102980, -42973, -69853, -8887, 242328, 283847, 176782, 213823, 28677, 119207, 107960, -241703, 164722, 82589, 82296, 276923, -99318, 281948, 139321, -209612, 193009, 59718, -77030, -209699, 155030, -398238, 82580, 171820, 8334, 392108, 197979, -272585, 134670, 354474, 22937, 44019, -116511, 231006, 233583, -142429, 40872, 74222, 245797, 3984, -212199, 102605, -103025, -28134, 6943, 17635, -9591, 217672, 59170, -185798, 32638, -6201, 63790, 127096, 247273, 237166, 182445, 255918, 2194, -19589, 175921, 223269, -69178, 140058, 395848, 508452, 359532, 156438, 132051, 471915, -55310, -27321, 59073, 112332, 12833, 239800, -86455, 47458, 13008, 130792]
15137A30792E8793M3504P2804R0660f0364A34560D9937j2350K69243j21041p3005
15126A12784a73874K4974A4508K2515g7740B08090J26903A46954b0288A86762
15115A24969a17977E25023g5784k26117N920C38286d31182G6545h7464g43k53538
15104b54281A76814A8050N8060a35820j8472H8383a7945j87925j4798A3364J80647
15093A94011b09280C02293A10158J94569E8128J77963J19561F3321K6779R4480
15083A84580b28682B84446J60249f4768F9921H581M698J02621M3937K3120L06206
15072D89163I2330J87308p146J46718J9890A45675j735E9123L7607B5184K0029
15061D5213L29961c9806C97568A40043J43484l1746G8102M28966A09763o830M6879
$$ y = [130792, 58793, 102297, 175101, 265761, -60364, 134560, 49937, 37587, 306830, 185789, 112784, -173874, -148900, 14508, 37023, -77740, 208090, 334993, 146954, -20288, 186762, 124969, -117977, 525023, -75784, -301901, -295981, 338286, -431182, 76545, -87464, -743, -254281, 176814, 18050, 76110, -135820, -154292, 88383, -17945, -205870, -220668, 13364, 194011, -209280, 302293, 110158, 304727, 58128, 236091, 355652, 63321, 90100, 184580, -228682, 284446, 444695, -64768, 69921, 8581, 13279, 115900, 159837, 182957, 489163, 92330, 279638, 272492, 419210, 439100, 145675, 143940, 59123, 96730, 25184, 45213, 375174, -39806, 397568, 140043, 283527, 251781, 78102, 507068, 109763, 102933, 149812]
15050A49812l7825K4468b4468F5258g4162D23242b681B54180H1258e3574B4862
15038f512C61243K47577A25323J00341a50153A2750a19287C19292c0113D10551
15027g3471B9051L44412E5281K38468J7000j13046M3064f923C88415j0315D6096
15015A43982n6600J63423L8721Q5313R9j82099J18347O5448K7681A30756l9304
15004I1452r15l0453B1976P9215a6857A12373l8788K98209j8635J52132B3194
14992A4255J12962K71184A87508l4208J55678A34289O2829K02166b95799A16631
14981A31703J88796n2791C2775M65658A16700k676Q4446N0711P1083E1540L37395
14970C88935p5207L2144O3928A38225J56879j30469o7785K81817D4534J29983
$$ y = [149812, 111987, 136455, -24468, 65258, -74162, 423242, -2681, 254180, 81258, -53574, 24862, -6512, 361243, 608820, 125323, 225664, -150153, 12750, -119287, 319292, -30113, 410551, -73471, 29051, 373463, 55281, 293749, 310749, 197703, 240767, -6923, 388415, 378100, 46096, 143982, 87382, 250805, 289526, 374839, 374938, 192839, 311186, 376634, 404315, 130756, 91452, 90537, 60084, 21976, 101191, -16857, 112373, 73585, 371794, 353159, 505291, 23194, 14255, 127217, 398401, 187508, 153300, 308978, 134289, 197118, 399284, -295799, 116631, 131703, 320499, 267708, 32775, 498433, 116700, 114024, 198470, 249181, 320264, 51540, 388935, 313728, 345872, 409800, 138225, 295104, 164635, 96850, 378667, 44534, 174517]
14960A74517R5690K43482A78476P2761J72611j72456m6570j7716H3160J31789
14950B14949K00586j17979p0247L1293C3667K77185A6851K83341J76089L101A41997
14938E50603B73537b31129B78541K88675A08641K20882H7333B263K04649L37605
14928E44517j90543a502C27463q0471C7017M20750m3862K7035r6143n7382J76855
14917D64270A4454J92374P5734M7538K1977J25890E5973M47041b68404D73154
14906E84924m6739b46959C30741M6027J16547i1020D50076N2177a97976D7686
14895D39938F2997J13085h0290F41973A82591L25310A01547J70301k5413a4386
14884H4758O6163k6132M26724A39775L01010O2239j75302L5068k2867R1493A65148
$$ y = [174517, 270207, 513689, 178476, 251237, 423848, 251392, 204822, 187106, 83160, 214949, 415535, 297556, 227309, 258602, 33667, 310852, 16851, 300192, 476281, 479382, 141997, 550603, 273537, -231129, 278541, 567216, 108641, 329523, 87333, 2263, 206912, 544517, 353974, -1502, 327463, 246992, 37017, 457767, 413905, 440940, 344797, 287415, 464270, 14454, 206828, 282562, 330100, 352077, 477967, 55973, 503014, -268404, 473154, 584924, 538185, -246959, 330741, 376768, 493315, -91020, 450076, 502253, -197976, 47686, 439938, 62997, 176082, -80290, 641973, 182591, 507901, 101547, 271848, 246435, -14386, 84758, 150921, 124789, 551513, 139775, 440785, 503024, 327722, 362790, 339923, 431416, 165148]
14872B74799J22733n9753A56652M23847p7278j95659j00138m6600J37708O0695
14862C59227K1711J9736q9858K62375q233B45700J51332p1921M50656k64868A07301
14850E37331A80159J93490j75010K65922j72258K82765A61681K56389q9097J44916
14840D73889O5765A69839J46204J48640D3967L85760m3442R5334M6188J21088
14830F48895m9758q8492r1594j37243n9085K86821j97604O2529L47148j73506
14820E48111B06960M11404j4658k1540B46227J35240q2239J07100J47192k8212
14810E25308j06953J39783B71717L59915B15700P7238d4935C72039A85318M17340
14800F02658j3331j48795A97840K69196K11907C38407J29167J91292J43499k59541
$$ y = [274799, 397532, 337779, 156652, 580499, 503221, 307562, 207424, 160824, 298532, 359227, 380938, 400674, 310816, 573191, 564958, 245700, 397032, 325111, 775767, 510899, 107301, 537331, 180159, 373649, 198639, 464561, 292303, 575068, 161681, 418070, 328973, 473889, 539654, 169839, 316043, 464683, 43967, 429727, 386285, 481619, 527807, 648895, 599137, 510645, 419051, 281808, 222723, 509544, 311940, 374469, 721617, 548111, 206960, 618364, 603706, 582166, 246227, 381467, 299228, 406328, 553520, 525308, 418355, 558138, 271717, 631632, 215700, 292938, -44935, 372039, 185318, 602658, 589327, 440532, 197840, 467036, 678943, 338407, 467574, 658866, 802365, 542824]
14790E42824j69494K47226l4456k78947O4505R5766J5587k6092Q0283P0904o170
14779F01936J64450C59518K25839j39916J75753m733O305J54759j09741l0954
14769F36830J3493m7871k77861L95835C27621J86059L649r5028L56189k03170
14759E75320A60926L13655J0493p7760J95713o3132K73646m03105K3851R8559
14749E32846K54854k80151p5363k2351J68704j6531m2345N1276M7182L56041k28861
14738G45301l3083m5189n18l3276k59743J46738L90450k57575J80650j83295L28561
14727I79021J32511A77759O68478k24909k2643K20290O5926l78702M34873k20659
14717G20413L15831k80930j06090L57156D64903M64780l80297J18484P1201Q7615
$$ y = [542824, 373330, 620556, 586100, 307153, 371658, 467424, 483011, 456919, 537202, 608106, 601936, 766386, 359518, 585357, 445441, 621194, 616461, 622766, 777525, 667784, 636830, 650323, 602452, 324591, 720426, 327621, 513680, 517329, 422301, 778490, 575320, 160926, 474581, 485074, 407314, 603027, 539895, 813541, 410436, 434287, 532846, 787700, 507549, 432186, 409835, 578539, 562008, 519663, 570939, 618121, 974162, 745301, 712218, 667029, 666511, 633235, 373492, 520230, 910680, 653105, 833755, 650460, 979021, 1111532, 177759, 846237, 621328, 598685, 818975, 884901, 506199, 941072, 720413, 1036244, 755314, 649224, 1006380, 464903, 929683, 549386, 667870, 739071, 826686]
14707H26686m3704k82388J53320K13513k55003J55359N7885J28039r4081K9891
14697H89517L3997O0083D79462K12111L45648l36682K40323j26650L15861l06391
14687H23682L51938m34411J7812J03850o6712Q4756l29179J41988l0424N4228
14677G17528N6301O2705J86002j6398l8444L31937k26813n14576K34501J16522
14667I09265L47388l97965L05388k28893J7426K450q0536K16167p7942J27485
14657A140233K9162j16601o393K40540o4138k24299l65586L96374K05785k94822
14647I40255K78200P8972l13811J67893j05957K23223k08679j54885L03110j03381
14637A104940J70491N2454j78922j07518L30308o53869N45465O670k2445m06920
$$ y = [826686, 782982, 500594, 653914, 867427, 612424, 767783, 825668, 953707, 859626, 889517, 923514, 983597, 479462, 691573, 1037221, 700539, 940862, 814212, 1130073, 823682, 1175620, 741209, 759021, 862871, 796159, 880915, 551736, 693724, 663300, 717528, 773829, 836534, 1022536, 1006138, 967694, 1299631, 1072818, 558242, 792743, 909265, 1256653, 858688, 1164076, 935183, 952609, 955059, 874523, 1090690, 1012748, 1140233, 1169395, 1052794, 1046401, 1286941, 1222803, 998504, 632918, 1029292, 1235077, 940255, 1218455, 1297427, 983616, 1151509, 1045552, 1268775, 1060096, 905211, 1208321, 1104940, 1275431, 1327885, 1148963, 1041445, 1371753, 717884, 1263349, 1270019, 1247574, 840654]
14627H40654M07282K68850j54304l56829l2145O05979k32369K00885j92353m5150
14617A310500Q0046N7980j02748k33127K50278M08020m68886J62318Q5126k34453
14607A315054J78572k34956L40775j3608l07157J61818J21295j28665J36378j45410
14597A424096k61453L95998K53776j22130l910j01775j2609J50519K6545K13578
14587A962635o6695l48831n691L06501r6968R1944m56281P13728l56050j04051
14577A640241L0698R5633J53952k79239J99397J69040m0396N6796J94624j78625
14567B042121M0428q82o5287M34065j85559K06078j93987j43056K19728K82740
14557B636389j67114J93845K80065m4976M62129M02765K86240Q61881K244028
$$ y = [840654, 1247936, 1516786, 1362482, 1005653, 973508, 1579487, 1347118, 1548003, 1355650, 1310500, 1390546, 1448526, 1345778, 1112651, 1362929, 1770949, 1302063, 1464381, 1549507, 1315054, 1493626, 1258670, 1599445, 1585837, 1278680, 1440498, 1561793, 1433128, 1569506, 1424096, 1162643, 1558641, 1812417, 1690287, 1686377, 1584602, 1571993, 1722512, 1749057, 1962635, 1895940, 1547109, 1541418, 1847919, 1750951, 1842895, 1386614, 2100342, 1744292, 1640241, 1670939, 1766572, 1920524, 1641285, 1840682, 2009722, 1969326, 2026122, 2220746, 2042121, 2082549, 2081667, 2016380, 2450445, 2264886, 2470964, 2276977, 2133921, 2353649, 2636389, 2469275, 2663120, 2943185, 2898209, 3360338, 3763103, 4049343, 4911224, 7155252]
14548G155252L687545Q653939J7595323R278569B2162957H322427C634586q24302
14540B810284n03217k17947k55443K18071j34295j8583j06070M6051p3053L41438
14530B107236P1009k72926N254K07334o4286J53418o7504L4791K8022P5289j27555
14519B150082J36891L12032l68106O6765L13726J32342l33747N391L34442j2866
14509B736952m62960j5844K73848O1391J52586o1601J84071k89616N65096j71100
14499B972823O0025j55257J73910j25621J83103j36450J58359j18412J18967n1168
14489C080279R4041r3654R5456j171M36761J53559k98843l014J95608j56704J95314
14478C697632j84328J54107N9961O12517o06048M5195m6132L02994j43570K27743
$$ y = [7155252, 10842797, 19496736, 37092059, 46370628, 22162957, 8322427, 3634586, 2810284, 2307067, 2089120, 1833677, 2051748, 1917453, 1898870, 1792800, 1838851, 1765798, 2107236, 2178245, 1905319, 1910573, 2117907, 2053621, 2207039, 2139535, 2174326, 2202348, 2277637, 2150082, 2286973, 2599005, 2230899, 2297664, 2611390, 2743732, 2409985, 2415376, 2749818, 2736952, 2273992, 2258148, 2531996, 2593387, 2745973, 2684372, 2868443, 2578827, 3143923, 2972823, 3032848, 2877591, 3051501, 2925880, 3108983, 2972533, 3130892, 3012480, 3131447, 3080279, 3174320, 3080666, 3176122, 3174951, 3611712, 3765271, 3466428, 3463414, 3659022, 3502318, 3697632, 3513304, 3667411, 3727372, 4339889, 3733841, 3779036, 3732904, 4035898, 3892328, 4120071]
14468D120071k72889J80067j139J5543Q3251L29881k22577O5564j6288K31231
14458D512715o8728k3668K22166K48626j2579k5779r6025J49055j76927M45278
14448E174134j72846L52345k79748J78949j59497J6276L06613j74297J23808L87800
14438E753537k77615J23706R8614J19627L3817N22358l43205j22433L52982j26864
14428F134524N81673m57653J73708L67706q5601L12882n4477m1086J44033J80331
14418G256040j93286N95657L4450k9040J79413J05361J41680k0898Q6824P0753
14408H226954K33496k75128O23355J55426J5093O1514M15127j08695M6067L19053
14398I712262J05106K72329K69637o7356L09818o965M21751L13789o4055M8275
$$ y = [4120071, 3847182, 4027249, 4026110, 4041653, 4124904, 4454785, 4232208, 4297772, 4281484, 4512715, 4443987, 4420319, 4642485, 4891111, 4878532, 4852753, 4756728, 4905783, 4728856, 5174134, 5001288, 5353633, 5073885, 5252834, 5093337, 5109613, 5416226, 5241929, 5365737, 5753537, 5475922, 5599628, 5698242, 5817869, 5851686, 6374044, 6030839, 5908406, 6261388, 6134524, 6716197, 6258544, 6432252, 6799958, 6714357, 7027239, 6972762, 6931676, 7075709, 7256040, 7062754, 7658411, 7692861, 7663821, 7843234, 7948595, 8090275, 8069377, 8156201, 8226954, 8460450, 8185322, 8808677, 8964103, 8979196, 9040710, 9455837, 9347142, 9393209, 9712262, 9817368, 10089697, 10359334, 10291978, 10601796, 10594831, 11016582, 11330371, 11266316, 11314591]
14388A1314591N33058k84891K26378O16339J16230L44696K44550K62688j043N16938
14378A3889534j94787N30925J21294O24330J00010J25905K45550N50982P7919
14369A6071662J56563N86928K20971O7887R33596K68903K34339L51924P46564
14360A9639337K94495Q180R07986M94446L23553R58824J3271O19530O64213L31774
14350B4255609O98714P47750Q9929J111661N27016R29058L13350P49072J023113
14341C0445272N62791J023321Q57714J060523R17941M73856J690631J311259O33727
14332C8977035J072517J494222J033720J419510J115951J506644J755393J585806
14324D9960798J553464J382663K279378J633403K411767K233359K158994K223389
$$ y = [11314591, 11847649, 11562758, 11789136, 12405475, 12521705, 12866401, 13110951, 13373639, 13372596, 13889534, 13694747, 14225672, 14346966, 14971296, 15071306, 15197211, 15442761, 15993743, 16071662, 16228225, 16815153, 17036124, 17104011, 18037607, 18306510, 18540849, 18892773, 19639337, 19933832, 19942012, 20849998, 21344444, 21667997, 22626821, 22640092, 23259622, 23923835, 24255609, 24954323, 25702073, 25792002, 26903663, 27430679, 28359737, 28673087, 29422159, 30445272, 31008063, 32031384, 32889098, 33949621, 34867562, 35341418, 37032049, 38343308, 38977035, 40049552, 41543774, 42577494, 43997004, 45112955, 46619599, 48374992, 49960798, 51514262, 52896925, 55176303, 56809706, 59221473, 61454832, 63613826, 65837215]
14316F5837215K416984K730246K627245K881933L423059L349774L055726L989983
14308I0312165L669270M623447M141777M487235M905085N108728N613297N881818
14300A28742822O582597O642165P139276P642282P873345Q700477Q992647R822119
14292A92137730J0021328J1096246J1504015J2102896J3055599J3455212J4221679
14285B77594705J4689814J5139836J5799683J5822593J6018764J6425284J6073159
14278C87563838J5173633J4807311J3556819J1846296Q055784L902590K845940
14271D57752211M24315J48168Q69239j743376k642908o985565r894698j1348094
14263D26579292j2286381j4151904j5671512j5943662j6359459j6460359j5982104
$$ y = [65837215, 68254199, 70984445, 73611690, 76493623, 79916682, 83266456, 86322182, 90312165, 93981435, 98604882, 102746659, 107233894, 112138979, 117247707, 122861004, 128742822, 135325419, 141967584, 149106860, 156749142, 164622487, 173322964, 182315611, 192137730, 202159058, 213255304, 224759319, 236862215, 249917814, 263373026, 277594705, 292284519, 307424355, 323224038, 339046631, 355065395, 371490679, 387563838, 402737471, 417544782, 431101601, 442947897, 451003681, 454906271, 457752211, 458176526, 458324694, 459193933, 457450557, 454807649, 447822084, 437927386, 426579292, 414292911, 400141007, 384469495, 368525833, 352166374, 335706015, 319723911]
14256C19723911j5765700j4607299j4512298j3981347j3642473j3198699j1587736
14249B22428359j1698833j0819346j0360343r641781q897526q299201p835760
14242A54875569p696292p100660o348175o530375n483830n530476m821553n181088
14234A06183120m433898m394761m176133k997970m011742l679559l293736k905030
14226G6290291l127353k760540k575811k317120k388803k395540j755691k313986
14218E6655447j771674j832832k356007j657704r14800j367677j275769j671891
14210D3807093j620347j276150r13277o17463j079765j501766r66411j156864
14202C4675050r83025o93630o82307r16694o81992j083726q03739p91813r80793
$$ y = [319723911, 303958211, 289350912, 274838614, 260857267, 247214794, 234016095, 222428359, 210729526, 199910180, 189549837, 179908056, 171010530, 162711329, 154875569, 147179277, 140078617, 133730442, 127200067, 121716237, 116185761, 111364208, 106183120, 101749222, 97354461, 93178328, 90180358, 86168616, 82489057, 79195321, 76290291, 73162938, 70402398, 67826587, 65509467, 63120664, 60725124, 58969433, 56655447, 54883773, 53050941, 50694934, 49037230, 48122430, 46754753, 45478984, 43807093, 42186746, 40910596, 39997319, 39379856, 38300091, 36798325, 35831914, 34675050, 33692025, 32998395, 32316088, 31399394, 30717402, 29633676, 28829937, 28038124, 27057331]
14193B7057331k52372r75501n24630p85410j50229o18868p76106n98990m18752
14184B1956473l51053o21553n17243n53007l51606J0310q42583k60265l94901
14175A8074572l28072k86868n32008l16295k22234k42664m57963k57077k30892
14166A5200499n77159J59433n49205l15354n7072l88013k61292k08466p1616k20524
14156A2711231l57108n43536L8983k15029j5609p0279n3541m56235j48310m64463
14146A0426104p8658J65038j8699n65875j792m09394L05461m77877j01789o955
14136I235564k92625o9976j00707l00659k9067J06287P943p09665L47753l42189
14126G852659P3899k42505P7477j89585k66853K8032j11465N6367j84219j36320
$$ y = [27057331, 26804959, 25829458, 25304828, 24519418, 24369189, 23750321, 22974215, 22375225, 21956473, 21605420, 20983867, 20466624, 19913617, 19562011, 19572321, 18729738, 18469473, 18074572, 17746500, 17459632, 16927624, 16611329, 16389095, 16146431, 15688468, 15431391, 15200499, 14623340, 14782773, 14233568, 13918214, 13861142, 13473129, 13211837, 13003371, 12931755, 12711231, 12354123, 11810587, 11849570, 11634541, 11618932, 11548653, 11495112, 11038877, 10890567, 10426104, 10347446, 10512484, 10493785, 9927910, 9926118, 9516724, 9822185, 9344308, 9242519, 9235564, 8942939, 8872963, 8772256, 8471597, 8442530, 8548817, 8556760, 7847095, 8194848, 7852659, 7926558, 7684053, 7761530, 7571945, 7305092, 7333124, 7221659, 7278026, 7093807, 6957487]
14116F957487K2639m1680o62094J36546n4456q1895K21200l66792P8248j83557
14106F025646K309l52495l4027J09467j878J27064l97060o2098j6174J23499j64479
14095E359774N7268m9j50623P9858m40448J47650m3121l88447M62098l62182m7887
14084D673891J23702k75272J87126o14905K84273J6894K6712r3231M5779p8512
14074D296457l13207K87788k31640k83313K83395l88351K79776j84408m709J37205
14064C878993j56658j12098o6613J5298k10158J08487L47342l91750K83964j13264
14054C583543r4259m71280K53456j82771J69852M28875l80509m01608k4950L84862
14044C265211O2061m92280J71139L9244J8691k02505r6436R326L85775n98069
$$ y = [6957487, 6980126, 6938446, 6276352, 6412898, 6358442, 6276547, 6497747, 6130955, 6209203, 6025646, 6027955, 5675460, 5641433, 5750900, 5749022, 5876086, 5479026, 5416928, 5400754, 5524253, 5359774, 5417042, 5416993, 5266370, 5346228, 4905780, 5053430, 5010309, 4621862, 5083960, 4721778, 4673891, 4797593, 4522321, 4709447, 4094542, 4378815, 4395709, 4422421, 4329190, 4374969, 4296457, 3983250, 4271038, 4039398, 3756085, 4039480, 3651129, 3930905, 3746497, 3741788, 3878993, 3722335, 3610237, 3543624, 3558922, 3348764, 3457251, 3804593, 3412843, 3696807, 3583543, 3489284, 3018004, 3271460, 3088689, 3258541, 3687416, 3306907, 2905299, 2880349, 3265211, 3327272, 2834992, 3006131, 3045375, 3064066, 2861561, 2765125, 2774451, 3160226, 2562157]
14034B562157N97291p23888L79016k35910J02312J81385l10781l8875J59260l25676
14024B346291K03408q4036J89648j4364J05905n41925P3442q829L12334k54876
14014B326998j85983j25144o9332K64620k10892J24983J57562O0634m17512J11060
14004B036994O2628J87753l80305J82011j01025l64437r4401M39843k52849N5798
13994A772010p9729j45039M96515l87605N21029J164789K492323P114170J6671824
13985B9620287J6431767j9010007A2893039n535459j884823j093441o34561m48234
13977C296521l39145p0649L8798r8007k83890j57612Q6157l854l61005p8945N0283
13966B078652j85004K83661j73252J22310l96937r2957J95756R9090K43922k66466
$$ y = [2562157, 3159448, 2435560, 2814576, 2578666, 2680978, 2862363, 2551582, 2512707, 2671967, 2346291, 2549699, 2465663, 2655311, 2640947, 2746852, 2204927, 2278369, 2269540, 2581874, 2326998, 2141015, 2015871, 1946539, 2211159, 2000267, 2125250, 2282812, 2343446, 1925934, 2036994, 2099622, 2287375, 1907070, 2089081, 1988056, 1623619, 1529218, 1969061, 1716212, 1772010, 1692281, 1547242, 2043757, 1656152, 2177181, 3341970, 5834293, 12948463, 29620287, 46052054, 27042047, 12893039, 7357580, 5472757, 4379316, 3744755, 3296521, 2957376, 2886727, 2925525, 2827518, 2543628, 2386016, 2472173, 2468319, 2107314, 2028369, 2078652, 1893648, 2177309, 2004057, 2126367, 1729430, 1636473, 1832229, 1931319, 2175241, 1908775]
13956A908775j58071J76534K2999l49435J31633k33874K66732j87531M6925Q9169
13946A713856J24073k10825n54966L84519M37970k73273k17248K42500J43486
13937A790092m04690O545J50729J23669p4487k40383J70915j54856Q7483K2539
13927A477556M5609j24191J35638p3820l1885J0480p3943l05963L60334j61990
13917A257825K92213l05391K82802j79845j17070k4926k01775j8533N74087l69512
13907A189875R4376o2260j86189L41207l55461L37130j97652N39349m44897j5015
13897A240463Q8733K09124m88754k6431p505n2873L19628l08448j60904O4000
13887H77033M58299n30932M17722j59890K38521l75711j43524J85352J83580k39718
$$ y = [1908775, 1750704, 1927238, 1950237, 1600802, 1732435, 1498561, 1765293, 1577762, 1624687, 1713856, 1837929, 1627104, 1072138, 1456657, 1894627, 1621354, 1404106, 1646606, 1790092, 1385402, 1391947, 1542676, 1666345, 1591858, 1351475, 1522390, 1367534, 1455017, 1477556, 1523165, 1398974, 1534612, 1460792, 1428907, 1439387, 1365444, 1059481, 1419815, 1257825, 1550038, 1244647, 1527449, 1347604, 1230534, 1205608, 1003833, 985300, 1559387, 1189875, 1284251, 1221991, 1035802, 1377009, 1021548, 1358678, 1161026, 1700375, 1255478, 1240463, 1329196, 1538320, 1049566, 1023135, 1015630, 962757, 1282385, 973937, 813033, 877033, 1335332, 804400, 1222122, 1062232, 1300753, 925042, 781518, 966870, 1150450, 910732]
13877I10732K23631M2073j24497k0394L03917k74262j46519M63421n76054r3978
13867G08070L63565o5101K00865j52860P8987j61005j59455M88714k20998k772
13857A078010K15147k51643j06558O7973q6546L0570L2543j42764J60329l85383
13847F11678L97146j31030J86199Q4766j01329l17448L73431l01366j22639O60498
13837A339906l46105J68748k38968k58483k5264L8185n6062K60998J7798j93392
13827G07361J49103p1446r7558K1669J28964J4879n9622p5203j83728J58858J99927
13816H93204j48233R0052m7803C75955N31062o9792j11759j39098L35200o5236
13806H56332o2791p2834J96000k5277K3330l03195O6287P7785J77778j93027k11596
$$ y = [910732, 1134363, 1176436, 1051939, 1031545, 1335462, 1061200, 914681, 1378102, 802048, 708070, 1071635, 1006534, 1207399, 1054539, 1133526, 972521, 813066, 1301780, 1080782, 1078010, 1293157, 1041514, 934956, 1002929, 916383, 946953, 979496, 836732, 997061, 611678, 1008824, 877794, 1063993, 1148759, 1047430, 729982, 1103413, 802047, 679408, 1339906, 993801, 1162549, 923581, 665098, 639834, 678019, 621957, 882955, 900753, 707361, 856464, 785018, 687460, 709129, 838093, 852972, 793350, 718147, 534419, 693277, 893204, 744971, 835023, 787220, 375955, 907017, 837225, 725466, 586368, 921568, 856332, 793541, 720707, 916707, 891430, 914760, 611565, 677852, 755637, 933415, 740388, 528792]
13795E28792k43711N11114k23583L28754j72017M1459k10290K55861l4389n6067
13785G25923j71526J30657J84099K1458k46549q9759l0112n8252M17901k05100
13775F78740Q2784B76737L28634L40228l42626L23271j6537k82803j4544k6850
13765E85510k0677j22947L04921O4623C69784R2925M59891C69707J65903K8789
13755E64399K09693k87761J27566j12131K2703J38801j2249M6241k65331J16955
13745E48886J19444J76935j90525j92127K57104k24353j14037J03382J73445k56076
13735D02078j4530J52185k4187k00597M2760k7010K80753O7253l16230L67527
13725G30002C42892J01202k294L8060L38303k03760J06930B01480L54283j06401
$$ y = [528792, 285081, 796195, 572612, 901366, 729349, 770808, 560518, 816379, 781990, 725923, 554397, 685054, 869153, 890611, 644062, 554303, 524191, 465939, 883840, 678740, 761524, 276737, 605371, 945599, 602973, 926244, 909707, 626904, 612360, 585510, 564833, 441886, 746807, 811430, 369784, 462709, 922600, 369707, 535610, 564399, 774092, 486331, 613897, 501766, 524469, 663270, 651021, 697262, 431931, 548886, 668330, 845265, 654740, 462613, 719717, 495364, 381327, 484709, 658154, 402078, 387548, 539733, 515546, 314949, 357709, 330699, 611452, 678705, 362475, 730002, 342892, 444094, 441800, 479860, 818163, 614403, 721333, 201480, 555763, 449362]
13715D49362J32519r6195K66853j51658K84333l20730q3400r9450R4623J11324
13705E87581I3879M41166l9798J569J83621B36164J57790M27974l64825j37521
13695C19582J93773M9202o1593J60114j72071n8346n1729Q2355j78952L80370
13685F62705k01817J45393B72173L3379L64406C04782j3512J10090j26118Q5758
13675C61000R5640j00285K39543p8007q316j65215J91317B13315K30893J6357
13665D60565J99689G5265L96090j09259O0507j70527L39372A30449K12015J50394
13655D92858j25828Q4372n0233K70682J6042A78540Q3332L65076j5478A93247
13644E12058k1848j34977J22858k25677K01675I9553M78240K49524j46308B53020
$$ y = [449362, 581881, 485686, 752539, 600881, 885214, 564484, 481084, 381634, 476257, 587581, 93879, 535045, 495247, 496816, 680437, 236164, 393954, 821928, 457103, 319582, 513355, 562557, 500964, 661078, 489007, 430661, 378932, 461287, 282335, 662705, 460888, 606281, 272173, 305552, 669958, 304782, 291270, 401360, 275242, 361000, 456640, 356355, 595898, 517891, 509575, 344360, 535677, 213315, 444208, 460565, 660254, 75265, 471355, 362096, 422603, 252076, 591448, 130449, 342464, 492858, 367030, 451402, 401169, 671851, 687893, 178540, 261872, 626948, 611470, 193247, 512058, 490210, 355233, 478091, 252414, 454089, 99553, 577793, 827317, 681009, 253020]
13633B99797A39967J71675L50200B35772q1167M42412B95193J03585A91753o3959
13623A27794K72303l7131l4911K25761n5833H7868L55894r4214j50149L98971
13613E98370A49997J96455A67225q2803K66352o1153j36235J68659N4080r6622
13603B79503J84678M691b23935B43222K17238k0531J23392m7613j30107K45826
13593F31427j35845A70345K10646q0248P5458j61277j06177L81807j69624o5618
13583B55312J84339j41808r4294J13992J34484M6445A88964F3601L07766l6075
13573C35292n5790A24273R7576E4454o477J20285J34618j26422R9212E1918J42751
13562A94669g3784C35305A24677O4085J57002m6609J16032q7428k4789n5920A16802
$$ y = [299797, 139967, 311642, 661842, 235772, 154605, 597017, 295193, 398778, 191753, 127794, 400097, 362966, 328055, 553816, 497983, 87868, 443762, 349548, 199399, 598370, 149997, 346452, 167225, 84422, 350774, 289621, 153386, 322045, 376125, 279503, 464181, 468872, -223935, 243222, 460460, 439929, 563321, 515708, 385601, 631427, 495582, 170345, 380991, 300743, 376201, 214924, 108747, 490554, 320930, 255312, 439651, 297843, 203549, 317541, 452025, 498470, 188964, 63601, 371367, 335292, 279502, 124273, 221849, 54454, 47977, 168262, 302880, 176458, 275670, 51918, 194669, -73784, 335305, 124677, 188762, 345764, 299155, 415187, 327759, 302970, 247050, 116802]
13550c335C64226B5911J89360K14171O8042B33856r0603J59720j46118N9227q7940
13539A28142l1058J90577F6730J57450M3903K32997k17903K48722a03024C81085
13528E06224k44737L15441B07848L87705H1634L98073K1702j60115E6712N18262
13518E74974B51691C0104L32676j35166I3795K65392M2435h1402D26801p6885
13508C49916P9694j90874p9400B0581M24082A50972J72517K2267L5592r0785r9904
13497A90659I1289J63727N103J212l1842m3013o8541P54887D13590A99481K33376
13486D32857f7058D35549j68005r3254M6569R1955j2705K2076J2969J8653A15883
13474A75986F3056J26997i5019G9427e0973B84786j18695J04876J61q2529J76062
$$ y = [-3335, 364226, 25911, 215271, 429442, 497484, 233856, 143253, 302973, 156855, 216082, 128142, 97084, 287661, 66730, 224180, 268083, 501080, 283177, 531899, -103024, 381085, 506224, 261487, 576928, 207848, 595553, 81634, 479707, 501409, 341294, 56712, 574974, 251691, 30104, 362780, 227614, 93795, 359187, 401622, -81402, 426801, 349916, 429610, 238736, 159336, 20581, 444663, 150972, 323489, 345756, 381348, 290563, 190659, 91289, 255016, 260119, 261331, 229489, 186476, 117935, 872822, 413590, 199481, 432857, -67058, 435549, 267544, 174290, 220859, 312814, 300109, 322185, 335154, 353807, 115883, 175986, 63056, 190053, -95019, 79427, -50973, 284786, 166091, 270967, 271128, 188599, 364661]
13463C64661j79939c273A61275F8195P8091j0428K03752k5612B7110A680a43857
13451C61728K536n1814J2427j05205J26276A55260l7025b2007j87405C86961j42755
13440B44206A21112M5990b8184B89570A43012P6574Q3727r6659K04139j20558
13430B90235P3732j7081I5844N4210L92491A90699L78051A01533N8342o6442J57363
13419B50796M07885k89007j39152g2792C06211A51379B3570K74062J01344n8635
13409C40341j39487L2811l8863B3898J3133J38181L6123e3891B15123I5085L8567
13398A33652l457A8404J31743c84747C10160A28278R1535m4911o7965A848M40276
13387D42124n773A85936J43811D4754K14870F7150L27303a15737J1019M6550D37024
$$ y = [364661, 184722, -3273, 161275, 68195, 146286, 135858, 339610, 313998, 27110, 1680, -143857, 361728, 364264, 312450, 324877, 219672, 345948, 155260, 118235, -22007, -209412, 386961, 244206, 121112, 167102, -28184, 289570, 143012, 219586, 303313, 206654, 410793, 290235, 363967, 346886, 95844, 150054, 542545, 190699, 568750, 101533, 159875, 93433, 250796, 658681, 369674, 230522, -72792, 306211, 151379, 23570, 297632, 398976, 340341, 200854, 233665, 194802, 23898, 37031, 175212, 211335, -53891, 215123, 95085, 133652, 130195, 18404, 150147, -384747, 310160, 128278, 219813, 174902, 106937, 1848, 442124, 436351, 185936, 329747, 44754, 259624, 67150, 394453, -115737, -104718, -58168, 437024]
13375B92685j36729N8822E657J20725J52440j14610K36681j82441J60215j20619
13365B58048L59808A66780K71664I0563L86054i6827A74489n8577R3612k4917
13355A84607D5231J01846J483M68471A3878L36711p428m2908K60871K2753B63545
13343A55304K07115a07690C31225B3920M05600J25269a21035C56414B9244K38549
13333B67793j2309r1619i150I1767J9601J19047P5760J26819A34906e5759B73704
13321B74470C0491L54187j60325M37133j95916j23279j09562j03737k5200d7328
13310A18883M41108a15681B82452K45022k25097K7466a93590A54657P0043D0061
13299D01578a55134A13031C3043A3917a93925A55738K15472b10120d694D82777
$$ y = [292685, 155956, 214778, 5657, 126382, 278822, 164212, 400893, 218452, 378667, 258048, 617856, 166780, 438444, 90563, 476617, -96827, 174489, 115912, 209524, 184607, 45231, 147077, 148560, 617031, 13878, 350589, 343161, 300253, 561124, 583877, 263545, 155304, 362419, -107690, 331225, 23920, 429520, 554789, -121035, 356414, 29244, 267793, 255484, 163865, -9150, 91767, 111368, 230415, 306175, 432994, 134906, -55759, 273704, 274470, 30491, 384678, 224353, 661486, 465570, 342291, 232729, 128992, 103792, -47328, 118883, 559991, -115681, 282452, 527474, 302377, 329843, -193590, 154657, 224700, 40061, 401578, -155134, 113031, 33043, 13917, -193925, 155738, 371210, -210120, -4694, 482777]
13288B62773j22937o5120J3770J14443A4523J23759J58906j24512h9000j825C51303
13276i645B1385n918i1554L4866A91246J7029P0583o5814a04808J2620A63647
13264d8941j85906B2361Q3595K12930I6799q425J77174j8670K1785A23910J24534
13253B48444d5030C10816g6220A13850d1462h747j21401A48891J64223A44209
13242A19576a41288f2810a8538o7442C49563l1550b02740K2020C01429j18550
13232A82879E2905J05751a29072O738C622K56568i4310A47723M7483E882a7302
13220b8184B6653b03176f5438n5086E2105M09856G6163b88985B68332r0364l9754
13209A38214K1436m0046P9555p1047n5476A9778b07917C46911A66979E7909f0251
$$ y = [262773, 139836, 74716, 88486, 202929, 14523, 138282, 297188, 172676, -89000, -90825, 351303, -9645, 21385, 15467, -91554, -56688, 191246, 208275, 278858, 213044, -104808, -92188, 163647, -48941, -234847, 22361, 105956, 318886, 96799, 88374, 265548, 246878, 268663, 123910, 248444, -45030, 310816, -76220, 113850, -41462, -8747, -130148, 148891, 313114, 144209, 119576, -141288, -62810, -18538, -85980, 349563, 318013, -202740, -180720, 301429, 182879, 52905, 158656, -129072, -122334, 3622, 260190, -94310, 147723, 195206, 5882, -17302, -28184, 26653, -203176, -65438, -120524, 52105, 461961, 76163, -288985, 268332, 177968, 138214, 159650, 119604, 199159, 128112, 72636, 19778, -207917, 346911, 166979, 57909, -60251]
13197B35900r2816C9961J1116M8852k0719a6833I1139b59795F0460b1883F8357
13185B33354R580P4544p8982l8426a12515b746B1216J39585O6009m8747q4465
13174I3598c4906B36890D1991b11197A92917p6019b20112K4666b177B59125K10797
13163D69922A63333Q0594b53398C6652c61669G5765K78311a92866M8872a6262
13152a03895E70f7936A42179C6083J36032H5494L6472Q0104o0981J00848F2654
13140E5943b48609B55158C8102J7042L6994Q4113m4945L8009E002M2205K79856
13129C27063F8793F205K02663i5645B40403P9810A13398J01015I7137m3399A5020
13117b28678I2867K07793b26775D22223a10268D7338d30076a28892E4956N38289
$$ y = [235900, 143084, 39961, 51077, 99929, 79210, -16833, 91139, -259795, 60460, -21883, 68357, 233354, 242934, 317478, 238496, 200070, -112515, -2746, 21216, 160801, 226810, 178063, 93598, -34906, 236890, 41991, -211197, 192917, 116898, -220112, -195446, -2177, 259125, 469922, 163333, 243927, -253398, 36652, -361669, 75765, 354076, -192866, -143994, -16262, -103895, 570, -67936, 142179, 36083, 172115, 85494, 121966, 202070, 141089, 241937, 62654, 55943, -248609, 255158, 38102, 55144, 92138, 176251, 131306, 169315, 5002, 47207, 327063, 68793, 6205, 208868, -95645, 240403, 320213, 113398, 214413, 97137, 53738, 15020, -228678, 92867, 300660, -226775, 422223, -110268, 47338, -430076, -128892, 54956, 593245]
13107E93245C8810K60172A31433O0746R3741J98462A70176a20091H3393c7591
13096C18661k1561o4802c8481a0066A7641K46848c0813F7685a09366L3779p682
13085h3269L5345B9719a26061b5817A26407E3013b05056f825j88053f2534H3916
13073D6047a02381A90858H2437a80652c300o0643j3557B41097i1151L8035E9417
13061a83192A24561J13565D2376a16760D19953a1152B71683C3332R7045L2567
13051A62944a6394l3372l28451B36007n0428a75107A25391N1727b3053B59316
13040A19547P1703l1295F3268Q9493b6319B92172c86843d2376A22913k8369a8817
13028I5240O2022N8538P1768j2613A05909L5115K59883q004c75138D25267E5241
$$ y = [593245, 38810, 298982, 131433, 192179, 285920, 484382, 170176, -120091, 83393, -37591, 318661, 297100, 232298, -38481, -10066, 17641, 264489, -30813, 67685, -109366, -75587, -83269, -47924, 29719, -126061, -25817, 126407, 53013, -205056, -6825, -194878, -62534, 83916, 46047, -102381, 190858, 82437, -180652, -3300, -63943, -77500, 241097, -91151, -53116, 59417, -183192, 124561, 238126, 42376, -116760, 419953, -11152, 271683, 33332, 130377, 162944, -16394, -49766, -378217, 236007, 185579, -175107, 125391, 177118, -23053, 259316, 119547, 191250, 159955, 63268, 152761, -26319, 292172, -386843, -42376, 122913, 94544, -18817, 95240, 157262, 215800, 287568, 274955, 105909, 141024, 400907, 392903, -375138, 425267, 55241]
13016G8407c8220I2274m975N5908b4731a0124C85825J03044A7263K32714A07663
13004A6881a90857J6196B237R1120K43967i2192D6033a79499A11444J43629K9102
12993B84175H9381a60688N654A74331q3670N4052j9618o1106c2272p09k09522
12982b42503a13683A56205L5919b37577A5443R6206k5424B9065O1396b00263L4322
12971a65941E4562b89130A1587a7684A86727a83511a4076I3298J40425b51721
12960B05167a21717e4846C57969a06242j35380h7540b180B60418j11241c13063
12949a32807b5842A91346F7877c06996C73881a79091B24358a14154p779A00487
12938B10682a15898A18955E7244g3598F6164K1319b28694C09018G0599e0751B3678
$$ y = [78407, -38220, 92274, 87299, 143207, -24731, -10124, 385825, 488869, 17263, 249977, 107663, 16881, -190857, -174661, 2237, 93357, 337324, -92192, 46033, -179499, 111444, 255073, 284175, 89381, -160688, -155034, 174331, 90661, 144713, 125095, 63989, -32272, -32981, -242503, -113683, 156205, 192124, -237577, 15443, 111649, 86225, 29065, 90461, -200263, -165941, 54562, -289130, 11587, -17684, 186727, -183511, -14076, 93298, 233723, -251721, 205167, -121717, -54846, 357969, -106242, -241622, -87540, -2180, 260418, 149177, -313063, -132807, -25842, 191346, 67877, -306996, 373881, -179091, 224358, -114154, -121933, 100487, 210682, -115898, 118955, 57244, -73598, 66164, 87483, -228694, 309018, 70599, -50751, 23678]
12926C45871A44083a1427G6117J93447c15424a32250n0810k2084F9451b33209
12915i6565J3935a317A17117A3900L8886K0501f4339k8517A8895d6217k35972
12904b82189A22373j3887N968E6520b22756I6793a44158A12214a48576F1935R2838
12893A54773a4272k03137g0879C35931b09167A59194h0611B35576b33586A97638
12882c44701e4099E1654c9114C90821a99689j60361a14622C24374f6038j0173
12872g6211B15488G5027l6173c8215A09323f6792C24848c8943C2755d1819A37773
12860I0854O309I203J58323a20964D32376b43131A74126F1437a42084f9846J9014
12849e0832B06519H7280a70065C99857B8792c75434J40210A37600n4028B6632
$$ y = [345871, 144083, -11427, 76117, 269564, -315424, -132250, -183060, -205144, 69451, -233209, -96565, -82630, -1317, 117117, 13900, 52786, 73287, -64339, -92856, 18895, -46217, -282189, 122373, 108486, 114454, 56520, -222756, 96793, -144158, 112214, -148576, 61935, 154773, -14272, -217409, -70879, 335931, -209167, 159194, -80611, 235576, -233586, 197638, -344701, -54099, 51654, -39114, 390821, -199689, -360050, -114622, 324374, -66038, -76211, 215488, 75027, 38854, -38215, 109323, -66792, 324848, -38943, 32755, -41819, 137773, 90854, 97163, 9203, 167526, -120964, 432376, -243131, 174126, 61437, -142084, -69846, -50832, 206519, 87280, -170065, 399857, 28792, -375434, -235224, 137600, 83572, 26632]
12838a47141A35971d5134j93977a7459A26254M6600J69397r5722c25883A65203
12827f5042B48258F0547a00434C77990j03292j18869N6510r2169C9282c6926B72514
12815d59121E0217h0095F1458e0948B09336f805B01165a82086I6876C9013c9811
12803b20417L6345g7734j06945H1006a0919H7691C5154b92148J40538a0710A44291
12791A26294L32156G5783A6538J55688e7783A10916a5343j03571k03690b2171
12780B10037a12401B1394b99455D742J13182i5587H5390Q7284Q8010c03670I8126
12768B48874e0894C31034c55418B62263J4873C945L05317h4796A53884b15568
12757G8246C8426f3353D851J64240M2360q4871a48913K3306l0820j46217A60295
$$ y = [-147141, 135971, -45134, -239111, -17459, 126254, 172854, 342251, 246529, -325883, 165203, -65042, 248258, 60547, -100434, 377990, 274698, 155829, 212339, 120170, 39282, -36926, 272514, -459121, 50217, -80095, 61458, -50948, 209336, -6805, 201165, -182086, 96876, 39013, -39811, -220417, -184072, -77734, -184679, 81006, -10919, 87691, 35154, -292148, -151610, -10710, 144291, 126294, 458450, 75783, 16538, 172226, -57783, 110916, -15343, -118914, -322604, -22171, 210037, -112401, 21394, -299455, 4742, 117924, -95587, 85390, 172674, 260684, -303670, 98126, 248874, -50894, 331034, -355418, 262263, 277136, 3945, 309262, -84796, 153884, -215568, 78246, 38426, -63353, 4851, 169091, 211451, 126580, -148913, -125607, -156427, -302644, 160295]
12745b52783A37283c39018F6879a84910f0962A0764g5406D398a98D8787N3207
12734A01994Q2992K74969a21935l2052C70106a37618B92914I0231b887A773g9904
12722A59719a70900B09018e4332r9136C6487O5872D1390a12447A5606K03366c58148
12710b20828h7178C43366a41881A0465K1242a18837B05003e7586I5154J34068
12700B29222A3616K14124m6556b5656m3847E0557n10J27321l7110a20426C3977
12688f7769p4788B09793j8524d6129r181B27099c1720A44160m0687b9235l5306
12677f4541o8484A93826K7065H3803J97644a6856A56057a60908A52442k2618D5258
12665B13970n6843K61472j59368P2650j03588K3716q4017a35497F3821K92389
$$ y = [-252783, 137283, -339018, 66879, -184910, -60962, 10764, -75406, 4398, -198, 48787, 101994, 184986, 459955, -121935, -153987, 370106, -137618, 292914, 90231, -2887, 1773, -79904, 159719, -170900, 209018, -54332, -153468, 36487, 102359, 41390, -112447, 15606, 218972, -358148, -220828, -87178, 343366, -141881, 10465, 31707, -118837, 205003, -57586, 95154, 229222, 13616, 227740, 181184, -25656, -69503, 50557, 50047, 177368, 140258, -120426, 33977, -67769, -142557, 209793, 191269, -46129, -55310, 227099, -31720, 144160, 103473, -29235, -64541, -133025, 193826, 220891, 83803, 281447, -16856, 156057, -160908, 152442, 129824, 45258, 213970, 157127, 418599, 259231, 331881, 228293, 252009, 167992, -135497, 63821, 356210]
12655C56210A04929I461L69573K9627b61249D82995H2467j9296a50138C7246i9664
12643a56452B37427C2600a2884j3359k5795A40115b4667B90401F2298J41861O5225
12632B69384k0487J9219a01653E11784j86591j49541O1754c5960C30713A60529
12621A37441P5e2528D1701K02389J45518D9316e8815A86803q2056a76838j27181
12610c04019a08069j01365C05454K1608h2175A3864a20579A41122K66790i5007
12599a8910j64030A42524j569J31862k1375a87898M5594C26422p6300A20003J23273
12588B43276a7970o6279k03524q715h8909D257c17243j23623g2243B83654d8305
12576A79107k5128a19560N8960c451B65505F8706a96455c5485k12995A16523a67295
$$ y = [356210, 104929, 9461, 379034, 408661, -261249, 482995, 82467, 63171, -150138, 37246, -99664, -156452, 237427, 32600, -12884, -26243, -52038, 140115, -24667, 290401, 62298, 204159, 269384, 248897, 268116, -101653, 511784, 325193, 175652, 237406, -35960, 330713, 160529, 137441, 137516, -52528, 41701, 244090, 389608, 49316, -58815, 186803, 104747, -176838, -304019, -108069, -209434, 305454, 327062, -82175, 13864, -120579, 141122, 407912, -95007, -18910, -182940, 142524, 140955, 272817, 251442, -187898, -142304, 326422, 250122, 120003, 243276, -17970, -84249, -287773, -296488, -88909, 4257, -317243, -440866, -72243, 283654, -48305, 179107, 153979, -119560, -60600, -3451, 265505, 68706, -196455, -35485, -248480, 116523, -167295]
12564B75067a8933j27153e5052M076A36680a07035F2157c8105A49162L7903d1979
12552B45166g3126A72281R4699a46233D0469c48268b6948j84826k4183g7542D4140
12540e9099A90918C9743c8610C926K20045i3798L5710j6359j1663B1479L70266
12529C91745b78253B24084r8626L26951k8189j88328K2112A19315l6947J32000
12519B14368A1652N2081J19899b29581A26742n5129L4317J82023j04224b29643
12508A5655c79933D2407J34726r068f9827j50192j53063A12538J3838L9985a51571
12496C20451J35492a43653B59899b81643B65729h8129n034n758B11153C4839a91573
12484F6445a91170D8813k1093M0525h1216k93894A07348i9997C02642b15006H1842
$$ y = [275067, -18933, -146086, -55052, -50976, 136680, -107035, 62157, -38105, 149162, 187065, -41979, 245166, -73126, 172281, 266980, -146233, 40469, -348268, -26948, -211774, -235957, -77542, 44140, -59099, 190918, 39743, -38610, 3926, 223971, -93798, -58088, -74447, -86110, 21479, 391745, -278253, 224084, 125458, 452409, 424220, 235892, 258004, 119315, 82368, 214368, 11652, 63733, 183632, -229581, 126742, 71613, 105930, 287953, 183729, -229643, 15655, -379933, 42407, 177133, 168065, -69827, -220019, -373082, 112538, 126376, 166361, -151571, 320451, 455943, -143653, 259899, -281643, 265729, -88129, -93163, -98921, 211153, 34839, -191573, 66445, -191170, 48813, 27720, 68245, -81216, -375110, 107348, -99997, 302642, -215006, 81842]
12472a26522f0235k33525B74522m9691E6294F740K1596J03896c27561a07723A8367
12460a3223A12481D0836J21005E5254c7015l30358i141A73588a62476A68499h8919
12448a110q5382C93160b03396B512J3707R6419c2233l69908C5195K12053j2451
12437B34797j10186R4853j00867C1125c502l3363B28084M1816b60118E9157c14257
12425A54726a39652J7207I1769a87977C755J07646g2325k74300e8662k29153b3680
12413b48363n2471D3858b96390B26751a31331B08613l7470c7772k46248b3219
12402D3957J64106C6456M02184B2596a12879A1095R4141B5913K39495n5495q7603
12391A22310E4728e8422G7898J35621a70104C8237a91917I2973h4553F3987a13129
$$ y = [-126522, -60235, -293760, 274522, 224831, 56294, 6740, 28336, 132232, -327561, -107723, 18367, -13223, 112481, 40836, 161841, 55254, -37015, -367373, -9141, 173588, -162476, 168499, -88919, -1110, -86492, 393160, -203396, 2512, 16219, 112638, -32233, -402141, 35195, 247248, 234797, 124611, 219464, 118597, 31125, -3502, -36865, 228084, 269900, -260118, 59157, -314257, 154726, -139652, -122445, 91769, -187977, 3755, 111401, -72325, -346625, -58662, -287815, -23680, -248363, -300834, 43858, -296390, 226751, -131331, 208613, 171143, -37772, -284020, -23219, 43957, 208063, 36456, 438640, 22596, -112879, 11095, 105236, 25913, 265408, 209913, 122310, 54728, -58422, 77898, 213519, -170104, 38237, -191917, 92973, -84553, 63987, -113129]
12379b56368A63440b931C9089b7990H639c64447G251L31104b3485B59096a97350
12367B78065d9818F0898j3275a66164P8840F1388a0229B34471o211N8891a50019
12355A91541l2126l7391Q598b22086B10008a6039A21413b67194H3282i4464k07025
12344c01489b8825N580j03624A82962H2089J00349a35649A53258e4487k7613c7703
12332b52805n5433a30226B91725j12766a80745A52073B429J34993O6600I8012
12321a97239r5062G9466a91741H7424b79B0277e1836A00007a38954b8861J207
12310b7654A58315a29570m5555H437R0130b59397h792k3494A46019h3324A95000
12298f1391B9239b69049J8979A12439L20311j63409a77188d1398A24980d2376
$$ y = [-256368, 163440, -2931, 39089, -27990, 8639, -364447, 7251, 338355, -23485, 259096, -197350, 278065, -49818, 60898, 47623, -166164, -87324, 61388, -10229, 234471, 228260, 287151, -150019, 191541, 159415, 122024, 130622, -222086, 210008, -16039, 121413, -267194, 83282, -94464, -301489, -28825, -23245, -126869, 182962, 82089, 182438, -135649, 153258, -54487, -82100, -37703, -252805, -308238, -130226, 291725, 178959, -180745, 152073, 2429, 137422, 204022, 98012, -197239, -292301, 79466, -191741, 87424, -279, 20277, -51836, 100007, -138954, -28861, -27654, 158315, -129570, -175125, 8437, 98567, -259397, -8792, -32286, 146019, -83324, 195000, -61391, 29239, -269049, -250070, 112439, 432750, 269341, -177188, -41398, 124980, -42376]
12287e09285B13982a74786H6947a80032A33147J19409L704A0409a62462A37992
12276a23703B16648A06606e563B12979f4756A8018O3087a85866F6484K33247i7763
12264b19629E4367J63382n0532J31508A41706a31095B70164D7519K71833A12163
12253H5458j5201a12089m437N6595k2765A77567b6203l1413c782o1827I7374e0576
12240F1560L2387l3615J14730F1576H247K76804j13222n1950m0010d720A07029
12228D60500A72073n592K47924I7648M17183j59931B4928L80942j70400K70947
12218E06417A1947L92891B00886f2924F6168A2379J42088c7051J8289p6205c1437
12206B31591F8596J21403l4708B9419L06867r756o5390J83885A43771K89220A69258
$$ y = [-509285, 213982, -174786, 86947, -180032, 133147, 252556, 256260, 10409, -162462, 137992, -123703, 216648, 106606, -5563, 212979, -64756, 18018, 81105, -185866, 66484, 299731, -97763, -219629, 54367, 217749, 167217, 298725, 141706, -131095, 270164, 47519, 319352, 112163, 85458, 70257, -112089, -116526, -59931, -82696, 177567, -26203, -57616, -3782, -65609, 97374, -50576, 61560, 93947, 60332, 175062, 61576, 8247, 285051, 171829, 119879, 79869, -4720, 107029, 460500, 172073, 166481, 414405, 97648, 514831, 354900, 24928, 405870, 235470, 506417, 11947, 404838, 200886, -62924, 66168, 12379, 154467, -37051, -18762, -94967, -31437, 231591, 68596, 189999, 155291, 29419, 336286, 326530, 261140, 445025, 143771, 432991, 169258]
12194A83507K65205A68344O4176L50349A07197l3572R3693J82229L8041D5863
12183b4679C10324j34985o8657K88844q4928q6812I3502K74656A35765e8684F873
12171A26376D4691L66578a7732C960O549O55357A69784F6746J39365c7908A56157
12159G4352K0205d7557A60475j3557J24134p9151e4392A00357P0549n5991J12415
12148B27330a12651A01998J55596j27163i0630B71277F0368M1387r25Q849a6828
12136C46405k6989k2843b34502g804o2470j98871o0949a53040C57902A77152D4409
12124A09473a06511j86410G761P7348c03074A72717f5391k17161F0286K38913
12114B99199D2885J93867r3022J24404a75195B17750a282A42579F2072a67146
$$ y = [183507, 448712, 168344, 232520, 582869, 107197, 73625, 167318, 349547, 387588, 45863, -24679, 310324, 175339, 106682, 395526, 310598, 223786, 93502, 368158, 135765, -58684, 6873, 126376, 44691, 411269, -17732, 3960, 10509, 665866, 169784, 66746, 206111, -37908, 156157, 74352, 94557, -47557, 160475, 146918, 271052, 191901, -54392, 100357, 170906, 114915, 227330, -112651, 101998, 257594, 130431, -90630, 271277, 60368, 101755, 100830, 109679, -16828, 346405, 319416, 296573, -234502, -7804, -70274, -269145, -330094, -153040, 357902, 177152, 44409, 109473, -106511, -292921, 7761, 85109, -303074, 172717, -65391, -282552, 60286, 299199, 42885, 236752, 143730, 268134, -175195, 217750, -1282, 142579, 62072, -167146]
12103C3168a64360b2116I053K8442A5585a9029l6732E86O186b24573A46860l2165
12091A14695a95874R283p9048g8545A23116a14581B42497b35133R503c6064j42021
12080a78085b0191G2376N832c41511O8909b2743B79959a61983O2727j5805C84652
12068F07299P30766n71035A31205a3773A0047K11232a30924m1122G1496a46232
12057F1564L8098L20754E5873a05522B89645H1357a0118C29159A38535b24232
12046c749A26257M3699b3919I5477a05354K9404A07273J59034a37804J1676J0229
12035a15899B10353c77591D7704A1473b11318h368n5706l8263j3449A90850d01874
12023c30473A40190K5284K1231M7930b37178H0031f3511D8156a39148B1221n105
$$ y = [33168, -164360, -22116, 9053, 37495, 15585, -19029, -55761, 586, 6772, -224573, 146860, 114695, -195874, -186591, -265639, -78545, 123116, -114581, 242497, -235133, -225630, -36064, -178085, -20191, 72376, 78208, -341511, -272602, -22743, 279959, -161983, -99256, -115061, 384652, 607299, 1338065, 767030, 131205, -13773, 10047, 221279, -130924, -172046, 71496, -146232, 61564, 99662, 420416, 55873, -105522, 289645, 81357, -10118, 329159, 138535, -224232, -3749, 126257, 169956, -23919, 95477, -105354, -75950, 107273, 266307, -137804, -126128, -115899, 210353, -377591, 47704, 11473, -211318, -8368, -64074, -102337, -115786, 190850, -401874, -330473, 140190, 165474, 186705, 234635, -237178, 80031, -63511, 48156, -139148, 21221, 16116]
12012A6116g444o8705A75295H3918G477P3203N6002A9485b36390B5375b04692
12000b42516j8222A51326J13083b90297j500A9619O4518c77369R0641c4195B3884
11988H218K0407j3931K19475J41204D6578J2613K47903i0566D6869f4820A95420
11976c30402B237J24070d27899C36482d6704j93756M7202A55374O8507C7019b16528
11964C33139a57989J3122M8706D31083C7283K43920a74656a6640H0957b23918
11953e8755A21193l5243Q0384d06002a08819d2977J536k34627D1049J54194g6441
11941a19669d6822j55438a0457j78735h5552a3657j48167d2541l8757D1449e9557
11929A6947b61148B51390a18012k7866a6703k37953G1648O4040a39532I7844g7591
$$ y = [16116, -7444, -76149, 175295, 83918, 7477, 80680, 136682, 19485, -236390, 25375, -204692, -242516, -260738, 151326, 264409, -290297, -291797, 19619, 84137, -377369, -286728, -34195, 23884, 8218, 28625, 14694, 234169, 375373, 46578, 59191, 307094, -90566, 46869, -64820, 195420, -330402, 2237, 126307, -427899, 336482, -46704, -240460, -193258, 155374, 223881, 37019, -216528, 333139, -157989, -144867, -96161, 431083, 37283, 281203, -174656, -16640, 80957, -223918, -58755, 121193, 85950, 166334, -406002, -108819, -42977, -41441, -276068, 41049, 195243, -76441, -119669, -46822, -202260, -10457, -189192, -85552, -13657, -161824, -42541, -81298, 41449, -59557, 16947, -261148, 251390, -118012, -145878, -16703, -254656, 71648, 135688, -139532, 97844, -77591]
11917A43749h1637G452K02342f008G5396h1849D2259g3465j1237B50384a42855
11905A61403K08021C5915a2542I6925c97300a94026B00165a20219C566J6169d6706
11893e6861k60677E0040b40151B47481C1776M7372J58307j6046I1090b61444j4140
11882b75584e2125a9030j71784F8682a22975C2154J22456a19566d3910j78572
11872b22482G0398C0450i199j04939B51518c33311N2271E4035a02523B8113j1468
11861A6645J5476b0761j77610h8657B81982a54811j87949B5845P4634e7789l21820
11850c79609h3082k79580a79919m2061n0846a30254F8651b5896p5012B04209a30722
11838a42262J119J4793A8257M410c49788B09102H0041b16414H2934a33967j278
$$ y = [143749, -81637, 7452, 209794, -6008, 75396, -81849, 42259, -73465, -84702, 250384, -142855, 161403, 369424, 35915, -12542, 96925, -397300, -194026, 200165, -120219, 3566, 19735, -46706, -56861, -317538, 50040, -240151, 247481, 31776, 79148, 237455, 221409, 91090, -261444, -275584, -52125, -19030, -190814, 68682, -122975, 32154, 154610, -119566, -43910, -222482, 70398, 30450, -9199, -114138, 251518, -333311, -281040, 54035, -102523, 28113, 16645, 32121, -20761, -198371, -88657, 281982, -154811, -342760, 25845, 100479, -57789, -379609, -83082, -362662, -179919, -221980, -272826, -130254, 68651, -25896, -100908, 204209, -130722, -142262, -141143, -126350, 18257, 22667, -349788, 209102, 80041, -216414, 82934, -133967, -135245]
11827a35245A219K47254b66381B96835D8715A704c8802l6319b8995B6787a67666
11815D2924L04354b89613B11527D5510b11544q0730i3197K7972F3815i4443k20880
11804c15323g6192r9033H9754a95397B29955F136b93925h1941g669A64660e10212
11792B80115b72557a11811L1814C75402b00154e0275l64756D5859f9033A32684
11781B2470a63412J0183j53780H6320f4391k95453J44782b8397j40508B3030K02486
11770B25516j00701B8995c40767R8159E5813a0654l04843H8975K41674A30847
11759a3098r7063A75461c79420a24297d9552l20779f8019p3927e9485F9874O9428
11748A39302M884e8020m6495B73181a75002c2377A9404R2494e5965k17857a09262
$$ y = [-135245, 1219, 248473, -266381, 296835, 48715, 1704, -38802, -75121, -28995, 26787, -167666, 42924, 347278, -289613, 211527, 45510, -211544, -292274, -93197, -65225, 63815, -94443, -315323, -76192, -175225, 89754, -195397, 229955, 6136, -293925, -81941, -7669, 164660, -510212, 280115, -272557, -111811, -79997, 375402, -200154, -50275, -415031, 45859, -69033, 132684, 22470, -163412, -153229, -307009, 86320, -64391, -359844, -215062, -28397, -168905, 23030, 225516, 124815, 28995, -340767, -242608, 55813, -10654, -315497, 88975, 330649, 130847, -13098, -110161, 175461, -379420, -124297, -49552, -370331, -68019, -141946, -59485, 69874, 139302, 144186, -58020, -104515, 273181, -175002, -32377, 19404, 111898, -55965, -273822, -109262]
11736a13925J5913g092r7895B11913b13438R8794M802A11660a08080j86985B62615
11724A45128N9774a27575A70555F8000b36897C1433e5382n8982n1553I515L49658
11713C59173G3865g9179A17105i7845j58665G6035a5795k09517D4296d48770A06125
11701A63913i7976B77346E893K6648a18268H4655K8797a62319A52466m3547B8870
11689a26143c8491a4354B58755j26330a36997a8174j54903e0999n0334a9418c374
11677C9827b4545A33138a57456O9434B08334a38556D6811a69564h2657b3287H7119
11665A51951b79301j99600B6688a87256Q1489F4189B6381f2858E4046c63505C32645
11653C1991b25003r6978k9710a18130N5903j52507A96496b80086B4495f071G0692
$$ y = [-113925, -98012, -7092, -104987, 211913, -213438, -114644, -109842, 111660, -108080, -295065, 262615, 145128, 204902, -127575, 170555, 68000, -236897, 31433, -55382, -114364, -165917, 9515, 359173, 73865, -79179, 117105, -97845, -256510, 76035, -15795, -225312, 44296, -448770, 106125, 163913, -97976, 277346, 5893, 32541, -118268, 84655, 113452, -162319, 152466, 108919, 28870, -126143, -38491, -14354, 258755, 132425, -136997, -18174, -173077, -50999, -101333, -19418, -3374, 39827, -24545, 133138, -157456, -88022, 208334, -138556, 46811, -169564, -82657, -23287, 87119, 151951, -279301, -478901, 26688, -187256, -105767, 64189, 26381, -62858, 54046, -363505, 332645, 31991, -225003, -321981, -351691, -118130, -62227, -214734, 196496, -280086, 24495, -6071, 70692]
11641d4959q9009f4499a39I2629B1121K7075b5460j73974d3065B39358r3097K07924
11629C54185G8139c29486I9648P232C0278I412b0516A71831a81630B09632I5856
11617C7180K8583J31109c84576E7769f9504C2365R1137h6709B0990M4184c22855
11605F9565a77246E8624K3312a560l04877c4149B1041J32941g0512A63831b02054
11593A20169b48083h9387B16500a03017E872b74474b3483j50625A87056b15713
11582a11018d2840j0121J7780E7912e2735j90687A57856J6082o7563J29258E5977
11570i1046l1730b8099j77362e4771B08107N6531H3711e6614j04542a8052j49570
11559a67622K2981L7930K9523r596C4199a3466A53692a4499A57270c62081I7881
$$ y = [-44959, -133968, -64499, -139, 92629, 21121, 48196, -25460, -199434, -43065, 239358, 146261, 354185, 78139, -329486, 99648, 106880, 30278, 9412, -20516, 171831, -181630, 209632, 95856, 37180, 65763, 196872, -384576, 57769, -69504, 32365, 123502, -86709, 20990, 65174, -322855, 69565, -177246, 58624, 81936, -1560, -306437, -34149, 21041, 153982, -70512, 163831, -202054, 120169, -248083, -89387, 216500, -103017, 5872, -274474, -23483, -174108, 187056, -215713, -111018, -42840, -52961, -35181, 57912, -52735, -243422, 157856, 173938, 106375, 235633, 55977, -91046, -122776, -28099, -205461, -54771, 208107, 264638, 83711, -56614, -161156, -18052, -167622, -144641, -106711, -77188, -86784, 34199, -13466, 153692, -14499, 157270, -362081, 97881]
11547A32214C6233J69892c24567B7275N3336O3453d21011C6339N6210b14488D45242
11535A7988J85587K36458b26412C838K06808K5251B670K18493j1698L76309A26400
11523b7477A02961Q9839b18424A18015J42240b6273q8992A5044Q3001m535J92298
11512B85808j39640K0333J4040G1729N584f71A87254a75304e218j3592B34464
11500I9165L00728j48723c5160C87040A14073J33253J16597L85187d0205A61918
11489A03999N9775d2358C1208J78831F2925K81624G3034J80865d8698D76262j36925
11478C39337O4976j82956a07576E06207A92727J58228k5505j60478D9769f2457
11467a28596H8147J78529r7970J0923N4628M9610F9002O9936N4460Q0774J59683
$$ y = [132214, 36233, 206125, -324567, 27275, 80611, 144064, -421011, 36339, 92549, -214488, 445242, 17988, 203575, 440033, -226412, 3838, 210646, 235897, 2670, 221163, 209465, 585774, 126400, -27477, 102961, 192800, -218424, 118015, 260255, -26273, -115265, 15044, 98045, 93510, 285808, 146168, 166501, 180541, 71729, 77313, -671, 187254, -175304, -5218, -18810, 234464, 99165, 399893, 251170, -35160, 387040, 114073, 247326, 363923, 749110, -40205, 161918, 103999, 163774, -42358, 31208, 210039, 62925, 344549, 73034, 253899, -48698, 476262, 339337, 404313, 221357, -107576, 506207, 192727, 350955, 325450, 164972, 49769, -62457, -128596, 88147, 266676, 168706, 179629, 234257, 283867, 69002, 138938, 193398, 274172, 433855]
11456D33855a60784f2051f307h26B06056B3877f422q7077d0465o1451A85822a21689
11443I8996q886J1284j9528p616K06996A9081K32410H0713J81422C9530J83791
11432B23321c36917A11210a59891A3609Q247J1539f25B2573a86021n2919E3425
11420i1486A82469C2980g3831C4571a713j357H6598J05812c46802a20470A08256
11408b53210A94304F0927j9072b62113Q0890c7416H5764M1145e7881F6488a99526
11396c01768G5046M3785c9551A10088d8271B13840E2855O4796n3687J34967H232
11384h2213c8028H0942J48019a12833j13486C06788k7471a32299M7403B06872
11373a56034B00720f9978A64835h0091A47088a19460C597K83366h6890C0025b12559
$$ y = [433855, -160784, -62051, -6307, -826, 206056, 23877, -6422, -93499, -40465, -101916, 185822, -121689, 98996, 90110, 101394, 81866, 74250, 281246, 19081, 251491, 80713, 262135, 39530, 223321, -336917, 111210, -159891, 13609, 21856, 33395, -625, 22573, -186021, -238940, 53425, -91486, 182469, 32980, -73831, 34571, -1713, -3070, 86598, 192410, -346802, -120470, 108256, -253210, 194304, 60927, 41855, -262113, -181223, -37416, 85764, 126909, -57881, 66488, -199526, -301768, 75046, 118831, -39551, 110088, -48271, 213840, 52855, 117651, 63964, 198931, 8232, -82213, -38028, 80942, 228961, -112833, -226319, 306788, 279317, -132299, -84896, 206872, -156034, 200720, -69978, 164835, -80091, 147088, -119460, 3597, 286963, -86890, 30025, -212559]
11361c0217I572b0116A70888a90220g8857j76536A5944K53046a96852i2205j11540
11350b03745o124j23478I1940b21355B44879I5012a075H7863b12856C4947A4062
11338F2892b1024j50323f9774d225l45496a21490D0524J79923a46383L5272I0040
11326h9425A9149a50806A69264q4228b71054a20356a1366B22589L6267B9345a54531
11314a22407Q616I6131a20739q8774P1628j70415H8312a63679f2413j5416a0774
11302a09288A73020c23897J4872A62378l0898E9962J5963a45852A23346C3731
11291a66243a6690A71971c2522l02030E2261c6809E4465D334J97438b57202E20
11279D153J76059a50890d6942B95586g2233J1562m1381j93501a08336j8410B14407
$$ y = [-30217, 9572, -20116, 170888, -190220, -78857, -255393, 15944, 268990, -196852, -92205, -203745, -209869, -333347, 91940, -221355, 244879, 95012, -1075, 87863, -212856, 34947, 14062, 62892, -21024, -171347, -69774, -4225, -349721, -121490, 40524, 220447, -146383, -111111, 90040, -89425, 19149, -150806, 169264, 85036, -271054, -120356, -11366, 222589, 258856, 29345, -154531, -122407, -113791, 96131, -120739, -209513, -137885, -308300, 88312, -163679, -62413, -77829, -10774, -109288, 173020, -323897, -309025, 162378, 131480, 59962, 75925, -145852, 123346, 33731, -166243, -16690, 171971, -32522, -334552, 52261, -36809, 54465, 4334, 201772, -257202, 520, 4153, 180212, -150890, -46942, 295586, -72233, -60671, -102052, -295553, -108336, -126746, 214407]
11267a67991E3492a21698j8017B42827h6546o8216D47694a63891O6647a985k6802
11256b8787M136A84911c55120H4626i5888B6954a32442n2984Q8223l8267A73680
11244B20566k92o6189a03346A36248F1193f9373j31511B80021i8335K1533A64599
11232B09800b98693J11634d9782j53766C83393l0704b12027C6624M1501e2817
11221G0173b17579J05737B19026a69737M9400e5429k22631A32789b53575q2822
11211c36397e7253j82955f9070F0236a26250B75193j17015B9241P8999b31346
11200a97207C52295H4535i5777k31427B59324r9019c0244A14151b67273p6272
11190c43545C26355c59397K1418P7768A64310a34531k9993A4815b23202c1813
$$ y = [-167991, 53492, -121698, -139715, 242827, -86546, -154762, 447694, -163891, -97244, -1985, -28787, -24651, 184911, -355120, 84626, -95888, 26954, -132442, -185426, -97203, -135470, 173680, 220566, 220274, 154085, -103346, 136248, 61193, -69373, -200884, 280021, -98335, -76802, 164599, 209800, -298693, -187059, -49782, -203548, 383393, 352689, -212027, 36624, 78125, -52817, 70173, -217579, -111842, 219026, -169737, -120337, -55429, -278060, 132789, -253575, -336397, -57253, -240208, -69070, 60236, -126250, 275193, 158178, 29241, 108240, -231346, -197207, 352295, 84535, -95777, -327204, 259324, 160305, -30244, 114151, -267273, -343545, 326355, -359397, -337979, -260211, 164310, -134531, -164524, 14815, -223202, -31813]
11179a78038A09774j6569b83672G8490g06A9184a01557r0485B7793J72460I4630
11167A62696a37124B9990a39983a385k01428N3566k25731h9542C35885A62654
11156B07287b6474G7727b82877E0064c4862m701j8561A85699a58138H1043J31525
11145B12568C8025c82546a60942O4788k00117B47099a8329B88265D6428B384J06695
11134A09079a7078B05862j7804L9711p0500i2152K6923B85576j0925G6720K5079
11123A01799a60821G1550J71875b1702C2563b52665B58015a1777G3060J62058
11113B35118l2791Q7739F2701a77772A80656L2106Q0233r4134D6156L57712G7182
11101A05760C599J38579J78710K08487j7708j91763K51799B12530K6773J38280
$$ y = [-178038, 109774, 93205, -283672, 78490, -706, 19184, -101557, -192042, 27793, 200253, 94630, 162696, -137124, 29990, -139983, -1385, -202813, -149247, -374978, -89542, 335885, 162654, 207287, -26474, 77727, -282877, 50064, -34862, -39563, -58124, 185699, -158138, 81043, 212568, 38025, -382546, -160942, -96154, -296271, 247099, -18329, 288265, 46428, 2384, 109079, -17078, 205862, 188058, 227769, 157269, -92152, -65229, 285576, 274651, 76720, 101799, -160821, 71550, 243425, -21702, 32563, -252665, 258015, -11777, 73060, 235118, 202327, 290066, 62701, -177772, 180656, 212762, 292995, 198861, 46156, 403868, 77182, 105760, 3599, 142178, 320888, 529375, 511667, 319904, 571703, 212530, 239303, 377583]
11091C77583j31680q953A10754J64602I8917K34943p9369A16821J99925P5397
11081C92143J33108B20612J92568M6066j70745r617L58906k75270O555j62681
11071B06394J96599R6305j11488m5835L69629B62405Q9833K68498J44198J66935
11061I31869C53372J77442O165J48762r649J84287j01393Q0279K56508k60248
11051H35525K06562j35898M1148J3318L6644q2302o1244J79845l77491M99963
11041A156070k22523J42997J86408j01143j74386j56766j12754N71369m40812
11032H48460K88039l41073M7792J93337j25804J67188j12969l88063L07242j18524
11022G65625J34113l5669n5700L788p2800J81867r1650j13234o9963M2827K60853
$$ y = [377583, 245903, 236950, 110754, 275356, 98917, 333860, 254491, 116821, 316746, 392143, 525251, 220612, 413180, 459246, 288501, 278884, 637790, 362520, 369075, 206394, 402993, 499298, 387810, 341975, 711604, 262405, 352238, 620736, 764934, 931869, 353372, 530814, 536979, 685741, 676092, 860379, 758986, 839265, 1095773, 835525, 1042087, 906189, 947337, 960655, 997299, 914997, 853753, 1033598, 656107, 1156070, 933547, 1076544, 1262952, 1161809, 987423, 830657, 717903, 1289272, 848460, 1136499, 795426, 843218, 1036555, 910751, 1077939, 964970, 576907, 884149, 765625, 899738, 864069, 808369, 812157, 739357, 921224, 829574, 716340, 646377, 689204, 950057]
11011I50057k17317m261K99363k81345J72688k25895R2700j29933K05210L02415
11001A163682k86541k54859K27893K21513k85714J46883j00073j69872k09942
10992D52970L37838J66900r5446K40401k7905J97939n4271j67573J52022k7784
10982A175091J10783M54925N8423M0620R4036J03691K86917Q14710J65524P84871
10972D089591k09152L27384N75283k74214l10375l90622n90311p28893m57008
10963B031683k49588l76239l37644N01782j93679k77894Q1103j30968o3708l65332
10953F19516J01003j68930q9367P6606J34789e0386E33305C7891J01802J49141
10943B88834P3942L67032A19126Q7987N9958J4204A27682J99094o4954A176J73386
$$ y = [950057, 732740, 728479, 1027842, 746497, 919185, 693290, 785990, 656057, 861267, 1163682, 877141, 622282, 850175, 1071688, 785974, 932857, 832784, 662912, 452970, 790808, 957708, 862262, 1102663, 1074758, 1272697, 1218426, 1050853, 1202875, 1175091, 1285874, 1740799, 1799222, 1839842, 1933878, 2037569, 2324486, 3139196, 3304720, 4089591, 3880439, 4207823, 4783106, 4508892, 4198517, 3807895, 3217584, 2488691, 2031683, 1782095, 1405856, 1068212, 1569994, 1376315, 1098421, 1179524, 1048556, 984848, 619516, 720519, 551589, 462222, 538828, 673617, -50386, 533305, 37891, 139693, 288834, 362776, 729808, 119126, 207113, 267071, 281275, 127682, 326776, 261822, 1176, 174562]
10932A74562O0413C475L35149N6038B6201J69693J78940j02012R7971A66961a25994
10920I7033f9191j16747k9313A16304J4776c76098A23692f0392j75652b300k9959
10909c2259H2106b81758B51640H932e5109p8515A45574f8903K5084B0646K29432
10898B50078B2040N4871K1856I441a50606G4254N0774a05126E8526R7376F4682
10886c3096A5736a82600d311H5916R0231F1220J71581D8372i8094K6455G8740
10874a94154n2229j03481a20671j79351H4426a95312A32658J73039a69113F3322
10863e7426j687n3964A53263K03034b0564r9144B2469K75904C6266K94032f705
10851A3326a229k39627A104a73064j8033A79062a43711l16604A2577c2956n7465
$$ y = [174562, 234975, 3475, 338624, 394662, 26201, 195894, 374834, 272822, 370793, 166961, -125994, 97033, -69191, -185938, -215251, 116304, 131080, -376098, 123692, -60392, -236044, -2300, -32259, 82106, -281758, 251640, 8932, -55109, -133624, 145574, -68903, -43819, 20646, 250078, 22040, 76911, 98767, 9441, -150606, 74254, 125028, -105126, 58526, 155902, 64682, -33096, 15736, -182600, -4311, 85916, 176147, 61220, 232801, 48372, -98094, -71639, 78740, -194154, -246383, -349864, -120671, -300022, 84426, -195312, 132658, 305697, -169113, 63322, -57426, -59113, -113077, 153263, 356297, -20564, -119708, 22469, 298373, 36266, 330298, -6705, 13326, -1229, -240856, 1104, -173064, -191097, 179062, -143711, -460315, 12577, -32956, -90421]
10840i0421p8446m0238o7558A49285c26821A0233O4990j3872d7338J5581c348
10828F5487L5053b44598H4427a17501A32478b61552d9532A2408J12754b71924
10817b5061k51105F7473J1279A1949R323m69b12366B0276c35662J30673A51069
10805A57452E7205c97025J62356E6844K8483a98915m2491I230M0040a91419A06377
10793f6261H1498Q292a22359C05274a27952N1994j12333B14261b19387Q1807B97438
10781C2423K5609B1364J87837b6619G8157g3106F3693h924j40466P2634h083j05043
10769a13126c1368I7516a60316L8699j08694i5323j44448A30586k2193C5935c9794
10757A61252D8658a62069j42221F868b68069d3301C1447a83983q1569B41572J42290
$$ y = [-90421, -168867, -209105, -276663, 149285, -326821, 10233, 75223, 61351, -47338, -31757, -3348, 65487, 100540, -244598, 84427, -117501, 132478, -261552, -49532, 12408, 125162, -271924, -25061, -276166, 67473, 78752, 11949, 21272, 20803, -212366, 20276, -335662, -204989, 151069, 157452, 57205, -397025, -234669, 56844, 85327, -198915, -241406, 9230, 49270, -191419, 106377, -66261, 81498, 89790, -122359, 305274, -127952, -75958, -188291, 214261, -219387, -137580, 297438, 32423, 58032, 21364, 209201, -26619, 78157, -73106, 63693, -8924, -149390, -76756, -8083, -113126, -31368, 97516, -160316, -121617, -230311, -95323, -239771, 130586, 108393, 35935, -39794, 161252, 48658, -162069, -304290, 6868, -268069, -43301, 31447, -183983, -265552, 241572, 383862]
10746C83862c71859J18005a09041A24878n9960a34521B8785a09642C68927b47044
10735a02857C40341J04743A05059a25491A91915J9164b03857A97374g0840E4517
10724g1804C1244Q9525b9988k7545j65512d2024G9068a18855C78411H3327a372
10712B9205e9746A2099a76819f7812A34227c71692G803K68447J2068a40831A59613
10700a5278l13422J47094B66684A32017c01550a1485C14988a50896C4303b7009
10689I9238o705f0706j34047o847K7653A92721c47862a15444A97111b14312C6166
10677a91763D4087k1562J90809a09534e2084A16099f3249K905j02376P1558a3659
10665b59421C5354a01667j3527a210r31A22768A3293O4725a65448b6617B1166
$$ y = [383862, -371859, -253854, -109041, 124878, 64918, -134521, 28785, -109642, 368927, -247044, -102857, 340341, 445084, 105059, -125491, 191915, 211079, -203857, 197374, -70840, 54517, -71804, 31244, 120769, -29988, -57533, -223045, -42024, 79068, -118855, 378411, 83327, -1372, 29205, -59746, 12099, -176819, -67812, 134227, -371692, 7803, 276250, 288318, -140831, 159613, -15278, -328700, -181606, 266684, 132017, -301550, -11485, 314988, -150896, 34303, -27009, 99238, 92533, -60706, -194753, -201600, -173947, 192721, -347862, -115444, 197111, -214312, 36166, -191763, 44087, 22525, 213334, -109534, -52084, 116099, -63249, -60344, -162720, -91162, -13659, -259421, 35354, -101667, -115194, -1210, -2141, 122768, 13293, 78018, -165448, -26617, 21166]
10653i1741A93729c2957O752k8933m01497e6049B9416J80762d6569F6791c8151
10641g7831A00472C3693a19209k74538D1342e8907q664A28795J78727i2228m9774
10630a42002j8265D4447a02812j12066i5185a0098A74304C730e4548j93903B36873
10618C035a7751o5175A06732l3116c2939I6558b69861P03J24825A48351m3058
10607A05293L64837a36576j11227B16348b57451B82713C9623e30237b49458A42932
10596A20598b45194e4203j89710f3213k42012B06681B708a39421g775F2827K8540
10585I1367K9144a31153e4802B29614I5451b06713J01984d530m17738B5757Q9249
10574A15006i7118B1429c6307k7242C33554E8308k1910K30800h4148k1351A05590
$$ y = [-91741, 193729, -32957, -26205, -55138, -456635, -56049, 29416, 210178, -46569, 66791, -38151, -77831, 100472, 33693, -119209, -393747, 41342, -58907, -67571, 128795, 307522, -92228, -142002, -160267, 44447, -102812, -214878, -95185, -10098, 174304, 3730, -54548, -248451, 236873, 3035, -17751, -82926, 106732, 73616, -32939, 96558, -269861, -269158, -144333, 148351, 105293, 470130, -136576, -247803, 216348, -257451, 282713, 39623, -530237, -249458, 142932, 120598, -245194, -54203, -243913, -63213, -305225, 206681, 2708, -139421, -7775, 62827, 91367, 120511, -131153, -54802, 229614, 95451, -206713, -104729, -4530, -422268, 25757, 115006, -97118, 21429, -36307, -63549, 333554, 58308, 36398, 267198, -84148, -105499, 105590]
10562i2038j411K900L4830p9323C13204r6353G2127B8046G812c15986G9933b26750
10549I758J38193D1303d4287m8097A3473a97408M1070M8094J3546l4548a1260
10537D4177a85121B3479J66516Q8288A08381R7021E8996f9753C9439Q2006h0103
10525F7484k9236g6159j37176a0840k94057n970h594j61460I792a64073F8973
10513f5319K7329E4331a33922A02659a6171A16943J54748A0269J5052i3845k2120
10502a15965N2275n3895F732M156c3764A47378C4252a71641B30851D5540a48502
10490C7686a86729A19527e0633n1127G3177f2190d003G2432b73453g9862i386
10478b27855a2627B31734a73064J9164I443L19729e5097A58091j0918e7917j11455
$$ y = [-92038, -93449, -90549, -55719, -135042, 313204, 216851, 72127, 28046, 7812, -315986, 79933, -226750, 9758, 147951, 41303, -44287, -92384, 13473, -197408, -156338, -108244, -94698, -129246, -11260, 44177, -185121, 23479, 189995, 278283, 108381, 205402, 58996, -69753, 39439, 121445, -80103, 67484, 38248, -76159, -213335, -10840, -304897, -310867, -8594, -170054, 9792, -164073, 68973, -65319, -37990, 54331, -133922, 102659, -16171, 116943, 271691, 10269, 25321, -93845, -115965, -63690, -117585, 6732, 10888, -33764, 147378, 34252, -171641, 230851, 45540, -148502, 37686, -186729, 119527, -50633, -101760, 73177, -62190, -4003, 72432, -273453, -79862, -9386, -227855, -12627, 231734, -173064, -153900, 9443, 329172, -55097, 158091, 147173, -57917, -169372]
10467a69372A33279A0818c1424C8874g3822B02905P3283a25759E962c0397j40384
10456a70781r2213K3927m1722F0974b96604c1867j1235A2046J29531L2568g3446
10444a23896b282B62032i348A62953o4605J8805a10528I9204P0240a78400c5879
10432G7716a18780C22751k9615a63659C05106a5340k312q7330L182k91465H4375
10420A10360b16551j25081B23484g6759q9860O880B5479b4044j7612E1892n7J38386
10408A90221a21956k0848N9684A15833c11848C4077a41214C40276n7109a78306
10397A75891e1273E4642d9235n6689B0331K68208F7364c1875C26938H4647J18962
10386B03609J7251F4534l1431a04722M5978B25933G5150L0481d1511D12630k02151
$$ y = [-169372, 133279, 10818, -31424, 38874, -73822, 202905, 276188, -125759, 5962, -30397, -170781, -262994, -239067, -280789, 60974, -296604, -31867, -43102, 12046, 141577, 174145, -73446, -123896, -2282, 262032, -9348, 162953, 98348, 117153, -110528, 99204, 169444, -178400, -35879, 77716, -118780, 322751, 293136, -163659, 305106, -15340, -17652, -104982, -101800, -393265, 84375, 110360, -216551, -341632, 223484, -76759, -166619, -159739, 25479, -24044, -41656, 51892, 51835, 190221, -121956, -142804, -83120, 115833, -311848, 34077, -141214, 340276, 283167, -178306, 175891, -51273, 54642, -49235, -105924, 20331, 288539, 67364, -31875, 326938, 84647, 203609, 220860, 64534, 33103, -104722, -58744, 225933, 75150, 105631, -41511, 412630, 210479]
10375B10479k4263K20087q3893A13877J46773K23029J33617C08560J30745m6701
10365C92604K99685R6332k70277k43503K02898K2836k0043k33712J60042o0900
10355C45962M405A16944N56093l03475M34435k2418J3676C35604j44644K90176
10345D81136m8449B783M50654A08114J95120L1562q7393J39226l3327F3608K39609
10334C03217I6629B7438J27630a16301j21581C51777a94612D3460f6104A68264
10323B77618p6733J1518L9819J90287o4469B0897R9844Q3218J42709C0636b08536
10311b8226j45450k15106D9359J15250D4297b6118a2554A18935K32821C151a09195
10299i5526E1522I727a90490A94481G590h1113A11262P9888o66c5808B2784J15243
$$ y = [210479, 186216, 406303, 322410, 113877, 260650, 483679, 617296, 308560, 439305, 392604, 692289, 788621, 518344, 274841, 477739, 500575, 480532, 246820, 406862, 345962, 350367, 116944, 673037, 369562, 803997, 781579, 795255, 335604, 190960, 481136, 432687, 2783, 453437, 108114, 303234, 334796, 247403, 386629, 353302, 63608, 303217, 96629, 27438, 155068, -116301, -237882, 351777, -194612, 43460, -66104, 168264, 277618, 200885, 212403, 252222, 442509, 378040, 20897, 120741, 203959, 346668, 30636, -208536, -28226, -173676, -388782, 49359, 164609, 44297, -26118, -12554, 118935, 351756, 3151, -109195, -95526, 51522, 9727, -190490, 194481, 7590, -81113, 111262, 191150, 190484, -35808, 22784, 138027]
10287A38027m550e723C8436i0007a0244K129I4913a67038O1923k70501B16117
10275e5906b659A23676H128N35947a89447i2079n7874A01896L4046J67255e35101
10263H3144b49871c5061A97021L792d3147B10926o8644N8506b992F6007j3012
10252E2995d726j7075k18368R1852J5339k63590a5461l0198A493J4275K22757
10241B38525D2674a55655A58368a71908b0114A758b63731C10678q2852c61085
10230c8118o7244k27513c0606o5981k65472H6759k7251b75536L8966j7727f009
10218A55328b92105B92887d5019l1179A17461L7981p3378d2308r4477m5374P5845
10207a06314H4581J15228b71463a3344G1238J32489E0495a63845l1663L7175c6361
$$ y = [138027, 133477, -5723, 38436, -90007, -10244, -8115, 94913, -167038, -105115, -375616, 216117, -55906, -2659, 123676, 8128, 544075, -189447, -92079, -149953, 101896, 135942, 303197, -535101, 83144, -249871, -35061, 197021, 200813, -43147, 210926, 142282, 200788, -2992, 66007, 52995, -4726, -21801, -240169, -148317, -132978, -396568, -15461, -45659, 1493, 15768, 238525, 42674, -155655, 158368, -171908, -20114, 1758, -263731, 310678, 227826, -361085, -38118, -105362, -332875, -30606, -96587, -362059, 86759, 59508, -275536, -236570, -254297, -6009, 155328, -292105, 292887, -45019, -76198, 117461, 155442, 82064, -42308, -136785, -182159, -106314, 84581, 199809, -271463, -13344, 71238, 203727, 50495, -163845, -195508, -158333, -36361]
10195E0404b00303G3331a0512j14345D2713L9239K2052J1346a07236J7699A1489
10183a60204A17152J66029a68046G4911f7017F2296a44512b5550j98671J01128
10173a23093d5102K869j28922C3336a40146c9408j40099g1576n08K9377m04474
10162d47181B591f480j90792d7052A64067E3389a71320C43552C1245a61547e6086
10150b02249j70240N2649Q9413D6084J80162n5129Q287A3662K63718j06996K166
10139A72550o9338a28015N1874J9646j08817L3839j48259B3869J41993a37801
10128a79978G6187a95612b6777C56914c03185P3136A21865J59828a96792B03259
10117a585j56557A0187c58332a35163d3151P019k4734l9521k8390G7619N2172
$$ y = [50404, -200303, 73331, -10512, -124857, 42713, 81952, 104004, 115350, -107236, -89537, 11489, -160204, 117152, 283181, -168046, 74911, -67017, 62296, -144512, -25550, -224221, -123093, -45102, -42233, -171155, 33336, -140146, -39408, -179507, -71576, -72084, -42707, -447181, 2591, -6480, -197272, -47052, 164067, 53389, -171320, 343552, 31245, -161547, -56086, -202249, -372489, -319840, -230427, 46084, 226246, 171117, 179404, 13662, 277380, 170384, 172550, 103212, -128015, -76141, -56495, -165312, -131473, -279732, 23869, 165862, -137801, -179978, 76187, -195612, -26777, 356914, -303185, -230049, 121865, 281693, -196792, 203259, -1585, -158142, 10187, -358332, -135163, -43151, -36132, -60866, -100387, -128777, 77619, 129791]
10106A29791c43105C95320g840ej21181B26271B1341J75660a77972d3923j63115
10095b07038A41894N1372c4933l5590j3113J7776A84625c2008j4023A19659c20447
10083c30962A24905b08140H4685B1877a53648k7894A40714b8520B0880K16569
10073B37449b65331e3659A84396q5179e64j11622A23244R7715o5267b1505k16008
10062b37513h6021J9746D0959c22384B9692d7044A91518a6149r8259A34758N6246
10051A91004C6288Q8465a98187j51695A03182a09307H4931L21439a7432j00984
10041a18416D5511R2105F7102d23173a14350A3640a92780i3627L7806f883j58032
10030a64915M0338d574k48618J16073k509C4129a32741M3029q0590m6809L3037
$$ y = [129791, -343105, 395320, -7840, -5, -121186, 226271, 21341, 197001, -177972, -43923, -207038, 141894, 193266, -34933, -70523, -83636, -65860, 184625, -32008, -46031, 119659, -320447, -330962, 124905, -208140, 84685, 21877, -153648, -181542, 140714, -28520, 20880, 237449, -265331, -53659, 184396, 99217, -564, -112186, 123244, 220959, 155692, -21505, -237513, -86021, -66275, 40959, -322384, 29692, -47044, 191518, -16149, -114408, 134758, 191004, 36288, 124753, -198187, -349882, 103182, -109307, 84931, 406370, -17432, -118416, 45511, 137616, 67102, -423173, -114350, 13640, -192780, -93627, -55821, -6883, -164915, -124577, -4574, -253192, -137119, -139628, 34129, -132741, -89712, -170302, -217111, -184074]
10019a84074L4795m1003A83251D4360J55427b52440L9296m0305g4481G6101e5166
10007F3256j2004F228k906d98229e4859o184j001j61244q8816a13349j4539E1911
9994D3373K39716B875d347j28946b715p1798J9002j73087J4097i9731j44051J16609
9982a27173G6366i0216G2344J11263q707a46219c9480A76069f1834A6740d31779
9970A03280i6798b0095E1241h2280k76712J24361N7686A98282a69260D4389c82691
9958f8413n9786K5184L1183A17334J37168B6569J93003F1547L39312a64899B336
9946A49515a04243k61982R3280P3942e5927j40729D1131J8165K08143b63207e0405
9934a53024G8008f280F3197b71714M5948Q9128f5229j19006m1985f2932A64210
$$ y = [-184074, -149279, -190282, 183251, 44360, 199787, -252440, -213144, -253449, -74481, 76101, -55166, 63256, 51252, 6228, 3322, -498229, -54859, -61043, -62044, -223288, -312104, -113349, -127888, 51911, 43373, 283089, 2875, -4347, -133293, -2715, -74513, -55511, -228598, -214501, -99731, -243782, -127173, 76366, -90216, 72344, 183607, 174900, -146219, -39480, 176069, -61834, 16740, -431779, 103280, -96798, -20095, 51241, -82280, -358992, -234631, -176945, 198282, -169260, 44389, -382691, -68413, -128199, -103015, -71832, 117334, 254502, 26569, 219572, 61547, 400859, -164899, 2336, 149515, -104243, -366225, -272945, -199003, -55927, -196656, 41131, 59296, 267439, -263207, -50405, -153024, 78008, -6280, 63197, -271714, -225766, -136638, -65229, -184235, -226220, -62932, 164210]
9922a22859b5977k46718B27164a2039E8500a07162j11380A53023E04c36347A9368
9910G7429b23500A03705B6016a84046j38694e5874A5342b76238K26o1353J14488
9899b22877C8973J53260G817J5244h7886j71366j29722a23035a7964o837k31544
9888b56345A1521f7155F9044a8714j26934N1188j29830j7359R5517j1433j78237
9877c35802G0914K77371a46491j43002R023J21710D1854a47863A0389J00882f0811
9865d5446j88673N7530j10912g3676k80739C06387d0868k23098A45446j3223o3663
9854F8560J40623D5661a23923D613b32022P1265b5180p7279L522b012A04004a79074
9841a51868j86661l7620a03458F515L3013J25395c98736a16937I3018l7164L1468
$$ y = [-122859, -25977, -272695, 227164, -12039, 58500, -107162, -218542, 153023, 504, -336347, 19368, 77429, -223500, 103705, 26016, -184046, -322740, -55874, 15342, -276238, -276012, -337365, -222877, 38973, 192233, 7817, 23061, -87886, -259252, -388974, -123035, -17964, -24801, -256345, 11521, -67155, 69044, -18714, -145648, -94460, -224290, -241649, -146132, -157565, -335802, 70914, 348285, -146491, -289493, -280470, -158760, 41854, -147863, 10389, 111271, -60811, -45446, -234119, -176589, -287501, -73676, -354415, 306387, -40868, -263966, 145446, 132223, 68560, 209183, 45661, -123923, 4613, -232022, -160757, -25180, -102459, -98937, -2012, 104004, -179074, -151868, -338529, -376149, -103458, 6515, 39528, 164923, -398736, -116937, 93018, 55854, 87322]
9830H7322B3166g0323A81803c7857k5357k02447a5433j78818F7678a36890A42565
9818C26061h7278F0172k8620c10313A13650b11149m8333N4429i3104d3990l5464
9807g9454a3598n20139G6600k1237K38703b22131d1679j11683j55027q5949J26533
9796b67805M6366a0512A17365a67395c988k27k56136J14004q9590j30540f0656
9784a78800K673P4119H8517l9227d41089e7946J0543C5040J13842n3746a59600
9772a53814D4764f6018a0600j31557A52281F3103a24041k49178F6768a11024j71228
9761b82252Q2736R8258B8255a35512c8565I8358K6279a55071L8273M4921b0650
9749f5765l6104K2596A45985a12506o254C0938f547D2286J52860a63879A75328
$$ y = [87322, 23166, -70323, 181803, -37857, -63214, -265661, -15433, -194251, 67678, -136890, 142565, 326061, -87278, 60172, 31552, -310313, 113650, -211149, -259482, -205053, -93104, -43990, -79454, -13598, -533737, 76600, 55363, 294066, -222131, -41679, -153362, -308389, -394338, -267805, -221439, -10512, 117365, -167395, -3988, -4215, -260351, -146347, -235937, -366477, -60656, -178800, -176127, -102008, 88517, 49290, -441089, -57946, -47403, 35040, 148882, 95136, -159600, -153814, 44764, -66018, -10600, -142157, 152281, 63103, -124041, -373219, 66768, -111024, -282252, -199516, -101258, 28255, -135512, -38565, 98358, 124637, -155071, -116798, -71877, -20650, -65765, -101869, -79273, 145985, -112506, -118760, 30938, -6547, 42286, 195146, -163879, 175328]
9737G3362e1633A73769E4003d65790N5683J34150a8200k24225i4098A75329A8025
9725i6177A3549J7713K47871H5073a59506l29373b19563N2681E0053P1243m6228
9714G5068a5538G9917K63363d1647k69442A14070D8593R3241k9874J7902b80823
9702C8204a47608A05043D7226B1454J12352j4344m1259c40915p1119C1639h8251
9690b93098N1163A49716A9845b17498D2452b44910a15070b4901n197A43295b37675
9678g6085a0207m08069A53483M0896K5372d5341n47349A38176a0863A26599f8045
9666B74382f4502k4907q0097I879J12280a28823A34625N8839E2782h6517k89736
9655c76253G956g1063A4037Q9100A9714b11446Q3811F4484i5027j31456D1660
$$ y = [73362, -51633, 173769, 54003, -465790, -410107, -275957, -18200, -242425, -94098, 175329, 18025, -96177, 13549, 31262, 279133, 85073, -159506, -488879, -219563, -166882, 50053, 121296, 75068, -15538, 79917, 343280, -41647, -311089, 114070, 48593, 141834, 111960, 129862, -280823, 38204, -147608, 105043, 47226, 21454, 133806, 119462, 78203, -340915, -412034, 31639, -88251, -293098, -241935, 149716, 19845, -217498, 42452, -244910, -115070, -24901, -30098, 143295, -237675, -76085, -10207, -418276, 153483, 194379, 219751, -45341, -592690, 138176, -10863, 126599, -68045, 274382, -64502, -89409, -169506, 9879, 122159, -128823, 134625, 193464, 52782, -86517, -376253, 7956, -71063, 14037, 103137, 19714, -211446, -127635, 64484, -95027, -226483, 41660]
9643a78912k00173P1682a35542B6907a17860I1791g4152K273l16790B6989M2022
9632F9011a04886F1632a32042H5642b2690G2028a94368D2957e11791A92246c98730
9620A3654a12782A9064o045J821a58766A83587k1806o2863b86192l2213f7861
9608C6333F417a37196d5022B24492a7569A08517l2816d578p4394J4690B60803
9596I9212a34714k45518A47478A5180J05346a61348n715l17429K22972Q6162P2272
9585a03086o1712A44888l7175c37062a19879A88190b07109k5609M2607A8921b51434
9573A46629B2696i6979C4930b66549A13700B1269f6080q7981j2903B9982b46276
9561A69696a25896o3671O6169B36380g3236I1514a98535I8143m0877a91372k1306
$$ y = [-178912, -379085, -307403, -135542, 26907, -117860, 91791, -74152, -71879, -388669, 26989, 69011, -104886, 61632, -132042, 85642, -22690, 72028, -194368, 42957, -511791, 192246, -398730, 13654, -112782, 19064, 13019, 14840, -158766, 183587, 161781, 98918, -286192, -318405, -67861, 36333, 6417, -137196, -45022, 224492, -17569, 108517, 75701, -4578, -78972, -64282, 260803, 99212, -134714, -380232, 147478, 15180, 120526, -161348, -167063, -484492, -261520, -175358, -103086, -164798, 144888, 107713, -337062, -119879, 188190, -207109, -232718, -190111, 18921, -251434, 146629, 22696, -96979, 34930, -266549, 113700, 21269, -66080, -154061, -166964, 29982, -246276, 169696, -125896, -189567, -123398, 236380, -73236, 91514, -198535, 98143, 57266, -191372, -212678]
9550b12678A42955E375b15787l9904c2178A5679L27766e2560A23583P398l3738
9539I7243a92281o8032M8093A51487a26040K1009d1369j08657A9021M19129A02297
9527B6615b99910G5074J15646c36718J01392F309a40706k92091A52050a56138
9516c9283g664m05q8595j34974K5643k53853Q8330h9692A0401K37559f2712j92617
9504b55329A42535B372i6270n8594p2577b8414A0241b62721m3561G9802f9839
9492C36410j33050m4660C198b25101h5382A00853a66838b8953j14099D3542J33160
9481A76702L896b55810e7422j39812B89253H2991c25478A54134j4354a12262I7170
9469a74666E9229c85989Q6125E3902a39934o4577H8325C7543b33522F2904a51136
$$ y = [-212678, 142955, 5375, -215787, -255691, -32178, 15679, 343445, -52560, 123583, 130981, 97243, -192281, -260313, -212220, 151487, -126040, -105031, -41369, -150026, 19021, 438150, 102297, 26615, -299910, 75074, 190720, -336718, -235326, 6309, -140706, -432797, 152050, -156138, -39283, -7664, -8069, -96664, -231638, -205995, -459848, -371518, -89692, 10401, 247960, -62712, -255329, 142535, 2372, -96270, -154864, -227441, -28414, 10241, -262721, -306282, 79802, -69839, 336410, 203360, 158700, 3198, -225101, -85382, 100853, -166838, -28953, -143052, 43542, 176702, 180598, -255810, -57422, -197234, 289253, 82991, -325478, 154134, 139780, -112262, 97170, -174666, 59229, -385989, -299864, 53902, -139934, -204511, 88325, 37543, -233522, 62904, -151136]
9457b26719A18367a97963F8353E010a72826K5733j10987h9188c9543A87266d5956
9445B19559a98645B39446B9933G142a33234r1451k2851H7420b23150B04085a24217
9433c23934a29393c2903k3740A07525b66553A97165c6794j29532M1765J0833k72551
9422c86279A32284P4260F6978Q8456a49190d7011k83252B19152B5039a36009r7491
9411b33500Q7044B19269a4309l79132J04110a16392j66006A4404a29270A73785
9400A23451g0043B34547c5577k40682f0685B50606D1570b88820A456J64917c94495
9388a46116a0738F6485A8519a56093B08641b24339A46680R9202j14491J51369
9378B82760H3460g0400b8696j10219e6782K5840l0226B29105b62495j36090a24824
$$ y = [-226719, 118367, -197963, 68353, 5010, -172826, -147093, -258080, -89188, -39543, 187266, -45956, 219559, -198645, 239446, 29933, 7142, -133234, -224685, -247536, 87420, -223150, 204085, -124217, -323934, -129393, -32903, -56643, 107525, -266553, 197165, -36794, -166326, -124561, -113728, -386279, 132284, 206544, 66978, 155434, -149190, -47011, -330263, 219152, 25039, -136009, -233500, -146456, 219269, -14309, -393441, -289331, -116392, -282398, 14404, -129270, 173785, 123451, -70043, 234547, -35577, -276259, -60685, 250606, 41570, -288820, 1456, 166373, -394495, -146116, -10738, 66485, 18519, -156093, 208641, -224339, 146680, 245882, 131391, 282760, 83460, -70400, -28696, -138915, -56782, -30942, -61168, 229105, -262495, -398585, -124824]
9366b93499H6133b66167A30610P6327d5916F9909e7345C9841a58043q8000L1752
9355b14291I6370A8721K24812H5230a21223j5119j1033C88308b0997m3931j0473
9344g5401L4672j87080A23613f6928j88215d4821k91991O5319m2550h4514E5119
9332A23573J75609h9252k68537J76401e790q0840j53827i202D4782b90294J12364
9321a77930Q8640E1715a32807q5884D6506K19908a33347j65444a12649D75a30074
9309b87449A28844a46280F11710a48329H0536b5493a0569j27033B9641a77548
9298c45686a59028B20821e2355i688j23043k0886j93958a61281d0117j13571b1196
9286D2541b8379k1631a5043B34662m8868K519o4261a76320E088g3051b2323k7133
$$ y = [-293499, 86133, -266167, 130610, 206937, -45916, 69909, -57345, 39841, -158043, -246043, -214291, 96370, 18721, 243533, 85230, -121223, -136342, -147375, 388308, -20997, -64928, -75401, -40729, -227809, 123613, -66928, -255143, -44821, -336812, -271493, -314043, -84514, 55119, 123573, 299182, -89252, -357789, -181388, -5790, -86630, -240457, -9202, 44782, -290294, -177930, -89290, 51715, -132807, -218691, 46506, 266414, -133347, -298791, -112649, 475, -130074, -287449, 128844, -146280, 611710, -148329, 80536, -25493, -10569, -137602, 29641, -177548, -345686, -159028, 220821, -52355, -9688, -132731, -153617, -347575, -161281, -40117, -153688, -21196, 42541, -28379, -50010, -15043, 234662, 185794, 188313, 124052, -176320, 5088, -73051, -22323, -49456]
9274d9456C0718e95876H5118a85086B2952P7590f27472K02962a15565B67220a38911
9262b20462f4680j14911A91053e7413A15179a6621r1000B36377f1957j63981A36367
9250B2457K9961K53268J14754A38994F7955b20696A69649h167j61267E5771h2956
9238A7671a4197r9827l2859C07682B1390a8004q9253m3965M4040k71646F2436
9226a21453A58052K9001a3824l424M986k05897A9630f8103A27153f8162k60293
9215c28455E0595f9734n4403J2789b1767j74798n0953h2672B53140p7709a3789
9203h3857k2615C4845J68424a9487A90131C4227a00848a8784k55146i7425m41760
9192e39185e9772k33083J23002L3873o238e0346k4322a4604j09102l1033A8094
$$ y = [-49456, 30718, -595876, 85118, -185086, 22952, 100542, -627472, -424510, -115565, 267220, -138911, -220462, -64680, -179591, 191053, -57413, 115179, -16621, -107621, 236377, -61957, -225938, 136367, 22457, 52418, 305686, 420440, 138994, 67955, -220696, 169649, -8167, -169434, 55771, -82956, 17671, -14197, -114024, -146883, 307682, 21390, -18004, -107257, -151222, -107182, -378828, 62436, -121453, 158052, 187053, -13824, -17248, -12262, -218159, 19630, -68103, 127153, -68162, -328455, 50595, -69734, -124137, -111348, -21767, -196565, -247518, -82672, 253140, 175431, -13789, -83857, -106472, 34845, 203269, -19487, 190131, 34227, -100848, -18784, -273930, -97425, -539185, -59772, -292855, -169853, -135980, -142218, -50346, -74668, -14604, -123706, -154739, 18094]
9180B58644j04441a3412j92553o4041A68996C7667h6389A22333b15091k4407H065
9168g7710D3778f03086A2098c7995B81918a06872m8003F0580P6404o0834a75979
9156b12397J04765J1645l3359n0405m6261R5287k19076J10056J9238K8242e1038
9144a18765c1398H7658b59739c7949a397r4098k23423D9102d6371E7617a7253
9132i8355q1544k91677J21406B976J943c19602P9526F6301a00867r9635d6181
9120g8999k26319k5177a29407I7704Q2577a49239a4783l1152l5556j68256C45193
9108E1151a10637m2096g2453l2763q079O889A76297M5159b03923A04895h9461
9096C7739L05961b69932i3442c1514B5845K43236a46094C3858a97236d3764m89267
$$ y = [258644, 154203, -13412, -205965, -270006, 168996, 37667, -86389, 122333, -215091, -239498, 8065, -77710, 43778, -603086, 12098, -37995, 281918, -106872, -154875, 60580, 136984, 76150, -175979, -212397, -107632, -95987, -129346, -179751, -226012, -130725, -349801, -239745, -220507, -192265, -51038, -118765, -31398, 87658, -259739, -37949, -1397, -95495, -318918, 49102, -46371, 57617, -17253, -98355, -179899, -471576, -350170, 2976, 4919, -319602, -240076, 66301, -100867, -200502, -46181, -78999, -305318, -330495, -129407, 97704, 180281, -149239, -14783, -45935, -81491, -249747, 345193, 51151, -110637, -152733, -72453, -105216, -113295, -106406, 176297, 221456, -203923, 104895, -89461, 37739, 343700, -269932, -93442, -31514, 25845, 269081, -146094, 33858, -197236, -43764, -533031]
9085e33031a53074f1318I1162O2330a16532r2360A884a64781L8054n5772g9733
9073D09522c01591C6531a90694G0685a05478E0179a78555b9717A29844b79664
9062F1254j4243L3368b12600Q4057L0668B03361f1290A00960a74145F6896c461
9050B27251a90168j48854R8624B09712m7703a3077B73508A01566D4581h2087I9515
9038b39406g2040p8319B78748d3986j47354j36125J27496B25925a2410k70006
9028b82416R7270k7015b3211l18027C5256a22776H0181a68435A8105c9612E877
9016e6201a4711D3344g7967A33083F4036c39400f3865I4754A4208J5002L8959
9005F8169a82170e342j59617e3805E8838a65924c0872q3284G2082a4470p3325
$$ y = [-533031, -153074, -61318, 91162, 153492, -116532, -208892, 1884, -164781, -126727, -182499, -79733, 409522, -301591, 36531, -190694, 70685, -105478, 50179, -178555, -29717, 129844, -279664, 61254, 47011, 80379, -212600, -128543, -97875, 203361, -61290, 100960, -174145, 66896, -3461, 227251, -190168, -339022, -240398, 209712, 162009, -13077, 273508, 101566, 44581, -82087, 99515, -239406, -72040, -150359, 278748, -43986, -191340, -327465, -199969, 225925, -12410, -282416, -185146, -212161, -23211, -341238, 35256, -122776, 80181, -168435, 18105, -39612, 5877, -56201, -14711, 43344, -77967, 133083, 64036, -339400, -63865, 94754, 14208, 29210, 68169, -182170, -5342, -164959, -53805, 58838, -165924, -30872, -114156, 72082, -14470, -87795]
8994h7795a4656A16864d19566L8845J33000A10447D6327L7950c10371d4456l050
8983d7506l0315j2318K8532A26023a37602G1235c0211A9569L16391c0422l8153
8972f8575j6942r3066I8105b15388B4364J65949D8604a62364j06201a21922H3964
8960a59750f9735A34873c08224a08760n7296A45750a96598N44e9440m03688A0229
8948i8087A6153L7852i7201n9332k54165P4897A10887k4164e4216k43376A4136
8936A25798l3713P71838C11920f5883A63231O3644a37109L3658B60198F0750L47480
8925D08230L01304L22193K631964Q368363M28820C562622F23056J01835F5775
8915D84344B7066J05246N5944n524O9524a20848C10430J03464A20877c8083G7365
$$ y = [-87795, -14656, 116864, -419566, -380721, -247721, 110447, 46327, 84277, -310371, -44456, -47506, -77821, -90139, -61607, 126023, -137602, 71235, -30211, 19569, 335960, -30422, -68575, -85517, -178583, 98105, -215388, 24364, 190313, 48604, -162364, -268565, -121922, 83964, -159750, -69735, 134873, -308224, -108760, -166056, 145750, -196598, -196054, -59440, -463128, 10229, -98087, 16153, 54005, -97201, -156533, -410698, -335801, 110887, 86723, -54216, -297592, 14136, 125798, 92085, 863923, 311920, -65883, 163231, 226875, -137109, -103451, 260198, 60750, 408230, 709534, 1031727, 3663691, 12032054, 12460874, 3562622, 623056, 724891, 65775, 484344, 27066, 132312, 188256, 182732, 252256, -120848, 310430, 413894, 120877, -38083, 77365]
8903A49428a6963A75498a05570j10653A12842b38670b8914r3193A17110J69687
8893B86797e2091g495n48745i1333j75671N4093H585K60177a4642A55260n6907
8882I8353a02289k24619R9316A82099m6075c49439a620j16172A40116F0575r893
8871E0682K5084L9558a24961l9874H8341a48254j21055a22021d0075k07574k8268
8860b75917d5706j16459L7113j20295D1129J2067c58912f8210j52203o606C1004
$$ y = [149428, -16963, 175498, -105570, -216223, 112842, -238670, -28914, -122107, 117110, 286797, -52091, -7495, -556240, -91333, -267004, -212911, 8585, 268762, -14642, 155260, 98353, -102289, -326908, -227592, 182099, 136024, -349439, -1620, -117792, 140116, 60575, 50682, 75766, 115324, -124961, -164835, 88341, -148254, -269309, -122021, -40075, -247649, -275917, -45706, -162165, -125052, -245347, 41129, 53196, -358912, -68210, -220413, -227019, 31004]
$$ [...]
##END NTUPLES=NMR SPECTRUM
##END=
