
##TITLE=AC1344_CHILS11171_6647394_hvHdWUDuJO
##JCAMPDX= 6.0         $$ Bruker NMR JCAMP-DX V2.0
##DATA TYPE= NMR SPECTRUM
##DATA CLASS= NTUPLES
##ORIGIN= BRUKER
##OWNER= Administrator
$$ 1.72 TOPSPIN		Version 2.1
$$ 2012-08-11 00:15:21.250 -0500  Administrator@TOPSPIN
$$ Compression mode = diff/dup
##.OBSERVE FREQUENCY= 400.02188249412
##.OBSERVE NUCLEUS= ^1H
##.ACQUISITION MODE= SIMULTANEOUS (DQD)
##.ACQUISITION SCHEME= undefined
##.AVERAGES= 8
##.DIGITISER RES= 22
##SPECTROMETER/DATA SYSTEM= spect
##.PULSE SEQUENCE= zg30
##.SOLVENT NAME= COFFEE_meoh
##.SHIFT REFERENCE= INTERNAL, COFFEE_meoh, 1, 14.98509
##AUDIT TRAIL= $$ (NUMBER, WHEN, WHO, WHERE, PROCESS, VERSION, WHAT)
$$ ##TITLE= Audit trail, TOPSPIN		Version 2.1
$$ ##JCAMPDX= 5.01
$$ ##ORIGIN= Bruker BioSpin GmbH
$$ ##OWNER= Administrator
$$ $$ C:\Bruker\TOPSPIN/data/COFFEE/nmr/AC1344_CHILS11171_6647394_hvHdWUDuJO/10/pdata/1/auditp.txt
$$ ##AUDIT TRAIL=  $$ (NUMBER, WHEN, WHO, WHERE, PROCESS, VERSION, WHAT)
(   1,<2012-08-11 00:15:13.109 -0500>,<Administrator>,<TOPSPIN>,<go>,<TOPSPIN 2.1>,
      <created by zg
	started at 2012-08-11 00:14:06.578 -0500,
	POWCHK enabled, PULCHK disabled,
       configuration hash MD5:
       6B 1B 68 BB D9 2E 58 E2 7F 35 AD 54 07 DF 0E 41
       data hash MD5: 64K
       5B BC E0 47 18 AF 2F B9 73 73 9E D1 11 84 FB C6>)
(   2,<2012-08-11 00:15:16.625 -0500>,<Administrator>,<TOPSPIN>,<proc1d>,<TOPSPIN 2.1>,
      <Start of raw data processing
       efp LB = 0 FT_mod = 6 PKNL = 1 PHC0 = 0 PHC1 = 0 SI = 32K 
       data hash MD5: 32K
       9D 78 ED AB 7F 66 40 06 75 DF F6 EA 07 FC 6F A9>)
(   3,<2012-08-11 00:15:16.921 -0500>,<Administrator>,<TOPSPIN>,<proc1d>,<TOPSPIN 2.1>,
      <pk PHC0 = 182.6862 PHC1 = 0 
       data hash MD5: 32K
       5D 64 79 7E B1 5E 9E 98 18 B5 A5 F0 00 56 0E 84>)
(   4,<2012-08-11 00:15:16.984 -0500>,<Administrator>,<TOPSPIN>,<proc1d>,<TOPSPIN 2.1>,
      <abs ABSG = 1 
       data hash MD5: 32K
       2E 9A 1F 8A 30 D2 5C CF 23 B0 F1 FE E9 15 C3 8D>)
(   5,<2012-08-11 00:15:17.015 -0500>,<Administrator>,<TOPSPIN>,<proc1d>,<TOPSPIN 2.1>,
      <abs ABSG = 2 
       data hash MD5: 32K
       B5 39 FA D4 B5 4F 12 F3 AA 40 4F BF 85 02 E2 42>)
(   6,<2012-08-11 00:15:17.046 -0500>,<Administrator>,<TOPSPIN>,<proc1d>,<TOPSPIN 2.1>,
      <abs ABSG = 3 
       data hash MD5: 32K
       97 D7 11 2C 42 E8 B1 55 FB 76 D3 B9 A0 79 51 8C>)
(   7,<2012-08-11 00:15:17.078 -0500>,<Administrator>,<TOPSPIN>,<proc1d>,<TOPSPIN 2.1>,
      <abs ABSG = 4 
       data hash MD5: 32K
       1B 06 1E D3 A9 2C 08 27 2F A1 C8 DB FB 3E FC A2>)
(   8,<2012-08-11 00:15:17.109 -0500>,<Administrator>,<TOPSPIN>,<proc1d>,<TOPSPIN 2.1>,
      <abs ABSG = 5 
       data hash MD5: 32K
       C3 33 B8 CB 91 88 6E A9 10 5D 6F 48 7D F7 00 7F>)
$$ ##END=
$$ 
$$ $$ hash MD5
$$ $$ F7 F2 4F C9 5B D5 9A 56 7A AA AB 15 4B 89 1E 47
##$RELAX= 
##$RELAX= 
##$RELAX= 
##$RELAX= 
##$RELAX= 
##$RELAX= 
##$RELAX= 
$$ Bruker specific parameters
$$ --------------------------
$$ [...]
150 150 150 150 150 150 150 150
##$TP07= 0
##$TPNAME0= <>
##$TPNAME1= <>
##$TPNAME2= <>
##$TPNAME3= <>
##$TPNAME4= <>
##$TPNAME5= <>
##$TPNAME6= <>
##$TPNAME7= <>
##$TPOAL= (0..7)
0.5 0.5 0.5 0.5 0.5 0.5 0.5 0.5
##$TPOFFS= (0..7)
0 0 0 0 0 0 0 0
##$TUNHIN= 0
##$TUNHOUT= 0
##$TUNXOUT= 0
##$USERA1= <user>
##$USERA2= <user>
##$USERA3= <user>
##$USERA4= <user>
##$USERA5= <user>
##$V9= 5
##$VALIST= <valist>
##$VCLIST= <CCCCCCCCCCCCCCC>
##$VD= 0
##$VDLIST= <DDDDDDDDDDDDDDD>
##$VPLIST= <PPPPPPPPPPPPPPP>
##$VTLIST= <TTTTTTTTTTTTTTT>
##$WBST= 1024
##$WBSW= 4
##$XGAIN= (0..3)
0 0 0 0
##$XL= 0
##$YL= 0
##$YMAX_a= 472125
##$YMIN_a= -604736
##$ZGOPTNS= <>
##$ZL1= 120
##$ZL2= 120
##$ZL3= 120
##$ZL4= 120
##$ABSF1= 14.98509
##$ABSF2= -5.573092
##$ABSG= 5
##$ABSL= 3
##$ALPHA= 0
##$AQORDER= 0
##$ASSFAC= 0
##$ASSFACI= 0
##$ASSFACX= 0
##$ASSWID= 0
##$AUNMP= <proc_prof1d_extract_pilot.lims>
##$AXLEFT= 0
##$AXNAME= <>
##$AXNUC= <1H>
##$AXRIGHT= 0
##$AXTYPE= 0
##$AXUNIT= <>
##$AZFE= 0.1
##$AZFW= 0.1
##$BCFW= 0
##$BC_mod= 0
##$BYTORDP= 0
##$COROFFS= 0
##$CY= 15
##$DATMOD= 1
##$DC= 0
##$DFILT= <>
##$DTYPP= 0
##$F1P= 0
##$F2P= 0
##$FCOR= 0.5
##$FTSIZE= 32768
##$FT_mod= 6
##$GAMMA= 0
##$GB= 0
##$INTBC= 1
##$INTSCL= 1
##$ISEN= 128
##$LB= 0
##$LEV0= 0
##$LPBIN= 0
##$MAXI= 10000
##$MC2= 0
##$MEAN= 0
##$ME_mod= 0
##$MI= 0
##$NCOEF= 0
##$NC_proc= -8
##$NLEV= 6
##$NOISF1= 0
##$NOISF2= 0
##$NSP= 0
##$NTH_PI= 0
##$NZP= 0
##$OFFSET= 14.98509
##$PC= 1
##$PHC0= 182.6862
##$PHC1= 0
##$PH_mod= 1
##$PKNL= yes
##$PPARMOD= 0
##$PPDIAG= 0
##$PPIPTYP= 0
##$PPMPNUM= 2147483647
##$PPRESOL= 1
##$PSCAL= 4
##$PSIGN= 0
##$PYNMP= <proc.py>
##$REVERSE= no
##$SF= 400.02
##$SI= 32768
##$SIGF1= 0
##$SIGF2= 0
##$SINO= 400
##$SIOLD= 32768
##$SPECTYP= <>
##$SREGLST= <1H.CDCl3>
##$SSB= 0
##$STSI= 32768
##$STSR= 0
##$SW_p= 8223.68421052631
##$SYMM= 0
##$S_DEV= 0
##$TDeff= 65536
##$TDoff= 0
##$TI= <>
##$TILT= no
##$TM1= 0
##$TM2= 0
##$TOPLEV= 0
##$USERP1= <user>
##$USERP2= <user>
##$USERP3= <user>
##$USERP4= <user>
##$USERP5= <user>
##$WDW= 1
##$XDIM= 32768
##$YMAX_p= 451938687
##$YMIN_p= -735405
##$CURPLOT= <Network HP LaserJet P1505>
##$CURPRIN= <$Network HP LaserJet P1505>
##$DFORMAT= <normdp>
##$LAYOUT= <+/1D_H.xwp>
##$LFORMAT= <normlp>
##$PFORMAT= <normpl>
##$SURQMSG= 1
$$ End of Bruker specific parameters
$$ ---------------------------------
##NTUPLES= NMR SPECTRUM
##VAR_NAME=  FREQUENCY,     SPECTRUM/REAL,   SPECTRUM/IMAG
##SYMBOL=    X,             R,               I
##VAR_TYPE=  INDEPENDENT,   DEPENDENT,       DEPENDENT
##VAR_FORM=  AFFN,          ASDF,            ASDF
##VAR_DIM=   32768,         32768,           32768
##UNITS=     HZ,            ARBITRARY UNITS, ARBITRARY UNITS
##FACTOR=    0.250966925370066, 1,           1
##FIRST=     8223.43324360094, -133995,      -142106
##LAST=      0,             -2936,           -50357
##MIN=       0,             -735405,         0
##MAX=       8223.43324360094, 451938687,    0
$$ Real data points
##PAGE= N=1
##DATA TABLE= (X++(R..R)), XYDATA
$$ [...]
$$ plain form
19497 -66516 60477 -95633 34415 -50093 -32867 -67056 234609 31119 157940 -145413 -145260
19486 -145260 -183231 -30470 -80430 -227119 -296746 -400521 37283 -281047 22338 45035 15884
19474 -72098 -119447 -50087 13189 -75963 -46707 -100459 14194 165396 -35555 162021 -386437
19462 202209 -68896 -227371 -234129 35907 -145715 -300818 142176 95736 19548 -20166 -161930
19451 -161930 -187441 -1854 256011 293 233134 -138392 -101035 -2656 -303479 308347 -81945
19439 169208 88288 -234222 24818 -101620 -110096 207906 -234519 -447890 -211997 -319280
19429 -319280 -23279 111787 269003 55238 -169569 102650 71292 83647 -73218 -345528
19419 -345528 -39083 -137090 -236617 279777 172155 -119700 -253374 133964 -128038 245929
$$ packed form
19497f6516F0477i5633C4415e0093J7226l4189B34609C1119J26821a45413J53
19486a45260l7971c0470m9960j46689o9627j03775C7283b81047B2338K2697A5884
19474g2098m7349e0087A3189g5963K9256n3752A4194J51202c5555A62021c86437
19462B02209f8896j58475o758C5907a45715j55103A42176m6440A9548b0166j41764
19451a61930k5511a854B56011B93K32841a38392L7357b656l00823C08347h1945
19439A69208q0920b34222B4818a01620q476B07906b34519k13371b11997j07283
19429c19280b3279A11787J57216E5238a69569A02650l1358J2355g3218k72310
19419c45528c9083r8007r9527B79777j07622a19700j33674A33964a28038B45929
$$ plain form
19408 -310776 -175224 -104215 -45740 -260641 -207411 -211598 219721 145054 -271302 -233951 115322
19396 -31646 95555 60899 19132 -70461 62608 74575 105585 2680 -243557 28533 -77955 -302690
19384 -302690 -105247 -190483 -130385 160094 -348295 -199574 -163253 -137071 -294024 -128183
19373 49581 -238083 -164941 -143824 10271 121151 -152977 -60186 -72777 116 -79353 -238572
19362 -238572 -45298 -242976 13758 25599 -117863 -185870 5381 -181470 -16253 152440 -171967
19350 -265763 276394 16658 -35651 -342919 -70756 180955 -18364 65101 112538 35028 207287
19339 207287 -68542 -31680 -390412 -217366 147454 -49096 327479 -180490 -153878 -196810
19329 -196810 214081 -90880 162636 -90304 -391685 -125310 279971 -128982 55230 -404168
$$ packed form
19408c10776J35552P1009d5740k14901N3230m187B19721p4667b71302L7351A15322
19396c1646I5555l4656A9132g0461F2608J1967L1010B680b43557B8533g7955k24735
19384c02690a05247q5236O0098A60094c48295J48721L6321K6182j56953a28183
19373D9581b38083P3142K1117A0271J10880a52977f0186j2591A16g9353j59219
19362b38572d5298j97678A3758J1841a17863o8007E381a81470a6253A52440a71967
19350b65763B76394A6658c5651l07268g0756A80955a8364F5101M7437C5028J72259
19339B07287f8542c1680l58732J73046A47454d9096C27479a80490K6612m2932
19329a96810B14081i0880A62636i0304l01381a25310B79971a28982E5230d04168
$$ plain form
19318 -237300 -242228 151943 -44163 -314429 -334120 -163703 -26392 -18355 142070 -190879 119088
19306 2533 -172604 38867 194713 -125276 -95402 107936 222683 57710 64064 -146930 -10302
19294 -274074 131860 175763 110062 -145602 -175016 -276566 233506 -73539 -89039 -244020
19284 -244020 -10135 -242059 -82481 114886 208170 68157 -111403 -102904 -51128 330943 -71136
19272 -23626 -172928 -310766 -103467 -177947 31120 -159589 -85509 143286 -199948 -93463
19261 45369 -241811 140862 101691 -100995 -378921 -208254 -158624 -11067 13130 75755 -42608
19249 10134 4 -73947 -202345 -16388 -156079 -152126 -119489 -866 39340 -193755 -282151 -295924
19237 -295924 -135176 -107821 5948 -177011 90902 -122781 -129473 265869 -92335 -144093 -415483
$$ packed form
19318b37300m928A51943d4163k70266j9691a63703b6392Q037A42070a90879A19088
19306B533a72604C8867J55846a25276K9874A07936J14747E7710O354a46930a0302
19294b74074A31860M3903o5701a45602k9414j01550B33506g3539j5500j54981
19284b44020a0135k31924h2481A14886R3284F8157a11403Q499e1128C30943g1136
19272b3626j49302j37838a03467p4480C1120a59589P4080A43286a99948i3463
19261D5369b41811A40862l9171a00995k77926J70667M9630a1067A3130O2625d2608
19249A0134Dg3947j28398a6388j39691L953L2637h66C9340a93755q8396j3773
19237b95924a35176K7355E948a77011I0902a22781o692B65869i2335n1758k71390
$$ plain form
19226 -415483 176962 -180436 -163247 85473 382979 -23201 -186811 -98342 -264824 -35745
19215 -2785 -170888 140594 -202297 24748 147551 73161 -144423 -14831 -144371 171497
19204 -126901 11909 -141292 85556 -67047 176627 -222283 -327863 108268 139161 2920 -37885
19192 225390 -144582 -125278 242671 -69989 265842 -148702 121863 -278229 -86841 -127166
19182 -127166 -54215 -39612 185603 -207616 209866 -166041 -127600 -379905 217138 194400
19172 194400 -156124 -27374 38054 -32871 -10596 -306329 -207683 -239025 365600 -35096 -54201
19161 -54201 145819 -20842 -64944 -116681 -119885 245367 -144899 -143379 -59248 163887 203647
19150 203647 -343806 -91201 -334603 -239788 -94123 -318152 -373593 -171414 -401549 100969
$$ packed form
19226d15483A76962a80436J7189H5473K97506b3201j63610Q8469j66482c5745
19215b785j68103A40594b02297B4748J22803G3161a44423a4831j29540A71497
19204a26901A1909a41292H5556f7047A76627b22283j05580A08268L0893B920c7885
19192B25390a44582J9304B42671f9989B65842a48702A21863b78229h6841m0325
19182a27166e4215J4603A85603b07616B09866a66041L8441k52305B17138k2738
19172A94400a56124b7374C8054c2871a0596k95733R8646l1342C65600c5096j9105
19161e4201A45819b0842m4102n1737l204B45367a44899J520e9248A63887L9760
19150B03647c43806i1201k43402R4815i4123k24029n5441a71414k30135A00969
$$ plain form
19139 333705 -147605 145665 -225691 291881 134628 103742 205593 133770 21159 -27728
19128 138970 44715 -150312 -39325 -171393 164151 -100371 -164493 -158182 -49056 -8308 -152585
19117 -152585 -52974 -159275 -210287 16774 -486 -361896 13325 38960 -134312 -31111 -173556
19106 -173556 -131204 37800 -164351 149342 30746 -150314 113107 -308630 -206177 -199171
19096 -199171 -286109 -26381 5012 -83691 -133849 61504 -18527 -203008 -196130 -267549 113389
19084 16514 94562 -115460 -36755 -70619 -268923 72281 80710 -118949 68847 71337 -162558
19072 -178421 -426535 -281414 191307 -73331 -20774 312297 169786 -192095 43235 -118602
19061 -199171 16211 -248139 118942 -22466 31204 38225 325425 -142053 139191 145234 120440
$$ packed form
19139C33705a47605A45665b25691B91881A34628l0886J01851p1823B1159b7728
19128A38970D4715a50312c9325j32068A64151a00371o4122O311d9056h308j44277
19117a52585e2974j06301n1012A6774d86l61410A3325K5635a34312c1111j42445
19106a73556M2352C7800a64351A49342C0746a50314A13107c08630J02453P006
19096a99171q6938b6381E012h3691n0158F1504a8527j84481O878p1419A13389
19084A6514P8048a15460c6755l3864j98304G2281Q429a18949F8847K490a62558
19072a78421k48114J45121A91307g3331b0774C12297j42511a92095D3235a18602
19061a99171A6211b48139A18942b2466C1204P021K87200a42053A39191O043k4794
$$ plain form
19050 120440 -140615 104729 -16297 78409 147033 -103294 -28042 71447 -302084 -416059
19040 -416059 -133093 -289439 -56696 79550 -30093 -8946 -125970 -102810 162545 -75761 -245838
19029 -245838 -308241 -93493 -75974 103891 -1151 -64229 77493 -119115 -322168 15722 203390
19018 203390 27114 -309209 156380 -87914 32320 276689 -117845 16853 -35549 -296629
19008 -296629 -98895 -71757 210591 38352 -11613 -268571 230025 -56840 -95210 -267093 -2890
18996 -66706 62121 74494 -65213 -422364 187703 -85379 -120507 -316946 -246826 200567 -56897
18984 -22857 -324080 76800 -145638 -65740 293177 -118171 12198 57164 -38975 -131568 -178711
18973 -178711 84210 39129 131290 -234708 138179 -242594 -195766 19921 60221 -320115 -79552
$$ packed form
19050A20440a40615A04729a6297G8409O8624a03294b8042G1447c02084j13975
19040d16059a33093j56346e6696G9550c0093h946j17024K3160A62545g5761j70077
19029b45838o2403i3493J7519A03891a151o3078G7493a19115k03053A5722J87668
19018B03390B7114c09209A56380h7914C2320K44369a17845A6853c5549k61080
19008b96629i8895K7138B10591C8352a1613k56958B30025e6840l8370j71883b890
18996f6706F2121J2373f5213l57151A87703h5379l5128j96439P0120B00567e6897
18984b2857l01223G6800a45638f5740B93177a18171A2198M4966c8975r2593m7143
18973a78711H4210C9129R2161b34708A38179b42594M6828A9921M0300c20115g9552
$$ plain form
18961 276888 -27425 77985 -116161 -20400 256516 33660 -97469 -99706 154372 -2128 447776
18949 216966 -163924 15284 -34491 -10012 57975 -178398 -28084 114048 254217 -227516
18938 -19084 219825 -78286 -52452 135967 428569 -289396 -120859 319373 120270 -115587
18927 119324 -101345 -154430 -214828 -38777 -197717 246651 8425 180815 -56610 -235577 11452
18915 -174101 110892 -389551 6704 92309 201748 -120348 -147484 -48624 234300 131117
18905 131117 -91199 117846 -126017 -216603 -139335 20616 77206 283182 253085 -219913 73676
18893 -142897 -70664 -85887 -178244 -339174 21117 157083 -63976 -55418 -283685 143646 -96547
18881 -237454 5097 -97198 -194274 -193644 -244435 -64571 -67169 3675 -191558 188067 -168079 10312
$$ packed form
18961B76888b7425G7985a16161b0400B56516C3660i7469k237A54372b128D47776
18949B16966a63924A5284c4491a0012E7975a78398b8084A14048J40169b27516
18938a9084B19825g8286K5834A35967K92602b89396a20859C19373A20270a15587
18927A19324a01345n3085o0398c8777j58940B46651H425J72390e6610j78967A1452
18915a74101A10892c89551F704Q5605J09439a20348k7136d8624B34300j03183
18905A31117i1199A17846a26017r0586P7268B0616N6590K05976l0097b19913G3676
18893a42897g0664j5223r2357j60930B1117J35966f3976Q558k28267A43646i6547
18881b37454E097i7198r7076O30n0791f4571k598C675a91558A88067a68079A0312
$$ plain form
18868 92909 -114239 -199537 -89361 57253 -124146 -26758 113036 76145 -77440 -82018 230681
18856 -266197 73164 -96708 -191730 -170845 -187795 -128061 -178660 -195695 -159600 56301 50320 108269
18844 108269 8404 -210434 -48954 41889 -26886 -227360 69065 -99386 -199387 -13408 -234771
18833 -234771 -186982 -181945 28446 -85878 -69303 -116399 -333259 188528 -9815 -170327 -315532
18822 -315532 97416 -23710 -107740 74730 -164078 190608 -33912 -15271 275046 -92556 47662
18810 -101133 -130796 170021 353266 10096 253472 -256358 -286091 139306 237867 -309593
18799 -260892 82845 -281983 71441 -36618 290035 -140349 -210775 -236396 -272565 92494 90799
18788 90799 3155 41681 -116238 -322788 -289339 268632 410752 -103188 -4476 -11134 -49761
$$ packed form
18868I2909a14239q5298h9361E7253a24146b6758A13036l6891g7440m578B30681
18856b66197G3164i6708r5022K0885j6950N9734n0599j7035L6095E6301n981N7949
18844A08269H404b10434d8954D1889b6886k00474F9065i9386j00001a3408k21363
18833b34771M7789N037B8446h5878J6575m7096k16860A88528i815j60512j45205
18822c15532I7416b3710q4030G4730a64078A90608c3912a5271B75046i2556D7662
18810a01133k9663A70021J83245A0096K43376b56358k9733A39306R8561c09593
18799b60892H2845b81983G1441c6618B90035a40349p0426k5621l6169I2494j695
18788I0799C155L8526a16238k06550L3449B68632J42120a03188d476o658l8627
$$ plain form
18777 -49761 -332193 -114152 -30786 -54189 34311 -178716 483 42924 -11016 -94889 -163635
18766 -163635 119445 -250722 -109255 -246214 22843 -75236 50346 -417284 -61110 -275377
18756 -275377 -177333 -133426 13003 133694 243112 28150 -167105 -198953 192092 -174171
18745 41144 -35734 -138598 -119349 -165693 -270837 122085 -404991 94756 -144532 -116437 -267312
18734 -267312 -127028 -239072 51177 74502 25193 -387365 35783 282849 -163182 15819
18723 -317819 284556 -76898 -402488 15727 -272920 -167442 63241 81951 127112 92664 -378499
18711 -70244 -256373 -70349 -111744 112239 311136 109866 175780 -198279 -66202 163094
18700 -12788 -195722 -203454 -114626 -182821 -74635 -162772 4097 -12044 -68102 156288 -349226
$$ packed form
18777d9761k82432a14152c0786k3403C4311a78716D83M2441a1016q3873o8746
18766a63635A19445b50722a09255j36959B2843g5236E0346d17284f1110k14267
18756b75377R8044M3907A3003J20691J09418B8150a67105l1848A92092a74171
18745D1144c5734j02864J9249m6344j05144A22085d04991I4756a44532K8095j50875
18734b67312a27028j12044E1177K3325B5193c87365C5783K47066a63182A5819
18723c17819B84556g6898l25590A5727b72920J05478F3241J8710M5161l4448c78499
18711g0244j86129g0349m1395A12239J98897A09866O5914a98279f6202A63094
18700a2788j82934p732Q8828o8195g4635q8137D097a2044n6058A56288c49226
$$ plain form
18688 143198 -184114 -61117 -109945 109113 -257301 -139565 -142001 -251590 -244017 236759 60115
18676 -227727 252926 119876 -325384 -131296 -120555 -171760 -206130 -12066 157210 -58211
18665 -48345 -197960 -107651 -42628 312352 -156612 366262 -17373 82962 -104140 117971
18654 -180832 243152 169827 -228204 -174203 42551 -20897 -207298 -352612 257324 292520
18644 292520 -279999 -211699 113894 -141547 -31655 -123900 -85472 -70238 -157298 -78825 92456
18632 -105525 93469 -124715 -211968 65788 -186037 -95057 -426898 32234 54554 -84754 -27350
18620 -223098 230886 17119 -287357 -46727 -69825 -39099 -102784 -139263 -83492 -45310 -231792
18609 -231792 196133 -493057 167862 -251622 118154 158444 149107 -302543 -49599 -460691
$$ packed form
18688A43198a84114f1117m8828A09113b57301J17736k436j09589P573B36759F0115
18676b27727B52926A19876c25384a31296J0741n1205l4370a2066A57210e8211
18665d8345j49615R0309d2628C12352a56612C66262a7373H2962a04140A17971
18654a80832B43152p3325b28204N4001D2551b0897j86401j45314B57324L5196
18644B92520b79999O8300A13894a41547c1655r2245L8428J5234q7060P8473I2456
18632a05525I3469a24715q7253F5788a86037R0980l31841C2234K2320h4754b7350
18620b23098B30886A7119b87357d6727k3098L0726o3685l6479N5771L8182j86482
18609b31792A96133d93057A67862b51622A18154M0290r337c02543d9599m11092
$$ plain form
18599 -460691 -84252 -328287 -74859 -168848 59436 -299585 56729 -401203 -94679 -138271 -314034
18588 -314034 -140013 130846 -74143 344174 -256785 -54133 142570 -15186 69686 140331
18578 140331 -191699 -406072 12918 176332 79138 -117723 -124546 -27155 -25777 -3270 -79029
18567 -79029 -419912 -208859 -252040 383444 -257352 -75446 -119114 -129140 -59128 173247 -177219
18555 25103 -117628 -133004 -68551 -25017 244353 87782 -167215 82798 117941 -133070 -2353
18543 200198 -4876 -158597 120031 -112861 -320885 -134017 -203849 -122926 -108541 37497 -150048
18531 -78114 95346 -35242 -4921 60131 139950 -69384 -317288 -227504 113938 -268157 -154815
18520 -154815 48343 115725 225109 162753 94918 32076 -79398 -111898 151354 263756 -39331
$$ packed form
18599d60691h4252k44035g4859r3989E9436b99585E6729d01203i4679m3592j75763
18588c14034a40013A30846g4143C44174b56785e4133A42570a5186F9686P0645
18578A40331a91699k14373A2918J63414G9138a17723o823b7155J378c270p5759
18567g9029l40883b08859m3181C83444b57352g5446m3668j0026e9128A73247a77219
18555B5103a17628j5376O4453b5017B44353H7782a67215H2798L5143a33070b353
18543B00198d876j53721A20031a12861k08024a34017o9832Q0923J4385C7497a50048
18531g8114I5346c5242d921F0131P9819f9384k47904Q9784A13938b68157J13342
18520a54815D8343O7382J09384o2356o7835C2076g9398l2500A51354J12402c9331
$$ plain form
18508 -153299 -182036 359073 72469 -45832 105250 263463 82844 -142840 366118 139856
18497 -116862 -306239 66879 -43571 -51236 -125185 -350179 -187513 -339526 -166553 240434
18486 274275 -151040 -225408 6113 -131865 -240813 -28042 -130876 -277040 31664 -52189 -40570
18475 -40570 -283336 207295 5375 -336875 -123511 -211222 118676 -63189 100829 177500 63772
18463 63133 -125968 -213607 1640 -310008 -142259 -157207 -7713 -227810 -70177 85605 -75778
18451 39568 121959 189325 -251994 -284592 -163883 -138229 -60866 -181338 -135864 -11235 -59924
18440 -59924 -77772 -64612 -64199 177426 280922 -26589 -164077 -499569 19134 -84238 -236927
18429 -236927 8456 115491 -172280 -22512 221028 24205 30897 -29691 -207125 -25653 -19547
$$ packed form
18508a53299k8737C59073G2469d5832A05250J58213H2844a42840C66118A39856
18497a16862j89377F6879d3571p665p3949k24994J62666j52013a66553B40434
18486B74275a51040p4368F113a31865j08948b8042j02834j46164C1664e2189J1619
18475d0570k42766B07295E375c36875a23511q7711A18676f3189A00829P6671F3772
18463F3133a25968q7639A640c10008a42259j4948g713k20097g0177H5605g5778
18451C9568Q2391O7366b51994l2598J20709K5654f0866j20472M5474a1235m8689
18440e9924j7848J3160M13A77426J03496b6589j37488l35492A9134h4238j52689
18429b36927H456J07035a72280b2512B21028B4205O692b9691j77434b5653O106
$$ plain form
18418 -19547 -47603 2996 -88492 -73634 -107687 153932 -258196 145277 231789 -46791 -291871
18407 -291871 290000 -45246 -37739 248219 -835 -16422 -9920 -54963 -37839 -168780 47930 -243456
18394 -213477 -20603 88586 -219178 192900 -360917 83458 126295 133376 -258377 -174853 -335527
18383 -335527 6783 -195511 44579 158956 137401 379285 -99796 -104451 86210 377232 -217985
18371 323 17379 259439 33178 113473 -196852 -168585 305278 158497 -47627 142728 -123237
18359 104177 -57150 41682 77169 -266608 -316017 -145016 -56944 69098 -315502 -97360 -120419
18348 -120419 -152715 53789 -102275 15956 -168745 230740 282744 143019 -145055 22460
18337 -43598 -47245 104511 -37602 84291 53616 -91754 82865 -306968 -14577 -7144 14937 -28295
$$ packed form
18418a9547k8056B996h8492J4858l4053A53932b58196A45277Q6512d6791k45080
18407b91871B90000d5246P507B48219h35j5587O502m5043J7124j30941D7930b43456
18394b13477b0603H8586b19178A92900c60917H3458M2837P081b58377Q3524j60674
18383c35527F783a95511D4579J14377k1555K41884i9796m655H6210K91022b17985
18371C23J7056K42060C3178Q0295a96852K8267C05278j46781d7627A42728a23237
18359A04177e7150D1682L5487b66608m9409a45016e6944F9098c15502i7360k3059
18348a20419l2296E3789a02275A5956a68745B30740N2004j39725a45055B2460
18337d3598l647A04511c7602H4291l0675i1754H2865c06968a4577g144A4937b8295
$$ plain form
18324 -155473 -189825 -6269 305834 -231262 -100271 -127825 -2668 141758 -157035 -192799 112704
18312 -59366 -256757 220989 -118165 106671 72277 -191402 -126916 107214 -257729 91106
18301 -151974 -81269 81433 145201 40083 -168194 -5546 -26326 -178226 -173999 342603 27532
18289 -84548 179366 328715 -59497 86835 -78882 -87999 69902 -58417 62002 -209918 -156398
18278 -156398 -195773 39568 -109986 -236754 23163 -114760 -79271 22849 -70448 -114205 96636
18266 -162271 4814 11298 -220379 -89778 114525 -335239 18565 -210061 193432 -272443 72972
18254 -90605 -126091 -71472 -374096 191432 167197 -47198 42186 -78778 104419 104731 -82164
18242 -150539 50237 47513 -145 -11197 -72861 -204306 161259 2669 -172349 26615 -215640
$$ packed form
18324a55473l4352f269C05834b31262a00271k7554b668A41758a57035l5764A12704
18312e9366j97391B20989a18165A06671l4394a91402O4486A07214b57729I1106
18301a51974P0705H1433O3768D0083a68194e546k0780j51900M227C42603B7532
18289h4548A79366J49349e9497H6835g8882r117F9902e8417F2002b09918N3520
18278a56398l9375C9568a09986j26768B3163a14760L5489B2849g0448m3757I6636
18266a62271D814O484b20379h9778A14525c35239A8565b10061A93432b72443G2972
18254i0605l5486N4619l02624A91432k4235d7198D2186g8778A04419L12h2164
18242a50539E0237k724a45j1052o1664j31445A61259B669a72349B6615b15640
$$ plain form
18230 -71354 -6707 -85384 -80711 -160484 242385 -101695 -23275 -311004 103156 27770 -134647
18218 -27128 149203 -322218 98019 -114131 -91566 80019 -429198 7036 218841 -12648 -191629
18207 -191629 -125379 -172942 111893 -58630 -24025 -210644 78539 -148904 -129590 -250517 27099
18195 -102685 -49111 -497135 -86880 291858 -148193 -11689 -87693 136774 68335 -143637
18184 207351 -34721 33577 -27219 -96729 18946 38125 28632 -56565 -256897 -246450 36668
18172 258105 -280659 6312 -56814 -24351 214403 170526 -179889 -121824 144015 78541 293073
18161 293073 -30119 208383 -68885 84775 -181204 83065 -156158 45797 95365 34847 -283442
18149 126342 130535 -304372 199129 -28714 -108381 4147 65745 -133736 -102185 -57177 -66424
$$ packed form
18230g1354f707p8677M673p9773B42385a01695b3275k87729A03156B7770a34647
18218b7128A49203c22218I8019a14131K2565H0019d29198G036K11805a2648j78981
18207a91629O6250m7563A11893e8630b4025j86619G8539a48904J9314j20927B7099
18195a02685d9111m48024h6880B91858a48193a1689p6004A36774F8335a43637
18184B07351c4721C3577b7219o9510A8946J9179r493e6565k00332J0447C6668
18172B58105b80659F312e6814b4351B14403m3877a79889N8065A44015o5474K14532
18161B93073c0119B08383f8885H4775a81204H3065a56158D5797M9568C4847b83442
18149A26342M193c04372A99129b8714p9667D147O1598a33736L1551M5008r247
$$ plain form
18138 -66424 -29683 -206888 -192247 -340426 414610 -70575 -30545 -15587 222428 79503 471798
18127 471798 -254925 -501431 729 -153079 -19003 -246707 38587 -14541 39081 177481 -50092
18115 -184353 35969 104890 34963 -106192 89372 36480 89100 78716 26251 187829 90564
18103 -95332 -9041 -205413 204472 130510 240127 -196282 -245051 -71681 -56713 -17666 225221
18091 127485 132624 45093 276070 -178029 495961 -88753 -9262 -262223 17359 -28752 114626
18079 -72208 -45067 144989 -151407 -7747 88073 127754 108661 122204 305199 49258 -176829
18067 194018 -338043 -172667 2528 -28919 -45224 -32135 -163558 -49845 59859 -475101 -293707
18056 -293707 -163329 163341 188593 -155682 7215 66137 1930 -135928 -58743 -87978 -60134
$$ packed form
18138f6424b9683j77205J4641j48179D14610g0575c0545J4958B22428G9503L92295
18127D71798b54925k46506G29a53079a9003k27704C8587a4541C9081J38400e0092
18115a84353C5969O8921C4963a06192H9372C6480N2620j0384B6251J61578I0564
18103i5332i041j96372B04472p3962J09617a96282m8769g1681J4968a7666B25221
18091A27485N139D5093K30977a78029D95961h8753i262k52961A7359b8752A14626
18079g2208K7141A44989a51407g747H8073L9681j9093J3543J82995D9258a76829
18067A94018c38043J65376B528b8919j6305J3089j31423d9845E9859d75101J81394
18056b93707J30378A63341K5252a55682G215N8922A930a35928e8743k9235K7844
$$ plain form
18045 -60134 -312162 -51644 147931 13530 -17008 386140 -199072 -188261 138194 -201048
18034 163710 -40566 -35259 -149190 -157620 -15648 -232314 -375105 232222 -120103 -317992 69712
18022 51868 92878 92561 -18352 153109 -407109 -281653 -127622 -46317 17811 161698 -235888
18010 -152872 -276593 -254902 -79561 64891 -949 -332268 -300868 103873 54481 89738 -7105
17998 121148 334841 82695 6005 -120920 -9340 -112133 -56466 -35124 72684 -117211 18068
17986 351439 159764 46662 -113898 -153529 -41601 -52988 41967 -40305 -51151 170219 -194763
17974 -167213 192382 199877 -224549 3495 -21074 -83810 157616 -222611 -161020 64807 38567
17963 38567 -345332 259022 -3165 25035 104918 170552 -252841 -358136 -334935 280370 25777
$$ packed form
18045f0134k52028e1644A47931A3530a7008C86140a99072J0811A38194b01048
18034A63710d0566N307j13931q430a5648k16666j42791B32222a20103j97889F9712
18022E1868M1010l17a8352A53109d07109J25456a27622d6317A7811J43887b35888
18010a52872j23721K1691g9561F4891i49l31319L1400A03873m9392L5257g105
17998A21148K13693H2695F005a20920i340j02793N5667K1342G2684a17211A8068
17986C51439A59764D6662a13898l9631d1601j1387D1967d0305j0846A70219a94763
17974a67213A92382P495b24549C495b1074o2736A57616b22611O1591F4807k6240
17963C8567c45332B59022c165B5035P9883O5634b52841j05295K3201B80370B5777
$$ plain form
17951 353895 -255767 -138490 -204331 130131 232251 -74823 -35199 -99741 -124939 -61267 87448
17939 -96566 153009 1384 47556 217483 -197581 48878 11123 -21231 -111622 56706 60645
17928 60645 413798 -381136 315404 27459 -11189 -79420 50083 176325 276815 296208 119980
17916 50005 33126 140834 -148714 -130907 121244 -81576 41358 115803 -252827 43276 197231
17905 197231 -140714 -128752 200777 108530 -97586 104125 -112763 -103210 12062 -7864 -248319
17894 -248319 -265238 -39926 163173 152588 -196794 136895 109402 -225325 -202826 12037 -140077
17882 49641 -4119 162024 108069 117187 227303 117117 33350 201173 -24122 10632 -302660
17870 -201648 -204601 201215 -77725 373238 120633 254183 -251824 -38849 -29312 14179 28030
$$ packed form
17951C53895b55767J17277o5841A30131J02120g4823c5199o4542k5198f1267H7448
17939i6566A53009A384M6172J69927a97581D8878A1123b1231r0391E6706L939
17928F0645L53153c81136C15404B7459a1189o8231E0083J26242J00490J9393A19980
17916E0005j6879J07708a48714J7807A21244h1576D1358P4445b52827D3276J53955
17905A97231a40714J1962B00777r2247i7586A04125a12763R553A2062g864k40455
17894b48319j6919c9926A63173j0585a96794A36895k7493b25325K2499A2037a40077
17882D9641d119A62024n3955R118J10116j10186C3350J67823b4122A0632c02660
17870b01648k953B01215g7725C73238A20633J33550b51824c8849R537A4179J3851
$$ plain form
17859 28030 175872 -106693 -405404 -23945 286655 -21537 79605 -74080 19375 -204437 -116136
17848 -116136 -334606 -24922 148388 84172 -1316 -119948 17540 95140 -212743 -3674 -82187
17837 -82187 -129812 -85665 -76490 12914 -151002 -367805 -90791 -76215 -268252 166979 -127688
17825 -67666 75262 153291 119694 109577 -19905 29917 -102826 134373 -811 -10251 -128357 -63922
17812 14340 85414 271412 -60934 -189872 147331 -142362 152736 6232 -195840 -267563 37789
17800 -388346 167011 -381755 130812 -132400 -317511 106014 -8002 -20911 23077 -23857
17789 330702 -178814 4108 -24630 -182935 346151 148576 85775 2167 -119395 -104114 122035
17777 170738 -91557 89240 -176960 -4204 -330555 -234744 -44797 -158957 -245133 163126 -194709
$$ packed form
17859B8030J47842a06693k98711b3945B86655b1537G9605g4080A9375b04437Q8301
17848a16136k18470b4922A48388o4216a316j18632A7540P7600b12743c674p8513
17837h2187m7625M4147R175A2914a51002k16803i0791J4576j92037A66979a27688
17825f7666G5262P8029l3597j0117a9905B9917a02826A34373h11r440j18106f3922
17812A4340P1074J85998f0934j28938A47331a42362A52736F232a95840p1723C7789
17800c88346A67011c81755A30812a32400j85111A06014h002j2909B3077b3857
17789C30702a78814D108b4630j58305C46151A48576o2801B167a19395J5281A22035
17777A70738i1557H9240a76960d204l26351R5811d4797j14160q6176A63126a94709
$$ plain form
17765 -219991 35203 8566 -40315 -44977 -53012 -69017 -95321 -26359 -152725 -377289 43243 54828
17753 54828 -234976 255442 141121 152012 267895 -65569 31840 168280 264917 -128434
17742 124536 98550 -47335 528642 128441 244683 366483 217428 -139240 -251749 36833
17731 162562 -191834 -246525 174305 -183162 -62381 70847 -40586 97650 -47357 93532 -6384
17719 331942 -81175 132571 -83233 186463 -37752 79035 -98364 -22368 -195387 221778 125348
17708 125348 26749 -28306 -91284 -88461 437614 -254622 -4058 -229008 253712 226228 -1605
17696 20989 29680 66730 -112891 -48322 -92225 -186660 -122106 -172080 -245955 -14385 -139261
17685 -139261 35155 -255463 217894 64760 278677 75579 239724 126871 24243 236612
$$ packed form
17765b19991C5203H566d0315m662q035j6005k6304b6359j26366k24564D3243J1585
17753E4828b34976B55442j14321J0891J15883f5569C1840J36440R6637a28434
17742A24536k5986d7335E28642A28441J16242J21800j49055a39240j12509C6833
17731A62562a91834n4691A74305a83162f2381G0847d0586I7650d7357I3532f384
17719C31942h1175A32571h3233A86463c7752G9035i8364b2368j73019B21778r6430
17708A25348B6749b8306o2978K823D37614b54622d058k24950B53712k7484a605
17696B0989Q691L7050a12891d8322m3903r4435O4554m9974p3875a4385j24876
17685a39261C5155b55463B17894F4760K13917G5579J64145j12853B4243K12369
$$ plain form
17675 236612 389807 -236676 109039 57753 131204 41638 -64213 86811 -189652 -284271 17217
17663 164909 -95316 -190392 12352 274971 -291721 29336 165440 -84111 74716 177734 234608
17652 234608 276042 -279125 -17708 -219471 -69260 -140269 -261742 -31362 123136 281294
17642 281294 -46695 -26903 150569 50680 33529 -136019 70921 -40712 292129 384469 34361
17630 120854 -114954 -419555 -46123 -62157 60992 62520 117779 29077 236672 139997 56079
17618 145303 177143 231279 221727 -48694 92551 -115794 -17343 -122605 -157911 99928 -38506
17606 156818 21060 83172 42921 -62160 -178698 -228731 72820 338682 -84917 23757 -207005
17594 41896 383596 70719 139523 253049 53877 160144 -47410 167229 -95710 187615 -175643
$$ packed form
17675B36612J53195b36676A09039n1286P3451D1638f4213H6811a89652r4619A7217
17663A64909i5316r5076A2352K62619b91721B9336J36104h4111G4716J03018N6874
17652B34608M1434b79125a7708k01763f9260p1009j21473c1362A23136J58158
17642B81294d6695J9792A50569E0680j7151a36019G0921d0712B92129R2340C4361
17630A20854a14954l04601d6123j6034F0992J528N5259B9077K07595r6675E6079
17618A45303L1840N4136r552d8694I2551a15794a7343j05262l5306I9928c8506
17606A56818B1060O2112m0251f2160j16538n0033G2820K65862h4917B3757b07005
17594D1896L41700G0719O8804J13526E3877J06267d7410A67229i5710A87615a75643
$$ plain form
17582 217019 -115856 -215156 190920 108519 20348 -297053 -219561 83290 -117073 184740
17571 -264242 -95422 -176912 168169 78642 253343 251725 5406 -52186 167817 -28908 -368672
17560 -368672 64917 -21604 94165 429641 322478 313826 38046 149353 5182 238597 -188521
17548 166419 -21137 137441 95761 68292 329783 -271433 12546 48734 240137 145066 90817
17537 90817 -91368 236054 215261 37178 78095 -98234 123336 271351 175841 226555 116777
17526 116777 105372 -79301 50640 147953 -49948 434374 308901 331616 689994 354336 389062
17515 389062 715209 54856 -220339 40087 -8851 321739 119867 382292 299565 125788
17504 350708 142540 196014 58404 117449 -76628 84066 -30957 140933 42297 382775 157845
$$ packed form
17582B17019a15856r9300A90920q2401B0348b97053P7492H3290a17073A84740
17571b64242i5422q1490A68169G8642J74701j618E406e2186A67817b8908l39764
17560c68672F4917b1604I4165L35476j07163q652C8046J11307E182K33415a88521
17548A66419b1137A37441m1680k7469K61491b71433A2546L6188J91403r5071n4249
17537I0817i1368B36054k0793C7178M0917i8234A23336J48015r5510N0714j09778
17526A16777j1405g9301E0640R7313d9948D34374j25473K2715L58378l35658L4726
17515C89062L26147E4856b20339D0087h851C21739A19867K62425q2727A25788
17504C50708A42540N3474E8404N9045g6628H4066c0957A40933D2297L40478A57845
$$ plain form
17492 -144773 163094 225450 -48353 200291 3822 254846 -153125 127449 10719 -133166
17481 49978 56353 11860 184158 372737 117740 303410 156434 42861 201154 115771 261080
17470 261080 402268 180142 320798 25894 177606 -85603 -30747 87091 120235 258303
17460 258303 172350 427719 214688 -166200 -142032 298720 -65599 148104 490804 318373
17450 318373 129333 559597 191491 154024 418054 323331 255821 277455 41237 290036
17440 290036 -45148 443491 160330 559158 443574 345928 42267 367610 203655 285162
17430 285162 250789 171221 -109613 168362 487415 462339 278480 206870 397842 195741
17419 -34003 243806 619646 307430 212575 343304 128014 474665 342417 328942 -51434
$$ packed form
17492a44773A63094O2356d8353B00291C822K51024a53125A27449A0719a33166
17481D9978O375A1860J72298J88579A17740J85670j46976D2861J58293q5383J45309
17470B61080J41188A80142J40656B5894J51712h5603c0747H7091L3144J38068
17460B58303q5953K55369k13031a66200K4168B98720f5599A48104L42700j72431
17450C18373A29333M30264A91491l7467K64030r4723o7510K1634D1237K48799
17440B90036d5148D43491A60330L98828j15584r7646D2267L25343j63955Q1507
17430B85162l4373p9568a09613A68362L19053k5076j83859p1610J90972A95741
17419c4003B43806L75840C07430r4855J30729A28014L46651j32248j3475e1434
$$ plain form
17408 182745 -136884 269039 240763 -4274 257687 158257 -101520 305235 121650 143886
17398 143886 168595 334007 205714 -24875 357121 285451 592262 355399 471971 279195
17388 279195 310578 176125 190583 364219 201279 183026 439697 203510 73802 424402
17378 424402 -30448 -449751 159803 124320 -76430 344644 304355 269508 122876 -101123
17367 46485 158288 305967 98582 118790 16896 -66215 312102 331530 191655 183656 206783
17356 206783 -233914 369679 -20147 -4910 43583 29614 -74787 318218 312397 88527 121502
17345 121502 316160 203236 113662 -221356 117397 426362 448516 270096 342472 221818
17335 221818 148569 328195 39973 26284 308482 151886 -148651 143530 562258 -151735
$$ packed form
17408A82745a36884B69039k8276d274B57687r9430a01520C05235A21650K2236
17398A43886K4709J65412j28293b4875C57121p1670L06811k36863J16572j92776
17388B79195L1383j34453J4458J73636j62940j8253K56671B03510G3802L50600
17378D24402c0448m19303A59803l5483g6430C44644m0289l4847A22876a01123
17367D6485J11803J47679I8582K0208A6896f6215C12102J9428j39875p999K3127
17356B06783b33914C69679b0147d910D3583j3969g4787C18218n821H8527L2975
17345A21502J94658j12924q9574b21356A17397L08965K2154j78420P2376j20654
17335B21818p3249J79626C9973j3689K82198A51886a48651A43530M18728a51735
$$ plain form
17324 128814 281380 -29823 336148 372307 457463 257052 297314 269910 88988 122704 -250178
17312 205151 398162 163987 116672 169046 147197 218553 -198534 280211 255569 163306 382137
17301 382137 109883 6510 -25990 332396 84505 417303 78934 167330 257131 222274 29497
17289 75975 142710 545481 501599 252362 7605 177135 71577 113435 377760 116074 116767
17278 116767 221313 121713 -273638 491220 115220 56760 90032 -29234 341176 74294
17267 150500 382399 158283 245565 186718 61767 63234 491828 -173729 206682 332289
17257 332289 -86311 339146 176358 51238 -36548 251629 416714 84216 8164 331874 90416
17245 100954 308773 285111 27597 205119 57811 226227 320301 172029 223541 285372 362991
$$ packed form
17324A28814J52566b9823C36148L6159Q5156k00411M0262k7404H8988L3716b50178
17312B05151J93011A63987m7315N2374k1849P1356a98534B80211k4642r2263K18831
17301C82137A09883F510b5990C32396H4505L32798G8934Q8396Q9801l4857B9497
17289G5975O6735M02771m3882k49237G605J69530G1577M1858K64325A16074O93
17278A16767J04546r9600b73638D91220A15220E6760L3272b9234C41176G4294
17267A50500K31899A58283Q7282n8847F1767J467M28594a73729B06682J25607
17257C32289h6311C39146j62788E1238c6548B51629J65085H4216H164L23710I0416
17245A00954K07819k3662B7597J77522E7811J68416R4074j48272N1512O1831P7619
$$ plain form
17234 362991 151389 -99531 197768 114442 21528 -66721 258818 133555 221113 57347 458820
17223 458820 282177 229586 -105358 226222 455696 187339 -33530 232137 121826 134260
17213 134260 356847 304620 141023 180552 34018 33364 211251 234419 -10868 183112 383115
17202 383115 69671 99188 236973 45307 151149 -31578 263587 180123 84963 361984 273469
17191 273469 403757 114825 439265 -39363 278315 373417 273933 237155 235750 276746 372530
17180 372530 276509 -19660 476864 353045 230854 327001 208574 -115314 521823 134436
17169 96839 391700 49597 351954 108701 -129418 78288 203417 326398 254818 309009
17159 309009 202986 284900 518393 667977 210568 263772 176172 333791 129228 116050
$$ packed form
17234C62991A51389i9531A97768q3326B1528f6721B58818j25263Q7558E7347M01473
17223D58820j76643n2591a05358B26222K29474A87339c3530B32137j10311J2434
17213A34260K22587n2227A41023L9529C4018o54J77887K3168a0868A83112K00003
17202C83115F9671K9517J37785D5307J05842c1578B63587q3464H4963K77021q8515
17191B73469J30288A14825L24440c9363B78315R5102r9484l6778j405M0996R5784
17180C72530r6021a9660D76864j23819j22191R6147j18427a15314E21823A34436
17169I6839K94861D9597L02357A08701a29418G8288J25129J22981p1580N4191
17159C09009j06023Q1914K33493J49584B10568N3204q7600J57619A29228j3178
$$ plain form
17149 116050 152653 -41264 127962 246968 295785 152001 121330 265681 95841 417901
17139 417901 417047 665432 666311 251275 139103 230087 531903 450964 426568 333213 197675
17128 197675 176905 508450 279181 239249 141836 -197299 164575 599381 -63982 426367
17117 306005 371713 290653 399682 285485 330440 481365 366989 215165 273274 344439
17107 344439 282835 223737 237955 162400 338695 129305 306342 251238 341067 272132 428580
17096 428580 505763 311036 395020 244730 128755 681881 618486 302654 137308 432645
17086 432645 516755 438975 320827 395246 552079 597295 317578 331647 353803 438719 533023
17075 533023 328643 311331 687781 659089 393146 478416 246988 423453 423010 208729 228024
$$ packed form
17149A16050L6603d1264A27962J19006M8817j43784l0671J44351I5841L22060
17139D17901q54K48385Q79B51275j12172R0984L01816q0939k4396r3355j35538
17128A97675k0770L31545k29269l9932r7413a97299A64575M34806f3982D26367
17117C06005O5708q1060J09029j14197M4955J50925j14376j51824N8109P1165
17107C44439o1604n9098J4218p5555J76295A29305J77037n5104Q9829o8935J56448
17096D28580P7183j94727Q3984j50290j15975N53126o3395C02654A37308K95337
17086D32645Q4110p7780j18148P4419J56833M5216k79717J4069K2156Q4916R4304
17075E33023k04380j7312L76450k8692k65943Q5270k31428J76465m43B08729J9295
$$ plain form
17064 228024 629953 650403 542011 417982 364710 359744 620811 40078 380822 319146 510497
17053 510497 476572 666134 437760 334765 304929 701986 684952 423691 512735 712772
17043 712772 495369 774426 931095 314498 694048 302449 379239 565732 751929 382826
17033 382826 494327 293399 787291 879804 509315 834366 201512 353179 584869 320483
17023 320483 757550 724958 699722 540939 673147 345926 182450 622501 914747 642476
17013 642476 818403 645175 1124469 772819 864519 557701 1008400 224863 641902 651515
17003 651515 949478 868622 398005 1039485 580035 650059 1038164 794284 810993 783607
16993 783607 551258 488682 536916 642056 829782 640149 676997 946988 952596 792572
$$ packed form
17064B28024M01929K0450j08392j24029n3272m966K61067D0078L40744o1676J91351
17053E10497l3925J89562k28374j02995k9836L97057j7034k61261Q9044K00037
17043G12772k17403K79057J56669C14498L79550C02449P6790J86493J86197l69103
17033C82826J11501k00928M93892R2513l70489L25051B01512J51667K31690k64386
17023C20483M37067l2592k5236j58783J32208l27221j63476M40051K92246k72271
17013F42476J75927j73228M79294l51650R1700l06818M50699B24863M17039R613
17003F51515K97963q0856C98005O41480m59450P0024L88105k43880J6709k7386
16993G83607k32349o2576M8234J05140J87726j89633L6848K69991N608j60024
$$ plain form
16983 792572 957109 1145514 664730 702098 822734 634127 949939 1029013 836334 806955
16973 806955 763033 617172 988768 1002542 955990 853272 831213 543798 1021850 662236
16963 662236 936389 1275438 907321 918471 896794 1291240 836426 1114296 1330708 1034951
16953 1034951 973913 1307572 848334 880654 1124814 797161 783156 1364762 1118222 1370781
16943 1370781 835479 1025472 990404 1235808 1274536 1250276 1148163 1377575 1058063 1254914
16933 1254914 1387655 1185266 1242193 1233264 1532408 1259633 1140699 1393525 1462094 1178890
16923 1178890 1529445 1402214 1473068 1256804 1562246 1686946 1338199 1559135 1350779 1440335
16913 1440335 1517311 1874439 1544310 1705081 1961031 1665699 1775971 1838294 1656310 1723493
$$ packed form
16983G92572J64537J88405m80784L7368J20636j88607L15812P9074j92679k9379
16973H06955m3922j45861L71596J3774m6552j02718k2059k87415M78052l59614
16963F62236K74153L39049l68117J1150k1677L94446m54814K77870K16412k95757
16953A034951o1038L33659m59238L2320K44160l27653j4005N81606k46540K52559
16943A370781n35302J89993l5068K45404L8728k4260j02113K29412l19512J96851
16933A254914J32741k02389N6927q929K99144k72775j18934K52826O8569k83204
16923A178890L50555j27231P0854k16264L05442J24700l48747K20936k08356Q9556
16913A440335P6976L57128l30129J60771K55950k95332J10272O2323j81984O7183
$$ plain form
16903 1723493 1658690 1836570 1585881 1906891 1818278 1881535 2008659 1835192 2128228 1926086
16893 1926086 2137973 2090398 2056344 2146957 1989353 1918437 2262543 2244223 1991723 2192363
16883 2192363 2125994 2290662 2330418 2010563 2383173 2358180 2711684 2515037 2216520 2741268
16873 2741268 2785606 2722756 2431180 2437021 2506284 2800115 2663334 2676324 2794959 2649173
16863 2649173 2901729 2632473 2916968 3212809 3068545 3270397 3077875 3171321 3330167 3160314
16853 3160314 3432677 3735445 3524640 3452793 3786621 3728863 3731789 3592145 3990795 3945152
16843 3945152 3980848 4343212 4140967 3950366 4106995 4462319 4486954 4810363 4477617 4559050
16833 4559050 4916046 4704992 4993192 5182738 4901362 5284045 5781340 5456329 5687242
$$ packed form
16903A723493o4803J77880k50689L21010q8613O3257J27124j73467K93036k02142
16893A926086K11887m7575l4054R0613j57604p0916L44106j8320k52500K00640
16883B192363o6369J64668L9756l19855L72610k4993L53504j96647k98517N24748
16873B741268M4338o2850k91576N841O9263K93831j36781J2990J18635j45786
16863B649173K52556k69256K84495K95841j44264K01852j92522R3446J58846j69853
16853C160314K72363L02768k10805p1847L33828n7758K926j39644L98650m5643
16843C945152L5696L62364k02245j90601J56629L55324K4635L23409l32746Q1433
16833D559050L56996k11054K88200J89546k81376L82683M97295l25011K30913
$$ plain form
16824 5687242 5563738 5936025 6044524 5998684 6162439 6535787 6321185 6606646 6577752 6775004
16814 6775004 6804565 7036664 7674592 7159123 7566918 7942518 7926723 8243139 8347630 8486513
16804 8486513 8791313 8832739 9198737 9795168 9525515 10108015 10146674 10757716 10693586 10883497
16794 10883497 11588209 11244201 11281082 12313548 12371996 13057043 13046718 13565894 13976711 14421613
16784 14421613 14709760 15409112 15579475 16607850 16628290 17137004 17715970 18494804 19361334
16775 19361334 19862485 20508993 21246107 21878839 22589170 23501792 24627331 25233540 26514958
16766 26514958 27212944 28380399 29612993 30532794 31915214 33111841 34675884 35846699
16758 35846699 37589930 39260132 40865374 42712437 45245476 47106590 49173228 51408048
$$ packed form
16824E687242j23504L72287J08499m5840J63755L73348k14602K85461k8894J97252
16814F775004K9561K32099O37928n15469M07795L75600j5795L16416J04491J38883
16804H486513L04800M1426L65998N96431k69653N82500L8659O11042o4130J89911
16794A0883497P04712l44008L6881J032466N8448O85047j0325N19176M10817M44902
16784A4421613K88147O99352J70363J028375K0440N08714N78966P78834Q66530
16775A9361334N01151O46508P37114O32732P10331R12622J125539O06209J281418
16766B6514958O97986J167455J232594R19801J382420J196627J564043J170815
16758C5846699J743231J670202J605242J847063K533039J861114K066638K234820
$$ plain form
16750 51408048 54006296 56697877 59380914 62271548 64842445 68533825 71887922 75706006
16742 75706006 79355956 83459727 87308114 91387803 95893741 100864877 105827104 110257482
16734 110257482 115033732 119847466 124355846 128989265 133389408 137660762 141025268 144566656
16726 144566656 147261998 149223720 150650174 151691548 152066869 151706043 149918489 148004389
16718 148004389 145692802 142618622 139388072 135212249 131085563 126317724 121962236 116980263
16710 116980263 112454987 107447614 102673276 98081907 93596530 89269099 84879464 80891772
16702 80891772 76892424 73494989 69965605 66468645 63271850 60364678 57644836 55099814
16694 55099814 52471268 50133866 47750260 45727828 43735397 41795629 39741856 38173854
$$ packed form
16750E1408048K598248K691581K683037K890634K570897L691380L354097L818084
16742G5706006L649950M103771L848387M079689M505938M971136M962227M430378
16734A10257482M776250M813734M508380M633419M400143M271354L364506L541388
16726A44566656K695342J961722J426454J041374L75321l60826j787554j914100
16718A48004389k311587l074180l230550m175823m126686m767839m355488m981973
16710A16980263m525276n007373m774338m591369m485377m327431m389635l987692
16702H0891772l999348l397435l529384l496960l196795k907172k719842k545022
16694E5099814k628546k337402k383606k022432j992431j939768k053773j568002
$$ plain form
16686 38173854 36610867 35540077 33765552 32854687 31485486 29918511 28842869 28154995
16678 28154995 26837485 25418135 24678930 24176740 23119530 22315674 21638685 20730371 20321316
16669 20321316 19487226 18785426 18400887 17778556 17263424 16475114 16116838 15684830 15256642
16660 15256642 14754433 14130785 13741046 13581389 13335274 12615911 12261559 12030435 11789573
16651 11789573 11570501 11222962 10866911 10630895 10223639 9963660 10045850 9561500 9328300
16642 9328300 9448940 9052303 8610184 8803194 8587076 7867646 8168023 7866060 7579129
16633 7579129 7570367 7510665 7412780 7484549 6537335 6474187 6447980 6227212 6260152 6115952 6182173
16622 6182173 5936332 6021494 5809738 5559963 5481480 5398707 5493824 5391914 5321748 4866695
$$ packed form
16686C8173854j562987j070790j774525r10865j369201j566975j075642o87874
16678B8154995j317510j419350p39205n02190j057210q03856o76989r08314m09055
16669B0321316q34090p01800l84539o22331n15132p88310l58276m32008m28188
16660A5256642n02209o23648l89739j59657k46115p19363l54352k31124k40862
16651A1789573k19072l47539l56051k36016m07256k59979Q2190m84350k33200
16642I328300J20640l96637m42119J93010k16118p19430L00377l01963k86931
16633G579129q762n9702r7885P1769r47214o3148k6207k20768L2940j44200O6221
16622F182173k45841Q5162k11756k49775p8483q2773R5117j01910p0166m55053
$$ plain form
16612 4866695 5096017 5146372 4863824 4854286 4793752 4497144 4537149 4233215 3849996 4060725
16602 4060725 4266505 3795714 4008907 4187204 3740299 3961206 3858956 3702993 3623246 3812908
16592 3812908 3411159 3566848 3566923 3050194 3198620 3624665 3165859 3227916 3068518 3391838
16582 3391838 3123413 3241536 2809579 3116127 3303252 3144233 2846991 3024158 2514187
16573 2514187 2747090 2738866 2481345 2864458 2554046 2517554 2500007 2371323 2548859 2290229
16563 2290229 2423090 2248514 2242021 2296858 2505065 2221492 2624692 1956704 2019216 2203176
16553 2203176 2479767 2112442 1944694 2193911 2052385 2036100 2067561 1951645 1957766 1866308
16543 1866308 2214748 1662927 2106118 1779247 1925448 1777915 1940877 1810514 1758476 1796619
$$ packed form
16612D866695K29322N0355k82548r538o0534k96608M0005l03934l83219K10729
16602D060725K05780m70791K13193J78297m46905K20907j02250j55963p9747J89662
16592C812908m01749J55689P5n16729J48426M26045m58806O2057j59398L23320
16582C391838k68425J18123m31957L06548J87125j59019k97242J77167n09971
16573B514187K32903q224k57521L83113l10412l6492j7547j28684J77536k58630
16563B290229J32861j74576o493N4837K08207k83573M03200o67988O2512J83960
16553B203176K76591l67325j67748K49217j41526j6285L1461j15916O121r1458
16543A866308L48440n51821M43191l26871J46201j47533J62962j30363n2038L8143
$$ plain form
16533 1796619 1875967 1662454 1981150 1551527 1993436 1685238 1560891 1748907 1613179 1617205
16523 1617205 1481776 1369555 1359477 1325925 1329792 1473903 1547425 1339800 1872134 1408893
16513 1408893 1404993 1329123 1512746 1090147 1474446 1425617 1577174 1476736 1301317 1342631
16503 1342631 1398926 1237281 961476 1348660 1494548 1432986 1340631 1309294 1228892 829037
16493 829037 1153752 1310507 1334966 1074275 1315348 961086 1094055 979994 1094070 913535
16483 913535 1109591 1174951 866213 1224451 946608 1174150 1181120 1217702 1326051 1056404
16473 1056404 1034178 1172987 1135530 1167727 885477 1019932 687235 926753 998633 1120314
16463 1120314 998603 704430 770407 807324 893145 1120561 1153186 671056 854195 833115
$$ packed form
16533A796619P9348k13513L18696m29623M41909l08198j24347J88016j35728M026
16523A617205j35429j12221j0078l3552L867J44111P3522k07625N32334m63241
16513A408893l900p5870J83623m22599L84299m8829J51557j00438j75419M1314
16503A342631N6295j61645k75805L87184J45888o1562r2355l1337q0402l99855
16493H29037L24715J56755K4459k60691K41073l54262J32969j14061J14076j80535
16483I13535J96056O5360l08738L58238k77843K27542O970L6582J08349k69647
16473A056404k2226J38809l7457L2197k82250J34455l32697K39518P1880J21681
16463A120314j21711k94173O5977L6917Q5821K27416L2625m82130J83139k1080
$$ plain form
16453 833115 1005226 883798 913093 734403 891208 1132935 629681 742944 927470 994495
16443 994495 655053 776584 719813 1022584 1016391 533448 818547 590653 1050831 665212
16433 665212 735830 605101 939913 622668 835804 589010 791164 689581 765850 878852
16423 878852 1069197 901047 459408 702327 273223 783090 770132 612320 438662 820474
16413 820474 575245 608564 455246 702289 451798 689781 690774 727389 618889 605266 888788
16402 888788 440159 408378 632895 791460 480426 805372 515335 633085 423664 444059
16392 444059 583536 768008 622119 680092 575072 645095 499882 627263 453945 527451
16382 527451 600115 427689 502300 567812 506412 370722 666647 426613 769392 460354
$$ packed form
16453H33115J72111j21428K9295j78690J56805K41727n03254J13263J84526O7025
16443I94495l39442J21531n6771L02771o193m82943K85099k27894M60178l85619
16433F65212P0618j30729L34812l17245K13136k46794K02154j01583P6269J13002
16423H78852J90345j68150m41639K42919B73223N09867j2958j57812j73658L81812
16413H20474k45229L3319j53318K47043k50491K37983R93L6615j08500j3623K83522
16402H88788D40159l1781K24517J58565l11034L24946k90037J17750k09421K0395
16392D44059J39477J84472j45889N7973j05020P0023j45213J27381j73318P3506
16382E27451P2664j72426P4611O5512o1400j35690K95925k40034L42779l09038
$$ plain form
16372 460354 659386 587442 445858 709848 327680 468548 502024 494954 232245 411762
16362 411762 793615 399049 695306 580179 235491 604565 676235 315202 13858 459941
16352 459941 682692 502432 607136 494542 536960 486640 161652 31655 383884 532396
16342 532396 235282 440238 277802 535698 537472 447585 -25166 357602 282275 760957
16332 760957 488594 728602 386795 547201 304936 930546 244515 288083 608702 636733
16322 636733 433349 263124 492738 429006 472282 416078 488585 342904 217147 333315
16312 333315 462428 29889 457345 264253 691956 377316 547139 552829 393482 171190
16301 277993 642212 298419 273495 292883 467353 435695 430862 355922 586618 274018 590935
$$ packed form
16372D60354J99032p1944j41584K63990C27680J40868L3476p070B32245J79517
16362D11762L81853l94566K96257j15127B35491L69074P1670C15202A3858M46083
16352D59941K22751j80260J04704j12594M2418n0320A61652C1655L52229J48512
16342E32396B35282K04956j62436K57896J774q9887b5166C57602p5327M78682
16332G60957k72363K40008l41807J60406k42265O25610B44515M3568L20619K8031
16322F36733k03384j70225K29614o3732M3276n6204P2507j45681j25757J16168
16312C33315J29113B9889M27456j93092M27703l14640J69823N690j59347A71190
16301B77993L64219B98419k4924J9388J74470l1658m833p4940K30696B74018L16917
$$ plain form
16290 590935 256242 601779 277886 412752 464154 551074 151322 346952 639053 456666
16280 456666 525434 764383 322818 416267 184495 413963 268510 216319 397229 54698
16269 458948 459409 451809 435255 460584 467820 284831 590525 332873 324884 447259 257195
16258 257195 347763 301415 527932 224411 118526 552160 125080 431173 150720 339831
16248 339831 326112 403763 34081 95666 407676 131720 275423 357822 148158 624505
16238 624505 610665 394642 366822 209871 61045 393115 16020 121749 432675 331598
16228 331598 222218 6616 313953 134017 351558 295552 107326 117465 -17598 297646
16217 130179 188947 134377 140997 109887 480724 379129 209560 331917 310203 291149 200137
$$ packed form
16290E90935B56242L45537B77886J34866N1402Q6920A51322J95630K92101j82387
16280D56666O8768K38949C22818R3449A84495K29468j45453n2191J80910E4698
16269D58948M61p600j6554K5329P236j82989L05694k57652p989J22375j90064
16258B57195R0568m6348K26517B24411j05885M33634A25080L06093A50720J89111
16248C39831j3719P7651C4081O1585L12010A31720J43703Q2399A48158M76347
16238F24505j3840k16023k7820j56951F1045L32070A6020J05729L10926j01077
16228C31598j09380F616L07337A34017K17541n6006A07326J0139a7598B97646
16217A30179N8768n4570O620l1110L70837j01595j69569J22357k1714j9054r1012
$$ plain form
16206 200137 180279 42560 66263 354743 231085 335805 368770 43000 396987 147870
16195 -139212 88093 341310 13623 56960 156115 -2622 -126138 17539 89549 535620 408255
16184 408255 -60715 364352 -190198 50777 212722 -157317 325260 110828 521848 376127
16174 376127 214191 -65870 -2379 117120 202938 105004 34651 212123 109063 36892 113297
16163 113297 72825 168641 61611 316134 106153 -28505 235121 61628 295862 422342
16153 422342 230259 19216 -65655 278240 280461 9430 -7802 -97209 32559 71450 259634
16142 259634 -201868 256235 192902 229462 207026 -42113 100607 9714 -69709 241883 19550
16130 83621 -38725 -2826 -100933 181407 267734 373273 -111031 -31759 -62699 185064 -5434
$$ packed form
16206B00137j9858D2560K3703K88480j23658J04720L2965D3000L53987A47870
16195a39212H8093K53217A3623M3337R9155b622j23516A7539P2010M46071j27365
16184D08255f0715C64352a90198E0777J61945a57317C25260A10828M11020j45721
16174C76127j61936f5870b379A17120Q5818r7934C4651J77472j03060C6892P6405
16163A13297m0472R5816F1611K54523A06153b8505B35121F1628K34234J26480
16153D22342j92083A9216f5655B78240K221I430g802q9407C2559L8891J88184
16142B59634b01868B56235o3333L6560k2436d2113A00607I714f9709B41883A9550
16130H3621c8725b826r8107A81407Q6327J05539a11031c1759l0940A85064e434
$$ plain form
16118 -125038 -70562 2025 126038 150833 -259907 65166 -69895 -227876 -62566 145017 169213
16107 169213 -145285 -43150 17488 -183759 -89106 124791 177488 207254 34116 244247 150993
16096 150993 189673 167505 206678 177764 88216 79074 -135869 -99395 -113736 -263731 269069
16084 450998 198355 25936 -125942 319552 -232944 96439 498858 171441 175120 271194
16074 271194 97288 -103277 -56183 337322 -22906 -1934 -80770 247597 226175 235547 119306
16063 119306 93989 -77493 34955 -12830 -40456 130437 102815 6147 -208435 193618 212531
16052 212531 17497 228524 95292 -53551 215318 17354 -141579 -78672 -125440 -16663 -83524
16041 -83524 147317 180819 213536 -60457 126027 -495 120061 83433 286458 130155 171992
$$ packed form
16118a25038N4476B025J24013K4795b59907F5166f9895j57981f2566A45017K4196
16107A69213a45285d3150A7488a83759h9106A24791N2697K9766C4116K10131r3254
16096A50993L8680k2168L9173k8914H8216r142a35869L6474j4341j49995B69069
16084D50998A98355B5936a25942C19552b32944I6439M02419A71441L679R6074
16074B71194I7288a03277M7094C37322b2906a934p8836B47597k1422R372j16241
16063A19306k5317g7493C4955a2830k7626A30437k7622F147b08435A93618J8913
16052B12531A7497K11027I5292e3551B15318A7354a41579O2907m6768a6663o6861
16041h3524A47317L3502L2717f0457A26027d95A20061l6628K03025A30155M1837
$$ plain form
16030 171992 153083 114345 48969 42215 914 242934 -385490 182420 167899 243300 219929
16019 219929 37883 -250067 141707 35038 285531 505731 96009 238214 169793 320223
16009 320223 73008 -68210 420283 352787 104485 33794 -297503 -529190 -14374 58938 86168
15998 86168 14715 -5321 -182987 -101297 -112957 206432 -180659 -3829 -6389 157650 -183559
15986 -93474 -63379 -85842 174373 252416 145834 194004 65975 -73951 283305 -101152 215830
15974 296838 24206 352840 -123207 -35383 145376 106043 95300 -119158 -247161 -239659 -103607
15962 -308653 -70071 -327173 453187 -245391 93205 43866 -43593 68781 23395 109958 196548
15951 196548 -70401 -220149 -133225 -142672 -25400 173323 97263 -108242 -493849 121433 124696
$$ packed form
16030A71992j8909l8738D8969o754I14K42020c85490A82420j4521P5401k3371
16019B19929C7883b50067A41707C5038K50493K20200I6009J42205o8421J50430
16009C20223G3008f8210D20283o7496A04485C3794b97503k31687a4374E8938K7230
15998H6168A4715e321j77666Q1690j1660B06432a80659c829k560A57650a83559
15986i3474L0095k2463A74373P8043j06582M8170F5975g3951B83305a01152B15830
15974B96838B4206L28634a23207c5383A45376l9333j0743a19158j28003P502a03607
15962c08653g0071k57102D53187b45391I3205D3866d3593F8781B3395Q6563Q6590
15951A96548g0401j49748Q6924r447b5400A73323p6060a08242l85607A21433L263
$$ plain form
15940 124696 -127052 179824 -117264 79077 195785 311895 -33234 282307 93327 81777
15930 81777 239445 -9005 -23741 -211334 39178 201041 118611 -93205 214295 70145 -345281
15918 35698 45572 -124232 340101 -110638 -158604 48171 67802 -24123 -140068 96304 -75865
15906 177801 -269451 109905 -300033 -135341 -115453 -141941 -155617 159526 -311477 -414526
15896 -414526 6325 -21130 -278604 -341063 -98367 -51310 71621 50568 -100250 -301644 190020
15884 -406385 -152015 317633 -305071 -83956 131208 284023 384385 -4117 -280332 -243976
15874 -243976 93986 80624 -21692 256142 -127204 -205735 32192 91902 -72497 2435 -29706
15862 40373 -73861 -279407 -303501 -184922 -8552 36477 151090 -245835 3233 264161 -205626
$$ packed form
15940A24696a27052A79824a17264G9077J16708J16110c3234B82307I3327j1550
15930H1777J57668i005j4736j87593C9178J61863q2430i3205B14295G0145c45281
15918C5698R874a24232C40101a10638m7966D8171J9631b4123j15945I6304g5865
15906A77801b69451A09905c00033a35341J9888k6488j3676A59526c11477j03049
15896d14526F325b1130k57474o2459i8367M7057G1621k1053a00250k01394A90020
15884d06385a52015C17633c05071h3956A31208J52815J00362d117k76215L6356
15874b43976I3986j3362b1692B56142a27204p8531C2192N9710g2497B435b9706
15862D0373g3861k05546k4094J18579h552C6477J14613b45835C233K60928b05626
$$ plain form
15850 290945 -74629 279405 72689 7274 -23136 -288347 -63755 -149361 59735 210072 -154604
15838 101927 34472 -154461 -144287 -284112 -221193 51682 21277 -92299 -208624 53279 -105922
15826 -139922 279129 -243980 -55957 -98250 237347 -8898 -56559 173127 -37833 39859 -245073
15814 -321295 -88248 -243704 -87324 26073 40495 -270516 -143622 49148 122166 103966 77152
15803 77152 -49751 236722 -47240 -100226 26573 186413 -88186 -29540 -363751 -64940 -259174
15792 -259174 -208926 -16335 -101712 124921 -178809 -35358 63098 -76104 -182683 127813 -58062
15780 -19319 70922 -332843 81276 96111 -28268 -105348 -95235 55878 -202383 95788 -188981
15768 -146417 -3960 72609 -48283 -216011 216236 -181161 -375103 68433 -90873 91911 -100721
$$ packed form
15850B90945g4629B79405G2689G274b3136k65211f3755q5606E9735J50337a54604
15838A01927C4472a54461J0174j39825O2919E1682B1277i2299j16325E3279a05922
15826a39922B79129b43980e5957m2293B37347h898m7661A73127c7833C9859b45073
15814c21295h8248j55456h7324B6073J4422b70516J26894D9148P3018j8200k6814
15803G7152d9751B36722d7240n2986B6573J59840h8186b9540l34211f4940j94234
15792b59174N0248a6335q5377A24921a78809c5358F3098g6104j06579A27813e8062
15780a9319G0922c32843H1276J4835b8268p7080J0113E5878b02383I5788a88981
15768a46417c960G2609d8283j67728B16236a81161j93942F8433i0873I1911a00721
$$ plain form
15756 371065 -147347 -177693 51765 -81158 96378 -79691 -28585 67435 -46689 4178 183722
15745 183722 137632 -121654 -227995 -308214 -155227 -236924 167232 -106971 42873 -611936
15734 -58905 90443 49808 -306855 -197905 -17285 -159513 35529 219965 113560 159362 243472
15723 243472 4649 -233717 248616 115527 103111 36057 -84827 -121226 -131146 -263798 -327193
15712 -327193 162062 -158794 -229682 164798 -129385 -39958 -149099 -147085 23978 8353 -226908
15700 -106491 -216968 -364955 143522 -19426 331931 -177248 194974 -24919 -997 -3951 55696
15688 -37555 10779 37779 6912 -41043 -23645 2623 39763 -162043 13775 17529 -210323 103578
15675 298770 -16585 157930 189647 -102368 145372 148143 17643 -265070 261708 71151 -235643
$$ packed form
15756C71065a47347l0346E1765h1158I6378g9691b8585F7435d6689D178J79544
15745A83722m6090a21654j06341q0219J52987q1697A67232a06971D2873f11936
15734e8905I0443m0635c06855J08950a7285j42228C5529J84436j06405M5802Q4110
15723B43472D649b33717B48616A15527j2416C6057h4827l6399r920j32652o3395
15712c27193A62062a58794p0888A64798a29385c9958j09141K014B3978H353b26908
15700a06491j10477j47987A43522a9426C31931a77248A94974b4919i97k954E5696
15688c7555A0779K7000F912d1043J7398B623L7140a62043A3775L754b10323A03578
15675B98770a6585A57930L1717a02368A45372K771A7643b65070B61708G1151b35643
$$ plain form
15663 -121902 -10599 -298391 -98659 -37229 70808 -36758 208703 -104105 388299 -109189
15652 78570 -158468 -570471 -144519 -101163 -184882 -84155 -74800 -175631 75726 -136101 -112874
15641 -112874 238279 -8174 50243 81734 163999 -257433 -443057 -178559 188657 -229487
15630 278084 112489 -62064 -158915 99528 270754 -152229 239980 73286 -91810 -26015 -152321
15619 -152321 -362412 -144903 -117875 55077 87168 -174331 -206210 -400638 -34799 -274024
15609 -274024 91392 115924 -145827 6309 -126546 208129 162069 34457 111759 -226065 -85512
15597 -44034 -89744 -101553 -58054 30019 -94628 23723 -1612 -88103 8913 103345 443171 187948
15584 288290 -186220 -74856 -44620 -166520 -125363 94946 -139048 462154 65542 51744 25692
$$ packed form
15663a21902a0599k87792i8659c7229G0808c6758B08703a04105C88299a09189
15652G8570a58468m12003a44519M3356q3719h4155R355j00831G5726a36101K3227
15641a12874B38279h174E0243L1491Q2265b57433j85624a78559A88657b29487
15630B78084A12489f2064r6851I9528J71226a52229B39980G3286i1810b6015j26306
15619a52321k10091a44903K7028E5077L2091a74331l1879j94428c4799k39225
15609b74024I1392K4532a45827F309a26546B08129m6060C4457P7302b26065h5512
15597d4034m5710j1809M3499C0019i4628B3723a612q6491H913R4432L39826A87948
15584B88290a86220g4856L0236j21900M1157I4946a39048D62154F5542j3798B5692
$$ plain form
15572 54292 211544 119142 -99038 -15758 52173 94917 193371 -15626 -35170 203021 256761
15561 256761 96046 18586 317981 155091 -146438 -190487 -229661 -96725 -71672 -116843 209218
15549 -38188 -36898 -174023 -103971 -12373 496618 58568 48570 -46927 -68765 10888 96785 -242043
15536 -115538 -529673 -44670 -150587 369456 -236918 -57025 28007 304609 -211394 -105979
15526 -105979 -186729 -310041 -111255 -146629 -141010 49053 -95299 -307442 33368 -260883 186078
15514 -254901 274089 -97720 178887 55925 -79478 -24588 220082 223748 105499 179505 301113
15503 301113 440816 105315 -178547 294615 393329 -311461 10158 223262 -543556 -42531
15492 -222192 -3228 -47401 -90190 73724 -90788 -120786 -307838 -141266 -272891 129663 132510
$$ packed form
15572E4292J57252r2402i9038a5758E2173M2744R8454a5626j9544B03021N3740
15561B56761I6046A8586K99395A55091a46438m4049l9174i6725K5053m5171B09218
15549c8188J290j37125P0052a2373D96618E8568r998d6927k1838A0888Q5897b42043
15536a15538m14135d4670j05917C69456b36918e7025B8007K76602b11394J05415
15526a05979q0750j23312a11255l5374N619D9053i5299k12143C3368b60883A86078
15514b54901B74089i7720A78887E5925g9478b4588B20082L666A05499P4006J21608
15503C01113J39703A05315a78547B94615R8714c11461A0158K13104e43556d2531
15492b22192c228m4173m2789G3724i0788k9998j87052a41266j31625A29663K847
$$ plain form
15481 132510 -73242 -120814 58190 71746 -119145 81460 -95826 228616 -98779 -2645 67408
15469 40687 209284 116405 28410 112245 -48064 161971 132862 311303 145629 -96917 188647
15457 246853 -156270 335584 79653 251147 159900 369197 -16948 278214 -165072 329037
15446 -55556 -56801 24716 -155213 -139043 2297 -131931 28233 140441 204675 40268 -43816
15434 -186707 81200 15964 139757 -261848 -137799 -178613 92475 -203534 -94912 141006
15423 166720 -66123 -167044 -67430 83967 178370 -109282 55010 -162815 -1159 23041 -98944
15411 184303 -10804 -139371 98213 119223 -134371 149859 181745 -67585 192994 57090 210810
15400 210810 189052 -283672 191976 -167620 -198093 -136357 -4073 -34513 -103110 91670 -193163
$$ packed form
15481A32510g3242m7572E8190J3556a19145H1460i5826B28616i8779b645F7408
15469D0687J68597r2879B8410Q3835d8064A61971k9109J78441A45629i6917A88647
15457B46853a56270C35584G9653J71494r1247K09297a6948B78214a65072C29037
15446e5556j245B4716a55213J6170B297a31931B8233J12208O4234D0268d3816
15434a86707H1200A5964J23793b61848J24049m0814I2475b03534i4912A41006
15423A66720f6123j00921f7430H3967R4403a09282E5010a62815a159B3041i8944
15411A84303a0804j28567I8213K1010a34371A49859L1886f7585A92994E7090J53720
15400B10810k1758b83672A91976a67620l0473O1736d073l0440o8597I1670a93163
$$ plain form
15388 191164 16554 -15205 33791 -33852 70010 277458 30770 153537 -56140 -139411 -258047
15377 -258047 74131 -249979 -150822 -92392 234999 -266208 203851 61466 -33918 52949 136125
15366 136125 -335245 -94077 250566 -126870 284088 125770 100369 -225186 97370 -94193
15355 21560 -36421 134921 171048 -168066 -69917 122095 164684 -42997 -73715 -197321 -123327
15344 -123327 -49051 85516 11362 -140560 -150249 70370 -35302 83579 -101697 -98026 252319
15332 39500 291552 346148 183669 63754 303357 -282992 229815 -188755 121659 -38895
15321 122012 72632 -52477 -66144 -100548 -40613 377199 -190613 -17770 502050 84485 206881
15310 206881 116457 181939 204067 3034 -145163 184349 -83637 434174 -303332 -163506 -200944
$$ packed form
15388A91164A6554a5205C3791c3852G0010K07448C0770J22767e6140q3271j18636
15377b58047G4131b49979R9157N8430B34999b66208B03851F1466c3918E2949Q3176
15366A36125c35245i4077B50566a26870B84088A25770k5401b25186I7370i4193
15355B1560c6421A34921L6127a68066f9917A22095M2589d2997l0718j23606P3994
15344a23327d9051H5516A1362a40560r689G0370c5302H3579a01697L671B52319
15332C9500K52052N4596j62479F3754K39603b82992B29815a88755A21659c8895
15321A22012m9380e2477j3667l4404d0613C77199a90613a7770E02050H4485J22396
15310B06881r0424O5482K2128C034a45163A84349h3637D34174c03332J39826l7438
$$ plain form
15299 -200944 110431 -48700 194404 -202827 187465 -225083 5444 -125451 10243 -160979
15288 96884 94287 175247 333285 -382774 56960 -54899 -138271 -41969 -49358 225130 258764
15277 258764 -21424 56467 293997 54096 192210 -263512 -287563 -289079 211281 -60255 242201
15265 -213353 287033 -84452 27846 -14133 -33595 -29201 80463 118005 252263 -47230 145849
15253 249036 317029 137197 -158556 437857 711019 1446074 875673 808342 1019754 543298
15243 543298 287939 -19713 241390 -53465 86672 -23576 29011 232970 7428 -163942 79507
15231 71481 -305888 40058 -294872 109358 -39244 48839 310857 117679 151714 -173614
15220 147072 208520 372117 -87938 -77898 195854 -193531 28963 84756 258566 -68402 139153
$$ packed form
15299b00944A10431d8700A94404b02827A87465b25083E444a25451A0243a60979
15288I6884k597Q0960J58038c82774E6960e4899q3372d1969p389B25130L3634
15277B58764b1424E6467K37530E4096J38114b63512k4051j516B11281f0255B42201
15265b13353B87033h4452B7846a4133j9462M394H0463L7542J34258d7230A45849
15253B49036O7993A37197a58556D37857K73162P35055n70401o7331K11412m76456
15243E43298k55359a9713B41390e3465H6672b3576B9011K03959G428a63942G9507
15231G1481c05888D0058b94872A09358c9244D8839K62018A17679L4035a73614
15220A47072O1448J63597h7938J0040A95854a93531B8963N5793J73810f8402A39153
$$ plain form
15208 126704 -285945 108746 -62358 30972 -116466 -22267 78346 379048 -330541 363686
15197 -9721 -195633 -206193 89925 -143290 395741 -383343 229573 -316816 144415 -305613
15186 67566 182801 78372 248411 376744 125345 158341 123156 268980 -140803 82782
15175 -116187 1309 -108776 49297 33332 369092 110047 -46708 19707 -61595 64233 108753
15164 108753 59792 234464 -306930 211413 56900 10215 113532 203074 157246 41995 171931
15153 171931 -300922 -120430 -76434 -49926 -176124 -84263 -111235 124253 70669 117213 130111
15142 130111 185136 75418 -319690 -17778 96491 236572 113340 -270240 -320252 355752
15131 206685 218294 161385 -138842 125336 127038 155189 191643 203212 -3347 17046 393747
$$ packed form
15208A26704b85945A08746f2358C0972a16466b2267G8346L00702c30541C63686
15197i721j85912j0560H9925a43290C95741c83343B29573c16816A44415c05613
15186F7566J15235G8372J70039J28333A25345L2996l5185J45824a40803H2782
15175a16187A309a08776D9297j5965L35760A10047d6708A9707f1595F4233M4520
15164A08753m8961J74672c06930B11413E6900A0215J03317Q9542m5828D1995J29936
15153A71931c00922a20430M3996K6508j26198h4263k6972A24253n3584M6544J2898
15142A30111N5025G5418c19690a7778I6491J40081A13340b70240n0012C55752
15131B06685J1609n6909a38842A25336J702K8151L6454J1569c347A7046L76701
$$ plain form
15120 393747 286196 -96718 38122 -234410 290127 -142545 37521 124980 442879 -27192
15109 25567 -62329 173361 206701 325581 160744 43656 -133920 75775 257502 157467
15099 157467 491912 117534 146121 269512 -137048 276295 -218073 29843 397817 -187805
15088 56688 9916 -97593 90710 263642 157365 194531 368669 363458 136928 -146792 -280450
15077 -280450 396552 315136 265415 29687 196042 89244 -121442 -208423 270329 78956 447675
15066 447675 255679 77431 -97293 -132757 -69451 -63252 74948 -135307 105029 -102247 317019
15054 -146513 99529 82546 87147 -272886 287740 -13104 -38132 296661 324056 106513 84312
15043 84312 273213 556404 240579 111330 98664 298643 -40889 120350 -167095 78945
$$ packed form
15120C93747j07551i6718C8122b34410B90127a42545C7521Q7459L17899b7192
15109B5567f2329A73361L3340J18880A60744D3656a33920G5775J81727j00035
15099A57467L34445A17534K8587J23391a37048B76295b18073B9843L67974a87805
15088E6688I916i7593I0710J72932j06277L7166J74138n211A36928a46792j33658
15077b80450C96552q1416m9721B9687J66355H9244a21442q6981B70329G8956L68719
15066D47675j91996G7431i7293l5464O3306O199G4948a35307A05029a02247C17019
15054a46513I9529j6983M601b72886B87740a3104k5028B96661K7395A06513k2201
15043H4312J88901K83191B40579A11330j2666J99979d0889A20350a67095G8945
$$ plain form
15032 20386 572955 47830 153330 343718 122101 305783 195328 290281 206396 327538
15022 327538 -49171 191353 427811 414331 167110 405091 157046 403124 -68090 100575
15011 493941 -82010 215223 71560 154104 558901 251787 -26620 474354 103608 175495
15001 175495 442342 381220 150772 265032 214769 135848 245228 216483 78966 443972
14991 443972 535462 80245 23233 -30842 281906 318070 59797 365101 528666 566594 -98217
14979 253895 70042 322576 370353 205521 91006 -167820 284505 463219 82758 181308
14969 181308 194117 193995 182945 186181 -248421 55595 120465 75179 198020 65654 129267 505759
14957 505759 100015 207361 181057 125579 430402 41249 174953 422512 179176 54767
$$ packed form
15032B0386N52569D7830J05500J90388A22101J83682j10455R4953q3885J21142
15022C27538d9171A91353K36458j3480A67110K37981A57046K46078f8090A00575
15011D93941h2010B15223G1560Q2544M04797B51787b6620D74354A03608P1887
15001A75495K66847o1122A50772J14260n0263p8921J09380k8745G8966L65006
14991D43972R1490H0245B3233c0842B81906L6164E9797L05304J63565L7928i8217
14979B53895G0042K52534M7777j64832I1006a67820B84505J78714H2758R8550
14969A81308J2809j22j1050L236b48421E5595O4870m5286J22841F5654O3613L76492
14957E05759A00015J07346k6304n5478L04823D1249J33704K47559A79176E4767
$$ plain form
14946 586359 105448 187474 -47360 150469 -60319 199345 250051 355725 92550 241197
14936 241197 102953 280520 320107 278656 234365 -58083 377721 183451 376465 82467
14925 722435 422481 423360 372930 503114 576997 537227 632563 297426 267616 615724 823746
14914 823746 612701 731268 483892 709965 610690 426684 457199 -75170 220123 660582
14904 660582 221909 355637 258394 -40202 384561 280700 -234509 316760 346350 234000
14894 234000 543264 130124 383374 196172 195819 288847 215898 254191 406814 177319 106016
14883 106016 306691 923134 508273 203851 277312 250463 373190 116661 449169 608937
14873 608937 523224 16548 733720 495169 303583 -99227 488829 417752 87424 519706
$$ packed form
14946E86359A05448Q2026d7360A50469f0319A99345N0706J05674I2550J48647
14936B41197A02953J77567L9587m1451m4291e8083C77721A83451J93014H2467
14925G22435k99954Q79n0430J30184P3883l9770R5336B97426k9810L48108K08022
14914H23746k11045J18567k47376K26073r9275j84006L0515g5170B20123M40459
14904F60582B21909J33728r7243d0202C84561j03861b34509C16760K9590j12350
14894B34000L09264A30124K53250j87202l53R3028p2949L8293J52623A77319p1303
14883A06016K00675O16443m14861B03851P3461k6849J22727A16661L32508J59768
14873F08937q5713A6548P17172k38551j91586i9227D88829p1077H7424M32282
$$ plain form
14863 519706 65863 600348 521208 538887 415487 418539 283605 479322 313653 403829 318285
14852 318285 667740 137459 424790 274047 480435 8719 595737 509887 330193 780272
14842 780272 440082 584355 547527 210767 228197 775748 364046 350451 682037 627471
14832 627471 495088 460122 313451 119967 483751 526152 341528 513379 267070 598750
14822 598750 403520 472259 514019 501460 435960 417189 439983 550180 498530 238206 597209
14811 597209 674775 516550 260032 274407 539228 29506 378191 534365 622470 374224
14801 374224 401894 326045 348691 263961 233075 802442 332443 415718 564575 637211 583838
14790 583838 529698 284145 346372 676130 584057 690329 321231 605296 553331 541706
$$ packed form
14863E19706F5863N34485p9140J7679j23400L052j34934J95717j65669R0176q5544
14852C18285L49455A37459K87331j50743K06388H719N87018q5850j79694M50079
14842G80272l40190J44273l6828B10767J7430N47551C64046j3595L31586n4566
14832F27471j32383l4966j46671A19967L63784M2401j84624J71851k46309L31680
14822E98750j95230O8739M1760j2559o5500j8771K2794J10197n1650B38206L59003
14811E97209P7566j58225k56518J4375K64821B9506L48685J56174Q8105k48246
14801C74224K7670p5849K2646q4730l0886N69367C32443Q3275J48857P2636n3373
14790E83838n4140k45553O2227L29758r2073J06272C21231K84065n1965j1625
$$ plain form
14780 541706 546057 436486 681127 416390 215356 485906 480475 813836 542067 601164
14770 601164 389383 434937 556041 495814 552612 696228 82070 134001 673815 368271
14760 368271 723327 342904 470568 603136 458396 945378 263525 1126419 467621 567977
14750 567977 344093 744154 466478 463235 637784 931415 910562 626511 425312 351683
14740 351683 539917 183312 753138 415211 698395 317717 788006 377649 430583 492156
14730 492156 687492 605588 860081 755946 561903 595799 645448 626968 702696 700973 972411
14719 972411 740239 1249880 982434 862162 680273 746435 814513 589418 293023 717583
14709 717583 647206 705189 540049 910187 656456 758804 796222 848867 965173 655773
$$ packed form
14780E41706M351j09571K44641k64737k01034K70550n431L33361k71769N9097
14770F01164k11781M5554J21104o0227N6798J43616H2070N1931N39814l05544
14760C68271L55056C42904J27664J32568j44740M86982B63525Q62894D67621J00356
14750E67977k23884M00061k77676l243J74549K93631k0853k84051k01199p3629
14740C51683J88234A83312N69826l37927K83184C17717M70289C77649N2934O1573
14730D92156J95336q1904K54493j04135j94043L3896M9649j8480P5728j723K71438
14719I72411k32172N09641k67446j20272j81889O6162O8078k25095B93023M24560
14709G17583p0377N7983j65140L70138k53731J02348L7418N2645J16306l09400
$$ plain form
14699 655773 575246 776500 707168 1019827 705622 715577 787270 818104 846996 708257 1059031
14688 1059031 890704 832497 1120083 841365 876899 860804 1127724 782917 1050877 884444
14678 884444 829543 796633 725792 702871 878867 832425 1105903 962109 1016390 908116 1362186
14667 1362186 978131 834455 958241 750606 644898 976379 811478 912378 975220 906408
14657 906408 736771 937084 925211 799157 877037 910216 967068 994825 915892 953531 705644
14646 705644 1135065 1063293 1106096 984336 1005625 1100787 893091 1143859 1001948 1194593
14636 1194593 973650 905720 1103995 1152645 967628 1068276 1411735 1089541 1106829 1124077
14626 1124077 1103606 864163 1004437 1259975 1443238 1107302 1217620 1145846 1247916 1384711
$$ packed form
14699F55773q0527K01254o9332L12659l14205R955P1693L0834K8892j38739L50774
14688A059031j68327n8207K87586k78718L5534j6095K66920l44807K67960j66433
14678H84444n4901l2910p0841k2921J75996m6442K73478j43794N4281j08274M54070
14667A362186l84055j43676J23786k07635j05708L31481j64901J00900O2842o8812
14657I06408j69637K00313j1873j26054P7880L3179N6852K7757p8933L7639k47887
14646G05644M29421p1772M2803j21760K1289R5162k07696K50768j41911J92645
14636A194593k20943o7930J98275M8650j85017J00648L43459l22194J7288J7248
14626A124077k0471k39443J40274K55538J83263l35936J10318p1774J02070J36795
$$ plain form
14616 1384711 1154587 1282222 1273394 1148700 1464986 1488362 1224141 1152064 1338386 1511916
14606 1511916 1190862 1317111 1459542 1430286 1537910 1470788 1060086 1469104 1471944 1289321
14596 1289321 1405791 1360216 1456609 1544047 1452196 1378446 1963661 1616283 1432699 1552720
14586 1552720 1619588 1679973 1945060 1741601 1740920 1640910 1756706 1726852 1635124 1636242 2035405
14575 2035405 1960193 1765268 1921186 1856486 2286211 1982088 2352148 1960473 2078450 2077592
14565 2077592 1887016 2066451 2421731 2391355 2259735 2265461 2375494 2751003 2531748 2966419
14555 2966419 2768077 3606496 3231828 4104318 4532381 5462007 7472694 11007561 18223822
14546 18223822 34509121 39185108 22082320 9027418 4475954 3371831 2203125 2266881
$$ packed form
14616A384711k30124J27635q828j24694L16286K3376k64221p2077J86322J73530
14606A511916l21054J26249J42431k9256J07624o7122m10702M09018K840j82623
14596A289321J16470m5575R6393Q7438r1851p3750N85215l47378j83584J20021
14586A552720O6868O0385K65087k03459o81j00010J15796k9854r1728J118L99163
14575B035405p5212j94925J55918o4700M29725l04123L70060l91675J17977q58
14565B077592j90576J79435L55280l0376j31620N726J10033L75509k19255M34671
14555B966419j98342Q38419l74668Q72490M28063R29626K010687L534867P216261
14546A8223822J6285299M675987j7102788I027418D475954j104123j168706O3756
$$ plain form
14538 2266881 1950968 1886568 2004729 1961742 1871316 1767256 1720862 1863541 2090625 2115115
14528 2115115 2332470 2172433 1682681 1732537 2011692 2176542 2207579 1893009 2234153 2099478
14518 2099478 1922695 2326210 2204089 2275669 2466870 2738240 2456508 2254390 2580381 2538800
14508 2538800 2960116 2528843 2407574 2308167 2495431 2886882 2788479 2730438 2666826 2934273
14498 2934273 2656342 2618323 2809610 2822943 2940369 2857197 2810586 3053245 3237741 2998353
14488 2998353 2780509 3257052 3283429 3481855 3383482 3267585 3302229 3360447 3330867 3505928
14478 3505928 3217409 3529985 3644224 3460686 3885275 3845951 3832464 3986592 3749034 3945817
14468 3945817 3795821 3736421 4034668 3692307 3799971 4241032 4137255 4118322 4090541 4134835
$$ packed form
14538B266881l15913o4400J18161m2987r0426j04060m6394J42679K27084K4490
14528B115115K17355j60037m89752M9856K79155J64850L1037l14570L41144j34675
14518B099478j76783M03515j22121P1580J91201K71370k81732k02118L25991m1581
14508B538800M21316m31273j21269r9407J87264L91451r8403n8041o3612K67447
14498B934273k77931l8019J91287J3333J17426q3172m6611K42659J84496k39388
14488B998353k17844M76543K6377J98426r8373j15897L4644N8218k9580J75061
14478C505928k88519L12576J14239j83538M24589l9324j3487J54128k37558J96783
14468C945817j49996n9400K98247l42361J07664M41061j03777j8933k7781M4294
$$ plain form
14458 4134835 4194726 4527916 4118993 4435218 4347458 4582983 4614763 4939874 4709049 4695014
14448 4695014 4918519 4818256 5182119 4826708 5325153 4997375 5097033 5316617 5254468 5799051
14438 5799051 5648081 5816499 6078186 5808389 5950706 5851516 6045738 6003117 5885060 6457969
14428 6457969 6611976 6086856 6287325 6436924 6701666 6556916 6743041 6881567 6985802
14419 6985802 6882696 7252920 7410221 7494285 7628002 7387031 7503169 7870875 7973683 7956325
14409 7956325 8370142 8436733 8559942 8850741 8983683 8920108 8864070 9483569 9543623 9334828
14399 9334828 9440514 9842234 9658777 9924050 10257297 10356627 10332978 10545636 10886027 11224037
14389 11224037 11411077 11647160 11709601 11800581 12061778 12255795 12581044 12728037 12905297 13150180
$$ packed form
14458D134835N9891L33190m08923L16225q7760K35525L1780L25111k30825j4035
14448D695014K23505j00263L63863l55411M98445l27778R9658K19584o2149N44583
14438E799051j50970J68418K61687k69797J42317r9190J94222m2621j18057N72909
14428F457969J54007n25120K00469J49599K64742j44750J86125J38526J04235
14419F985802j03106L70224J57301Q4064J33717k40971J16138L67706J02808j7358
14409G956325M13817O6591J23209K90799J32942o3575n6038O19499O0054k08795
14399I334828J05686M01720j83457K65273L33247R9330k3649K12658L40391L38010
14389A1224037J87040K36083O2441R0980K61197J94017L25249J46993J77260K44883
$$ plain form
14379 13150180 13169679 13681541 13983864 14524697 14327906 14884783 15140357 15243617 15577504
14370 15577504 15938744 16218005 16484533 16904658 17156619 17675757 18011277 18421577 19164412
14361 19164412 19426885 19483129 20246073 20366148 20904456 21330895 21884950 22443303 22848219
14352 22848219 23461742 23977741 24734913 25267616 25775970 26430429 27398060 28200986 28499358
14343 28499358 29236858 30504022 31037868 31906687 32600993 33407373 34517646 35494231 36475772
14334 36475772 37495956 38847750 39777599 40770411 42108317 43801107 45201721 46422821
14326 46422821 47913761 49841894 51015947 53048439 54883749 56845119 58966835 60878345
14318 60878345 63613451 65464656 68299774 70379273 73317174 76302244 79207178 82542501
$$ packed form
14379A3150180J9499N11862L02323N40833j96791N56877K55574J03260L33887
14370A5577504L61240K79261K66528M20125K51961N19138L35520M10300P42835
14361A9164412K62473N6244P62944J20075N38308M26439N54055N58353M04916
14352B2848219O13523N15999P57172N32703N08354O54459R67631Q02926K98372
14343B8499358P37500J267164N33846Q68819O94306Q06380J110273R76585R81541
14334C6475772J020184J351794R29849R92812J337906J692790J400614J221100
14326D6422821J490940J928133J174053K032492J835310J961370K121716J911510
14318F0878345K735106J851205K835118K079499K937901K985070K904934L335323
$$ plain form
14310 82542501 85738087 89551979 93109997 97279824 101474059 106371140 110981156 116373819
14302 116373819 121745750 127536224 133959545 140267521 146982168 154423932 162386949 170500473
14294 170500473 179215386 188573061 198531315 208663611 219983722 231389235 243663103
14287 243663103 256366601 270062034 283538561 297902149 312359221 327558095 342521338
14280 342521338 357443767 372349851 386963352 400915658 413895067 425419396 435429619
14273 435429619 442198598 446753356 449963267 451765296 451938687 450096079 447317780 441253123
14265 441253123 432639224 422425806 410323834 396721155 382445195 366895801 351409940
14258 351409940 335626010 319898298 304316381 290269424 276136136 261982519 248733944
$$ packed form
14310H2542501L195586L813892L558018M169827M194235M897081M610016N392663
14302A16373819N371931N790474O423321O307976O714647P441764P963017Q113524
14294A70500473Q714913R357675R958254J0132296J1320111J1405513J2273868
14287B43663103J2703498J3695433J3476527J4363588J4457072J5198874J4963243
14280C42521338J4922429J4906084J4613501J3952306J2979409J1524329J0010223
14273D35429619O768979M554758L209911J802029J73391j842608k778299o064657
14265D41253123q613899j0213418j2101972j3602679j4275960j5549394j5485861
14258C51409940j5783930j5727712j5581917j4046957j4133288j4153617j3248575
$$ plain form
14251 248733944 236075759 223679045 212368900 201995306 191472226 181932281 172824412
14244 172824412 164691178 156870143 149071569 142058252 135248335 128898427 123224283 117484067
14236 117484067 113093302 107685268 102789721 98740740 95000058 90934955 87300840 83621174
14228 83621174 80022025 76969718 74325743 71491710 68717510 66385778 63733791 61782821
14220 61782821 59769594 57737355 55588135 53509142 52039594 50615609 49008639 47423658
14212 47423658 45854422 44229327 43188362 41772935 40495466 39899097 38937670 37552494
14204 37552494 36300299 35279356 34034751 33887346 32878854 31683538 31082195 30094125
14196 30094125 29260114 28334401 27832740 27446294 26371887 25917329 25237427 24687660 23826792
$$ packed form
14251B48733944j2658185j2396714j1310145j0373594j0523080r539945r107869
14244A72824412q133234p821035p798574p013317o809917o349908n674144n740216
14236A17484067m390765n408034m895547m048981l740682m065103l634115l679666
14228H3621174l599149l052307k643975k834033k774200k331732k651987j950970
14220F1782821k013227k032239k149220k078993j469548j423985j606970j584981
14212D7423658j569236j625095j040965j415427j277469n96369r61427j385176
14204C7552494j252195j020943j244605j47405j008492j195316o01343r88070
14196C0094125q34011r25713n01661l86446j074407m54558o79902n49767q60868
$$ plain form
14187 23826792 23184397 22869966 22570760 21772877 21399022 21025735 20674320 19912512 19582390
14178 19582390 18970076 19049682 18506710 17877811 17747668 17251033 16875175 16492233 16221236
14169 16221236 16027238 15898550 15652503 15045268 14821230 14742555 14070629 14098427 13574015 13476545
14159 13476545 13044270 13183910 12470775 12640592 12381571 12193171 12280158 11771142 11380012
14150 11380012 11425691 11506480 11072856 10667746 10570869 10474557 10308075 10016556 9845022 9804854
14140 9804854 9810861 9588508 9204892 9536727 9205711 9174999 9035440 8935791 8545807 8397531
14130 8397531 8252232 8149772 8406793 8261204 7676403 7740264 7634730 7483850 7589662 7613177
14120 7613177 7120349 7181884 6985564 7210275 6798907 6819890 6847659 6461081 6658685 6655142
$$ packed form
14187B3826792o42395l14431k99206p97883l73855l73287l51415p61808l30122
14178A9582390o12314P9606n42972o28899j30143m96635l75858l82942k70997
14169A6221236j93998j28688k46047o07235k24038p8675o71926K7798n24412r7470
14159A3476545m32275J39640p13135J69817k59021j88400Q6987n09016l91130
14150A1380012M5679Q0789m33624m05110r6877r6312j66482k91519j71534m0168
14140I804854O007k22353l83616L31835l31016l0712j39559r9649l89984j48276
14130H397531j45299j02460K57021j45589n84801O3861j05534j50880J05812K3515
14120G613177m92828O1535j96320K24711m11368K0983K7769l86578J97604l543
$$ plain form
14110 6655142 6674106 6195679 6282624 6314971 6241509 5971573 5889001 6203900 5728189 5763265
14100 5763265 5626007 5693758 5746532 5347544 5600001 5132544 5191807 5340730 5216499 5049720
14090 5049720 5333847 5096957 5001451 5234260 4989346 4704178 4857504 5048677 4344426 4288256
14080 4288256 4352996 4555146 4539808 4613637 4539178 4336196 3996100 4447614 4024790 4098003
14070 4098003 4288475 4067579 3883383 4028580 3770139 4169409 3824225 3868607 4000839 3636293
14060 3636293 3741042 4063575 3846161 3474479 3598443 3870264 3653397 3623941 3165751 3369287
14050 3369287 3400515 3831426 3362716 3675185 3052933 3148034 3088530 3211838 2985579 2985519 3134100
14039 3134100 2900420 2839405 3072817 2700514 2953246 3031656 2733533 3357259 2858724 2520737
$$ packed form
14110F655142J8964m78427Q6945L2347p3462k69936q2572L14899m75711L5076
14100E763265j37258O7751N2774l98988K52457m67457N9263J48923j24231j66779
14090E049720K84127k36890r5506K32809k44914k85168J53326J91173p04251n6170
14080D288256O4740K02150j5338P3829p4459k02982l40096M51514m22824P3213
14070D098003J90472k20896j84196J45197k58441L99270l45184M4382J32232l64546
14060C636293J04749L22533k17414l71682J23964K71821k16867k9456m58190K03536
14050C369287L1228M30911m68710L12469o22252R5101n9504J23308k26259o0J48581
14039C134100k33680o1015K33412l72303K52732P8410k98123O23726m98535l37987
$$ plain form
14029 2520737 2707934 2779662 2602175 2739158 2736338 2487095 2534221 2874660 2622270 2413501
14019 2413501 2516543 2364203 2331398 2509245 2562532 2316523 2482856 2221092 2243887 2257059
14009 2257059 2431357 2344760 2307798 2202923 2177741 2220795 1933917 2232111 1953712 2208536
13999 2208536 2242950 2379514 2020207 2125749 2103365 2163759 2055016 2144763 2399400 2811017
13989 2811017 4037760 6492089 12704214 28056686 39904461 25309213 13352225 7969422
13981 7969422 5962304 4961975 4030245 3436451 3562789 3152387 2808387 2830489 2436684
13972 2436684 2606865 2677192 2679478 2359349 2502976 2580512 2061381 2143556 2034906 2181489
13962 2181489 2381028 2125780 2385764 1936839 1972914 2141684 1897227 1994446 2129512 1841676
$$ packed form
14029B520737J87197P1728j77487J36983k820k49243M7126L40439k52390k08769
14019B413501J03042j52340l2805J77847N3287k46009J66333k61764K2795J3172
14009B257059J74298q6597l6962j04875k5182M3054k86878K98194k78399K54824
13999B208536L4414J36564l59307J05542k2384O0394j08743Q9747K54637M11617
13989B811017J226743K454329O212125J5352472J1847775j4595248j1956988n382803
13981G969422k007118j000329r31730n93794J26338m10402l44000K2102l93805
13972B436684J70181P0327K286l20129J43627P7536n19131Q2175j08650J46583
13962B181489J99539k55248K59984m48925L6075J68770k44457R7219J35066k87836
$$ plain form
13952 1841676 1945147 1702046 1653360 1846544 1990706 1532783 1844835 1950386 1546925 1856604
13942 1856604 1691043 1939226 1627764 1628792 1583717 1520365 1459891 1762063 1637484 1771866
13932 1771866 1652430 1410866 1606089 1768905 1838094 1256274 1469174 1421192 1698835 1382847
13922 1382847 1524964 1575968 1417846 1539087 1329600 1322795 1392463 1016453 1717349 1207352
13912 1207352 1309440 1285867 1483867 1172262 1512307 1238439 1613476 1302595 1679877 1071584
13902 1071584 1346782 1426473 1266751 1156754 1470072 1331876 1396881 1078972 1303548 1220035
13892 1220035 1260348 1187664 1255021 1488459 1179855 1105518 1049196 1146296 900171 1145002
13882 1145002 1196154 1084300 1015904 1084457 1127940 1121334 914917 1293726 777761 1015305
$$ packed form
13952A841676J03471k43101m8686J93184J44162m57923L12052J05551m03461L09679
13942A856604j65561K48183l11462J028m5075o3352o0474L02172j24579J34382
13932A771866j19436k41564J95223J62816O9189n81820K12900m7982K77643l15988
13922A382847J42117N1004j58122J21241k09487o805O9668l76010P00896n09997
13912A207352J02088k3573J98000l11605L40045k73868L75037l10881L77282o08293
13902A071584K75198P9691j59722j09997L13318j38196O5005l17909K24576q3513
13892A220035M0313p2684O7357K33438l08604p4337n6322R7100k46125K44831
13882A145002N1152j11854o8396O8553M3483o606k06417L78809n15965K37544
$$ plain form
13872 1015305 1130765 1059080 1063658 885821 1000922 878579 928694 856729 1057468 823638
13862 823638 828282 1196420 1223169 1094437 1027296 894588 1062771 689819 849809 843619 922579
13851 922579 819033 713524 1199461 1017669 972690 684187 916465 626533 743288 849153
13841 849153 1080854 670443 787455 811227 747173 959402 957282 555743 903093 1052700
13831 1052700 970282 936522 867548 404235 990479 740100 848200 867132 812223 1090386
13821 1090386 950527 846848 733904 788581 538850 812951 493607 720237 942382 682821
13811 682821 690165 781446 702048 701585 808207 744723 635436 811704 672853 935857 858939
13800 858939 718236 823123 809758 746478 609555 689661 893273 876568 767008 674599
$$ packed form
13872A015305J15460p1685M578j77837J15101j22343N0115p1965K00739k33830
13862H23638M644L68138K6749j28732o7141j32708J68183l72952J59990o190P8960
13851I22579j03546j05509M85937j81792m4979k88503K32278k89932J16755J05865
13841H49153K31701m10411J17012K3772o4054K12229k120m01539L47350J49607
13831A052700q2418l3760o8974D04235N86244k50379J08100J8932n4909K78163
13821A090386j39859j03679j12944N4677k49731K74101l19344K26630K22145k59561
13811F82821P344R1281p9398m63J06622o3484j09287J76268j38851K63004p6918
13800H58939j40703J04887j3365o3280j36923Q0106K03612j6705j09560r2409
$$ plain form
13790 674599 554647 973089 737089 744923 601465 1087948 746180 1024029 643439 1016757
13780 1016757 691801 811565 498787 719166 271843 961781 526948 361150 483833
13771 483833 852205 917624 250224 457870 730270 844203 642629 666163 570401 423773
13761 423773 691248 859101 418516 476431 709694 802028 850205 548969 596707 710815
13751 710815 610505 716508 594546 803211 792670 540479 725389 675198 409505 572792
13741 572792 534589 552162 518153 692027 512096 991778 403218 749242 874285 394791
13730 658174 561931 234320 520302 818978 694914 518819 354906 845354 497501 641204
13720 641204 486813 603016 409666 337327 495524 455396 695198 332286 609868 620052
$$ packed form
13790F74599j19952M18442k36000P834j43458M86483l41768K77849l80590L73318
13780A016757l24956J19764l12778K20379B71843O89938m34833j65798J22683
13771D83833L68372O5419B50224K07646K72400J13933k01574K3534r5762j46628
13761D23773K67475J67853D18516N7915K33263R2334M8177l01236M7738J14108
13751G10815j00310J06003j21962K08665j0541k52191J84910n0191k65693J63287
13741E72792l8203J7573l4009J73874j79931M79682D03218L46024J25043C94791
13730F58174r6243B34320K85982K98676j24064j76095j63913M90448l47853J43703
13720F41204j54391J16203j93350p2339J58197m0128K39802C32286K77582J0184
$$ plain form
13710 620052 441571 290521 311715 278800 423396 502263 599160 446052 233469 515958
13700 515958 465094 389739 436765 854484 487771 723242 545116 466961 296022 413839
13690 413839 565416 388553 391689 637533 305541 -111583 175503 556803 384436 269360
13680 269360 688380 738219 553588 555578 659176 385633 529315 521709 423482 569465 415846
13669 415846 776843 465641 474680 551905 725126 530160 279625 757684 390068 477875
13659 477875 461025 808238 407601 178079 59420 537928 498330 571381 606812 364303
13649 364303 590893 352147 653331 224997 357447 213716 233866 521001 39241 168603
13639 168603 68092 598530 323607 176402 483227 451631 727035 405540 583657 472792
$$ packed form
13710F20052j78481j51050K1194l2915J44596P8867R6897j53108k12583K82489
13700E15958n0864p5355M7026M17719l66713K35471j78126p8155j70939J17817
13690D13839J51577j76863L136K45844C05541a11583A75503L81300j72367j15076
13680B69360M19020M9839j84631J990J03598k73543J43682p606r8227J45983j53619
13669D15846L60997l11202R039P7225J73221j94966k50535M78059l67616Q7807
13659D77875j6850L47213m00637A78079E9420M78508l9598P3051L5431k42509
13649C64303K26590k38746L01184B24997J32450j43731K0150K87135C9241J29362
13639A68603F8092N30438k74923j47205L06825l1596K75404l21495J78117j10865
$$ plain form
13629 472792 409403 76507 499541 190798 282083 551997 334354 229332 403801 288780
13619 288780 471107 385098 398402 426380 632172 506454 587680 441078 312421 365045
13609 365045 289282 371551 407053 607935 228594 179110 244690 356168 482903 460447 531059
13598 531059 492139 487590 338328 184436 398191 351298 416483 340588 326366 211484 249304
13587 249304 276481 215758 361883 274191 460592 356543 93114 361435 124510 516085
13577 516085 284740 435113 187655 447425 229957 420693 232378 389098 228859 218445
13567 218445 316812 285259 385347 369040 339915 514834 182926 261764 341662 364287 -40932
13555 450069 531826 382118 192831 223821 247425 379936 235002 341678 205433 -12061
$$ packed form
13629D72792o3389G6507M23034A90798R1285K69914k17643j05022J74469j15021
13619B88780J82327q6009J3304K7978K05792j25718Q1226j46602j28657N2624
13609C65045p5763Q2269L5502K00882B28594m9484O5580J11478J26735k2456P0612
13598E31059l8920m549j49262j53892K13755m6893O5185p5895j4222j14882L7820
13587B49304K7177o0723J46125q7692J86401j04049I3114K68321A24510L91575
13577E16085k31345J50373A87655K59770k17468J90736j88315J56720j60239j0414
13567B18445R8367l1553J00088j6307k9125J74919A82926P8838P9898K2625d0932
13555D50069Q1757j49708j89287L0990K3604J32511j44934J06676j36245a2061
$$ plain form
13544 347508 489535 750919 571283 318529 355565 71945 129393 -15394 155727 539492
13534 539492 320425 -222643 179870 353220 284558 329050 300269 156939 178209 298218
13524 298218 404709 273065 146705 444060 76146 254771 185477 481596 262718 240774
13514 240774 405023 425555 293571 210907 189130 196494 784501 498760 137283 90676 135324
13503 135324 257778 128757 46027 99159 289534 237583 344280 397876 432528 396061 334120
13492 334120 352924 184544 -119717 102145 137082 299589 399419 -244716 94509 383310
13482 383310 319238 -38108 337891 181543 400005 452457 310905 153917 374590 147965
13471 130811 281226 15916 414980 89289 248571 101830 198239 182455 199590 17536 -125950
$$ packed form
13544C47508J42027K61384j79636k52754L7036G1945N7448a5394A55727L83765
13534E39492k19067b22643A79870J73350o8662M4492k8781j43330K1270J20009
13524B98218J06491j31644j26360K97355G6146J78625o9294K96119k18878k1944
13514B40774J64249K0532j31984q2664k1777P364N88007k85741A37283m6607M4648
13503A35324J22454A28757D6027N3132J90375n1951J06697N3596L4652l6467o1941
13492C34120J8804j68380a19717A02145L4937J62507R9830b44716I4509K88801
13482C83310o4072c8108C37891j56348K18462N2452j41552A53917K20673A47965
13471A30811J50415A5916L99064H9289J59282A01830R6409j5784J7135A7536a25950
$$ plain form
13459 178186 129294 121185 264721 21876 264350 212359 213148 520693 594405 101587 3097
13447 503918 57086 169016 423356 354598 321897 261088 266514 329493 212867 279440 153858
13436 153858 -87340 43479 409698 103218 287428 -121209 -48882 -194969 151783 70019
13425 110089 -170072 221323 53270 75372 114488 323536 248018 407964 29521 40762 541692
13414 541692 235586 397065 74628 -45119 260769 297616 150884 79805 165402 12243 -42570
13402 94653 241465 -189719 201528 218819 298854 182381 338073 31695 363938 141199
13391 192859 136754 299186 -82310 301309 225040 430706 -43924 318706 169563 259084
13381 259084 183417 158068 171572 85858 257095 164611 210504 408455 -133153 388338 212329
$$ packed form
13459A78186m8892q109J43536B1876K42474n1991P89L07545P3712A01587C097
13447E03918E7086J11930K54340o8758l2701o0809N426O2979j16626O6573j25582
13436A53858h7340D3479L66219A03218J84210a21209d8882j46087A51783G0019
13425A10089a70072B21323E3270K2102L9116K09048p5518J59946B9521J1241N00930
13414E41692B35586J61479G4628d5119B60769L6847j46732p1079Q5597A2243d2570
13402I4653J46812a89719B01528J7291Q0035j16473J55692C1695L32243A41199
13391A92859n6105J62432h2310C01309p6269K05666d3924C18706j49143Q9521
13381B59084p5667k5349J3504q5714J71237r2484M5893J97951a33153C88338j76009
$$ plain form
13370 212329 155211 222764 474246 497084 408513 427286 361615 555944 299189 445457 496182
13359 496182 216356 326718 223150 369326 116789 385847 331299 -9341 26280 359742
13349 359742 184577 225219 305979 448977 542678 72856 326538 494135 380487 279124
13339 279124 299021 269113 241580 65324 353042 81499 73801 362311 344381 109492 292963
13328 292963 175777 373222 281115 364243 63217 215993 263436 92515 367581 -48205 205028
13316 572658 341776 291382 287194 202769 311218 294968 316485 200453 -39715 119058 256690
13305 256690 106953 -187021 389875 107716 117192 -149474 41218 207228 199132 -146283
13294 232536 172399 96913 -135783 191361 235054 230836 89049 411037 200644 134547 226522
$$ packed form
13370B12329n7118O7553K51482K2838q8571J8773o5671J94329k56755J46268N0725
13359D96182B16356J10362j03568J46176A16789K69058n4548i341B6280L33462
13349C59742j75165M0642Q0760J42998R3701G2856K53682J67597j13648j01363
13339B79124J9897k9908k7533F5324K87718H1499p698K88510j7930A09492J83471
13328B92963j17186J97445r2107Q3128F3217J52776M7443I2515K75066d8205B05028
13316E72658k30882n0394m188q4425J08449j6250K1517j16032c9715A19058J37632
13305B56690A06953a87021C89875A07716R476a49474D1218J66010q096a46283
13294B32536o0137p5486a35783A91361M3693m218H9049L21988B00644o6097R1975
$$ plain form
13283 226522 279758 158504 181377 -51568 120900 203757 529255 -48573 91862 108371 282061
13272 282061 23545 261012 299745 321346 -172797 76290 58953 374238 -190221 164306
13261 4960 108160 77855 43582 -1944 78689 -215793 8109 56481 250379 304037 63354 54651
13249 54651 161630 17702 -98798 -218031 -261250 -95587 153097 95444 45974 247469 44942
13237 213219 -68196 104858 90381 -265460 49299 146056 -5515 148269 115986 138595 -229024
13225 -11652 376241 177613 61898 237067 476507 -16020 206100 365254 157921 13142
13214 56615 197001 33504 230124 265544 209806 153938 337635 284 210659 94977 204367
13203 204367 154676 -197521 305771 327217 68927 -42611 30416 -39080 146007 90847 341710
$$ packed form
13283B26522N3236j21254K2873e1568A20900Q2857L25498d8573I1862J6509J73690
13272B82061B3545K37467L8733K1601a72797G6290j7337L15285a90221A64306
13261D960J03200l0305l4273a944G8689b15793H109M8372J93898N3658F3354q703
13249E4651J06979A7702i8798j19233m3219i5587A53097n7653D5974K01495D4942
13237B13219f8196A04858j4477b65460D9299R6757e515A48269l2283K2609b29024
13225a1652C76241A77613F1898J75169K39440a6020B06100J59154A57921A3142
13214E6615J40386C3504J96620L5420n5738n5868J83697B84K10375I4977J09390
13203B04367m9691a97521C05771K1446F8927d2611C0416c9080A46007n5160K50863
$$ plain form
13192 341710 93574 157312 206598 202134 329375 12427 -131611 154064 -186608 163456 -101396
13180 -104944 580514 204248 -266091 170387 157535 204264 -27847 260620 77664 154558
13170 154558 53392 239886 43987 324099 -385589 97164 152751 442978 210801 25073
13159 122155 -109063 -47965 52081 71826 250630 62750 194199 -251487 231628 -2610 69418
13147 -55099 -71188 154774 135710 -122609 -66734 33134 50399 -53853 -238168 -141122 -73368
13136 -73368 180823 10291 275204 490696 82089 178470 -136941 -82384 -82541 -81079 -39215
13124 347760 -5167 6707 151664 -64921 373941 106809 -3660 -84520 53869 17449 -63265
13112 -248530 -279273 160118 222844 314320 6391 162775 17586 33570 -79868 -14835 -239823
$$ packed form
13192C41710I3574O3738M9286m464J27241A2427a31611A54064a86608A63456a01396
13180a04944E80514B04248b66091A70387j2852M6729b7847B60620G7664P6894
13170A54558E3392J86494D3987K80112c85589I7164N5587K90227B10801B5073
13159A22155a09063d7965E2081J9745J78804F2750J31449b51487B31628b610F9418
13147e5099j6089A54774j9064a22609N5875C3134J7265e3853j84315R7046O7754
13136g3368A80823A0291K64913K15492H2089R6381a36941N4557j57J462c9215
13124C47760e167F707J44957f4921C73941A06809c660q0860E3869A7449f3265
13112b48530l0743A60118O2726R1476F391J56384A7586J5984g9868a4835k24988
$$ plain form
13101 -239823 295008 -3805 35573 20440 -35157 206603 111797 312182 -144541 -38876 -53017
13090 -53017 23736 20927 -5359 84732 -30517 165973 -26486 294384 -67393 95646 139626 117477
13078 117477 297787 289695 28767 224113 316359 316560 101992 -46373 -84573 -93576 106196
13066 110734 434950 -169541 275454 -95763 -22077 -22333 259971 -121182 59502 -52500 -94327
13055 -94327 164361 318837 -17094 -184914 18313 -220184 135707 -252095 179148 -110798
13044 198950 228375 -192566 50462 -286803 -91553 71928 -255893 80717 10378 -92938 -270786
13033 -270786 36090 153464 98932 162199 -68623 332599 120715 386310 -343659 252527
13022 -116576 128831 -13732 47168 14893 -17965 -72601 -389048 59640 16234 205116 338189
$$ packed form
13101b39823B95008c805C5573j5133c5157B06603r4806K00385a44541c8876j4141
13090e3017B3736k809e359H4732c0517A65973b6486B94384f7393I5646M3980k2149
13078A17477J80310q092B8767J95346R2246K01A01992d6373l8200r003A06196
13066A10734L24216a69541B75454i5763b2077k56B59971a21182E9502e2500m1827
13055i4327A64361J54476a7094j67820A8313b20184A35707b52095A79148a10798
13044A98950K9425a92566E0462b86803i1553G1928b55893H0717A0378i2938j77848
13033b70786C6090J17374n4532O3267f8623C32599A20715K65595c43659B52527
13022a16576A28831a3732D7168A4893a7965n4636l16447E9640A6234J88882J33073
$$ plain form
13011 338189 389094 -98925 -185621 106758 19177 220619 111239 -209790 -27251 54122 -64411
12999 338319 210207 204465 7271 -36146 -15808 46142 81955 273197 137415 66713 -66908
12987 -27307 124619 380676 34283 167167 -199751 -127200 21551 61417 104154 32081 417260
12976 417260 168892 100725 -126105 134808 -106439 -231254 19405 -79883 15891 145909
12966 145909 407955 148239 -109729 -78675 -221630 120629 50241 -82087 -69065 -120520
12956 -120520 -205500 91292 -150505 217656 -162894 76295 239825 -41087 24638 163315
12946 163315 330472 229418 -230314 1142 257611 189876 98897 101003 116780 339634 282452
12935 282452 -71685 365308 141857 176712 -31060 -214038 282766 27663 187383 39969
$$ packed form
13011C38189N0905i8925q6696A06758A9177K01442j09380b09790b7251E4122f4411
12999C38319j28112n742G271c6146a5808D6142L5813J91242j35782F6713f6908
12987b7307A24619K56057C4283J32884a99751P2551B1551L9866M2737C2081L85179
12976D17260A68892o8167a26105A34808a06439j24815A9405g9883A5891J30018
12966A45909K62046A48239a09729L1054j42955A20629E0241h2087J3022n1455
12956a20520q4980I1292a50505B17656a62894G6295J63530d1087B4638J38677
12946A63315J67157j01054b30314A142K56469o7735r0979K106J5777K22854n7182
12935B82452g1685C65308A41857L4855c1060j82978B82766B7663J59720C9969
$$ plain form
12924 139397 -5423 117207 -85131 212683 69077 -58965 3523 101519 92740 5639 -98184 31687
12911 222218 30233 304609 -534508 -102610 302867 303255 262258 288421 -166093 85018 210111
12900 210111 224591 4987 281072 190375 -112785 504 131291 -141428 -391037 167203 69336
12888 230259 44380 4456 177595 -62620 220958 -196277 150052 302705 113355 -6385 -106893
12877 -106893 79152 239216 -113868 148187 -33412 -191454 -144232 -112209 -158735 -38377 90511
12865 -17832 -296808 -134222 114959 -42362 396207 -75815 -432570 68907 -62352 60493 181684
12854 181684 -5965 85325 -234720 -24472 -75762 432760 295502 -47907 -182420 -65988 123660
12842 -155857 -120823 -146589 110303 -206732 74874 122400 44824 -90427 -214726 93461 211249
$$ packed form
12924A39397e423A17207h5131B12683F9077e8965C523R7996q779E639i8184C1687
12911B22218C0233K74376e34508a02610C02867L88m0997K6163a66093H5018J25093
12900B10111J4480D987K76085r0697a12785E04J30787a41428k49609A67203F9336
12888B30259D4380D456J73139f2620B20958a96277A50052J52653A13355f385j00508
12877a06893G9152J60064a13868A48187c3412j58042M7222L2023m6526c8377I0511
12865a7832k78976a34222A14959d2362C96207g5815l56755F8907f2352F0493J21191
12854A81684e965H5325b34720b4472n1290D32760j37258d7907j34513f5988A23660
12842a55857L5034k5766A10303b06732G4874M7526D4824i0427j24299I3461J17788
$$ plain form
12831 211249 -114374 171173 197953 101146 171954 -330296 296045 -268474 82764 175094
12821 175094 98629 -134657 -164125 -124447 305511 38721 178941 -248380 -210423 147153
12810 -6931 115419 -149570 286151 -150927 35937 -164019 8424 -11610 97002 101610 230477
12799 230477 106536 -136503 -87522 21446 -14060 94305 -165090 -212789 -264689 82687 82131
12788 82131 -12033 12221 3588 138744 -268453 -27404 433144 -100448 61995 -336696 -117647
12776 76871 -109303 263327 -361113 -51641 -127969 244424 -297301 -301101 -28556 250491 -69828
12764 -72495 113844 57824 151004 109901 34901 185745 -43181 239615 100797 128125 44335
12752 339629 68300 -144103 -94639 -169950 -23877 98029 -65360 362110 -333301 80525 68917
$$ packed form
12831B11249a14374A71173K6780r6807P0808c30296B96045b68474H2764R2330
12821A75094p6465a34657k9468L9678C05511C8721J40220b48380L7957A47153
12810f931A15419a49570B86151a50927C5937a64019H424a1610I7002M608J28867
12799B30477A06536a36503M8981B1446a4060I4305a65090m7699n1900H2687n56
12788H2131a2033A2221C588J35156b68453b7404D33144a00448F1995c36696a17647
12776G6871a09303B63327c61113e1641p6328B44424b97301l800b8556B50491f9828
12764g2495A13844n6020R3180m1103C4901J50844d3181B39615A00797K7328D4335
12752C39629F8300a44103M9464p5311b3877I8029f5360C62110c33301H0525j1608
$$ plain form
12741 68917 67879 193611 -160654 -227764 -18011 -208063 -332545 19133 184385 155656 -179508
12729 -329794 69138 113620 -210805 112916 -39842 11810 85371 -233360 340999 497337
12719 497337 193134 -22933 -13566 56646 49985 259806 57015 -208120 -4128 108988 138715
12708 138715 229483 160826 31629 155775 -52168 130506 299099 112010 -21302 180710
12697 90423 157383 98131 268876 84684 -23028 621268 291207 170042 -104987 -42436 127996
12685 40601 259052 25942 103223 -49785 314014 114411 194379 -35651 -96185 239524 -234437
12673 -189981 410875 5806 78851 82755 119636 -164923 26222 -40524 50810 301833 290470
12662 290470 198715 188083 123761 -59537 163888 266744 36495 -85574 38812 218726 211010
$$ packed form
12741F8917j038J25732a60654o7110a8011j90052j24482A9133J65252k8729a79508
12729c29794F9138M4482b10805A12916c9842A1810P3561b33360C40999J56338
12719D97337A93134b2933R367E6646o661K09821E7015b08120d128A08988K9727
12708A38715R0768o8657C1629J24146e2168A30506J68593A12010b1302A80710
12697I0423O6960n9252J70745H4684b3028F21268B91207j21165a04987d2436A27996
12685D0601K18451B5942P7281d9785C14014A14411P9968c5651o0534B39524b34437
12673a89981D10875E806P3045L904L6881a64923B6222d0524E0810K51023j1363
12662B90470r1755j0632o4322e9537A63888J02856C6495h5574C8812J79914p716
$$ plain form
12651 211010 -116141 171264 749535 -92525 -71177 -24570 89743 68460 3537 -76414 -46936
12640 -46936 16688 -170892 -26097 184115 204401 488053 -2666 366749 489267 -38621 339072
12628 239726 58409 273457 284205 390948 -76867 17023 406598 28240 157194 -42124 -97702
12617 -97702 160422 133703 132153 -48714 -222968 -196512 78989 -30845 269801 300142 279734
12606 279734 140306 117083 180125 -47534 382165 -84259 86988 288158 -105228 71747 292343
12595 292343 396457 176240 -186428 -37049 -159116 -135723 13834 161931 91324 221673
12585 221673 -180690 -148774 188142 92575 -41920 -19084 -16209 -15091 -3926 8695 292186 252184
12573 252184 129245 141863 -268040 115548 481 -159204 68937 15102 -180000 79007 104538
$$ packed form
12651B11010a16141A71264N78271i2525K1348b4570H9743k1283C537g6414K9478
12640d6936A6688a70892b6097A84115K0286K83652b666C66749J22518c8621C39072
12628B39726E8409K15048J0748J06743g6867A7023L89575B8240J28954d2124n5578
12617i7702A60422k6719j550d8714j74254K6456G8989c0845B69801L0341k0408
12606B79734j39428k3223O3042d7534C82165h4259H6988K01170a05228G1747K20596
12595B92343J04114A76240a86428c7049j22067K3393A3834J48097p0607J30349
12585B21673a80690L1916A88142I2575d1920a9084K875J118c926H695K83491m0002
12573B52184j22939J2618b68040A15548D81a59204F8937A5102a80000G9007K5531
$$ plain form
12562 104538 -29545 242384 -52445 136516 -100388 -167938 -97882 209608 253674 231581 127463
12551 127463 28118 96147 274415 10770 121964 392020 -159648 -103138 135202 -191523
12540 -52160 288147 298922 75458 -69556 139494 -19932 -86905 -42289 178550 -216189 -31601
12528 161929 -21922 -104668 -23375 -129797 241 281941 271589 21817 428291 470987 311001
12517 311001 468906 228916 -110162 -113831 206447 274175 -179087 149004 -23398 318474
12506 -133685 121609 338982 -15957 -109858 -120146 80942 -107380 1926 -1738 -97041 246523
12494 -56829 -355879 287841 229075 302547 259287 224626 401229 -163610 107148 -157641
12483 -266669 -16528 96544 -91037 140904 304150 176354 100602 -22397 -238793 -165285 -55563
$$ packed form
12562A04538b9545B42384e2445A36516a00388o7550P0056B09608M4066k2093j04118
12551A27463B8118O8029J78268A0770J11194K70056a59648N6510A35202a91523
12540e2160B88147J0775G5458f9556A39494a9932o6973d2289A78550b16189c1601
12528A61929b1922q2746b3375j06422B41K81700j0352B1817M06474M2696j59986
12517C11001J57905B28916a10162l669B06447O7728a79087A49004b3398C18474
12506a33685A21609K17373a5957r3901j0288H0942a07380A926a738r5303B46523
12494e6829k99050B87841n8766P3472m3260l4661J76603a63610A07148a57641
12483b66669a6528I6544i1037A40904J63246j27796p5752b2397k16396P3508e5563
$$ plain form
12471 13888 -273489 -191106 49852 49642 105260 156596 161086 -207639 142135 268261 -86260
12459 155112 -158096 -115382 -38386 -2248 -38353 155605 -74362 84291 -250250 184563 -142065
12447 -56387 -152115 -34035 -19130 119516 -149128 -172111 -24609 137398 -53055 -36712 -257398
12436 -257398 113879 -52190 -38042 119586 72405 -3325 -89147 109273 142419 -16440 176134
12424 23447 121860 -460428 -281516 163088 -219456 -127088 92312 -54407 34582 270244 -163300
12412 -389949 90995 189916 -56675 -332221 450190 30070 59548 -94962 176074 190592 76692
12400 51674 158499 -51023 194465 -199341 -164745 495856 117645 -163755 167230 -64124
12389 -152893 -114385 294599 -135561 -13116 -249738 80988 105768 -298964 108475 102293 183316
$$ packed form
12471A3888b73489Q2383D9852k10N5618N1336M490b07639A42135J26126h6260
12459A55112a58096M2714c8386b248l6105A55605g4362H4291b50250A84563a42065
12447e6387r5728c4035J4905A19516a49128k2983b4609A37398e3055J6343k20686
12436b57398A13879e2190J4148A19586m7181c325q5822A09273L3146a6440A76134
12424B3447R8413d60428J78912A63088b19456R2368I2312e4407C4582K35662a63300
12412c89949I0995R8921e6675k75546D50190C0070K9478i4962A76074J4518G6692
12400E1674J06825e1023A94465a99341L4596D95856A17645a63755A67230f4124
12389a52893L8508B94599a35561a3116k36622H0988K4780b98964A08475o182Q1023
$$ plain form
12378 183316 -13569 118334 50239 -12011 88111 -98546 -167910 296815 401461 88540 153045
12367 153045 -44783 -94081 76564 126038 -65356 -39938 -122917 -261879 54490 -227743 26472
12355 114617 301996 -234121 -134390 21879 250317 -77618 -169335 -226012 -131702 49969 182017
12344 182017 246748 -44712 112962 -94515 98450 -183545 -44148 282603 -39573 -243156 -223811
12333 -223811 256292 22095 256160 -195511 133507 -39178 22134 -229428 140063 201926
12323 201926 247763 189137 -85142 -165452 -144900 -198607 478284 -208049 230682 -199412 -13292
12311 -143660 106022 273832 234656 422465 83088 -210169 47798 245902 235427 235213 -25670
12299 -5622 107911 -105484 129872 -242189 -781 39462 431273 22025 -147421 226397 -780
$$ packed form
12378A83316a3569A18334E0239a2011H8111i8546o9364B96815J04646H8540O4505
12367A53045d4783m9298G6564M9474f5356K5418q2979j38962E4490b27743B6472
12355A14617J87379b34121R9731B1879K28438g7618r1717n6677R4310D9969J32048
12344A82017O4731d4712A12962i4515I8450a83545d4148B82603c9573k03583J9345
12333b23811B56292B2095K34065a95511A33507c9178B2134b29428A40063O1863
12323B01926M5837n8626h5142q0310K0552n3707D78284b08049B30682a99412a3292
12311a43660A06022J67810l9176J87809H3088b10169D7798J98104j0475k14b5670
12299e622A07911a05484A29872b42189g81C9462L91811B2025a47421B26397g80
$$ plain form
12287 69849 214175 -86237 -122017 -125660 -76462 167064 23189 44006 276554 19146 -105721
12275 279402 -8048 -85640 110352 152532 57161 -67235 29732 -266927 102445 176850 -198991
12263 154170 -56291 -138132 154356 -267852 -145733 -19832 48902 36399 33897 -4679 -285797
12252 -285797 103044 12909 -224135 6994 -103742 -94570 299605 99339 169928 12977 198593
12241 198593 378817 -16645 69377 238358 291576 142326 51564 49127 326622 44670 464679
12230 464679 250056 -12846 231477 -28666 205936 116259 394696 234378 81194 178352
12220 178352 388524 332883 149466 123465 359131 44937 310246 274787 71491 199996
12210 199996 357984 265716 139419 342681 119526 90777 77615 157248 490442 352064
$$ packed form
12287F9849J44326h6237l5780l643M9198A67064B3189K0817K32548A9146a05721
12275B79402h048p7592A10352M2180E7161f7235B9732b66927A02445P4405a98991
12263A54170e6291q1841A54356b67852J22119a9832D8902j2503k502d679k81118
12252b85797A03044A2909b24135F994a03742R172B99605I9339P0589A2977J85616
12241A98593J80224a6645F9377J68981N3218A42326E1564k437K77495D4670M20009
12230D64679k14623a2846B31477b8666B05936q9677K78437j60318H1194R7158
12220A78352K10172n5641A49466k6001K35666D4937K65309l5459G1491J28505
12210A99996J57988r2268j26297K03262A19526k8749j3162P9633L33194j38378
$$ plain form
12200 352064 367808 356982 483399 382975 204257 200330 307022 -118264 292296 385560
12190 385560 252658 126569 145669 416643 265725 102687 -172634 74037 186781 117036
12180 117036 231667 177139 -31587 9749 104759 260009 -44753 -39824 143721 210382 258486
12169 258486 135149 105578 149954 -131634 82517 281084 424738 432788 213686 -39869 167193
12157 -14184 223320 125601 -2472 -144601 -277771 96068 63485 422668 233411 -43008 1382
12145 195790 143461 292034 267493 362548 263572 85824 210900 271632 -129923 28079 69965
12134 69965 236350 -139453 -81656 188986 43103 324571 49048 -38111 128685 84176 205068
12123 205068 68152 115432 -185346 -333278 581837 -232031 -210850 54148 -30439 157685
$$ packed form
12200C52064J5744j0826J26417j00424j78718l927J06692a18264B92296R3264
12190C85560j32902j26089J9100K70974j50918A02687a72634G4037J12744o9745
12180A17036J14631n4528c1587I749R5010J55250d4753M929A43721O6661M8104
12169B58486j23337k9571M4376a31634H2517J98567J43654Q050B13686c9869A67193
12157a4184B23320r7719b472j42129j33170I6068l2583L59183j89257d3008A382
12145A95790n2329J48573k4541R5055r8976H5824J25076O0732a29923B8079M1886
12134F9965J66385a39453N7797A88986D3103K81468D9048c8111A28685m4509J20892
12123B05068F8152M7280a85346j47932E81837b32031K1181E4148c0439A57685
$$ plain form
12112 -29657 274034 -276564 73356 7710 -14478 -40525 113617 306738 308095 9041 -239166
12100 -264487 -97547 78670 160624 -122679 -45800 217247 -15721 279449 178316 18423 328793
12089 328793 14947 198479 -387526 -89519 -149855 -15946 269805 -45995 10258 169888 131735
12078 131735 95962 -288943 -25390 34542 224615 -121950 -237842 -56110 151238 150808 -144678
12066 -248895 47409 211583 -160161 -175086 80834 -93739 -122915 33424 71694 136140 -238205
12054 288613 -171660 363190 78794 -298801 -7092 -30929 174176 7749 30858 -48871 -218460
12043 -218460 94740 -7910 -73054 66919 21568 -84106 355248 -139034 -76508 40868 103533
12032 103533 -76426 -63903 -39292 237542 -268170 56705 149088 -73841 325217 103321 -37908
$$ packed form
12112b9657B74034b76564G3356G710a4478k6047A13617J93121J357I041b39166
12100b64487i7547G8670Q1954a22679d5800B17247a5721B79449j01133A8423L10370
12089C28793A4947J83532c87526h9519o0336a5946B69805d5995A0258J59630l8153
12078A31735l5773b88943b5390C4542J90073a21950j15892e6110A51238m30a44678
12066b48895D7409J64174a60161j4925H0834i3739k9176C3424L8270O4446b38205
12054B88613a71660C63190G8794b98801g092k3837A74176G749K3109d8871j69589
12043b18460I4740g910o5144F6919B1568h4106C55248a39034O2526D0868O2665
12032A03533g6426J2523K4611B37542b68170E6705R2383g3841C25217A03321c7908
$$ plain form
12020 -180056 -44829 -155032 99022 -179522 -51280 -23886 85476 245507 -257985 -192593 5577
12008 -80846 49927 -31962 -421688 120114 -40850 6672 -287635 -102627 187695 141838 -54882
11996 16877 -168817 -55985 18497 -167135 -186520 -107905 201741 -432888 -84585 47733 -18862
11984 -425736 68443 107108 -62212 -80372 -53297 -112816 245107 269823 -69746 -210596 75530
11972 -177894 66121 -197189 81567 -130725 35839 -201228 -5807 113730 -63631 212849 -75562
11960 -94605 80478 -297717 -59573 -45243 349756 63355 -215761 -35100 49079 -105552 -159432
11949 -159432 -35066 18811 -42944 -245658 -66135 -120551 79568 -65991 -18492 429761 190108
11937 110728 -309020 -223187 244658 55915 -257499 -10170 27101 -166825 -5660 -170175 79262
$$ packed form
12020a80056d4829j10203I9022a79522e1280b3886H5476J60031b57985O5392E577
12008h0846D9927c1962l89726A20114d0850F672b87635a02627A87695m5857e4882
11996A6877a68817e5985A8497a67135j9385P8615B01741d32888h4585D7733a8862
11984d25736F8443L8665f2212j8160K7075n9519B45107K4716f9746j40850G5530
11972a77894F6121a97189H1567a30725C5839b01228e807A13730f3631B12849g5562
11960i4605H0478b97717e9573J4330C49756F3355b15761c5100D9079a05552n3880
11949a59432c5066A8811d2944k02714f6135n4416G9568f5991a8492D29761A90108
11937A10728c09020Q5833B44658E5915b57499a0170B7101a66825e660j64515G9262
$$ plain form
11925 -154167 -161403 132020 -167089 22452 188206 -189020 -82720 169661 -413267 33309
11914 66028 105423 89706 -272550 619 171258 60937 -230791 353046 -175539 -51761 200812
11902 213137 20966 -35139 -60505 23677 -6130 68079 -91568 -167469 -54017 -79302 95680 30207
11889 153833 221961 -97902 329040 -198873 103612 66417 184802 55065 -101214 -159831
11879 -159831 -137333 22204 -24857 -119444 -416938 -247237 -295154 -283350 -310458 -49521 182282
11867 -10301 -232149 -90912 -381664 -42921 12481 -23807 -359918 -47422 146881 -194115 115246
11855 -40883 -339985 19367 45790 76587 -74403 -31784 130172 -104180 62787 -175882 66362
11843 -24171 -86715 -162158 53839 -408022 -10682 86383 -94717 26686 -161334 81913 -50031
$$ packed form
11925a54167p236A32020a67089B2452J65754a89020h2720A69661d13267C3309
11914F6028L9395j5717b72550F19J70639F0937b30791C53046a75539e1761B00812
11902B13137B0966c5139k5366B3677f130F8079i1568p5901e4017k5285I5680C0207
11889A53833O8128i7902C29040a98873A03612l7195J18385E5065a01214n8617
11879a59831K2498B2204b4857r4587k97494J69701m7917J1804k7108d9521A82282
11867a0301k21848i0912k90752d2921A2481b3807l36111d7422A46881a94115A15246
11855d0883k99102A9367K6423L0797g4403c1784A30172a04180F2787a75882F6362
11843b4171o2544p5443E3839d08022a0682H6383i4717B6686a61334H1913e0031
$$ plain form
11831 -188198 -9576 -120954 -69086 45492 -39893 -110804 -71699 -141115 -104918 -334664 -149312
11819 195409 -36729 205715 92909 243467 -92803 -31332 -122444 211941 -3566 85976 -112328
11807 -134400 -174693 -369768 -126479 -10617 -255868 -66035 370584 -30930 -63061 -137814 -172643
11796 -172643 -117337 -166038 11833 -130131 -62429 134452 -213018 -304863 -55568 -73518 217575
11784 30141 111646 113874 350080 121115 -25970 49972 -74725 -162281 -32510 -52671 -261405
11773 -261405 57281 110514 -14959 251981 -254545 -76041 -85372 -106500 -103537 -68302 -73861 25175
11760 -246693 -88923 27010 -72352 -427955 8469 234721 331815 45818 -143058 -41596 116860
11748 -96614 219925 44451 207040 253420 52325 -157145 -90031 -143506 55397 254027 -21558
$$ packed form
11831a88198i576j11378N1868D5492c9893p0911L9105o9416L6197k29746a49312
11819A95409c6729B05715I2909J50558i2803c1332r1112B11941c566H5976a12328
11807a34400m0293j95075a26479a0617k45251f6035C70584c0930l2131p4753l4829
11796a72643N5306m8701A1833a30131f2429A34452b13018r1845e5568j7950B17575
11784C0141Q1505K228K36206A21115b5970D9972g4725q7556c2510k0161k08734
11773b61405E7281N3233a4959B51981b54545g6041r331k1128K963L5235n559B5175
11760b46693h8923B7010g2352l55603H469K26252R7094D5818a43058d1596A16860
11748i6614B19925D4451J62589M6380E2325a57145O7114n3475E5397J98630b1558
$$ plain form
11736 47832 250579 -190805 42366 -122318 -378643 223049 -95735 291360 -71175 -95086
11726 -95086 2934 61670 -200241 -241404 -233407 19163 28910 109945 -113468 -140308 117553 176513
11714 176513 -334795 115665 1736 64197 69992 -165097 -52572 -459066 181601 -125769 -23415
11702 130251 227707 -288643 76851 -212215 188927 -185899 217403 -270694 -222709 -140013
11692 -140013 -205824 -174376 135013 57941 31142 -22665 240057 -58623 134871 199251 25425
11680 165019 67259 57314 -124100 -191582 -310390 359645 -141040 -230911 212275 -79097 -231879
11669 -231879 47255 12492 -176393 -17898 -423344 64057 -125485 -238107 -118876 -6728 -281992
11658 -281992 -141666 28550 41608 23060 44079 -97750 -88772 -108821 50984 -156728 116615
$$ packed form
11736D7832K02747a90805D2366a22318k56325B23049i5735B91360g1175k3911
11726i5086B934N8736b00241m1163P997A9163R747Q1035a13468k6840A17553N8960
11714A76513c34795A15665A736O2461N795a65097e2572m06494A81601a25769b3415
11702A30251R7456b88643G6851b12215A88927a85899B17403b70694M7985Q2696
11692a40013o5811L1448A35013E7941k6799b2665B40057e8623A34871O4380B5425
11680A65019F7259r945a24100o7482j18808C59645a41040q9871B12275g9097j52782
11669b31879D7255A2492a76393a7898m05446F4057a25485j12622a18876f728k75264
11658b81992J40326B8550J3058j8548K1019i7750Q978k0049E0984a56728A16615
$$ plain form
11646 -247770 132158 -186456 -123642 -140951 54248 -164360 -83821 21808 -167917 -211768 44807
11634 -7971 -94824 -142822 101913 106765 -185110 70407 -180986 141476 -146087 36829 -227121
11622 91843 -349839 136602 3652 52282 -183053 -94113 -68941 263864 -201557 114277 -256589
11610 42566 329619 122275 -418447 95741 -166203 -196545 300969 -83003 96578 -235600
11599 36861 -12198 -93752 94669 -114525 -106976 77987 -209818 -182116 132649 -55273 -294862
11588 -294862 -203496 114348 -132242 -26399 14435 73639 -18188 142169 -27350 65847 -110700
11576 34467 17030 -174135 164533 54424 98929 430409 31998 256489 -28444 151485 -64290
11564 -279072 -81401 45486 74354 -342609 7209 71783 175046 -450965 -12134 -71364 125198
$$ packed form
11646b47770A32158a86456O2814j7309E4248a64360Q0539B1808a67917m3851D4807
11634g971q6853m7998A01913M852a85110G0407a80986A41476a46087C6829b27121
11622I1843c49839A36602C652M8630a83053Q8940K5172B63864b01557A14277b56589
11610D2566K87053A22275d18447I5741a66203l0342C00969h3003I6578b35600
11599C6861a2198q1554I4669a14525P549G7987b09818K7702A32649e5273k39589
11588b94862R1366A14348a32242b6399A4435N9204a8188A42169b7350F5847a10700
11576C4467A7030a74135A64533E4424M4505L31480C1998K24491b8444A51485f4290
11564b79072h1401D5486K8868c42609G209O4574J03263d50965a2134n9230A25198
$$ plain form
11552 87996 169426 -51577 28431 60260 -228937 -182148 -8060 49753 21419 383082 49329
11540 -98131 219315 -18307 326701 208130 -96861 322706 18223 -327531 402816 296030
11530 296030 150765 -183822 108880 -126154 -63372 179848 -106814 266479 -86857 56063
11519 152805 -23039 355259 -70678 89549 306095 148890 231793 123703 106119 -342186
11508 195667 297056 -218292 -15750 -51769 47946 -60580 125961 76435 138971 111627 3526
11496 197616 250314 336321 291728 328175 208743 82400 433972 207618 344374 221290
11486 221290 -439 451841 51256 -138233 486202 -107716 120934 253684 246696 162033 124376
11475 124376 525576 -207871 -17015 46527 176575 461934 130295 284777 282350 279989 176916
$$ packed form
11552H7996Q1430e1577B8431L1829b28937M6789h060D9753B1419L61663D9329
11540i8131B19315a8307C26701j18571i6861C22706A8223c27531D02816j06786
11530B96030j45265a83822A08880a26154O2782A79848a06814B66479h6857E6063
11519A52805b3039C55259g0678H9549K16546A48890Q2903j08090j7584c42186
11508A95667J01389b18292a5750l6019D7946f0580A25961m9526O2536k7344C526
11496A97616N2698Q6007m4593L6447j19432H2400L51572B07618J36756j23084
11486B21290d39D51841E1256a38233D86202a07716A20934J32750o988q4663l7657
11475A24376M01200b07871a7015D6527J30048K85359A30295J54482k427k361j03073
$$ plain form
11464 176916 -74054 210898 368171 456307 251306 379390 155977 156516 -6383 22575 287135
11453 287135 276818 -303227 11619 160536 151151 130584 59570 82474 -188517 57334 232318
11442 232318 -260477 465976 -114227 75853 355873 90463 204746 160412 12352 192782
11432 192782 179312 96727 59 347812 233795 17922 156034 213128 -163386 131275 213666
11421 213666 297958 38395 -6614 38012 61222 101514 -189296 -5239 -331615 -132252 110150
11409 -294145 82416 -84970 -93838 -191252 34799 -28152 -141640 -123887 -166703 168342 -131256
11397 -14893 -52121 65934 283536 215850 161032 131057 350328 -162618 -91832 -173044 -319766
11386 -319766 159733 198526 18910 8061 154745 -50030 207547 149048 -242232 -63720 -249027
$$ packed form
11464A76916g4054B10898J57273Q8136k05001J28084A55977N39f383B2575K64560
11453B87135j0317c03227A1619J48917r385k0567E9570K2904a88517E7334J74984
11442B32318b60477D65976a14227G5853K80020I0463J14283m4334A2352J80430
11432A92782j3470q2585E9L47753j14017A7922J38112N7094a63386A31275Q2391
11421B13666Q4292C8395f614C8012K3210M0292a89296e239l26376a32252A10150
11409b94145H2416h4970q868r7414C4799b8152j13488J7753m2816A68342a31256
11397a4893l7228F5934K17602o7686n4818k9975K19271a62618P0786q1212j46722
11386c19766A59733L8793A8910H061J46684e0030B07547n8499b42232f3720j85307
$$ plain form
11375 -249027 -34146 22576 -174176 -24324 197739 74428 223235 280001 -42077 19484 36401
11364 36401 16279 -466590 429404 220155 45084 143989 -280787 -60530 -381699 -43749 19385
11352 129260 -14857 -84240 111910 -214029 -58346 -23357 -141486 186261 239197 136737
11342 136737 180658 -219921 -87242 90490 -71455 175921 -33342 1634 113796 -166663 2541
11330 314542 -100338 87965 -366601 -16999 8429 65264 -18438 64913 229677 375472 27581
11318 128438 126980 126973 -93315 90119 -41617 52333 -181757 -24915 -257419 2790 71913 -65375
11305 -172130 -30708 206026 49511 -137148 -14078 74335 55726 -25927 -317927 -31916 229565
11293 -146089 -18743 -65349 -126327 44321 -144244 164047 15062 176904 -31651 -254778 218750
$$ packed form
11375b49027c4146B2576a74176b4324A97739G4428J48807N6766d2077A9484J6917
11364C6401A6279d66590D29404k09249D5084R8905b80787f0530l21169d3749A9385
11352A29260a4857o9383A11910b14029e8346b3357j18129A86261N2936j02460
11342A36737M3921b19921h7242I0490g1455A75921c3342A634J12162a66663B541
11330C14542a00338H7965c66601a6999H429N6835a8438F4913J64764J45795B7581
11318A28438j458pi3315I0119d1617E2333a81757b4915k32504B790O9123f5375
11305a72130c0708B06026D9511a37148a4078G4335j8609b5927k92000c1916B29565
11293a46089a8743m6606o0978D4321a44244A64047A5062J61842c1651k23127B18750
$$ plain form
11281 181233 -295395 -252837 -48229 82834 -104539 -149536 7638 -3090 -3048 -191734 78239 -166776
11268 346527 -397090 -235721 -4338 -260555 -68071 -120733 -238790 -2474 28633 -206089 25727
11256 -175988 108818 -328841 6484 -88296 -153152 -261044 -304042 -8634 -126997 -363419 -261031
11245 -261031 -53386 -35865 -126551 24194 -35880 141224 301996 -139604 -211905 181165 11026
11233 -172867 -104741 8396 -267983 519021 97380 48994 202723 -267957 -102728 -51304 136699
11221 181884 -259201 -78611 -51425 38259 -370099 -56249 -50180 206614 307549 -179996 -59629
11209 20186 -48808 174620 -110056 -267590 268387 33566 -333900 -108322 28936 -314998
11198 135748 -3781 -244234 -89139 105212 -106005 -41832 69416 -52154 -63989 141943 -144929
$$ packed form
11281A81233b95395M2558d8229H2834a04539m4997G638c090M2j88686G8239a66776
11268C46527c97090J61369d338k56217f8071n2662j18057b474B8633b06089B5727
11256a75988A08818c28841F484h8296o4856j07892m2998h634j18363k36422J02388
11245b61031e3386J7521r0686B4194c5880A41224J60772a39604p2301A81165A1026
11233a72867O8126H396b67983E19021I7380m8386J53729b67957a02728e1304A36699
11221A81884b59201g8611K7186C8259c70099e6249O069B06614J00935a79996e9629
11209B0186d8808A74620a10056j57534B68387C3566c33900a08322B8936c14998
11198A35748c781k40453h9139A05212a06005d1832F9416e2154j1835A41943a44929
$$ plain form
11186 -68405 131036 89290 -147035 303072 -109364 -89925 55805 -4049 -143096 51065 -7138
11174 47602 -172536 -43385 20589 159723 211724 -269591 18734 -86434 -54731 184857 -360110
11162 106054 185285 -116938 -119386 -84432 -17723 55238 61559 -42960 272154 -65985 -66920 -191919
11150 -191919 214540 -63925 112307 -30158 -58213 337441 59209 73413 5490 25294 321016
11139 321016 1963 9439 -99858 54675 32222 161594 120873 220347 106751 126325 524459
11128 524459 146062 150029 -24882 -39096 -175393 93329 245518 130680 9840 234143 144897
11117 144897 -198451 -215976 -25478 211998 96182 -44781 -44431 13123 203819 311665 278977
11106 278977 165196 -9069 -46877 546675 76883 -88314 194019 132770 285012 132806 486210
$$ packed form
11186f8405A31036m1746a47035C03072a09364J9439E5805d049j39047E1065g138
11174D7602a72536d3385B0589J39134N2001b69591A8734h6434L1703A84857c60110
11162A06054P9231a16938k448L4954a7723E5238O321d2960B72154f5985r35j24999
11150a91919B14540f3925A12307c0158k8055C37441E9209J4204E490J9804K95722
11139C21016A963P476i9858E4675k2453J29372m0721R9474A06751J9574L98134
11128E24459A46062L967b4882j4214j36297I3329J52189j14838I840K24303q9246
11117A44897a98451j7525b5478B11998I6182d4781L50A3123J90696J07846l2688
11106B78977j13781i069l7808E46675G6883h8314A94019o1249J52242A32806L53404
$$ plain form
11095 486210 202938 364954 206099 400216 314104 261182 6077 153126 293153 234504
11085 234504 92232 464629 219243 284808 296159 565227 384005 688943 459204 568572
11075 568572 571501 601653 479589 512876 210521 324269 491693 542503 322690 432536
11065 432536 684575 647581 708734 547504 815241 569060 800245 711763 710181 820373
11055 820373 772502 953929 876218 1366144 1245715 1067407 888286 1110842 791018 701300
11045 701300 1202627 896663 1193198 1325827 1212750 1263628 994425 1003466 1364516 1108006
11035 1108006 1090581 1242092 1135988 1141608 913456 904242 1058051 926143 1043420 914019
11025 914019 771400 1041452 1000849 749530 979009 896623 444047 731038 931197 712991
$$ packed form
11095D86210B02938J62016j58855J94117q6112n2922F077J47049J40027n8649
11085B34504I2232L72397B19243O5565J1351K69068j81222L04938k29739J09368
11075E68572K929L0152j22064L3287B10521J13748J67424N0810k19813J09846
11065D32536K52039l6994O1153j61230K67737k46181K31185q8482j582J10192
11055H20373m7871J81427p7711M89926j20429j78308j79121K22556l19824q9718
11045G01300N01327l05964K96535J32629j13077N0878k69203R041L61050k56510
11035A108006j7425J51511j06104N620k28152r214J53809j31908J17277j29401
11025I14019j42619K70052m0603k51319K29479q2386D44047K86991K00159k18206
$$ plain form
11015 712991 1102516 909018 590019 724057 990421 970856 1227555 963833 1033138 961723
11005 961723 926167 1146756 735775 793922 795854 627996 934229 761346 714246 846076
10995 846076 1062078 1052026 989449 712289 795958 1002546 1154691 913182 1253569 1511437
10985 1511437 927061 994024 1420530 1307765 1746318 1463780 1864450 2063673 2328239 2523797
10975 2523797 2889907 3152114 4103840 4300411 4368652 4715455 4738781 5057787 4649537 3516118
10965 3516118 2939646 2370071 1740927 1464305 1214868 1229831 1337169 1161117 1127915 955862
10955 955862 932150 608032 563333 340929 654268 402958 -20484 328224 61630 198010
10945 198010 236888 233818 48921 -82448 646612 365184 183367 -83051 103849 312798 117094
$$ packed form
11015G12991L89525j93498l18999J34038K66364j9565K56699k63722O9305p1415
11005I61723l5556K20589m10981N8147J932j67858L06233j72883m7100J31830
10995H46076K16002j0052o2577k77160Q3669K06588J52145k41509L40387K57868
10985A511437n84376O6963M26506j12765M38553k82538M00670J99223K64566J95558
10975B523797L66110K62207R51726J96571O8241L46803K3326L19006m08250j133419
10965C516118n76472n69575o29144k76622k49437J4963J07338j76052l3202j72053
10955I55862k3712l24118m4699k22404L13339k51310b0484C28224F1630J36380
10945A98010L8878l070D8921h2448F46612k81428j81817h3051A03849K08949A17094
$$ plain form
10933 344454 -141787 147433 -40068 113215 38484 64490 -79348 71074 -91309 134054 11631
10921 75022 166167 -403747 -253818 -4859 -264353 -234454 -193459 41839 101402 -95623 251112
10909 -82634 -182740 144631 131684 31768 34181 -57456 -155067 400015 -83521 -264328 53790
10897 95941 111771 -328622 344467 44174 -313844 213872 72850 35106 -136600 -311804
10887 -311804 -71111 -170916 -28679 -172685 -82358 -57760 153792 -159720 72837 -127182 -112262
10876 -112262 113949 206414 -223753 49000 78742 45529 -52012 -224372 -65777 7525 -200750
10864 173831 -13627 -173323 55714 -110978 -99506 32396 -27627 -194915 -38223 87110 173165
10853 173165 -399489 110514 117505 -46530 91699 160000 264405 -177482 -59470 230922 76692
$$ packed form
10933C44454a41787A47433d0068A13215C8484K6006g9348G1074i1309A34054A1631
10921G5022R1145d03747J49929d859k59494K9899M0995D1839N9563i5623B51112
10909h2634j00106A44631j2947C1768K413e7456r7611D00015h3521j80807E3790
10897I5941J5830c28622C44467D4174c13844B13872G2850C5106a36600j75204
10887c11804g1111r9805b8679j44006h2358K4598A53792a59720G2837a27182J4920
10876a12262A13949R2465b23753D9000K9742l3213e2012j72360f5777G525b00750
10864A73831a3627j59696E5714a10978J1472C2396b7627j67288c8223H7110Q6055
10853A73165c99489A10514O991d6530I1699O8301J04405a77482e9470B30922G6692
$$ plain form
10841 81950 -81869 7320 -143921 -279803 -112336 138527 28455 -50448 -199831 -178711 -700
10829 -69471 99470 -214804 -141520 -30187 -206563 -56675 -27224 -217129 -1353 60545 23332
10817 69610 -101921 -79306 44510 109629 -18162 187395 -311888 -59490 -139926 -11815 215558
10805 -42086 39961 36072 -134700 -165670 125770 -134618 -326970 197034 -206120 -140567 -158848
10794 -158848 -192786 -5583 -123468 86641 -239614 -77531 -34668 -160484 -187905 262329 135787
10783 135787 -121277 -328829 79091 -9411 -86077 158602 322725 188527 -208420 -189003
10773 -189003 -94608 -325846 -139151 158707 -25630 239530 -161589 95109 -65239 -350890
10763 -350890 120955 -34279 -19585 92754 -5749 -240762 177360 123148 135440 197416 107484
$$ packed form
10841H1950h1869G320a43921j35882a12336A38527B8455e0448j49383K1120g00
10829f9471I9470b14804P3284c0187j76376e6675b7224j89905a353F0545B3332
10817F9610a01921K2615D4510O5119a8162A87395c11888e9490q0436a1815B15558
10805d2086C9961l889a34700l0970A25770a34618j92352A97034b06120O5553j8281
10794a58848l3938e583j17885H6641b39614g7531c4668j25816k7421B62329j26542
10783A35787a21277k07552G9091i411p6666A58602J64123j34198b08420J9417
10773a89003R4395k31238a39151A58707b5630B39530a61589I5109f5239k85651
10763c50890A20955c4279J4694I2754e749k35013A77360n4212J2292O1976q9932
$$ plain form
10752 107484 -168854 -118188 -68289 -175817 363554 4414 -4013 36514 119500 314355 18478
10740 92381 -86095 143072 13203 7076 -210515 -176837 -36655 -74438 -14252 -74628 329503
10728 -159032 -127600 9848 -84925 51494 -116142 -78939 -139227 -50931 -352710 -195682 -38040
10716 23768 -58504 -144420 -213801 119882 -127233 26383 -27740 -373123 321559 -246581 -70945
10704 353445 -219768 110346 179450 47501 49832 43758 27890 22367 -152160 -129835 -322309
10693 -322309 257103 -162170 -20662 -147783 105218 -50102 -162667 22966 100876 -208283
10682 60319 -298432 -258639 -176250 4913 33 53280 -51788 4375 -142213 -216240 141699 -429859
10669 214246 -178310 -307148 -174640 -235583 42805 -271627 47374 -339710 -158220 -161337
$$ packed form
10752A07484a68854N0666M9899j07528C63554D414d013C6514Q2986J94855A8478
10740I2381h6095A43072A3203o127b10515L3678c6655l7783a4252o0376C29503
10728a59032L1432I848h4925E1494a16142L7203o0288e0931l01779J57028c8040
10716B3768e8504q5916o9381A19882a27233B6383b7740l45383C21559b46581g0945
10704C53445b19768A10346O9104D7501K331o074j5868n523a52160K2325j92474
10693c22309B57103a62170b0662j27121A05218e0102j12565B2966P7910b08283
10682F0319b98432L9793Q2389D913C3N3247e1788D375a42213p4027A41699d29859
10669B14246a78310j28838J32508o0943D2805b71627D7374c39710a58220l117
$$ plain form
10659 -161337 -67725 132505 -7938 49362 -89879 -268244 -39839 -110536 -223566 38612 200700
10648 200700 102135 -211666 38837 -236411 -99085 -404311 -289302 330411 8198 -154232
10637 192424 -212484 -105930 -306635 -242578 49484 -387218 -54757 -39744 -235235 -20466
10626 17643 -268450 141933 178735 25176 131186 227311 211458 122897 -85272 79071 -48642
10614 -138011 77881 186573 186100 20240 -263671 1756 158730 -212513 160616 -238500 -84883
10602 -217440 -97096 -332006 -75934 7420 -109725 47267 -98597 -249408 -53730 200185 -62369
10590 267792 166376 113299 -198082 -7056 208499 96998 -280484 95599 -62812 -100266 102070
10578 2669 -309532 25246 59538 -168049 -317271 61041 124970 307037 -27125 39103 -292536
$$ packed form
10659a61337f7725A32505g938D9362h9879j78365c9839p0697j13030C8612J62088
10648B00700r8565b11666C8837b36411i9085l05226J15009C30411H198a54232
10637A92424b12484a05930k00705O4057D9484c87218e4757J5013j95491b0466
10626A7643b68450A41933L6802B5176J06010R6125j5853q8561h5272G9071d8642
10614a38011G7881J08692m73B0240b63671A756J56974b12513A60616b38500h4883
10602b17440i7096k34910g5934G420a09725D7267i8597j50811e3730B00185f2369
10590B67792j01416n3077a98082g056B08499I6998b80484I5599f2812l7454A02070
10578B669c09532B5246L4292a68049j49222F1041O3929J82067b7125C9103b92536
$$ plain form
10566 -91885 -258257 11922 153220 -41307 -21493 -265190 -112206 -51771 -85810 9196 206887
10555 206887 372323 -382419 191026 -417480 -48122 151883 67584 35864 196383 226236
10545 226236 58979 178926 146747 116096 13869 -217298 46354 87698 -100345 -168568 93203
10533 -353650 48711 -256578 -86961 -92195 -22429 184598 10148 -46454 55088 156679 -262120
10521 -177106 8346 -132962 133201 -72160 125119 -109633 -214963 39834 -28819 -125793 -211144
10510 -211144 -434849 80878 -92173 107495 29439 -75819 7984 132725 233895 159485 -205489
10498 471219 172215 -235784 84218 369010 162900 -138375 -127609 -358232 923 -70315 -130400
10487 -130400 36645 -254161 -52525 106643 -50534 160053 80027 107948 -166533 -1213 91383
$$ packed form
10566i1885j66372A1922J41298d1307J9814k43697a12206e1771l4039I196J97691
10555B06887J65436c82419A91026d17480d8122A51883F7584l1720J60519K9853
10545B26236E8979J19947l2179l0651A3869b17298D6354M1344a00345o8223I3203
10533c53650D8711b56578h6961n234b2429A84598A0148d6454E5088J01591b62120
10521a77106H346a32962A33201g2160A25119a09633j05330C9834b8819r6974q5351
10510b11144k23705H0878i2173A07495B9439g5819G984J24741J01170p4410b05489
10498D71219A72215b35784H4218K84792A62900a38375J0766k30623I23g0315o0085
10487a30400C6645b54161e2525A06643e0534A60053q0026K7921a66533a213I1383
$$ plain form
10475 108108 152122 -117223 -36520 -106299 -11627 276700 53852 123473 -11684 224179 3410
10463 -191190 -138954 280894 92144 19286 92563 -26667 97376 234220 196742 43030 -262877
10451 -145146 117541 -253561 88677 170703 -265788 -229878 -378115 -141899 161914 138178
10441 138178 -3753 8677 264899 -24902 -143134 368217 158845 42829 134689 -52031 -266946
10430 -266946 -27279 -111801 201293 -410748 53711 -9407 -1681 -97608 68457 66282 -282455
10418 3478 196988 22066 174553 -231047 -523416 70128 127349 -285942 -224772 -264739 -79380
10406 310592 -2172 -167517 -179563 -258183 -174711 -57419 -142250 45914 223391 177806 264931
10395 264931 224236 237818 44515 64792 236157 79277 181659 397558 243958 287312 -111851
$$ packed form
10475A08108M4014a17223c6520o9779a1627B76700E3852O9621a1684B24179C410
10463a91190N2236B80894I2144A9286P3277b6667I7376J36844l7478D3030b62877
10451a45146A17541b53561H8677Q2026b65788L5910j48237a41899A61914k3736
10441A38178c753H677K56222b4902j18232C68217A58845D2829R1860e2031k14915
10430b66946b7279q4522B01293d10748E3711i407a681r5927F8457k175b82455
10418C478J93510B2066J52487b31047k92369G0128N7221b85942O1170l9967g9380
10406C10592b172j65345j2046p8620Q3472e7419q4831D5914J77477m5585Q7125
10395B64931m0695J3582D4515K0277J71365G9277J02382K15899j53600M3354a11851
$$ plain form
10383 104061 158323 353977 295430 -75366 278977 334323 345148 647198 263749 129941
10372 252385 437517 295913 195127 369414 486493 635860 276363 401731 800107 892704
10362 892704 755126 439147 481180 11482 79100 196146 -27916 13667 377193 640293
10352 640293 414320 710061 931933 834726 546858 339784 319801 95155 -77712 100208
10341 361134 358151 86294 291979 324523 249378 581444 275365 540209 415792 245900
10331 245900 236998 -56939 -93733 114911 -27340 252809 179453 692775 669290 224501 288220
10320 288220 139459 439015 178398 92879 -75785 376155 16477 323999 -144277 -203004
10310 -203004 -40347 268098 -227112 -58236 268131 -237234 221319 -69900 56771 -276192
$$ packed form
10383A04061N4262J95654n8547g5366B78977N5346J0825L02050B63749A29941
10372B52385J85132j41604j00786J74287J17079J49367B76363J25368L98376R2597
10362H92704j37578l15979M2033A1482O7618J17046b7916A3667L63526K63100
10352F40293k25973K95741K21872r7207k87868k07074j9983I5155g7712A00208
10341C61134k983H6294K05685L2544p5145L32066B75365K64844j24417j69892
10331B45900q902e6939l6794A14911b7340B52809p3356N13322k3485B24501O3719
10320B88220A39459K99556A78398q5519g5785C76155A6477L07522a44277n8727
10310b03004d0347B68098b27112e8236B68131b37234B21319f9900E6771b76192
$$ plain form
10299 -30978 -67192 41214 16649 -104716 65333 -287043 -5741 21566 154213 295916 -138320
10287 312537 -158491 -303074 80949 -28075 178196 -186386 -93554 -71233 37477 -84382 11657
10275 -143951 -63292 -514084 49487 211017 -16648 -264055 24123 56850 -17922 17610 80029
10264 80029 29951 -88369 -237625 326980 122723 83308 322 25578 33962 -180295 165119
10252 -178811 166828 24440 -131824 -174309 -59625 135384 100450 -6985 -233069 120707 3875
10240 -434926 -30813 48335 -160118 -300302 -549564 -181252 -57185 -98867 -32257 -154842
10230 -154842 -45491 -292582 -58417 -162621 -151185 -96542 -205945 -75425 2942 -61458 -167510
10219 -167510 -230100 -223195 -142897 296449 289141 -9862 -191069 -333735 -56986 37672 -107109
$$ packed form
10299c0978l6214D1214A6649a04716F5333b87043e741B1566J32647J41703a38320
10287C12537a58491j44583H0949b8075A78196a86386R2832K2321C7477h4382A1657
10275a43951f3292m50792D9487J61530a6648k47407B4123L2727a7922A7610O2419
10264H0029B9951h8369j49256C26980A22723l9415C22K5256Q384a80295A65119
10252a78811A66828B4440a31824m2485e9625A35384l4934f985k26084A20707C875
10240d34926c0813D8335a60118j40184k49262a81252e7185m1682c2257j22585
10230a54842d5491k47091e8417j04204J1436N4643j09403g5425B942f1458j06052
10219a67510o2590O905Q0298B96449p308i862j81207j42666e6986C7672a07109
$$ plain form
10207 30008 -11590 -9239 -378648 -474429 258460 30186 5927 24068 -270662 181666 -388300
10195 -22072 -262325 -47161 -94229 -187521 -36587 19794 -47403 -18608 -46380 105560 -190217
10183 48305 -75113 310489 -405927 74298 -378218 -96511 211320 -51085 45590 219490 -87229
10171 182813 478534 101231 -2519 107065 88493 -383728 81238 -81179 85719 -161023 35321
10159 167188 11951 -205915 -152994 -72239 -305946 -102844 -126904 -370092 -162466 114461
10148 -199193 -422703 -138324 18187 172406 189652 -187714 -211140 -185427 -265546 -134339
10138 -134339 -22829 32003 14024 -169847 -534299 -248034 -165956 253695 107174 -58486
10127 43468 -24771 37017 -359736 -412888 -22152 18654 503075 199898 388522 -134941 -291808
$$ packed form
10207C0008a1590K351l69409r5781B58460C0186E927J8141b70662A81666c88300
10195b2072k40253d7161m7068r3292c6587A9794d7403a8608k7772A05560a90217
10183D8305g5113C10489d05927G4298c78218i6511B11320e1085D5590J73900h7229
10171A82813K95721A01231b519A07065j8572c83728H1238h1179H5719a61023C5321
10159A67188A1951b05915N2921g2239k33707a02844k4060k43188a62466A14461
10148a99193k23510a38324A8187J54219J7246a87714k3426K5713q0119J31207
10138a34339b2829C2003A4024a69847l64452b48034Q2078B53695A07174e8486
10127D3468b4771C7017c59736n3152b2152A8654M84421A99898J88624a34941j56867
$$ plain form
10116 -291808 -162722 -34741 -84265 213151 52540 -163564 71449 -318102 94745 -247734
10105 -71499 -339376 9212 -128367 -37174 35174 -293249 -81344 -23194 -262775 -201078 -183380
10094 -183380 -163436 -93162 -185223 -146835 -84342 -259417 -365350 -65153 -418680 -93 162070
10082 227257 -93393 -183806 218773 -228452 -86924 49285 -112845 103308 9874 117224 -46530
10070 -190453 -432112 -210671 -211101 -79275 -48800 -159809 -255009 -175018 -20662 -86505 -98022
10059 -98022 42460 -55033 13720 176771 -146886 -330859 33342 12629 298401 -63232 108692
10047 78637 -426688 -62432 -125233 56267 140616 133937 205549 -346288 196281 -66750 77765
10035 5317 -408391 -459970 -163513 -168682 -67987 -201371 42888 -199207 33004 388332 23218
$$ packed form
10116b91808J29086c4741m9524B13151E2540a63564G1449c18102I4745b47734
10105g1499k67877I212a28367c7174C5174b93249h1344b3194k39581O1697J7698
10094a83380J9944P0274r2061L8388O2493j75075j05933f5153l53527i3A62070
10082B27257i3393r0413B18773b28452h6924D9285a12845A03308I874J07350d6530
10070a90453k41659b10671m30g9275L0475j11009r5200P9991b0662o5843j1517
10059i8022D2460e5033A3720J63051a46886j83973C3342A2629K85772f3232A08692
10047G8637d26688f2432o2801E6267Q4349o679P1612c46288A96281f6750G7765
10035E317d08391n1579a63513n169f7987j33384D2888a99207C3004L55328B3218
$$ plain form
10023 -300298 44343 -99902 -177363 -278663 199296 54525 -237180 16063 36602 -72832 315860
10011 -18728 -86182 77106 96503 -148884 -156725 202603 -107176 -117490 -83546 -42833 96593
9999 -37900 -25282 -258561 38498 -4726 -68605 77178 215057 -40375 -253913 -126648 154782
9987 332189 -305360 -235139 -325947 42623 44560 317230 3769 -164659 37721 -89463 -341053
9976 -341053 -343141 -151273 43023 87439 -246184 193966 -309737 185685 -205062 -132827 120717
9964 -195262 -318227 -253781 -38316 -1591 49165 -288952 -309565 -228166 -39059 125694 -176575
9952 116845 -347888 -129369 -101736 -63870 -141858 -60957 -99973 75971 -22804 7880 126764
9941 126764 16811 46498 -76251 -214337 -249271 10732 -233251 -79456 -34685 81084 228329
$$ packed form
10023c00298D4343i9902p7461j01300A99296E4525b37180A6063K0539g2832C15860
10011a8728o7454G7106J9397a48884p841B02603a07176j0314L3944M0713I6593
9999c7900J2618k33279C8498d726o3879G7178J37879d0375k13538a26648A54782
9987C32189c05360P0221r0808D2623J937K72670C769a64659C7721h9463k51590
9976c41053k088a51273D3023M4416b46184A93966c09737A85685b05062P2235A20717
9964a95262j22965O4446c8316a591D9165b88952k0613Q1399c9059A25694a76575
9952A16845c47888a29369K7633L7866p7988f0957l9016G5971b2804G880J18884
9941A26764A6811K9687g6251j38086l4934A0732b33251g9456c4685H1084J47245
$$ plain form
9930 228329 -43459 244148 238995 128843 -293672 -82151 -77544 -463230 -103342 -352629 115880
9918 268412 20364 -39606 424770 -20732 -128386 -352123 -499267 -198574 138277 131645 -338204
9906 21947 33931 -43874 249635 79482 -361407 -39705 -181528 -11921 252791 -25575 -88526
9895 -88526 -215902 35419 -399959 -128490 150386 24679 241319 -298815 24069 216831
9885 216831 -87118 19445 -37861 20920 -149574 137635 80377 -13362 -443115 152072 -241181
9873 -329134 -40114 -247192 122202 -142802 -48193 45849 -218266 -301601 -306034 280621 -21708
9861 -338459 62203 -239012 141011 -219720 112276 13367 18181 -70596 60688 353877 -87555
9849 -103538 -41271 259039 236054 144334 -85041 -213324 17043 -155182 217618 133547 -50157
$$ packed form
9930B28329d3459B44148n153j10152b93672h2151M607l85686a03342k49287A15880
9918B68412B0364c9606D24770b0732j07654k23737j47144a98574A38277o632c38204
9906B1947J1984d3874B49635G9482c61407c9705j41823a1921B52791b5575o2951
9895h8526j27376C5419c99959a28490A50386B4679K16640b98815B4069J92762
9885B16831h7118A9445c7861B0920a49574A37635n7258a3362m29753A52072b41181
9873c29134d0114k07078A22202a42802d8193D5849b18266q3335m433B80621b1708
9861c38459F2203b39012A41011b19720A12276A3367M814g0596F0688K93189h7555
9849a03538d1271B59039k2985r1720h5041j28283A7043a55182B17618q4071e0157
$$ plain form
9837 61944 -143220 -43445 -244874 -102458 -352928 169533 -17791 -57879 -297002 -43974 -216415
9826 -216415 436160 -355583 -225579 33140 -237686 25205 -265245 113664 -159496 -223623
9816 -223623 172090 250365 -260474 -136848 -231844 167137 135867 45673 358954 98857 -12226
9804 254203 159407 74696 -122689 -105581 259522 207878 234024 -67023 -142053 -127030 153437
9792 -319838 3810 18721 -42500 -125012 55313 46814 -50069 -73318 137289 30919 -78093 -39170
9780 -39170 -252692 143103 -119816 -94619 -135266 109241 -285248 -43939 231423 -246038
9769 52496 249674 -298155 -7732 -70952 -290835 -39285 -67863 -170538 -91108 37329 -45716
9757 -271633 -407004 43266 -39097 79127 -126944 56073 249344 -96170 56718 -194384 -151419
$$ packed form
9837F1944a43220d3445k01429a02458k50470A69533a7791m0088k39123d3974j72441
9826b16415D36160c55583J30004C3140b37686B5205b65245A13664a59496o4127
9816b23623A72090P8275b60474J23626r4996A67137l1270D5673L13281I8857a2226
9804B54203r4796G4696a22689J7108B59522n1644K6146f7023p5030J5023A53437
9792c19838C810J4911d2500q2512E5313q499e0069k3249A37289C0919g8093L8923
9780c9170k13522A43103a19816K5197m0647A09241b85248d3939B31423b46038
9769E2496J97178b98155g732o3220k19883c9285k8578j02675P9430C7329d5716
9757b71633j35371D3266c9097G9127a26944E6073J93271i6170E6718a94384M2965
$$ plain form
9746 -151419 -87384 -123015 -113748 -121695 -230420 -85574 -309325 264143 -334892 -99721 -345225
9735 -345225 207126 -59671 -274084 88881 104131 180117 2488 175434 306680 215543 -222475
9723 -97575 21492 100938 -106326 144883 -140461 -61377 -359271 -371828 31658 -82998 -277037
9712 -277037 -71074 51758 92161 273150 -49387 198084 -372912 71038 -120498 -160862 182037
9700 -152723 -73208 -174962 -97065 -43714 -270258 -7749 -27351 -224592 180455 305140 44147
9688 -34542 7354 -192776 -183191 227883 -195731 -73679 -279097 -26456 -417140 87358 -40988
9676 -360830 219040 -44057 59206 -77157 -318552 -178658 113814 -162640 -49295 22078 -25852
9664 -75532 298255 -158139 -128989 -64907 -150468 -404500 -566201 -361273 -52957 -45563 35077
$$ packed form
9746a51419O4035l5631R267p947j08725h5574k23751B64143c34892i9721k45504
9735c45225B07126e9671k14413H8881J5250P5986B488J72946J31246r1137b22475
9723i7575B1492P9446a06326A44883a40461f1377k97894j2557C1658h2998j94039
9712b77037g1074E1758M0403J80989d9387A98084c72912G1038a20498m0364A82037
9700a52723g3208j01754P7897d3714k26544g749j9602j97241A80455J24685D4147
9688c4542G354a92776R585B27883a95731g3679k05418b6456l90684H7358d0988
9676c60830B19040d4057E9206g7157k41395J39894A13814a62640d9295B2078b5852
9664g5532B98255a58139K9150O4082q5561k54032j61701K04928e2957P394C5077
$$ plain form
9652 -135721 -358201 -129895 -147712 -226798 143726 -158185 -154266 246130 254811 -178837 -144718
9641 -144718 -72387 -60213 60120 63129 -175496 159615 -241293 43664 33191 -491817 52818
9629 -108288 -173112 201601 -416579 84766 70038 44114 -301014 -27098 89187 -95695 71333
9617 -151070 -24519 -227573 138389 136796 -278376 -248964 182020 3501 -321898 -90733 55358
9605 73341 84097 138843 -61190 -116033 127801 337450 -78254 -300294 -192008 -309610 -200576
9594 -200576 -173716 159067 -433825 232343 -116787 15534 115217 118341 -73683 -33264 56196
9582 -50855 -19343 -49920 -228873 -477604 119971 35625 -186858 -118904 -156268 192958 -193628
9570 148049 -38462 181209 -281562 -13707 44563 74724 -66262 -137894 279307 -18084 -91972
$$ packed form
9652a35721k22480a29895j7817p9086A43726a58185L919B46130Q681a78837L4119
9641a44718P2331J2174F0120L009a75496A59615b41293D3664j0473d91817E2818
9629a08288o4824B01601d16579H4766j4728k5924c01014b7098H9187i5695G1333
9617a51070b4519k03054A38389j593b78376K9412A82020C501c21898i0733E5358
9605G3341J0756N4746f1190n4843A27801K09649g8254k22040J08286j17602J09034
9594b00576K6860A59067d33825B32343a16787A5534R9683L124g3683c3264E6196
9582e0855a9343l0577j78953k48731A19971C5625a86858O7954l7364A92958a93628
9570A48049c8462A81209b81562a3707D4563L0161f6262p1632B79307a8084p3888
$$ plain form
9559 -91972 -112784 -216765 242136 -282910 -370061 -67001 140181 -184547 151287 -350988
9548 78627 -106935 47299 28798 -129949 -71391 -125390 -170689 79453 -90612 -392283 -246212
9537 -246212 -145984 -516 -335402 5511 -186640 -448800 67115 -150666 121796 -24389 -306329
9526 -306329 -18683 -82185 21094 -3309 -114706 -78549 -16824 -206428 33471 -120795 -166557
9515 -166557 -246226 -14368 -271573 117582 -7080 -18128 243314 -188936 44617 58261 -125167
9503 -17634 -248682 -141714 -38210 -136536 81749 -25211 44214 -135856 -403038 -52417 -16739
9491 -400069 -124117 -138697 69545 -274104 -342678 -119295 -178651 161110 33255 63557 -180167
9479 50798 -55762 336288 -207457 -48313 -40883 -234173 -67928 236370 -130576 -215088 72578
$$ packed form
9559i1972k0812j03981B42136b82910q7151f7001A40181a84547A51287c50988
9548G8627a06935D7299j8501a29949N8558n3999m5299G9453i0612l01671J46071
9537b46212J00228e16l34886E511a86640k62160F7115a50666A21796b4389k81940
9526c06329a8683o3502B1094c309j11397L6157a6824j89604C3471a20795m5762
9515a66557p9669a4368k57205A17582g080j1048B43314a88936D4617J3644a25167
9503a7634k31048J06968c8210r8326H1749b5211D4214a35856k67182e2417a6739
9491d00069a24117j4580F9545b74104o8574a19295n9356A61110C3255L0302a80167
9479E0798e5762C36288b07457d8313P430j93290f7928B36370a30576q4512G2578
$$ plain form
9467 -179124 -425709 -720108 -68264 76082 -275494 -50726 18966 -117082 -116132 -113446 355591
9455 113539 -80138 -24919 -51377 -89861 231447 33167 195460 309263 -160509 -40933 -302178
9444 -302178 99992 -250492 6148 206678 -45986 120236 51061 -171223 -154622 -9251 -296695
9433 -296695 -164714 -256139 -45516 -85690 44111 24410 -86173 -21867 -292763 -159612 -105722
9422 -105722 -184055 -282531 -293781 -18864 -43964 -364657 -109752 -146848 132749 153588 15151
9410 -182072 -144537 -203557 -492094 -125139 9001 -188903 105981 37404 -3795 126579 -151285
9398 10930 69690 164720 -245736 -47472 -227976 -275284 -154468 -82210 -244087 205814 -81911
9386 -108507 -135048 -195557 -86514 89678 -128824 -176767 271803 189824 -146659 -334542 114126
$$ packed form
9467a79124k46585k94399f8264G6082b75494e0726A8966a17082R50K686C55591
9455A13539h0138b4919k6458l8484B31447C3167J62293J13803a60509d0933k61245
9444c02178I9992b50492F148K00530d5986A20236E1061a71223J6601i251k87444
9433b96695J31981r1425d5516m0174D4111j9701h6173b1867k70896J33151N3890
9422a05722p8333r8476j1250a8864k5100l20693a09752l7096A32749K0839A5151
9410a82072L7535n9020k88537a25139I001a88903A05981C7404c795A26579a51285
9398A0930N8760R5030b45736d7472j80504m7308J20816P2258j61877B05814h1911
9386a08507k6541o0509h6514H9678a28824m7943B71803q1979a46659j87883A14126
$$ plain form
9374 250980 -200963 201361 -67281 -218165 -85239 -169730 27328 200689 -198952 -164837 -269311
9363 -269311 95489 -134921 177698 -262562 -144526 -53343 27741 -210682 -103155 -147055
9353 -147055 -88731 -248028 -266410 33094 51273 -22399 318622 -391840 18782 -363357 112879
9341 -282269 -104227 -47195 -153235 50510 -2965 360843 -103829 142056 -196762 55316 9479
9329 83840 -151700 9119 270177 -125302 -144282 -253495 171148 -243906 -32048 31163 483771
9318 483771 -50711 259324 152253 -1693 72258 -326023 -418796 -322130 -202483 -196704 -292623
9307 -292623 -206766 -60031 215400 46658 1438 -341213 -174340 124531 -124357 77674 -153244
9295 -149650 -27857 161633 -168763 -50556 -52840 168127 -247981 -54034 -97818 -134168 340454
$$ packed form
9374B50980b00963B01361f7281j50884h5239q4491B7328J73361a98952L4115j04474
9363b69311I5489a34921A77698b62562J18036e3343B7741b10682a03155m3900
9353a47055N8324j59297j8382C3094J8179b2399C18622c91840A8782c63357A12879
9341b82269a04227d7195j06040E0510b965C60843a03829A42056a96762E5316I479
9329H3840a51700I119K61058a25302j8980j09213A71148b43906c2048C1163M52608
9318D83771e0711B59324j07071a693G2258c26023r2773R6666J19647N779r5919
9307b92623Q5857f0031B15400D6658A438c41213J66873A24531a24357G7674a53244
9295a49650b7857A61633a68763e0556k284A68127b47981e4034m3784l6350C40454
$$ plain form
9283 9447 88705 -85647 24049 -277365 -228428 132352 1391 -31998 -28808 -134886 -67897 120066
9270 23574 -188560 179295 35892 -188852 -166032 140311 -168048 204357 83106 -204640
9259 -23088 23863 -153930 147244 256087 -73853 440246 -105221 -4916 -237216 -318229 -493723
9248 -493723 -82956 53385 -66410 -128864 -321748 17797 -174321 51390 18792 -291072 -307916
9237 -307916 -116050 -64518 -196420 -168058 -226457 -288259 255068 138683 -196976 -299399
9227 -299399 25202 224574 -277411 5967 -61028 84010 239986 -63629 -115268 -127234 -173443
9216 -173443 119315 148455 -15739 57043 107642 -328696 -188859 -88272 20272 -379946 -120646
9204 85261 73229 -10750 24200 -305076 -8962 -33911 39772 133423 -146569 -16487 -120209
$$ packed form
9283I447P9258h5647B4049b77365M8937A32352A391c1998L190j06078O6989A20066
9270B3574a88560A79295C5892a88852K2820A40311a68048B04357H3106b04640
9259b3088B3863a53930A47244J08843g3853D40246a05221d916k32300q1013j75494
9248d93723h2956E3385f6410o2454j92884A7797a74321E1390A8792b91072j6844
9237c07916a16050N1532j31902K8362n8399o1802B55068j16385a96976j02423
9227b99399B5202J99372b77411E967f1028H4010J55976f3629n1639j1966m6209
9216a73443A19315K9140a5739E7043N0599c28696J39837h8272B0272c79946a20646
9204H5261j2032a0750B4200c05076h962k4949C9772R3651a46569a6487j03722
$$ plain form
9193 -120209 -81934 -60038 -25134 -409853 -312315 -58513 -164850 -287693 -84648 -115553 -329651
9182 -329651 -48802 -240098 85103 157392 -100951 -309108 -203963 -43853 -26725 27456 -169093
9170 -72868 6800 39540 -68030 140738 -31124 33839 7202 15374 -40281 -166584 -109893 -154070
9158 -154070 5092 -184227 -152201 181297 243751 92933 -11297 -271916 65277 145885 -89436
9146 -227890 264295 1643 -242716 171128 -212992 143925 -137116 -226084 -235694 -287454 -71938
9134 16880 183909 84803 187847 82306 95482 40495 -172395 -206925 -106941 -265633 82712
9122 27884 -31047 -231528 109072 -4754 -207835 14982 139707 -8134 -19408 76781 56860
9111 56860 38640 27811 28115 -594 42170 -293274 -84129 101966 -62207 -43014 -27555 -261305
$$ packed form
9193a20209L8275K1896b5134l84719R7538e8513j06337j22843h4648l0905k14098
9182c29651d8802j91296H5103P2289a00951k08157J05145d3853J7128B7456a69093
9170g2868F800L2740f8030A40738c1124C3839G202Q172d0281j26303N6691m4177
9158a54070E092a84227L2026A81297O2454I2933a1297k60619F5277Q0608h9436
9146b27890B64295A643b42716A71128b12992A43925a37116q8968r610n1760g1938
9134A6880J67029H4803J03044H2306J3176D0495a72395l4530R9984j58692H2712
9122B7884c1047k00481A09072d754k03081A4982J24725h134j1274G6781j9921
9111E6860j8220j0829L04e94D2170b93274h4129A01966f2207J9193J5459k33750
$$ plain form
9099 -261305 116967 12992 -349461 319754 -116909 89695 154155 -243487 -16738 160788
9088 101416 224836 -115959 213204 -158935 -26528 -334613 -487174 290185 78148 -118065
9077 -183130 -48300 44233 -106441 92938 -231591 -34189 -127272 287644 -159546 -42705 122408
9065 -21965 -227365 82944 5562 -170411 -425050 -29847 -14590 84522 252356 109315 81111
9054 81111 106208 -52793 197159 39736 -243730 143512 -137343 -45466 -43396 -198502 198632
9042 -77439 -67825 -248819 -179664 -400398 239648 -225924 185234 -126481 -101929 -359211 274833
9030 -488463 82900 24807 65362 101362 -42413 -353680 -82851 218413 -108720 -116870 -131774
9019 -131774 394048 -210014 40512 -167600 103692 -350206 -5604 5653 52798 -316135 -286856
$$ packed form
9099b61305A16967A2992c49461C19754a16909H9695O4460b43487a6738A60788
9088A01416J23420a15959B13204a58935b6528l08085j52561B90185G8148a18065
9077a83130d8300D4233a06441I2938b31591c4189r3083B87644a59546d2705A22408
9065b1965k05400H2944E562a70411k54639b9847a4590H4522J67834A09315k8204
9054H1111K5097e2793A97159C9736b43730A43512a37343d5466K070j55106A98632
9042g7439R614j80994O9155k20734B39648b25924A85234a26481K4552k57282B74833
9030d88463H2900B4807M0555L6000d2413l11267h2851B18413a08720q150j4904
9019a31774C94048b10014D0512a67600A03692c50206e604E653M7145c16135K9279
$$ plain form
9008 -286856 -65412 185328 -12417 53571 -108114 -123226 -13997 -62047 243182 244464 127311
8997 127311 48140 -150006 -59393 -42289 -385159 183369 -70169 168597 42146 -42447 91539
8985 -2160 -81536 -416119 -175682 -152269 -41569 39613 -67407 192459 -164952 278236 -526669
8973 -63299 -38179 -87954 -194510 1175 -288522 110224 -197946 -6683 -208721 -29258 14009
8961 7811 -142292 -36330 -174501 105742 171512 -55831 -242901 -3410 208296 -320733 -95065
8949 -126400 -308482 -100596 -115335 234712 89079 41280 -151568 -74408 102069 -58478 94106
8937 -537261 -270496 -190188 -224452 561921 150480 -163972 39924 31469 -62725 -89131 188756
8925 -79901 507181 891970 1497086 6145517 18399672 4913884 691692 417408 341835
$$ packed form
9008b86856f5412A85328a2417E3571a08114j5112a3997m8050B43182J282j17153
8997A27311D8140a50006e9393J7104l42870A83369g0169A68597D2146d2447I1539
8985b160p9376l34583a75682K3413d1569C9613f7407A92459a64952B78236e26669
8973f3299K5120m9775j06556A175b88522A10224a97946f683k02038b9258A4009
8961G811a42292c6330j38171A05742O5770e5831j87070c410B08296c20733i5065
8949a26400j82082a00596j4739B34712H9079D1280a51568g4408A02069e8478I4106
8937e37261K66765Q0308l4264E61921A50480a63972C9924q455f2725k6406A88756
8925g9901E07181L84789O05116M648431J2254155D913884F91692k74284p5573
$$ plain form
8916 341835 100750 117195 70619 269426 -158945 -95415 -116472 183136 534555 259304
8905 81823 155813 -115872 -61755 -75824 83311 204146 41213 158056 -123695 -144021 91704
8893 -139733 29232 -459137 208977 -342731 -39957 -101661 -156685 -362763 -199947 142921
8882 86126 20471 -38525 -45048 136749 -82151 -78809 53777 -113118 134489 221272 325809
8871 325809 -234522 250941 212301 -26935 111569 42675 -25835 -301700 -45716 136315 -150121
$$ packed form
8916C41835A00750J6445m6576J98807a58945O3530k1057A83136L51419B59304
8905H1823P3990a15872N4117j4069H3311J20835D1213J16843a23695k0326I1704
8893a39733B9232d59137B08977c42731c9957o1704n5024k06078J62816A42921
8882H6126B0471c8525o523A36749h2151L342E3777a13118A34489Q6783J04537
8871C25809b34522B50941l8640b6935A11569D2675b5835k75865d5716A36315a50121
$$ [...]
##END NTUPLES=NMR SPECTRUM
##END=
