
##TITLE=AC1345_GUAAH12163_7155106_2wqzkNcoBV
##JCAMPDX= 6.0         $$ Bruker NMR JCAMP-DX V2.0
##DATA TYPE= NMR SPECTRUM
##DATA CLASS= NTUPLES
##ORIGIN= BRUKER
##OWNER= Administrator
$$ 1.72 TOPSPIN		Version 2.1
$$ 2012-12-01 03:52:19.082 -0500  Administrator@X
$$ Compression mode = diff/dup
##.OBSERVE FREQUENCY= 400.02188249412
##.OBSERVE NUCLEUS= ^1H
##.ACQUISITION MODE= SIMULTANEOUS (DQD)
##.ACQUISITION SCHEME= undefined
##.AVERAGES= 8
##.DIGITISER RES= 22
##SPECTROMETER/DATA SYSTEM= spect
##.PULSE SEQUENCE= zg30
##.SOLVENT NAME= COFFEE_meoh
##.SHIFT REFERENCE= INTERNAL, COFFEE_meoh, 1, 14.98509
##AUDIT TRAIL= $$ (NUMBER, WHEN, WHO, WHERE, PROCESS, VERSION, WHAT)
$$ ##TITLE= Audit trail, TOPSPIN		Version 2.1
$$ ##JCAMPDX= 5.01
$$ ##ORIGIN= Bruker BioSpin GmbH
$$ ##OWNER= Administrator
$$ $$ E:\/data/COFFEE/nmr/AC1345_GUAAH12163_7155106_2wqzkNcoBV/10/pdata/1/auditp.txt
$$ ##AUDIT TRAIL=  $$ (NUMBER, WHEN, WHO, WHERE, PROCESS, VERSION, WHAT)
(   1,<2012-12-01 03:52:10.770 -0500>,<Administrator>,<X>,<go>,<TOPSPIN 2.1>,
      <created by zg
	started at 2012-12-01 03:51:04.190 -0500,
	POWCHK enabled, PULCHK disabled,
       configuration hash MD5:
       86 BA 57 50 F2 9D 5C 9B 26 00 A9 28 5F 66 2E 89
       data hash MD5: 64K
       AC 06 C7 21 3B C4 5C 08 7E 55 D5 26 B8 9B 9C 4F>)
(   2,<2012-12-01 03:52:13.910 -0500>,<Administrator>,<X>,<proc1d>,<TOPSPIN 2.1>,
      <Start of raw data processing
       efp LB = 0 FT_mod = 6 PKNL = 1 PHC0 = 0 PHC1 = 0 SI = 32K 
       data hash MD5: 32K
       AB 47 50 FD 8C DA 99 69 FF 9C B5 DC 1E BC ED 33>)
(   3,<2012-12-01 03:52:14.363 -0500>,<Administrator>,<X>,<proc1d>,<TOPSPIN 2.1>,
      <pk PHC0 = 94.96033 PHC1 = 0 
       data hash MD5: 32K
       D9 FA 71 ED 06 14 1A 31 F0 9C 17 4C C4 F9 2B 9B>)
(   4,<2012-12-01 03:52:14.598 -0500>,<Administrator>,<X>,<proc1d>,<TOPSPIN 2.1>,
      <abs ABSG = 1 
       data hash MD5: 32K
       33 5A FA BE 4A 7E 5A 49 1C 40 1A 04 49 E0 B9 AE>)
(   5,<2012-12-01 03:52:14.754 -0500>,<Administrator>,<X>,<proc1d>,<TOPSPIN 2.1>,
      <abs ABSG = 2 
       data hash MD5: 32K
       99 8E 07 ED 5F AF 55 36 80 2E CE D2 83 71 A0 79>)
(   6,<2012-12-01 03:52:14.895 -0500>,<Administrator>,<X>,<proc1d>,<TOPSPIN 2.1>,
      <abs ABSG = 3 
       data hash MD5: 32K
       6B A8 2B B1 37 7A D9 D6 A7 47 D2 39 63 69 58 A0>)
(   7,<2012-12-01 03:52:15.035 -0500>,<Administrator>,<X>,<proc1d>,<TOPSPIN 2.1>,
      <abs ABSG = 4 
       data hash MD5: 32K
       8D 50 54 40 45 52 D3 8A C8 BD 11 BD D5 4C 62 D3>)
(   8,<2012-12-01 03:52:15.176 -0500>,<Administrator>,<X>,<proc1d>,<TOPSPIN 2.1>,
      <abs ABSG = 5 
       data hash MD5: 32K
       14 29 94 1D A7 67 B1 15 A0 A2 E1 DF BB 68 F7 FB>)
$$ ##END=
$$ 
$$ $$ hash MD5
$$ $$ 0E E8 D4 C8 47 DB 96 05 85 4E 96 C3 3C 9F 83 91
##$RELAX= 
##$RELAX= 
##$RELAX= 
##$RELAX= 
##$RELAX= 
##$RELAX= 
##$RELAX= 
$$ Bruker specific parameters
$$ --------------------------
##$DU= <E:\>
##$EXPNO= 10
##$NAME= <AC1345_GUAAH12163_7155106_2wqzkNcoBV>
$$ [...]
##$TP= (0..7)
150 150 150 150 150 150 150 150
##$TP07= 0
##$TPNAME0= <>
##$TPNAME1= <>
##$TPNAME2= <>
##$TPNAME3= <>
##$TPNAME4= <>
##$TPNAME5= <>
##$TPNAME6= <>
##$TPNAME7= <>
##$TPOAL= (0..7)
0.5 0.5 0.5 0.5 0.5 0.5 0.5 0.5
##$TPOFFS= (0..7)
0 0 0 0 0 0 0 0
##$TUNHIN= 0
##$TUNHOUT= 0
##$TUNXOUT= 0
##$USERA1= <user>
##$USERA2= <user>
##$USERA3= <user>
##$USERA4= <user>
##$USERA5= <user>
##$V9= 5
##$VALIST= <valist>
##$VCLIST= <CCCCCCCCCCCCCCC>
##$VD= 0
##$VDLIST= <DDDDDDDDDDDDDDD>
##$VPLIST= <PPPPPPPPPPPPPPP>
##$VTLIST= <TTTTTTTTTTTTTTT>
##$WBST= 1024
##$WBSW= 4
##$XGAIN= (0..3)
0 0 0 0
##$XL= 0
##$YL= 0
##$YMAX_a= 666550
##$YMIN_a= -566162
##$ZGOPTNS= <>
##$ZL1= 120
##$ZL2= 120
##$ZL3= 120
##$ZL4= 120
##$ABSF1= 14.98509
##$ABSF2= -5.573092
##$ABSG= 5
##$ABSL= 3
##$ALPHA= 0
##$AQORDER= 0
##$ASSFAC= 0
##$ASSFACI= 0
##$ASSFACX= 0
##$ASSWID= 0
##$AUNMP= <proc_prof1d_extract_pilot.lims>
##$AXLEFT= 0
##$AXNAME= <>
##$AXNUC= <1H>
##$AXRIGHT= 0
##$AXTYPE= 0
##$AXUNIT= <>
##$AZFE= 0.1
##$AZFW= 0.1
##$BCFW= 0
##$BC_mod= 0
##$BYTORDP= 0
##$COROFFS= 0
##$CY= 15
##$DATMOD= 1
##$DC= 0
##$DFILT= <>
##$DTYPP= 0
##$F1P= 0
##$F2P= 0
##$FCOR= 0.5
##$FTSIZE= 32768
##$FT_mod= 6
##$GAMMA= 0
##$GB= 0
##$INTBC= 1
##$INTSCL= 1
##$ISEN= 128
##$LB= 0
##$LEV0= 0
##$LPBIN= 0
##$MAXI= 10000
##$MC2= 0
##$MEAN= 0
##$ME_mod= 0
##$MI= 0
##$NCOEF= 0
##$NC_proc= -8
##$NLEV= 6
##$NOISF1= 0
##$NOISF2= 0
##$NSP= 0
##$NTH_PI= 0
##$NZP= 0
##$OFFSET= 14.98509
##$PC= 1
##$PHC0= 94.96033
##$PHC1= 0
##$PH_mod= 1
##$PKNL= yes
##$PPARMOD= 0
##$PPDIAG= 0
##$PPIPTYP= 0
##$PPMPNUM= 2147483647
##$PPRESOL= 1
##$PSCAL= 4
##$PSIGN= 0
##$PYNMP= <proc.py>
##$REVERSE= no
##$SF= 400.02
##$SI= 32768
##$SIGF1= 0
##$SIGF2= 0
##$SINO= 400
##$SIOLD= 32768
##$SPECTYP= <>
##$SREGLST= <1H.CDCl3>
##$SSB= 0
##$STSI= 32768
##$STSR= 0
##$SW_p= 8223.68421052631
##$SYMM= 0
##$S_DEV= 0
##$TDeff= 65536
##$TDoff= 0
##$TI= <>
##$TILT= no
##$TM1= 0
##$TM2= 0
##$TOPLEV= 0
##$USERP1= <user>
##$USERP2= <user>
##$USERP3= <user>
##$USERP4= <user>
##$USERP5= <user>
##$WDW= 1
##$XDIM= 32768
##$YMAX_p= 475141584
##$YMIN_p= -716596
##$CURPLOT= <Network HP LaserJet P1505>
##$CURPRIN= <$Network HP LaserJet P1505>
##$DFORMAT= <normdp>
##$LAYOUT= <+/1D_H.xwp>
##$LFORMAT= <normlp>
##$PFORMAT= <normpl>
##$SURQMSG= 1
$$ End of Bruker specific parameters
$$ ---------------------------------
##NTUPLES= NMR SPECTRUM
##VAR_NAME=  FREQUENCY,     SPECTRUM/REAL,   SPECTRUM/IMAG
##SYMBOL=    X,             R,               I
##VAR_TYPE=  INDEPENDENT,   DEPENDENT,       DEPENDENT
##VAR_FORM=  AFFN,          ASDF,            ASDF
##VAR_DIM=   32768,         32768,           32768
##UNITS=     HZ,            ARBITRARY UNITS, ARBITRARY UNITS
##FACTOR=    0.250966925370066, 1,           1
##FIRST=     8223.43324360094, -27550,       -18358
##LAST=      0,             29888,           -23343
##MIN=       0,             -716596,         0
##MAX=       8223.43324360094, 475141584,    0
$$ Real data points
##PAGE= N=1
##DATA TABLE= (X++(R..R)), XYDATA
$$ [...]
19525i018A23561e6261k4211j53075C8375b65455k2757I4550a7966m2349l73704
$$ -9018 123561 -56261 -80472 -233547 38375 -265455 -288212 94550 -17966 -60315 -434019
19514d34019a21814K1941o805j96416i8509A77280B0387a0949k57387r599B3660
$$ -434019 -121814 -99873 -106678 -303094 -98509 177280 20387 -10949 -268336 -277935 23660
19502H4996A1205k528K24172j08867a13237J141k1126K2805k2451k47642H8885
$$ 84996 11205 8677 232849 123982 -113237 -112096 -133222 -110417 -132868 -380510 88885
19490B33699b03791P354j09991A65927a22048j48466H9977O1006b25966O2371
$$ 233699 -203791 -196437 -306428 165927 -122048 -270514 89977 150983 -225966 -163595
19480a63595O4025B68609A06074c50359d9963p8376A12570M5915p5775c98497
$$ -163595 -99570 268609 106074 -350359 -49963 -128339 112570 158485 82710 -398497
19469b8224l8740j93306q9711B02630I0403M5321b45516J9017A90685a41137f4770
$$ -28224 -66964 -260270 -349981 202630 90403 135724 -245516 -226499 190685 -141137 -64770
19457g1841A60132e5828B7911b02807f8595r492l77939d0328l2116D2600b67544
$$ -71841 160132 -55828 27911 -202807 -68595 -78087 -456026 -40328 -72444 42600 -267544
19445f5454j578o1511j35131c4486E2545b19938h4149K3901m04629B03631o3487
$$ -65454 -67032 -128543 -263674 -34486 52545 -219938 -84149 -60248 -464877 203631 140144
19434A40144d7324m17871f5995q3815N853l611A51987f6863G4487a75543E6089
$$ 140144 -47324 -465195 -65995 -149810 -143957 -147568 151987 -66863 74487 -175543 56089
19422i223l42850J42298n485D5246d04224h1913D0761a5288B0011d4546o1159
$$ -9223 -352073 -209775 -215260 45246 -404224 -81913 40761 -15288 20011 -44546 -105705
19411a05705n52d5513l9099H8771J46935c72661J65441A23016i7803d2802A86425
$$ -105705 -106257 -45513 -84612 88771 235706 -372661 -207220 123016 -97803 -42802 186425
19399A14349b72079B7583P4334l8334f9520K6395r7667A37867a73284K9546q035
$$ 114349 -272079 27583 101917 63583 -69520 -43125 -140792 137867 -173284 -143738 -151773
19388a51773b6875C0410J29079i9795B61117c97062A05651a29406q2203L0010
$$ -151773 -26875 30410 159489 -99795 261117 -397062 105651 -129406 -211609 -181599
19378a81599E4353M9920c8685j29579P9535o6995C14463a64912A86779k0160b7087
$$ -181599 54353 104273 -38685 -168264 -88729 -155724 314463 -164912 186779 166619 -27087
19366B65047B3228c97023c5837l2827j59849M94b25j69993j34822a10286A051
$$ 265047 23228 -397023 -35837 -68664 -228513 -228019 -225 -170218 -305040 -110286 1051
19354C90304E2611f7769j13807O7744j07334a5500p619k47620e3380r0626d6354
$$ 390304 52611 -67769 -181576 -113832 -221166 -15500 -23119 -270739 -53380 -144006 -46354
19342a88099A04638e8848A20773b8364o3969B5411a06135A68913C1617g3906A55864
$$ -188099 104638 -58848 120773 -28364 -92333 25411 -106135 168913 31617 -73906 155864
19330a91376j60190B5563a48D3522J6044A710a48451j22370A48418b80828D2880
$$ -191376 -351566 25563 -148 43522 59566 1710 -148451 -270821 148418 -280828 42880
19318D8960a46588D5885b3001k09643M1564A07706k9523h9749q0698d240k22485
$$ 48960 -146588 45885 -23001 -232644 -191080 107706 78183 -89749 -170447 -4240 -226725
19307b26725j22533a71485k72784a60045B17996g9687j82728A6362K89365G1216
$$ -226725 -349258 -171485 -444269 -160045 217996 -79687 -262415 16362 305727 71216
19296f0143A6916a45994K538e2277k04327G797d40885a72976H6295d3770E1644
$$ -60143 16916 -145994 -143456 -52277 -256604 7797 -440885 -172976 86295 -43770 51644
19284A1989c3688k01839A62085g3364j42170P6117A36026i6028c982j51404I08
$$ 11989 -33688 -235527 162085 -73364 -215534 -139417 136026 -96028 -3982 -155386 908
19272a10225d5493A53677c16333c2193j33052Q0024L3253k195A33960a11752j94328
$$ -110225 -45493 153677 -316333 -32193 -165245 -85221 -51968 -54163 133960 -111752 -306080
19261c06080A42673A4818c8553A38110J14988A06868a92744N7644k4502e1367
$$ -306080 142673 14818 -38553 138110 253098 106868 -192744 -135100 -159602 -51367
19250A65315b85361B01727I4966k3035e5850K796K5749B46941a98512a1790k04784
$$ 165315 -285361 201727 94966 71931 -55850 -53054 -27305 246941 -198512 -11790 -216574
19239b16574D8665a43443G8900L3843m9357d20272A80272c17720J52322I3885
$$ -216574 48665 -143443 78900 112743 63386 -420272 180272 -317720 -165398 93885
19228I6484b82948E2812J24011d08001h9292B18165d6604A72069b1797A5665Q3383
$$ 96484 -282948 52812 176823 -408001 -89292 218165 -46604 172069 -21797 15665 99048
19217I9048b45691M9763B3229M2913a72226q1836C4738e59175A54691c54388J44443
$$ 99048 -245691 -195928 23229 66142 -172226 -254062 34738 -559175 154691 -354388 -209945
19206b09945A655O9922a33425B49469a88121K5206N0389p4847k58748e098q2488
$$ -209945 1655 71577 -133425 249469 -188121 -162915 -112526 -187373 -446121 -5098 -87586
19195h7586j3950A35791N1092i707A18720d921j182p5627l8558j35166a00316
$$ -87586 -101536 135791 186883 -9707 118720 -4921 -6103 -81730 -120288 -255454 -100316
19183c81A02543a7277B20232a1978r0321o9954l3146A65958a43159o3319B20236
$$ -381 102543 -17277 220232 -11978 -102299 -172253 -205399 165958 -143159 -206478 220236
19171a85396N6244j84145B32635R1011f6938r0084D7593d02282i3544A567P9890
$$ -185396 -129152 -313297 232635 323646 -66938 -157022 47593 -402282 -93544 1567 81457
19160H1457b0229p0648A44745a81355M1287k08496J43749A34149B9990a88A0282
$$ 81457 -20229 -90877 144745 -181355 -140068 -348564 -204815 134149 29990 -188 10282
19148b06840i5562l20653c575A2497M3136J01374e34019A73265B7321a61189C9160
$$ -206840 -95562 -416215 -3575 12497 55633 157007 -534019 173265 27321 -161189 39160
19136I1268h2703o6064j94227Q0756b3555B2712a38675c2581G2834b94170a31921
$$ 91268 -82703 -148767 -342994 -262238 -23555 22712 -138675 -32581 72834 -294170 -131921
19124b70646D380R5492h5045k69832G8197M7778D9306L3258a68387H1551f4101
$$ -270646 4380 99872 -85045 -354877 78197 125975 49306 82564 -168387 81551 -64101
19112c45646A10454c94705A2721M55761B23628F9174b1733B35519f7479j28041
$$ -345646 110454 -394705 12721 468482 223628 69174 -21733 235519 -67479 -195520
19102a95520i3965m19840a29656j17607D7831J16353h5778A48687A7189J01386
$$ -195520 -93965 -513805 -129656 -247263 47831 164184 -85778 148687 17189 118575
19092A18575A4950d0387B3663J58824b00002l6617c7360m571j37409H784c53988
$$ 118575 14950 -40387 23663 182487 -200002 -236619 -37360 -41931 -179340 8784 -353988
19080b73718R00D5548K6000K3478l2799b74791D03762c0339A70J99334g528j0021
$$ -273718 -272818 45548 71548 95026 62227 -274791 403762 -30339 170 199504 -7528 -17549
19068a7549q398j63380j06782a18243d4226A63924l759B0093J83943J69475A67817
$$ -17549 -25947 -189327 -296109 -118243 -44226 163924 160165 20093 204036 373511 167817
19056a56753j75188H2032K0117k1570a97557k4094A11897b17324A22712b80608
$$ -156753 -331941 82032 102149 80579 -197557 -221651 111897 -217324 122712 -280608
19045i9279D7154J10043f8607C50694a21446E7204c1841D8756i4854A01834a82012
$$ -99279 47154 157197 -68607 350694 -121446 57204 -31841 48756 -94854 101834 -182012
19033c16087B4579L23434C7743b74662A37331d0942d866G3826J35457I560g945
$$ -316087 24579 348013 37743 -274662 137331 -40942 -4866 73826 209283 9560 -7945
19021e6628A17883m2009K308i6800j76663k41051G8223j7796Q9538D3140a05446
$$ -56628 117883 75874 78182 -96800 -273463 -514514 78223 60427 149965 43140 -105446
19009D6576L1117b87104J42453B99691b81084A23182p923a7097j5393K640j06659
$$ 46576 77693 -287104 -144651 299691 -281084 123182 115259 -17097 -32490 -29850 -136509
18998a36509A40340a11871K4073G6258P788Q2238f2082k60624d1743A31756a23348
$$ -136509 140340 -111871 -87798 76258 84046 166284 -62082 -322706 -41743 131756 -123348
18986F0186b27832b0417j13752A6428b28550A5642a42547N3010F1549c79256a39394
$$ 60186 -227832 -20417 -134169 16428 -228550 15642 -142547 -89537 61549 -379256 -139394
18974C5417c5424A54664b38855G636N8692d0222k25208j3857A37076g4546A2138
$$ 35417 -35424 154664 -238855 7636 66328 -40222 -265430 -279287 137076 -74546 12138
18962B13669G4268c1596A10753b53976h3335i680H0353k5360d19261J78974Q170
$$ 213669 74268 -31596 110753 -253976 -83335 -9680 80353 54993 -419261 -240287 -232117
18951b32117P3103H3152C3365O9115C7026a70042M7892j77365B05364a22824b7505
$$ -232117 -159014 83152 33365 102480 37026 -170042 -122150 -299515 205364 -122824 -27505
18939d1535C25760j5939b42508j46868a92511l48085b29495A74872f545B32376
$$ -41535 325760 309821 -242508 -389376 -192511 -540596 -229495 174872 -6545 232376
18928c838A96904c22412a37325I7933O0201a03456k12519B91210O301c80963E898
$$ -3838 196904 -322412 -137325 97933 158134 -103456 -315975 291210 297511 -380963 5898
18916A87528a04045d5685A80536b16293p9745g2863D0443N2892A3063b16696G8909
$$ 187528 -104045 -45685 180536 -216293 -296038 -72863 40443 93335 13063 -216696 78909
18904I6134J12579b9807k46232A91744h0327A22824K04356a5348A75802q5325
$$ 96134 208713 -29807 -276039 191744 -80327 122824 327180 -15348 175802 90477
18894I0477a22184j3128e4265l59049c4985B81222b80914a14283A00911J1479
$$ 90477 -122184 -135312 -54265 -413314 -34985 281222 -280914 -114283 100911 112390
18884A12390e1877A01006k7118K50460I2769c03272F3617a39985k57768c7720
$$ 112390 -51877 101006 73888 324348 92769 -303272 63617 -139985 -397753 -37720
18873e54335A12696b74336b0007d373A85915n6401K8151J59967a42792D1687a68457
$$ -554335 112696 -274336 -20007 -4373 185915 129514 157665 317632 -142792 41687 -168457
18861A45985d04181C09384a80278j41440C10412D4112a15631G6743a01889B8129
$$ 145985 -404181 309384 -180278 -321718 310412 44112 -115631 76743 -101889 28129
18850B5462J38038b9684q8633q4593o9043R6706A27215O848a79443H8351A2543
$$ 25462 163500 -29684 -118317 -202910 -271953 -175247 127215 134063 -179443 88351 12543
18838A76243a3887p9889m2496j20350A710i711j2988k53676b0199k0316D06460
$$ 176243 -13887 -93776 -136272 -256622 1710 -9711 -22699 -276375 -20199 -40515 406460
18826c45200e4415a424j67106e6242C4573P4056P85b11479E7929K67671g0077
$$ -345200 -54415 -1424 -168530 -56242 34573 108629 109414 -211479 57929 325600 -70077
18814a49517J7137B48851j19322L46180a47284k7459M398L5449F228d70704h2977
$$ -149517 -132380 248851 129529 475709 -147284 -174743 -170345 -134896 6228 -470704 -82977
18802c7635a6406l71447B9977J03386a76020D4933b88255A3361a81596e7810j62492
$$ -37635 -16406 -387853 29977 133363 -176020 44933 -288255 13361 -181596 -57810 -220302
18791b20302C50999A35214b99567B71330G2840c32267B2794b08325E5583b43627
$$ -220302 350999 135214 -299567 271330 72840 -332267 22794 -208325 55583 -243627
18780B06822b2916A47795I493J6929a84637I8691A1099b82146O7389F4312b42462
$$ 206822 -22916 147795 9493 26422 -184637 98691 11099 -282146 -214757 64312 -242462
18768D2317b96686e8924G5469a30233A35143b59101C1500J0676a06753A39180
$$ 42317 -296686 -58924 75469 -130233 135143 -259101 31500 42176 -106753 139180
18757c04651B10615E3045J15251B6625a05713k21397D5121R6749b05668N700J1778
$$ -304651 210615 53045 168296 26625 -105713 -327110 45121 141870 -205668 -199968 -188190
18746a88190I7066g6964j3063p4327A1693f1951F6268b57493J01993j71457l71601
$$ -188190 97066 -76964 -90027 -164354 11693 -61951 66268 -257493 -155500 -326957 -698558
18735f98558G6399a50101A24616b81889a09173l22447C75552f0927l2496m5447
$$ -698558 76399 -150101 124616 -281889 -109173 -431620 375552 -60927 -93423 -138870
18725a38870d3152k02046B00412d8863o7549D9242K16392a18792d5767A05079
$$ -138870 -43152 -245198 200412 -48863 -116412 49242 265634 -118792 -45767 105079
18714b15722h3722n5506j73947e0150j82714A25839a62514O7229p8971B7673R1608
$$ -215722 -83722 -139228 -313175 -50150 -232864 125839 -162514 -95285 -174256 27673 119281
18703A19281h714j39536B93821b10147A44358i3489B65693a10823H0723b3224
$$ 119281 -8714 -148250 293821 -210147 144358 -93489 265693 -110823 80723 -23224
18692b84390A22844c71255B81886b34435E7866J6519a26435j4537c022q146j15344
$$ -284390 122844 -371255 281886 -234435 57866 74385 -126435 -140972 -3022 -11168 -126512
18681a26512A21543e0340P515q12j97980J03812a7526p0499j27683F4945J15102
$$ -126512 121543 -50340 -42825 -43637 -241617 -137805 -17526 -88025 -215708 64945 180047
18670A80047q8079d85410a82982j1956j0301B0708b32783g7986C16935f6872H9847
$$ 180047 91968 -485410 -182982 -194938 -205239 20708 -232783 -77986 316935 -66872 89847
18658c34397C0410c36942D15230a41831B12814d6946h914k0344j75544O7537L3840
$$ -334397 30410 -336942 415230 -141831 212814 -46946 -8914 -29258 -204802 -137265 -103425
18647a03425L8068j08085B2938i933D43287h5057L2071F567b19840C6394P9598
$$ -103425 -65357 -173442 22938 -9933 443287 -85057 -52986 6567 -219840 36394 115992
18636A15992a16385J8149j3399a3878k4195D9214a6714j46427l7169r0002F6009
$$ 115992 -116385 -98236 -111635 -13878 -38073 49214 -16714 -163141 -200310 -290312 66009
18624b43598a4197j99123m4703l4623i8335m14368A45485N9032b73089b2118j45462
$$ -243598 -14197 -213320 -258023 -292646 -98335 -512703 145485 204517 -273089 -22118 -167580
18613a67580n3631F5850d14879a56313J4005e3637p3601A78905b6784l10j72509
$$ -167580 -221211 65850 -414879 -156313 -142308 -53637 -127238 178905 -26784 -27094 -199603
18602a99603B65837c4692A82593B7098c16538B49739r0099c5863o9556l5438j31167
$$ -199603 265837 -34692 182593 27098 -316538 249739 159640 -35863 -105419 -140857 -272024
18591b72024p5176f383k65253I3568a66823k31975J33503A73811a40523j79756
$$ -272024 -347200 -6383 -271636 93568 -166823 -398798 -265295 173811 -140523 -320279
18581c20279J18133A36000c0560I462f3605j09300j07355J37976O3439r723A26358
$$ -320279 -202146 136000 -30560 9462 -63605 -172905 -280260 -142284 -78845 -88568 126358
18569A14538a23576p5473C68439c8156A11369c2853k51832b3205j55686J7577
$$ 114538 -123576 -199049 368439 -38156 111369 -32853 -284685 -23205 -178891 -161314
18559a61314j57383J03810B25659L49b87252E3777J77534a57666b0793A54684
$$ -161314 -318697 -214887 225659 226008 -287252 53777 231311 -157666 -20793 154684
18548a59098f15A9042J14935a4060j28803J6186m3953B14229d528r8189a537l05347
$$ -159098 -615 19042 133977 -14060 -142863 -126677 -170630 214229 -4528 -102717 -1537 -306884
18536c06884g5806H6374a19956A11581n346n0016a29717l27979I003h6667l3184
$$ -306884 -75806 86374 -119956 111581 106235 56219 -129717 -457696 9003 -86667 -119851
18525a19851j07132k6494r9162B15397b93764f808E7946c31455A95285f6542n7220
$$ -119851 -226983 -253477 -352639 215397 -293764 -6808 57946 -331455 195285 -66542 -123762
18514a23762B61600b4437D1215L7151L33713a59466r1367i361B36008n6739b4725
$$ -123762 261600 -24437 41215 78366 412079 -159466 -250833 -9361 236008 179269 -24725
18502e0729l0957M0358H2939c1294j74376L3053N2868I9583B2350L5120i797n598
$$ -50729 -81686 -41328 82939 -31294 -205670 -172617 -119749 99583 22350 57470 -9797 -15395
18490a5395k37966A72211P5465a77539B3616J66497a20691A53004k5461j0685
$$ -15395 -253361 172211 247676 -177539 23616 190113 -120691 153004 127543 116858
18480A16858J119c13866J46226r362O3821j91043g7052A57569b19836A53620h0849
$$ 116858 117977 -313866 -167640 -177002 -113181 -304224 -77052 157569 -219836 153620 -80849
18468a27811b3932r355H1970J52104n5253O3169d3282j76931k0908G2927e6704
$$ -127811 -23932 -33287 81970 234074 178821 241990 -43282 -220213 -241121 72927 -56704
18456c49908j8552R3035A20630a26923D480j111d8929l6699o0317B7339b64104
$$ -349908 -368460 -275425 120630 -126923 4480 3369 -48929 -85628 -145945 27339 -264104
18444a6295A71240b83040A49844j3927n5827J85136e4201I1760d8342l5956I6271
$$ -16295 171240 -283040 149844 135917 80090 265226 -54201 91760 -48342 -84298 96271
18432A03279K595a62984B98947i9773K5071B04611A4056b06313C5385g6771F6055
$$ 103279 105874 -162984 298947 -99773 -74702 204611 14056 -206313 35385 -76771 66055
18420a47166c8110p7500H9751b19372A33603J74763H5718d7265k3378k26466J34342
$$ -147166 -38110 -115610 89751 -219372 133603 308366 85718 -47265 -70643 -297109 -162767
18409a62767F641O1189b59010I6441J2784b3238j66942b5286a2563I9185C2309
$$ -162767 6641 67830 -259010 96441 109225 -23238 -190180 -25286 -12563 99185 32309
18397E5156e2274j39665a2571j50320f3787o4214M0339A65651a71775b9718E8169
$$ 55156 -52274 -191939 -12571 -162891 -63787 -128001 -87662 165651 -171775 -29718 58169
18385f1194o5627A65038b28164I6367a73652j06508c8952A61852K5380i7735M0326
$$ -61194 -126821 165038 -228164 96367 -173652 -280160 -38952 161852 187232 -97735 -57409
18374e7409p6523j1225d8884j81517e4296B5889b59854A7226M9403L0227c61412
$$ -57409 -133932 -145157 -48884 -230401 -54296 25889 -259854 17226 66629 96856 -361412
18362B7119E596Q5740B7958a58897j7188d8524B50462a20005A01284b06864n1884
$$ 27119 5596 91336 27958 -158897 -176085 -48524 250462 -120005 101284 -206864 -258748
18351b58748c7302B48133a83166j64606g8195k29165B85453a52602B33154p4159
$$ -258748 -37302 248133 -183166 -347772 -78195 -307360 285453 -152602 233154 158995
18341A58995a82595f5182k9836B09037G7787h67k06195N5611H116a31586A24451
$$ 158995 -182595 -65182 -95018 209037 77787 -867 -207062 -151451 8116 -131586 124451
18329I0255c20559a5074q1038K8906j35877h2996B26385g8331B26603D5685R2895
$$ 90255 -320559 -15074 -96112 -67206 -203083 -82996 226385 -78331 226603 45685 138580
18318A38580b4447k11540A15649d2172A89855G8995g7141j1268A58231p3455r522
$$ 138580 -24447 -235987 115649 -42172 189855 78995 -77141 -88409 158231 84776 75254
18307G5254a05749j12632c8517k07569h21B3044a9435o1288A99014g506j14301
$$ 75254 -105749 -218381 -38517 -246086 -821 23044 -19435 -80723 199014 -7506 -121807
18296a21807A60436B0992c11381C8665K24506i6622j22354O3179b7817B96636
$$ -121807 160436 20992 -311381 38665 263171 -96622 -218976 -155797 -27817 296636
18285a99963l32i8795k37299F7946L2383O349Q973k1844j784a12344m59741J64853
$$ -199963 -200295 -98795 -336094 67946 100329 106678 115651 93807 92023 -112344 -572085 -407232
18273d07232C24356C1358c3871E7491p10e5649j87634M1820O5320e3529A06655
$$ -407232 324356 31358 -33871 57491 56781 -55649 -243283 -201463 -136143 -53529 106655
18261g4831j82102A76575c3415j50256i0173N694A12535j1775d3942l065A71248
$$ -74831 -256933 176575 -33415 -183671 -90173 -84479 112535 100760 -43942 -47007 171248
18249C8435b48514J23222F0125L95913k12434b1210H5056d0801J3830l3622o096
$$ 38435 -248514 -125292 60125 456038 243604 -21210 85056 -40801 -26971 -60593 -66689
18238f6689F0249J1833C0264J9745e188j97103b4246k78854i3997j54929A88659
$$ -66689 60249 72082 30264 50009 -5188 -202291 -24246 -303100 -93997 -248926 188659
18226a51245l1839b228B20921b93491A19608c11194a04861L3444q4532k2511B96260
$$ -151245 -183084 -2228 220921 -293491 119608 -311194 -104861 -71417 -155949 -178460 296260
18214A83391a59341F498J2663a86198C7144a44496f8182o8751A19088c13175P4960
$$ 183391 -159341 6498 19161 -186198 37144 -144496 -68182 -136933 119088 -313175 -238215
18203b38215A56512A2327J97898q9207a75747B1047b1850C3553Q2383m0764K98388
$$ -238215 156512 12327 210225 121018 -175747 21047 -21850 33553 115936 75172 373560
18192C73560a35494B22101A2633J20521a54929j07434B4330L8462k2803a99814
$$ 373560 -135494 222101 12633 133154 -154929 -262363 24330 62792 39989 -199814
18181a13261j9611A49817b10206B42271r4517b05711G981a20787j46545M8617
$$ -113261 -132872 149817 -210206 242271 147754 -205711 7981 -120787 -267332 -218715
18171b18715B0164c9028A4512E915K29052j09862a91345m9698i816j76444h7043
$$ -218715 20164 -39028 14512 5915 234967 125105 -191345 -241043 -9816 -186260 -87043
18159A42065b34502f5691A51230m2566J34230A20987K8240c4478J610B7510d0803
$$ 142065 -234502 -65691 151230 108664 242894 120987 149227 -34478 -32868 27510 -40803
18147A17701b29293A13588b2590D7481M5314a99108m8913C24994a51819j69025
$$ 117701 -229293 113588 -22590 47481 92795 -199108 -248021 324994 -151819 -320844
18137c20844j4258J08331P8469B71389E4852a28191B6293a38052F8068g5422k49788
$$ -320844 -335102 -226771 -148302 271389 54852 -128191 26293 -138052 68068 -75422 -325210
18126c25210g7124B51474a38964B1491d849I8656b914j17472k27597a44966a1799
$$ -325210 -77124 251474 -138964 21491 -4849 98656 -2914 -120386 -347983 -144966 -11799
18114F102b02386J1431b4653A4760J50821b48194A52716c16033A01647a77403
$$ 6102 -202386 -190955 -24653 14760 165581 -248194 152716 -316033 101647 -177403
18103h5755B48734J36231A63752K0911J2130D0814c3146D7106J52360b07878A59557
$$ -85755 248734 384965 163752 184663 196793 40814 -33146 47106 199466 -207878 159557
18091C0386F093a78363A11389a31142G4321b88538g9434F6810c3104C4301O2146
$$ 30386 6093 -178363 111389 -131142 74321 -288538 -79434 66810 -33104 34301 96447
18080I6447M465i3954A80275c77346c205A95195G1396i1116j50825A01142L08905
$$ 96447 100912 -93954 180275 -377346 -3205 195195 71396 -91116 -241941 101142 410047
18069D10047d0527A80000a72598A72719n72b1302E5249c21957H5630J3868a109
$$ 410047 -40527 180000 -172598 172719 172147 -21302 55249 -321957 85630 99498 -1109
18057a99282A59745a5534k5046k50996C3233b0339l38158b4314j71317g4725L7088
$$ -199282 159745 -15534 -40580 -291576 33233 -20339 -358497 -24314 -195631 -74725 -37637
18046c7637k38792A19521H574K7208a26930l62568f3676D5010a78310C00467c15810
$$ -37637 -276429 119521 8574 35782 -126930 -489498 -63676 45010 -178310 300467 -315810
18034a17834I3764A7774J50514a35915b413A08494e9599H470h4131E8555J13092
$$ -117834 93764 17774 168288 -135915 -2413 108494 -59599 8470 -84131 58555 171647
18023A71647i4102j5624C0864a81966A87834c51982g0044q2388D03526A38677
$$ 171647 -94102 -109726 30864 -181966 187834 -351982 -70044 -152432 403526 138677
18012A85187c7055a6240k9593j7281C1814K82925n7023c9961A40228P4336D5471
$$ 185187 -37055 -16240 -45833 -63114 31814 314739 257716 -39961 140228 214564 45471
18000b18600A28240i2524C27527a94745G6424K90150c8619e383m5099F8164M33275
$$ -218600 128240 -92524 327527 -194745 76424 366574 -38619 -5383 -50482 68164 501439
17989E01439f6527O184b3241A17060K0510b39602b7160h520C4989M8135P086l5801
$$ 501439 -66527 -60343 -23241 117060 137570 -239602 -27160 -8520 34989 83124 90210 54409
17977E4409n540d7673b0496k08137N317A91875a74402M8200A8456a2286G5605
$$ 54409 48869 -47673 -20496 -228633 -223316 191875 -174402 -126202 18456 -12286 75605
17965C12211j04194a81428e3871k04565A23095P261c57673C78764A23885b8193
$$ 312211 208017 -181428 -53871 -258436 123095 130356 -357673 378764 123885 -28193
17954a55779K1734A47495M5985M8176a06287a9173j27258n9875E1839K09439B4096
$$ -155779 -134045 147495 193480 241656 -106287 -19173 -146431 -206306 51839 261278 24096
17942f5525g372B8400a82817j97931a52371I7798q62L1227a29670D0652c26873
$$ -65525 -7372 28400 -182817 -380748 -152371 97798 96936 128163 -129670 40652 -326873
17930a31525C36398p1344A6259a9195E676b69855i9581p9903M5354d4169n0972
$$ -131525 336398 265054 16259 -19195 5676 -269855 -99581 -179484 -134130 -44169 -95141
17919i5141A69974J38612c20545c4045D47979f3735r7822h0368A25129G017c1262
$$ -95141 169974 308586 -320545 -34045 447979 -63735 -161557 -80368 125129 7017 -31262
17907a29262p586e3603b169j36147B9942K9621N0398P6617O0248G0340r491K2204
$$ -129262 -136848 -53603 -2169 -138316 29942 59563 109961 186578 246826 70340 60849 83053
17895H3053a46034B4305M1943a80372A97916d6513j18717A90467B811K36153i0819
$$ 83053 -146034 24305 66248 -180372 197916 -46513 -165230 190467 2811 238964 -90819
17883c73769B65826d07512A06671M3401g7817B77855e4181H8856K1361K59576
$$ -373769 265826 -407512 106671 150072 -77817 277855 -54181 88856 110217 369793
17873C69793b3926m8117C8560a66135K5593L7292N1101l93590a66476m1169i4568
$$ 369793 -23926 -72043 38560 -166135 -140542 -103250 -52149 -445739 -166476 -207645 -94568
17861b04827Q5260P853D4649O7671g16596I2635B2633K40407f9988j47163a05838
$$ -204827 -119567 -111714 44649 112320 -716596 92635 22633 263040 -69988 -217151 -105838
17849h4307j96767J23137e7393m0549A59614H457J09403C2704J42316a87083B74582
$$ -84307 -281074 -157937 -57393 -97942 159614 8457 117860 32704 175020 -187083 274582
17837A80218P3036f7621j44101j0534g7750A62954d7875B27466a23820A03089
$$ 180218 253254 -67621 -211722 -222256 -77750 162954 -47875 227466 -123820 103089
17826c3664C81271c1384C2900M0345d9001A9990J20703n0348h4356p2526I0428
$$ -33664 381271 -31384 32900 73245 -49001 19990 140693 90345 -84356 -156882 90428
17814b30267H0212a1036D09395A21957J80626d73088g7549A22923Q8084p3660
$$ -230267 80212 -11036 409395 121957 302583 -473088 -77549 122923 211007 137347
17804A37347D9314c87251G1690a81563C02399E3844Q117L3116M6974b76899F6482
$$ 137347 49314 -387251 71690 -181563 302399 53844 61961 95077 142051 -276899 66482
17792a18391C63506G0097f5819m6674k442j7504l0926B86639A25961J78732b13601
$$ -118391 363506 70097 -65819 -112493 -114935 -132439 -163365 286639 125961 304693 -213601
17780a17914B09608k6878b9161o1665E4045J9269A9108J82105J61653A41497M5082
$$ -117914 209608 182730 -29161 -90826 54045 73314 19108 201213 362866 141497 186579
17769A86579o5853f9477l530H2471k046i3881k6694A25447e8538j2568F1379J17512
$$ 186579 120726 -69477 -73007 82471 80425 -93881 -120575 125447 -58538 -71106 61379 178891
17757A78891a69039E1102a22720D0964g3625A23932O0129d4262B16395g4340F8207
$$ 178891 -169039 51102 -122720 40964 -73625 123932 184061 -44262 216395 -74340 68207
17745a93236a7896I5770a59795B8469c32737a38180a9028q2696D4082L3382c47058
$$ -193236 -17896 95770 -159795 28469 -332737 -138180 -19028 -101724 44082 77464 -347058
17733a78878A4931J71278c36534J01046k08685C55158a67591g7576F9645N6009
$$ -178878 14931 186209 -336534 -235488 -444173 355158 -167591 -77576 69645 125654
17723A25654b11193Q2611C4695K31644C5876b25756C10094h659C73123j72792
$$ 125654 -211193 -128582 34695 266339 35876 -225756 310094 -8659 373123 200331
17713B00331a08801j0338K9123A8407D95h6523A02410C8266g9242I2495f0335
$$ 200331 -108801 -119139 -90016 18407 495 -86523 102410 38266 -79242 92495 -60335
17701A51742f6458A94709f4687H847K66540c16773f4263k07449A10345a903j2080
$$ 151742 -66458 194709 -64687 8847 275387 -316773 -64263 -271712 110345 -1903 -13983
17690a3983G9304h3029H0373a90291B52346f3029j14529h7544C05765L4246a57657
$$ -13983 79304 -83029 80373 -190291 252346 -63029 -177558 -87544 305765 340011 -157657
17678b91246A91745L6230b18206G3201K3625d876A15431a52816N5109k2310K6637
$$ -291246 191745 227975 -218206 73201 96826 -4876 115431 -152816 -97707 -120017 -93380
17667i3380J1076C00555a59273L6037A7614J38467b06688d8133k03431Q7386m268
$$ -93380 -82304 300555 -159273 -123236 17614 156081 -206688 -48133 -251564 -164178 -168446
17656a68446B57436J33803A27174M4250l0794j9639k1785a3704B40107c0855B32737
$$ -168446 257436 391239 127174 171424 140630 120991 99206 -13704 240107 -30855 232737
17644a38736d5072D06295k01469E6403L1392J39443d6614K714B4130J88361q3419
$$ -138736 -45072 406295 204826 56403 87795 227238 -46614 -43900 24130 212491 129072
17633A29072f7322A39208c76525L7696a37271n6856C34013E0310k0160d2611A96018
$$ 129072 -67322 139208 -376525 -338829 -137271 -194127 334013 50310 30150 -42611 196018
17621B75740A01514b62056A56127b7825A10278j6948J05442F7069M4192C1997
$$ 275740 101514 -262056 156127 -27825 110278 93330 198772 67069 111261 31997
17610D2436b8148A75742G2720C369K50141b23937A32723a02116A91939q4921J18803
$$ 42436 -28148 175742 72720 3369 253510 -223937 132723 -102116 191939 107018 225821
17599B25821b46944A98889E7170a42103A23568B5962N08105a05305j15445C97568
$$ 225821 -246944 198889 57170 -142103 123568 25962 534067 -105305 -220750 397568
17588A54380l9490j0535M9051f4861l953J5861D9916AL095K14663g2614b349k65054
$$ 154380 114890 104355 153406 -64861 -68814 -52953 49916 1 3096 217759 -72614 -2349 -267403
17575b67403K7368O8654g1038C07910A00178d1233B35653k933b14756A86369d7576
$$ -267403 -240035 -171381 -71038 307910 100178 -41233 235653 232720 -214756 186369 -47576
17563e4353o5346Q083e2513A10515c9153C29588E18M1970g5287j77927A48467
$$ -54353 -119699 -111616 -52513 110515 -39153 329588 518 42488 -75287 -253214 148467
17551C15436H3425O6507a01090H1706K5049D9578a26206B22360o5088b39415Q0839
$$ 315436 83425 149932 -101090 81706 106755 49578 -126206 222360 157272 -239415 -158576
17540a58576E3982B4369q796e7345K3493A84456B0569K50536j2555I7478a61755
$$ -158576 53982 24369 15573 -57345 -33852 184456 20569 271105 258550 97478 -161755
17528A4518N147h2163A18809R3485q5759j4784J78763h5913j1216A02588O4335
$$ 14518 19665 -82163 118809 212294 126535 111751 290514 -85913 -97129 102588 166923
17517A66923c76600A45482m3381L5753a13402d08A11444O0527b15216I5495a11545
$$ 166923 -376600 145482 102101 137854 -113402 -408 111444 171971 -215216 95495 -111545
17505A56608J54181H3630b3289A26383B9889g4474I3617M18740j69692q7760J40934
$$ 156608 310789 83630 -23289 126383 29889 -74474 93617 512357 342665 254905 395839
17494C95839b11798H1927J31049J0501R440L1737J59887e9174D70189j83725n7686
$$ 395839 -211798 81927 212976 223477 232917 264654 424541 -59174 470189 286464 228778
17483B28778a72989A47760a66101M4571A77973a19894C4752j3522L80158A53011
$$ 228778 -172989 147760 -166101 -121530 177973 -119894 34752 21230 401388 153011
17472A53094J60154I003J78037L0426A07687K85029a29055j00347A43940K5369
$$ 153094 313248 9003 187040 217466 107687 392716 -129055 -229402 143940 169309
17462A69309o718b7915A09365j8272k1710K34801j13709Q6413J47003A83913J32691
$$ 169309 162591 -27915 109365 91093 69383 304184 190475 276888 423891 183913 316604
17451C16604A55036L63012j42680j08241k1597N5380n5443A03138J71126A34722
$$ 316604 155036 518048 375368 267127 245530 300910 245467 103138 274264 134722
17440b9758A54259j7011D0747K11864J49685j73601J24999m838A3722J30056O807
$$ -29758 154259 137248 40747 252611 402296 228695 353694 348856 13722 143778 150585
17429A50585K98190a41476D27071A33537J91220l7229A19003K81560a66024D2401
$$ 150585 448775 -141476 427071 133537 324757 287528 119003 400563 -166024 42401
17418C83264j2046j33748I0004O1313m6595J92019A38145O1225M63341A00122
$$ 383264 371218 237470 90004 151317 104722 296741 138145 199370 662711 100122
17407D25775j47867J52569B02939O7663J8622L5038E7141a12049B71016j9736
$$ 425775 277908 430477 202939 270602 289224 324262 57141 -112049 271016 251280
17397B51280A09560J35581a18952A78083o5109O6330l1931L66328A85957P5496
$$ 251280 109560 245141 -118952 178083 112974 179304 147373 513701 185957 261453
17387B61453Q0285A41701i9319H1226K96395c4044A17983L73740A4039P9610Q22
$$ 261453 341738 141701 -99319 81226 377621 -34044 117983 491723 14039 93649 94471
17376I4471a20638C14586l8791A26388K23211A18774c37543f2648D10224d774
$$ 94471 -120638 314586 275795 126388 349599 118774 -337543 -62648 410224 -4774
17365A88141H3414O9712g3012A6213b2331C44526a56254A33558J28230O5530d7871
$$ 188141 83414 153126 -73012 16213 -22331 344526 -156254 133558 261788 327318 -47871
17353B44155I6418J80098i8968c7950A31219l4923O992e6129A27500f5774A17430
$$ 244155 96418 276516 -98968 -37950 131219 96296 103288 -56129 127500 -65774 117430
17341b5164E3077E795J94936h7469j02896A84440a05891D090Q5009J96161B0578
$$ -25164 53077 5795 200731 -87469 -190365 184440 -105891 4090 89099 285260 20578
17329a26499B26490J54732e4340D01750G947K53637A13768m2699J72897L6039
$$ -126499 226490 381222 -54340 401750 7947 261584 113768 71069 243966 280005
17319B80005a83653C33603D5744N733J8735K90054j01887M5878A6620c6106C05724
$$ 280005 -183653 333603 45744 51477 70212 360266 258379 304257 16620 -36106 305724
17307B76644n428j11596A2491K29087J22217h3230h019E20035B11293J06606L3063
$$ 276644 271216 159620 12491 241578 363795 -83230 -8019 520035 211293 317899 350962
17296C50962L6808D5064J38979E1375J9387J10579e4671A75162G1855L9187m960
$$ 350962 387770 45064 184043 51375 70762 181341 -54671 175162 71855 111042 106082
17285A06082p741f2147J0313F445K44698c6621A35730C5472J64276M0623Q6307
$$ 106082 98341 -62147 -51834 6445 251143 -36621 135730 35472 199748 240371 326678
17274C26678H1118M0062J53223l2228A2872J20162L7889m3433K7196p0127K54784
$$ 326678 81118 121180 274403 242175 12872 133034 170923 127490 154686 84559 339343
17263C39343h8755A80012K47208B08090K39215N3145j59412A60416G6744K06599
$$ 339343 -88755 180012 427220 208090 447305 500450 341038 160416 76744 283343
17253B83343l2083E6692J86790L0427j32987J30236K81252B72238K74634j53430
$$ 283343 251260 56692 243482 273909 140922 271158 552410 272238 546872 393442
17243C93442e039A05589L2349N9099d7497n5116B64421j1786O3672O3858d9941
$$ 393442 -5039 105589 137938 197037 -47497 -102613 264421 252635 316307 380165 -49941
17231A17725J02577J54682l2290A19893E1241a65135E06043B32035E9025K58995
$$ 117725 220302 374984 342694 119893 51241 -165135 506043 232035 59025 318020
17221C18020q44A26219J52649K511p3964M99060B14883r7269K23230A13295L47518
$$ 318020 317176 126219 278868 281379 207415 706475 214883 117614 340844 113295 460813
17210D60813A01606J83916M3618j35525o6791J30689j9483J93770K4737k05060
$$ 460813 101606 285522 329140 193615 126824 257513 238030 431800 456537 251477
17200B51477L24415A00331M67439D8338K52130o0208P9347j53570l842N5438I6247
$$ 251477 575892 100331 567770 48338 300468 240260 319607 166037 162195 217633 96247
17188D16532I7295Q1193D7612K04731C6933P9388J54248m408K51048q4970j1093
$$ 416532 97295 178488 47612 252343 36933 116321 270569 266161 517209 432239 421146
17177D21146A71080K73028E4702L01718G0621K54895J53357l3477P4291j53239
$$ 421146 171080 444108 54702 356420 70621 325516 478873 445396 519687 366448
17167C66448J69686j28348r265j08448P8234N6618J80999A61600K54427A93160
$$ 366448 536134 407786 398521 290073 368307 424925 605924 161600 416027 193160
17156A04943D9039M36475j80486J26843P5470B40612F6486J30584p8842M0500
$$ 104943 49039 485514 305028 431871 507341 240612 66486 197070 118228 158728
17146A58728K60116j98238M26613j53322A50241b4573A55246K84890N6697B26499
$$ 158728 418844 220606 647219 493897 150241 -24573 155246 440136 496833 226499
17135D08497K07818k88514K02675j54123Q8814l1848B3890M35426j07676R3839
$$ 408497 616315 327801 530476 376353 465167 433319 23890 459316 351640 445479
17125D45479A2618O92203j1034B13411J61311J34147r4738n8363m4044k2554m3713
$$ 445479 12618 704821 693787 213411 374722 508869 414131 355768 311724 289170 245457
17114B45457K42857K05907k71112J34653R2000L0742A34388J41432I5795Q4330
$$ 245457 488314 694221 423109 557762 649762 680504 134388 275820 95795 180125
17104A80125K56530j99843L80521l5603K1196C01430M4194b2339D69360A74730
$$ 180125 436655 236812 617333 581730 602926 301430 345624 -22339 469360 174730
17093D55840C979N80484J66132k52518k1244D0425L34487J24307n9922R8404R5001
$$ 455840 3979 584463 750595 498077 476833 40425 374912 499219 439297 537701 632702
17082F32702k05033K0432k08097P0706M94442k08952j63804M6438r5763M7818
$$ 632702 427669 448101 240004 310710 805152 596200 432396 478834 383071 430889
17072D30889P4941p7793K22455k94681J22070K35865j26378K1276q8806M03K9337
$$ 430889 505830 428037 650492 355811 477881 713746 587368 608644 519838 520241 549578
17061E49578J47693k15879J88297j25981j80329K41141k89379J06025J42275j10928
$$ 549578 697271 481392 669689 543708 363379 604520 315141 421166 563441 452513
17051D52513K48034k34046j30462J97474r4454K28605n8347B27135m3394L58144
$$ 452513 700547 466501 336039 533513 439059 667664 609317 227135 183741 541885
17041E41885M1775j46095L2060k149J22876k5482J43139k03319j53880J62002
$$ 541885 583660 437565 469625 467476 590352 564870 708009 504690 350810 512812
17031E12812O9769q8356n3056O36480C51385J60511k19725K93341J65666K0303
$$ 512812 582581 494225 441169 1077649 351385 511896 292171 585512 751178 771481
17021G71481K89414E07368p1202K35377j67375L77186j57089J54790m055J32737
$$ 771481 1060895 507368 436166 671543 504168 881354 724265 879055 875000 1007737
17011A007737j98649o3322J33569N9820j90872o4546Q3966j9811L5921k8429r5642
$$ 1007737 809088 745766 879335 939155 748283 683737 767703 747892 783813 755384 659742
17000F59742j95472P35232l62146r0930L6675j1755l39203K60171J66908j64295
$$ 659742 464270 1199502 837356 746426 783101 771346 432143 692314 859222 694927
16990F94927n3512L84748j06578j10072r2957P9868L85924k70115R5599j85905
$$ 694927 641415 1026163 919585 809513 716556 796424 1182348 912233 1007832 821927
16980H21927N02486F34017L83029m25108K55686J84715n02964M89644m12205M24576
$$ 821927 1324413 634017 1017046 591938 847624 1032339 529375 1019019 606814 1031390
16970A031390n9856r7693K59052j56179n7649j66067L90669j62499J11534j22464
$$ 1031390 971534 873841 1132893 976714 919065 752998 1143667 981168 1092702 970238
16960I70238k04525j61613L86530k9700J79592M3669k0108k3974N1640L02982
$$ 970238 765713 604100 990630 960930 1140522 1184191 1164083 1140109 1191749 1494731
16950A494731m19931P0451N5400P430j76908N9423J11643j80327J7848N6274K35032
$$ 1494731 1074800 1145251 1200651 1208081 1031173 1090596 1202239 1021912 1039760 1096034 1331066
16939A331066J2466k36345j12125J75179K84712R4306k96569q9332k9933j7185
$$ 1331066 1343532 1107187 995062 1170241 1454953 1549259 1252690 1163358 1133425 1116240
16929A116240K03021K07723l45115J24289L81229l64576J46763J77161Q2697j27918
$$ 1116240 1319261 1526984 1181869 1306158 1687387 1322811 1469574 1646735 1729432 1601514
16919A601514k81033K03419J61266j49101K81120n7206j04663J01567J23791j19811
$$ 1601514 1320481 1523900 1685166 1536065 1817185 1759979 1655316 1756883 1880674 1760863
16909A760863k88868j6521L57751k85555J37144L30323L0949O4344l52441J36792
$$ 1760863 1471995 1455474 1813225 1527670 1664814 1995137 2026086 2090430 1737989 1874781
16899A874781K57577n77347K90650K54058l34204J24859L70452o31958N15116
$$ 1874781 2132358 1555011 1845661 2099719 1765515 1890374 2260826 1628868 2143984
16890B143984O3703N1442m15901M07288Q1504L496M4394k42266P7293K28523Q8507
$$ 2143984 2207687 2259129 1843228 2250516 2332020 2335516 2379910 2137644 2214937 2443460 2531967
16879B531967j6440k00402K20579j75938Q6937L30433q2100k12172Q1782j36739
$$ 2531967 2515527 2315125 2535704 2359766 2446703 2777136 2695036 2482864 2564646 2427907
16869B427907M92465K28980J74078n87693J41194o4206k8926K8781j25261K85007
$$ 2427907 2920372 3149352 3323430 2735737 2876931 2812725 2783799 2812580 2687319 2972326
16859B972326J3382J04316j92315N45726j44907K09840k15224P6444m3391J73008
$$ 2972326 2985708 3090024 2897709 3443435 3298528 3508368 3293144 3369588 3326197 3499205
16849C499205L01532j80910p7687M72494l15972N0412m2307K94851l0503J0948
$$ 3499205 3800737 3619827 3542140 4014634 3698662 3749074 3706767 4001618 3971115 3982063
16839C982063m9985L30806R5104O45p4149K90200l55717N1954R63591l51876R6788
$$ 3982063 3932078 4262884 4357988 4358633 4284484 4574684 4218967 4270921 5234512 4882636 4979424
16828D979424J45167K81274k49583n8491M79692m69110L98834M84699o10450K16081
$$ 4979424 5124591 5405865 5156282 5097791 5577483 5108373 5507207 5991906 5381456 5597537
16818E597537K21648M29807j13136l6262K21897K51213K56953J25255J34298K7190
$$ 5597537 5819185 6248992 6135856 6099594 6321491 6572704 6829657 6954912 7089210 7116400
16808G116400j68639M36031L75363R897R6284J79180L55736J31470L01936Q1313
$$ 7116400 6947761 7383792 7759155 7769052 7865336 8044516 8400252 8531722 8833658 8914971
16798H914971N44697l04053J35205M20330N27193J12408j12575O45947J77117
$$ 8914971 9459668 9155615 9290820 9711150 10238343 10350751 10238176 10884123 11061240
16789A1061240J86883K75503N93965K93896J00539M09277O11537J6394P57870
$$ 11061240 11248123 11523626 12117591 12411487 12512026 12921303 13532840 13549234 14307104
16780A4307104M97327R6444N56557O70435L06749O76947L74567O23811M40265
$$ 14307104 14804431 14900875 15457432 16127867 16434616 17111563 17486130 18109941 18550206
16771A8550206R03796M82270O65844P24853J056479N02795O42901O67045J418503
$$ 18550206 19454002 19936272 20602116 21326969 22383448 22886243 23529144 24196189 25614692
16762B5614692P29208J307674P66867J463604P39946J594997J372524J360213
$$ 25614692 26343900 27651574 28418441 29882045 30621991 32216988 33589512 34949725
16754C4949725J357392J856150J522077K261075J877748K060058J847943K456725
$$ 34949725 36307117 38163267 39685344 41946419 43824167 45884225 47732168 50188893
16746E0188893K672220K429375K714862L178747L087097L774000L722854L608537
$$ 50188893 52861113 55290488 58005350 61184097 64271194 68045194 71768048 75376585
16738G5376585M013875M652484M758533M868581N108324N589927N880641N953445
$$ 75376585 79390460 84042944 88801477 93670058 98778382 104368309 110248950 116202395
16730A16202395O296544O579738O479268O473115P099863O004075O527549N732671
$$ 116202395 122498939 129078677 135557945 142031060 149130923 155134998 161662547 167395218
16722A67395218N469956M993993L905595K760693K122638J197988j06342j136937
$$ 167395218 172865174 177859167 181764762 184525455 186648093 187846081 187739739 186602802
16714A86602802k596755l061923m018855n177883n282655o179574o119411p132858
$$ 186602802 184006047 180944124 176925269 171747386 166464731 160285157 154165746 147032888
16706A47032888o481570o677430o568638o625601o646131n715166n898072n668461
$$ 147032888 140551318 133873888 127305250 120679649 114033518 108318352 102420280 96751819
16698I6751819n276405m910273m744921m212085l911802m230057l621257l489073
$$ 96751819 91475414 86565141 81820220 77608135 73696333 69466276 65845019 62355946
16690F2355946l114841l265281k544967k735311k472567k536022j716002k180828
$$ 62355946 59241105 55975824 53430857 50695546 48222979 45686957 43970955 41790127
16682D1790127j820864k446158j373050j233125j530646j563765j077844j565173
$$ 41790127 39969263 37523105 36150055 34916930 33386284 31822519 30744675 29179502
16674B9179502j248578j126810p15677j222890n59602j153974r12785o77257p81600
$$ 29179502 27930924 26804114 26088437 24865547 24305945 23151971 22239186 21561929 20780329
16665B0780329p60947p11824p80069m24456o22728n58057j101692k44376l11514
$$ 20780329 20019382 19307558 18527489 18103033 17480305 16922248 15820556 15576180 15264666
16656A5264666k62023m53313k47163o84087m79980m43037j30459l52653p11662
$$ 15264666 15002643 14549330 14302167 13618080 13138100 12695063 12564604 12211951 11500289
16647A1500289j47615j62227m69899k66154l82340J4457n05483p8939p2272l93017
$$ 11500289 11352674 11190447 10720548 10454394 10072054 10086511 9581028 9502089 9429817 9036800
16637I036800l31422j13390O7449o18416J94198n27992n3560L3838m70804o8014
$$ 9036800 8705378 8591988 8659437 8041021 8235219 7707227 7653667 7687505 7216701 7148687
16627G148687N1219m40395k60700Q8880o79452L00830J4271k70133l894m08693
$$ 7148687 7199906 6759511 6498811 6587691 5908239 6209069 6223340 5953207 5949313 5540620
16617E540620K03561k10930K2105j71506k88525r5096l7488k01966R6120l61466
$$ 5540620 5744181 5533251 5555356 5383850 5095325 5000229 4962741 4760775 4856895 4495429
16607D495429N5644l83381N14134J5878j16897k95289J38337j59290N2235n19152
$$ 4495429 4551073 4167692 4681826 4697704 4580807 4285518 4423855 4264565 4316800 3797648
16597C797648N9554j10811o9567K49860l34678p5905J2006k84426J97500J98495
$$ 3797648 3857202 3746391 3676824 3926684 3592006 3516101 3528107 3243681 3441181 3639676
16587C639676m20580j25839J03267j47626j8629J73390j84278k84920J96426J2268
$$ 3639676 3219096 3093257 3196524 3048898 3030269 3203659 3019381 2734461 2930887 2943155
16577B943155l10591K51991j34532p7310J53547l5322j54658j8073o157m65577
$$ 2943155 2632564 2884555 2750023 2672713 2826260 2790938 2636280 2618207 2612050 2146473
16567B146473M13618r4120m0630q6667l5698m43878M26294k68561J82780j70783
$$ 2146473 2560091 2465971 2425341 2338674 2302976 1859098 2285392 2016831 2199611 2028828
16557B028828K53692k58393J18637r6123k91836M9918K18012K89793o59878M57726
$$ 2028828 2282520 2024127 2142764 2046641 1754805 1804723 2022735 2312528 1652650 2110376
16547B110376l53653R5080j20152J5693k6910j9835m3558K58826l37168k67887
$$ 2110376 1756723 1851803 1731651 1747344 1720434 1700599 1657041 1915867 1578699 1310812
16537A310812N05450k04448r9708J55425l58387O40473l88018l1745J12521k75891
$$ 1310812 1816262 1611814 1512106 1667531 1309144 1949617 1561599 1529854 1642375 1366484
16527A366484J21363J39705l63749l8391J48461k2046j45090J31887k56499J40804
$$ 1366484 1487847 1627552 1263803 1225412 1373873 1351827 1206737 1338624 1082125 1222929
16517A222929L43210k9394j62076m01992L91473m27117J37386N57849n35109n7568
$$ 1222929 1566139 1536745 1374669 972677 1364150 937033 1074419 1632268 1097159 1039591
16507A039591q5826K59012r2717K58977k58321M1867M5068J13942o0433k55875
$$ 1039591 953765 1212777 1120060 1379037 1120716 1162583 1207651 1321593 1261160 1005285
16497A005285K29474l87518Q7397J01111K2326n4032M4249L79427k02951k54865
$$ 1005285 1234759 847241 934638 1035749 1058075 1004043 1048292 1427719 1224768 969903
16487I69903J21253j69523O2556J5044l74202M58676j59357r0750m9640L91808
$$ 969903 1091156 921633 984189 999233 625031 1083707 924350 833600 783960 1175768
16477A175768k3297m81529J75588Q1804k89020O57637n38439n3294j91331M27166
$$ 1175768 1152471 670942 846530 928334 639314 1296951 758512 705218 513887 941053
16467I41053p5537p7039C56355M34303k66510q8097L90841k49505L80030j02598
$$ 941053 865516 788477 356355 790658 524148 436051 826892 577387 957417 854819
16457H54819O320p9307j7088K65734m96890J16239J61659j46097J29511C62924
$$ 854819 861139 781832 764744 1030478 533588 649827 811486 665389 794900 362924
16446G11592N37541n73814o2224J14609r60k30644J73339k49304M5043J30916
$$ 711592 1249133 675319 613095 727704 726744 496100 669439 420135 465178 596094
16436E96094Q5076l9006r2644L25792B69928L43621K02897j34525o4867J26727
$$ 596094 681170 642164 549520 875312 269928 613549 816446 681921 617054 743781
16426G43781l57389O1433j22113L21114J84295k83837O8268M5827C27997K60284
$$ 743781 386392 447825 325712 646826 831121 547284 615552 661379 327997 588281
16416E88281J3225p2422m9844J82670k03526L27379k15231j39790j78269J88219
$$ 588281 601506 529084 479240 661910 458384 785763 570532 430742 252473 440692
16406D40692Q4323j08446J56744j23984J60391J929B94023L11081k0192m5782
$$ 440692 525015 416569 573313 449329 609720 611649 294023 605104 584912 539130
16396E39130A87495K46335L51978C19501A36408L24067J41440k66699J15712J33625
$$ 539130 187495 433830 785808 319501 136408 460475 601915 335216 450928 584553
16386E84553k23144A5527N77339O9744k42532G4996O42236C36647j60141M40904
$$ 584553 361409 15527 592866 662610 420078 74996 717232 336647 176506 617410
16376F17410J0453J8410K0551I1735K0680K67844J33215r2141m9239O3825K1862
$$ 617410 627863 646273 666824 91735 112415 380259 513474 421333 372094 435919 457781
16365D57781j84207J74119j28817N8374L02867A81542R9209O9854p5020K43744
$$ 457781 273574 447693 318876 377250 680117 181542 280751 350605 275585 519329
16355E19329A58774K77591j57066p9876Q9297K45167j7777R113k32009A33627
$$ 519329 158774 436365 279299 199423 288720 533887 516110 525223 293214 133627
16344B69717J62516j88717J76450B5853J09122K95364A75252K2350G4611A7558
$$ 269717 432233 243516 419966 25853 134975 430339 175252 197602 74611 17558
16333B67502A29715K13552J9361A79790J05379J12311j95118G6790L22804f5448
$$ 267502 129715 343267 362628 179790 285169 397480 202362 76790 399594 -65448
16322D53601j84477j17279D3236A4584J96079m5033K15494k6930J46697D3248
$$ 453601 269124 151845 43236 14584 210663 165630 381124 354194 500891 43248
16311D07238K4610k7010j37569N7019J68552k18291J21924A92270J73542R5409
$$ 407238 431848 404838 267269 324288 492840 274549 396473 192270 365812 461221
16301D61221A31054C1561L85451j38686F0033J5722K26852l2212H3704J10846
$$ 461221 131054 31561 417012 278326 60033 75755 302607 270395 83704 194550
16291A94550J10519j09054E103J33533Q194K41018I7223L5777K5624G7459K32904
$$ 194550 305069 196015 5103 138636 146830 387848 97223 133000 158624 77459 310363
16280C10363L51024A10105n2787J47830a17791G2714K70998j00389K15061A72726
$$ 310363 661387 110105 57318 205148 -117791 72714 343712 243323 458384 172726
16269c6670E13496k40830n5358b1044C69823M5196A75618a69398A05042K0539
$$ -36670 513496 272666 217308 -21044 369823 415019 175618 -169398 105042 125581
16259A25581J929k5939K54855k2534G1204a32235d4395A61661J93821j09219N9487
$$ 125581 127510 101571 356426 333892 71204 -132235 -44395 161661 355482 246263 305750
16248C05750M0846G0299g8809A13003K6388F6029L0347L52345f0023A67672a44873
$$ 305750 346596 70299 -78809 113003 139391 66029 96376 448721 -60023 167672 -144873
16236I4198P7052K58292A68899M5096c1920H5434J64469F8810b99278D45014A55153
$$ 94198 171250 429542 168899 213995 -31920 85434 249903 68810 -299278 445014 155153
16224C14463a35129A45502J56104j18655b223B44722p7877A1774L05747k4014
$$ 314463 -135129 145502 301606 182951 -2223 244722 166845 11774 317521 293507
16214B93507K00066A66985m4046P4891e7719k8809J6931j85291a27053A2739a14689
$$ 293507 493573 166985 122939 197830 -57719 -86528 -69597 -254888 -127053 12739 -114689
16202a2107B05469o0172E1797K45402A8585L9173R4200r544L0968A5238M29209
$$ -12107 205469 145297 51797 297199 18585 57758 151958 142414 173382 15238 444447
16191D44447c9251A55751B5635K86960G9774J47329A872d4652j54452B09890J68526
$$ 444447 -39251 155751 25635 312595 79774 227103 1872 -44652 -199104 209890 378416
16180C78416I8086K15285j07290k0479j5270a4262A22135B4449c7901C05850C1352
$$ 378416 98086 313371 206081 185602 170332 -14262 122135 24449 -37901 305850 31352
16168A5506g3091C4358b36696A72800K89144c5253B41401A8177J75910j5565H7313
$$ 15506 -73091 34358 -236696 172800 461944 -35253 241401 18177 194087 178522 87313
16156b56073a27929B14126a04020A20213d41116e4952o4217B20390p6700a46036
$$ -256073 -127929 214126 -104020 120213 -441116 -54952 -119169 220390 143690 -146036
16145B47242K14376J6724k33494A08029D1445J19506O0133o0856h5876A26152
$$ 247242 461618 478342 244848 108029 41445 160951 221084 160228 -85876 126152
16134C44210b00150I6288A8969J45274A2830d2744A0994b62616O234A63942b09407
$$ 344210 -200150 96288 18969 164243 12830 -42744 10994 -262616 -256382 163942 -209407
16122A51971o9002J11586g7261C19890a15411E8377J21266b14183A01941J35176
$$ 151971 82969 194555 -77261 319890 -115411 58377 179643 -214183 101941 237117
16112B37117a05995d7302A48679n3770J38546e6006B97784a51067e6393A63258
$$ 237117 -105995 -47302 148679 94909 233455 -56006 297784 -151067 -56393 163258
16101B74226n844K9546D865J78635R1091q7765B555M20817A04225b43014H9338
$$ 274226 268382 297928 4865 183500 274591 186826 2555 423372 104225 -243014 89338
16089c92939F8591J54207G9058a64693B57252K8315d4057C910K75386A12888a19158
$$ -392939 68591 222798 79058 -164693 257252 285567 -44057 3910 279296 112888 -119158
16077b9151B98173j25160L1852a54575J3612A79267C3353a41731j49924B15761
$$ -29151 298173 173013 204865 -154575 -140963 179267 33353 -141731 -291655 215761
16066A29102a56597j57839e7320k23776B2540K85175F8524a55360D6750e692E7613
$$ 129102 -156597 -314436 -57320 -281096 22540 307715 68524 -155360 46750 -5692 57613
16054a57814P2646b7524k70452k249a47145A8283a15382L9185A43808J32769A14397
$$ -157814 -85168 -27524 -297976 -300225 -147145 18283 -115382 -76197 143808 276577 114397
16042a73684g4448K1201C0189a01152A33927m8864K58168I915L92983j86974D1815
$$ -173684 -74448 -53247 30189 -101152 133927 85063 343231 9915 402898 215924 41815
16030F8478K12591K8542A49721c05031J06687R8110G5137a18227H2927i6249A6173
$$ 68478 281069 309611 149721 -305031 -198344 -100234 75137 -118227 82927 -96249 16173
16018a5126a743j47244K4174j11247F7332P1832g1953H6696J7946J45423a76056
$$ -15126 -1743 -148987 -124813 -236060 67332 139164 -71953 86696 104642 250065 -176056
16006G1284k8534a21231C9925f6209A43326b18582a03182b6527A28600D0151N4808
$$ 71284 42750 -121231 39925 -66209 143326 -218582 -103182 -26527 128600 40151 94959
15995I4959b21629i6820H1479C1285b55285k8527a05243R35A06727b00781C00835
$$ 94959 -221629 -96820 81479 31285 -255285 -283812 -105243 -104308 106727 -200781 300835
15983B06826D2977M41191B29631a03659B73875A4723n79J76844H8761J21647a03959
$$ 206826 42977 484168 229631 -103659 273875 14723 14144 190988 88761 210408 -103959
15971c17330C52100j27019G4065B878K53094a09226j47020i6786d1249A64688
$$ -317330 352100 225081 74065 2878 255972 -109226 -256246 -96786 -41249 164688
15960a8988j30855B64613A27455a96624f1530j38218E002g2259j21633A21583
$$ -18988 -149843 264613 127455 -196624 -61530 -199748 5002 -72259 -193892 121583
15949a44041C92574a14330A1934i5137j5991j25390I0567R7826F5530L00713a83016
$$ -144041 392574 -114330 11934 -95137 -111128 -236518 90567 188393 65530 366243 -183016
15937B21107D8302J04371A9175E731e3901o0603j8957A60542N2938c8448j05306
$$ 221107 48302 152673 19175 5731 -53901 -114504 -133461 160542 213480 -38448 -143754
15926a43754C2295c2712O563l03341B57206a18973M8071r4239d1700F607J22735
$$ -143754 32295 -32712 -26149 -329490 257206 -118973 -70902 -165141 -41700 6607 129342
15915A29342a81039B96635i7179E7052J34563m0839k2816a78587A13173c4649
$$ 129342 -181039 296635 -97179 57052 191615 150776 127960 -178587 113173 -34649
15904a63148p4092A64561G5141a90661C8552j1067d5602j90077A73634J10187
$$ -163148 -237240 164561 75141 -190661 38552 27485 -45602 -235679 173634 283821
15894B83821B5692a41517I1992g2783A88710b56883B0969K4943a7919E3137b45650
$$ 283821 25692 -141517 91992 -72783 188710 -256883 20969 45912 -17919 53137 -245650
15882A5705K54501j32461J43386e5755C11601H3736R2621a05218N1695j58762
$$ 15705 270206 137745 281131 -55755 311601 83736 176357 -105218 -53523 -212285
15872b12285C66125b92143m7589B00012c40249J62441h1883B17683a48225A05538
$$ -212285 366125 -292143 -339732 200012 -340249 -177808 -81883 217683 -148225 105538
15861a40726F72571C35092O7525a81162A31760j968b04942J01700c3918F379Q5837
$$ -140726 672571 335092 402617 -181162 131760 129792 -204942 -103242 -33918 6379 92216
15850I2216a16379B11301n25c99579d9184B9136N9158c8222j30616A58795a71855
$$ 92216 -116379 211301 210776 -399579 -49184 29136 88294 -38222 -168838 158795 -171855
15838b24652A25088J6851F1556B9332a83942k08918J85081m1022d4322K46a7633
$$ -224652 125088 141939 61556 29332 -183942 -392860 -207779 -248801 -44322 -44076 -17633
15826B4981b16119l9681m4499b7053k03657D0815P750a08572d1599j5687l0922
$$ 24981 -216119 -255800 -300299 -27053 -230710 40815 48565 -108572 -41599 -57286 -88208
15815h8208A20325e6287J1262j53308A02667a35386A94296e04535C8084N6152
$$ -88208 120325 -56287 -45025 -198333 102667 -135386 194296 -504535 38084 94236
15805I4236a37981B41698f2155F4980e500A12196a9236k92143D8497R801b2482
$$ 94236 -137981 241698 -62155 64980 -5500 112196 -19236 -311379 48497 58298 -22482
15793f8123K8120m1570A55260j0260D2834K528a81650m2800K0672P4615b0505
$$ -68123 -40003 -81573 155260 145000 42834 45362 -181650 -224450 -203778 -129163 -20505
15781E7404Q7068g3214C02227G9114c38557M3231J45169C7584c58781J20276A62186
$$ 57404 144472 -73214 302227 79114 -338557 -295326 -150157 37584 -358781 -238505 162186
15769d06547P1859D9425a6876O57l38001H9416h6981B8575a52028C2650A3907
$$ -406547 -334688 49425 -16876 -16219 -354220 89416 -86981 28575 -152028 32650 13907
15757B24706C448c88536B2025c09149B22966F9838Q0908n9029d9121j12120m0869
$$ 224706 3448 -388536 22025 -309149 222966 69838 150746 91717 -49121 -161241 -202110
15746b02110E3032K9705k6818M2647b26724A09828a32163k3733k2613Q1275o7098
$$ -202110 53032 82737 55919 98566 -226724 109828 -132163 -155896 -178509 -97234 -164332
15735a64332g3959k707G9046e0000j75224c4671l2348o9424A38966c3327o3606
$$ -164332 -73959 -76666 79046 -50000 -225224 -34671 -67019 -136443 138966 -33327 -96933
15724i6933j84670d5399l20355I7429f6278j38530G7255j9860c46487L2460g2086
$$ -96933 -281603 -45399 -365754 97429 -66278 -204808 77255 57395 -346487 -314027 -72086
15712b77932i5008E72b32071M8194g941H182K07212i8474B46760a00056l1954
$$ -277932 -95008 572 -232071 -183877 -7941 8182 215394 -98474 246760 -100056 -132010
15701a32010G7314l5326a70972D6165a10153L5704B37401c7602a7274j23944A27062
$$ -132010 77314 41988 -170972 46165 -110153 -74449 237401 -37602 -17274 -141218 127062
15689f2528j67191A06737d6461A51676i1425B7290q152J04954B5302a8989o8492
$$ -62528 -229719 106737 -46461 151676 -91425 27290 19138 124092 25302 -18989 -87481
15678h7481m04193B5781b74170e8632B41786E2603a35134C35086f5957a6193B25919
$$ -87481 -491674 25781 -274170 -58632 241786 52603 -135134 335086 -65957 -16193 225919
15666a62828R467p6121l2908m6538B08417a2823r54C66439A41622o1683a44305
$$ -162828 -153361 -229482 -262390 -308928 208417 -12823 -13777 366439 141622 79939 -144305
15654c4740A42051h0996c829A45029a09757I0746a15595A06547f8618G872a54743
$$ -34740 142051 -80996 -3829 145029 -109757 90746 -115595 106547 -68618 7872 -154743
15642a60127A31453a52017j76075a34850E5888J31538E4516a1623j28031D4948
$$ -160127 131453 -152017 -328092 -134850 55888 187426 54516 -11623 -139654 44948
15631A22853J89471A04819L4653b15704C52105h3354r7H4795J35022F8796L2795
$$ 122853 312324 104819 139472 -215704 352105 -83354 -83451 84795 219817 68796 101591
15620A01591h5309A08864a70762A16593a31016L4967A52686G2561B085K8197g5408
$$ 101591 -85309 108864 -170762 116593 -131016 -96049 152686 72561 2085 30282 -75408
15608a72223h4180e812l7157j42410E4753a49615E9904e6339o3540B82138a87167
$$ -172223 -84180 -5812 -42969 -185379 54753 -149615 59904 -56339 -119879 282138 -187167
15596A52248O7175a03656A36001a67249D753E05d41461D0479K72878A14345J0707
$$ 152248 219423 -103656 136001 -167249 4753 505 -441461 40479 313357 114345 125052
15585A25052b50982O0118A16874a80441B95902b82054A26016J18166j08985J8660
$$ 125052 -250982 -190864 116874 -180441 295902 -282054 126016 244182 135197 153857
15575A53857E7387K807Q4833i8815l29361a50338B7198b85816D44067F6682d4093
$$ 153857 57387 60194 145027 -98815 -428176 -150338 27198 -285816 444067 66682 -44093
15563H1025b45017C64798F721K17095j11065a83847j11098B66024a1332D0165
$$ 81025 -245017 364798 6721 223816 112751 -183847 -294945 266024 -11332 40165
15552I691R9232I923f0395j13916A44339B008f1455A41550a97067i3525j92603
$$ 9691 108923 9923 -60395 -174311 144339 2008 -61455 141550 -197067 -93525 -286128
15541b86128P6044O2097a3315H5931b24485a5772B41677b2649b224j05302j22070
$$ -286128 -210084 -147987 -13315 85931 -224485 -15772 241677 -22649 -2224 -107526 -229596
15530b29596L0493j34234C6272c32456A8592J5833a9746A21162l4349g50B35622
$$ -229596 -199103 -333337 36272 -332456 18592 34425 -19746 121162 86813 -750 235622
15518a5314n7050k1366d3716A86759a75939B72019j25680o139f2353G5668a50778
$$ -15314 -72364 -93730 -43716 186759 -175939 272019 146339 140200 -62353 75668 -150778
15506h8751A95278r320q1153B291g8524C09106a0081k45596j3145D9901K32816
$$ -88751 195278 185958 104805 2291 -78524 309106 -10081 -255677 -268822 49901 282717
15495B82717D0402c82046d4763A29637Q4435I3862a72353j12317p4642A24991
$$ 282717 40402 -382046 -44763 129637 214072 93862 -172353 -284670 -359312 124991
15484b59969a492n8229n17A6313a03404c7517n2960q404G7943J95081M5589H7005
$$ -259969 -1492 -59721 -60238 16313 -103404 -37517 -90477 -98881 77943 273024 318613 87005
15471a75691C9320b31648F2243p393B4667a00677B4681J64524F1228a10336I7253
$$ -175691 39320 -231648 62243 54850 24667 -100677 24681 189205 61228 -110336 97253
15459A05819K68779D0577R8870D7248G548h4247A94142h1494n5554F8766g0030
$$ 105819 374598 40577 139447 47248 7548 -84247 194142 -81494 -137048 68766 -70030
15447a97874G7800f5550D5933R6313h7451J0547j72988f1019j53621L6953D857
$$ -197874 77800 -65550 45933 142246 -87451 -76904 -249892 -61019 -214640 -177687 4857
15435A59145L5674a2384B0583b4659A7601K11681b33027j9704h7233C0742J79875
$$ 159145 194819 -12384 20583 -24659 17601 229282 -233027 -252731 -87233 30742 210617
15424B10617e2231J7274A73312H6549P33b05531e9862k3757k71246B1739Q2519
$$ 210617 -52231 -34957 173312 86549 87282 -205531 -59862 -83619 -354865 21739 104258
15413A04258b26266C63580h0489p0174l8946A18326a91248C21627b38616B04699
$$ 104258 -226266 363580 -80489 -150663 -189609 118326 -191248 321627 -238616 204699
15402A53128F7814L0413b5875C99634c60053d2219F2566L4549g0880J8224l7155
$$ 153128 67814 98227 -25875 399634 -360053 -42219 62566 97115 -70880 -52656 -89811
15391h9811G0854b26345L0378o8752A14666O8191L577L0477a57374C93273a30910
$$ -89811 70854 -226345 -195967 -264719 114666 182857 186434 216911 -157374 393273 -130910
15379C33541b6444r9406n7656A02057F236a05362A93198b35990a15181a8298A12601
$$ 333541 -26444 -125850 -183506 102057 6236 -105362 193198 -235990 -115181 -18298 112601
15367a76478B24857b17375I5063c1393E1306Q9936a37571A20261a32551A5656
$$ -176478 224857 -217375 95063 -31393 51306 141242 -137571 120261 -132551 15656
15356b8440H2369h7270q6978A15562a42789C06373A8797a61330F2000J7623a10649
$$ -28440 82369 -87270 -174248 115562 -142789 306373 18797 -161330 62000 79623 -110649
15344C85629a23625b765r4001L1987D06578A54207A0939a65834j7770A71277n8437
$$ 385629 -123625 -2765 -96766 -64779 406578 154207 10939 -165834 -183604 171277 112840
15333A12840e4676C01005I5140a23037A93837l4202f1771k56258C74271j78130
$$ 112840 -54676 301005 95140 -123037 193837 159635 -61771 -318029 374271 196141
15323A96141I070a78971K7952O5201I2640B4661J69478a19920B179a85408J6830
$$ 196141 9070 -178971 -151019 -85818 92640 24661 194139 -119920 2179 -185408 -168578
15312a68578c6143I5468A2726O3791L6893g542A42274f1317j06877D0017N5740
$$ -168578 -36143 95468 12726 76517 113410 -7542 142274 -61317 -168194 40017 95757
15301I5757J71958j30439d8798r9171f5746B24401q3599o4617J09356a01I8752
$$ 95757 267715 137276 -48798 -147969 -65746 224401 140802 76185 185541 -101 98752
15289a6011A27442c2784D6322J26122J84354e0660n8510A74040b45391B16010
$$ -16011 127442 -32784 46322 172444 356798 -50660 -109170 174040 -245391 216010
15278A10739E3401a3673j11574F2879P8508E3040a16523e39j16018j95759A72966
$$ 110739 53401 -13673 -125247 62879 141387 53040 -116523 -539 -116557 -312316 172966
15266d376A13465M28525b15173D88638A93158r2371J95691b5578A76025C2790
$$ -4376 113465 541990 -215173 488638 193158 100787 296478 -25578 176025 32790
15255C44542o703j00909E9410j0169L55891J12976N57912j2230j46429L92402
$$ 344542 337839 236930 59410 49241 405132 518108 1076020 1063790 917361 1309763
15245A309763E72044j07708E4583k4079J77437a27997A63042M571R4881j19020
$$ 1309763 572044 464336 54583 30504 207941 -127997 163042 167613 262494 143474
15235A43474J91457q4459p9809g8693C14720f9888A16499R6043F9522p415Q4923
$$ 143474 334931 250472 170663 -78693 314720 -69888 116499 212542 69522 62107 147030
15224A47030Q5290i7193d5642j60399g454C00948r7003B4189a47614A89298c34671
$$ 147030 232320 -97193 -45642 -206041 -7454 300948 203945 24189 -147614 189298 -334671
15212I3910m3230J39589J2795b8472A91052K61327f914A17356n4982O5567c2152
$$ 93910 50680 190269 203064 -28472 191052 452379 -6914 117356 62374 127941 -32152
15200b92157n6518d8330a1786A11750k207L43500b03948C4585J70961d0179k1030
$$ -292157 -348675 -48330 -11786 111750 109543 453043 -203948 34585 205546 -40179 -61209
15189f1209A40657J05865I0146J34564a31248E0161K09258R4516g1417j99i998
$$ -61209 140657 246522 90146 224710 -131248 50161 259419 353935 -71417 -71616 -9998
15177I2350J07293g194A40378P5172a4722C11800E0453J82027j2165p5014J28276
$$ 92350 199643 -7194 140378 215550 -14722 311800 50453 232480 220315 145301 273577
15166B73577H790P6981J31866a58040B03472k0424R056F5639J18885i4807L8858
$$ 273577 8790 85771 217637 -158040 203472 183048 192104 65639 184524 -94807 -55949
15155e5949j0024A47806M5790f5621A93471d6919I7982i4198I7966r825h7770
$$ -55949 -65973 147806 193596 -65621 193471 -46919 97982 -94198 97966 88141 -87770
15143a4544C19265Q5745j86641J03406C3186J68543b2397A4390L32901M5408b83725
$$ -14544 319265 405010 218369 321775 33186 201729 -22397 14390 347291 392699 -283725
15131A87423J44156j36889R176D6781K20443k7122b7929m8559A0375m315J3471
$$ 187423 331579 194690 203866 46781 267224 240102 -27929 -76488 10375 6060 19531
15120A9531a17512j17237A96449E8857R9328n1417d4925A82347p0162k3841J00482
$$ 19531 -117512 -234749 196449 58857 158185 106768 -44925 182347 112185 88344 188826
15109A88826H5489J33041p193p5976a6602A34813n2935J16812E3638j9632K13529
$$ 188826 85489 218530 211337 135361 -16602 134813 81878 198690 53638 34006 247535
15098B47535O0782A32000J06445j9411K15790A71207R4194j26719L6283n8462
$$ 247535 308317 132000 238445 219034 434824 171207 265401 138682 174965 116503
15088A16503A8306N12600c2693C9994J98818l0242f2793A64933o4151g9889C60081
$$ 116503 18306 530906 -32693 39994 238812 208570 -62793 164933 100782 -79889 360081
15076A69059J0154A7879J3584O6247a33885I8175J07575E8315J79773P0989L7113
$$ 169059 179213 17879 31463 97710 -133885 98175 205750 58315 238088 309077 346190
15065C46190j42723k5099a19809D31926j7732A34330j6104J90221a344B18756
$$ 346190 203467 178368 -119809 431926 414194 134330 118226 308447 -1344 218756
15054D37951j22482a1344B15188j922n7038E231K42300a87293C41821m3644G6875
$$ 437951 315469 -11344 215188 213266 156228 5231 247531 -187293 341821 298177 76875
15042B10720A8435M51408A55959R7362d5770D08091a79633A44329M1260M0771
$$ 210720 18435 469843 155959 253321 -45770 408091 -179633 144329 185589 226360
15032B26360b1570j99471b8527C10178J51859q4706A26574j664K97485B3574J3501
$$ 226360 -21570 -221041 -28527 310178 462037 377331 126574 124910 422395 23574 37075
15021C7075M55571k17234J81610k25073a1757D49324b44316C04526K12566l5753
$$ 37075 492646 275412 457022 231949 -11757 449324 -244316 304526 517092 481339
15011D81339B16034l1149N31259G6327a57633C02357j42510J81428F7343K22524
$$ 481339 216034 184885 716144 76327 -157633 302357 159847 341275 67343 289867
15001B89867a15920A64118a54014C72631j29125D1276K60748m6702H9378J85573
$$ 289867 -115920 164118 -154014 372631 243506 41276 302024 255322 89378 274951
14991B74951e6814B05303O6341o4522K594J6791K56603k18112J09162A35146o7214
$$ 274951 -56814 205303 271644 207122 209716 226507 483110 264998 374160 135146 67932
14980F7932j6733N6963A3203A819g7090a2299B56747K91887a77143D62312j20920
$$ 67932 51199 108162 13203 1819 -77090 -12299 256747 548634 -177143 462312 341392
14969C41392j42315r9183K00535P6999J14773j08829b325A08736M5913G1802k5703
$$ 341392 199077 99894 300429 377428 492201 383372 -2325 108736 154649 71802 46099
14958D6099J61468q71J90018A134L8050f724B99399J93126j58563J67043q1274
$$ 46099 207567 206696 396714 1134 39184 -6724 299399 492525 333962 501005 419731
14947D19731a52051B16878K40115A81302R0614p2716F4526L91955F8571M94184
$$ 419731 -152051 216878 456993 181302 271916 199200 64526 456481 68571 562755
14937E62755j88765p7463J13427Q9999N4098k43848J52248l0340J14769j46287
$$ 562755 373990 296527 409954 499953 554051 310203 462451 432111 546880 400593
14927D00593r4050e2151D45120J8816j60978A36445J47468A39728K93799j85727
$$ 400593 306543 -52151 445120 463936 302958 136445 283913 139728 433527 247800
14917B47800K07594E5560L47290j80718M66789j94601A44836L64678J68160A83906
$$ 247800 455394 55560 402850 222132 688921 494320 144836 509514 677674 183906
14906D40104J94958A77009J68388J54788K53806C36869r9351K4777L90157C11473
$$ 440104 635062 177009 345397 500185 753991 336869 237518 262295 652452 311473
14895D61164J33442k54458J01331n9349K57717k82402D1228g8649E31454G3618
$$ 461164 594606 340148 441479 382130 639847 357445 41228 -78649 531454 73618
14884D66732p3083j39386L06292j89836j04682L3599J77162p0896O6331J0527
$$ 466732 393649 254263 560555 370719 266037 299636 476798 405902 472233 482760
14874D82760r5303K00652j87036j75990K12687K6280K0306j19729P7185O3466
$$ 482760 387457 588109 401073 225083 437770 464050 484356 364627 441812 505278
14864E05278j35853j23072o5802L03043K27702H8989J8098L18264p9620K20335
$$ 505278 369425 246353 180551 483594 711296 88989 107087 425351 345731 566066
14854E66066q0736L8014k19626M05457P1605l05503o868o6588J97893j76228K38520
$$ 566066 485330 523344 303718 709175 780780 475277 468409 401821 599714 423486 662006
14843F62006A22063N31635B41640K91170k8196j04935L21419k47403j07824L08104
$$ 662006 122063 653698 241640 532810 504614 399679 721098 473695 365871 673975
14833F73975m8431j99121K24287k70788q3097L75994q3257K7739r9617j36783
$$ 673975 625544 426423 650710 379922 296825 672819 589562 617301 517684 380901
14823C80901Q0685J07740K1255A63434K34613J54648O1745k90067K73011j90246
$$ 380901 461586 569326 590581 163434 398047 552695 614440 324373 597384 407138
14813D07138L0363j1093o8064j36232N76004C85748J24670B46067M96046k4079
$$ 407138 437501 426408 358344 222112 798116 385748 510418 246067 742113 718034
14803G18034k87070J58934B64283L3440q2585L55833B35868N48597l40949L8433
$$ 718034 430964 589898 264283 297723 215138 570971 235868 784465 443516 481949
14793D81949Q2784q2324J95744J37412j5400k72450O16j25243P7166l2390M20209
$$ 481949 564733 482409 678153 815565 800165 527715 528331 403088 480254 447864 868073
14782H68073k48742L08045j51848j13915j69693k9527K09875J85490j69375j15163
$$ 868073 619331 927376 775528 661613 491920 462393 672268 857758 688383 573220
14772E73220j2128K25564k69880M14305m13726K09550j24811J79816k59365J02541
$$ 573220 561092 786656 516776 931081 517355 726905 602094 781910 522545 625086
14762F25086j49895M84159k89879o6983j36892K04800j55361j45688K70935K46405
$$ 625086 475191 959350 669471 602488 465596 670396 515035 369347 640282 886687
14752H86687j39470j40195K97935l62382L78170j09676j93285N1819J10556k38154
$$ 886687 747217 607022 904957 542575 920745 811069 617784 669603 780159 542005
14742E42005K99499k7258n21K55693l88919L66072k82474j37616J66411K41140
$$ 542005 841504 814246 813725 1069418 680499 1046571 764097 626481 792892 1034032
14732A034032l56888N474K52501l60433L76229n1174n4271n4828j30344K1782
$$ 1034032 677144 682618 935119 574686 950915 899741 845470 790642 660298 682080
14722F82080P1706O8100L10877n57985L10778m5747K64193E08586J64961J17165
$$ 682080 753786 821886 1132763 574778 885556 839809 1104002 508586 673547 790712
14712G90712J04859J29448k1461j31553k8267J62228j93346J67848k47073k02201
$$ 790712 895571 1025019 1003558 872005 843738 1005966 812620 980468 733395 531194
14702E31194L63773m3423K88045r3097j04153M0638k17020J25733K30609j40794
$$ 531194 894967 851544 1139589 1046492 942339 982977 765957 891690 1122299 981505
14692I81505L40J55306k59522J05267J12406L8090l87883K53073j10701J68799
$$ 981505 981845 1137151 877629 982896 1095302 1133392 745509 998582 887881 1056680
14682A056680l8065J23620j76807m6862J64903M3531k17983j5656J87760j77317
$$ 1056680 1018615 1142235 965428 918566 1083469 1127000 909017 893361 1081121 903804
14672I03804N2756K90891m55563j11782L40400m146K08463k96630L42262J88005
$$ 903804 956560 1247451 791888 680106 1020506 1016360 1224823 928193 1270455 1458460
14662A458460k38948q0163j75008M55846j29812J56336j53134R2353m23339J95907
$$ 1458460 1219512 1139349 964341 1420187 1290375 1446711 1293577 1385930 962591 1158498
14652A158498m14220L76220J26341r974j15396O660M0918N61147n65091L03961
$$ 1158498 744278 1120498 1246839 1236865 1121469 1128129 1169047 1730194 1165103 1469064
14642A469064k08320J86075j704K59226q14497L71775L49394m81357L12965j99714
$$ 1469064 1260744 1446819 1445115 1704341 889844 1261619 1611013 1129656 1442621 1242907
14632A242907Q38K19709l43981R7852R6089j09749o8914M50993k47924J60136
$$ 1242907 1243745 1463454 1119473 1217325 1313414 1203665 1134751 1585744 1337820 1497956
14622A497956L20655k05519j70930K60790k71016K40075j5647N902j79410R2475
$$ 1497956 1818611 1613092 1442162 1702952 1431936 1672011 1656364 1662266 1482856 1575331
14612A575331j69442K64415o3332j9574J91057j32170R6251k32473k5701r9908
$$ 1575331 1405889 1670304 1606972 1587398 1778455 1646285 1742536 1510063 1484362 1384454
14602A384454L87687j54849j17033L96758k93766M67368m30223J96238K39096
$$ 1384454 1772141 1617292 1500259 1897017 1603251 2070619 1640396 1836634 2075730
14593B075730l2245l42056K18194j49725Q3251K8853M859J6515J20236J67587
$$ 2075730 2043485 1701429 1919623 1769898 1853149 1882002 1886861 1903376 2023612 2191199
14583B191199j67177k97729L16061L10585j18142m24661M99059K8508k02525K78939
$$ 2191199 2024022 1726293 2042354 2352939 2234797 1810136 2309195 2337703 2135178 2414117
14573B414117k33952q3595q0900K2919K82672j06027K87696J85952n9226j29494
$$ 2414117 2180165 2096570 2015670 2038589 2321261 2215234 2502930 2688882 2629656 2500162
14563B500162L26148J50499l39839K98445j0588K94067M6643J57625K94061m52860
$$ 2500162 2826310 2976809 2636970 2935415 2924827 3218894 3265537 3423162 3717223 3264363
14553C264363P68076J5556Q39836M67905J653061M182247Q161028J7223341J4923834
$$ 3264363 4032439 4047995 4887831 5355736 7008797 11191044 19352072 36575413 51499247
14544E1499247k5306233A0825609m951339k076520j204850m60755l45535N35078
$$ 51499247 26193014 10825609 5874270 3797750 2592900 2132145 1786610 2321688
14536B321688l39119J23503J50978p9507J14047l67070K39968N1261l1395K45738
$$ 2321688 1982569 2106072 2257050 2177543 2291590 1924520 2164488 2215749 2184354 2430092
14526B430092K66043m47076P6147M86979l39156l7059M07240m17193N12424o7309
$$ 2430092 2696135 2249059 2325206 2812185 2473029 2435970 2843210 2426017 2938441 2871132
14516B871132k4736k83814J4120r3219O66811k86657M789M16928m73716r972M43200
$$ 2871132 2846396 2562582 2576702 2483483 3150294 2863637 2868426 3285354 2811638 2801666 3244866
14505C244866j8208m10701J19463J58263J73228J18496p0458k27333L83930J35748
$$ 3244866 3226658 2815957 2935420 3093683 3266911 3385407 3314949 3087616 3471546 3607294
14495C607294m55250K88159j99141O33321k04456j2972J64770j0337j81293J93376
$$ 3607294 3152044 3440203 3241062 3874383 3669927 3656955 3821725 3811388 3630095 3823471
14485C823471L7161Q9122J00428p7152M5192j04235J95642m5262J97162r6807
$$ 3823471 3860632 3949754 4050182 3973030 4018222 3913987 4109629 4064367 4261529 4164722
14475D164722K63845J51970K9441k26398L48530p8858K9396K37516k58760L12086
$$ 4164722 4428567 4580537 4609978 4383580 4732110 4653252 4682648 4920164 4661404 4973490
14465D973490j2963j34743M60575k70868n004O28462m51217J6137m77240Q53035
$$ 4973490 4960527 4825784 5286359 5015491 5010487 5638949 5187732 5203869 4726629 5579664
14455E579664J13973j08109j68520K47412L03217J04798j99013M3989L84351j04823
$$ 5579664 5693637 5585528 5417008 5664420 5967637 6072435 5873422 5917411 6301762 6196939
14445F196939l09031K73227k47874K90874L51438m5094K64622n27935K15894K98327
$$ 6196939 5887908 6161135 5913261 6204135 6555573 6510479 6775101 6247166 6463060 6761387
14435F761387R5972J74426K26557O2229p1781L60194m30690L14452J49491o8270
$$ 6761387 6857359 7031785 7258342 7320571 7248790 7608984 7178294 7492746 7642237 7573967
14425G573967J96596J86871K29630K75527J35540k70655L59668k32594N51947
$$ 7573967 7770563 7957434 8187064 8462591 8598131 8327476 8687144 8454550 9006497
14416I006497J6254K29489k7865K62965j30411K38957n3434J48447j0366N67028
$$ 9006497 9022751 9252240 9224375 9487340 9356929 9595886 9542452 9690899 9680533 10247561
14406A0247561j19658M87361L33257j96315J30476J79491n494J97623L96326K36291
$$ 10247561 10127903 10615264 10948521 10752206 10882682 11062173 11056679 11254302 11650628 11886919
14396A1886919j23845M65352K16347J18603M60054r788p3894M67189L89931M60073
$$ 11886919 11763074 12228426 12444773 12563376 13023430 13013642 12939748 13406937 13796868 14256941
14386A4256941k96870K47717L98825O44039J77496j5233M52005K73676L83918
$$ 14256941 13960071 14207788 14606613 15250652 15428148 15412915 15864920 16138596 16522514
14377A6522514J92381K8179J94854L39843L74889O15311K73507N54115K49953
$$ 16522514 16714895 16743074 16937928 17277771 17652660 18267971 18541478 19095593 19345546
14368A9345546K98956M48740L36519L30896O49264O22608L26425M16857M59709
$$ 19345546 19644502 20093242 20429761 20760657 21409921 22032529 22358954 22775811 23235520
14359B3235520O92281L36555N25243J031678M80027K47546P27586P69313N88313
$$ 23235520 23927801 24264356 24789599 25821277 26301304 26548850 27276436 28045749 28634062
14350B8634062P81613O81760Q53574L69867J049142Q61865Q55304Q60236J059088
$$ 28634062 29415675 30097435 30951009 31320876 32370018 33231883 34087187 34947423 36006511
14341C6006511P35749J233788R20021J223578J301790O59895J278356J151801
$$ 36006511 36742260 37976048 38896069 40119647 41421437 42081332 43359688 44511489
14333D4511489J536498J260527J704853J602058J367470J661560J808843J972376
$$ 44511489 46047987 47308514 49013367 50615425 51982895 53644455 55453298 57425674
14325E7425674J946979J794473K248888K187240K183757K479314K508069K130989
$$ 57425674 59372653 61167126 63416014 65603254 67787011 70266325 72774394 74905383
14317G4905383L300866K800118L033519L032127L760749L562290L833253M025682
$$ 74905383 78206249 81006367 84039886 87072013 90832762 94395052 98228305 102253987
14309A02253987M105817M534493M970388M982245N313153O000647N684964O375219
$$ 102253987 106359804 110894297 115864685 120846930 126160083 132160730 137845694 144220913
14301A44220913O475681P047747P856763Q105360Q579668Q854533R534160R702770
$$ 144220913 150696594 157744341 165601104 173706464 182286132 191140665 200674825 210377595
14293B10377595J0656436J1071677J1796597J2157045J2944157J3389683J4071440
$$ 210377595 221034031 232105708 243902305 256059350 269003507 282393190 296464630
14286B96464630J4041324J4830055J5134568J4936110J5016995J5273685J5081571
$$ 296464630 310505954 325336009 340470577 355406687 370423682 385697367 400778938
14279D00778938J4580232J3224172J2658401J1222367R428977P751104M658476
$$ 400778938 415359170 428583342 441241743 452464110 461893087 469644191 474302667
14272D74302667Q38917k011919k035606k745908m813227o424051q124326r363025
$$ 474302667 475141584 473129665 471094059 468348151 463534924 457110873 448986547 439623522
14264D39623522j0255279j2378484j3408220j4634460j5254072j5603396j5746913
$$ 439623522 429368243 416989759 403581539 388947079 373693007 358089611 342342698
14257C42342698j5830123j4666382j4592085j4474742j3699767j2968288j2940507
$$ 342342698 326512575 311846193 297254108 282779366 269079599 256111311 243170804
14250B43170804j2042844j1387742j0726835r931507r660234r185498p964216
$$ 243170804 231127960 219740218 209013383 199081876 189421642 180236144 172271928
14243A72271928q390644p551545p192633o817646o624403n425187n371454n248277
$$ 172271928 163881284 156329739 149137106 142319460 135695057 130269870 124898416 119650139
14235A19650139n464801m820545m631642l995424l584279l423319l991056l791927
$$ 119650139 114185338 109364793 104733151 100737727 97153448 93730129 89739073 85947146
14227H5947146k859133l395750k845615k747882k142278l218397k308651j702373
$$ 85947146 83088013 79692263 76846648 74098766 71956488 68738091 66429440 64727067
14219F4727067k587539j935625k190916j562037j625118j933574j146214j471807
$$ 64727067 62139528 60203903 58012987 56450950 54825832 52892258 51746044 50274237
14211E0274237j860304j358510j278565j457025o69604j305297j173502j416783
$$ 50274237 48413933 47055423 45776858 44319833 43650229 42344932 41171430 39754647
14203C9754647r85789j397419q81425n54529j001627j014936q99160j309505n95391
$$ 39754647 38768858 37371439 36490014 35935485 34933858 33918922 33019762 31710257 31114866
14194C1114866n14018p81754n32082q56255m72580j006653l66584m36455r01193
$$ 31114866 30600848 29819094 29287012 28430757 27958177 26951524 26584940 26148485 25247292
14185B5247292m58841j131412j23719o56277k03501l94382p54982k80658m17162
$$ 25247292 24788451 23657039 23533320 22877043 22673542 22279160 21524178 21243520 20826358
14176B0826358k46489n77035o1627p29330o06709n33151o1993j45754o78113N0246
$$ 20826358 20579869 20002834 19941207 19211877 18605168 18072017 18010024 17864270 17186157 17236403
14166A7236403m13939m53245k9054n78903n56048O8025j42024l87514j30528l06734
$$ 17236403 16822464 16369219 16340165 15761262 15205214 15273239 15131215 14743701 14613173 14306439
14156A4306439l99365O7141l23783k17695l90400N2970m68876k5291k95674k09144
$$ 14306439 13907074 13974215 13650432 13432737 13042337 13095307 12626431 12601140 12305466 12096322
14146A2096322j24127j77180l05816K3322n71528j98333r8310K20153k23465k45174
$$ 12096322 11972195 11795015 11489199 11512521 10940993 10742660 10644350 10864503 10641038 10395864
14136A0395864j77345j3001m68853J34722m60386M45229p63506M09219k00966
$$ 10395864 10218519 10205518 9736665 9871387 9411001 9856230 9092724 9501943 9300977
14127I300977j84080n31452q5000L53480m96015j65500r6219m16103L45683J01557
$$ 9300977 9116897 8585445 8500445 8853925 8357910 8192410 8096191 7680088 8025771 8127328
14117H127328l50570k53256N2879k06913k84468N733J26928L82322p13791J37681
$$ 8127328 7776758 7523502 7576381 7369468 7085000 7090733 7217661 7599983 6886192 7023873
14107G023873L3418k92289J7236O7920l51520J21822k2426l13614r9964p7678
$$ 7023873 7057291 6765002 6782238 6850158 6498638 6620460 6598034 6284420 6184456 6106778
14097F106778O7516k22856J1752j75315k7879M5713j2307l98021M38923j56423
$$ 6106778 6174294 5951438 5963190 5787875 5759996 5805709 5793402 5395381 5834304 5677881
14087E677881k25649k34204M9289p4560k38535M00944k02049J01255k03093l79216
$$ 5677881 5452232 5218028 5267317 5192757 4954222 5355166 5153117 5254372 5051279 4672063
14077D672063M29514k11574p2472N8526k74250o413J25921p92257N56087k02570
$$ 4672063 5101577 4890003 4817531 4876057 4601807 4595394 4721315 3929058 4485145 4282575
14067D282575L84246j25150l24920l9287J66535q9256k336j2194n9429M32227
$$ 4282575 4666821 4541671 4216751 4177464 4343999 4254743 4252407 4240213 4180784 4613011
14057D613011k02821m81908r6964j0848L55313k82217p1400k68967L06831j11063
$$ 4613011 4410190 3928282 3831318 3820470 4175783 3893566 3822166 3553199 3860030 3748967
14047C748967k86960K49650k03722k4737J99990J08445k57323m7806j51414r3568
$$ 3748967 3462007 3711657 3507935 3483198 3683188 3791633 3534310 3486504 3335090 3241522
14037C241522K04093k1005l97529O3643L81262l19208J31523j89147J41072m8775
$$ 3241522 3445615 3424610 3027081 3090724 3471986 3152778 3284301 3095154 3236226 3187451
14027C187451m10249M08564k83260J2435J0883K63470q113l84005j22290k73973
$$ 3187451 2777202 3185766 2902506 2914941 2925824 3189294 3181181 2797176 2674886 2400913
14017B400913K68890n5326P38N7875j3821q8157J49888j14140j64196k32320J16428
$$ 2400913 2669803 2614477 2615215 2673090 2659269 2571112 2721000 2606860 2442664 2210344 2326772
14006B326772K53046l04099L04210k26616L9408k54751M00161p172m85699K16957
$$ 2326772 2579818 2275719 2579929 2353313 2392721 2137970 2538131 2530959 2045260 2262217
13996B262217j59953K4334N0944O6101J83056J31288N6698R07916K086164O020073
$$ 2262217 2102264 2126598 2177542 2243643 2426699 2557987 2614685 3522601 5608765 11628838
13986A1628838J4901647K2123804j6521071A6044811n834463l183459j440483
$$ 11628838 26530485 48654289 32133218 16044811 10210348 7026889 5586406
13979E586406r07859m23579r37102L04699k89598l76475K06038k77656j99505
$$ 5586406 4678547 4254968 3317866 3622565 3332967 2956492 3162530 2884874 2685369
13970B685369m2709o5470Q2060j43585o0385J65484l77197N6072J42359j61818
$$ 2685369 2642660 2577190 2659250 2515665 2455280 2620764 2243567 2299639 2441998 2280180
13960B280180J16011k89996n3407J45470N4030J28112k61763K4270M3528k86307
$$ 2280180 2396191 2106195 2052788 2198258 2252288 2380400 2118637 2142907 2186435 1900128
13950A900128L20596m9812k80053p978K34552j97260Q1744J66766l81736k21676
$$ 1900128 2220724 2170912 1890859 1882881 2117433 1920173 2001917 2168683 1786947 1565271
13940A565271K83399n6426r7380l0652K41036j69665J30811l81991K50134K39343
$$ 1565271 1848670 1792244 1694864 1664212 1905248 1735583 1866394 1484403 1734537 1973880
13930A973880j34520l61511k2738p2647R7865L62420j28148m8188K08907k00151
$$ 1973880 1839360 1477849 1455111 1382464 1480329 1842749 1714601 1666413 1875320 1675169
13920A675169M7835L19308n36839l2918j17441L55256k5191l17457M31804k91388
$$ 1675169 1723004 2042312 1505473 1472555 1355114 1710370 1685179 1367722 1799526 1508138
13910A508138l87145M26463l51892K04384J76472J87405n24916M4423J75579M01977
$$ 1508138 1120993 1547456 1195564 1399948 1576420 1763825 1238909 1283332 1458911 1860888
13900A860888n59086K42127O151k03928K86978l37628J98624j74728j20893K45117
$$ 1860888 1301802 1543929 1550080 1346152 1633130 1295502 1494126 1319398 1198505 1443622
13890A443622M7763j84302K71812l67469m2969J9409k03422K18331j13878O0746
$$ 1443622 1491385 1307083 1578895 1211426 1168457 1187866 984444 1202775 1088897 1149643
13880A149643K25016P5952n9485j18861q5971L3600J1159M28573l99231o4291
$$ 1149643 1374659 1450611 1391126 1272265 1186294 1219894 1231053 1659626 1260395 1196104
13870A196104j74003Q7253N3227j53629P5038M10708m96186l88074M84410K28279
$$ 1196104 1022101 1109354 1162581 1008952 1083990 1494698 998512 610438 1094848 1323127
13860A323127k19094m9872K83412k05911j93558L5633L30110k53570k31478J35443
$$ 1323127 1104033 1054161 1337573 1131662 938104 973737 1303847 1050277 818799 954242
13850I54242m2603J41390m7664k0084P1219r3340O0396K8447l8729n9809k61891
$$ 954242 911639 1053029 1005365 985281 1056500 963160 1023556 1052003 1013274 953465 691574
13839F91574M70395k61102j20616Q5724K7504N557K17843k40966K50663L2336
$$ 691574 1161969 900867 780251 865975 893479 899036 1116879 875913 1126576 1158912
13829A158912j10356k77943K8468L04756P5702l35933R8046q112M2946O317K8373
$$ 1158912 1048556 770613 799081 1103837 1179539 843606 941652 933540 976486 982803 1011176
13818A011176K1348j98872p343k77907K35465j14240m314L72666l44030J12498
$$ 1011176 1032524 833652 826309 548402 783867 669627 665313 1037979 693949 806447
13808H06447K71069l21849j08853j81086N22958j89985J65457j74323j0288k96361
$$ 806447 1077516 755667 646814 465728 988686 798701 964158 789835 779547 483186
13798D83186J23403K06437o3309j7256L61701n3056r524m3360m42802K41547o526
$$ 483186 606589 813026 749717 732461 1094162 1041106 1031582 988222 545420 786967 780441
13787G80441q0381J43707k29059J4746L62263k01410n0898Q8273q551k81999M31903
$$ 780441 700060 843767 614708 629454 991717 790307 739409 827682 819131 537132 969035
13776I69035B54109M19941j47837K02969J18135Q6537n1313m06597M38270j25115
$$ 969035 254109 674050 526213 729182 847317 933854 882541 475944 914214 789099
13766G89099k1124J4461j91241K62788K08702m42281J53317K4077l76265K36484
$$ 789099 767975 782436 591195 853983 1062685 620404 773721 797798 421533 658017
13756F58017J31736C28062L01200K55238k10962Q236K9070q7233m3896J04152
$$ 658017 789753 328062 629262 884500 673538 681774 710844 623611 579715 683867
13746F83867o5975M9376P3191j19719L61664l04850O1464j34323r3871J38360
$$ 683867 617892 667268 740459 620740 982404 677554 739018 604695 510824 649184
13736F49184j01194k66632L19962j03389K03152P9688l32541P2284L7288o7028
$$ 649184 547990 281358 601320 497931 701083 780771 448230 520514 557802 490774
13726D90774j16631J541M83996k27673k98875K44140J6960o5560A26068K27254
$$ 490774 374143 375684 859680 632007 333132 577272 594232 528672 126068 353322
13716C53322K70978r7071K97623j39237j01628P7906o3106r4972j06820j40916
$$ 353322 624300 527229 824852 685615 583987 661893 598787 503815 396995 256079
13706B56079M36428B36135L61940B28872J09389M03952j01404J03229k3415j31714
$$ 256079 692507 236135 598075 228872 338261 742213 640809 744038 720623 588909
13696E88909A34893M00677m1952K93221C36610J5656L5949L5168K39616B65653
$$ 588909 134893 535570 493618 786839 336610 352266 388215 423383 662999 265653
13685D78376M74923C70697J00321L3177A34222N27122n7886k15743M0872A55518
$$ 478376 953299 370697 471018 504195 134222 661344 603458 387715 428587 155518
13674E49938B35851R7906L8030L50282k52401J45267o2421A51339L04054J24590
$$ 549938 235851 333757 371787 722069 469668 614935 552514 151339 455393 579983
13664E79983A27779L81026H5953N69524j63305q1178J60112j33080J55702k27897
$$ 579983 127779 508805 85953 655477 492172 410994 571106 438026 593728 365831
13654C65831L58834C45274J23904J73104p9166Q3677k66382J68201k13850M8176
$$ 365831 724665 345274 469178 642282 563116 646793 380411 548612 334762 382938
13644C82938P9108j90199J43273k7706K29757B68516M73623l13121A99359K10395
$$ 382938 462046 271847 415120 387414 617171 268516 742139 429018 199359 409754
13634D09754j5765J27823j15430L44371B24472L04824B43044L70339o3231k74890
$$ 409754 393989 521812 406382 750753 224472 529296 243044 613383 550152 275262
13624B75262R5155A09948J10443L19287f3181E76166m7606k45561L65607a09268
$$ 275262 370417 109948 220391 539678 -63181 576166 528560 282999 648606 -109268
13613B50359l4024L96934B59405j15300K16619R1991D6094J22585O11567C08952
$$ 250359 216335 613269 259405 144105 360724 452715 46094 168679 780246 308952
13602D06045L62976k99531k12608J55474j22049K24080p6064j20562R7107M982
$$ 406045 769021 469490 256882 412356 290307 514387 438323 317761 414868 419850
13592D19850J02192j87725K06924A88467P5022P8034K37593k05872o344J77284
$$ 419850 522042 334317 541241 188467 263489 341523 579116 373244 366900 544184
13582E44184B62320K30188m5989J56408k91497l53L59558B27807J61435L75796
$$ 544184 262320 492508 446519 602927 311430 311077 670635 227807 389242 765038
13572G65038B18887K69670P6497j70434A27512K66222L6988K5015m5596Q8510
$$ 765038 218887 488557 565054 394620 127512 393734 430722 455737 410141 498651
13562D98651B12781K59833k31986Q7691j29470n5287M23098B55710J98662j37495
$$ 498651 212781 472614 240628 328319 198849 143562 566660 255710 454372 316877
13552C16877G4632M11364p2118M1510L0137r5457H5792j5349K73408J2966J71078
$$ 316877 74632 485996 413878 455388 485525 390068 85792 70443 343851 356817 527895
13541E27895k16341a55572B68295J50762O9312A06681B6190K76230Q4187A54264
$$ 527895 311554 -155572 268295 419057 488369 106681 26190 302420 386607 154264
13530D73383M2411A80312L2897N7958q2556p4748L04096j3204o7771A14441J08160
$$ 473383 515794 180312 213209 271167 188611 113863 417959 404755 336984 114441 222601
13519B22601j7437J5926f4602j21294A29293K21932b08697B86671A33569R6688
$$ 222601 205164 221090 -64602 -185896 129293 351225 -208697 286671 133569 230257
13509B30257o5289j3036N3200c282B21970n3725L0998h7212E46461k21064q5924
$$ 230257 164968 151932 205132 -3282 221970 168245 199243 -87212 546461 325397 239473
13498B39473K68905K7430A96514J09848J0508l3223J51476J24178A40216a674
$$ 239473 508378 535808 196514 306362 316870 283647 435123 559301 140216 -1674
13487E25337j57145J2775j04979A00145K63252J61281k02789c7092D41388A38904
$$ 525337 368192 380967 275988 100145 363397 524678 321889 -37092 441388 138904
13476B31224K25537A53441O726Q7117A06926j6262C4124J94914p9437K518L70987
$$ 231224 456761 153441 160167 247284 106926 90664 34124 229038 149601 152119 523106
13465E23106G1943J74257F3462J45881Q8311J48576A95903h7393B97682P1791
$$ 523106 71943 246200 63462 209343 297654 446230 195903 -87393 297682 369473
13455C69473j19593l3259L75077j78355J26481e3581A04242l7189R9078L3845
$$ 369473 249880 216621 591698 413343 539824 -53581 104242 67053 166131 199976
13445A99976L31271A33235J49708c8712B64830A11817a51475A99929q2510K91247
$$ 199976 531247 133235 282943 -38712 264830 111817 -151475 199929 117419 408666
13435D08666q1673q4308J02551Q4992n6145c4991B86394j29821H65J82928p6692
$$ 408666 326993 242685 345236 430228 374083 -34991 286394 156573 865 183793 107101
13424A07101B3666J40884J89327l794F0012Q6487k104p436J61449J60213j51216
$$ 107101 23666 164550 353877 350083 60012 146499 144395 136959 298408 458621 307405
13413C07405B3799j1357L92606I4255m2184K18405e0286C68701l9368a5211B34193
$$ 307405 23799 12442 405048 94255 52071 270476 -50286 368701 329333 -15211 234193
13401B86485m7252L5325P2632J06705j07413h0664E0091L75820b5195C92653A29449
$$ 286485 239233 274558 347190 453895 346482 -80664 50091 425911 -25195 392653 129449
13389H5803K78617e6792A19016R3873n6329g4178C92868A91612K9871L5770N170
$$ 85803 364420 -56792 119016 212889 156560 -74178 392868 191612 221483 257253 262423
13378B62423f1545B50938I2545K14083j28956J1761K5473K23774j26616J45249
$$ 262423 -61545 250938 92545 306628 177672 189433 214906 438680 312064 457313
13368D57313j50093k3832r8010J04872o9625P5199J08911q2629H1051O1711a42469
$$ 457313 307220 283388 185378 290250 220625 295824 404735 322106 81051 142762 -142469
13356D72274A07771L29621j77402j06636C2587J38004k1578J7313J02331R2225
$$ 472274 107771 437392 259990 153354 32587 170591 149013 166326 268657 360882
13346C60882j37609J35502J9646A61867J61985j38133k2671L24817A059J88547
$$ 360882 223273 358775 378421 161867 323852 185719 163048 487865 1059 189606
13336A89606j9683k9996M1157B6930Q067P3574A0657K68697a9645C46895P2997
$$ 189606 169923 139927 181084 26930 34997 108571 10657 279354 -19645 346895 419892
13325D19892A78772J65946E3965J90841l3011J39944A67131p823k3268j2242C0764
$$ 419892 178772 344718 53965 244806 211795 351739 167131 159308 136040 123798 30764
13313D28708a09398D33270j85728l8482P6254N4491D3580O7731M6076d2430C7702
$$ 428708 -109398 433270 247542 209060 285314 339805 43580 111311 157387 -42430 37702
13301B57708G2881L85544h7423A76060L23136j70029A36964C2349J37703c0581
$$ 257708 72881 458425 -87423 176060 499196 329167 136964 32349 170052 -30581
13290g5416A5906L83229a7484D20005A21862a7723C03002K6400a38592B09746
$$ -75416 15906 399135 -17484 420005 121862 -17723 303002 329402 -138592 209746
13279A99044N0397j11688F7119j8475d7180C39224M4607D3790P8619J60096p6414
$$ 199044 249441 137753 67119 48644 -47180 339224 383831 43790 122409 282505 206091
13268B06091N8531j14139a99495C60501j56304P3858A32219K7667Q8197J72858
$$ 206091 264622 150483 -199495 360501 204197 278055 132219 159886 248083 420941
13258D20941a88419g0194H4541a423A46263K68933A14570N7100J20112D3871a27803
$$ 420941 -188419 -70194 84541 -1423 146263 415196 114570 171670 291782 43871 -127803
13246A01760O2845a20135j03016B05586m7211Q3023k5685o2965J8959L4356a33977
$$ 101760 164605 -120135 -223151 205586 158375 241398 215713 152748 171707 206063 -133977
13234A36482b43841M5044B5992c00726B06472C6968a1803B47048g5787j04485
$$ 136482 -243841 -198797 25992 -300726 206472 36968 -11803 247048 -75787 -180272
13224a80272B95740d3640C09513D5928K72731I4897K30929j59872F6442M7357
$$ -180272 295740 -43640 309513 45928 318659 94897 325826 165954 66442 113799
13214A13799K5389N0029k2267m7283a56659o7347H5639h6397j4926F6855a25807
$$ 113799 139188 189217 166950 119667 -156659 -224006 85639 -86397 -101323 66855 -125807
13202F7370d7980A9913N2428a59453e2611B9739L2029M4256a29218A7053K58883
$$ 67370 -47980 19913 72341 -159453 -52611 29739 61768 106024 -129218 17053 275936
13191B75936a9452A9224a30513A57681J08350A02147K4492K54109a64373A61203
$$ 275936 -19452 19224 -130513 157681 266031 102147 126639 380748 -164373 161203
13180C13430F9187R0761l3173O9993J72711a87750D9577N3239A066K98431j11328
$$ 313430 69187 159948 126775 196768 369479 -187750 49577 102816 1066 299497 188169
13169A88169a42773A07205c0851m5986c0765A64750B2219b14573O3690A75540
$$ 188169 -142773 107205 -30851 -76837 -30765 164750 22219 -214573 -150883 175540
13158A4096L3551N1045K05326A04161j7733N6055i8380G9013J9843l223R1529
$$ 14096 47647 98692 304018 104161 86428 142483 -98380 79013 98856 95633 187162
13147A87162J4439J6886E9256J55873k8736g1504a9118B17432N46c20302a05190
$$ 187162 201601 218487 59256 215129 186393 -71504 -19118 217432 217978 -320302 -105190
13135E0041q657J55677B1494J05520m6257j2826J61149o3230a9023j4030J2399
$$ 50041 41384 197061 21494 127014 80757 67931 229080 165850 -19023 -33053 -20654
13124b0654D3917J69972I6507f4247i905A88195A5662a98720B05356a77416c8239
$$ -20654 43917 213889 96507 -64247 -9905 188195 15662 -198720 205356 -177416 -38239
13112A36363d0492j03214E6941b64961a14728E23170I8099J7832a5107A98757
$$ 136363 -40492 -143706 56941 -264961 -114728 523170 98099 115931 -15107 198757
13101H3172d0064r9724B0031J51854d0516a4061A3353J73893a03930L380D5501
$$ 83172 -40064 -139788 20031 171885 -40516 -14061 13353 187246 -103930 -100550 45501
13089f9365L038B22306f2910A62449h1806A5370O9874O5433L3129A4438d1806
$$ -69365 -66327 222306 -62910 162449 -81806 15370 85244 150677 183806 14438 -41806
13077B26366j03267E8230C229J80053b64032B25817b97829A43448b53277A52579
$$ 226366 123099 58230 3229 183282 -264032 225817 -297829 143448 -253277 152579
13066b4623i764m9734a4010C38276j3884a71745f2177j90252H1195K43463l6270
$$ -24623 -9764 -59498 -14010 338276 324392 -171745 -62177 -252429 81195 324658 288388
13055B88388a11026I5768a56010A96299A2558M52694E7457j1295K01087g2843
$$ 288388 -111026 95768 -156010 196299 12558 465252 57457 46162 247249 -72843
13044b09081A94003b29810A34330a6469I0859J49459e2184C3616K92683b95313
$$ -209081 194003 -229810 134330 -16469 90859 240318 -52184 33616 326299 -295313
13033C08224D9138L94881A06869h7187C78151j38399A14990C020a60331e911B29984
$$ 308224 49138 444019 106869 -87187 378151 239752 114990 3020 -160331 -5911 229984
13021H8442g6550B25201a10077A79155J1810b79555e4295C27667c7947j56465
$$ 88442 -76550 225201 -110077 179155 190965 -279555 -54295 327667 -37947 -194412
13011a94412B29965P9631g8247B17194j7097l6928O1704C616J5711J11065O6686
$$ -194412 229965 309596 -78247 217194 200097 163169 224873 3616 19327 130392 197078
13000A97078l170a2316C70749H9179J25787C9186K40461H3775h9812n3166c1089
$$ 197078 193908 -12316 370749 89179 214966 39186 279647 83775 -89812 -142978 -31089
12988B49771E8852M904K71014c0954j04476B07981j01325N8671b5405H4865a68330
$$ 249771 58852 63756 334770 -30954 -135430 207981 106656 165327 -25405 84865 -168330
12976A5576a41349H2932c0149D6335j4105c67750i8940A17852b6860A26694b81333
$$ 15576 -141349 82932 -30149 46335 32230 -367750 -98940 117852 -26860 126694 -281333
12964b7362A90468J77712j42901K3784A23527b70614A33595o6494J62142a66453
$$ -27362 190468 368180 225279 249063 123527 -270614 133595 67101 229243 -166453
12953a3986A02795a11388A77761J01214A34244m2455B4342a51591A75720J36255
$$ -13986 102795 -111388 177761 278975 134244 91789 24342 -151591 175720 311975
12943C11975H33a06784b0323C9732L62221A47775B5911N3860a60750A12102a27769
$$ 311975 833 -106784 -20323 39732 401953 147775 25911 79771 -160750 112102 -127769
12931A08706J22811N9578I0018g393n9073a7566k93072C65801c6927B66034B4049
$$ 108706 231517 291095 90018 -7393 -66466 -17566 -310638 365801 -36927 266034 24049
12919h1859j3535A00560J85218C8445b3733B11678I1188a97325B21020j00638
$$ -81859 -95394 100560 285778 38445 -23733 211678 91188 -197325 221020 120382
12909A20382f1227A33090a622j15997n2793K8670B669Q3308O3182h3166B49870
$$ 120382 -61227 133090 -1622 -117619 -170412 -141742 2669 85977 149159 -83166 249870
12897a93201F4773b5391p5620A20087C9225N9573M6902D0821R421Q9468B1086
$$ -193201 64773 -25391 -101011 120087 39225 98798 145700 40821 50242 139710 21086
12885I1749k4493b9085C476J92522l9318l0046a55483F5373h5180A93568J36605
$$ 91749 67256 -29085 3476 195998 156680 126634 -155483 65373 -85180 193568 330173
12874C30173c39946a34603D99513p0276A55678C5472J5253a44734A9833a39700
$$ 330173 -339946 -134603 499513 429237 155678 35472 50725 -144734 19833 -139700
12863A01057N572N8992F0823a95157B79601l3587A05054R8752J11671j40411q2636
$$ 101057 106629 165621 60823 -195157 279601 246014 105054 203806 315477 175066 92430
12852I2430l7318A10h9336F5228R1362J87699g6832a6361m3499B2133f1380C28737
$$ 92430 55112 110 -89336 65228 156590 344289 -76832 -16361 -59860 22133 -61380 328737
12839A73831a63458b3105C54669i6235j3090a7569j45937A47923L41018c76255
$$ 173831 -163458 -23105 354669 -96235 -109325 -17569 -163506 147923 488941 -376255
12828a32700A65811k8087j9768a60181A01005K43014b18858E5195k0250R1271
$$ -132700 165811 137724 117956 -160181 101005 344019 -218858 55195 34945 126216
12818A26216N3178f0682m9004H3190e1660a8415j62580A58278a76877h4579k36696
$$ 126216 179394 -60682 -109686 83190 -51660 -18415 -180995 158278 -176877 -84579 -321275
12807c21275a25087O0181A10171J28014l2492H6196N6722a11016p4186R1595F7586
$$ -321275 -125087 -64906 110171 238185 205693 86196 142918 -111016 -185202 -93607 67586
12795B070K51381J8827c15109a26023b015r7337o088b7214j46767F3280G629c63272
$$ 2070 253451 272278 -315109 -126023 -2015 -99352 -105440 -27214 -173981 63280 7629 -363272
12782a01177A1077Q2360B2020d599j80266D4349a20837C6157J39331a25894j9143
$$ -101177 11077 93437 22020 -4599 -184865 44349 -120837 36157 175488 -125894 -145037
12771a45037C1078c5266P497k10013J00755l7733I2571B1968J31324n8821C5522
$$ -145037 31078 -35266 -27769 -237782 -137027 -174760 92571 21968 153292 94471 35522
12759A68982b16706m3104H6603a28890B3504L50723b85171A66818k4322k3364
$$ 168982 -216706 -259810 86603 -128890 23504 374227 -285171 166818 142496 119132
12749A19132a03373E2881P7311a60786B3408b03107A83828j5615b1446D3578L7563
$$ 119132 -103373 52881 130192 -160786 23408 -203107 183828 168213 -21446 43578 81141
12738H1141b05166C16906d963A97517A5083J28565R9415C3424K80643A23404b94
$$ 81141 -205166 316906 -4963 197517 15083 143648 243063 33424 314067 123404 -294
12726A62502a7782k5871o9126E7997J03398b76168m6640f1153j45847A5776h2259
$$ 162502 -17782 -43653 -112779 57997 161395 -276168 -322808 -61153 -207000 15776 -82259
12714A28848P590c00744D04727H0988L3562L69248B36573k4926K83452j22586
$$ 128848 136438 -300744 404727 80988 114550 483798 236573 211647 495099 372513
12704C72513a37722F8182L51386a20130A84696P4756c0203j35465H7700c80489
$$ 372513 -137722 68182 419568 -120130 184696 259452 -30203 -165668 87700 -380489
12693e5167B42041q707I8100J59724a1981A95190A3251b69986B43163a65132A48081
$$ -55167 242041 233334 98100 257824 -11981 195190 13251 -269986 243163 -165132 148081
12681a07563k03641i1739B75367m7315O8499q4607b32686d2019B12621L5978b3785
$$ -107563 -311204 -91739 275367 228052 296551 211944 -232686 -42019 212621 248599 -23785
12669C25519k9450i8865C24790E9161L5415J19508F7615K00096j12930L6177a19906
$$ 325519 296069 -98865 324790 59161 94576 214084 67615 267711 154781 190958 -119906
12657e2510A24425f3371A12769E5759K03356A17748a61B9506J02323K60183a27828
$$ -52510 124425 -63371 112769 55759 259115 117748 -161 29506 131829 392012 -127828
12645a56535A17969a82791G6761b10884p435Q8090A70812a8260j69704C02800
$$ -156535 117969 -182791 76761 -210884 -218319 -130229 170812 -18260 -187964 302800
12634C95796a26106e2036C88889E2500A2915N4882e3825J1932B08847r9181J11647
$$ 395796 -126106 -52036 388889 52500 12915 67797 -53825 -41893 208847 109666 221313
12623B21313a85295A94561M33794B17760Q7822a27634a0278h18B3619d6503h731
$$ 221313 -185295 194561 628355 217760 305582 -127634 -10278 -818 23619 -46503 -8731
12611A01536J11342g3909j99587a24481A51572b37981B2956a12106p0835f2319
$$ 101536 212878 -73909 -273496 -124481 151572 -237981 22956 -112106 -182941 -62319
12600C9374J64167b8542B7262J70167F3034g2552l6481A25103A4031J58290j1812
$$ 39374 203541 -28542 27262 197429 63034 -72552 -109033 125103 14031 172321 160509
12589A60509J70387b19305A55380F4591A0496O191K42866c7709A19018L7620A9382
$$ 160509 330896 -219305 155380 64591 10496 16687 259553 -37709 119018 156638 19382
12577C35759A47351r766j621a8211A42189K18607g1395L2786A72853a11986j80861
$$ 335759 147351 137585 135964 -18211 142189 360796 -71395 -38609 172853 -111986 -292847
12566b92847A11351f3988k26882a8427A28411L71307E8701K77498G7950L3775
$$ -292847 111351 -63988 -290870 -18427 128411 499718 58701 336199 77950 111725
12556A11725M2725B4794a45541c4889q467A25382h851r1692c1500j48145A16372
$$ 111725 154450 24794 -145541 -34889 -43356 125382 -8851 -100543 -31500 -179645 116372
12544d6114A52556m1393G679J51911p1873a54182L8607C3397d35462a66774L7576
$$ -46114 152556 111163 7679 159590 87717 -154182 -115575 33397 -435462 -166774 -129198
12533a29198D5071Q1969a26634e6655D03878b93148B19663K5954o3362F1788a75653
$$ -129198 45071 127040 -126634 -56655 403878 -293148 219663 245617 182255 61788 -175653
12521E3403a72159B22160F0633j8508c995n6113D16912A60113a21044p7608m4318
$$ 53403 -172159 222160 60633 42125 -3995 -60108 416912 160113 -121044 -198652 -242970
12510b42970k8449p0302J08717N7488g3754G5381C5291d28005b5665j37994j5544
$$ -242970 -271419 -341721 -233004 -175516 -73754 75381 35291 -428005 -25665 -163659 -179203
12499a79203I7851a5822C4059J3387J6936a11115q9683Q3316A49031A5996J3172
$$ -179203 97851 -15822 34059 47446 64382 -111115 -200798 -117482 149031 15996 29168
12488B9168J8507a16285G443a76420A39475D0688i2323B81870A0182b77546d1734
$$ 29168 47675 -116285 7443 -176420 139475 40688 -92323 281870 10182 -277546 -41734
12476a7520C38947A60634d94108a75859B83356j6809a30690H054R6934a62140
$$ -17520 338947 160634 -494108 -175859 283356 266547 -130690 8054 104988 -162140
12465A24615g7211r0764M4b8729A84159K7949h483k71299C8663J89486a30399
$$ 124615 -77211 -167975 -167931 -28729 184159 212108 -8483 -279782 38663 228149 -130399
12453C64717A8103O800J65282l9474a58743g177A23377E2896b7947A17740L23790
$$ 364717 18103 24903 190185 150711 -158743 -7177 123377 52896 -27947 117740 441530
12442D41530g3759A5935J12717b39958g6711n1966K5164D3588M2453b00387A33738
$$ 441530 -73759 15935 128652 -239958 -76711 -128677 -103513 43588 86041 -200387 133738
12430e0500A50084A9056J95067a053j72653L411k15707B79616C4574A925a071
$$ -50500 150084 19056 214123 -1053 -173706 -170295 -386002 279616 34574 1925 -1071
12418G78O6215J11369j8737c33468O4389B0341J80384r2732J48056p2259L5973
$$ 778 66993 178362 159625 -333468 -269079 20341 200725 107993 256049 183790 219763
12407B19763a37370A01185a00471A4286J27485i6549A84484a93610D4023a81321
$$ 219763 -137370 101185 -100471 14286 141771 -96549 184484 -193610 44023 -181321
12396g9879j54155a13891a7451k61714a09381N0130j2034B22676a0120H8102o308
$$ -79879 -234034 -113891 -17451 -279165 -109381 -59251 -71285 222676 -10120 88102 81794
12385H1794a21033c4056A354N5250b34333b7205j86882j40141A0498a86451h4059
$$ 81794 -121033 -34056 1354 56604 -234333 -27205 -214087 -354228 10498 -186451 -84059
12373a87677h629j36919J5708A60086d0718A7387H191K84876j24217p7058l7484
$$ -187677 -8629 -145548 -129840 160086 -40718 17387 8191 293067 168850 91792 54308
12362E4308b05417L1384o5056f945B71774b05969B88652a21983C6585c52273A50667
$$ 54308 -205417 -174033 -239089 -6945 271774 -205969 288652 -121983 36585 -352273 150667
12350H7519a40040A50131C9748a93970D5515J09646k094a89156L8402A8504b39149
$$ 87519 -140040 150131 39748 -193970 45515 155161 153067 -189156 -150754 18504 -239149
12338c48424A17062C4263c681k10562a01336G8306i2974b5867A2766c95214a32420
$$ -348424 117062 34263 -3681 -214243 -101336 78306 -92974 -25867 12766 -395214 -132420
12326B62904a78783q8131C76456c02081G4977J4530E195M7200g1218C53076G9020
$$ 262904 -178783 -266914 376456 -302081 74977 89507 5195 52395 -71218 353076 79020
12314a38136d2289j0326l8296C80199J1102a35054A3047a1196j34198q905g2408
$$ -138136 -42289 -52615 -90911 380199 391301 -135054 13047 -11196 -145394 -154299 -72408
12302g2224A14444b7255l7090B3213R5983a54784A2756J64180J3669B3631a25133
$$ -72224 114444 -27255 -64345 23213 119196 -154784 12756 176936 190605 23631 -125133
12290B00248G070K76956a6086B2849P007d1599A53292i0801D75872C6201J5608
$$ 200248 7070 284026 -16086 22849 29856 -41599 153292 -90801 475872 36201 51809
12279E1809d188B85647j9084A19181a26834B20412a40306C00956j05035P0494
$$ 51809 -4188 285647 266563 119181 -126834 220412 -140306 300956 195921 266415
12269B66415a5817j95808e8718F5419d81533a22645k48718A60042h0882m2378
$$ 266415 -15817 -211625 -58718 65419 -481533 -122645 -371363 160042 -80882 -123260
12259a23260A90711B2208C760J92509b7389C80145b12858A17120K57768j84965
$$ -123260 190711 22208 3760 196269 -27389 380145 -212858 117120 374888 189923
12249A89923P8233k8460o0329L3065F1713a21758H3804Q8342a30461B09270F8810
$$ 189923 268156 239696 179367 212432 61713 -121758 83804 172146 -130461 209270 68810
12237F8359b17565E6100a03318L2818A84449p5314B1622K63034j26953f0416B63635
$$ 68359 -217565 56100 -103318 -70500 184449 109135 21622 284656 157703 -60416 263635
12225B27055J46886g8093D1939K80725G900K25045a28530E2984a5628B81335H2379
$$ 227055 373941 -78093 41939 322664 7900 232945 -128530 52984 -15628 281335 82379
12213a22226A73242i7319A06134D7556K04348g4104A19338L8441a3220B11433
$$ -122226 173242 -97319 106134 47556 251904 -74104 119338 157779 -13220 211433
12202B2716J57675o4639r460L7724J34731F6328K37418K0559j29676l7723C0948
$$ 22716 180391 115752 106292 144016 278747 66328 303746 324305 194629 156906 30948
12190a15100d9431D01904A35994j3662J88054H0148J06490m6178K7796C7154K62550
$$ -115100 -49431 401904 135994 122332 310386 80148 186638 140460 168256 37154 299704
12179B99704D0232J91185D5948g191j13489I3829D2348L07667D5206M34O3095
$$ 299704 40232 231417 45948 -7191 -120680 93829 42348 350015 45206 45640 108735
12168A08735J29239A03463R9512Q3995n0294H1236J2792a78576B82181A1627a10716
$$ 108735 237974 103463 202975 286970 236676 81236 94028 -178576 282181 11627 -110716
12156D5457A8701i8106G6105k5210a6332A15310K6339L71338A4868J2616J13275
$$ 45457 18701 -98106 76105 50895 -16332 115310 141649 512987 14868 27484 140759
12145A40759k5813F809R2567c15480B31232K51976A52114a31725d7369A96478
$$ 140759 114946 6809 99376 -315480 231232 483208 152114 -131725 -47369 196478
12134a98089A82602h3806B60758D7616P0885K4625b08100h5488D6246a73899M0850
$$ -198089 182602 -83806 260758 47616 118501 143126 -208100 -85488 46246 -173899 -133049
12123a33049A06165i5333B5829c6770A71906q3063a01137A94203H7992R9298c34802
$$ -133049 106165 -95333 25829 -36770 171906 88843 -101137 194203 87992 187290 -334802
12111a86450g0435C7430P5095A5718J21836e289j8018r781A53766a81018A06728
$$ -186450 -70435 37430 112525 15718 137554 -5289 -23307 -33088 153766 -181018 106728
12099b16920P4041D2335J34812B1362b39893J18539j15530a06259H5615b26170
$$ -216920 -142879 42335 177147 21362 -239893 -121354 -236884 -106259 85615 -226170
12088a25832I3939d1884j52186k81217D48443A26535B4733J06286b15868J7359
$$ -125832 93939 -41884 -194070 -475287 448443 126535 24733 131019 -215868 -198509
12078a98509o3263C13437A14405p015J57903J116824N50291F01212B83424E6712
$$ -198509 -261772 313437 114405 107390 265293 1382117 1932408 601212 283424 56712
12067B00810p2306A4416a34226B5884K10084F8439A5274M2284J32169O117c48538
$$ 200810 128504 14416 -134226 25884 235968 68439 15274 57558 189727 195844 -348538
12055a12513E1928a93659A8173c46518a19566K7682A14871b2992r9505B07463
$$ -112513 51928 -193659 18173 -346518 -119566 -91884 114871 -22992 -122497 207463
12044B1526a33112C14006c35214F6248a66327B14294a74335b6767j6660A24994
$$ 21526 -133112 314006 -335214 66248 -166327 214294 -174335 -26767 -43427 124994
12033A38343J53035C3239J84077A866b22484C8866f9422b438A46615c02671d7544
$$ 138343 291378 33239 217316 1866 -222484 38866 -69422 -2438 146615 -302671 -47544
12021A59674E9936f0j02475I450Q0793N455i4823L5448G5558g4175j2187k42166
$$ 159674 59936 -60 -102535 9450 90243 95698 -94823 -59375 75558 -74175 -86362 -328528
12009c28528k34916a04952E43c76402F4080r386b49284A8976a9532p2400b7578
$$ -328528 -563444 -104952 543 -376402 64080 54694 -249284 18976 -19532 -91932 -27578
11997C4968A2999K5605d16734A53344e4214j01619l843B46497l5316a44174j01416
$$ 34968 12999 38604 -416734 153344 -54214 -155833 -159676 246497 211181 -144174 -245590
11986b45590A6227N2666b18074J5023f5386A72545M362b49516E0980I056d2506
$$ -245590 16227 68893 -218074 -203051 -65386 172545 176907 -249516 50980 9056 -42506
11974i0551D1808b66190a18759A11995D9532J49171j5193d4527l3599I2485b94874
$$ -90551 41808 -266190 -118759 111995 49532 198703 183510 -44527 -78126 92485 -294874
11962D8454J27410i3529R287F1906J41098b05762A53086b6033p2232A95344a36162
$$ 48454 175864 -93529 -84242 61906 203004 -205762 153086 -26033 -98265 195344 -136162
11950A18766m2563e214k91311E0525a3428m9380k8881D19856a35533m5425j69544
$$ 118766 76203 -5214 -296525 50525 -13428 -62808 -91689 419856 -135533 -180958 -350502
11939c50502a28917I1157e07000f7677E0555a06797B80542d666j75855j64443
$$ -350502 -128917 91157 -507000 -67677 50555 -106797 280542 -4666 -180521 -344964
11929c44964J48409h2199I284c05795k9875I4379h5687l0425N4019o1770A86539
$$ -344964 -196555 -82199 9284 -305795 -335670 94379 -85687 -116112 -62093 -123863 186539
11917h7640j10100b5411r5806a1060B28332n8913D8290a63899G21b02398A65581
$$ -87640 -197740 -25411 -121217 -11060 228332 169419 48290 -163899 721 -202398 165581
11905A64571B7974m01J3065O8380i3830B36916a84684N9395c6425l51828e8777
$$ 164571 27974 27573 40638 109018 -93830 236916 -184684 -125289 -36425 -388253 -58777
11893A33745b3731l03234a16329l8236C6622K98051j21379a88513O8262L4335
$$ 133745 -23731 -326965 -116329 -154565 36622 334673 213294 -188513 -120251 -85916
11883h5916c9264I8989a26505m9444H1456b9724D3088E295h7380j7721j1981A3432
$$ -85916 -39264 98989 -126505 -175949 81456 -29724 43088 5295 -87380 -105101 -117082 13432
11870D630i4694o028j83703J3816a28816L700A92160a82673A63257J40942f60393
$$ 4630 -94694 -100722 -284425 -270609 -128816 -125116 192160 -182673 163257 304199 -660393
11858g1733C27919b37030J01634A24614c81172g222l45911J03566d90j76016d8349
$$ -71733 327919 -237030 -135396 124614 -381172 -7222 -353133 -249567 -490 -176506 -48349
11846d179l7576J6223G7594C6554Q7867I31a36066f1554F7317M8598b40515G6666
$$ -4179 -41755 -25532 77594 36554 124421 931 -136066 -61554 67317 115915 -240515 76666
11833d9678A73105h1915n881n7002A54591l7004f6344j31788M9777C88168c03316
$$ -49678 173105 -81915 -87796 -144798 154591 117587 -66344 -198132 -148355 388168 -303316
11821A42758m6432a3006p9876j03887A114b00385Q0620A68639H3742a44004d7252
$$ 142758 96326 -13006 -92882 -196769 1114 -200385 -119765 168639 83742 -144004 -47252
11809A39842e7894j53505F893c0842A66519a00101k9621D0556P9654l3226C4762
$$ 139842 -57894 -211399 6893 -30842 166519 -100101 -129722 40556 120210 86984 34762
11797C15840g6855B78676a99465B86289a297B40614J10904A28227a13357A40129
$$ 315840 -76855 278676 -199465 286289 -1297 240614 351518 128227 -113357 140129
11786F224d2727H3506L8713k4013A628R4072a64930p2177C9006b71732h5633k3055
$$ 6224 -42727 83506 122219 98206 1628 95700 -164930 -237107 39006 -271732 -85633 -108688
11774a08688b9592E1322K63169K0173D6995K34440a2077n1194q4321B79862a53429
$$ -108688 -29592 51322 314491 334664 46995 281435 -12077 -63271 -147592 279862 -153429
11762b04793B74785I7688b03330A90446A6263e6787E7969f3378J5663a2293K02
$$ -204793 274785 97688 -203330 190446 16263 -56787 57969 -63378 -47715 -12293 -12091
11751a2091l32968e962B26492a9731G0750b44738C21647g976k24008r31H1175
$$ -12091 -345059 -5962 226492 -19731 70750 -244738 321647 -7976 -231984 -232915 81175
11739d86357d6498F2576A6813K5380c50243I5186K6905R1415r1524d42605B30038
$$ -486357 -46498 62576 16813 42193 -350243 95186 122091 213506 121982 -442605 230038
11727a22880l5722A01939h3055I112K24111a53179A75919q1569L6426E6489M8035
$$ -122880 -158602 101939 -83055 9112 233223 -153179 175919 94350 130776 56489 104524
11716A04524g8077G3620i4954C5099J16376f3849B24683m9897p1849A8040i3880
$$ 104524 -78077 73620 -94954 35099 151475 -63849 224683 174786 102937 18040 -93880
11704B3480J20152C1766a89095C40979k0648r9244a83884n3301C8043b1715j56764
$$ 23480 143632 31766 -189095 340979 320331 221087 -183884 -237185 38043 -21715 -178479
11693a78479A3979R9455a31090k43377b7619A8908K77339f6904m1152H4013c68864
$$ -178479 13979 113434 -131090 -374467 -27619 18908 296247 -66904 -108056 84013 -368864
11681b5307A82857F1262a76862d41j8953k32977B42890F2410J43344c45590A37387
$$ -25307 182857 61262 -176862 -441 -19394 -252371 242890 62410 205754 -345590 137387
11669a13159j44579b8309j9849k77757a14975M7336E7040a0176A86585A1818L6604
$$ -113159 -257738 -28309 -48158 -325915 -114975 -67639 57040 -10176 186585 11818 48422
11658D8422a14383A12144A3682a30035p2578f0593o364A208a24696B6433a73377
$$ 48422 -114383 112144 13682 -130035 -202613 -60593 -66957 1208 -124696 26433 -173377
11646b69892A66533p9431K11379M9469C9138N3264a69219L552D4660J71056i6300
$$ -269892 166533 87102 298481 347950 39138 92402 -169219 -165667 44660 215716 -96300
11634a0429A49227D3436a20984N4711D7334L37349A56696K42888c24040A34921
$$ -10429 149227 43436 -120984 -66273 47334 384683 156696 399584 -324040 134921
11623b06495n1687H1710j5867i8523G7176I652K14644b71539H9834L20590a1103
$$ -206495 -258182 81710 65843 -98523 77176 9652 224296 -271539 89834 410424 -11103
11611G6047a36503I4137b13581D5227J94154R2646A48740Q5046o7619E1359L1502
$$ 76047 -136503 94137 -213581 45227 239381 332027 148740 233786 166167 51359 82861
11600H2861J31789j01090K9486J5461a51337Q819D9729R1966o5276c3357A05938
$$ 82861 214650 113560 143046 158507 -151337 -142518 49729 141695 76419 -33357 105938
11588F1941c28474B5552K61149q7667a28062M424A82914a65644B55782A20472
$$ 61941 -328474 25552 286701 199034 -128062 -123638 182914 -165644 255782 120472
11577B4503i4401r3790C39812C2514Q0797a10778c747k8488k27982B10630r5406
$$ 24503 -94401 -188191 339812 32514 113311 -110778 -3747 -32235 -260217 210630 115224
11566A15224J89031b71810A62807g2326K1451A40442c508B4149r928J08495b13316
$$ 115224 304255 -271810 162807 -72326 -50875 140442 -3508 24149 14221 122716 -213316
11554C6203J66590l3745a10724L1892n4617A85050a31642A23617K91476G366b6942
$$ 36203 202793 169048 -110724 -78832 -133449 185050 -131642 123617 415093 7366 -26942
11542A10983c19827B4350c9106A85224j1975J00852m4366g2393A85674e8755D98523
$$ 110983 -319827 24350 -39106 185224 173249 274101 229735 -72393 185674 -58755 498523
11530A33746F4159a13571A09459b05140m0714B02822A0159a3293G2825r626B6063
$$ 133746 64159 -113571 109459 -205140 -245854 202822 10159 -13293 72825 63199 26063
11518C20289B7258O3170a2A30268R0936A04973A684J43220k3830j0599D1242j8266
$$ 320289 27258 90428 -12 130268 221204 104973 1684 144904 121074 110475 41242 22976
11506B2976Q5841k7856K6694i5037A0922h6134d262C14371d1299B28558J68245
$$ 22976 108817 80961 107655 -95037 10922 -86134 -4262 314371 -41299 228558 396803
11495C96803B2284h6913A79153P2852a50215M2458n8726j2880A69480a01015E00171
$$ 396803 22284 -86913 179153 252005 -150215 -107757 -166483 -179363 169480 -101015 500171
11483B42647a67065A41097R3473P8011R3107a17670d4538A36389o6678C2128J73758
$$ 242647 -167065 141097 234570 312581 405688 -117670 -44538 136389 69711 32128 205886
11472B05886N2191f7743C4623j5333M67843j01999A08178k1919b50494c9356j32949
$$ 205886 258077 -67743 34623 19290 487133 385134 108178 86259 -250494 -39356 -172305
11461a72305A03787b8433A14607A6288a23408C084J6709K25098A22054N104b20355
$$ -172305 103787 -28433 114607 16288 -123408 3084 19793 244891 122054 127158 -220355
11449F2833M7060A4917a27455A55048o4798a24130A54398G1976a72812A06489
$$ 62833 109893 14917 -127455 155048 90250 -124130 154398 71976 -172812 106489
11438D19832A60795J0002g7840E0714R8532J84868B800M0360e0708A28449Q4223
$$ 419832 160795 170797 -77840 50714 149246 334114 2800 43160 -50708 128449 212672
11427B12672D1473M01878a01386M6706A72195b01950Q5856D90414B1862L32722
$$ 212672 41473 443351 -101386 -54680 172195 -201950 -116094 490414 21862 354584
11417C54584c45089A4349a43927f7900A16314a54544B26423K2104a77993D6129
$$ 354584 -345089 14349 -143927 -67900 116314 -154544 226423 248527 -177993 46129
11406B20300D6745B2987K51700o9901o9488a84372D8715a93149A05953E1905a1501
$$ 220300 46745 22987 274687 204786 135298 -184372 48715 -193149 105953 51905 -11501
11394i4849k2035A31516g6607k1655L7581k70579A26208K0139J25347b35238i3250
$$ -94849 -116884 131516 -76607 -98262 -60681 -331260 126208 146347 271694 -235238 -93250
11382A87182a54508I7586a72147L5232j71229B1875J80397i3651c5150A00386
$$ 187182 -154508 97586 -172147 -136915 -308144 21875 202272 -93651 -35150 100386
11371A46384K2382a01866A30146a70721c6703A63479b842k78427a12142A48019
$$ 146384 168766 -101866 130146 -170721 -36703 163479 -2842 -281269 -112142 148019
11360d0082C5908c40318e5140F5525a20013B3786J17138g7427C79316a89212o7793
$$ -40082 35908 -340318 -55140 65525 -120013 23786 140924 -77427 379316 -189212 -257005
11349b57005F976e8898j50616J02952B18875l3992c31611D88047a48092k13772
$$ -257005 6976 -58898 -209514 -106562 218875 184883 -331611 488047 -148092 -361864
11339c61864e1279A17879k5501F659b79095b7222B428Q8124l0328i5383j5011
$$ -361864 -51279 117879 92378 6659 -279095 -27222 2428 90552 60224 -95383 -110394
11328a10394p1209E4904b52252i1478A93424H6306J60967A13071D2494M05564
$$ -110394 -181603 54904 -252252 -91478 193424 86306 247273 113071 42494 448058
11318D48058b044A64673a6779q5850H4991j2152b0680k1007b0062j72760N8591
$$ 448058 -2044 164673 -16779 -102629 84991 72839 -20680 -41687 -20062 -192822 -134231
11307a34231O3373k6999M6316B52143O0573a59891A80611F1514A8418f5336b468
$$ -134231 -70858 -97857 -51541 252143 312716 -159891 180611 61514 18418 -65336 -2468
11295H1170K0566h615B7274a75102j36873D42373a78532G9217a82741o8061A8637
$$ 81170 101736 -8615 27274 -175102 -311975 442373 -178532 79217 -182741 -250802 18637
11283h8692C0066b05086H6929b1867D5331b18086B8986h4605B64491a11373A79845
$$ -88692 30066 -205086 86929 -21867 45331 -218086 28986 -84605 264491 -111373 179845
11271A13117a29799j61192B902J87813f594j08707K2139m1934D5288a78715J9530
$$ 113117 -129799 -290991 2902 190715 -6594 -115301 -93162 -135096 45288 -178715 -159185
11260a59185L4969c075o0372l01756a58766P5463K9518A08262D2455a4609H3130
$$ -159185 -124216 -3075 -63447 -365203 -158766 -83303 -53785 108262 42455 -14609 83130
11248A39952a75256M701j15970i3263k15842a1046m2638G7467k3492K8575b31435
$$ 139952 -175256 -170555 -286525 -93263 -309105 -11046 -53684 77467 53975 82550 -231435
11236c15185A1662L96983b61637l197d9828B33010B3142Q1983b82009g9022F3773
$$ -315185 11662 408645 -261637 -264834 -49828 233010 23142 105125 -282009 -79022 63773
11224a94496k8979o5507a25748A96249p1068M1032a21448A51840g8147p2662A1903
$$ -194496 -223475 -288982 -125748 196249 125181 166213 -121448 151840 -78147 -150809 11903
11212C8062a63149j7436A49915C8407J20647C2734J10303a14041C6251c36001
$$ 38062 -163149 -180585 149915 38407 159054 32734 143037 -114041 36251 -336001
11201A05282c66807B57018m3286b00B4907b15008P4515a5723k16648A77599e984
$$ 105282 -366807 257018 213732 -200 24907 -215008 -140493 -15723 -232371 177599 -5984
11189B33579j3941i9867m9200B01877a27453e627H5590a04320A58659a98806F4822
$$ 233579 219638 -99867 -149067 201877 -127453 -5627 85590 -104320 158659 -198806 64822
11177F7206b67773I8097k1308i6252a729n66770a28173d1480G9405b68066a7039
$$ 67206 -267773 98097 76789 -96252 -1729 -568499 -128173 -41480 79405 -268066 -17039
11165a0104j80695j39896E8807a88724K8641A16776J39632E4759A1748a936B24978
$$ -10104 -190799 -330695 58807 -188724 -160083 116776 256408 54759 11748 -1936 224978
11153b17237j87066A8514d66557e9680A35013m4517g0665A33551K33704a31689
$$ -217237 -404303 18514 -466557 -59680 135013 90496 -70665 133551 367255 -131689
11142a63935A81341E4310J11023g1658k05526A30611i1909A54108Q948b86125
$$ -163935 181341 54310 165333 -71658 -277184 130611 -91909 154108 163056 -286125
11131F2163A4052a77221A85504a23217B6449K12420h9833A15890M2253D5455a6199
$$ 62163 14052 -177221 185504 -123217 26449 238869 -89833 115890 158143 45455 -16199
11119a38113A47642g9911B30307b32146H360Q9442I319a04604r0114H9799c3965
$$ -138113 147642 -79911 230307 -232146 8360 97802 9319 -104604 -194718 89799 -33965
11107a69153f7752D5421a02024m4873G210J71916B8715J97020F9739a16318C55675
$$ -169153 -67752 45421 -102024 -146897 7210 179126 28715 225735 69739 -116318 355675
11095C29001a23108A80223n5591M84812D4254a53055I9649a22589D37023r502
$$ 329001 -123108 180223 124632 609444 44254 -153055 99649 -122589 437023 427521
11085D27521r9499a4757B38067n7667J71660K05939l3565A74611n4238j2265b20671
$$ 427521 328022 -14757 238067 180400 352060 557999 524434 174611 120373 108108 -220671
11073C29317m3200j00915o9873L55923A22749L5194J69613L4524m3472J86098
$$ 329317 286117 185202 115329 471252 122749 157943 327556 362080 318608 504706
11063E04706B47433R925q380J78310J02607M6403k53074P2599L47069j31928o2775
$$ 504706 247433 257358 248978 427288 529895 576298 323224 395823 742892 610964 548189
11052E48189K30830r5368J01254P0087k96363m5370L17862l14398M8160N8758
$$ 548189 779019 683651 784905 854992 558629 513259 831121 516723 564883 623641
11042F23641K4051j6071J68921l15239M31061l40218K3597Q1552j08584K29736
$$ 623641 647692 631621 800542 485303 916364 576146 599743 681295 572711 802447
11032H02447l792m049j87830k28600L68669l40074L5094K88161n9j66631K27936
$$ 802447 798655 794606 606776 378176 746845 406771 441865 730026 729967 563336 791272
11021G91272j81868J2180k04526L34342j37301A21705N69293j62969k46976K45339
$$ 791272 609404 621584 417058 751400 614099 121705 690998 528029 281053 526392
11011E26392k02850M03285j45093N3296k00485J67257j83425j78608q0032N79817
$$ 526392 323542 726827 581734 635030 434545 601802 418377 239769 159737 739554
11001G39554k97785J07033J60027k53396L15883o5663B71185K69658j41639L62177
$$ 739554 441769 548802 708829 455433 771316 705653 271185 540843 399204 761381
10991G61381J84745k10921K4326L21663r37l39228K60616n341J50203p1685j72106
$$ 761381 946126 735205 759531 1081194 1080257 741029 1001645 996304 1146507 1074822 902716
10980I02716N22556j15651J46708j0465J36112M07520K13567L63045j96098J31308
$$ 902716 1425272 1309621 1456329 1445864 1581976 1989496 2203063 2566108 2370010 2501318
10970B501318j20977K06556k10524m47483j68066Q8593k85270j77932K66029m73423
$$ 2501318 2380341 2586897 2376373 1928890 1760824 1849417 1564147 1386215 1652244 1178821
10960A178821K87563k1280k66891J96101J22652j99587n6842j85782j61160L1198
$$ 1178821 1466384 1445104 1178213 1374314 1496966 1297379 1240537 1054755 893595 924793
10950I24793j32552j00820p880B08588M10343j75468B03921E5896K6984N30651
$$ 924793 792241 691421 683541 208588 618931 443463 203921 55896 82880 613531
10940F13531A36149E3558J63684O9539F7687B3384a67282O4045A49905J1246a74815
$$ 613531 136149 53558 217242 286781 67687 23384 -167282 -103237 149905 161151 -174815
10928h4968A84089a49833c730j0536A97358b30293D9116R3580a56724A91741f4093
$$ -84968 184089 -149833 -3730 -14266 197358 -230293 49116 142696 -156724 191741 -64093
10916b10486O8799L8089M7584H2566n362h5571D92221a66608O9274B9544J04143
$$ -210486 -141687 -103598 -56014 82566 77204 -85571 492221 -166608 -97334 29544 133687
10905A33687a91576Q7475B17653p3651a46097K8258I9828J45658E4729M5587a6127
$$ 133687 -191576 -104101 217653 144002 -146097 -117839 99828 245486 54729 100316 -16127
10893A54276Q455m6873i80A58585h8394j12220A21873c36731A37736K5909o3769
$$ 154276 162731 115858 -980 158585 -88394 -200614 121873 -336731 137736 163645 99876
10882I9876l8436K56191a16102c9174o0070A7136a30859K6179I1727P5641H2158
$$ 99876 61440 317631 -116102 -39174 -99244 17136 -130859 -104680 91727 167368 82158
10870a2811k58075i5660K3609B01662b32227c6624A85907a50368P1353o9451b7704
$$ -12811 -270886 -95660 -72051 201662 -232227 -36624 185907 -150368 -79015 -148466 -27704
10858a96224i633H7654K8826K9877q881b71362A36332h1269j0206A57683J40185
$$ -196224 -9633 87654 116480 146357 137476 -271362 136332 -81269 -91475 157683 297868
10847B97868d8205k87960A21619i9701C1201b65396A64776n9252c7034B50808
$$ 297868 -48205 -336165 121619 -99701 31201 -265396 164776 105524 -37034 250808
10836H2738c4597j05164C03839d29368R8124b6509A51372E3694K91609e0306A65714
$$ 82738 -34597 -139761 303839 -429368 -331244 -26509 151372 53694 345303 -50306 165714
10824F7895a23289L3289C4345J26667c81251h820q6068q6511e2087j42851G0745
$$ 67895 -123289 -90000 34345 161012 -381251 -8820 -94888 -181399 -52087 -194938 70745
10812i6329H297N2855a30658A4060K06932c006A87422k4445N2030e9j9058A4287
$$ -96329 8297 61152 -130658 14060 220992 -3006 187422 162977 215007 -59 -19117 14287
10799c79625h687q6235C8890a50941D10550c9546B87072D193a66388e7893n3350
$$ -379625 -8687 -94922 38890 -150941 410550 -39546 287072 4193 -166388 -57893 -111243
10788a11243K0539A24049a14871J0714n738a1412j39263I5187d5081l0248j23500
$$ -111243 -90704 124049 -114871 -104157 -109895 -11412 -150675 95187 -45081 -75329 -198829
10777a98829f970B12339E3383a73993D8762d6235k66051a762l05872I3926L8506
$$ -198829 -6970 212339 53383 -173993 48762 -46235 -312286 -1762 -307634 93926 132432
10766A32432c04349J21663l3278K5079C35243E5859b04780n4047b4510l0030I2016
$$ 132432 -304349 -182686 -215964 -190885 335243 55859 -204780 -258827 -24510 -54540 92016
10754A2782J61760b10764A1748J18766f5515m1631D4385b27502o0225B7858g7938
$$ 12782 174542 -210764 11748 130514 -65515 -107146 44385 -227502 -287727 27858 -77938
10742A85944j4091a41704I7727a04727j75627i2950F9943b56407R4946A11933
$$ 185944 171853 -141704 97727 -104727 -280354 -92950 69943 -256407 -161461 111933
10731a48614g0590j81960B9585a73541B82615d561m59219J13761J58626d8116
$$ -148614 -70590 -252550 29585 -173541 282615 -4561 -463780 -350019 -191393 -48116
10720b87999Q2461A34863Q1327a20415F830a3503l53142g2672P46H3788b74768
$$ -287999 -205538 134863 216190 -120415 6830 -13503 -366645 -72672 -71926 83788 -274768
10708a28354G7231b08132A10428K17838b84696J9574D5002f5896k23213B34808
$$ -128354 77231 -208132 110428 328266 -284696 -265122 45002 -65896 -289109 234808
10697H0248K66936C2728g3300j60504J00851A3593b12508c8231k97388a41614
$$ 80248 347184 32728 -73300 -233804 -132953 13593 -212508 -38231 -335619 -141614
10686g489l1677l5129k15428J29776F9905b67757e8541n9328F3626a30835j44504
$$ -7489 -39166 -74295 -289723 -159947 69905 -267757 -58541 -117869 63626 -130835 -275339
10675b75339C6058i6509h80r2814j31441A43651b82634E8956a281A15516e5091
$$ -275339 36058 -96509 -880 -93694 -225135 143651 -282634 58956 -1281 115516 -55091
10663d04095B05358I853i3089c6210A21453h7010j63615E2218g8573j85684J03489
$$ -404095 205358 9853 -93089 -36210 121453 -87010 -250625 52218 -78573 -264257 -160768
10652a60768d4277k38275d4067o6091l8454l88758c5890a7930r9512l3332m7502
$$ -160768 -44277 -282552 -44067 -110158 -148612 -537370 -35890 -17930 -117442 -150774 -198276
10641a98276d8295o9993C8543c833j16944b8307C8571R0218k7123C9345K05542
$$ -198276 -48295 -118288 38543 -3833 -120777 -28307 38571 128789 101666 39345 244887
10630B44887a94217N8430H6902a83524j72069A76522h4818F0816B1085b03605
$$ 244887 -194217 -135787 86902 -183524 -355593 176522 -84818 60816 21085 -203605
10619i4632j2805j34140A41987c46575Q5274g516A83257b9891C79845b28784i9895
$$ -94632 -107437 -241577 141987 -346575 -261301 -7516 183257 -29891 379845 -228784 -99895
10607f5259j76610B526c10150M2778C7295c38552J26941G0891a02003j10129B48507
$$ -65259 -241869 2526 -310150 -267372 37295 -338552 -211611 70891 -102003 -212132 248507
10595a4496n5570a4378A16374D8514R5821a02211j24171C7863d4309k69337M593
$$ -14496 -70066 -14378 116374 48514 144335 -102211 -226382 37863 -44309 -313646 -309053
10584c09053f157A58344b05810A3823J8916J00856Q0879e6640l90864A46149B9966
$$ -309053 -6157 158344 -205810 13823 32739 133595 214474 -56640 -447504 146149 29966
10572D4503K22591i6714n3473A7410J33560k6038E4171L6430b13586o7502c3451
$$ 44503 267094 -96714 -150187 17410 150970 124932 54171 90601 -213586 -281088 -33451
10560c30762A88893e4425G5687J05295c74394A37226a51072k8708c1321j64098
$$ -330762 188893 -54425 75687 180982 -374394 137226 -151072 -179780 -31321 -195419
10550a95419A64683a61801B4002a31181d5046C69309B5371J35694a67726k8167
$$ -195419 164683 -161801 24002 -131181 -45046 369309 25371 161065 -167726 -195893
10540a95893D5253b04757r674B1192J43922h9586A83658a36751r068M804H9083
$$ -195893 45253 -204757 -214431 21192 165114 -89586 183658 -136751 -145819 -141015 89083
10528b13907A34017I651a45582k25974C38288A58543o0386k8783A9090c37894
$$ -213907 134017 9651 -145582 -371556 338288 158543 98157 69374 19090 -337894
10517e4841j70639A12661K92336A07499b82626B73535A9118c40585A40493m9132
$$ -54841 -225480 112661 404997 107499 -282626 273535 19118 -340585 140493 91361
10507I1361a02039A35936b19504p3176B33208d03761B91940b77620G6616e5004
$$ 91361 -102039 135936 -219504 -292680 233208 -403761 291940 -277620 76616 -55004
10496A74019C9128e0959C6092J50366C576J23497d2028m3561a2075q7060D1711
$$ 174019 39128 -50959 36092 186458 3576 127073 -42028 -85589 -12075 -99135 41711
10484A80212a64877A49406K19087q1409c9843C59990h5692q3382P1385A00165
$$ 180212 -164877 149406 368493 287084 -39843 359990 -85692 -169074 -97689 100165
10473h4322g532p5083C35720d67278A02938a28681a4047B637c3571A13329l9382
$$ -84322 -7532 -82615 335720 -467278 102938 -128681 -14047 2637 -33571 113329 73947
10462G3947K8133a10498k21176a53523B93956l6624C2088e3305B38263c5030F6380
$$ 73947 102080 -110498 -331674 -153523 293956 257332 32088 -53305 238263 -35030 66380
10450A31370B2159c14115h3164I2801j3324l3731M3117a447j74825K5851A85023
$$ 131370 22159 -314115 -83164 92801 79477 45746 88863 -1447 -176272 -150421 185023
10438h3681E3945b33090A52866e1335B82372a57020a7108p4793C75502h2258J9551
$$ -83681 53945 -233090 152866 -51335 282372 -157020 -17108 -91901 375502 -82258 -62707
10427f2707B19080a38926I9023J26555O0688D7145b40578M2723c5783j43785j84733
$$ -62707 219080 -138926 99023 225578 286266 47145 -240578 -197855 -35783 -179568 -364301
10416c64301F6670a80640e7257j59763l68027d6321j07658A25537a26172A17523
$$ -364301 66670 -180640 -57257 -217020 -585047 -46321 -153979 125537 -126172 117523
10405B0748i6032c0816D9953J088d2619I9070B1071P4662N6961J05388m4185R1618
$$ 20748 -96032 -30816 49953 51041 -42619 99070 21071 95733 152694 258082 213897 305515
10393C05515b0529l548B14016G8527j0776F271Q7977J12715J15523L1553F9827
$$ 305515 -20529 -24077 214016 78527 67751 6271 94248 206963 322486 354039 69827
10381A99721q8253R1334n367A4815Q9189K94755A36555K28847E9863Q7756K06211
$$ 199721 111468 202802 197435 14815 104004 398759 136555 365402 59863 147619 353830
10370C53830G4918N03363k79543A10470J70913J49950L163B03036J06490L4350
$$ 353830 74918 578281 298738 110470 281383 431333 434496 203036 309526 343876
10360C43876j28391M4102m7665K6478a12084A57201l905o6307a13000F52750L6612
$$ 343876 215485 259587 211922 238400 -112084 157201 153296 86989 -113000 652750 689362
10349F89362j79544j41633A09813J07115A4080L72026n8555I951K19610J03733
$$ 689362 509818 368185 109813 216928 14080 386106 327551 9951 229561 333294
10339C33294a84716B15175k4658o1366a6663E66639B78261C847R6500J30392a42608
$$ 333294 -184716 215175 190517 129151 -16663 566639 278261 3847 100347 230739 -142608
10327F9176c48556a19629A51039F8920J76134J2676p7349j8212a59059A14065
$$ 69176 -348556 -119629 151039 68920 245054 257730 180381 162169 -159059 114065
10316B36043m1631G7293F167k483J99000J18539E0876j2826a08818G658b11759
$$ 236043 194412 77293 6167 3684 202684 321223 50876 38050 -108818 7658 -211759
10304D15288A38153K15971c23464C8216E024J29354L31556B29733b03221c7158
$$ 415288 138153 354124 -323464 38216 5024 134378 465934 229733 -203221 -37158
10293a61854b6437I0187a00670m3660m6108j59116g6424H5267c24383A6448L25612
$$ -161854 -26437 90187 -100670 -144330 -190438 -349554 -76424 85267 -324383 16448 342060
10282C42060d1168A44845b2043q9550A31297D6706b02766A60987n1871b40949
$$ 342060 -41168 144845 -22043 -111593 131297 46706 -202766 160987 109116 -240949
10271h754k92818A66984c5132q421e925C48035h7277m66q697D30626k08501n1767
$$ -8754 -301572 166984 -35132 -43553 -5925 348035 -87277 -87743 -96440 430626 222125 170358
10259A70358O92508c8988C02570e6718B81924B7792c7791j33071C33993b26744
$$ 170358 862866 -38988 302570 -56718 281924 27792 -37791 -170862 333993 -226744
10248D2781J40361b2724j30574j54246B51058m5259H4572B8521J57970i2756A14805
$$ 42781 183142 -22724 -153298 -307544 251058 205799 84572 28521 186491 -92756 114805
10236a07412A89741a72944A17418a50410P1556p2332C26937m3063c31130f7953
$$ -107412 189741 -172944 117418 -150410 -78854 -151186 326937 283874 -331130 -67953
10225b90469A78510D9845h2786L4637A54395c73266a31864j39565a04835k23454
$$ -290469 178510 49845 -82786 -48149 154395 -373266 -131864 -271429 -104835 -328289
10215c28289g5453m7442k88749a33623r4k71497e8122A0807a13070A45036a05993
$$ -328289 -75453 -122895 -411644 -133623 -133717 -405214 -58122 10807 -113070 145036 -105993
10203G7950b30383a09531j8977j14318F1898a76538j03502P5633b469k33912G0037
$$ 77950 -230383 -109531 -128508 -242826 61898 -176538 -280040 -204407 -2469 -236381 70037
10191A89331d00249h1153C13174b18034A1823b80315Q172B41645a22073E6076
$$ 189331 -400249 -81153 313174 -218034 11823 -280315 -272143 241645 -122073 56076
10180b08243A90270a73241P9473j56967A6225d57827R4415G9124b20411K1495
$$ -208243 190270 -173241 -93768 -250735 16225 -457827 -363412 79124 -220411 -198916
10170a98916d889E9761d2434q8867k0436L4058a1885j70420A72690a96144j82809
$$ -198916 -4889 59761 -42434 -131301 -151737 -117679 -11885 -182305 172690 -196144 -378953
10159c78953Q6154A14277b44989l6944c5655J4664F0546i1816K105p7322G8197
$$ -378953 -292799 114277 -244989 -281933 -35655 -20991 60546 -91816 -89711 -167033 78197
10147b64071e8864p67j12009j41083j65841d0540C96951a38925A9820a77379A90076
$$ -264071 -58864 -59631 -171640 -312723 -478564 -40540 396951 -138925 19820 -177379 190076
10135E8521b82851a19190A28099c66487a05390j48223i9126r766j67019A89479
$$ 58521 -282851 -119190 128099 -366487 -105390 -253613 -99126 -108892 -275911 189479
10124b8620i873k73716J09408k60952i717j29719k97893c371j51295H0533b74579
$$ -28620 -9873 -283589 -174181 -435133 -9717 -139436 -437329 -3371 -154666 80533 -274579
10112a62127D3400J40712b66183J24292e3131k82002A37109m3903a64376o0934
$$ -162127 43400 184112 -266183 -141891 -53131 -335133 137109 93206 -164376 -225310
10102b25310g8748L752A62555o7361h4333i811j74569k9584G6790g8244n7620
$$ -225310 -78748 -74996 162555 95194 -84333 -9811 -184380 -213964 76790 -78244 -135864
10091a35864e7590n9441N7974j87791d7903l2752C9226K69949j38616g1857J4828
$$ -135864 -57590 -117031 -59057 -246848 -47903 -80655 39226 309175 170559 -71857 -57029
10080e7029G3304e48425e2910A8084b10195c77E6699j3014K1645a68984o7429
$$ -57029 73304 -548425 -52910 18084 -210195 -377 56699 43685 65330 -168984 -236413
10069b36413b3161A11110D1686j0961c65146A17502j9116a87279A26148e9168
$$ -236413 -23161 111110 41686 30725 -365146 117502 98386 -187279 126148 -59168
10058a39524j03630i9834A07352a31928b5010p6497j1634A0781J11458c47775
$$ -139524 -243154 -99834 107352 -131928 -25010 -101507 -113141 10781 122239 -347775
10047a56656k02248I474N5530a3926j6416A35466a70909P9782c7698o3702A78721
$$ -156656 -358904 9474 65004 -13926 -30342 135466 -170909 -91127 -37698 -101400 178721
10035a32035j29965J02581b6541j17201B6210a5619j53352C833J24400b3388m3180
$$ -132035 -262000 -159419 -26541 -143742 26210 -15619 -168971 3833 128233 -23388 -66568
10024f6568o9196H2778J8364j9351K216j9849L9709k0384c2075B55149a86300
$$ -66568 -135764 82778 101142 81791 84007 64158 103867 83483 -32075 255149 -186300
10012B9667a03592A37400k3070b80784a03371A20669a63074m5271j47378A699
$$ 29667 -103592 137400 114330 -280784 -103371 120669 -163074 -208345 -355723 1699
10001A20847b92284J08725L6603C11899a74212B7714K0536R0778E7293c85003
$$ 120847 -292284 -183559 -146956 311899 -174212 27714 48250 139028 57293 -385003
9990E4010O3665O241m7547E823d33071a91080A05412K42483G576f5901G1382O9864
$$ 54010 117675 123916 76369 5823 -433071 -191080 105412 347895 7576 -65901 71382 141246
9978A41246b54552h2869A62404F0918e11357F9445P677a25743b4576m668o7540
$$ 141246 -254552 -82869 162404 60918 -511357 69445 77122 -125743 -24576 -29244 -96784
9967i6784k40631B41451A6883c37571A92239a4710l45798C16460D2666a63571
$$ -96784 -337415 241451 16883 -337571 192239 -14710 -360508 316460 42666 -163571
9956b34232A42337A214J22832a8564l61512O6304J07946l20603b62877G3317g7545
$$ -234232 142337 1214 124046 -18564 -380076 -313772 -205826 -526429 -262877 73317 -77545
9944h9998a9935j14568m8772m55193g5224A53032a92102l721P7486h527F707b36397
$$ -89998 -19935 -134503 -183275 -638468 -75224 153032 -192102 -195823 -118337 -8527 6707 -236397
9931a38853j70251h0551j88823C37691c47701J15479J06882i812k98388d6721
$$ -138853 -309104 -80551 -269374 337691 -347701 -232222 -125340 -9812 -308200 -46721
9920a37398l4251B6242a45557C13625c21830Q7449e7179A27090b78984J30025
$$ -137398 -171649 26242 -145557 313625 -321830 -234381 -57179 127090 -278984 -148959
9910a48959I310h8389p2646l52361a62346j32376D8344a98270Q8881o0023J1121
$$ -148959 9310 -88389 -161035 -513396 -162346 -294722 48344 -198270 -109389 -169412 -158291
9899a58291e6826k35966B2094a77638d038o712m3638E5270c46435a15138M0749
$$ -158291 -56826 -292792 22094 -177638 -4038 -10750 -54388 55270 -346435 -115138 -74389
9888g4389j2443A27363a10861F9953C0833a59573j39840i1485l3556C9908J24880
$$ -74389 -86832 127363 -110861 69953 30833 -159573 -299413 -91485 -125041 39908 164788
9877A64788D8478J34237b7739j21793A32963b48619d2043l83508K12675E8557
$$ 164788 48478 182715 -27739 -149532 132963 -248619 -42043 -425551 -212876 58557
9866C17572b03134A26626b1728k4911r5619D2110e8960J4270j79572F6443b79720
$$ 317572 -203134 126626 -21728 -46639 -142258 42110 -58960 -44690 -224262 66443 -279720
9854a1655K897j56102d0153D2106a95542c5843A0979J45316c76537l7517J86048
$$ -11655 -8758 -164860 -40153 42106 -195542 -35843 10979 156295 -376537 -414054 -228006
9843b28006A5492c76334A09476a28352A02387a74026M0056E9414O9268C1610c6383
$$ -228006 15492 -376334 109476 -128352 102387 -174026 -133970 59414 128682 31610 -36383
9831C2901J39935d09313f0352G3409b70579e3684m7278M9129J5339A67413e8460
$$ 32901 172836 -409313 -60352 73409 -270579 -53684 -100962 -51833 -36494 167413 -58460
9819H7969b59110q3814A82903n2678c96078A90420a54701B48191a04680j55767
$$ 87969 -259110 -342924 182903 130225 -396078 190420 -154701 248191 -104680 -260447
9809b60447J20910r7112a01368G71J81404K90617c28100f7917B05645E515h0850
$$ -260447 -139537 -236649 -101368 771 182175 472792 -328100 -67917 205645 5515 -80850
9797c7690j56251a6692j64465K5716O7375A18344a36043A16796a62029h906l72124
$$ -37690 -193941 -16692 -181157 -155441 -88066 118344 -136043 116796 -162029 -8906 -381030
9786c81030j10783a21682j79852J07580f9682k8290q812n3194G7187a72320D2894
$$ -381030 -491813 -121682 -301534 -193954 -69682 -97972 -106784 -159978 77187 -172320 42894
9774a52955g4575n3337a5917j52356M6741j27141l148C6379c13361A26403a15574
$$ -152955 -74575 -127912 -15917 -168273 -121532 -248673 -251821 36379 -313361 126403 -115574
9762b29860D2720L9908b32880q3271E0936c10000N8338F6776a43650a9433l490
$$ -229860 42720 82628 -232880 -316151 50936 -310000 -251662 66776 -143650 -19433 -22923
9751b2923C84258b31765J8924A15097h6852j66013H445b04518a9640l94362J18896
$$ -22923 384258 -231765 -212841 115097 -86852 -252865 8445 -204518 -19640 -414002 -295106
9740b95106D3525b00861D6755K6443a1290j9625B37553c15909A2302J40413a15348
$$ -295106 43525 -200861 46755 73198 -11290 -30915 237553 -315909 12302 152715 -115348
9728A62181c2629l22681g5187A02544C5677J0154a34816j58873h9964C8853M8717
$$ 162181 -32629 -355310 -75187 102544 35677 45831 -134816 -293689 -89964 38853 87570
9717H7570c34349a40355B12227B9735b70528g5878l0673g399B10607b22634g6738
$$ 87570 -334349 -140355 212227 29735 -270528 -75878 -106551 -7399 210607 -222634 -76738
9705a45454l344B20510f0735n4889o6785k0093e2978E3819J3027A6919a8240k395
$$ -145454 -148798 220510 -60735 -115624 -182409 -202502 -52978 53819 66846 16919 -18240 -20635
9693b0635B3157d2037H4050D0401J67222q3635J46949I6793a27715e6123k52138
$$ -20635 23157 -42037 84050 40401 207623 123988 270937 96793 -127715 -56123 -308261
9682c08261F5046J39024b41236i4711A38633d03068A28359f2747K0929k02604
$$ -308261 65046 204070 -241236 -94711 138633 -403068 128359 -62747 -41818 -244422
9672b44422d4719B34358A1927o13Q2897a50141A57815a23676N9011k16912g0066
$$ -244422 -44719 234358 11927 11314 94211 -150141 157815 -123676 -64665 -281577 -70066
9660b00813B51056E6767K1952N1689R2021j07726K72982h1284j02438q5416d141
$$ -200813 251056 56767 78719 130408 222429 114703 387685 -81284 -183722 -269138 -4141
9648a6332A28443d07806I4372c33448I4256O5576g19j26682o9596A7063a27266
$$ -16332 128443 -407806 94372 -333448 94256 159832 -719 -127401 -196997 17063 -127266
9636b8569k1443A13875m2809i9068B87046a82806M0605J6021p8175A09256R7260
$$ -28569 -50012 113875 71066 -99068 287046 -182806 -142201 -126180 -204355 109256 206516
9625B06516d3429l54140j9052G7868f9508q0418b4762k23611A60249f53749e0679
$$ 206516 -43429 -397569 -416621 77868 -69508 -149926 -24762 -248373 160249 -653749 -50679
9613B46200b13657R3332G7080i9031A90793b45045h2230p278H19h4282C32733
$$ 246200 -213657 -120325 77080 -99031 190793 -245045 -82230 -89508 819 -84282 332733
9601B9262e6459a543D1054L003a44318L8123j37816P056F7257P042c81689B16632
$$ 29262 -56459 -1543 41054 44057 -144318 -106195 -244011 -236955 67257 74299 -381689 216632
9588c2838A23066a58298f7610k20565f2810B81162l4920c98687G3018K8490A5766
$$ -32838 123066 -158298 -67610 -288175 -62810 281162 246242 -398687 73018 101508 15766
9576I6113a3701j7063o3876m9606f8228A52767D4769e4418q6444A3893b81562
$$ 96113 -13701 -30764 -94640 -144246 -68228 152767 44769 -54418 -140862 13893 -281562
9564F6559d02810A1919g9530P159k07697J18447p4293c1958k56771N2605A3987
$$ 66559 -402810 11919 -79530 -72371 -280068 -161621 -235914 -31958 -288729 -236124 13987
9552i665A56971P0202a9818l5818G9997a95544D5194k1620J04286a98745l8697
$$ -9665 156971 227173 -19818 -55636 79997 -195544 45194 23574 127860 -198745 -237442
9541b37442j69626A75650a20387g225k56483e2631F3275J13118b0974l66845a52813
$$ -237442 -407068 175650 -120387 -7225 -263708 -52631 63275 176393 -20974 -387819 -152813
9529e42451A3488a68859c6210m0223p4576M6363l7004j66639B30150b5883I8797
$$ -542451 13488 -168859 -36210 -76433 -151009 -104646 -141650 -308289 230150 -25883 98797
9517A3776e68557E0390a63528J6690k45207o8479f2741j60751B48220b53091N8166
$$ 13776 -568557 50390 -163528 -146838 -392045 -460524 -62741 -223492 248220 -253091 -194925
9506a94925h2784j08824A7044d5138f814k74350B40527c69490A7218J40646A2751
$$ -194925 -82784 -191608 17044 -45138 -6814 -281164 240527 -369490 17218 157864 12751
9494a32551D583L1077b97336e0949p3357A62003p5414a60320M6175i968k48740
$$ -132551 4583 35660 -297336 -50949 -124306 162003 86589 -160320 -114145 -9968 -258708
9483b58708a21188d8977a654j01932n8884N5432K0322A11048b01630b0664A70616
$$ -258708 -121188 -48977 -1654 -103586 -162470 -107038 -86716 111048 -201630 -20664 170616
9471B92409B7687c0956k86569a22391B15075F9137B1338c76394J58486b9786j32770
$$ 292409 27687 -30956 -317525 -122391 215075 69137 21338 -376394 -217908 -29786 -162556
9460a62556e6618G2329a52415f0323F2490R841b44642e4093J5785j5804G0713
$$ -162556 -56618 72329 -152415 -60323 62490 72331 -244642 -54093 -38308 -54112 70713
9448A21617a16977k7859j29459j62957A25859K1769a94422L529O3564M047m5703
$$ 121617 -116977 -144836 -274295 -437252 125859 147628 -194422 -190893 -127329 -123282 -168985
9437a68985J6146a2506A36781k029B4294c82213J25360a17597n3045C50307a37723
$$ -168985 -152839 -12506 136781 134752 24294 -382213 -256853 -117597 -170642 350307 -137723
9425h2489l53997a06662J9002D3897h1830L1914K43G3936f57643a97787R1804
$$ -82489 -436486 -106662 -87660 43897 -81830 -49916 -49673 73936 -657643 -197787 -105983
9414a05983A6499e3791j21409A41949k8216A1447a24827A3840g3833C4762O8969
$$ -105983 16499 -53791 -175200 141949 113733 11447 -124827 13840 -73833 34762 103731
9403A03731M4162G2022a9553j55193O3112G2912d8188k6360B32112a90035f3450
$$ 103731 147893 72022 -19553 -174746 -111634 72912 -48188 -74548 232112 -190035 -63450
9391C8295a70896A86833F0774b42666B04812n9020J36448H9844B517b7589m72610
$$ 38295 -170896 186833 60774 -242666 204812 145792 282240 89844 2517 -27589 -500199
9380e00199A5430b32874j29720B85025b98848E7389J01327a4331o7040j71396
$$ -500199 15430 -232874 -362594 285025 -298848 57389 158716 -14331 -81371 -252767
9370b52767B21035b90096c4370r0537E1391b32589C5341g5756l5532o7971A33048
$$ -252767 221035 -290096 -34370 -124907 51391 -232589 35341 -75756 -111288 -179259 133048
9358A4121b24007K3007Q5486N4224J063q7444j36658A3925b50217E2328b9153
$$ 14121 -224007 -201000 -115514 -61290 -60227 -147671 -284329 13925 -250217 52328 -29153
9346A61217a77446r3869A48780B5292f6808F9518P8802a93959k71194a75995j89580
$$ 161217 -177446 -271315 148780 25292 -66808 69518 148320 -193959 -465153 -175995 -365575
9335c65575c1797B17738a80302h6882k67814f6778j13361B01227e1354k01679
$$ -365575 -31797 217738 -180302 -86882 -354696 -66778 -180139 201227 -51354 -253033
9325b53033d8436A5767b01632A80933o6354A6262b48629J06880c7672p7939o2825
$$ -253033 -48436 15767 -201632 180933 114579 16262 -248629 -141749 -37672 -115611 -178436
9314a78436H8514J22161b54765N6114F7504b42016m7787I111A784c47175B2868
$$ -178436 88514 210675 -254765 -198651 67504 -242016 -289803 9111 1784 -347175 22868
9302a52794H69c14718A83809d04309g7654B32736O7770a4498j64500f1765q6078
$$ -152794 869 -314718 183809 -404309 -77654 232736 300506 -14498 -178998 -61765 -147843
9291a47843F4597b7119A55111b0856j71569j0994A03306j1190b97772J8835A72540
$$ -147843 64597 -27119 155111 -20856 -192425 -203419 103306 92116 -297772 -278937 172540
9279D8434A8699A829b86580J23415r1196A24637a74340A37636g5560E142d13448
$$ 48434 18699 1829 -286580 -163165 -254361 124637 -174340 137636 -75560 5142 -413448
9267C2517J3935c18264F9087O1041o0586J95511g0509k2879j1984b9752q7700
$$ 32517 46452 -318264 69087 130128 69542 265053 -70509 -93388 -105372 -29752 -117452
9256a17452e2475j6766B09098h0769I2393a24521J1486H6989C3763c45569G4847
$$ -117452 -52475 -69241 209098 -80769 92393 -124521 -113035 86989 33763 -345569 74847
9244a7330j22946B4351f4851B11513p7776a64000d925j59674j98137a77251B30980
$$ -17330 -140276 24351 -64851 211513 133737 -164000 -4925 -164599 -362736 -177251 230980
9232a95261A57005L3034b05032E3095A1660c772C3841c39475C44505f3526K6065
$$ -195261 157005 190039 -205032 53095 11660 -3772 33841 -339475 344505 -63526 -37461
9221c7461A6711i1332A1396i075H5389B7386R9481a17465j72292j36099C99758
$$ -37461 16711 -91332 11396 -9075 85389 27386 126867 -117465 -289757 -425856 399758
9209d9782A9522a11092j48363M238A40998E8400J57521b28527A02346b10292F4089
$$ -49782 19522 -111092 -259455 -255217 140998 58400 215921 -228527 102346 -210292 64089
9197F0748j8849J94018A6002J98094J81625b68183k5734B85419a08534n8750D4986
$$ 60748 41899 235917 16002 214096 395721 -268183 -293917 285419 -108534 -167284 44986
9185b08193E6327J49147a66844I4768c0527l3567l09029A95362r5501a47175k0133
$$ -208193 56327 205474 -166844 94768 -30527 -64094 -373123 195362 99861 -147175 -167308
9174a67308h897A3134a73209M2131C4623a30730f0058A24886j6545B3642a28196
$$ -167308 -8897 13134 -173209 -131078 34623 -130730 -60058 124886 108341 23642 -128196
9162c32860C9414K31390D3756b03856J9210H2674K41926a8299k4966a8083k84213
$$ -332860 39414 270804 43756 -203856 -184646 82674 324600 -18299 -43265 -18083 -302296
9151c02296A20807b28227i9304j90660E6493f5301o903B69985a27412b1282A22371
$$ -302296 120807 -228227 -99304 -289964 56493 -65301 -72204 269985 -127412 -21282 122371
9139c30431O4837Q6502d5509D698J06684O9503h329G7730b96200A15303K9847
$$ -330431 -265594 -179092 -45509 4698 111382 180885 -8329 77730 -296200 115303 145150
9128A45150J15978b77793I5150i3921d6178A72158c0724r0896G8090a41336F0955
$$ 145150 261128 -277793 95150 -93921 -46178 172158 -30724 -121620 78090 -141336 60955
9116h7442M0263C0307e9030l85350a0087k89608B54900h7103j04776c306k6465
$$ -87442 -47179 30307 -59030 -444380 -10087 -299695 254900 -87103 -191879 -3306 -29771
9105b9771B3262K12091a34870e228A11943b66653F9310c16557A2046a29627c4899
$$ -29771 23262 235353 -134870 -5228 111943 -266653 69310 -316557 12046 -129627 -34899
9093b68588C6923f640B12937d01125a54903j36675D2289f1891o3360A42234b37487
$$ -268588 36923 -6640 212937 -401125 -154903 -291578 42289 -61891 -125251 142234 -237487
9081B05501a33669K115A74771e8549A60505a89790b2575k3841j5700B60509c06190
$$ 205501 -133669 -131554 174771 -58549 160505 -189790 -22575 -46416 -62116 260509 -306190
9069E3996a93980B9072g4797a533j71736j1233C73055A18020b73637O1454g1239
$$ 53996 -193980 29072 -74797 -1533 -173269 -184502 373055 118020 -273637 -212183 -71239
9057E9637b74399P1128j10734G1131M763b67033B33768a75258A71850d0370A22568
$$ 59637 -274399 -203271 -314005 71131 75894 -267033 233768 -175258 171850 -40370 122568
9045a78101b4730A10248c1948B26499a66242k62160a65692K7503a8580B29997
$$ -178101 -24730 110248 -31948 226499 -166242 -428402 -165692 -138189 -18580 229997
9034b37009g1493b9730j82992B205J70422P1747c252k96026D1410d1301G0142
$$ -237009 -71493 -29730 -212722 2205 172627 244374 -3252 -299278 41410 -41301 70142
9022C7711J98249b43943G3182J12256f7604j3098q267d0026c02j11631j38820
$$ 37711 235960 -243943 73182 185438 -67604 -80702 -88969 -40026 -302 -111933 -250753
9011b50753a12636C03277A21538b21948N5281A5435a71755I1486a82072c5966
$$ -250753 -112636 303277 121538 -221948 -166667 15435 -171755 91486 -182072 -35966
9000B20372a20041q113b176j71685j42278B13322n4875b58822d1903r1086d2845
$$ 220372 -120041 -128154 -2176 -173861 -316139 213322 158447 -258822 -41903 -132989 -42845
8988c63727Q2207E0396M2465b91048G536K44240B8886e8334J2336j49877A31096
$$ -363727 -281520 50396 92861 -291048 7536 251776 28886 -58334 -45998 -195875 131096
8976a01025o5070k68482a555B24143c1963a1795k5538o7630d5305k01588J716
$$ -101025 -166095 -434577 -1555 224143 -31963 -11795 -37333 -104963 -45305 -246893 -245177
8965b45177B0117O219c08022f2802p9745A2108P4085a79389a7344F6014B9358
$$ -245177 20117 26336 -308022 -62802 -142547 12108 86193 -179389 -17344 66014 29358
8953A15458b66261C72638a47216B00326a87353B05733a58393o1969A5358Q3667
$$ 115458 -266261 372638 -147216 200326 -187353 205733 -158393 -220362 15358 99025
8943I9025M9848g7797Q575E802b04606B13899C5663K28779O6372n403j27746c72774
$$ 99025 148873 -77797 -69222 5802 -204606 213899 35663 264442 330814 325411 197665 -372774
8930A37320g8955E7618h366A55191C0519K31229K85738J547623N264497O524700
$$ 137320 -78955 57618 -8366 155191 30519 261748 547486 2095109 7359606 13884306
8920A3884306C872670A068247l92653B34395N3759F7487j3528J12542a55720A4413
$$ 13884306 3872670 1068247 675594 234395 288154 67487 53959 166501 -155720 14413
8909C7385J75401K80498j07670h051B67136E934K50889G8052b76361J35728C3491
$$ 37385 212786 493284 385614 -8051 267136 5934 256823 78052 -276361 -140633 33491
8897a65857k1275M5707D0367J92931d7907r0134B45002f2413K9979C9669J00318
$$ -165857 -187132 -141425 40367 233298 -47907 -138041 245002 -62413 -32434 39669 139987
8886A39987J3426o7259r753J26695b40239J2672a10741F4715c35600a61162k939
$$ 139987 153413 86154 76401 203096 -240239 -227567 -110741 64715 -335600 -161162 -164101
8875a64101A06566b87589R2825Q6123l64349a33737l7931A81618e4965h572m8999
$$ -164101 106566 -287589 -194764 -108641 -472990 -133737 -171668 181618 -54965 -8572 -57571
8864e7571A72928c75733A2599a93638A97555c2958n7991A44240i211C7225O9678
$$ -57571 172928 -375733 12599 -193638 197555 -32958 -90949 144240 -9211 37225 106903
$$ [...]
##END NTUPLES=NMR SPECTRUM
##END=
