
##TITLE=AC1345_GUAAH12163_7155106_2wqzkNcoBV
##JCAMPDX= 6.0         $$ Bruker NMR JCAMP-DX V2.0
##DATA TYPE= NMR SPECTRUM
##DATA CLASS= NTUPLES
##ORIGIN= BRUKER
##OWNER= Administrator
$$ 1.72 TOPSPIN		Version 2.1
$$ 2013-01-29 21:31:18.699 -0500  Administrator@X
$$ Compression mode = diff/dup
##.OBSERVE FREQUENCY= 400.02188249412
##.OBSERVE NUCLEUS= ^1H
##.ACQUISITION MODE= SIMULTANEOUS (DQD)
##.ACQUISITION SCHEME= undefined
##.AVERAGES= 8
##.DIGITISER RES= 22
##SPECTROMETER/DATA SYSTEM= spect
##.PULSE SEQUENCE= zg30
##.SOLVENT NAME= COFFEE_meoh
##.SHIFT REFERENCE= INTERNAL, COFFEE_meoh, 1, 14.98509
##AUDIT TRAIL= $$ (NUMBER, WHEN, WHO, WHERE, PROCESS, VERSION, WHAT)
$$ ##TITLE= Audit trail, TOPSPIN		Version 2.1
$$ ##JCAMPDX= 5.01
$$ ##ORIGIN= Bruker BioSpin GmbH
$$ ##OWNER= Administrator
$$ $$ E:\/data/COFFEE/nmr/AC1345_GUAAH12163_7155106_2wqzkNcoBV/20/pdata/1/auditp.txt
$$ ##AUDIT TRAIL=  $$ (NUMBER, WHEN, WHO, WHERE, PROCESS, VERSION, WHAT)
(   1,<2013-01-29 21:31:10.543 -0500>,<Administrator>,<X>,<go>,<TOPSPIN 2.1>,
      <created by zg
	started at 2013-01-29 21:30:03.308 -0500,
	POWCHK enabled, PULCHK disabled,
       configuration hash MD5:
       86 BA 57 50 F2 9D 5C 9B 26 00 A9 28 5F 66 2E 89
       data hash MD5: 64K
       C0 E5 E2 CF 45 C2 5D 33 6F 6D 82 04 62 52 82 BE>)
(   2,<2013-01-29 21:31:13.589 -0500>,<Administrator>,<X>,<proc1d>,<TOPSPIN 2.1>,
      <Start of raw data processing
       efp LB = 0 FT_mod = 6 PKNL = 1 PHC0 = 0 PHC1 = 0 SI = 32K 
       data hash MD5: 32K
       05 CD F0 B3 09 B4 22 02 F6 82 12 59 ED EF 1A CD>)
(   3,<2013-01-29 21:31:14.074 -0500>,<Administrator>,<X>,<proc1d>,<TOPSPIN 2.1>,
      <pk PHC0 = 100.058 PHC1 = 0 
       data hash MD5: 32K
       EA A7 9F 8B CF 53 8B 14 AD 66 B7 60 67 60 D2 61>)
(   4,<2013-01-29 21:31:14.308 -0500>,<Administrator>,<X>,<proc1d>,<TOPSPIN 2.1>,
      <abs ABSG = 1 
       data hash MD5: 32K
       53 F2 9E 75 2E 85 5F 48 7B D1 F4 10 B8 CF DC 0E>)
(   5,<2013-01-29 21:31:14.449 -0500>,<Administrator>,<X>,<proc1d>,<TOPSPIN 2.1>,
      <abs ABSG = 2 
       data hash MD5: 32K
       9D F5 DB 5A EF E9 43 30 86 75 79 E6 6A 40 7F FB>)
(   6,<2013-01-29 21:31:14.589 -0500>,<Administrator>,<X>,<proc1d>,<TOPSPIN 2.1>,
      <abs ABSG = 3 
       data hash MD5: 32K
       BD 48 37 ED 1A 4B 42 23 5B 45 AD FC 00 C8 DE 0D>)
(   7,<2013-01-29 21:31:14.746 -0500>,<Administrator>,<X>,<proc1d>,<TOPSPIN 2.1>,
      <abs ABSG = 4 
       data hash MD5: 32K
       13 BE 2F 4A 24 B6 9F B8 18 FF 25 1C F1 AA 0C D6>)
(   8,<2013-01-29 21:31:14.918 -0500>,<Administrator>,<X>,<proc1d>,<TOPSPIN 2.1>,
      <abs ABSG = 5 
       data hash MD5: 32K
       BD 3D C6 77 A1 D3 BB 1F 86 F8 3E 46 6C 2C 98 78>)
$$ ##END=
$$ 
$$ $$ hash MD5
$$ $$ 3A 3F 70 8B BA CF 12 99 25 45 8D 82 3E 3E 96 C4
##$RELAX= 
##$RELAX= 
##$RELAX= 
##$RELAX= 
##$RELAX= 
##$RELAX= 
##$RELAX= 
$$ Bruker specific parameters
$$ --------------------------
##$DU= <E:\>
##$EXPNO= 20
##$NAME= <AC1345_GUAAH12163_7155106_2wqzkNcoBV>
$$ [...]
##$TP= (0..7)
150 150 150 150 150 150 150 150
##$TP07= 0
##$TPNAME0= <>
##$TPNAME1= <>
##$TPNAME2= <>
##$TPNAME3= <>
##$TPNAME4= <>
##$TPNAME5= <>
##$TPNAME6= <>
##$TPNAME7= <>
##$TPOAL= (0..7)
0.5 0.5 0.5 0.5 0.5 0.5 0.5 0.5
##$TPOFFS= (0..7)
0 0 0 0 0 0 0 0
##$TUNHIN= 0
##$TUNHOUT= 0
##$TUNXOUT= 0
##$USERA1= <user>
##$USERA2= <user>
##$USERA3= <user>
##$USERA4= <user>
##$USERA5= <user>
##$V9= 5
##$VALIST= <valist>
##$VCLIST= <CCCCCCCCCCCCCCC>
##$VD= 0
##$VDLIST= <DDDDDDDDDDDDDDD>
##$VPLIST= <PPPPPPPPPPPPPPP>
##$VTLIST= <TTTTTTTTTTTTTTT>
##$WBST= 1024
##$WBSW= 4
##$XGAIN= (0..3)
0 0 0 0
##$XL= 0
##$YL= 0
##$YMAX_a= 677009
##$YMIN_a= -577297
##$ZGOPTNS= <>
##$ZL1= 120
##$ZL2= 120
##$ZL3= 120
##$ZL4= 120
##$ABSF1= 14.98509
##$ABSF2= -5.573092
##$ABSG= 5
##$ABSL= 3
##$ALPHA= 0
##$AQORDER= 0
##$ASSFAC= 0
##$ASSFACI= 0
##$ASSFACX= 0
##$ASSWID= 0
##$AUNMP= <proc_prof1d_extract_pilot.lims>
##$AXLEFT= 0
##$AXNAME= <>
##$AXNUC= <1H>
##$AXRIGHT= 0
##$AXTYPE= 0
##$AXUNIT= <>
##$AZFE= 0.1
##$AZFW= 0.1
##$BCFW= 0
##$BC_mod= 0
##$BYTORDP= 0
##$COROFFS= 0
##$CY= 15
##$DATMOD= 1
##$DC= 0
##$DFILT= <>
##$DTYPP= 0
##$F1P= 0
##$F2P= 0
##$FCOR= 0.5
##$FTSIZE= 32768
##$FT_mod= 6
##$GAMMA= 0
##$GB= 0
##$INTBC= 1
##$INTSCL= 1
##$ISEN= 128
##$LB= 0
##$LEV0= 0
##$LPBIN= 0
##$MAXI= 10000
##$MC2= 0
##$MEAN= 0
##$ME_mod= 0
##$MI= 0
##$NCOEF= 0
##$NC_proc= -8
##$NLEV= 6
##$NOISF1= 0
##$NOISF2= 0
##$NSP= 0
##$NTH_PI= 0
##$NZP= 0
##$OFFSET= 14.98509
##$PC= 1
##$PHC0= 100.058
##$PHC1= 0
##$PH_mod= 1
##$PKNL= yes
##$PPARMOD= 0
##$PPDIAG= 0
##$PPIPTYP= 0
##$PPMPNUM= 2147483647
##$PPRESOL= 1
##$PSCAL= 4
##$PSIGN= 0
##$PYNMP= <proc.py>
##$REVERSE= no
##$SF= 400.02
##$SI= 32768
##$SIGF1= 0
##$SIGF2= 0
##$SINO= 400
##$SIOLD= 32768
##$SPECTYP= <>
##$SREGLST= <1H.CDCl3>
##$SSB= 0
##$STSI= 32768
##$STSR= 0
##$SW_p= 8223.68421052631
##$SYMM= 0
##$S_DEV= 0
##$TDeff= 65536
##$TDoff= 0
##$TI= <>
##$TILT= no
##$TM1= 0
##$TM2= 0
##$TOPLEV= 0
##$USERP1= <user>
##$USERP2= <user>
##$USERP3= <user>
##$USERP4= <user>
##$USERP5= <user>
##$WDW= 1
##$XDIM= 32768
##$YMAX_p= 462827608
##$YMIN_p= -707789
##$CURPLOT= <Network HP LaserJet P1505>
##$CURPRIN= <$Network HP LaserJet P1505>
##$DFORMAT= <normdp>
##$LAYOUT= <+/1D_H.xwp>
##$LFORMAT= <normlp>
##$PFORMAT= <normpl>
##$SURQMSG= 1
$$ End of Bruker specific parameters
$$ ---------------------------------
##NTUPLES= NMR SPECTRUM
##VAR_NAME=  FREQUENCY,     SPECTRUM/REAL,   SPECTRUM/IMAG
##SYMBOL=    X,             R,               I
##VAR_TYPE=  INDEPENDENT,   DEPENDENT,       DEPENDENT
##VAR_FORM=  AFFN,          ASDF,            ASDF
##VAR_DIM=   32768,         32768,           32768
##UNITS=     HZ,            ARBITRARY UNITS, ARBITRARY UNITS
##FACTOR=    0.250966925370066, 1,           1
##FIRST=     8223.43324360094, 52157,        -85382
##LAST=      0,             -168666,         134068
##MIN=       0,             -707789,         0
##MAX=       8223.43324360094, 462827608,    0
$$ Real data points
##PAGE= N=1
##DATA TABLE= (X++(R..R)), XYDATA
$$ [...]
19540a86182F7618a77733j56484E0606O3177M3007n6983c38793J24932A09295
$$ -186182 67618 -177733 -334217 50606 113783 156790 99807 -338793 -213861 109295
19529A45318j3668b42280J01938k72297A19455b31777A05305A6051a12943A75211
$$ 145318 131650 -242280 -140342 -412639 119455 -231777 105305 16051 -112943 175211
19518F5343J11975b49798R8667I4463a92021K0973r5094Q1517g7078A70564C3031
$$ 65343 177318 -249798 -151131 94463 -192021 -171048 -266142 -184625 -77078 170564 33031
19506H3132J7049a39090m7001j80577D2797f76713A74651H7084J46173P121A00057
$$ 83132 100181 -139090 -186091 -366668 42797 -676713 174651 87084 233257 240378 100057
19494C4866b91485L7190a25931a6664j39690j92320C3098b38824h1662F2289b67638
$$ 34866 -291485 -254295 -125931 -16664 -156354 -348674 33098 -238824 -81662 62289 -267638
19482A3673J98275h6621n8897M095A39716a01759L945j86624M4782N0626c2902
$$ 13673 211948 -86621 -145518 -141423 139716 -101759 -97814 -284438 -239656 -189030 -32902
19470a1263A91399O7584I2956d26072F3082b10438M7091R3g070r021o6057l27145
$$ -11263 191399 258983 92956 -426072 63082 -210438 -163347 -163254 -7070 -16091 -82148 -409293
19458d09293A37965l3714J59063F6066j4942b66545f7558j25210H130c9016C89658
$$ -409293 137965 104251 263314 66066 51124 -266545 -67558 -192768 8130 -39016 389658
19446b97681J11337d0098j18084K3672A62952c80180A70852a77110H1839a5798
$$ -297681 -186344 -40098 -158182 -134510 162952 -380180 170852 -177110 81839 -15798
19435b11524K8753D2863c00467P7862i3762A57563K25955d3348i98m6069n8156
$$ -211524 -182771 42863 -300467 -222605 -93762 157563 383518 -43348 -998 -47067 -105223
19424a05223j0109c8481A8861b03685D8259a27361A2025P859L2540a88429j02962
$$ -105223 -115332 -38481 18861 -203685 48259 -127361 12025 19884 52424 -188429 -291391
19413b91391P5588A13229d11048b5171A1284i5632A82346q9354a15251m1291C8934
$$ -291391 -215803 113229 -411048 -25171 11284 -95632 182346 92992 -115251 -156542 38934
19401h6609A8439c1231k80362f6722L3261J4892j43354A48338b62674K4356A53163
$$ -86609 18439 -31231 -311593 -66722 -33461 -18569 -161923 148338 -262674 -238318 153163
19389g9479n6731j83053A46205R1988G3826D227b23004E2505d5765H4957b71709
$$ -79479 -136210 -319263 146205 238193 73826 4227 -223004 52505 -45765 84957 -271709
19377a96821e7159B27094a02410M8871l57911a18693q1047O1553l8466c6528k093
$$ -196821 -57159 227094 -102410 -53539 -411450 -118693 -199740 -138187 -176653 -36528 -38621
19366c8621H614a3716B1055P2748a51021d2106j85544H1305b1010k70459A68594
$$ -38621 8614 -13716 21055 93803 -151021 -42106 -227650 81305 -21010 -291469 168594
19354F890d4597A52284K5248a42228G8962g5777A84691G1653a16873l5821j43746
$$ 6890 -44597 152284 177532 -142228 78962 -75777 184691 71653 -116873 -152694 -296440
19343b96440Q0493N2338M695l21527a14618d1614A39015b49597A12910c52917
$$ -296440 -215947 -163609 -158914 -480441 -114618 -41614 139015 -249597 112910 -352917
19332a26404j86802N2014a29460l1642B62898a26513A01936h1103j51662a09795
$$ -126404 -313206 -261192 -129460 -161102 262898 -126513 101936 -81103 -232765 -109795
19321A14111c3102j72568B21337c403p2493q4503A61767l4400i8793C1322Q5508
$$ 114111 -33102 -205670 221337 -3403 -75896 -160399 161767 127367 -98793 31322 116830
19310A16830E4668b4474k55733a03426A57073l8452J06221b7225j94020H6415
$$ 116830 54668 -24474 -280207 -103426 157073 118621 224842 -27225 -221245 86415
19299b29252G9985l0866d16926C17741e6644C32672Q5896I9179K890c54662M8388
$$ -229252 79985 49119 -416926 317741 -56644 332672 418568 99179 102069 -354662 -306274
19288c06274C6609e1404j06590e8C0610J34322a95020l32760a04600a2591b629
$$ -306274 36609 -51404 -157994 -58 30610 164932 -195020 -527780 -104600 -12591 -2629
19276I425J1286a12964a916F412d5716k02674O6231A69343b89010h3517l84997
$$ 9425 20711 -112964 -1916 6412 -45716 -248390 -182159 169343 -289010 -83517 -468514
19265d68514E5452d8319j76430b2529B1124Q0105b04926G3428L8749i5187l171
$$ -468514 55452 -48319 -224749 -22529 21124 101229 -204926 73428 112177 -95187 -98358
19254i8358J0081m9156p36D4302J63625a35047a1690E4837a37858B04188d40557
$$ -98358 -88277 -137433 -138169 44302 207927 -135047 -11690 54837 -137858 204188 -440557
19242f1028j22162n127d4954B8107d9816j28918m2379i2975j28693m9010a34532
$$ -61028 -183190 -188317 -44954 28107 -49816 -178734 -221113 -92975 -221668 -270678 -134532
19230A56060b98143h2213R304p2103M6074A52811F258L2849R7122A5208a68206
$$ 156060 -298143 -82213 -72909 -145012 -98938 152811 6258 39107 136229 15208 -168206
19218h3971A01734f4458C63271i1007q2501A08594b22966d0221A11121Q4647a94428
$$ -83971 101734 -64458 363271 -91007 -173508 108594 -222966 -40221 111121 195768 -194428
19206G541J9334c47086e5726p0867k93842d7964j09630m8251l24699I8573b05517
$$ 7541 26875 -347086 -55726 -126593 -420435 -47964 -157594 -205845 -530544 98573 -205517
19194a20299e0439l1117B9976J4788A4061i2339A82794A3572b54262h9155A23816
$$ -120299 -50439 -81556 29976 44764 14061 -92339 182794 13572 -254262 -89155 123816
19182a99768M3046B4104b56916h8372E5013b49406N0816O8303M7841n7480A600
$$ -199768 -156722 24104 -256916 -88372 55013 -249406 -198590 -130287 -82446 -139926 1600
19170E6600J05500c70376a47379j68252G5762b61734P7543l60262b15812L1890
$$ 56600 162100 -370376 -147379 -315631 75762 -261734 -184191 -544453 -215812 -183922
19160a83922P1467A11399e7713k20586Q1269d594H0622c2587r8412a4492A51466
$$ -183922 -112455 111399 -57713 -278299 -197030 -4594 80622 -32587 -130999 -14492 151466
19148D6027A5264b82927A60755a17408D1484b50021A31576d5453F8975a76569
$$ 46027 15264 -282927 160755 -117408 41484 -250021 131576 -45453 68975 -176569
19137a69110f8977r3603A9525J5571J78502a76110a4967o6112k37701d8941I3336
$$ -169110 -68977 -162580 19525 35096 213598 -176110 -14967 -81079 -318780 -48941 93336
19125e0725A64283c50003e0670j3227r6302o4013l7870A80591f2529O455B6742
$$ -50725 164283 -350003 -50670 -63897 -160199 -224212 -262082 180591 -62529 -56074 26742
19113a21775F7153a56852A39227b6277A45827o5655J7132K6884a47295j02232
$$ -121775 67153 -156852 139227 -26277 145827 80172 97304 124188 -147295 -249527
19103b49527j05895a06406A94244C700a75411I1505b82023N5502G8630R6908a57112
$$ -249527 -355422 -106406 194244 3700 -175411 91505 -282023 -226521 78630 175538 -157112
19091a19133N7118E2964e52304h5539d87j62101G072a18979M466B5864P3669e2238
$$ -119133 -62015 52964 -552304 -85539 -487 -162588 7072 -118979 -114513 25864 99533 -52238
19078c52687N8790A62450a83149i871k15937E3768L71933A2012J07306c95285
$$ -352687 -293897 162450 -183149 -9871 -225808 53768 425701 12012 119318 -395285
19067A725d08094A3525b70134E9818a59181k5279H2820b24822H5379a78410N5353
$$ 1725 -408094 13525 -270134 59818 -159181 -184460 82820 -224822 85379 -178410 -123057
19056a23057H6366b12958a05969a2215c596k09623m9045i6630d2519J2412j14369
$$ -123057 86366 -212958 -105969 -12215 -3596 -213219 -262264 -96630 -42519 -30107 -144476
19045a44476B4894J02757j7230a91009E4818i0874c675D39433A23322b91187G9894
$$ -144476 24894 127651 110421 -191009 54818 -90874 -3675 439433 123322 -291187 79894
19033e1268j29539N2634A43i9025k1510E3137c41581E4438a05201k6750l5844
$$ -51268 -180807 -128173 143 -99025 -120535 53137 -341581 54438 -105201 -131951 -167795
19022a67795f4716A98769a44970m0201g3332A80273a52810E0080K0929a25785
$$ -167795 -64716 198769 -144970 -185171 -73332 180273 -152810 50080 71009 -125785
19011G5941a31993d729A08949J11863J38603m8105d7709a3285A80713c64039i5231
$$ 75941 -131993 -4729 108949 220812 359415 311310 -47709 -13285 180713 -364039 -95231
18999a15797m1876q5854g2347B34727a79012A99272A7545a56708A03272D9465
$$ -115797 -157673 -243527 -72347 234727 -179012 199272 17545 -156708 103272 49465
18988a78967b8386j76501j43706a45192j34183A24189K94711b1719n5675E988
$$ -178967 -28386 -204887 -348593 -145192 -279375 124189 418900 -21719 -77394 5988
18977a730j41103k66753B41921i6459a5006r8203B4605L8947a85184j44211J43845
$$ -1730 -142833 -409586 241921 -96459 -15006 -113209 24605 63552 -185184 -329395 -185550
18966a85550A60900D694R5033J63965A07198b81086C5266R9396a88643A73066
$$ -185550 160900 4694 99727 263692 107198 -281086 35266 134662 -188643 173066
18955a19122c1892A55996a9842j07086A11570B4790f9249A67724m553J35584j08488
$$ -119122 -31892 155996 -19842 -126928 111570 24790 -69249 167724 163171 298755 190267
18944A90267F7252f7825o8389c1305A68648a40124G9174a39357C410R248a1079
$$ 190267 67252 -67825 -136214 -31305 168648 -140124 79174 -139357 3410 12658 -11079
18932I7863f0524n540b1819B5829K54203a37001N7251n2070o6663h5358B06524
$$ 97863 -60524 -66064 -21819 25829 280032 -137001 -79750 -131820 -198483 -85358 206524
18920b69449k5897G8473a86674G7626e152l7142l57863A12936O8613C4891b56986
$$ -269449 -295346 78473 -186674 77626 -5152 -42294 -400157 112936 181549 34891 -256986
18908C4446b10784o0265g212o0829A72629b9537G211b37747B7655e3476k03693
$$ 34446 -210784 -271049 -7212 -68041 172629 -29537 7211 -237747 27655 -53476 -257169
18897b57169R5325A69648D6464a36110A04762a20567l5281e5617B23495I9463
$$ -257169 -161844 169648 46464 -136110 104762 -120567 -155848 -55617 223495 99463
18886a48010L6507I3228f8200B5861a1008B30985k9743G1860K44713b47364D8741
$$ -148010 -111503 93228 -68200 25861 -11008 230985 201242 71860 316573 -247364 48741
18874f8690l4721a6967l4924j17300r2690P8681A96266h1307A92695a64741k75054
$$ -68690 -103411 -16967 -51891 -169191 -261881 -183200 196266 -81307 192695 -164741 -439795
18863d39795a04489B995b64501A87708j8679J256o0414K72560b11442a6275n8346
$$ -439795 -104489 2995 -264501 187708 169029 170285 109871 382431 -211442 -16275 -74621
18852g4621C9849a61881d1952j23559G0201o012a02273I0757l7646c77356B2614
$$ -74621 39849 -161881 -41952 -165511 70201 64189 -102273 90757 53111 -377356 22614
18840a81433A58878A0083Q2699J86115c16466B06396f0715k81918L4884O3437
$$ -181433 158878 10083 92782 278897 -316466 206396 -60715 -342633 -307749 -244312
18830b44312q2320i1520r9116B6333d0095a2451j99894c4294j01703b9920A40434
$$ -244312 -326632 -91520 -190636 26333 -40095 -12451 -212345 -34294 -135997 -29920 140434
18818c5545I4804J11039I3859a38842C04661j40480a21152B13015I0713K00069
$$ -35545 94804 205843 93859 -138842 304661 164181 -121152 213015 90713 290782
18808B90782H5041c1441A17661L3461a03701A06061a98421A75323N3565c29054
$$ 290782 85041 -31441 117661 151122 -103701 106061 -198421 175323 228888 -329054
18797E9286b70975a15281o8535H6056a13013c6412m7640j13510B33073B5918H288
$$ 59286 -270975 -115281 -183816 86056 -113013 -36412 -84052 -197562 233073 25918 8288
18785a54498M0482r5675m9193f9539j5947q3606j05098A2415e4181B2054L2785
$$ -154498 -114016 -209691 -258884 -69539 -85486 -169092 -274190 12415 -54181 22054 54839
18774E4839c77488C6258c02976J43640F4299K07374A20518h1767n4846j0181K4419
$$ 54839 -377488 36258 -302976 -159336 64299 271673 120518 -81767 -136613 -146794 -122375
18763a22375c745o9263I4427G8K51432b12637k3423B36542A14584a1715A67736
$$ -122375 -3745 -73008 94427 78 251510 -212637 -236060 236542 114584 -11715 167736
18751c63122H5627b8705j60572n18512h1620o2273I0214A2330b01699a1287j83077
$$ -363122 85627 -28705 -189277 -707789 -81620 -143893 90214 12330 -201699 -11287 -194364
18740a94364O5086q9384E6054i7837J4157m5716H7963N3533b00581q2344A28372
$$ -194364 -129278 -218662 56054 -97837 -83680 -129396 87963 141496 -200581 -282925 128372
18728c3066E7698J5354e2433B1678a98657D1421J76484J7114J15614i8489C51148
$$ -33066 57698 73052 -52433 21678 -198657 41421 217905 235019 350633 -98489 351148
18716b56326B3600b56941a27816k23271g3525r8712e7754G9811c8546G6250a27026
$$ -256326 23600 -256941 -127816 -351087 -73525 -172237 -57754 79811 -38546 76250 -127026
18704b54074n830B6821a92121j03973a35286A5286b04550I6736a33512D3248b41496
$$ -254074 -259904 26821 -192121 -296094 -135286 15286 -204550 96736 -133512 43248 -241496
18692a30809e7305j16059j20474A16459g7426A25112c23161J48296f3806A79387
$$ -130809 -57305 -173364 -293838 116459 -77426 125112 -323161 -174865 -63806 179387
18681A11876b08463A06290b85964C29263A52840a72609j779I0023N9981b8157
$$ 111876 -208463 106290 -285964 329263 152840 -172609 -174388 90023 150004 -28157
18670D9926d3309k8626B34253A5409b9621C7359K545L9364C1914K91597E8914
$$ 49926 -43309 -71935 234253 15409 -29621 37359 39904 79268 31914 323511 58914
18658G6054K2931a06057c3781A50741b6228A58778b8610r0644C13247c80665B19613
$$ 76054 98985 -106057 -33781 150741 -26228 158778 -28610 -119254 313247 -380665 219613
18646F0769a89172c4821B00965a07384c7659H135b15623a02729j26382B8635c5531
$$ 60769 -189172 -34821 200965 -107384 -37659 8135 -215623 -102729 -229111 28635 -35531
18634b17363A384K5637K26742j17227n3082b39443A03631a88839N9947e8692b1418
$$ -217363 1384 27021 253763 136536 83454 -239443 103631 -188839 -128892 -58692 -21418
18622A79233q1497A5938h0253A02892a23538B8371d6761j1956a8997k55468B397
$$ 179233 97736 15938 -80253 102892 -123538 28371 -46761 -58717 -18997 -274465 2397
18610c69944J79937b5807B17568B6234b98620d6305E164e0181j56326G4355a82315
$$ -369944 -190007 -25807 217568 26234 -298620 -46305 5164 -50181 -206507 74355 -182315
18598a1322j15450K6833m2800c6960j14084A65877g8651E6218b18944c2916j28258
$$ -11322 -126772 -99939 -142739 -36960 -151044 165877 -78651 56218 -218944 -32916 -161174
18587a61174B9231J7051b73300A70783b68926K43A10649l4315h3757F3257a26632
$$ -161174 29231 46282 -273300 170783 -268926 -268683 110649 76334 -83757 63257 -126632
18575A43512l3481K21001D5191b03939M2332e7072j24968E0735a19785H6029a18804
$$ 143512 110031 331032 45191 -203939 -161607 -57072 -182040 50735 -119785 86029 -118804
18563i1913a0611C2902J37848i9493J4620j88638A09746G184N4343a4304A34081
$$ -91913 -10611 32902 170750 -99493 -84873 -273511 109746 7184 61527 -14304 134081
18551a34907l76103B62652a26408A52953a67563I5237m4127a33870C5904Q9585
$$ -134907 -511010 262652 -126408 152953 -167563 95237 51110 -133870 35904 125489
18541A25489c9181l6947H3297f5298B3671g4994C57156a5149l8607k12097k9604
$$ 125489 -39181 -76128 83297 -65298 23671 -74994 357156 -15149 -53756 -265853 -295457
18530b95457O1778A55096i5764J2053r9219B65485C0034b14063B92205F9875a1460
$$ -295457 -233679 155096 -95764 -83711 -182930 265485 30034 -214063 292205 69875 -11460
18518e0122q4499e8086C30348h8714k53300p6745g1190A22892K8169h7204J8474
$$ -50122 -134621 -58086 330348 -88714 -342014 -418759 -71190 122892 151061 -87204 -68730
18507f8730r578k38289C01635f5361k58696a23250l38450C33115A31571a70167
$$ -68730 -78308 -316597 301635 -65361 -324057 -123250 -461700 333115 131571 -170167
18496H6835a80009N0963j11982F0586K1362b72314P7610n1602E2261b4952o0852
$$ 86835 -180009 -129046 -241028 60586 81948 -272314 -194704 -246306 52261 -24952 -85804
18485h5804D27498G1974i8141A08210a65219k22977f8526A99199l5668p8253a55410
$$ -85804 427498 71974 -98141 108210 -165219 -388196 -68526 199199 163531 85278 -155410
18473c40988E1505c0565a1037B81398G7186h7880A37211b21648P1734a6771I6192
$$ -340988 51505 -30565 -11037 281398 77186 -87880 137211 -221648 -149914 -16771 96192
18461g2128B4990a83714B65297D3250c08578B3606a58872M8083p0860A58703b484
$$ -72128 24990 -183714 265297 43250 -308578 23606 -158872 -110789 -181649 158703 -2484
18449f1054J3046j16294D6170j9412b22199L8361n7699F871a72038m2466C5680
$$ -61054 -48008 -164302 46170 26758 -222199 -183838 -241537 6871 -172038 -214504 35680
18437a96854d6761n2514K9604N665E2216b55606A67023a60288q332J9267O0787
$$ -196854 -46761 -99275 -69671 -64006 52216 -255606 167023 -160288 -168620 -149353 -88566
18426h8566j88660L8640C2368f6693l57857a55627C5391b07974A03689a77309
$$ -88566 -277226 -238586 32368 -66693 -424550 -155627 35391 -207974 103689 -177309
18415a26380l13009A02678d4652F5670k2009b4174A45631b0945l1835C54087a12788
$$ -126380 -439389 102678 -44652 65670 43661 -24174 145631 -20945 -52780 354087 -112788
18403b51296a10334E8407a77260j99506I959Q1155c1544r0737A14923D3781a69348
$$ -251296 -110334 58407 -177260 -376766 9959 91114 -31544 -122281 114923 43781 -169348
18391C55944A42361a66476A0336a25701j8185E574b57821B5580M5710a60152I955
$$ 355944 142361 -166476 10336 -125701 -143886 5574 -257821 25580 71290 -160152 9955
18379d3843B70806b30606f8969o9153F9324c25065a37905I4208J13056o2816a06031
$$ -43843 270806 -230606 -68969 -138122 69324 -325065 -137905 94208 207264 144448 -106031
18367b46632A25054d4288F5317J66029F6883e3579A24939i3078B21995j7730q9887
$$ -246632 125054 -44288 65317 231346 66883 -53579 124939 -93078 221995 204265 114378
18356A14378b1547D7359b32405A45189Q8884a15034I960J11022a65052J4258c4688
$$ 114378 -21547 47359 -232405 145189 234073 -115034 9960 120982 -165052 -150794 -34688
18344h3631K8902j45590A57239G2911a51447e5834D5815k1466a09758k92825e5443
$$ -83631 -54729 -200319 157239 72911 -151447 -55834 45815 24349 -109758 -402583 -55443
18332c6908H5708b08817K3579C40592A48764D5566d07031B65131h7750c8808k04388
$$ -36908 85708 -208817 -185238 340592 148764 45566 -407031 265131 -87750 -38808 -243196
18321b43196A94245L4585a6329k19319j06180E4655P8401F4372a16667D7931b50604
$$ -243196 194245 228830 -16329 -235648 -341828 54655 133056 64372 -116667 47931 -250604
18309B04977l1689F9805j2045K20511h5310A23155c2929j23B36263B5365M8753
$$ 204977 173288 69805 57760 278271 -85310 123155 -32929 -33052 236263 25365 74118
18298G4118a4376B31597E6746b65866B92510H732J86425o2321b50966O4398k05253
$$ 74118 -14376 231597 56746 -265866 292510 8732 195157 132836 -250966 -186568 -391821
18287c91821C9422d1577r7939A31947R4407L320H803K8133a28800j63929c3031
$$ -391821 39422 -41577 -139516 131947 226354 229674 8803 36936 -128800 -292729 -33031
18275a11945p8783M6798f3520G4074A8923a07922m75845b20224B70367a85515
$$ -111945 -190728 -143930 -63520 74074 18923 -107922 -583767 -220224 270367 -185515
18264A68564a34504A5439Q4283g8070A6458o574L00028c32581J35215N3069H1701
$$ 168564 -134504 15439 99722 -78070 16458 9884 309912 -332581 -197366 -144297 81701
18252i2183A06434c08622F9791b06105c1954m54012e5726D1873a75991j15566
$$ -92183 106434 -308622 69791 -206105 -31954 -485966 -55726 41873 -175991 -291557
18242b91557b0737o2256k7930D2415c58588A42540n7895J01657q0228g6423j11842
$$ -291557 -20737 -82993 -110923 42415 -358588 142540 84645 186302 106074 -76423 -188265
18231a88265F4751I037K35199a5932A66178o8320f2035A10743b30818G6574K38025
$$ -188265 64751 9037 244236 -15932 166178 97858 -62035 110743 -230818 76574 314599
18220C14599b83041h8038m56024B05170a56468B57786b57004B3237a48244l70822
$$ 314599 -283041 -88038 -544062 205170 -156468 257786 -257004 23237 -148244 -519066
18210e19066B65767A25184l8509b73971Q9070n954d6024A53158i6152C07317a15641
$$ -519066 265767 125184 86675 -273971 -184901 -190855 -46024 153158 -96152 307317 -115641
18198G718a80181N5117j29690A3053d0384k25154B3068a52229j62263a07304A39631
$$ 7718 -180181 -125064 -254754 13053 -40384 -265538 23068 -152229 -314492 -107304 139631
18186a82019I5788b0216B35965b82349a20650B49320h7275M1217a5978I2268L7838
$$ -182019 95788 -20216 235965 -282349 -120650 249320 -87275 -46058 -15978 92268 130106
18175A30106a21700J8688a0927k70524J02444a2582c541k4066A40104o9337C0490
$$ 130106 -121700 -103012 -10927 -281451 -179007 -12582 -3541 -27607 140104 70767 30490
18163a52540e0578j32132Q2972p0554g820j85296A2962g9071A01538a18337e7793
$$ -152540 -50578 -182710 -99738 -170292 -7820 -193116 12962 -79071 101538 -118337 -57793
18151A9775J43377J01050a39824K5987M4946C43043a24507r1203M2562k4384j83193
$$ 19775 163152 264202 -139824 -113837 -68891 343043 -124507 -215710 -173148 -197532 -380725
18140c80725H1860a3379j75188L4984p0122b5513C31776a7485A6693b11612M07
$$ -380725 81860 -13379 -188567 -153583 -223705 -25513 331776 -17485 16693 -211612 -211205
18129b11205L8438O4529d1675C06041j29290J43670d2889K116D4546a49286A38630
$$ -211205 -172767 -108238 -41675 306041 176751 320421 -42889 -40773 44546 -149286 138630
18117e5601j8294j2728F8378c3590j42841k9753A44239h3266k24347H412K24030
$$ -55601 -73895 -86623 68378 -33590 -176431 -206184 144239 -83266 -307613 8412 232442
18106B32442h4317p6451L3532H6632b86821A49485O1362K78Q3591D4918a39205
$$ 232442 -84317 -160768 -127236 86632 -286821 149485 210847 211125 294716 44918 -139205
18094b64031b3981A11999b9370m7181A36136m8589e3022F7046R8472k2060c9935
$$ -264031 -23981 111999 -29370 -76551 136136 87547 -53022 67046 165518 143458 -39935
18082I1868a62609B41327J46829A58096g8971p2303H4082b13289m8015a09352
$$ 91868 -162609 241327 388156 158096 -78971 -151274 84082 -213289 -261304 -109352
18071H0962L7297a24749N9780H8346a30245H0510P965b9617l14437A53097d9023
$$ 80962 118259 -124749 -64969 88346 -130245 80510 88475 -29617 -344054 153097 -49023
18059a33818I0243a52990G9080a93891M8942A87138d0141p1804M7598L755o4214
$$ -133818 90243 -152990 79080 -193891 -144949 187138 -40141 -111945 -64347 -60592 -124806
18048a24806q2562A2646a69469L4267d0192E0942a66383g6710A48766a47891k3838
$$ -124806 -207368 12646 -169469 -135202 -40192 50942 -166383 -76710 148766 -147891 -171729
18037a71729B83243J40284A12316a12841A83855D3862N1532J81591a92114E3448
$$ -171729 283243 423527 112316 -112841 183855 43862 95394 276985 -192114 53448
18026e0722l446Q616C3575b24309J07359G0593R1622J30918A12568f5582J6311
$$ -50722 -54168 -45552 33575 -224309 -116950 70593 162215 293133 112568 -65582 -49271
18015d9271j7321k3660f070o485B42624b19561o5507E6962K2236b81890f6829
$$ -49271 -66592 -90252 -6070 -12555 242624 -219561 -285068 56962 79198 -281890 -66829
18003a85159G1964e8697j06261Q323J442d7333j51836d1088j84024B89763a62415
$$ -185159 71964 -58697 -164958 -156635 -155193 -47333 -199169 -41088 -225112 289763 -162415
17991A61068e9856n2277c5373C15616A51983c62625B50008d6530k04998J25241
$$ 161068 -59856 -112133 -35373 315616 151983 -362625 250008 -46530 -251528 -126287
17981a26287A71912e6403G8071K8863g0126k00769b1231A27595f9304A58288p9123
$$ -126287 171912 -56403 78071 106934 -70126 -270895 -21231 127595 -69304 158288 79165
17970G9165K534N090b57749A20368a65693h2318j06401A47143a22319l82751a86934
$$ 79165 81699 86789 -257749 120368 -165693 -82318 -188719 147143 -122319 -505070 -186934
17958i3625A97410Q2828b52513J21972B10645b99626f6998J302j49252l17780
$$ -93625 197410 280238 -252513 -130541 210645 -299626 -66998 -65696 -214948 -532728
17948e32728b27946E494R4542n991m4994b20060K5678B31500a35775C11088a56496
$$ -532728 -227946 5494 100036 94045 49051 -220060 -194382 231500 -135775 311088 -156496
17936b61752d4535A36320J9094C1474a0481C7375Q082b8851j1215j30119D44275
$$ -261752 -44535 136320 155414 31474 -10481 37375 45457 -28851 -40066 -170185 444275
17924a98263k01906g3028A67600a81379N3618A93305p6249L4080d3417N3G5060
$$ -198263 -400169 -73028 167600 -181379 -127761 193305 117056 151136 -43417 -43364 75060
17912a09383F0282J07850c8985A71356J49232h2870E0714J98620q2488B2189c4041
$$ -109383 60282 168132 -38985 171356 320588 -82870 50714 249334 166846 22189 -34041
17900C22299C930J64336a31189A07068P8275A2855b23013A68247a54374j64175
$$ 322299 3930 168266 -131189 107068 185343 12855 -223013 168247 -154374 -318549
17890c18549A50573a73867j67302j90542A01499a72024A67842i3701B76541e12013
$$ -318549 150573 -173867 -341169 -531711 101499 -172024 167842 -93701 276541 -512013
17879e6818K0076A65897a40530B10186K07914g2602D5050b09878d5221k12429
$$ -56818 -36742 165897 -140530 210186 418100 -72602 45050 -209878 -45221 -257650
17869b57650h9353j53013K7016A22087L6469b26872A06120J7208R4353c48359
$$ -257650 -89353 -242366 -215350 122087 158556 -226872 106120 123328 217681 -348359
17858a42389j25629C3399o512b37337B1819b18670d0199C35992B893b84329d2921
$$ -142389 -268018 33399 26887 -237337 21819 -218670 -40199 335992 2893 -284329 -42921
17846f9126A09515c58877A63977m5556n3177f778G6793J7770b14237B11471j8258
$$ -69126 109515 -358877 163977 118421 65244 -6778 76793 94563 -214237 211471 193213
17835A93213e9237A46473a99927b1960j79235A0532i4431L3626A00310b70667
$$ 193213 -59237 146473 -199927 -21960 -201195 10532 -94431 -60805 100310 -270667
17824b6527B26338D2234i0972K698B0730i8687K5068j76377M9784D09442A79686
$$ -26527 226338 42234 -90972 -88274 20730 -98687 -73619 -249996 -200212 409442 179686
17812a31790m4108n2783b7198A91428R0221c69895d8739D051R532a769C3261J81092
$$ -131790 -175898 -228681 -27198 191428 281649 -369895 -48739 4051 13583 -1769 33261 214353
17800B14353h7089L3096C89112A37191J6083P2608b70814O4366P0461n2251i2558
$$ 214353 -87089 -53993 389112 137191 153274 225882 -270814 -206448 -135987 -188238 -92558
17788A65513m8246a1805B4908a02972j43871b9622A83581l4168m2786k0360M5233
$$ 165513 117267 -11805 24908 -102972 -246843 -29622 183581 149413 106627 86267 131500
17777A31500F5085A3923a26320b4521A68266F3425k8794M3110a12519A20750i4738
$$ 131500 65085 13923 -126320 -24521 168266 63425 34631 77741 -112519 120750 -94738
17765c63831B95589j42680b91615R5971A33217h7903A04186B3755a55694J175
$$ -363831 295589 152909 -291615 -195644 133217 -87903 104186 23755 -155694 -154519
17755a54519j00193J03495B41064r0831L7212C5116d1469A36543b09864A03903
$$ -154519 -254712 -151217 241064 150233 187445 35116 -41469 136543 -209864 103903
17744B28696c19752A8850J04033a40024A44024J4069e5249b2690l7989j31478
$$ 228696 -319752 18850 122883 -140024 144024 158093 -55249 -22690 -60679 -192157
17734a92157A4414J5675a9356r4618B1247e3706j89432A67435D5262J25537J137
$$ -192157 14414 30089 -19356 -113974 21247 -53706 -243138 167435 45262 170799 171936
17723A71936a14096N2259k1462b4311j28151A78650J39340d9774b4009B11494
$$ 171936 -114096 -61837 -83299 -24311 -152462 178650 317990 -49774 -24009 211494
17712F4073a92294l6858a9724D73109a23658B84709E6503b13886B34575F9537
$$ 64073 -192294 -229152 -19724 473109 -123658 284709 56503 -213886 234575 69537
17701A62424B4878L2420J61532b07080A6546b28374A30636n2266j3489J47819
$$ 162424 24878 57298 218830 -207080 16546 -228374 130636 78370 64881 212700
17691B12700A6199N5307b27036I8145k4122D66M19275A54458a01204j33763a2926
$$ 212700 16199 71506 -227036 98145 74023 466 419741 154458 -101204 -234967 -12926
17679A02897l5553h6013K0028D9676J1049d4985J4125B51171Q80N6851c2536C84450
$$ 102897 67344 -86013 -65985 49676 60725 -44985 -30860 251171 252051 308902 -32536 384450
17666c14906A71963a17027C29053r4268n5177a11343d8769a8124m67742b8818
$$ -314906 171963 -117027 329053 234785 179608 -111343 -48769 -18124 -485866 -28818
17655c46280c8793j30410A23239n8096g62H8574B8298r706c22050B37541j04471
$$ -346280 -38793 -169203 123239 65143 -762 88574 28298 18592 -322050 237541 133070
17644A33070J41119a41872A66466b80055d0866J7875A47481e1896M579B15170
$$ 133070 274189 -141872 166466 -280055 -40866 -22991 147481 -51896 -47317 215170
17633C34627H2267J71994d04797P9269H5956g2655J6385r2431B98864A01216J85381
$$ 334627 82267 254261 -404797 -325528 85956 -72655 -56270 -148701 298864 101216 286597
17622B86597j33487C5974J58623K9480L1350k8194m3717c3461n2562A05108M9075
$$ 286597 153110 35974 194597 224077 255427 227233 183516 -33461 -86023 105108 154183
17611A54183a0397j00244l5175P479n8785B38157j19064a01439B83667E3747O3454
$$ 154183 -10397 -110641 -145816 -138337 -197122 238157 119093 -101439 283667 53747 117201
17600A17201g4536B06745a02295D8902G393e847m41247G305J29633E0980a14893
$$ 117201 -74536 206745 -102295 48902 7393 -5847 -447094 7305 136938 50980 -114893
17588B07636M9963a6207A4474M95b11766r639B25567o4024a33601A73541J2779
$$ 207636 257599 -16207 14474 14969 -211766 -221405 225567 161543 -133601 173541 186320
17577A86320E7338d9322l4996A68072G100a04117B96217b02161k6931f9961B76619
$$ 186320 57338 -49322 -84318 168072 7100 -104117 296217 -202161 -229092 -69961 276619
17565d68437b09399B37372c32043B03965a10134A08045O1881a00963M7262j91671
$$ -468437 -209399 237372 -332043 203965 -110134 108045 169926 -100963 -53701 -245372
17555b45372i134j46478B19573a00786b1045B54802i297B10018q1682h152A72236
$$ -245372 -9134 -155612 219573 -100786 -21045 254802 -9297 210018 128336 -8152 172236
17543A99511k0035a84645A45665a05527a4508G4991f6299o2419e1826j9463C5489
$$ 199511 179476 -184645 145665 -105527 -14508 74991 -66299 -128718 -51826 -71289 35489
17531B12542O3053p7893G8101f4642G1446B9181m110K23647G3811r971L33238
$$ 212542 275595 197702 78101 -64642 71446 29181 25071 248718 73811 63840 397078
17520C97078a63697I4447j5634J28483O2487A27523d8464B37557b06067H5959
$$ 397078 -163697 94447 78813 207296 269783 127523 -48464 237557 -206067 85959
17509f399E236L78657j66185H447N8555N748J04403C5363a83228B82435a32817
$$ -6399 5236 383893 217708 8447 67002 72750 177153 35363 -183228 282435 -132817
17497B39017k0821K33429f0647D11826q2654k8943a9744m1691A39888M4936o0597
$$ 239017 218196 451625 -60647 411826 329172 300229 -19744 -61435 139888 184824 124227
17486A24227B7297K5152J01890A9556d5108k7386C06599J17564A49617K0878a18490
$$ 124227 27297 52449 154339 19556 -45108 -72494 306599 424163 149617 170495 -118490
17474a3586C54078j5534E3683J1518J42434D2323F826K40798c40706C14601K072
$$ -13586 354078 338544 53683 65201 207635 42323 6826 247624 -340706 314601 316673
17463C16673a66725E0718h7077H7014O654d8447N588D67916C9216a31567A48320
$$ 316673 -166725 50718 -87077 87014 93668 -48447 -42859 467916 39216 -131567 148320
17451D00187A95376M1751j03994P1955K80163B22079q9916J91023j5832B622K57480
$$ 400187 195376 237127 133133 205088 485251 222079 132163 323186 307354 2622 260102
17440B60102A11935J39832L85018A86942O5165G031M14665A93647E4889J97690
$$ 260102 111935 251767 636785 186942 252107 7031 421696 193647 54889 252579
17430B52579I1733J73677R6714J87370A85079J61243l5109p5915J33277A54442
$$ 252579 91733 265410 362124 549494 185079 346322 311213 235298 368575 154442
17419C45019A49162h6967A85703K32711A51221K13749o2996J38790H5943Q5973
$$ 345019 149162 -86967 185703 418414 151221 364970 301974 440764 85943 171916
17409A71916B5871k200e1960A45108f2932C25311A27393R4545K07824B11340L07021
$$ 171916 25871 23671 -51960 145108 -62932 325311 127393 221938 429762 211340 518361
17398E18361B58710k3522A08616J57480e4693n982B20115b3617A88278J09826
$$ 518361 258710 235188 108616 266096 -54693 -60675 220115 -23617 188278 298104
17388B98104p547O4133m7111p5412F9728L30029r2036A40229J0857a13361q9583
$$ 298104 290557 354690 307579 232167 69728 399757 307721 140229 151086 -113361 -202944
17377b02944I9419f7088E56295j97018b22548D06174A00685m4564R6373R9931
$$ -202944 99419 -67088 556295 359277 -222548 406174 100685 56121 152494 252425
17367B52425e7728j69884A82756p5669K6279l3733J19986b44478A53928a76422
$$ 252425 -57728 -227612 182756 107087 133366 99633 219619 -244478 153928 -176422
17356A4383F461a24896C05416E1299J80733l8693L11999B41601J12715A30388
$$ 14383 6461 -124896 305416 51299 232032 193339 505338 241601 354316 130388
17345a1887A51358N9718K91982G5776L028K05907J60031j89422h6951d3285A34737
$$ -11887 151358 211076 503058 75776 78804 284711 444742 255320 -86951 -43285 134737
17333A52219J35669g116H1165i3033A48223b3331C59496F1138N5808L6921J31497
$$ 152219 287888 -7116 81165 -93033 148223 -23331 359496 61138 116946 153867 285364
17322B85364a27840I0185J15382a13565l4531A61198J62183J19505A92785A4649
$$ 285364 -127840 90185 205567 -113565 -148096 161198 323381 442886 192785 14649
17311B53285J04555j33924K07117j68814l8627J03721j51151e7743A02100M857
$$ 253285 357840 223916 431033 262219 223592 327313 176162 -57743 102100 106957
17301A06957J51719C9861N5169d2979C70077j11072o7317b641A99813a05260G4114
$$ 106957 258676 39861 95030 -42979 370077 259005 191688 -2641 199813 -105260 74114
17289C13178A09622L63944B15234p8676J33351A25201J02108m8498a11110j81222
$$ 313178 109622 473566 215234 136558 269909 125201 227309 178811 -111110 -292332
17279b92332B54256K81288k56628C4173J21900n7266P4635L5404K81392m4966
$$ -292332 254256 535544 278916 34173 156073 98807 173442 208846 490238 445272
17269D45272j35400A12774L06412A93623L94967A21531f5121F1999M7891i0664
$$ 445272 309872 112774 419186 193623 588590 121531 -65121 61999 109890 -90664
17258b88563C41824G4033K37479A22868D9810a10028C52872l5850F7591J56938
$$ -288563 341824 74033 311512 122868 49810 -110028 352872 317022 67591 224529
17248B24529o1872m7197P3197k1883Q2385b82299A41851J81842D8211J85606C5299
$$ 224529 162657 115460 188657 166774 249159 -282299 141851 323693 48211 233817 35299
17236B06546k0002K28811E6535J74967O0756A9941M21096a08625A96936J33297
$$ 206546 186544 415355 56535 231502 292258 19941 441037 -108625 196936 330233
17226C30233p5389l1256K41620B01771J649R5081o8488C0541J06094m3491K01397
$$ 330233 254844 223588 465208 201771 203420 298501 230013 30541 136635 93144 294541
17215B94541J11162l9811A03056O0278O1397m0974L08520A28120J68901A10546
$$ 294541 405703 365892 103056 163334 224731 183757 492277 128120 297021 110546
17204B70547J931A11019M51408B410J63748L42151k5347j41857A26490J11824
$$ 270547 272478 111019 562427 2410 166158 508309 482962 341105 126490 238314
17194B38314l2028K74037e1748j60707B61937K1151L0316R1774c339B0606K30229
$$ 238314 206286 480323 -51748 -212455 261937 283088 313404 405178 -3339 20606 250835
17183B50835N3313J48502r7463j18975L34640k28599L9800j7746l7145K1388j10106
$$ 250835 304148 452650 355187 236212 570852 342253 382053 364307 327162 348550 238444
17172B38444J95043c4099C09238k5138M03006B19794N6208j12250K8660L56319
$$ 238444 433487 -34099 309238 284100 687106 219794 276002 163752 192412 548731
17162E48731N1293k97480h479B19636a140B70306Q7274L73441k46124l101j77057
$$ 548731 600024 302544 -8479 219636 -1140 270306 357580 731021 484897 481796 304739
17151C04739o0518J25053n2095p9284M4994K31635p9268a39036B01222K23815
$$ 304739 244221 369274 317179 237895 282889 514524 435256 -139036 201222 425037
17141D25037A96817J06853M61325k67660B47412q8483k5876L50383J4911o8627
$$ 425037 196817 303670 764995 497335 247412 158929 133053 483436 498347 429720
17131D29720k09663I0443L31236Q2589k14830J22878j3199j15124J16211J31815
$$ 429720 220057 90443 421679 504268 289438 412316 399117 283993 400204 532019
17121E32019K0929J26061l29040k0777J38641k07969K03888j886j85943D1674
$$ 532019 552948 679009 349969 329192 467833 259864 463752 461866 275923 41674
17110F04692B49181L69048k61506L92917B21726N28043B33451L10249B09991O6000
$$ 604692 249181 618229 356723 749640 221726 749769 233451 543700 209991 275991
17100B75991j6115M47168j72228J47980k93743j06377k6068J77866j98465r1685
$$ 275991 259876 707044 534816 682796 389053 282676 256608 434474 236009 144324
17090A44324J99223K84592B37683M37753k69538J46922F9560M10595A84761K41241
$$ 144324 343547 628139 237683 675436 405898 552820 69560 480155 184761 426002
17080D26002o9373L3962o1464M05188C47287J02638L56719l61821k00668K95648
$$ 426002 356629 390591 329127 734315 347287 449925 806644 444823 244155 539803
17070E39803j91269n7613K77469k31237J81465K88707Q0902l43032p5028m1113
$$ 539803 348534 290921 568390 337153 518618 807325 888227 545195 470167 429054
17060D29054q0634K07611M29j17813l3224K76724j11559Q5373l4684k52886K09815
$$ 429054 348420 556031 556460 438647 405423 682147 570588 655961 621277 368391 578206
17049E78206K27956k32601j86165M90159l78870K41172m8334J59843l73461Q1306
$$ 578206 806162 573561 387396 877555 498685 739857 691523 851366 477905 559211
17039E59211M70218l08031C29980M08126P1943l5750l42947J13750k9900K01785
$$ 559211 1029429 721398 329980 738106 810049 774299 431352 545102 515202 716987
17029G16987k6889j60760L62997j61385C32920M75268k05600M2792j91397L34749
$$ 716987 690098 529338 892335 730950 332920 808188 602588 645380 453983 788732
17019G88732j58061K28814j01011J43973j06858j56321l4890J16838K41776k02600
$$ 788732 630671 859485 758474 902447 795589 639268 604378 721216 962992 760392
17009G60392n3091L11884l76957j07660M74890D93451J25560N4336R8579K26269
$$ 760392 707301 1019185 642228 534568 1009458 493451 619011 673347 771926 998195
16999I98195m58059K54905J81871q6184k37462K56920N3742M8514L4324l44609
$$ 998195 540136 795041 976912 890728 653266 910186 963928 1012442 1046766 702157
16989G02157N9544J40399r2618N8637k79266L30499K6399K02369k51985P7274
$$ 702157 761701 902100 809482 868119 588853 919352 945751 1148120 896135 973409
16979I73409o3176K9963L34642k25692m21702L39255J572K89253l16075K24034
$$ 973409 910233 940196 1274838 1049146 627444 966699 968271 1257524 941449 1165483
16969A165483l29414J66464L28794l27355N7805J1318J13603j87123R0711K87899
$$ 1165483 836069 1002533 1331327 1003972 1061777 1073095 1186698 999575 1090286 1378185
16959A378185l66151J42066J05350J5181J25435k22624j24770q0265L3682k66830
$$ 1378185 1012034 1154100 1259450 1274631 1400066 1177442 1052672 972407 1006089 739259
16949G39259L33233J95277Q0410K5748j55227n4796n6321O407P8480K67632k48945
$$ 739259 1072492 1267769 1348179 1373927 1218700 1163904 1107583 1113990 1192470 1460102 1211157
16938A211157o4501Q0509O3650o9320N00195p74894M14916K33620j11383K29592
$$ 1211157 1146656 1227165 1290815 1221495 1721690 946796 1361712 1595332 1483949 1713541
16928A713541l48965j63019L27515L8004j27247K25628k23741L38486j09897N9834
$$ 1713541 1364576 1201557 1529072 1567076 1439829 1665457 1441716 1780202 1670305 1730139
16918A730139k7300J86241m0428k38137K14829q9569N7205q0882j80950M66133
$$ 1730139 1702839 1889080 1848652 1610515 1825344 1735775 1792980 1712098 1531148 1997281
16908A997281r5810J97761r9937r9611q460J66823n5904J65145k12232j13842
$$ 1997281 1901471 2099232 1999295 1899684 1891224 2058047 2002143 2167288 1955056 1841214
16898A841214K55923J56383o7008R6604j65844j91173N49434j82344m3587N7833
$$ 1841214 2097137 2253520 2186512 2283116 2117272 1926099 2475533 2293189 2249602 2307435
16888B307435L3147j69242J05414K86909j62792K18778o5262j31050Q4895j43833
$$ 2307435 2340582 2171340 2276754 2563663 2400871 2619649 2554387 2423337 2508232 2364399
16878B364399M59864l58924K10778l2136O58636k33417m04199P4160j0784K76066
$$ 2364399 2824263 2465339 2676117 2643981 3302617 3069200 2665001 2739161 2728377 3004443
16868C004443k58607L09043k5979j69515L40952l87493M81664m77570N04447M4487
$$ 3004443 2745836 3054879 3028900 2859385 3200337 2812844 3294508 2816938 3321385 3365872
16858C365872k21146L67757k64182j68447O33851N8413k84399L34136j17696j10653
$$ 3365872 3144726 3512483 3248301 3079854 3713705 3772118 3487719 3821855 3704159 3593506
16848C593506J68145L77265j61498J12779j69620L22221j34914K70094n5362J62741
$$ 3593506 3761651 4138916 3977418 4090197 3920577 4242798 4107884 4377978 4322616 4485357
16838D485357K1483L60400k12670O1309k156J62274L62081j05804J52505r954
$$ 4485357 4506840 4867240 4654570 4715879 4713723 4875997 5238078 5132274 5284779 5274825
16828E274825K64911K24428k17491M64279j69147k92243K78355K99584J84732
$$ 5274825 5539736 5764164 5546673 6010952 5841805 5549562 5827917 6127501 6312233
16819F312233J23635j5922K29806L24850l5029R5668M10755O7902j91013L04025
$$ 6312233 6435868 6419946 6649752 6974602 6939573 7035241 7445996 7513898 7322885 7626910
16809G626910L1655J53274M41039J33696J84117J24214J01874M17557J00753K05586
$$ 7626910 7658565 7811839 8252878 8386574 8570691 8694905 8796779 9214336 9315089 9520675
16799I520675L1772L60422M15806N28734q3397K22357K48512N01488J61641L58389
$$ 9520675 9552447 9912869 10328675 10857409 10774012 10996369 11244881 11746369 11908010 12266399
16789A2266399N22857P3673N78893K33023L77403N35736J89984Q01366K24737
$$ 12266399 12789256 12862929 13441822 13674845 14052248 14587984 14777968 15579334 15804071
16780A5804071M26921Q65358M23561N75521M83075M03949N87727Q50658K53282
$$ 15804071 16230992 17096350 17519911 18095432 18578507 18982456 19570183 20420841 20674123
16771B0674123J389098N84695P40279J000476Q15140J111471R15622Q15771J479434
$$ 20674123 22063221 22647916 23388195 24388671 25203811 26315282 27230904 28046675 29526109
16762B9526109J322713Q27738J658153J406318J601856J573600J749259J570482
$$ 29526109 30848822 31676560 33334713 34741031 36342887 37916487 39665746 41236228
16754D1236228J938492J897234K458177K331723K192101K694623K415074L726951
$$ 41236228 43174720 45071954 47530131 49861854 52053955 54748578 57163652 60890603
16746F0890603K938293L315960L975017L824817M348439L801881N068726M716123
$$ 60890603 63828896 67144856 71119873 74944690 79293129 83095010 88163736 92879859
16738I2879859N174123N581933N717909O280905O380007O595197O749401O480370
$$ 92879859 98053982 103635915 109353824 115634729 122014736 128609933 135359334 141839704
16730A41839704O646186O772662O251737O150068N671460N064467L989465L428822
$$ 141839704 148485890 155258552 161510289 167660357 173331817 178396284 182385749 185814571
16722A85814571K148532J192514K46521j317465k037088l132370l576193n155482
$$ 185814571 187963103 189155617 189402138 188084673 186047585 182915215 179339022 174183540
16714A74183540n445966o042435o439582o952139o507174o867596p228839o204846
$$ 174183540 168737574 162695139 156255557 149303418 142796244 135928648 128699809 122494963
16706A22494963o246134o442132n923200n719819n282905n408423m585041m662893
$$ 122494963 116248829 109806697 103883497 98163678 92880773 87472350 82887309 78224416
16698G8224416l845852m440514l341588l425237l391329l023179k691352k920247
$$ 78224416 74378564 69938050 66596462 63171225 59779896 56756717 54065365 51145118
16690E1145118k338536k389790k342825j784944k093343k149337j464556j735246
$$ 51145118 48806582 46416792 44073967 42289023 40195680 38046343 36581787 34846541
16682C4846541j487096r73307j392011j397912j133980j411310r20439r41735
$$ 34846541 33359445 32386138 30994127 29596215 28462235 27050925 26130486 25188751
16674B5188751r88456r90728r14378o58127j152867m68886o76764p73762o58132
$$ 25188751 24200295 23209567 22295189 21637062 20484195 20015309 19338545 18564783 17906651
16665A7906651p59293l77119m80354o66660l03185o77798o74380R9966q37535
$$ 17906651 17147358 16770239 16289885 15623225 15320040 14642242 13967862 14067828 13230293
16656A3230293L3565m80898k20142r11952J24896m87430k90777j10962m82182
$$ 13230293 13263858 12782960 12562818 11650866 11775762 11288332 10997555 10886593 10404411
16647A0404411l14763P6415o04498k79101k21572R9545n78066o1381k11026l12452
$$ 10404411 10089648 10166063 9561565 9282464 9060892 9160437 8582371 8520990 8309964 7997512
16637G997512q6902l38598J10066m15558j98851q9768l47793l01955N18871n20085
$$ 7997512 7910610 7572012 7682078 7266520 7067669 6977901 6630108 6328153 6847024 6326939
16627F326939Q446k94816l0644j84118l4937J6671Q0630n22583l58365K24641
$$ 6326939 6335385 6040569 6009925 5825807 5790870 5807541 5888171 5365588 5007223 5231864
16617E231864P9407o62475k6992J99854k9096j29184p1170k01706j58437J8414
$$ 5231864 5311271 4648796 4621804 4821658 4792562 4663378 4592208 4390502 4232065 4250479
16607D250479J25822j26197P5641l85192L51303n55424N2275j26320L38208l31727
$$ 4250479 4376301 4250104 4325745 3940553 4291856 3736432 3788707 3662387 4000595 3668868
16597C668868M8109l59311r7239j71293J07528Q1679L7051j38079j14034p6060
$$ 3668868 3716977 3357666 3260427 3089134 3196662 3278341 3315392 3177313 3063279 2987219
16587B987219j18702J521K58649n10604N50907o703l74061j61455K70300k03787
$$ 2987219 2868517 2870038 3128687 2618083 3168990 3162287 2788226 2626771 2897071 2693284
16577B693284j3508k03851J4800j02913M43811m59835n8905J06200j73078O421
$$ 2693284 2679776 2475925 2490725 2387812 2831623 2371788 2312883 2419083 2246005 2252426
16567B252426l12500M03726p11679M50049O8131j0618k00175Q4770j22419j73250
$$ 2252426 1939926 2343652 1631973 2082022 2150153 2139535 1939360 2024130 1901711 1728461
16557A728461K90366J12206j55524p2l58902K28689k05726j15883L55280j4252
$$ 1728461 2018827 2131033 1975509 1975437 1616535 1845224 1639498 1523615 1878895 1864643
16547A864643R003k49734J07264j33706M4510J64744m40757R0493q9389Q244K19965
$$ 1864643 1873646 1623912 1731176 1597470 1641980 1806724 1365967 1456460 1367071 1375315 1595280
16536A595280k67998m8389J46377m6875j25864J32181M5809M6828n5049K9774
$$ 1595280 1327282 1278893 1425270 1378395 1252531 1384712 1430521 1477349 1422300 1452074
16526A452074Q0411l13947k0616j45703L05834l5747j01335N9849j13451k08552
$$ 1452074 1532485 1218538 1197922 1052219 1358053 1322306 1220971 1280820 1167369 958817
16516I58817N7656j9974N5119k67530L64839K60449q7804j33547j32550o6024
$$ 958817 1016473 996499 1051618 784088 1148927 1409376 1321572 1188025 1055475 989451
16506I89451J21517R358j96575J49440j0413J12453k68792q0351J99519j33224
$$ 989451 1110968 1120326 923751 1073191 1062778 1175231 906439 826088 1025607 892383
16496H92383R2156j30761J52189j42500K1215p737J29928j76681j19472L9460
$$ 892383 984539 853778 1005967 863467 884682 876945 1006873 830192 710720 750180
16486G50180L16229l97035K21759j11931m0817P3117J91334k64812j2785M1637
$$ 750180 1066409 669374 891133 779202 738385 811502 1002836 738024 725239 766876
16476G66876L8589J18157l4556k4661n6335j09770m7652J4417J58625j48317j31228
$$ 766876 805465 923622 889066 864405 808070 698300 650648 665065 823690 675373 544145
16465E44145L17227n8813p8659k6619P9129p4155k1610r104p5542P8069J73252
$$ 544145 861372 802559 723900 697281 776410 702255 680645 671541 595999 674068 847320
16454H47320k46978O5109p9112K57598j66791j06442l9132J81009j0070B56092
$$ 847320 600342 665451 586339 843937 677146 570704 531572 712581 702511 256092
16443E30019K12250m1729O7079j74756J04074K37028j76606k43318J32515k2331
$$ 530019 742269 700540 767619 592863 696937 933965 757359 514041 646556 624225
16433F24225k55320J12499q4273j02671j19602J87637R2426J30867k57732M24581
$$ 624225 368905 481404 397131 294460 174858 362495 454921 585788 328056 752637
16423G52637A96377K75457n3761j14369j46806N01139B27458J00509J91568B26326
$$ 752637 196377 471834 418073 303704 156898 658037 227458 327967 519535 226326
16412C30687L39282J68075l85974N1498o3304M4603J30708j43034K47053k23805
$$ 330687 669969 838044 452070 503568 440264 484867 615575 472541 719594 495789
16402D95789Q2929A77077J97367j74715K23414Q8407j02869P727p1364r8331R2445
$$ 495789 578718 177077 374444 199729 423143 511550 408681 416408 345044 246713 339158
16391C39158L6753B324N08992J57389k33449M1660B29541L03214k30614j5400
$$ 339158 375911 2324 511316 668705 435256 476916 229541 532755 302141 286741
16381B86741L34468j78182j17758F5872J83428K41803O3048j43640r5387L3901
$$ 286741 621209 443027 325269 65872 249300 491103 554151 410511 315124 349025
16371C49025j12939q7252K80703k06850J12856A63590L8325J72285H1799K81289
$$ 349025 236086 148834 429537 222687 335543 163590 201915 374200 81799 363088
16361C63088j22274N35702A4762a64G64617C76528j43620R0330L4685A47670J39771
$$ 363088 240814 776516 14762 -164 764617 376528 232908 323238 357923 147670 287441
16350B87441N433n2202K24178A10565L50908j41174K4828Q413F5682e0368B05563
$$ 287441 292874 240672 464850 110565 461473 320299 345127 353540 65682 -50368 205563
16338E2580K6119M04376j81880p16J42797C6727M15756j39388N3757j10204k35
$$ 52580 78699 483075 301195 300479 443276 36727 452483 313095 366852 256648 256413
16327B56413l223f2702D6516L75060f7849D64778j26452N1278k1757F2436N0745
$$ 256413 253190 -62702 46516 421576 -67849 464778 338326 389604 367847 62436 113181
16316A13181K28211J7523j18788a0425C36938A19980L0175P9034j9544G3530a91762
$$ 113181 341392 358915 240127 -10425 336938 119980 150155 229189 209645 73530 -191762
16304A41838Q041N8924a60912A99557k4684a10907A68419J6551G7197a71214A66616
$$ 141838 149879 208803 -160912 199557 174873 -110907 168419 184970 77197 -171214 166616
16292b25792A76627e3164A03157o005M02343J59779A30320m343L13652G8672N7354
$$ -225792 176627 -53164 103157 97152 499495 659274 130320 125977 439629 78672 136026
16281A36026K85837j44935q8131a08743C78796A75732m8510a50851A2932J7160
$$ 136026 421863 276928 188797 -108743 378796 175732 127222 -150851 12932 30092
16271C0092J25026L3548p3712K29964k6675c7145G4448J66561J51873A60549J47939
$$ 30092 155118 188666 114954 344918 318243 -37145 74448 241009 392882 160549 308488
16260C08488a59607c3064n4926l9B07805M4738C9676R1176K98155a22789B06383
$$ 308488 -159607 -33064 -87990 -88029 207805 252543 39676 130852 429007 -122789 206383
16248A88922i7667D7465M02340H6437a98297A27410a41383B23683M4878o2071
$$ 188922 -97667 47465 449805 86437 -198297 127410 -141383 223683 268561 206490
16238B06490b99128F2556J03061B3435J84832b38364P5165D74779a37845B13854
$$ 206490 -299128 62556 165617 23435 208267 -238364 -163199 474779 -137845 213854
16227A52915E0412Q0383a10866F6274M87705I745K72931K44263k34090H8930J2093
$$ 152915 50412 130795 -110866 66274 553979 9745 282676 526939 292849 88930 101023
16216A01023M33302B06374d131B81265k5105f5639G0132d2688j28452A51203j7111
$$ 101023 534325 206374 -4131 281265 256160 -65639 70132 -42688 -171140 151203 134092
16205A34092C9707a8035o2555L2689A60967d17861a63569P9682L8001B45732I0083
$$ 134092 39707 -18035 -80590 -47901 160967 -417861 -163569 -83887 -45886 245732 90083
16193E8088J83106b63120l0820I6821a69011P0607j09025B97490b68623F755a89620
$$ 58088 241194 -263120 -293940 96821 -169011 -98404 -207429 297490 -268623 6755 -189620
16181E6015O29082a05984K1669A51875J29488c9026m14424A32521L0205C5732
$$ 56015 685097 -105984 -84315 151875 281363 -39026 -453450 132521 162726 35732
16170C32355D8348M6704N581k043i3775G782a0524j38616D6268B0069K75517E256
$$ 332355 48348 95052 100633 98590 -93775 7782 -10524 -149140 46268 20069 295586 5256
16157F5791a05846m5723j6687B12755D4682l18A8482g2437B01462a89638I2431
$$ 65791 -105846 -151569 -168256 212755 44682 44364 18482 -72437 201462 -189638 92431
16145A21431Q9292e1104D5371e4737a3105n7099A42156Q9088l9044i9274M4617
$$ 121431 210723 -51104 45371 -54737 -13105 -70204 142156 231244 192200 -99274 -54657
16134e4657C45872j54902p0380C8453J42052Q1917g0026E740g0835l36365f8696
$$ -54657 345872 190970 120590 38453 180505 262422 -70026 5740 -70835 -407200 -68696
16122G9561Q3576G766R8198R7568a3828j41926c7492k52083a9876A25260m3437
$$ 79561 163137 7766 105964 203532 -13828 -155754 -37492 -289575 -19876 125260 81823
16111H1823g9905J3294p730l0217q2823B73050C4266b3502B67996a0801B36441
$$ 81823 -79905 -66611 -74341 -104558 -187381 273050 34266 -23502 267996 -10801 236441
16099A51963O2735K0085a89485A7769N386N3113M8567C3280J55553Q9899D2016
$$ 151963 214698 234783 -189485 17769 23155 76268 124835 33280 188833 278732 42016
16087B32030H0539j180h4420j16147J2795C50269c75689A6641a46171A7025R583
$$ 232030 80539 79359 -84420 -200567 -187772 350269 -375689 16641 -146171 17025 26608
16076B6608K70686i425I8680a64756C3357b9411k39407e2176A69621a40737J7188
$$ 26608 297294 -9425 98680 -164756 33357 -29411 -268818 -52176 169621 -140737 -123549
16065a23549B76452I9750C8348a81850B71118I212P331b56802N847A92034c6253
$$ -123549 276452 99750 38348 -181850 271118 9212 16543 -256802 -250955 192034 -36253
16053C07832K60258A7600d5356j1817A44458a82845d6095k66951F9820L4101a0223
$$ 307832 568090 17600 -45356 -57173 144458 -182845 -46095 -313046 69820 103921 -10223
16041d6698B9269a26098p1116E3329J02893a25723B1581a64800K2418c9247C18
$$ -46698 29269 -126098 -197214 53329 156222 -125723 21581 -164800 -142382 -39247 318
16029C67788a39054A70551L336q2392J365J35131J8013a82738G8786G508a75636
$$ 367788 -139054 170551 173887 91495 92860 227991 246004 -182738 78786 7508 -175636
16017C2587J06533a98541A43540f696p3139a2312o4037A83777a72712a1743j89726
$$ 32587 139120 -198541 143540 -6696 -79835 -12312 -76349 183777 -172712 -11743 -201469
16006b01469N5110B37425B6651a51590q903E9365g8205B63136j11667G5410e4184
$$ -201469 -146359 237425 26651 -151590 -160493 59365 -78205 263136 151469 75410 -54184
15994I3741a23572F8202a79255A67581a50525J498j4893C81010c1897E5943R527
$$ 93741 -123572 68202 -179255 167581 -150525 -149027 -163920 381010 -31897 55943 65470
15983F5470J98580J86597r5357j47441O7760R6078c10503Q8306J3954C2838p914
$$ 65470 264050 450647 355290 207849 275609 371687 -310503 -222197 -208243 32838 24924
15972B4924a28951A25087j54M1882c5419j74887J02200A70706g6707K5141H7938
$$ 24924 -128951 125087 124933 166815 -35419 -210306 -108106 170706 -76707 -51566 87938
15960A3136a07621J2913j9146M4743q5051E0041a17717l8238A39633g1734k4189
$$ 13136 -107621 -94708 -113854 -69111 -154162 50041 -117717 -155955 139633 -71734 -95923
15949i5923K1906F5237d5034I5519j0914d464r2107O193j13369A05203a47946
$$ -95923 -74017 65237 -45034 95519 84605 -4464 -96571 -90378 -203747 105203 -147946
15937E4136c2435j65789M0179o2714A74740M0883G8175j5223H526J44637Q0836
$$ 54136 -32435 -198224 -158045 -220759 174740 215623 78175 62952 8526 153163 233999
15926B33999a67572c8116C77262h1203o6671A30413P6955m0280b9950Q106q3609
$$ 233999 -167572 -38116 377262 -81203 -147874 130413 207368 167088 -29950 -21844 -105453
15915a05453A36139a60856G3803O3859b67557Q4719p8853b2750j45687o0467o6642
$$ -105453 136139 -160856 73803 137662 -267557 -182838 -261691 -22750 -168437 -228904 -295546
15904b95546H6069a29622G7092p231J20814k7592c3752j07602A11729e485r8905
$$ -295546 86069 -129622 77092 69861 190675 163083 -33752 -141354 111729 -5485 -104390
15893a04390A23671i5083j28387A42097L0960o2499k1101r762a17576K8681C56416
$$ -104390 123671 -95083 -223470 142097 173057 110558 89457 79695 -117576 -88895 356416
15881b89045A19464h4377K8301k8215r71D4034b27451A810L7045a23040l12991
$$ -289045 119464 -84377 -56076 -84291 -85262 44034 -227451 1810 38855 -123040 -436031
15870d36031F040J12935E0176L67872f526C7503b99605A58188E9283c86095a76079
$$ -436031 6040 118975 50176 418048 -6526 37503 -299605 158188 59283 -386095 -176079
15858A1667J47275d9782D74597A69771h8676k47826B87082d1168A31582M9185
$$ 11667 158942 -49782 474597 169771 -88676 -336502 287082 -41168 131582 180767
15848A80767H4856C2656Q4395M8099b70207M9945H0402b53649K9437a557k3507
$$ 180767 84856 32656 117051 165150 -270207 -220262 80402 -253649 -224212 -1557 -25064
15837b5064l9293A23262c92701B3358J23231m1059f813l1021p7578B27642C2293
$$ -25064 -64357 123262 -392701 23358 146589 105530 -6813 -37834 -115412 227642 32293
15825a47493j90772a10291j44529i1772K8623j751G9045c7228B5793P1440R1712
$$ -147493 -338265 -110291 -254820 -91772 -63149 -64900 79045 -37228 25793 97233 188945
15814A88945d1966r5735A7306b32661C3667c49620E9804a28847G3989c86211A28030
$$ 188945 -41966 -137701 17306 -232661 33667 -349620 59804 -128847 73989 -386211 128030
15802A12895N7734c09824M4888R5894c9710j2165G7532a75933Q6215E4471k3366
$$ 112895 170629 -309824 -264936 -169042 -39710 -51875 77532 -175933 -89718 54471 31105
15791C1105b5495k68284b8094q6236A89532p2465E2733b74930a873k26998A5562
$$ 31105 -25495 -293779 -28094 -114330 189532 117067 52733 -274930 -1873 -228871 15562
15779b82118B3504g1228k58204a06357D5502a2825I2291B6059K8211a64942E0140
$$ -282118 23504 -71228 -329432 -106357 45502 -12825 92291 26059 54270 -164942 50140
15767B23785c12624A48922n7226a48000D5742f8938I2939J02611f7941K6362A71365
$$ 223785 -312624 148922 91696 -148000 45742 -68938 92939 195550 -67941 -41579 171365
15755A22574c21962E1005J78888a70412D5788b02173A85898H3852O4914L0382
$$ 122574 -321962 51005 229893 -170412 45788 -202173 185898 83852 148766 179148
15745A79148f1218G055a84620B23052i7002k42943A04765d4549k65005A79743
$$ 179148 -61218 7055 -184620 223052 -97002 -339945 104765 -44549 -309554 179743
15734i3755J2901L473b9908G3352c75989a08684B58146a62377A88690B2067d1934
$$ -93755 -80854 -77381 -29908 73352 -375989 -108684 258146 -162377 188690 22067 -41934
15722h6305F0797K9215d79291a0408p702A52342J36127g8929k26159D1317J1480
$$ -86305 60797 90012 -479291 -10408 -18110 152342 288469 -78929 -305088 41317 52797
15711E2797J18352C7078J86093a68724G0813a58132c2209n6064j28744a677k24169
$$ 52797 171149 37078 223171 -168724 70813 -158132 -32209 -88273 -217017 -1677 -225846
15700b25846b6304j50107A93674b41845L6424O0894D0720b68510I5703h7653a9816
$$ -225846 -26304 -176411 193674 -241845 -205421 -144527 40720 -268510 95703 -87653 -19816
15688c3785A36456l8626B7609f7883E9226P1319Q2390c33169j4643a16921B42772
$$ -33785 136456 97830 27609 -67883 59226 130545 212935 -333169 -347812 -116921 242772
15676f4746k66799a39469c2339j86054R6927H9571j7176J22484a53827A35017
$$ -64746 -331545 -139469 -32339 -218393 -121466 89571 72395 194879 -153827 135017
15665A0267K05044c24665a30230d1753D5511O7306n0264c0296p6840G3431a94164
$$ 10267 215311 -324665 -130230 -41753 45511 112817 62553 -30296 -107136 73431 -194164
15653A29845g0765j3471k09739I5905A1675c07715k798A95671g8186A18338J60720
$$ 129845 -70765 -84236 -293975 95905 11675 -307715 -310513 195671 -78186 118338 279058
15642B79058b62452p39A48604a50877o9556k29367G4824a1822k72699H6301h3527
$$ 279058 -262452 -263191 148604 -150877 -220433 -449800 74824 -11822 -284521 86301 -83527
15630a00059A33420a5180j86214O4651j05336B21101d1405A08464E2098a32617
$$ -100059 133420 -15180 -201394 -136743 -242079 221101 -41405 108464 52098 -132617
15619D6228J63869O7535A28644b1991A24332b70536B08578e61378b08813i6357
$$ 46228 210097 277632 128644 -21991 124332 -270536 208578 -561378 -208813 -96357
15608B69331c00303A50944C1382a96630D1346b61627j80414J09049J38443k2554
$$ 269331 -300303 150944 31382 -196630 41346 -261627 -442041 -332992 -194549 -217103
15598b17103A8123J02782a75676G880J28700b42480d998C07542J700a05797c1101
$$ -217103 18123 120905 -175676 7880 136580 -242480 -4998 307542 309242 -105797 -31101
15586A99043M5875c003B20472a57447m7681j01023J25235c8208q0046G2531b49771
$$ 199043 244918 -3003 220472 -157447 -205128 -306151 -180916 -38208 -118254 72531 -249771
15574A9093c2094l24709Q5175q212J8708J24222J9682j91720H9007a20747j07523
$$ 19093 -32094 -356803 -271628 -279840 -261132 -136910 -117228 -308948 89007 -120747 -228270
15563b28270A69857F4690f5543C17635f6229B64703a51110J6360k7182L8139B7372
$$ -228270 169857 64690 -65543 317635 -66229 264703 -151110 -134750 -161932 -123793 27372
15551a62185M3137C6610b79065h6404B36805O2611c86188C8562c94426E2393K5407
$$ -162185 -119048 36610 -279065 -86404 236805 299416 -386188 38562 -394426 52393 77800
15540G7800b69914B77478i6919F8454b12200A95964F1618a29542c995m3693p9153
$$ 77800 -269914 277478 -96919 68454 -212200 195964 61618 -129542 -3995 -47688 -126841
15529a26841C05625A24117a21809E2723L57572C7557a41920e1607A51777f8974
$$ -126841 305625 124117 -121809 52723 410295 37557 -141920 -51607 151777 -68974
15518h1163E3114b62193I721M2145O8956h4095a610A495L3029c75811D9836a31687
$$ -81163 53114 -262193 9721 51866 120822 -84095 -1610 1495 34524 -375811 49836 -131687
15505F1207b0672f385F145a760G1228a2001A05799l9403B4000B157a44702d5835
$$ 61207 -20672 -6385 6145 -1760 71228 -12001 105799 66396 24000 2157 -144702 -45835
15492f2886H7874l8029b7857I3619g1090m2683C7243m652J51401P2391a61155
$$ -62886 87874 49845 -27857 93619 -71090 -113773 37243 32591 183992 256383 -161155
15480B25057b0479D5299A2363b07289B34087c67110F8677A9303J87592a53536
$$ 225057 -20479 45299 12363 -207289 234087 -367110 68677 19303 206895 -153536
15469a68769p6707J15556j94895d8668m6829j23973J05554E9510b2425A04169
$$ -168769 -245476 -129920 -324815 -48668 -95497 -219470 -113916 59510 -22425 104169
15458a36782g671j2878C41934c76203D73411a01578F8054b9515j11782A26219
$$ -136782 -7671 -20549 341934 -376203 473411 -101578 68054 -29515 -141297 126219
15447G2682b79312a181j10050B77881C1260L22032H3802K91948A021J26406b62320
$$ 72682 -279312 -1181 -111231 277881 31260 353292 83802 375750 1021 127427 -262320
15435D5223a42022F2150d5688L525J6218H1147J51463D7527L06501j64330d09950
$$ 45223 -142022 62150 -45688 -42163 -25945 81147 232610 47527 354028 189698 -409950
15423g0415l98135f5615B9461b14206A59224Q4764a62613P9426b3468k11419g9078
$$ -70415 -468550 -65615 29461 -214206 159224 243988 -162613 -83187 -23468 -234887 -79078
15411A3186J01584m2844b11048A38424b14108A52036J14754H0438b92585J35002
$$ 13186 114770 71926 -211048 138424 -214108 152036 266790 80438 -292585 -157583
15401a57583I1168J01769a30699D2725J30849F7066B3351R5113f842G4939a49022
$$ -157583 91168 192937 -130699 42725 173574 67066 23351 118464 -6842 74939 -149022
15389a28287B45803B7893b08558A09416N0658M640G5889a50058M828A10415Q5962
$$ -128287 245803 27893 -208558 109416 160074 164714 75889 -150058 -145230 110415 196377
15378A96377K47578E1889J65164C0681b66862A37772K46290f9028B89406A12986
$$ 196377 443955 51889 217053 30681 -266862 137772 384062 -69028 289406 112986
15367c13461H6665i8915A86924b62920A01827D1048a67502j14482O5574P8949
$$ -313461 86665 -98915 186924 -262920 101827 41048 -167502 -281984 -216410 -137461
15357a37461M3080F4602J85999a07606B77920H9491h6267I6506i534I5200F636
$$ -137461 -94381 64602 250601 -107606 277920 89491 -86267 96506 -9534 95200 6636
15345f2394A14929L144a33743j47980M5416J07267m310l0938A04935b12293B45944
$$ -62394 114929 118073 -133743 -281723 -236307 -129040 -133350 -164288 104935 -212293 245944
15333b1496q0441B80345J23596c6778J2485n6397F976J19777K0415d51948b11858
$$ -21496 -101937 280345 403941 -36778 -24293 -80690 6976 126753 147168 -451948 -211858
15321B56329F8041n327J37015q7702a35156J494G3359N2464C9437J09716a23305
$$ 256329 68041 62714 199729 112027 -135156 -133662 73359 125823 39437 149153 -123305
15309C39232e7503o4515B47218b23703D6946j6080M8598P3634a021A44271n8041
$$ 339232 -57503 -122018 247218 -223703 46946 30866 79464 153098 -1021 144271 86230
15298H6230J8554a36835j76383A89939b2135k7245A06670E477f30700A84419g2699
$$ 86230 104784 -136835 -313218 189939 -22135 -49380 106670 5477 -630700 184419 -72699
15286A74242B7990a31667B92236A33647R1963a71288D15795A66436J33284o9051
$$ 174242 27990 -131667 292236 133647 225610 -171288 415795 166436 299720 230669
15276B30669J06113q9053K4406p2120f4909B21137a10435k5575j55716a44976
$$ 230669 336782 247729 272135 200015 -64909 221137 -110435 -136010 -291726 -144976
15265A66564B2099J68816a9478I8123J75926A8165J62024J12511b8127B05404
$$ 166564 22099 190915 -19478 98123 274049 18165 180189 292700 -28127 205404
15254C1809a05381B88283f4487C49365o7076M14564O10234q7764l58881K93138
$$ 31809 -105381 288283 -64487 349365 282289 696853 1307087 1219323 860442 1153580
15244A153580E01230r4482j92542P946b1074A37030J7812J2165b01600A29616
$$ 1153580 501230 406748 214206 222152 -21074 137030 154842 167007 -201600 129616
15233B90924K84446a66387A94571Q8641j30678M2567A2021J35634l2579c16039
$$ 290924 575370 -166387 194571 283212 152534 195101 12021 147655 115076 -316039
15222c3714B7777J16417b07084o5973D1622a4044G15012a0465l9906J5233I4604
$$ -33714 27777 144194 -207084 -273057 41622 -14044 715012 -10465 -50371 -35138 94604
15210C02792j48419a1495C50054C9955b31689F4209j2304M8515c2631H0252J68238
$$ 302792 154373 -11495 350054 39955 -231689 64209 51905 100420 -32631 80252 248490
15199B48490P618o4825O03C3621g7537o0607B22378b54268B91509K1185k6533
$$ 248490 256108 191283 191886 33621 -77537 -138144 222378 -254268 291509 312694 286161
15188B86161a53954b7145A21394N0812k5481J94823l1060C3318a08909B3578O1588
$$ 286161 -153954 -27145 121394 172206 146725 341548 310488 33318 -108909 23578 85166
15177H5166L1640H888e6190I8676b04986C27070j16467m8461K35010d1303B85829
$$ 85166 116806 8888 -56190 98676 -204986 327070 210603 162142 397152 -41303 285829
15165C86918j10893j21667K9737G0259J33150J54897o9439A0437J68062l3570
$$ 386918 276025 154358 184095 70259 203409 358306 288867 10437 178499 144929
15155A44929g7262l9164H3990d25739A84349b13267D9143J58576C5164N0196e4256
$$ 144929 -77262 -116426 83990 -425739 184349 -213267 49143 207719 35164 85360 -54256
15143a52988A64317m9210n3558K47798H5429c19632B6490J46444P5358j00368
$$ -152988 164317 115107 61549 309347 85429 -319632 26490 172934 248292 147924
15133A47924a2548p5418O035B13794r6924a75326A1619O7347O6429K5601K11408
$$ 147924 -12548 -87966 -81931 213794 116870 -175326 11619 78966 145395 170996 382404
15122C82404d6464D7345a7874B71514M2326F8386j6627K13099q3130N4464b66917
$$ 382404 -46464 47345 -17874 271514 313840 68386 51759 264858 181728 236192 -266917
15110B37736a75143P1200A97471m6124L19296J70723A8592N3241P2344a61989
$$ 237736 -175143 -103943 197471 151347 470643 641366 18592 71833 144177 -161989
15099a80079a0054E9927J86999j3373D8602K25927A6728M50584b33148A20718
$$ -180079 -10054 59927 246926 233553 48602 274529 16728 467312 -233148 120718
15088A05263l1056k10K3264J51746a8511A9275L82K52211R3555A51797j6619O0816
$$ 105263 74207 73997 97261 249007 -18511 19275 19657 271868 365423 151797 135178 195994
15076A95994A6874P4967J19086J13446A3538L55592A48952K41728i5324L0581
$$ 195994 16874 91841 210927 324373 13538 369130 148952 390680 -95324 -64743
15066f4743A80050E8342J09489J34263K84131d4798B4573J65589M9568n2638E1071
$$ -64743 180050 58342 167831 302094 586225 -44798 24573 190162 239730 187092 51071
15054a46148B74749p8170O3961r4102j5962i3606B28328K70410k16146j03559
$$ -146148 274749 196579 260540 166438 150476 -93606 228328 498738 282592 179033
15044A79033H2006O5231J68672m2808n0223j8817a92238A57255J65596c7386j8436
$$ 179033 82006 147237 315909 273101 222878 204061 -192238 157255 322851 -37386 -55822
15033e5822C64380j20658a93648B94783a16520k41140A97227d0166C59482j37417
$$ -55822 364380 243722 -193648 294783 -116520 -357660 197227 -40166 359482 222065
15023B22065n0645G3509P4473J36825J04292l4956J285a98865A99210O968r4549
$$ 222065 171420 73509 147982 284807 389099 354143 355428 -198865 199210 206178 111629
15012A11629h891c393I8191b28131B51118K48788B42214J69161G2892J30717C4882
$$ 111629 -8891 -3393 98191 -228131 251118 499906 242214 411375 72892 203609 34882
15000A94873L0362K72472k02293j32468J117J29472J41695H0976J74807j20678
$$ 194873 225235 497707 295414 162946 164063 293535 435230 80976 255783 135105
14990A35105J77218M3777a59321D03048j5469A53316J57559C1046Q3002K84193
$$ 135105 312323 356100 -159321 403048 387579 153316 310875 31046 114048 398241
14980C98241j65151L7025E0946P1102m1159L4174L99372A72834n6601J21472l9039
$$ 398241 233090 270115 50946 122048 80889 115063 514435 172834 116233 237705 198666
14969A98666J01074B9396K51254K3900K91210B65829q3447J85757J44611B00736
$$ 198666 299740 29396 280650 304550 595760 265829 182382 368139 512750 200736
14958B72889j23246d9295C77400l4620j02129e6649A93658J26570C1476H620J8785
$$ 272889 149643 -49295 377400 342780 240651 -56649 193658 320228 31476 8620 27405
14947B7405J71174J8563J44697p2558K46536A34819J33782q6678J08107r397m4984
$$ 27405 198579 217142 361839 289281 535817 134819 268601 181923 290030 280633 235649
14936B35649K51903J5188j51078H3699L28620J64472A54696P3273L24280J00967
$$ 235649 487552 502740 351662 83699 412319 576791 154696 227969 552249 653216
14926F53216B16806l2205P2657J99796j45600n505A42920L52307B45443K4206
$$ 653216 216806 184601 257258 457054 311454 305949 142920 495227 245443 269649
14916B69649J30604o4449l885j45722L7824P9705J48644I1933L32596C6057K80949
$$ 269649 400253 335804 331919 186197 224021 303726 452370 91933 424529 36057 317006
14905C17006o1604K56459j51636J15990j85168N372J49264k01398A22032L33771
$$ 317006 255402 511861 360225 476215 291047 296419 445683 244285 122032 455803
14895D55803J85609B89157O693R9381j52274M0831J3989K15275l2569A71808p3022
$$ 455803 641412 289157 295850 395231 242957 283788 297777 513052 480483 171808 98786
14884I8786K32854M3590j7997m2592J71329J05531A66996N3392l1043M3224Q97
$$ 98786 331640 375230 357233 314641 485970 591501 166996 220388 189345 232569 233466
14873B33466J75248L0244q5307l085L03284k94473D6174L65313M1771l0631C1260
$$ 233466 408714 438958 353651 350566 653850 359377 46174 411487 453258 422627 31260
14861D65005r9760K21725j57030K53745q0113J65811C21925K19516J35574C25981
$$ 465005 365245 586970 429940 683685 603572 769383 321925 541441 677015 325981
14850F92373B35977J56271J31097j42849O5151J6023R7676A43653L08050H8654
$$ 692373 235977 392248 523345 380496 445647 461670 559346 143653 451703 88654
14839C89331A26591K77711j72902L47499B56205J14725K50526j82706M0718k2729
$$ 389331 126591 404302 231400 578899 256205 370930 621456 438750 479468 456739
14829D56739j25061L46436l28469J42674M8838j86601r6992L42459A57827K46511
$$ 456739 331678 678114 349645 492319 541157 354556 257564 600023 157827 404338
14819D04338J25765M0729j0331K19105j33046j14064J9361k13442N76411l93193
$$ 404338 530103 570832 560501 779606 646560 532496 551857 338415 914826 521633
14809E21633J7617P7094B06956K67316q9130J06261l2050j17350J15467J23909
$$ 521633 539250 616344 206956 474272 385142 491403 459353 342003 457470 581379
14799E81379J01767q6845N2323k09371B02531M65041k24077j41117j09624L40374
$$ 581379 683146 596301 648624 439253 202531 667572 443495 302378 192754 533128
14789E33128L05212j81055N4830j00746L9331r921j24872J75635B50001L22206
$$ 533128 838340 657285 712115 611369 650700 640779 515907 691542 250001 572207
14779E72207K82739l80398m7800L20530N3601j23767j57680K83446l95843J51686
$$ 572207 854946 474548 426748 747278 800879 677112 519432 802878 407035 558721
14769E58721N2641M1845L05086k32655o1017r5865j64855R6828N19412D90458
$$ 558721 611362 653207 958293 725638 664621 568756 403901 500729 1020141 490458
14758E86501J94127l74436R6887J1501J23820J09704l2201Q3571J7717k78124
$$ 586501 780628 406192 503079 514580 638400 748104 715903 799474 817191 539067
14748E39067M47842D49099J68090J94339j30763k28330R7530J32364L06113J12202
$$ 539067 986909 449099 617189 811528 680765 452435 549965 682329 988442 1100644
14738A100644l08406p8510k72981M63566J287l2966k91312M45351l00282j86343
$$ 1100644 792238 713728 440747 904313 905600 872634 581322 1026673 726391 540048
14728E40048j68677P59458j99001k52081K81707o5860J84920k97912o644M03730
$$ 540048 371371 1130829 931828 679747 961454 895594 1080514 782602 775958 1179688
14718A179688k95734K4859p6343J79098j06685j04049L9410J361K50241j73939
$$ 1179688 883954 908813 832470 1011568 904883 800834 840244 841605 1091846 917907
14708I17907j29153J86952J23246r9321r6724R4380j31466o3560J89444k58653
$$ 917907 788754 975706 1098952 999631 902907 997287 865821 802261 991705 733052
14698G33052J71419r2990L76319j54281j31156O6834N1207j25533j40762K9238
$$ 733052 904471 811481 1187800 1033519 902363 969197 1020404 894871 754109 783347
14688G83347Q8996K59018n50118L38643j65729R4366n8060L92026j06917R4653
$$ 783347 872343 1131361 581243 919886 754157 848523 790463 1182489 1075572 1170225
14678A170225k2442l17332L99159l3420k22415J54804k34289J6735K161J53160
$$ 1170225 1147783 830451 1229610 1196190 973775 1128579 894290 911025 913186 1066346
14668A066346J2165J60154j37038j43025K06988k49472K81904j25793j12272M34968
$$ 1066346 1078511 1238665 1101627 958602 1165590 916118 1198022 1072229 959957 1394925
14658A394925j17142k9050m13840K29070K04194j03738M3052k02221N56034k40776
$$ 1394925 1277783 1248733 834893 1063963 1268157 1164419 1207471 1005250 1561284 1320508
14648A320508k24570P4806j74628L25138k97787K51304q6379j54248K9539J87787
$$ 1320508 1095938 1170744 996116 1321254 1023467 1274771 1188392 1034144 1063683 1251470
14638A251470o1335M1272L30466j21572j30728K39197n50208K64739m9289K63960
$$ 1251470 1190135 1231407 1561873 1440301 1309573 1548770 998562 1263301 1214012 1477972
14628A477972R0144q9140k05724J37200J42847o3254R5781l02698L26519m6489
$$ 1477972 1568116 1478976 1273252 1410452 1553299 1490045 1585826 1283128 1609647 1563158
14618A563158K62992j29780l21503r0022J70262L42617o33524N34365l6729l68161
$$ 1563158 1826150 1696370 1374867 1284845 1455107 1797724 1164200 1698565 1661836 1293675
14608A293675K55350K09493j80979j8622R8838l5824J15799Q9207P0661k86196
$$ 1293675 1549025 1758518 1577539 1558917 1657755 1621931 1737730 1826937 1897598 1611402
14598A611402j57218L55837k79863L16966Q0165R2459J3170k45594K32019k08872
$$ 1611402 1454184 1810021 1530158 1847124 1927289 2019748 2032918 1787324 2019343 1810471
14588A810471J45291q0058P4532J74983m35223J56159n9152L79571K88905l81825
$$ 1810471 1955762 1875704 1950236 2125219 1689996 1846155 1787003 2166574 2455479 2073654
14578B073654R9170O1791N5609k80853M24140J57697k98712j16035L8679L90502
$$ 2073654 2172824 2234615 2290224 2009371 2433511 2591208 2292496 2176461 2215140 2605642
14568B605642k27913R9519r3775j95786L74400J61746J59072k46822K53945N926
$$ 2605642 2377729 2477248 2383473 2187687 2562087 2723833 2882905 2636083 2890028 2895954
14558B895954K7647M8179K3763L86325L81445J76587M07760L35698J386870K103638
$$ 2895954 2923601 2971780 2995543 3381868 3763313 3939900 4347660 4683358 6070228 8173866
14548H173866M075813R769987K1980775N699303B2151534H130448C683583q20524
$$ 8173866 12249679 22019666 44000441 49699744 22151534 8130448 3683583 2863059
14540B863059n73086r583k87864K06401j35587K07014m70807M54507L420k29880
$$ 2863059 2289973 2280390 1992526 2198927 2063340 2270354 1799547 2254054 2257474 2027594
14530B027594M86661j25671k27017M5783K48607J78281j47878j71819J67258L39505
$$ 2027594 2514255 2388584 2161567 2207350 2455957 2634238 2486360 2314541 2481799 2821304
14520B821304j76499Q4660k75778M37787J75879l73523K06922j93824j24908P3098
$$ 2821304 2644805 2729465 2453687 2891474 3067353 2693830 2900752 2706928 2582020 2655118
14510B655118J96231N4092L24063j06584J80046k42383J19633Q2843J39912J967
$$ 2655118 2851349 2905441 3229504 3122920 3302966 3060583 3180216 3263059 3402971 3404938
14500C404938l3932j09529J59493M65963l87720k2452k298K84925m40089J42370
$$ 3404938 3371006 3261477 3420970 3886933 3499213 3476761 3474463 3759388 3319299 3461669
14490C461669J35054k31105L23433k46100O78284l74951J37668R7465J38791K70043
$$ 3461669 3596723 3365618 3689051 3442951 4121235 3746284 3883952 3981417 4120208 4390251
14480D390251m40956L00779j15317Q015J22017K24091l19476M22407j69751R9625
$$ 4390251 3949295 4250074 4134757 4142772 4264789 4488880 4169404 4591811 4422060 4521685
14470D521685M19139k56479N6167J02341j84981M78730l44492M66837J38668k79764
$$ 4521685 4940824 4684345 4740512 4842853 4657872 5136602 4792110 5258947 5397615 5117851
14460E117851K42547m2105J05669j60416j26020K70317J22115J36614r6617R9324
$$ 5117851 5360398 5318293 5423962 5263546 5137526 5407843 5529958 5666572 5569955 5669279
14450E669279R2871k70894K94701L25116p2151p6381J56009O021K7379L84625
$$ 5669279 5762150 5491256 5785957 6111073 6038922 5962541 6118550 6124571 6151950 6536575
14440F536575J21647k26071n0929L19136l2888K76556l5438L83907p6137n170
$$ 6536575 6658222 6432151 6381222 6700358 6667470 6944026 6908588 7292495 7216358 7211188
14430G211188J66049j41614P2414L07903J67569k24468M99294j32154J59894K91050
$$ 7211188 7377237 7235623 7308037 7615940 7783509 7559041 8058335 7926181 8086075 8377125
14420H377125N9649J66910R2498J61106n0703J5952J56732P3089L29358m42235
$$ 8377125 8436774 8603684 8696182 8857288 8806585 8822537 8979269 9052358 9381716 8939481
14410H939481P77629O7680L32325K3252k6907K63321r0395N31595O6602J22087
$$ 8939481 9717110 9784790 10117115 10140367 10113460 10376781 10286386 10817981 10884583 11006670
14400A1006670K39331K01562l2068N56499m42391P76189r3983L29777K84508K21325
$$ 11006670 11246001 11447563 11415495 11971994 11529603 12305792 12211809 12541586 12826094 13047419
14390A3047419J12945K00625L69070R8984M6697P05457j40564M01950L15101P4118
$$ 13047419 13160364 13360989 13730059 13829043 13875740 14581197 14440633 14842583 15157684 15231802
14380A5231802K73358M80407M72121j08786L49945M24675M48761L53448L98531
$$ 15231802 15505160 15985567 16457688 16348902 16698847 17123522 17572283 17925731 18324262
14371A8324262n9244Q27354J65664K67005N58159N6009M39220M62124M74810O79040
$$ 18324262 18265018 19092372 19258036 19525041 20083200 20139209 20578429 21040553 21515363 22194403
14361B2194403P85315L01792N08911L03606N23208N95043Q95332N37228L40169
$$ 22194403 22979718 23281510 23790421 24094027 24617235 25212278 26107610 26644838 26985007
14352B6985007R36581N49849J084304M03933O29690R32288N00519R42849P98148
$$ 26985007 27921588 28471437 29555741 29959674 30589364 31521652 32022171 32965020 33763168
14343C3763168O23610J192246J016253R79469P83044J392228O05059J073806J491874
$$ 33763168 34386778 35579024 36595277 37574746 38357790 39750018 40355077 41428883 42920757
14334D2920757J422942Q47647J786174J203229J661188J290506J905800J445194
$$ 42920757 44343699 45191346 46977520 48180749 49841937 51132443 53038243 54483437
14326E4483437J915651J378955J932314K129049K061656K227403K255168K914145
$$ 54483437 56399088 57778043 59710357 61839406 63901062 66128465 68383633 71297778
14318G1297778K171358K680409K583584L202198K987196L412087L418526L813232
$$ 71297778 73469136 76149545 78733129 81935327 84922523 88334610 91753136 95566368
14310I5566368L466306M247905M580426M087141N027780N074831N257646N764274
$$ 95566368 99032674 103280579 107861005 111948146 116975926 122050757 127308403 133072677
14302A33072677N817489O329890O943166O925198P613668P944450Q756270Q919966
$$ 133072677 138890166 145220056 152163222 159088420 166702088 174646538 183402808 192322774
14294A92322774R651179J0011266J0337483J1193644J1898684J2119802J2527398
$$ 192322774 201973953 211985219 222322702 233516346 245415030 257534832 270062230
14287B70062230J3465083J3553504J3980569J4599489J5063323J4525343J5223667
$$ 270062230 283527313 297080817 311061386 325660875 340724198 355249541 370473208
14280C70473208J4732349J4308981J3699168J2632742J1938767J0129934P284803
$$ 370473208 385205557 399514538 413213706 425846448 437785215 447915149 455199952
14273D55199952L964883K310760J250798J01215j629577k7050l111970o122537
$$ 455199952 459164835 461475595 462726393 462827608 461198031 461170981 458059011 451936474
14265D51936474q149660r334533j1330806j2786703j3723659j4410484j4698419
$$ 451936474 443786814 434452281 423121475 410334772 396611113 382200629 367502210
14258C67502210j5243410j5104728j4830312j4233508j3448766j3839983j3182120
$$ 367502210 352258800 337154072 322323760 308090252 294641486 280801503 267619383
14251B67619383j2579872j2569250j1407940j0961865j0435134j0241178q847554
$$ 267619383 255039511 242470261 231062321 220100456 209665322 199424144 190576590
14244A90576590q862354q212940p934945p730693p251157o394189o331538n305036
$$ 190576590 181714236 173501296 165566351 157835658 150584501 144190312 137858774 132553738
14236A32553738o023338n745530m660033n024839m355986l641822m101822m017030
$$ 132553738 126530400 120784870 116124837 111099998 106744012 103102190 99000368 94983338
14228I4983338l849712l475787l261494l217632k645088k933048k777883k375798
$$ 94983338 91133626 87657839 84396345 81178713 78533625 75600577 72822694 70446896
14220G0446896j944745k685269k355619k024233j901278j860298j548201j512387
$$ 70446896 68502151 65816882 63461263 61437030 59535752 57675454 56127253 54614866
14212E4614866k188189j352421j732427j650434r28680o98117j577801j342704
$$ 54614866 52426677 51074256 49341829 47691395 46762715 46064598 44486797 43144093
14204D3144093j222343j633467j221172l34094o08723j384100j225094j193738
$$ 43144093 41921750 40288283 39067111 38733017 38124294 36740194 35515100 34321362
14196C4321362l93483j046200p62923o37837m68297j147559p02864o76870r49398
$$ 34321362 33927879 32881679 32118756 31480919 31012622 29865063 29162199 28485329 27535931
14187B7535931l83689o39256l75956r85263j34979n83794m88289p44379l87810
$$ 27535931 27152242 26512986 26137030 25151767 25016788 24432994 23944705 23200326 22812516
14178B2812516p69981N5276q21265k88693m98601k36421n48615l27509k46099
$$ 22812516 22042535 22097811 21276546 20987853 20489252 20252831 19704216 19376707 19130608
14169A9130608k94293n58813m22456p8710l29046j8358p72493k25025m24340j479
$$ 19130608 18836315 18277502 17855046 17776336 17447290 17428932 16656439 16431414 16007074 16005595
14159A6005595l59814n58378j94261l42786j82243j1358j15991n98221K3014L2421
$$ 16005595 15645781 15087403 14893142 14550356 14368113 14356755 14240764 13642543 13665557 13697978
14149A3697978l95597P4492p91841J5533k16734l99251N6613r8161k74644k56044
$$ 13697978 13302381 13376873 12585032 12600565 12383831 11984580 12041193 11943032 11668388 11412344
14139A1412344k79166k11426k39228l9060N0316k89058k98517J07665k49182L130
$$ 11412344 11133178 10921752 10682524 10643464 10693780 10404722 10106205 10213870 9964688 9967818
14129I967818m76862J6967L16914m35753n14298k2101k9393k96847L27996k48522
$$ 9967818 9490956 9507923 9824837 9389084 8874786 8852685 8823292 8526445 8854441 8605919
14119H605919K53925l46820j74127k19649O9147l50023j012j47521j93860J22006
$$ 8605919 8859844 8513024 8338897 8119248 8188395 7838372 7837360 7689839 7495979 7617985
14109G617985k93233J09507l72390K55303k95171J31918m25030K48339k58353
$$ 7617985 7324752 7434259 7061869 7317172 7022001 7153919 6728889 6977228 6718875
14100F718875j33771p918l89783K80251m4832j27102j11124q4676J66613o80094
$$ 6718875 6585104 6577186 6187403 6467654 6422822 6295720 6184596 6099920 6266533 5586439
14090E586439M07630Q19j57003l73770j425J35457J30758l58545k6554K3396k15749
$$ 5586439 5994069 5994888 5837885 5464115 5462690 5598147 5728905 5370360 5343806 5367202 5151453
14079E151453K0510K88936k76434l43838J68577M9951j31578k58491K55753l33334
$$ 5151453 5171963 5460899 5184465 4840627 5009204 5059155 4927577 4669086 4924839 4591505
14069D591505j19808J26592O8881J00143j41821m21817K06371O5745N0059M0855
$$ 4591505 4471697 4598289 4667170 4767313 4625492 4203675 4410046 4475791 4525850 4566705
14059D566705l4185Q5265Q847j98732m2523k12632j00409j57472j19511K1212
$$ 4566705 4532520 4617785 4626632 4427900 4385377 4172745 4072336 3914864 3795353 3816565
14049C816565J40475l48293M34508l11390j13790L28468j66329j38190J34298
$$ 3816565 3957040 3608747 4043255 3731865 3618075 3946543 3780214 3642024 3776322
14040C776322l53420K62347n2310m95734K73199j22504n4203P7087J28116L0039
$$ 3776322 3422902 3685249 3632939 3137205 3410404 3287900 3233697 3310784 3438900 3468939
14030C468939K36194l28585q3178p5315p7592J92806j64096K684k33522k66290
$$ 3468939 3705133 3376548 3293370 3218055 3140463 3333269 3169173 3171857 2938335 2672045
14020B672045K78579K56437k40917k4010r3610K5904k69019J52311j78091M20892
$$ 2672045 2950624 3207061 2966144 2942134 2848524 2874428 2605409 2757720 2579629 3000521
14010C000521n84301K10692M24354p28487K91293J8333j18032j99643o5397J90273
$$ 3000521 2416220 2626912 3051266 2322779 2614072 2632405 2514373 2314730 2249333 2439606
14000B439606j52514m2412K99010n85887K2673J43443L61414q2621j93158L09111
$$ 2439606 2287092 2244680 2543690 1957803 1980476 2123919 2485333 2402712 2209554 2518665
13990B518665J06939J020708L009908P148884K1552974J6432758k4049296A3282649
$$ 2518665 2625604 3646312 6656220 13805104 35358078 51790836 27741540 13282649
13981G975134j869577j260292m35981n59784j98000J7069m93490j98175J09018
$$ 7975134 6105557 4845265 4409284 3849500 3651500 3668569 3175079 2976904 3085922
13972C085922l9554K61376m90198o527l05216L42058j4186m49918J75647o8459
$$ 3085922 3046368 3307744 2817546 2811019 2505803 2847861 2833675 2383757 2559404 2490945
13962B490945j7719J4756O6955j76247L9775l22313n3862K05686l30441K81171
$$ 2490945 2473226 2487982 2554937 2378690 2418465 2096152 2042290 2247976 1917535 2198706
13952B198706l95596L70983J61040j78222j18957j8332M01429j06408o87659L33987
$$ 2198706 1803110 2174093 2335133 2156911 2037954 2019622 2421051 2314643 1626984 1960971
13942A960971m1496k1509J75616r199m18994L25468k93418K24494m1414J2923
$$ 1960971 1919475 1897966 2073582 2064383 1645389 1970857 1677439 1901933 1860519 1873442
13932A873442l5001O7668j1771l61709N42537j55667j39511o3779M27912l21340
$$ 1873442 1838441 1906109 1894338 1532629 2075166 1919499 1779988 1716209 2144121 1822781
13922A822781J02903k44924j8541L09475k81446J03974k36092k02926Q19250n59818
$$ 1822781 1925684 1680760 1662219 1971694 1690248 1794222 1558130 1355204 2174454 1614636
13912A614636J86020J63845l83348j24233m9088R3338L2229j60607R0548O4945
$$ 1614636 1800656 1964501 1581153 1456920 1407832 1501170 1533399 1372792 1463340 1528285
13902A528285p8183K2908l7975K54941m12351Q2012j58036L37338k23857K28773
$$ 1528285 1450102 1473010 1435035 1689976 1277625 1359637 1201601 1538939 1315082 1543855
13892A543855K93071k77515k48979M00706n49419N23028j16713m78092L52098
$$ 1543855 1836926 1559411 1310432 1711138 1161719 1684747 1568034 1089942 1442040
13883A442040k07729J5676L69930m15423o3694L10165k6403k6904L5205O4353
$$ 1442040 1234311 1249987 1619917 1204494 1140800 1450965 1424562 1397658 1432863 1497216
13873A497216l52478K42561l4649L77741n89487j51485O05401r1475J9100j76551
$$ 1497216 1144738 1387299 1352650 1730391 1140904 989419 1594820 1503345 1522445 1345894
13863A345894j59102l04492J91925K37966k52687K17763p0248j18679Q8909K2349
$$ 1345894 1186792 882300 1074225 1312191 1059504 1277267 1207019 1088340 1177249 1199598
13853A199598Q0189m46483Q8454L35718o7284k13384J11329O916r8151K06821
$$ 1199598 1279787 833304 921758 1257476 1190192 976808 1088137 1095053 996902 1203723
13843A203723J62540o24597N68454k9273l18309K99366n930J27491r2644l5397
$$ 1203723 1366263 741666 1310120 1280847 962538 1261904 1255974 1383465 1290821 1255424
13833A255424l49911J16530j84480M63753m0415M1447q5953l27839J80085q051
$$ 1255424 905513 1022043 837563 1301316 1260901 1302348 1216395 888556 1068641 1060590
13823A060590o6578j59134J71389L1656k64540K55038O5833k02376P0020m2075
$$ 1060590 994012 834878 1006267 1037923 773383 1028421 1094254 891878 961898 919823
13813I19823L58895l26487L2620m02643K64617j13149K18856L6358L9557k59089
$$ 919823 1278718 952231 984851 582208 846825 733676 952532 988890 1028447 769358
13803G69358m0816j53096K51059J1909J91518q2219j49989K3082k17393K65494
$$ 769358 728542 575446 826505 838414 1029932 947713 797724 820806 603413 868907
13793H68907J66643j34696K0610Q2463k98105K76504l03678K7720J15932r3216
$$ 868907 1035550 900854 921464 1003927 705822 982326 678648 706368 822300 729084
13783G29084J69584J00839l08577K63220l13388M5923J14991J18247k63855o7125
$$ 729084 898668 999507 690930 954150 640762 686685 801676 919923 656068 588943
13773E88943K43232j72097Q7735J4323l8942j97670L08283J39572j48974j61732
$$ 588943 832175 660078 747813 762136 723194 525524 833807 973379 824405 662673
13763F62673r4263J85101M5667K48737m82152J57157n8677R9627K94477D07328
$$ 662673 568410 753511 799178 1047915 565763 722920 664243 763870 1058347 407328
13752F15454Q6914p3115J44145J87904q5523Q7944D36061J95902Q3987j8791P605
$$ 615454 702368 629253 773398 961302 875779 963723 436061 631963 715950 697159 704764
13741G04764J17723k2846k61984J92221r4613L9944J50070l36394L75000k03314
$$ 704764 822487 799641 537657 729878 635265 675209 825279 488885 863885 660571
13731F60571K74405k56246J37680k83765j12052M19515k10392L6194P6926j69686
$$ 660571 934976 678730 816410 532645 420593 840108 629716 665910 742836 573150
13721E73150O6068J16659M1215C03440L8343L82181o3046J92291j97363J81446
$$ 573150 639218 755877 797092 303440 341783 723964 660918 853209 655846 837292
13711H37292j86523M2488j82990L51714l18376B36989K62301k07852M36022k45981
$$ 837292 650769 693257 510267 861981 543605 236989 499290 291438 727460 481479
13701D81479J87576J9109m0872J73592p6389k63642l7417l0719K28149k33285
$$ 481479 669055 688164 647292 820884 744495 480853 443436 412717 640866 407581
13691D07581L63277l60272N93734r6148o7726C45024M27896J01897k75763r7804
$$ 407581 770858 410586 1004320 908172 840446 345024 772920 874817 599054 501250
13681E01250J18608m3041J60021B68495n346M69785l10997Q0164P5168r2919J14116
$$ 501250 619858 576817 736838 268495 263149 732934 421937 502101 577269 484350 598466
13670E98466p3640j38992N0932P9625j25705A74856M24188N1958k63348K52626
$$ 598466 524826 385834 436766 516391 390686 174856 599044 651002 387654 640280
13660F40280B21796N21306j48952I5026M67389p0727j78300p1152O11285k07712
$$ 640280 221796 743102 594150 95026 562415 491688 313388 242236 853521 645809
13650F45809A08949N65187j25726P3730B76471j2405n1489K82535l1936K30020
$$ 645809 108949 674136 548410 622140 276471 264066 212577 495112 463176 693196
13640F93196M8416k01115A37724J98192j36325M32831B59937K32579k2548k7824
$$ 693196 741612 540497 137724 335916 199591 632422 259937 492516 469968 442144
13630D42144k02167l9328L94979A55039L98475k7801B56454M13835B75686j063
$$ 442144 239977 200649 595628 155039 553514 525713 256454 670289 275686 274623
13620B74623L5161J26903J3708p6420K10211L3270k05065j44212L64938j84196
$$ 274623 309784 436687 450395 373975 584186 617456 412391 268179 633117 448921
13610D48921k275j24370A60829J7484L29356J08232j32253A72548J65462L42212
$$ 448921 446646 322276 160829 178313 507669 615901 483648 172548 338010 680222
13600F80222o8830l8513m4523G4778K88537p6630K60164k18176K7488n9255K53538
$$ 680222 611392 572879 528356 74778 363315 286685 546849 328673 356161 296906 550444
13589E50444D6345L30772K42410j23442k02549j4992f917D76529A48701K61348
$$ 550444 46345 377117 619527 496085 293536 278544 -6917 476529 148701 410049
13579D10049J6722p088j58007n7664Q8944Q969L07295k81840K01473q7590j12345
$$ 410049 426771 419683 261676 204012 292956 301925 609220 327380 528853 441263 328918
13568C28918M1216O4627j00614J01700k6236j2519L09902d6034C23107K29335
$$ 328918 370134 434761 334147 435847 409611 397092 706994 -46034 323107 552442
13558E52442l2709k26035A19874K05432L79976C38822J86644A10114K26223J48618
$$ 552442 519733 293698 119874 325306 705282 338822 525466 110114 336337 484955
13548D84955B10028J36378K99223A96673J32154j55761J71102J97894e9710I9833
$$ 484955 210028 346406 645629 196673 328827 173066 344168 542062 -59710 99833
13537D80660j7832L57742m03087A62518J0118K06628K07641j71949L18706B36766
$$ 480660 462828 820570 417483 162518 172636 379264 586905 414956 733662 236766
13526C76402O9159J1489J69800k69402F4471j0655J95492b68786B77558P2919
$$ 376402 445561 457050 626850 357448 64471 53816 249308 -268786 277558 350477
13516C50477A13176N1366K26311j54774K34705A08781K1579J18119K88543B23420
$$ 350477 113176 164542 390853 236079 470784 108781 130360 248479 537022 223420
13505B85270G1730P5014K63037j56076L5077j3923j9072c655D40373J4740J4274
$$ 285270 71730 146744 409781 253705 288782 274859 255787 -3655 440373 455113 469387
13494D69387B07716F1769O0587K81242O9755k24918K04875Q195b7850H5324K32582
$$ 469387 207716 61769 122356 403598 473353 248435 453310 461505 -27850 85324 317906
13483C17906R4342j76592L7140J70211j35444D8073J37796K72928j22893j37151
$$ 317906 412248 235656 272796 443007 307563 48073 185869 458797 335904 198753
13473A98753J88048k9158A78776M03283k77567j03064l5524J20436A12472J75931
$$ 198753 386801 357643 178776 582059 304492 201428 165904 286340 112472 288403
13463B88403r594p9657J30174r2114b6015B71520C336O4151h5449F3013J40349
$$ 288403 278809 199152 329326 237212 -26015 271520 3336 67487 -85449 63013 203362
13452B03362K52455O4390q5079B2928a16392B99877L9602K40959A33955J36579
$$ 203362 455817 520207 435128 22928 -116392 299877 339479 580438 133955 270534
13442B70534l1325m4188j5119K19812A52978L11355O2395A01866a13267B42792
$$ 270534 239209 195021 179902 399714 152978 464333 526728 101866 -113267 242792
13431C39505o0089a03286D50846A44976J47373p7799i6206E97731B56403K8496
$$ 339505 279416 -103286 450846 144976 292349 214550 -96206 597731 256403 284899
13421B84899J33995D286R4565d2815B26101l1863J76447m9108A59994L86535k8823
$$ 284899 418894 4286 98851 -42815 226101 194238 370685 321577 159994 546529 517706
13410E17706k10717E6420Q4015J15671o2743J0772P5566M9671B1348J41186k1884
$$ 517706 306989 56420 140435 256106 193363 204135 279701 329372 21348 162534 140650
13399A40650K74186A50861J86940j22662J54114j43928a40793H3942J35012j05702
$$ 140650 414836 150861 337801 215139 369253 225325 -140793 83942 218954 113252
13389A13252a78006C82600j82846Q0551n0495K35824l8687B09026M4000J09581
$$ 113252 -178006 382600 199754 280305 229810 465634 426947 209026 253026 362607
13379C62607D0502Q0317J67555E0432K61403F9167K56723L0401N1904F4092R3161
$$ 362607 40502 120819 288374 50432 311835 69167 325890 356291 408195 64092 157253
13368A57253a28712A73066J35382q6874p9629K84906A80011j3833K6446E6983
$$ 157253 -128712 173066 308448 221574 141945 426851 180011 166178 192624 56983
13357G2086B2493L93183B5308Q307M76903j41867j69428H8117J25957K35092C6622
$$ 72086 22493 415676 25308 33615 510518 368651 199223 88117 214074 449166 36622
13345F12594k67812J87121O8475j41884j58169p4477e0652k3726C09673H4977
$$ 612594 344782 531903 600378 458494 300325 225848 -50652 -74378 309673 84977
13334B89399K91770B27705k7140l7264L14158A09165l3872J78694p2626N7264
$$ 289399 581169 227705 200565 163301 477459 109165 75293 253987 181361 238625
13324B38625j09988J24792o7242J13918J40728j06358N9148J44567B41343D1295
$$ 238625 128637 253429 186187 300105 440833 334475 393623 538190 241343 41295
13313A36284M13565h6078F8523a07356A79450L19137G0638Q209B146b0152D99368
$$ 136284 549849 -86078 68523 -107356 179450 498587 70638 78847 2146 -20152 499368
13301H1161e0247A41770J01802I6573B7179J1706e6670B62534l3733n8309J74667
$$ 81161 -50247 141770 243572 96573 27179 38885 -56670 262534 228801 170492 345159
13290C45159A15417J0721a54369D71077J38255j90653A5761L94297p5650c7785
$$ 345159 115417 126138 -154369 471077 609332 418679 15761 410058 334408 -37785
13279B96366Q2290A67223D6589J42748m9571J0531D1665L16990F8130K71284m6431
$$ 296366 378656 167223 46589 189337 139766 150297 41665 358655 68130 339414 292983
13268B92983P1803j06500A3651N20494D2291J38348d7497A14904l7482L30913
$$ 292983 364786 258286 13651 534145 42291 180639 -47497 114904 77422 408335
13258D08335k01190N9332L7140D3994a40158A19616J90826D89c9513A09914B2312
$$ 408335 207145 266477 303617 43994 -140158 119616 310442 489 -39513 109914 22312
13246D40706A23598K05270N8541j1212j32213r8498o0661K22086a56475E44572
$$ 440706 123598 328868 387409 376197 243984 145486 84825 306911 -156475 544572
13235e7410E1226L66161A92503J62657g6662D1963J54443n0948n1843B3212K07652
$$ -57410 51226 417387 192503 355160 -76662 41963 196406 145458 93615 23212 230864
13224B30864a56222d2326A52698M524L8265n6040a19412A45799k2044J21213j11452
$$ 230864 -156222 -42326 152698 157222 195487 139447 -119412 145799 123755 244968 133516
13213A33516K7018A3846K94214a0470j05481A32258b72946A22368J75679j35391
$$ 133516 160534 13846 308060 -10470 -115951 132258 -272946 122368 298047 162656
13203A62656a3940B60274e7367B5894O8666a08417j72447f1272B54673R9431A48019
$$ 162656 -13940 260274 -57367 25894 94560 -108417 -280864 -61272 254673 354104 148019
13191e1711C2998m464J61560b36758C11151l2920A15476Q9775D8238J83287o2200
$$ -51711 32998 28534 190094 -236758 311151 278231 115476 205251 48238 231525 169325
13180A69325g9184C31158A5301K5559e6420j23960A51973F0297B4627a24722B11952
$$ 169325 -79184 331158 15301 40860 -56420 -180380 151973 60297 24627 -124722 211952
13168d4272B44079C9910L02634A30968a40414N9500B37799N7077D50J59844k4088
$$ -44272 244079 39910 342544 130968 -140414 -80914 237799 294876 450 160294 136206
13157A36206L9546n6944d6550A64002k8815g5076B47004a39324A0707K64712j3467
$$ 136206 175752 118808 -46550 164002 135187 -75076 247004 -139324 10707 275419 261952
13146B61952d5949E55767E7617J17881j425a86017B43095c8256d514B31507o5573
$$ 261952 -45949 555767 57617 175498 174073 -186017 243095 -38256 -4514 231507 165934
13135A65934J23735H056a52890g4594A15263j7292K93836j73705l029c4141A78452
$$ 165934 289669 8056 -152890 -74594 115263 97971 391807 218102 215073 -34141 178452
13123A9351D102J14257l926O9748b57562h1788D0536j9361c0651j59135P8026
$$ 19351 4102 118359 114433 184181 -257562 -81788 40536 21175 -30651 -189786 -111760
13112a11760D9707a0802G4425L55580B8878P454Q6890J44938c3379A96965I2843
$$ -111760 49707 -10802 74425 430005 28878 36332 123222 268160 -33379 196965 92843
13100A02720a03011E57877a20804C15295a47344A35929L0596B3457a99837G8679
$$ 102720 -103011 557877 -120804 315295 -147344 135929 166525 23457 -199837 78679
13089d8157p3441D22325I8839K27524B9418K6777H388a19128L0047E5903J62286
$$ -48157 -121598 422325 98839 326363 29418 56195 8388 -119128 -89081 55903 218189
13078B18189a08300B17727a85546C73611E7525L4305A2277K37730a20835C45527
$$ 218189 -108300 217727 -185546 373611 57525 91830 12277 250007 -120835 345527
13067C35562G9819J7349N0128K18791F8786a0505B89061c08129F7383a2930A68413
$$ 335562 79819 97168 147296 366087 68786 -10505 289061 -308129 67383 -12930 168413
13055B83640C2046J00227a44236B83108J0092A03207J48539A24130J4206k5990
$$ 283640 32046 132273 -144236 283108 293200 103207 251746 124130 138336 112346
13045A12346b38366E7411M8135J59343O7391E0538M8247J13759O3826i2928B19727
$$ 112346 -238366 57411 105546 264889 332280 50538 98785 212544 276370 -92928 219727
13033A21753K64468B7359c0576D3059B1257J8985J78215m2082b00968B57741b54567
$$ 121753 386221 27359 -30576 43059 21257 40242 218457 176375 -200968 257741 -254567
13021c69056B83330I9478a12151j82430E2771K47225O3296b3633H1624M30501
$$ -369056 283330 99478 -112151 -294581 52771 299996 363292 -23633 81624 512125
13011E12125D6322J22951h787D3169J4934O71414e2803C64164q4443A18605Q1665
$$ 512125 46322 169273 -8787 43169 58103 729517 -52803 364164 279721 118605 200270
13000B00270H5998j8769K24321i6909A60900E13J24139K73291K3126j95138k6224
$$ 200270 85998 67229 291550 -96909 160900 513 124652 397943 421069 225931 199707
12989A99707h2846A4344R873P8184J05747n9418D0277M5470J0361A3239J31163
$$ 199707 -82846 14344 24217 102401 208148 148730 40277 85747 96108 13239 144402
12978A44402J15451K5577b0699B08384h7530B42340H6913J86454a64220B13189
$$ 144402 259853 285430 -20699 208384 -87530 242340 86913 273367 -164220 213189
12967A9580Q8097l788a9242m15791F4805G719g2935B8761K25518n2250B4007f5970
$$ 19580 107677 103889 -19242 -435033 64805 7719 -72935 28761 254279 202029 24007 -65970
12954e9606A49553J63965A35211b25323C3561A3174e6041j47988A2854J15018
$$ -59606 149553 313518 135211 -225323 33561 13174 -56041 -204029 12854 127872
12944A27872A8406b35895b9642r2038B02232n6675l1162j4999g9879j2158d3524
$$ 127872 18406 -235895 -29642 -121680 202232 145557 114395 99396 -79879 -92037 -43524
12932A73421H0840K9620J05576J06985j55656i8869B74530d9241C36015d9249
$$ 173421 80840 110460 216036 323021 167365 -98869 274530 -49241 336015 -49249
12921B2792a35901B51537e02022b6818B20680e6031j5915b9207n3615G0950J11724
$$ 22792 -135901 251537 -502022 -26818 220680 -56031 -71946 -29207 -82822 70950 182674
12910A82674j6949c9723D62307a97370G3333L6963m6345i3310A2625a58619B26870
$$ 182674 165725 -39723 462307 -197370 73333 110296 63951 -93310 12625 -158619 226870
12898D5040J89171d01395I8274m4696e19869e4422A2426K11483a06140J0533A14334
$$ 45040 234211 -401395 98274 53578 -519869 -54422 12426 223909 -106140 -95607 114334
12886B01895H660K25069r7595K58519A07013b43752A37170d0633B73514G3354
$$ 201895 8660 233729 136134 394653 107013 -243752 137170 -40633 273514 73354
12875B6096Q8238l4409c3889l1108C8072a70234C28799d7987m3721l11827a07685
$$ 26096 114334 79925 -33889 -64997 38072 -170234 328799 -47987 -91708 -403535 -107685
12863C00970A13009J83230j30775C1961J42604c4804C4705a70691b9662A96694
$$ 300970 113009 296239 165464 31961 174565 -34804 34705 -170691 -29662 196694
12852g0950B13654c7564k1303G2577f6787o7995a8724k2219A20261K506B1951
$$ -70950 213654 -37564 -58867 72577 -66787 -134782 -18724 -40943 120261 122767 21951
12840B59170B800a46915f185A8867Q7f688B8886f5321A3505f4499k40718J18668
$$ 259170 2800 -146915 -6185 18867 18954 -6688 28886 -65321 13505 -64499 -305217 -186549
12828a86549a7642C59285e0896l6612j51804g4922A16992a5302G1382b01845A50467
$$ -186549 -17642 359285 -50896 -87508 -239312 -74922 116992 -15302 71382 -201845 150467
12816c8912I3484L7036o2125f6208K2424m5257A75286M6106K8981I5936N79582
$$ -38912 93484 130520 68395 -66208 -43784 -89041 175286 221392 250373 95936 675518
12805F75518a56217P1479A40565e4869A46848B6199K208J86060i3066F3432a6519
$$ 675518 -156217 -84738 140565 -54869 146848 26199 28407 214467 -93066 63432 -16519
12793E08295B14888a64619A39525b30425B59377a40296A98088i1589A04159b10376
$$ 508295 214888 -164619 139525 -230425 259377 -140296 198088 -91589 104159 -210376
12782D3331b09550A04542k2241A7922J69140Q8314A08845a7474A66313P8985h6715
$$ 43331 -209550 104542 82301 17922 187062 275376 108845 -17474 166313 245298 -86715
12770g1223o2939O5294J6341C43329j60277a71277e2109E48323B39985j01981
$$ -71223 -134162 -68868 -52527 343329 183052 -171277 -52109 548323 239985 138004
12760A38004B8362J49704b23875j11835i2376L8563o5430I5301J84621L1647H8345
$$ 138004 28362 178066 -223875 -335710 -92376 -53813 -119243 95301 279922 311569 88345
12748c3963A94555a53472H2879l9584e8621j76231J12721B5134N756a58410B14081
$$ -33963 194555 -153472 82879 43295 -58621 -234852 -122131 25134 30890 -158410 214081
12736B14479M2383K9030b6192g696j99173B53411A19446J18572a13349A54528
$$ 214479 256862 285892 -26192 -7696 -206869 253411 119446 238018 -113349 154528
12725b18442A00502a61791E4115a11534C6751K9639a82831A29494J98249a07612
$$ -218442 100502 -161791 54115 -111534 36751 66390 -182831 129494 327743 -107612
12714C27968a69645A58492o7907b03999n2939A75502j8185a29915B13939C8614
$$ 327968 -169645 158492 90585 -203999 -256938 175502 157317 -129915 213939 38614
12703A64668J77730n4099P2849r8978H8036f6788C00580j45334q612a75013I8769
$$ 164668 342398 288299 361148 262170 88036 -66788 300580 155246 146634 -175013 98769
12691A73120B0598d2043H6547K31561i387A12083M9008D7926a9826A19337L11798
$$ 173120 20598 -42043 86547 318108 -9387 112083 161091 47926 -19826 119337 431135
12680D31135j72770n834q2033C2760h5401D61602r8459F6267K82158j45750F1257
$$ 431135 258365 252531 170498 32760 -85401 461602 363143 66267 348425 202675 61257
12668b89234C28412E7989J85199G9114h9259C85266A46132c5371B12224r7490
$$ -289234 328412 57989 243188 79114 -89259 385266 146132 -35371 212224 114734
12658A14734O6366i0553B37790o5881p4905M8499m2740N5606f7538A18555G345
$$ 114734 181100 -90553 237790 171909 97004 145503 102763 158369 -67538 118555 7345
12646f0900A04988L15858H3566d7875I9426N5735M5870d66206H8077b11297A15488
$$ -60900 104988 420846 83566 -47875 99426 155161 201031 -466206 88077 -211297 115488
12634C7676c84889i964j80034C71405j2038d1982A87709O6705r5460J06803j0251
$$ 37676 -384889 -9964 -189998 371405 359367 -41982 187709 254414 158954 265757 255506
12623B55506a82240D02816e2575E03264j39917M9189b8497F4068MM7172M9726
$$ 255506 -182240 402816 -52575 503264 363347 412536 -28497 64068 64072 111244 160970
12612A60970C9241N0367J26352B3398M17855A95449g171j57465H9334M7853E9131
$$ 160970 39241 89608 215960 23398 441253 195449 -7171 -164636 89334 137187 59131
12600A44212P9516h8122G3383J36157r4200J50247c55455B47852f0293j35455
$$ 144212 223728 -88122 73383 209540 115340 265587 -355455 247852 -60293 -195748
12590a95748C06132D0102K57114b600C5318L4990a08801d1453k6855G393L06406
$$ -195748 306132 40102 297216 -2600 35318 70308 -108801 -41453 -68308 7393 313799
12579C13799h8135n4340A86850J48081b00860C10372G7608A2828a23837B03347
$$ 313799 -88135 -142475 186850 334931 -200860 310372 77608 12828 -123837 203347
12568I1229N9828d7277j17193b7980l9259A24265b75706A38904h8334n4252j4211
$$ 91229 151057 -47277 -164470 -27980 -67239 124265 -275706 138904 -88334 -142586 -156797
12557a56797H2051c4740B04693g1818I175m291L015K42369P8957h5016H4895a81211
$$ -156797 82051 -34740 204693 -71818 9175 4884 7899 250268 329225 -85016 84895 -181211
12544C5560O8174K8415K38147a11667o1123j85660A87424h7472l18182a04751
$$ 35560 103734 132149 370296 -111667 -172790 -358450 187424 -87472 -405654 -104751
12533b4613A71890a41311K3416j441D23700j91757a95722A03275P6829n0554o2841
$$ -24613 171890 -141311 -117895 -119336 423700 231943 -195722 103275 180104 129550 66709
12522F6709K4286A5729b9154I7825a04136a2294A3808b2729B394J83418a20058
$$ 66709 90995 15729 -29154 97825 -104136 -12294 13808 -22729 2394 185812 -120058
12510c50401J21516B94638a78779F2362a30408L9025A32806P02g8447j38590B38385
$$ -350401 -228885 294638 -178779 62362 -130408 -91383 132806 133508 -78447 -217037 238385
12498A44938F5667c03373b1350o0958m5832e3733k70416J50273A33027d1719K0584
$$ 144938 65667 -303373 -21350 -82308 -128140 -53733 -324149 -173876 133027 -41719 -21135
12487b1135D69719d1460C9061b45711G6736b08382A09954J18064A3501a72880
$$ -21135 469719 -41460 39061 -245711 76736 -208382 109954 228018 13501 -172880
12476a33371D26984A85759b15392d1936D0099J05585b02034H615f7892C02773
$$ -133371 426984 185759 -215392 -41936 40099 145684 -202034 8615 -67892 302773
12465f1045j13335M0058c2087j62133J3745N5404o4085A91251n5080c35768J65438
$$ -61045 -174380 -134322 -32087 -194220 -180475 -125071 -189156 191251 136171 -335768 -170330
12454a70330b7875C56763C5952a44031r4183j14851J00841d6712l3500a8390B64089
$$ -170330 -27875 356763 35952 -144031 -238214 -353065 -252224 -46712 -80212 -18390 264089
12442D2707A7616J14947a9140D3632K96844b97994m7921B04538a19228k06157
$$ 42707 17616 132563 -19140 43632 340476 -297994 -345915 204538 -119228 -325385
12432c25385a26584k28756a75582B13771i0875n5390m825A91780O8947G2557b24836
$$ -325385 -126584 -355340 -175582 213771 -90875 -146265 -151090 191780 260727 72557 -224836
12420b79378a24035E0348P2185Q4442b20091I4143L87082a84352A2067g9669H9580
$$ -279378 -124035 50348 122533 206975 -220091 94143 481225 -184352 12067 -79669 89580
12408b55199C1246f3404K6276A70627l8198b49048A59373E5183N755b7075C23468
$$ -255199 31246 -63404 -37128 170627 132429 -249048 159373 55183 60938 -27075 323468
12396G9467J66585C7059b705k6575B15318a33199A37972B7540K29723a8465A03234
$$ 79467 246052 37059 -2705 -29280 215318 -133199 137972 27540 257263 -18465 103234
12384h3941b4239D2985A898a72355B3699a24242j11664o5557A75114M3171L0128
$$ -83941 -24239 42985 1898 -172355 23699 -124242 -235906 -301463 175114 218285 248413
12373B48413A9443J59469i9078A51606a31378A96634e5141A07178j4786J31230
$$ 248413 19443 178912 -99078 151606 -131378 196634 -55141 107178 92392 223622
12363B23622b75519B1534K15676a96490g7208a8546j40341C5841J89273c7577
$$ 223622 -275519 21534 237210 -196490 -77208 -18546 -158887 35841 225114 -37577
12352a36291c443A13264g7306m40920a38717A19463b01125C34196B2225K61151
$$ -136291 -3443 113264 -77306 -518226 -138717 119463 -201125 334196 22225 283376
12342B83376h4900l12541b8106A16077b51992B40826B5407J7569P2936J21077
$$ 283376 -84900 -397441 -28106 116077 -251992 240826 25407 42976 115912 236989
12332B36989b20850f0644A38993m7717a77167A73127d34832D2965g0040j80156
$$ 236989 -220850 -60644 138993 91276 -177167 173127 -434832 42965 -70040 -250196
12322b50196j6392A22552d5092C8728L841b00103I4910A28b58910A20261N8661
$$ -250196 -266588 122552 -45092 38728 42569 -200103 94910 128 -258910 120261 178922
12311A78922o0455b92686I8917a27986A4732L3856K00371I6290a07283j27610
$$ 178922 118467 -292686 98917 -127986 14732 48588 248959 96290 -107283 -234893
12301b34893C56668D470b2111p5373f616B34418b78917A37056c3137m2539a7738
$$ -234893 356668 4470 -22111 -97484 -6616 234418 -278917 137056 -33137 -75676 -17738
12289D2566J66045C5228L2284J13963a82288h7201G3195a62772E7410K6829R7865
$$ 42566 208611 35228 67512 181475 -182288 -87201 73195 -162772 57410 84239 182104
12278A82104a04810A44229b18360B82573r0306l2068a83696b805m8264B18373
$$ 182104 -104810 144229 -218360 282573 192267 160199 -183696 -2805 -51069 218373
12267H1033J10793b47613a19829C7830M2724P7777C6502L24122G341b07920O0350
$$ 81033 191826 -247613 -119829 37830 80554 158331 36502 360624 7341 -207920 -147570
12256a47570A56812h016F3370J44903r7449a4478I0509Q0660K01632a41883A87268
$$ -147570 156812 -8016 63370 208273 110824 -14478 90509 171169 372801 -141883 187268
12244f7324o252b6634B31728i2996I8233M0861d0809j4189n3758C68364A06050
$$ -67324 -73576 -26634 231728 -92996 98233 139094 -40809 -54998 -108756 368364 106050
12232C57555j45662o0146F2813J49389J64255A22284J6940K3256k4538L49041
$$ 357555 211893 151747 62813 212202 376457 122284 139224 162480 137942 486983
12222D86983A34932O8612b02530B98694j48036H540P9368Q6280H634L81993J01780
$$ 486983 134932 203544 -202530 298694 150658 8540 87908 174188 8634 390627 492407
12211D92407D0664Q8232b70242B8276J59847F0086P9537d6651A65614P4536j19594
$$ 492407 40664 128896 -270242 28276 188123 60086 139623 -46651 165614 240150 120556
12200A20556K13000n644J2449G4505L44506k8185M982I625K15045J289H8320R2064
$$ 120556 333556 327912 340361 74505 419011 390826 395808 9625 224670 225959 88320 180384
12188A80384K00286L1103A2170Q5229J48207r6662a14314A52260a25563A52990
$$ 180384 380670 411773 12170 97399 245606 148944 -114314 152260 -125563 152990
12177i9733A97076B1229a24162I4894J78533m1702J23493E1367a19603J1609D74345
$$ -99733 197076 21229 -124162 94894 273427 231725 355218 51367 -119603 -107994 474345
12165f0647B81047a81220A02526l3890L37870A40553b25071K4175N6459I3605
$$ -60647 281047 -181220 102526 68636 406506 140553 -225071 -200896 -144437 93605
12154a92234b5719B1507a81405F9264a9742D3826O9699B9989Q7099K54344A25970
$$ -192234 -25719 21507 -181405 69264 -19742 43826 113525 29989 117088 371432 125970
12142E8182L0249b71744A02781J28547E2885e5827p7839C34208j63132o2893a62437
$$ 58182 88431 -271744 102781 231328 52885 -55827 -133666 334208 171076 108183 -162437
12130H8976b07136B3937a4954p4324B71581i1355M3720B13021c5917j71445A66286
$$ 88976 -207136 23937 -14954 -89278 271581 -91355 -47635 213021 -35917 -207362 166286
12118c3636j86973h6070C37620E903K4997J26025l2945b52904A42349b685E0666
$$ -33636 -220609 -86070 337620 5903 30900 156925 123980 -252904 142349 -2685 50666
12106F2554a40866A13709a71598g5210C674L6693P0674l6893p255M4177a20222
$$ 62554 -140866 113709 -171598 -75210 3674 40367 111041 74148 66893 111070 -120222
12094a92997f7829j82471O3318A72053b55991J5043D2753a47915C224a6727k7850
$$ -192997 -67829 -250300 -186982 172053 -255991 -240948 42753 -147915 3224 -16727 -44577
12083d4577A03013D7089O4302d6391A7166d750l63968I2839L39057O97158J143781
$$ -44577 103013 47089 111391 -46391 17166 -4750 -368718 92839 431896 1129054 2272835
12072B272835A090132D62478A73090D2727a15679H0540a36776A0900c1607p5532
$$ 2272835 1090132 462478 173090 42727 -115679 80540 -136776 10900 -31607 -107139
12062a07139B29753h572k14207C37653b44003E611e9551l7376o1394p307f3051
$$ -107139 229753 -8572 -222779 337653 -244003 5611 -59551 -96927 -158321 -165628 -63051
12050I4500h6616B50572j16977a05349A95735a60955A8599L17131b19704l433
$$ 94500 -86616 250572 133595 -105349 195735 -160955 18599 335730 -219704 -223137
12040b23137b9674k76973D9024b45767H9414a59314M4457l3213C04628a99107
$$ -223137 -29674 -306647 49024 -245767 89414 -159314 -114857 -148070 304628 -199107
12029c37449B70950j09544B2608O2859J224j2598c0624D9080P507h9206c3180
$$ -337449 270950 161406 22608 85467 86691 74093 -30624 49080 56587 -89206 -33180
12017A9421K25332a69421O9320A55941a67973F5317c40690g989k89542B28630
$$ 19421 244753 -169421 -100101 155941 -167973 65317 -340690 -7989 -297531 228630
12006b1401D4031b29321C1372h3330m8468C47552a99246J1705n3795h9896M0363
$$ -21401 44031 -229321 31372 -83330 -131798 347552 -199246 -187541 -241336 -89896 -49533
11995d9533A83132h4688j17610A07277a3475o1646A61759c7466C03059A18731
$$ -49533 183132 -84688 -202298 107277 -13475 -75121 161759 -37466 303059 118731
11984a56453e5942D7310K82562b01404A73322a83746C3815K05770a80491F0431
$$ -156453 -55942 47310 329872 -201404 173322 -183746 33815 239585 -180491 60431
11973C9184a88500I0236d6037I5831e8050I9547b5484q7107B93988a9850m0799
$$ 39184 -188500 90236 -46037 95831 -58050 99547 -25484 -112591 293988 -19850 -60649
11962f0649l27315G5642J38231a72806B4028J12570a44856O1774j58034c8936
$$ -60649 -387964 75642 213873 -172806 24028 136598 -144856 -83082 -241116 -38936
11951b1920B24301B3103O0403j1975K2576b97118a40781E0968K59485m6774h5949
$$ -21920 224301 23103 83506 71531 94107 -297118 -140781 50968 310453 263679 -85949
11939b30268F7895L14212a8812a78D2931M4414J9187E3043b7928n6025l3447A83469
$$ -230268 67895 382107 -18812 -178 42931 87345 106532 53043 -27928 -83953 -117400 183469
11926i235A68711a09396J0549K3818c1184k0617B9685K32968D8788K1425A8757
$$ -9235 168711 -109396 -98847 -75029 -31184 -51801 29685 262653 48788 70213 18757
11914A26185a6181c38k37303h7294A36435m0665J39295I4830Q9234g9207A2921
$$ 126185 -16181 -338 -237641 -87294 136435 95770 235065 94830 184064 -79207 12921
11902B79329B7307P7799K423b73276E094c67895A16941a81915B9563a3547j29188
$$ 279329 27307 105106 107529 -273276 5094 -367895 116941 -181915 29563 -13547 -142735
11891a42735A40027a6505B3612c06866f5239K5042r2588P962B8926a41255I73
$$ -142735 140027 -16505 23612 -306866 -65239 -40197 -132785 -124823 28926 -141255 973
11879I3076a64694E1263a24168A63974C8883c2726B1972a9329k59536g0619B00756
$$ 93076 -164694 51263 -124168 163974 38883 -32726 21972 -19329 -278865 -70619 200756
11867i5429J0053H5821f7189k36910D5464c4265E606i8214l6428O6654l0511j85476
$$ -95429 -85376 85821 -67189 -304099 45464 -34265 5606 -98214 -134642 -67988 -98499 -283975
11855b83975c7007g46F0188a59068E4817J27539c4670r6746F3651a71425D1589
$$ -283975 -37007 -746 60188 -159068 54817 182356 -34670 -131416 63651 -171425 41589
11843A32102D6657a82790e3187r0692b4687m11643a5073A4518a41452B31062F7766
$$ 132102 46657 -182790 -53187 -143879 -24687 -436330 -15073 14518 -141452 231062 67766
11831b48181C11845H0070g4037F2946J22598H2474A9081L0232a17042q8914R8497
$$ -248181 311845 80070 -74037 62946 185544 82474 19081 49313 -117042 -205956 -107459
11820a07459l2118G0447J3874a19293d3707A27830a74106f4992q1555F2356b64499
$$ -107459 -139577 70447 84321 -119293 -43707 127830 -174106 -64992 -146547 62356 -264499
11808a26168p699b6675E8693g1917E5632c84360a18816d8664q8074A50976e9770
$$ -126168 -133867 -26675 58693 -71917 55632 -384360 -118816 -48664 -136738 150976 -59770
11796C3012R8289Q671f0718k9928l0740F8297R9276D9899J72934d6793j04211
$$ 33012 131301 139972 -60718 -90646 -121386 68297 167573 49899 222833 -46793 -151004
11785a51004e9246p5194k6328D8673b59964A68149E0866i8712G2304k8645b3194
$$ -151004 -59246 -134440 -160768 48673 -259964 168149 50866 -98712 72304 43659 -23194
11773B05638J33841A37920a5372q7668A03750a64150c5532l7901B5120J51737
$$ 205638 339479 137920 -15372 -103040 103750 -164150 -35532 -73433 25120 176857
11763A76857N7345a1219o5442j4703L4833k3606j53933f2562A33990k3626a99931
$$ 176857 234202 -11219 -76661 -91364 -56531 -80137 -234070 -62562 133990 110364 -199931
11751h4109A6446J04580b18512e4529l0058j55468J13360H8407R1723d2912l3319
$$ -84109 16446 121026 -218512 -54529 -84587 -240055 -126695 88407 180130 -42912 -76231
11740g6231l49432c589j11590j08092A44671K85791b32223c7992A44915l7494
$$ -76231 -425663 -3589 -115179 -223271 144671 430462 -232223 -37992 144915 107421
11730A07421d5033C3071d5294C8879L1608L1349Q9342H449J15871f5124j3032
$$ 107421 -45033 33071 -45294 38879 70487 101836 191178 8449 124320 -65124 -78156
11719g8156K5202B06300J72535f3799k7772A3959a74781F5646J79428E7914a30266
$$ -78156 -52954 206300 378835 -63799 -91571 13959 -174781 65646 245074 57914 -130266
11707a02306H0945J76944n0075J3754o9460b83285a22447a4542A80693F3250J13182
$$ -102306 80945 257889 207814 221568 152108 -283285 -122447 -14542 180693 63250 176432
11696A76432J346J05357a36517L0998A74734J88370j78771b00133Q9651j01462
$$ 176432 177778 283135 -136517 -105519 174734 363104 184333 -200133 -110482 -211944
11686b11944A8183J3739f2378H3032j1446M2782L31974a49678C27106e3790m5039
$$ -211944 18183 31922 -62378 83032 71586 114368 446342 -149678 327106 -53790 -98829
11675i8829d8838A27957a42030b0516B47755J54675A61496p7927J07473E3064
$$ -98829 -48838 127957 -142030 -20516 247755 402430 161496 83569 191042 53064
11664I9832D1740J30958c32710a13255H4086M7752h2222B26981E0443i3758b6223
$$ 99832 41740 172698 -332710 -113255 84086 131838 -82222 226981 50443 -93758 -26223
11652A0034a10436A14821a04123B91007j19723F0593e5048D28868H4367C8703
$$ 10034 -110436 114821 -104123 291007 171284 60593 -55048 428868 84367 38703
11641a45457A44280b17172J5909F4457a66252J0768k51125C74808p7905G0703
$$ -145457 144280 -217172 -201263 64457 -166252 -155484 -406609 374808 296903 70703
11630i6794K5230D7182L395e8654A28370E242J51894j7888o3307L87476G7916
$$ -96794 -71564 47182 50577 -58654 128370 5242 157136 139248 75941 463417 77916
11618b12111P8481j3884I3930g081A1200L177O3319b87767C63389j23985a62102
$$ -212111 -133630 -147514 93930 -7081 11200 14377 77696 -287767 363389 239404 -162102
11606C00639j02735D876R9020m0630L8926J4100O750J45501a7118H2563c053k889
$$ 300639 197904 4876 103896 63266 102192 116292 123042 268543 -17118 82563 -3053 -5942
11594e942n0825A30174A7065K70469A11532O7575c69843B79762a0531B88165i212
$$ -5942 -56767 130174 17065 287534 111532 179107 -369843 279762 -10531 288165 -9212
11582A99313g8201D4047J30462L9829r2724n9098e5111b2539r0752o0537B9310
$$ 199313 -78201 44047 174509 214338 121614 62516 -55111 -22539 -113291 -173828 29310
11570a05097A12225L51B9148C381c521k32356A25243b1489D39735j93893R3855
$$ -105097 112225 112576 29148 3381 -3521 -235877 125243 -21489 439735 245842 339697
11559C39697J8894D8378b51249b1117j60385D3959b14469a7324I338g5136n2930
$$ 339697 358591 48378 -251249 -21117 -181502 43959 -214469 -17324 9338 -75136 -128066
11548a28066A1818a81888G1016J95503j11682m1290n0238P1787a93113N885E5574
$$ -128066 11818 -181888 71016 266519 154837 113547 63309 135096 -193113 -187228 55574
11536b05562Q9555C00392J5488A04945K8960J42927d2605A26762a54794d122B9590
$$ -205562 -116007 300392 315880 104945 133905 276832 -42605 126762 -154794 -4122 29590
11524a29199L6341H8542d1676B24315O7150c99561A06296N2777M0385r1348a21214
$$ -129199 -92858 88542 -41676 224315 291465 -399561 106296 159073 199458 108110 -121214
11512B20933J11443c37640B9327O2618K90117A10764P3116a76474F3696b4062
$$ 220933 332376 -337640 29327 91945 382062 110764 183880 -176474 63696 -24062
11501a93132N6999A41071K6813Q836e262A91850j1598J80504j66783l6277k6358
$$ -193132 -136133 141071 167884 176720 -5262 191850 180252 360756 193973 157696 131338
11490A31338J72988F0803R4348O9085A5964N6870a40562B64281P194K01817k03579
$$ 131338 304326 60803 155151 224236 15964 72834 -140562 264281 271475 473292 269713
11479B69713H8946b4068i962o6455m5884B78862F3822Q1426p859J7809A5107b4387
$$ 269713 88946 -24068 -9962 -76417 -122301 278862 63822 145248 137389 155198 15107 -24387
11466B74997a18749C01759I7370b54643D59462a09242k680N0404A33297F4540
$$ 274997 -118749 301759 97370 -254643 459462 -109242 -111922 -61518 133297 64540
11455h9735D11255q9620p3604e6340C25329A09712a81787O2129o5744B32984C9830
$$ -89735 411255 321635 248031 -56340 325329 109712 -181787 -119658 -185402 232984 39830
11443I6108J92638g9093A29891d2996B70668a13035A02459L8824f4044K2008A86155
$$ 96108 288746 -79093 129891 -42996 270668 -113035 102459 141283 -64044 -42036 186155
11431b1737A98571b91194B90511a2067k0164D41563g5106G0935a72058A0993a92961
$$ -21737 198571 -291194 290511 -12067 -32231 441563 -75106 70935 -172058 10993 -192961
11419h0355E73a42824c5431F7928b21178A483b31853j47117A38882C2546b6043
$$ -80355 573 -142824 -35431 67928 -221178 1483 -231853 -378970 138882 32546 -26043
11407b6533j55548A19622J76744A33584A1145a29679j47141C4258N2554O0997
$$ -26533 -182081 119622 296366 133584 11145 -129679 -276820 34258 86812 147809
11397A47809e0323B52669j14710M3731b34030c0952a841A55216d4448C46861j36426
$$ 147809 -50323 252669 137959 181690 -234030 -30952 -1841 155216 -44448 346861 210435
11386B10435B3632A1601J67975i1919A30510a12175P018J6890c0912I8546k1173
$$ 210435 23632 11601 179576 -91919 130510 -112175 -105157 -88267 -30912 98546 77373
11375G7373M8776b31509k4360I8082F899c82209C04609C7552R994J38303g0881
$$ 77373 126149 -231509 -255869 98082 6899 -382209 304609 37552 47546 185849 -70881
11363I9549a02767D29201A86668d4150a0209B66665c85533o470a53998A68839
$$ 99549 -102767 429201 186668 -44150 -10209 266665 -385533 -392003 -153998 168839
11352H0203K9051a9944B23931A07619h1820a1871B99209J37079C6122i5797d2531
$$ 80203 109254 -19944 223931 107619 -81820 -11871 299209 436288 36122 -95797 -42531
11340a53581B23447c8428F260a44340a5289j37162I5566a18405j5781G6267g1049
$$ -153581 223447 -38428 6260 -144340 -15289 -152451 95566 -118405 -134186 76267 -71049
11328A16883P6160a72268j16116M9484a01790k96J8853j5617A42517d0491q7078
$$ 116883 193043 -172268 -288384 -238900 -101790 -102086 -83233 -98850 142517 -40491 -127569
11317a27569k552A04569a85209A75236B6441J04957C434b55917E9828a0902A2641
$$ -127569 -130121 104569 -185209 175236 26441 131398 3434 -255917 59828 -10902 12641
11305d44919a18050I27h7741j38639A23425J34029m3636F340K2858J8088a31207
$$ -444919 -118050 927 -87741 -226380 123425 257454 213818 6340 29198 47286 -131207
11293F4988e0960l21612J81568j20535A47662b43836A6740f1090o161A36380b42761
$$ 64988 -50960 -372572 -191004 -311539 147662 -243836 16740 -61090 -67251 136380 -242761
11281e3276n4756n7820k18952E4063f9924A38497g8127l78439c6219B08237C0154
$$ -53276 -108032 -165852 -384804 54063 -69924 138497 -78127 -456566 -36219 208237 30154
11269b45987A11775J24477r3613a00348A10027d2360r6161A48471a27787j53972
$$ -245987 111775 236252 142639 -100348 110027 -42360 -138521 148471 -127787 -281759
11259b81759C41439B7950a82293d4658A05843c40262M3598k0551M8843B36043
$$ -281759 341439 27950 -182293 -44658 105843 -340262 -296664 -317215 -268372 236043
11248a30072a1092q9516j97501B5372d2762B36005e4066H8607b70072i9593D14464
$$ -130072 -11092 -100608 -298109 25372 -42762 236005 -54066 88607 -270072 -99593 414464
11236A48765J564Q2463H4079C5805b12069C26816c92360D5138E756a35674A46999
$$ 148765 150329 232792 84079 35805 -212069 326816 -392360 45138 5756 -135674 146999
11224b23376e0703j0326k69986a55403n4366j04899g340n72954C94376a97267
$$ -223376 -50703 -61029 -331015 -155403 -209769 -314668 -7340 -580294 394376 -197267
11213D2479g2632l8038a0414r8554q3548j10488C4212a8923m08567J70509c6732
$$ 42479 -72632 -110670 -10414 -108968 -192516 -303004 34212 -18923 -427490 -256981 -36732
11201B32748p1947K2659H601c0331q3538r5706c5829C47285i5174B23700a86840
$$ 232748 160801 183460 8601 -30331 -113869 -209575 -35829 347285 -95174 223700 -186840
11189a38138A18187C710a19475a0648D0206J38967a0800B04979a29156F8511g8618
$$ -138138 118187 3710 -119475 -10648 40206 179173 -10800 204979 -129156 68511 -78618
11177I2164l6688j4668A8970c52792B99463b7232C0178J65812a56825A89190E7334
$$ 92164 55476 40808 18970 -352792 299463 -27232 30178 195990 -156825 189190 57334
11165c15914J19091N8340A30379a00155j33139J05485N9363l0382A74189h3104
$$ -315914 -196823 -138483 130379 -100155 -233294 -127809 -68446 -98828 174189 -83104
11154c04029B78166a37490K0360I0490a30688j61292J34263J8124F2177O0656
$$ -304029 278166 -137490 -117130 90490 -130688 -291980 -157717 -139593 62177 122833
11144A22833l5209a17894o6509j06506b7746j4061k7765j13704C8449d50204A39634
$$ 122833 87624 -117894 -184403 -290909 -27746 -41807 -69572 -183276 38449 -450204 139634
11132a18239A10982a20715F2407c10103B49410F9968b81253D37193F2072K69208
$$ -118239 110982 -120715 62407 -310103 249410 69968 -281253 437193 62072 331280
11122C31280C7441A358e340k017D39227a85530c8744A99693D364J70002C9562
$$ 331280 37441 1358 -5340 -7357 439227 -185530 -38744 199693 4364 174366 39562
11110C9724a44552J4913A69622j2693O5864q2729J79978r2123d05077d4346B45294
$$ 39724 -144552 -129639 169622 156929 222793 140064 320042 227919 -405077 -44346 245294
11098A59458J93100H7266J62284A10055K44804A8698d2583B62103J32869A71343
$$ 159458 352558 87266 249550 110055 354859 18698 -42583 262103 394972 171343
11087A90265J06785r9428L47004B31848r9601M01540d5457C89639J06938B19168
$$ 190265 297050 197622 544626 231848 132247 533787 -45457 389639 496577 219168
11076A41384J56M60823B79838p4067K30263l3934j88792H1480J8240N92167l41917
$$ 141384 141540 602363 279838 205771 436034 402100 213308 81480 99720 691887 349970
11065C49970J69162j87513K35894N0191q90l3772J23511l50416p9726J8539L75554
$$ 349970 519132 331619 567513 617704 616814 583042 706553 356137 276411 294950 670504
11054F70504q8815A25549L16742M98887m53817L64247o8118j60203N3381j84785
$$ 670504 581689 125549 442291 941178 487361 851608 783490 623287 676668 491883
11044D91883J13182L48270l27522K3645l0304K49158j48796p5442Q5719k65220
$$ 491883 605065 953335 625813 649458 619154 868312 719516 644074 729793 464573
11034D64573L05156l27659J93226J2305j87703J51348m602K69983k12366J1714
$$ 464573 769729 442070 635296 647601 459898 611246 606644 876627 664261 675975
11024F75975K97316m43282J99093k82602J18181j38239K40277p0580J32749N4320
$$ 675975 973291 530009 729102 446500 564681 426442 666719 596139 728888 783208
11014G83208P1605C23933m4306K32638j34058j9661J52025K04068C20729L73351
$$ 783208 854813 323933 279627 512265 378207 358546 510571 714639 320729 694080
11004F94080K28498l19909L54545m00750L11704p2855k36191K51930k37709n2184
$$ 694080 922578 602669 957214 556464 868168 795313 559122 811052 573343 521159
10994E21159J06770K32588k41155j46783L17252q7888J19270n7428K09711k56721
$$ 521159 627929 860517 619362 472579 789831 701943 821213 763785 973496 716775
10984G16775k76205N53849J66978j21912k5567L11588m32490O28783L92241L1456
$$ 716775 440570 994419 1161397 1039485 1013918 1325506 893016 1521799 1914040 1945496
10974A945496P9964J92730N51894q1247o9848K10050l71141j40555n02125L8541
$$ 1945496 2025460 2218190 2770084 2688837 2618989 2829039 2457898 2317343 1815218 1853759
10964A853759j13147m0606j01615J66585N599k96632J52158j28652l10293M93037
$$ 1853759 1740612 1700006 1598391 1764976 1770575 1473943 1626101 1497449 1187156 1680193
10954A680193k95019j77811k17483k9568k45918Q3053k97474K35051k55516J16697
$$ 1680193 1385174 1207363 989880 960312 714394 797447 499973 735024 479508 596205
10944E96205A31110E0229L10004o993A43984a3414j83455b3384q8410B33414C6747
$$ 596205 131110 50229 360233 353240 143984 -13414 -196869 -23384 -111794 233414 36747
10932B44126a538A25574f0402H3874j4342i3966q2422A45104K4911C6534J38427
$$ 244126 -1538 125574 -60402 83874 69532 -93966 -176388 145104 170015 36534 174961
10921A74961a56295B48830E0162J34528a38022j0774O8338m2391l5849C64273
$$ 174961 -156295 248830 50162 184690 -138022 -148796 -80458 -122849 -158698 364273
10910C80469A01075l6255J26784e1732C10807C5187a4015G1960a46968B78721
$$ 380469 101075 64820 191604 -51732 310807 35187 -14015 71960 -146968 278721
10899C0688J6344P6931J33325A7261i4383L367A73468b5910B27687k5714c6025
$$ 30688 47032 123963 257288 17261 -94383 -91016 173468 -25910 227687 201973 -36025
10887i0773D1612e2141A01132j6668a15874d5929o8139k6651o1711J9205N3127
$$ -90773 41612 -52141 101132 84464 -115874 -45929 -114068 -140719 -202430 -183225 -130098
10876a30098B62590i1194H844a41531k47346P123g7020H3444f3348j97883L8307
$$ -130098 262590 -91194 8844 -141531 -388877 -381754 -77020 83444 -63348 -261231 -222924
10865b22924P2429A35075e8854C3194a99864H6494b31702I4870d27808d4447B11059
$$ -222924 -150495 135075 -58854 33194 -199864 86494 -231702 94870 -427808 -44447 211059
10853a57605b6703k30499d3195A37718o4571a0863j0847p4109k7908j2988E5427
$$ -157605 -26703 -257202 -43195 137718 73147 -10863 -21710 -95819 -123727 -136715 55427
10841d5067I0358e7376a3762B23080G3041j7087g5985l5713K5354l4411o6685
$$ -45067 90358 -57376 -13762 223080 73041 55954 -75985 -111698 -86344 -120755 -187440
10830a87440A17034e5429B10658a24056C8652R1560c01335B52245b99183G134
$$ -187440 117034 -55429 210658 -124056 38652 130212 -301335 252245 -299183 7134
10819E4021K1443a2950n0203q9319p6155r7272G3348b11280G8431J65429f3033
$$ 54021 75464 -12950 -63153 -152472 -228627 -325899 73348 -211280 78431 243860 -63033
10807A65519F4561B0055a29481A37778A1237a92139h9035E0787b97682f2386k85818
$$ 165519 64561 20055 -129481 137778 11237 -192139 -89035 50787 -297682 -62386 -348204
10796c48204a22405b8228c165l2933B81220I9384Q2575f1675j57986j4941I6830
$$ -348204 -122405 -28228 -3165 -36098 281220 99384 181959 -61675 -219661 -234602 96830
10784C94923b12282j784B1095a66024g4992j91710i8110G4629k2411J02716b7069
$$ 394923 -212282 -214066 21095 -166024 -74992 -266702 -98110 74629 52218 154934 -27069
10772C01562C6247M7567a46592j6672r54m47234b34220C08671c7823A37507K5366
$$ 301562 36247 83814 -146592 -163264 -164218 -611452 -234220 308671 -37823 137507 162873
10761A62873b3809j9107j25087a9580A48557c21612A94391M025a33734A6725b90090
$$ 162873 -23809 -42916 -168003 -19580 148557 -321612 194391 198416 -133734 16725 -290090
10749E8138e7619b4615j72209A35413b55645B32352q8715e7990C2915J69982J07791
$$ 58138 -57619 -24615 -196824 135413 -255645 232352 143637 -57990 32915 202897 310688
10738C10688b0954q2968F4697K1656A4320M4068J49120b39792J01678A42847J68029
$$ 310688 -20954 -103922 64697 86353 14320 58388 207508 -239792 -138114 142847 310876
10727C10876E0589a52700j25279J00827b695C4013J50185E5466a43126b0559j09345
$$ 310876 50589 -152700 -277979 -177152 -2695 34013 184198 55466 -143126 -20559 -129904
10716a29904H579d1318B7389b66803A56890a36068m9671M3154j10855A73586d258
$$ -129904 8579 -41318 27389 -266803 156890 -136068 -185739 -142585 -253440 173586 -4258
10704c01494a12921L6305P440A72079h9901A13138D2433a93476A78070l9050b8461
$$ -301494 -112921 -76616 -69176 172079 -89901 113138 42433 -193476 178070 139020 -28461
10692a39613B40386a37899l2905k48799I7976N686b6075F3434c8821G8909a24955
$$ -139613 240386 -137899 -170804 -419603 97976 103662 -26075 63434 -38821 78909 -124955
10680A36891d4797K676r7496e386k27417b0116C3051a28264j33394i2760k81856
$$ 136891 -44797 -42121 -139617 -5386 -232803 -20116 33051 -128264 -261658 -92760 -374616
10669c74616B86857G8475a82544e460q2709E2304b82021e9942l69231A3533P7032
$$ -374616 286857 78475 -182544 -5460 -88169 52304 -282021 -59942 -429173 13533 90565
10658I0565j5447a92554F0890p822c63499f1081j03061N2738j33256i085l51410
$$ 90565 75118 -192554 60890 53068 -363499 -61081 -164142 -111404 -244660 -9085 -360495
10647c60495D7320a06918E4704b89713J17760C24537A39708B322b66977A77187
$$ -360495 47320 -106918 54704 -289713 -171953 324537 139708 2322 -266977 177187
10636b66333O0122H8277j7049b97487a16973F5986A0212a08846C19380A55056
$$ -266333 -206211 88277 71228 -297487 -116973 65986 10212 -108846 319380 155056
10625a27637o8168L5700A0150K31527d7150b0125G379J23532a7595D988M9950
$$ -127637 -195805 -160105 10150 241677 -47150 -20125 7379 130911 -17595 4988 54938
10614E4938a99546O2689L0533A56087c82723e8693D332J37740E3604a65730A63062
$$ 54938 -199546 -136857 -106324 156087 -382723 -58693 4332 142072 53604 -165730 163062
10602A97347i6389j16099F9312c83673J59681B03735l5340a52758M8165j43535
$$ 197347 -96389 -212488 69312 -383673 -223992 203735 168395 -152758 -104593 -248128
10592b48128b102P84A27758g5191B7342d6706j75081A30953M4864C8241J21139
$$ -248128 -2102 -1318 127758 -75191 27342 -46706 -221787 130953 175817 38241 159380
10581A59380F370a64693A21454q648C3204b05729a4830j22788d3800o0944c3814
$$ 159380 6370 -164693 121454 112806 33204 -205729 -14830 -137618 -43800 -104744 -33814
10569B6972a29110k31874I4759l1290a10396n2595A61131d43502O4536J89031
$$ 26972 -129110 -360984 94759 63469 -110396 -162991 161131 -443502 -378966 -189935
10559a89935A17494b51693j10544e3141G9925g0061k62657B47932b62193B15676
$$ -189935 117494 -251693 -362237 -53141 79925 -70061 -332718 247932 -262193 215676
10548b69143E6073K00821I1334a02601e679C38803A2579H49J01052f2923A7993
$$ -269143 56073 256894 91334 -102601 -5679 338803 12579 849 101901 -62923 17993
10536A68516E1692b99961A51841a41146H6259a10864A36914E2211a17182j14251
$$ 168516 51692 -299961 151841 -141146 86259 -110864 136914 52211 -117182 -231433
10526b31433l3820g3327A84784F0923b08907A48395R9a08885n3222I7130k0854
$$ -231433 -265253 -73327 184784 60923 -208907 148395 148494 -108885 -162107 97130 76276
10515G6276a76811A01196R6917B1829h4794A46373b2824l1175n5583M1272j29343
$$ 76276 -176811 101196 198113 21829 -84794 146373 -22824 -53999 -109582 -68310 -197653
10504a97653O3026b993o8549j99446P9793B9936I532b22637A38307a06959j33756
$$ -197653 -134627 -2993 -71542 -270988 -191195 29936 9532 -222637 138307 -106959 -240715
10493b40715J10734k8030A20309b86291N9296k10421h8296A88843D5352b7766
$$ -240715 -129981 -158011 120309 -286291 -226995 -437416 -88296 188843 45352 -27766
10482B88838l3991J21702o3117L03721o9898A36548L37801A45794J4303q568h0322
$$ 288838 254847 376549 313432 617153 547255 136548 474349 145794 160097 151529 -80322
10470b02904E3735K2817a21370r1365L4547c6893a7409m6709M056K0529B71119
$$ -202904 53735 76552 -121370 -212735 -178188 -36893 -17409 -64118 -60062 -39533 271119
10458A29226B825c36577F9621a05316l2941k06790b2173r9633k48607B67370A27726
$$ 129226 2825 -336577 69621 -105316 -138257 -345047 -22173 -121806 -370413 267370 127726
10446D3653a89860g691A32728k6800d6476j07A07971j6514I665J19880i1446c3245
$$ 43653 -189860 -7691 132728 105928 -46476 -46583 107971 91457 9665 129545 -91446 -33245
10433E1233a06672A24136h7934B9284R3834O6061c77612J45418D4122M0237j5900
$$ 51233 -106672 124136 -87934 29284 123118 189179 -377612 -232194 44122 84359 68459
10422F8459a52422A11343l0736i816j9608k99175E407J58488C105K33649G00J48443
$$ 68459 -152422 111343 80607 -9816 -29424 -328599 5407 163895 3105 236754 700 149143
10410A49143P3968a54124d2708p6222B46055i7902b6101G0912a24013N5692B0145
$$ 149143 223111 -154124 -42708 -118930 246055 -97902 -26101 70912 -124013 -68321 20145
10398c95276C3554Q2386c9860o801p1252J5131B24633f2312E4439q314e7723B69302
$$ -395276 33554 115940 -39860 -46661 -117913 -102782 224633 -62312 54439 46125 -57723 269302
10385F4537M4745a94926a9573A83201a9380G4653J27332J54152a1508B67258F1738
$$ 64537 109282 -194926 -19573 183201 -19380 74653 201985 356137 -11508 267258 61738
10373B75899L3742n6553a39056B72067A04321M12314J32918k46427P4004P8369
$$ 275899 309641 253088 -139056 272067 104321 516635 649553 403126 477130 555499
10363E55499j93704A23299J49821j20639K95856j16484b990D98233A03928J7155
$$ 555499 361795 123299 273120 152481 448337 331853 -2990 498233 103928 121083
10353A21083J16161J82312n9798K20505J27988R8417l47877D1526J81123J78386
$$ 121083 237244 419556 359758 580263 708251 806668 458791 41526 222649 401035
10343D01035J59638A70368M01375k81734a557A54436J9473b87A64592J15431G2737
$$ 401035 560673 170368 571743 290009 -1557 154436 173909 -287 164592 280023 72737
10331b73337D090b53387B09404B0560h7045r998A72929c52275G7199R1082K13828
$$ -273337 4090 -253387 209404 20560 -87045 -97043 172929 -352275 77199 168281 382109
10320C82109K19565B00486g282A39942J39829J8157D7231A6293a27563M2094j3123
$$ 382109 601674 200486 -7282 139942 279771 297928 47231 16293 -127563 -85469 -98592
10309i8592A02344b7968A05081b87407A75310A2367P7077l7722c68778c1123B86337
$$ -98592 102344 -27968 105081 -287407 175310 12367 89444 51722 -368778 -31123 286337
10297F5251a97026K9505k02593h5096j11876f8220E9307a77677B66724a02011
$$ 65251 -197026 -167521 -370114 -85096 -196972 -68220 59307 -177677 266724 -102011
10286A1270h8129j74336A75156a22718c738j16591I729Q5994a05569j6666A79074
$$ 11270 -88129 -262465 175156 -122718 -3738 -120329 9729 95723 -105569 -122235 179074
10274D879J61882k0260B7838d0408B48693p0840k6760L5023I884b10343g6570
$$ 4879 166761 146501 27838 -40408 248693 177853 151093 186116 9884 -210343 -76570
10262F1742e0772D66098j50319R9280a3437C31366R7529j86520r5090a0730k25398
$$ 61742 -50772 466098 315779 415059 -13437 331366 428895 242375 147285 -10730 -236128
10251b36128c7590D0556J91511c8996A48223J74845b1520j42348j7257A293J3607
$$ -236128 -37590 40556 232067 -38996 148223 323068 -21520 -163868 -181125 1293 14900
10240A4900N1723g0823k5706I034c56702a8742o3677A51526o2966B8483J46412
$$ 14900 66623 -70823 -96529 9034 -356702 -18742 -82419 151526 88560 28483 174895
10229A74895a88868Q8585L188B09901I6864b73020C63601j17406F2142c1881D7693
$$ 174895 -188868 -100283 -97095 209901 96864 -273020 363601 246195 62142 -31881 47693
10217a46150A4493a44039J0754m6249b4931m8545m900I0465a23396m8191J8622
$$ -146150 14493 -144039 -133285 -179534 -24931 -73476 -78376 90465 -123396 -171587 -152965
10206a52965B27597a01390A62204e4527o2354A21505d92664h8663j28587i0312
$$ -152965 227597 -101390 162204 -54527 -116881 121505 -492664 -88663 -217250 -90312
10195i1775r6809C06921d3009p6103j87740A29059a89149i0224A76287b93162
$$ -91775 -188584 306921 -43009 -119112 -306852 129059 -189149 -90224 176287 -293162
10184a82944B23540j02839c41394C36866a4839j19000A3633k684Q3571a20891
$$ -182944 223540 120701 -341394 336866 -14839 -133839 13633 10949 94520 -120891
10173a85576d2416k7801A17086a6747A05972d14321f7875k91215b116j62446j46101
$$ -185576 -42416 -70217 117086 -16747 105972 -414321 -67875 -359090 -2116 -164562 -310663
10162c10663M1034B7224a05266A39986a43872e6334j39795B07997K1332b4537
$$ -310663 -269629 27224 -105266 139986 -143872 -56334 -196129 207997 229329 -24537
10151C73160A5810a26335H0460b99598J19939C5208N3345a70072B46204a3965
$$ 373160 15810 -126335 80460 -299598 -179659 35208 88553 -170072 246204 -13965
10140A3620O7539b36290R5412a8313A09244K3103O2581f9737j09505F2480b60206
$$ 13620 81159 -236290 -140878 -18313 109244 132347 194928 -69737 -179242 62480 -260206
10128a27553A22491f730j19819I896a17571D8797a29431G1385i9019k36938R3689
$$ -127553 122491 -6730 -126549 9896 -117571 48797 -129431 71385 -99019 -335957 -242268
10117b42268A05143g020l54024B7906Q3776k763a89881j1266f7259A77215A7143
$$ -242268 105143 -7020 -361044 27906 111682 108919 -189881 -201147 -67259 177215 17143
10105b6456A72362a5118j39880A8101a46709k7434r4197I1827a02394n7414a7853
$$ -26456 172362 -15118 -154998 18101 -146709 -174143 -268340 91827 -102394 -159808 -17853
10093a69662f783G4657b75732I8573a5787k26526a5306A16682N6300b04447R3424
$$ -169662 -6783 74657 -275732 98573 -15787 -242313 -15306 116682 172982 -204447 -111023
10082a11023N808D09469b3007l8150i79l34006J17250N9264N3400A30706a917
$$ -111023 -105215 409469 -23007 -61157 -979 -334985 -217735 -158471 -105071 130706 -1917
10070A47124k8469b0556A817a47928E1203J4631f8718k1757H0180c37568H5799
$$ 147124 118655 -20556 1817 -147928 51203 65834 -68718 -90475 80180 -337568 85799
10058a64211f370l11348N2315N7970e3794j61630a0520I1976P9218d6752m78718
$$ -164211 -6370 -317718 -265403 -207433 -53794 -215424 -10520 91976 171194 -46752 -525470
10047e25470a64487A96176a07209F253f6204A65262i3342K4688j55250j17697
$$ -525470 -164487 196176 -107209 6253 -66204 165262 -93342 -68654 -223904 -341601
10037c41601B42188b49857c9837p2423A1243a23971K028C38469c03738a38140
$$ -341601 242188 -249857 -39837 -112260 11243 -123971 -121943 338469 -303738 -138140
10026G5298a08542j11296j44323B01452a03621f233I1934c4675k93227m3984a7360
$$ 75298 -108542 -219838 -364161 201452 -103621 -6233 91934 -34675 -327902 -371886 -17360
10014b31318D4441N1669i2271A89104B9620a36915A12712Q4389C1025Q0483J51586
$$ -231318 44441 96110 -92271 189104 29620 -136915 112712 197101 31025 111508 263094
10003B63094h4936q2077c7626H5070b7826k49018J1408O2895R4201a4257o8293
$$ 263094 -84936 -167013 -37626 85070 -27826 -276844 -265436 -202541 -108340 -14257 -82550
9992h2550j46253G3826J23400G7139a41643b595k71404J25018a0352q6383G6695
$$ -82550 -228803 73826 197226 77139 -141643 -2595 -273999 -148981 -10352 -96735 76695
9980b17987A09630a87650A21073b9149A38J05316J77653K8274c4887I521g440
$$ -217987 109630 -187650 121073 -29149 138 105454 283107 311381 -34887 9521 -7440
9968A07099f6679m8502C6448e6453k99581J64784g2865j49088B8281a21690E581
$$ 107099 -66679 -115181 36448 -56453 -356034 -191250 -72865 -221953 28281 -121690 5581
9956b66990b1511l56063J25422o4096g0973q8057B35826b02870K137q6370A84989
$$ -266990 -21511 -377574 -252152 -316248 -70973 -159030 235826 -202870 -200733 -287103 184989
9944b82977J28376A84258n7666a00900b308p9685k76388J73275c8364k20071A40800
$$ -282977 -154601 184258 126592 -100900 -2308 -81993 -358381 -185106 -38364 -258435 140800
9932a17232B17475a34379A15345d3659J458k40182Q8125N8909A48689b34633Q1254
$$ -117232 217475 -134379 115345 -43659 -42201 -282383 -194258 -135349 148689 -234633 -153379
9921a53379b5451C58102a93917o484j77332B40932A4669b45153g1549k34604J47149
$$ -153379 -25451 358102 -193917 -200401 -377733 240932 14669 -245153 -71549 -306153 -159004
9910a59004N829N7744r8679b3140F060R3418e9221K5698l85441A26604c8904n4316
$$ -159004 -153175 -95431 -194110 -23140 6060 99478 -59221 -33523 -418964 126604 -38904 -93220
9898i3220q438B9142i4664j15014o9096j23683J79854a09070d7295j38356d8172
$$ -93220 -101658 29142 -94664 -209678 -278774 -402457 -222603 -109070 -47295 -185651 -48172
9886A48889B1556a37291b9017k57344A16305c98283J56304J02444A53714a39360
$$ 148889 21556 -137291 -29017 -286361 116305 -398283 -241979 -139535 153714 -139360
9875a85435i694m6926j33821A28663a96259h8217j49024a15262r0823m2487J23771
$$ -185435 -9694 -56620 -190441 128663 -196259 -88217 -237241 -115262 -206085 -248572 -124801
9864a24801b6349k0383I9517f3440j47486J0698O7551a2629o5690k54957C3967
$$ -124801 -26349 -46732 99517 -63440 -210926 -200228 -132677 -12629 -78319 -333276 33967
9852c8238A87952a08795j68979B01057a51875l25050b00722A92774l5828b67846
$$ -38238 187952 -108795 -277774 201057 -151875 -476925 -200722 192774 156946 -267846
9841G9560B3104c05519a34490p3228J648O4864C2747b17287j64475O8223a1590
$$ 79560 23104 -305519 -134490 -207718 -206070 -141206 32747 -217287 -381762 -313539 -11590
9829h8660K0604a4582F4504L00320A00592b03988N958G522d4861j67340F8692
$$ -88660 -68056 -14582 64504 364824 100592 -203988 -198030 7522 -44861 -212201 68692
9817a19462c0074C4845b82712H7383d50111a11530o3167f3767e763j2386l98978
$$ -119462 -30074 34845 -282712 87383 -450111 -111530 -174697 -63767 -5763 -18149 -417127
9806d17127P0183M5457d6724g379B1641h1028K7306J3745n7618b4149j40192d5670
$$ -417127 -346944 -301487 -46724 -7379 21641 -81028 -53722 -39977 -97595 -24149 -164341 -45670
9793f9303C9185b92410c6501C45750A08895b97540a06959D1377a69577a2644k00338
$$ -69303 39185 -292410 -36501 345750 108895 -297540 -106959 41377 -169577 -12644 -212982
9782b12982a00548C01482B0698b7322A52188M9630G1572Q705i6452E8410b31905
$$ -212982 -100548 301482 20698 -27322 152188 201818 71572 80277 -96452 58410 -231905
9770a22364k28851a61215A13267b65750C3962b99086J31656c5551o7739K1731
$$ -122364 -351215 -161215 113267 -265750 33962 -299086 -167430 -35551 -103290 -81559
9760h1559A23689a40146c6329r4265f2915k09511B18311a36826k08885B2363b32667
$$ -81559 123689 -140146 -36329 -130594 -62915 -272426 218311 -136826 -345711 22363 -232667
9748b10558j48275A46073h7046C10273B8379J92095B1574a74448B95468d66393
$$ -210558 -358833 146073 -87046 310273 28379 220474 21574 -174448 295468 -466393
9737b2498j21285p9392j13686a32805A22330b70020J15757A21606J10153c76692
$$ -22498 -143783 -223175 -336861 -132805 122330 -270020 -154263 121606 231759 -376692
9726i1294j16359h7820a7874B7164K44937a88983b2489A14694A5856a36525q8322
$$ -91294 -207653 -87820 -17874 27164 272101 -188983 -22489 114694 15856 -136525 -224847
9715b24847A5166a4175k52173A9431A094J56308l3500J13884A2960P7719b93965
$$ -224847 15166 -14175 -266348 19431 1094 157402 123902 237786 12960 90679 -293965
9703i1422B97144j12255a9077j04207A35025b79306J35647j7843B16068b85042
$$ -91422 297144 184889 -19077 -123284 135025 -279306 -143659 -161502 216068 -285042
9692A89256R0066a19230F5648a35772B4148a08074k6778L6856F4775c68832b2245
$$ 189256 279322 -119230 65648 -135772 24148 -108074 -134852 -97996 64775 -368832 -22245
9680a68145h1229b7862j50483B2323d12321n6286a44395A54963a4986r8246n877
$$ -168145 -81229 -27862 -178345 22323 -412321 -468607 -144395 154963 -14986 -113232 -119109
9669a19109A91782a94742F8280a69621A53994e32747b4081A04461h7887B30281
$$ -119109 191782 -194742 68280 -169621 153994 -532747 -24081 104461 -87887 230281
9658C2076b04268I1250a17502r0714N7025L2358l17747A99807j975c55517a72617
$$ 32076 -204268 91250 -117502 -208216 -151191 -118833 -436580 199807 197832 -355517 -172617
9646h7165C8018c26518E874a50194a317j11854C2536P4628K19487a6732B04424
$$ -87165 38018 -326518 5874 -150194 -1317 -113171 32536 107164 326651 -16732 204424
9634B45881A21005a69205e5780B55217j10138k5426B7169K44827N0090b27535
$$ 245881 121005 -169205 -55780 255217 145079 119653 27169 271996 322086 -227535
9623b31444b1417k9377A42213a07513I1566l5896a54535m4481o7290i1130j36792
$$ -231444 -21417 -50794 142213 -107513 91566 55670 -154535 -199016 -266306 -91130 -227922
9612b27922B06998r2716O679B7622K97467b62309R3357B62535b36090k7112A71559
$$ -227922 206998 114282 120961 27622 325089 -262309 -168952 262535 -236090 -263202 171559
9600e86897B57383b06623f9240J5487k39526a09177c6480I2411c67984A99335
$$ -586897 257383 -206623 -69240 -53753 -293279 -109177 -36480 92411 -367984 199335
9589b32735F0453a91865r7598E2267d8149j93097K9042f8259C3523c51299a16891
$$ -232735 60453 -191865 -289463 52267 -48149 -241246 -212204 -68259 33523 -351299 -116891
9577D5347i9668k95836g4133J2456E0870b45719j51751a47448L1674D7474h6744
$$ 45347 -99668 -395504 -74133 -61677 50870 -245719 -397470 -147448 -115774 47474 -86744
9565E4303B7107a60213f7682A45195a7480k96449d4008o0457j44668d9938o5570
$$ 54303 27107 -160213 -67682 145195 -17480 -313929 -44008 -104465 -249133 -49938 -115508
9554a15508J199k09313H8872a87769A13878J67935b87230A30308B6549f6682r5046
$$ -115508 -114309 -323622 88872 -187769 113878 281813 -287230 130308 26549 -66682 -161728
9543a61728A31452j3590J89242g1669j60929J8800j66674g5395D8910K9806K540
$$ -161728 131452 117862 307104 -71669 -232598 -213798 -380472 -75395 48910 78716 81256
9532H1256A6343a13135M1542j32234C6063R1187a366A47084k9206a26905j24364
$$ 81256 16343 -113135 -71593 -203827 36063 127250 -1366 147084 117878 -126905 -251269
9521b51269F4286f5245B92655a69582A25628c94633B05665c34932a15600j08586
$$ -251269 64286 -65245 292655 -169582 125628 -394633 205665 -334932 -115600 -224186
9511b24186O7315N6163J539j52481A42268P2782A4896C054a46183d4498m9299
$$ -224186 -156871 -100708 -99169 -251650 142268 215050 14896 3054 -146183 -44498 -93797
9500i3797K9167l72398a00478O550k96603j49313a36403m3164N2748j84912d9725
$$ -93797 -64630 -437028 -100478 -93928 -390531 -539844 -136403 -179567 -126819 -311731 -49725
9488B12396f584A51402d5387k06861n6320J2178F77O2982a66300J6641H3503a84384
$$ 212396 -6584 151402 -45387 -252248 -308568 -296390 677 63659 -166300 -149659 83503 -184384
9475D7019J59613b32245i5964b5991B22615c0217k82328A2912K1318b01346j26165
$$ 47019 206632 -232245 -95964 -25991 222615 -30217 -312545 12912 34230 -201346 -327511
9464c27511a54057j99880a39515b6463m0189A29920a059A24250b8379q7180l1102
$$ -327511 -154057 -353937 -139515 -26463 -66652 129920 -1059 124250 -28379 -115559 -146661
9453a46661M4491j59241l9960a37071p4462i7676K4901r8294m6739j07896O6956
$$ -146661 -102170 -261411 -301371 -137071 -211533 -97676 -72775 -171069 -217808 -325704 -258748
9442b58748A31920a19401A30511k2289l1718f8037m8174L8528k75900d6882j42157
$$ -258748 131920 -119401 130511 108222 76504 -68037 -116211 -77683 -353583 -46882 -189039
9431a89039k90665b10262k1192P4991O9602n7881A46825d8538K4204H9451k7859
$$ -189039 -479704 -210262 -231454 -156463 -86861 -144742 146825 -48538 -24334 89451 61592
9420F1592f648B45800a71234A37866n0996N9142b79049A87252b6028l85084a90634
$$ 61592 -6648 245800 -171234 137866 86870 146012 -279049 187252 -26028 -411112 -190634
9408E5338A0258O1832b50648g0665b6494j15516B14249b00858d1473j55353P1778
$$ 55338 10258 72090 -250648 -70665 -26494 -142010 214249 -200858 -41473 -196826 -125048
9397a25048l82590K37600c6867A66618c09396B08428B3366C890i3471Q086o3341
$$ -125048 -507638 -270038 -36867 166618 -309396 208428 23366 3890 -93471 -85385 -148726
9386a48726g3452k17128N5372C1553J65179b4051I347b2664D6963b72457e0735
$$ -148726 -73452 -290580 -235208 31553 196732 -24051 9347 -22664 46963 -272457 -50735
9374b91464F5257b27066f3575b5328q0164A8909a32901K3863c6059l25489a22231
$$ -291464 65257 -227066 -63575 -25328 -105492 18909 -132901 -109038 -36059 -361548 -122231
9362c35824c3414r3281o6660i5298F3660f433H9994D3004K54864A12127h395k02411
$$ -335824 -33414 -126695 -193355 -95298 63660 -6433 89994 43004 297868 112127 -8395 -210806
9350b10806A59226B1291J96455l3137o4448g1538A55009b60998K6095A22444b91904
$$ -210806 159226 21291 217746 184609 120161 -71538 155009 -260998 -234903 122444 -291904
9338b6279j20613A86502c97969I6536i8246A15966c00033F5023i8868a7077j40664
$$ -26279 -146892 186502 -397969 96536 -98246 115966 -300033 65023 -98868 -17077 -157741
9327a57741A73148g5583k7761L9031B00136I8794K7677N0582G1234R2153c61332
$$ -157741 173148 -75583 -103344 -64313 200136 98794 126471 177053 71234 163387 -361332
9315C02177b25890j91950e6087a501q8111F8080M1514a90790A8231a51580C03206
$$ 302177 -225890 -417840 -56087 -1501 -89612 68080 109594 -190790 18231 -151580 303206
9303I4136j6939Q262K2133a16423k32126A52104j1671a29325k33276a40414N142
$$ 94136 77197 85459 107592 -116423 -348549 152104 140433 -129325 -362601 -140414 -135272
9292a35272A91497r2969m0095J10699F7181b41091C19639c46134A03406b04686
$$ -135272 191497 98528 58433 169132 67181 -241091 319639 -346134 103406 -204686
9281i01n1736A85463b38900K3416O4735b5683I9351g5144B13905a00463B700a163
$$ -901 -52637 185463 -238900 -215484 -150749 -25683 99351 -75144 213905 -100463 2700 -1163
9268a01012m1297a3310m03921a98373k49698F0558k1422e5537A82241a57296A66602
$$ -101012 -142309 -13310 -417231 -198373 -448071 60558 39136 -55537 182241 -157296 166602
9256d16047A76488m9652j4793n3965a36551A16990f9645B28903c83950C51945
$$ -416047 176488 126836 112043 58078 -136551 116990 -69645 228903 -383950 351945
9245G1078P4863P6886k4895a49438B80743b17089e0212j47352j34803A9046b33259
$$ 71078 145941 222827 197932 -149438 280743 -217089 -50212 -197564 -332367 19046 -233259
9233b19195j116h0723j71449e5911B58932c34615C3675N1056k9305f5043B53213
$$ -219195 -220311 -80723 -252172 -55911 258932 -334615 33675 84731 55426 -65043 253213
9221i2386l9073j19003B2791d66895H3440K8622b81218c609j30116b5597j16639
$$ -92386 -131459 -250462 22791 -466895 83440 112062 -281218 -3609 -133725 -25597 -142236
9210a42236j93310A5075J95291a95538j70045i464j88027F0695b65654G9236Q7199
$$ -142236 -335546 15075 210366 -195538 -365583 -9464 -197491 60695 -265654 79236 166435
9199A66435p6459d8477A5151a8979B2773c04801j00860a59071j29671a26612K5409
$$ 166435 89976 -48477 15151 -18979 22773 -304801 -405661 -159071 -288742 -126612 -101203
9188a01203L0122j82461J00277O4469m8759o7149A97091c21666J37272A78382
$$ -101203 -71081 -253542 -153265 -88796 -137555 -204704 197091 -321666 -184394 178382
9177D2455b16919e2736j02061J2724N2941j22782R9891n429K9094k58828c7876
$$ 42455 -216919 -52736 -154797 -142073 -89132 -211914 -112023 -117452 -88358 -347186 -37876
9165d6649A1165b15432M7165P9032l9022n4158Q1411K9660j02192d5012k16356
$$ -46649 11165 -215432 -168267 -89235 -128257 -182415 -101004 -71344 -173536 -45012 -261368
9154b61368A57008g3744B27167B571L5533b48917i9940d92o8447F594a12297q8201
$$ -261368 157008 -73744 227167 2571 38104 -248917 -99940 -492 -68939 6594 -112297 -200498
9142b00498F6383c35793B61094e8683C04624B8408Q7616a53807r8429B0613c5111
$$ -200498 66383 -335793 261094 -58683 304624 28408 116024 -153807 -252236 20613 -35111
9130i6371l30050F0959h890A74571D4106g4841n7981O0665q2766D6497a00424
$$ -96371 -426421 60959 -8890 174571 44106 -74841 -132822 -72157 -154923 46497 -100424
9118I9733m6612d3376A7577b44600k06430C0973c423q8967B12045G4711N4299
$$ 99733 53121 -43376 17577 -244600 -451030 30973 -3423 -92390 212045 74711 129010
9107A29010c20939g9711B59841h6274K8586j47894N2387c2636k50046I8647k2762
$$ 129010 -320939 -79711 259841 -86274 -57688 -205582 -153195 -32636 -282682 98647 75885
9096G5885e1200A54586a4041o6915j49678A03748c00376A08326a00260a5817k99797
$$ 75885 -51200 154586 -14041 -80956 -230634 103748 -300376 108326 -100260 -15817 -315614
9085c15614A81670i5911b6076r8528e9384q4952a6836k19323m1756M4687D0499
$$ -315614 181670 -95911 -26076 -124604 -59384 -144336 -16836 -236159 -277915 -233228 40499
9073A25242k8119c2035B21132K1915b6561G8460J87035j3957A7129K03806a46283
$$ 125242 97123 -32035 221132 243047 -26561 78460 265495 251538 17129 220935 -146283
9061h7196B48759b05153O202i1510j79043J03818A78042a42472b3090k1961A63013
$$ -87196 248759 -205153 -198951 -91510 -270553 -166735 178042 -142472 -23090 -45051 163013
9049a19211B06246a29458l01855A63509a71710a6640B9772c8599B67014a91135
$$ -119211 206246 -129458 -431313 163509 -171710 -16640 29772 -38599 267014 -191135
9038b44990f5711k11746A43128e3540j62650e0104j19246B9066b22580g3933j0791
$$ -244990 -65711 -277457 143128 -53540 -216190 -50104 -169350 29066 -222580 -73933 -84724
9027h4724B2316J24156g8976l65934A71294d9505a6474n0134j86374J10995B75396
$$ -84724 22316 146472 -78976 -444910 171294 -49505 -16474 -66608 -252982 -141987 275396
9015a95056C4919a32748M7437c2360j6481j49965n8741A1124J10689a38717a8331
$$ -195056 34919 -132748 -85311 -32360 -48841 -198806 -257547 11124 121813 -138717 -18331
9003a97177B700b05002j67059i9653K5832A32219a52061H598K05025n8261d09657
$$ -197177 2700 -205002 -372061 -99653 -73821 132219 -152061 8598 213623 155362 -409657
8991A18554a4503B28583c9089q6562F7399b21249J1415D7236m527L39864d31750
$$ 118554 -14503 228583 -39089 -125651 67399 -221249 -209834 47236 42709 382573 -431750
8979I7931a07075a9207A17730B8280c2591j86474Q1501C61276A33232E6876a36667
$$ 97931 -107075 -19207 117730 28280 -32591 -219065 -137564 361276 133232 56876 -136667
8967C8287q483b19578B29675h3357q7033d3582J3193B70092f0683k16806B44283
$$ 38287 29804 -219578 229675 -83357 -170390 -43582 -30389 270092 -60683 -277489 244283
8955B3606b43039i4127n6062D70758G3872c76568J82039p361M8153B0331a90025
$$ 23606 -243039 -94127 -150189 470758 73872 -376568 -194529 -201890 -153737 20331 -190025
8943d1185A43822b79119a16238B1651h9191I8118J76852r2290o3154J50167O1590
$$ -41185 143822 -279119 -116238 21651 -89191 98118 274970 182680 119526 269693 331283
8932C31283a74394E8175g5337B2471L6283A9314e6972E73997K01583J195473M720484
$$ 331283 -174394 58175 -75337 22471 58754 19314 -56972 573997 775580 1971053 6691537
8921F691537R739191E569119A031350A80404K86525q0279A15328a69276D1001
$$ 6691537 16430728 5569119 1031350 180404 466929 386650 115328 -169276 41001
8911a1633C16064A08008q495J69229f4168l0680n3084l31574C33361a11348p893
$$ -11633 316064 108008 99513 268742 -64168 -94848 -147932 -479506 333361 -111348 -119241
8900a19241l3991f797A70517J4093a76367A95979N2711A8603b96198J18240C6703
$$ -119241 -153232 -6797 170517 184610 -176367 195979 248690 18603 -296198 -177958 36703
$$ [...]
##END NTUPLES=NMR SPECTRUM
##END=
