
##TITLE=AC1345_GUAAH12163_7155106_2wqzkNcoBV
##JCAMPDX= 6.0         $$ Bruker NMR JCAMP-DX V2.0
##DATA TYPE= NMR SPECTRUM
##DATA CLASS= NTUPLES
##ORIGIN= BRUKER
##OWNER= Administrator
$$ 1.72 TOPSPIN		Version 2.1
$$ 2013-01-29 21:44:22.747 -0500  Administrator@X
$$ Compression mode = diff/dup
##.OBSERVE FREQUENCY= 400.02188249412
##.OBSERVE NUCLEUS= ^1H
##.ACQUISITION MODE= SIMULTANEOUS (DQD)
##.ACQUISITION SCHEME= undefined
##.AVERAGES= 64
##.DIGITISER RES= 22
##SPECTROMETER/DATA SYSTEM= spect
##.PULSE SEQUENCE= noesygpps1d.comp
##.SOLVENT NAME= COFFEE_meoh
##.SHIFT REFERENCE= INTERNAL, COFFEE_meoh, 1, 14.96121
##AUDIT TRAIL= $$ (NUMBER, WHEN, WHO, WHERE, PROCESS, VERSION, WHAT)
$$ ##TITLE= Audit trail, TOPSPIN		Version 2.1
$$ ##JCAMPDX= 5.01
$$ ##ORIGIN= Bruker BioSpin GmbH
$$ ##OWNER= Administrator
$$ $$ E:\/data/COFFEE/nmr/AC1345_GUAAH12163_7155106_2wqzkNcoBV/22/pdata/1/auditp.txt
$$ ##AUDIT TRAIL=  $$ (NUMBER, WHEN, WHO, WHERE, PROCESS, VERSION, WHAT)
(   1,<2013-01-29 21:44:16.810 -0500>,<Administrator>,<X>,<go>,<TOPSPIN 2.1>,
      <created by zg
	started at 2013-01-29 21:32:45.964 -0500,
	POWCHK enabled, PULCHK disabled,
       configuration hash MD5:
       86 BA 57 50 F2 9D 5C 9B 26 00 A9 28 5F 66 2E 89
       data hash MD5: 64K
       4D FB 68 2E E8 A8 61 7E 07 35 5F 23 52 00 3E 0E>)
(   2,<2013-01-29 21:44:19.919 -0500>,<Administrator>,<X>,<proc1d>,<TOPSPIN 2.1>,
      <Start of raw data processing
       efp LB = 0.3 FT_mod = 6 PKNL = 1 PHC0 = 0 PHC1 = 0 SI = 128K 
       data hash MD5: 128K
       94 50 0A ED 84 B7 CF 8F 7F 68 C8 33 01 F9 3F 55>)
(   3,<2013-01-29 21:44:21.044 -0500>,<Administrator>,<X>,<proc1d>,<TOPSPIN 2.1>,
      <pk PHC0 = -77.49207 PHC1 = 0 
       data hash MD5: 128K
       BE 99 69 22 47 4B 9A 48 5C A5 D6 39 B1 4F 28 32>)
(   4,<2013-01-29 21:44:21.701 -0500>,<Administrator>,<X>,<proc1d>,<TOPSPIN 2.1>,
      <abs ABSG = 1 
       data hash MD5: 128K
       12 B1 57 A2 06 76 A7 7E D7 C2 AA 34 9B 66 AA 8A>)
(   5,<2013-01-29 21:44:21.872 -0500>,<Administrator>,<X>,<proc1d>,<TOPSPIN 2.1>,
      <abs ABSG = 2 
       data hash MD5: 128K
       4B 5C 04 9B D2 46 88 18 28 1E DA 3E 6A D8 79 D1>)
(   6,<2013-01-29 21:44:22.044 -0500>,<Administrator>,<X>,<proc1d>,<TOPSPIN 2.1>,
      <abs ABSG = 3 
       data hash MD5: 128K
       90 AA 2D 5A 1B 82 2D 6C B9 60 38 B5 02 46 76 21>)
(   7,<2013-01-29 21:44:22.216 -0500>,<Administrator>,<X>,<proc1d>,<TOPSPIN 2.1>,
      <abs ABSG = 4 
       data hash MD5: 128K
       E7 0D A1 C4 E1 6B 60 EE 86 7D BD D8 11 E7 A7 4F>)
(   8,<2013-01-29 21:44:22.404 -0500>,<Administrator>,<X>,<proc1d>,<TOPSPIN 2.1>,
      <abs ABSG = 5 
       data hash MD5: 128K
       74 57 06 6E 13 C8 63 05 A3 89 F4 82 14 8A E5 54>)
$$ ##END=
$$ 
$$ $$ hash MD5
$$ $$ 97 42 5B C5 94 BB 03 27 67 CC 5E 9C CC 4E 6A 0E
##$RELAX= 
##$RELAX= 
##$RELAX= 
##$RELAX= 
##$RELAX= 
##$RELAX= 
##$RELAX= 
##$RELAX= 
$$ Bruker specific parameters
$$ --------------------------
##$DU= <E:\>
##$EXPNO= 22
$$ [...]
##$TP07= 0
##$TPNAME0= <>
##$TPNAME1= <>
##$TPNAME2= <>
##$TPNAME3= <>
##$TPNAME4= <>
##$TPNAME5= <>
##$TPNAME6= <>
##$TPNAME7= <>
##$TPOAL= (0..7)
0.5 0.5 0.5 0.5 0.5 0.5 0.5 0.5
##$TPOFFS= (0..7)
0 0 0 0 0 0 0 0
##$TUNHIN= 0
##$TUNHOUT= 0
##$TUNXOUT= 0
##$USERA1= <user>
##$USERA2= <user>
##$USERA3= <user>
##$USERA4= <user>
##$USERA5= <user>
##$V9= 5
##$VALIST= <valist>
##$VCLIST= <CCCCCCCCCCCCCCC>
##$VD= 0
##$VDLIST= <DDDDDDDDDDDDDDD>
##$VPLIST= <PPPPPPPPPPPPPPP>
##$VTLIST= <TTTTTTTTTTTTTTT>
##$WBST= 1024
##$WBSW= 4
##$XGAIN= (0..3)
0 0 0 0
##$XL= 0
##$YL= 0
##$YMAX_a= 6064053
##$YMIN_a= -13145423
##$ZGOPTNS= <>
##$ZL1= 120
##$ZL2= 120
##$ZL3= 120
##$ZL4= 120
##$ABSF1= 14.96121
##$ABSF2= -5.596972
##$ABSG= 5
##$ABSL= 3
##$ALPHA= 0
##$AQORDER= 0
##$ASSFAC= 0
##$ASSFACI= 0
##$ASSFACX= 0
##$ASSWID= 0
##$AUNMP= <proc_prof1d_extract.lims>
##$AXLEFT= 0
##$AXNAME= <>
##$AXNUC= <1H>
##$AXRIGHT= 0
##$AXTYPE= 0
##$AXUNIT= <>
##$AZFE= 0.1
##$AZFW= 0.1
##$BCFW= 0
##$BC_mod= 0
##$BYTORDP= 0
##$COROFFS= 0
##$CY= 15
##$DATMOD= 1
##$DC= 0
##$DFILT= <>
##$DTYPP= 0
##$F1P= 0
##$F2P= 0
##$FCOR= 0.5
##$FTSIZE= 131072
##$FT_mod= 6
##$GAMMA= 0
##$GB= 0
##$INTBC= 1
##$INTSCL= 1
##$ISEN= 128
##$LB= 0.3
##$LEV0= 0
##$LPBIN= 0
##$MAXI= 10000
##$MC2= 0
##$MEAN= 0
##$ME_mod= 0
##$MI= 0
##$NCOEF= 0
##$NC_proc= -2
##$NLEV= 6
##$NOISF1= 0
##$NOISF2= 0
##$NSP= 0
##$NTH_PI= 0
##$NZP= 0
##$OFFSET= 14.96121
##$PC= 1
##$PHC0= -77.49207
##$PHC1= 0
##$PH_mod= 1
##$PKNL= yes
##$PPARMOD= 0
##$PPDIAG= 0
##$PPIPTYP= 0
##$PPMPNUM= 2147483647
##$PPRESOL= 1
##$PSCAL= 4
##$PSIGN= 0
##$PYNMP= <proc.py>
##$REVERSE= no
##$SF= 400.020009553895
##$SI= 131072
##$SIGF1= 0
##$SIGF2= 0
##$SINO= 400
##$SIOLD= 131072
##$SPECTYP= <>
##$SREGLST= <1H.CDCl3>
##$SSB= 0
##$STSI= 131072
##$STSR= 0
##$SW_p= 8223.68421052631
##$SYMM= 0
##$S_DEV= 0
##$TDeff= 65536
##$TDoff= 0
##$TI= <>
##$TILT= no
##$TM1= 0
##$TM2= 0
##$TOPLEV= 0
##$USERP1= <user>
##$USERP2= <user>
##$USERP3= <user>
##$USERP4= <user>
##$USERP5= <user>
##$WDW= 1
##$XDIM= 131072
##$YMAX_p= 466403579
##$YMIN_p= -58575
##$CURPLOT= <Network HP LaserJet P1505>
##$CURPRIN= <$Network HP LaserJet P1505>
##$DFORMAT= <normdp>
##$LAYOUT= <+/1D_H.xwp>
##$LFORMAT= <normlp>
##$PFORMAT= <normpl>
##$SURQMSG= 1
$$ End of Bruker specific parameters
$$ ---------------------------------
##NTUPLES= NMR SPECTRUM
##VAR_NAME=  FREQUENCY,     SPECTRUM/REAL,   SPECTRUM/IMAG
##SYMBOL=    X,             R,               I
##VAR_TYPE=  INDEPENDENT,   DEPENDENT,       DEPENDENT
##VAR_FORM=  AFFN,          ASDF,            ASDF
##VAR_DIM=   131072,        131072,          131072
##UNITS=     HZ,            ARBITRARY UNITS, ARBITRARY UNITS
##FACTOR=    0.0627417313425164, 1,          1
##FIRST=     8223.62146879497, 1910,         -62672
##LAST=      0,             4116,            -62764
##MIN=       0,             -58575,          0
##MAX=       8223.62146879497, 466403579,    0
$$ Real data points
##PAGE= N=1
##DATA TABLE= (X++(R..R)), XYDATA
$$ [...]
63913C013512k25547k16835k05211j91992j78370j64423j49386j33105j16721
63904A431922j01665q8421p6576o5707n5757m6890l9411l3587k9172k5338k1559
63893H47839j8294j6260j5279j4502j3645j3237j3501j3685j2909j1240r500q362
63881F87425p830p371o200l734j13L786P136R847J2422J5229J8194K1080K3850
63868G73721K6671K9685L2784L5629L7954L9756M1055M1570M1011L9678L8316
63857A177830L7148L5508L2768K9246K5709K2195J7949J2535O416L85n135j0124
63845A382430j4820j9730k5260l0992l5759l8925m1208m3721m6438m8236m8382
63834I88959m7405m6337m5567m4712m3211m0834l7834l4799l2191k9911k7570
$$ plain form
63913 3013512 2787965 2571130 2365919 2173927 1995557 1831134 1681748 1548643 1431922
63904 1431922 1330257 1241836 1165260 1099553 1043796 996906 957495 923908 894736 869398 847839
63893 847839 829545 813285 798006 783504 769859 756622 743121 729436 716527 705287 695787 687425
63881 687425 679595 672224 666024 662290 662177 665963 673099 682946 695368 710597 728791 749871 773721
63868 773721 800392 830077 862861 898490 936444 976200 1017255 1058825 1099836 1139514 1177830
63857 1177830 1214978 1250486 1283254 1312500 1338209 1360404 1378353 1390888 1397304 1397689 1392554 1382430
63845 1382430 1367610 1347880 1322620 1291628 1255869 1216944 1175736 1132015 1085577 1037341 988959
63834 988959 941554 895217 849650 804938 761727 720893 683059 648260 616069 586158 558588
63823E58588k5153k3071k1463j9869j7939j6038j4683j3686j2393j0704r284q633
63811C65672q448q035p126o005n068m465m117l917l830l834l838l745l587l469
63797B96188l320k918k274j817j989k764l676m209m050l243k316k014k494l017
63783B56087k782j888j070o72m67l42m83p63o63LP74J228J463J578J288M60l73
63766B53378o49n57o69r98j086q79q68j310j820j927j564q95p5O05P54L24k05
63749B41559l63j72J67P11J529K182K068J298P46R87J593J840J744J871K263K239
63733B62262J461N84M66J069J685J991K322K845L103K657J888J725K616M031M973
63718B95678M923M205L535L309L307L073K363J234j26j489k582l230l431l290
$$ plain form
63823 558588 533435 510364 488901 469032 451093 435055 420372 406686 394293 383589 374305 365672
63811 365672 357224 349189 342063 336058 330990 326525 322408 318491 314661 310827 306989 303244 299657 296188
63797 296188 292868 289950 287676 285859 283870 281106 277430 273221 269171 265928 263612 261598 259104 256087
63783 256087 253305 251417 250347 249675 249208 248866 248383 247620 246957 246960 247734 248962 250425 252003 253291 253751 253378
63766 253378 252729 252172 251503 250505 249419 248540 247672 246362 244542 242615 241051 240156 240081 240686 241440 241764 241559
63749 241559 241196 241024 241191 241902 243431 245613 247681 248979 249725 250712 252305 254145 255889 257760 260023 262262
63733 262262 263723 264307 264773 265842 267527 269518 271840 274685 277788 280445 282333 284058 286674 290705 295678
63718 295678 300601 304806 308341 311650 314957 318030 320393 321627 321501 320012 317430 314200 310769 307479
63704C07479k895k372j921j643j426j146q39n20j6Q15J863K934L934M689M876
63689C13812M521M229M438M675M103K768J555R72N99q8r22j406j332q77l60j38
63673C36549l24n33l17J43K85J25L11R97J475J244P23M25J39m58j031j179j304
63656C37270k077l382m529n212n513n294m422l415k948k799k188j164p15j186
63642B92426j547o62J279L060L737L293K417J982K332K916K937K546K846M451
63628C24013O599Q119Q790R164R460R388R003Q993R952J1757J3789J5504J6706
63615D61237J7607J8695K0329K2333K4247K6018K8088L0659L3190L4948L5711
63604G53062L5651L4618L2061K7661K1647J4445O531j168p253j0779j2073j2208
$$ plain form
63704 307479 304584 302212 300291 298648 297222 296076 295237 294717 294701 295516 297379 300313 304247 308936 313812
63689 313812 318333 322562 327000 331675 335778 338546 340101 341073 341672 341584 340662 339256 337924 337047 336687 336549
63673 336549 336225 335692 335375 335518 335803 335928 336239 337236 338711 339955 340678 341103 341242 340784 339753 338574 337270
63656 337270 335193 331811 327282 322070 316557 311263 306841 303426 300478 297679 295491 294327 293612 292426
63642 292426 290879 290217 291496 294556 298293 301586 304003 305985 308317 311233 314170 316716 319562 324013
63628 324013 330612 338731 347521 356685 366145 375533 384536 393529 403481 415238 429027 444531 461237
63615 461237 478844 497539 517868 540201 564448 590466 618554 649213 682403 717351 753062
63604 753062 788713 823331 855392 883053 904700 919145 925676 924508 917255 906476 894403 882195
63592H82195j1857j1105j0203r824j0464j2140j4810j8531k2875k6683k8932k9537
63580F75234k9040k7824k6032k3871k1425j8397j4660j0980q457p170n930l623
63568D77825m68K349L921M337M393M914O168P698Q773R162R446J0362J1907J3308
63554E74095J3990J4429J5815J8804K2872K7043L1063L5499M0747M6266N0730
63543H91353N2467M9839M1909K9423J4902J297r462j6721k0576k1542k0391j7773
63531I74725j4165j0458q067p837r212j1260j4152j8636k4216k9045l1985l3684
63519G62008l5054l5676l4631l2269k9981k8400k6826k4590k2071j9954j8117
63508D54439j5909j3317j1174j0106r731r172q131p073o417n978n362m522l690
$$ plain form
63592 882195 870338 859233 849030 839206 828742 816602 801792 783261 760386 733703 704771 675234
63580 675234 646194 618370 592338 568467 547042 528645 513985 503005 494548 487378 481448 477825
63568 477825 477357 479706 483627 487964 492357 497271 503439 511137 519910 529072 538518 548880 560787 574095
63554 574095 588085 602514 618329 637133 660005 687048 718111 753610 794357 840623 891353
63543 891353 943820 993659 1035568 1064991 1079893 1081190 1071728 1055007 1034431 1012889 992498 974725
63531 974725 960560 950102 942035 934198 924986 913726 899574 880938 856722 827677 795692 762008
63519 762008 726954 691278 656647 624378 594397 565997 539171 514581 492510 472556 454439
63508 454439 438530 425213 414039 403933 394202 385030 376899 369826 363409 357431 352069 347547 343857
63495C43857k996k446k124j999j735j100m69m09p62o89J78J190J610J628J969
63480C35703K758L366L327K952K881L313L890M202M161L902L419K447P69j366
63466C75724l297m425m669m425m199m255m509m695m633m319l696k515o59J399
63452C26827K796L097K789K770L439M401N077N362N722O725Q541J0832J3054J4868
63438D16300J6422J8301K1179K5309L0261L5127L8851M0303L8393L2714K4295
63427G37455J5252P427J588j937k590j63M327R293J4172J9648K6142L2809L8342
63414I01765M2166M4315M4567M2340L7311K9720K0194R719k24q095j3105j5471
63402A135202j5861j4882j3235j1984j2234j4471j8325k3022k7904l2535l6516
$$ plain form
63495 343857 340861 338415 336291 334292 332557 331457 330988 330579 329817 329128 329306 330496 332106 333734 335703
63480 335703 338461 341827 345154 348106 350987 354300 358190 362392 366553 370455 373874 376321 377090 375724
63466 375724 372427 368002 363333 358908 354709 350454 345945 341250 336617 332298 328602 326087 325428 326827
63452 326827 329623 332720 335509 338279 341718 346119 351196 356558 362280 369005 377546 388378 401432 416300
63438 416300 432722 451023 472202 497511 527772 562899 601750 642053 680446 713160 737455
63427 737455 752707 760134 761722 759785 757195 757032 761359 770652 784824 804472 830614 863423 901765
63414 901765 943931 988246 1032813 1075153 1112464 1142184 1162378 1172097 1171873 1163778 1150673 1135202
63402 1135202 1119341 1104459 1091224 1079240 1067006 1052535 1034210 1011188 983284 950749 914233
63391I14233l9422m0945m1016l9773l7432l4233l0476k6603k3106k0238j7782
63380E63207j5299j2636j0050p713n474l295j602o47K24K019M832P714R889J1502
63366E42671J2996J4480J6110J8361K1331K4247K6335K7854K9671L2163L5089
63355H01308L8219M1300M3575M4092M2479L8852L3099K5092J5585O145k027q592
63343A119127j3340j5768j5803j4363j2782j1982j2406j4236j7298k1080k5163
63332I44906k9404l3445l6458l7713l7242l5623l3235k9999k5789k0836j5660
63321F09502j0605n640q66K655L077o63p496j4852k0549k3790k4690k3676k1435
63308D60972j8814j6365j4268j2643j1482j0329q652o660n156m464m087l563l051
$$ plain form
63391 914233 874811 833866 792850 753077 715645 681412 650936 624333 601227 580989 563207
63380 563207 547908 535272 525222 517509 512035 508740 507138 506491 506715 508734 513566 521280 531169 542671
63366 542671 555667 570147 586257 604618 625949 650196 676531 704385 734056 766219 801308
63355 801308 839527 880827 924402 968494 1010973 1049825 1082924 1108016 1123601 1129746 1127719 1119127
63343 1119127 1105787 1090019 1074216 1059853 1047071 1035089 1022683 1008447 991149 970069 944906
63332 944906 915502 882057 845599 807886 770644 735021 701786 671787 645998 625162 609502
63321 609502 598897 593257 592391 595046 598123 597460 589964 575112 554563 530773 506083 482407 460972
63308 460972 442158 425793 411525 398882 387400 377071 368419 361759 356603 352139 348052 344489 341438
63295C41438k795k657k468k346k329k201j907j701j598j250o08j59k06m84p82
63280C17947j256j809j876j330q70r32r27k59N68P24M32N92J386K114K341K279
63264C19124K143J893J615J481J354J016P53J076J868K512K864L322L876L851
63250C48748K921J792J441K030K951L644M102M666N584O707P654Q311R066J0307
63236D19924J1820J3023J3748J4474J5685J7326J8884J9859K0098J9858J9571
63225F04270J9428J9264J8924J8507J8122J7635J6966J6413J6342J6725J7248
63214G99844J7666J7785J7356J6351J5047J3419J0785O652J631l171p496j1907
63202H93962j6477k0335k2748k3913k4370k4271k3497k2022j9711j6352j2329
$$ plain form
63295 341438 338643 335986 333518 331172 328843 326642 324735 323034 321436 320186 319578 319419 319213 318729 317947
63280 317947 316691 314882 313006 311676 310806 309874 308947 308688 309256 309980 310412 311004 312390 314504 316845 319124
63264 319124 321267 323160 324775 326256 327610 328626 329379 330455 332323 334835 337699 341021 344897 348748
63250 348748 351669 353461 354902 356932 359883 363527 367629 372295 377879 384586 392240 400551 409617 419924
63236 419924 431744 444767 458515 472989 488674 506000 524884 544743 564841 584699 604270
63225 604270 623698 642962 661886 680393 698515 716150 733116 749529 765871 782596 799844
63214 799844 817510 835295 852651 869002 884049 897468 908253 914905 916536 913365 905869 893962
63202 893962 877485 857150 834402 810489 786119 761848 738351 716329 696618 680266 667937
63191F67937q765o431m729k407Q49M148O740Q946J1433J4054J5993J6988J7788
63178G42544J9163K0875K2068K2443K2470K2493K2242K1436K0317J9209J8027
63167I73287J6664J5508J4920J4373J2653Q982L593k737r227j5223k0287k4401
63155I88105k7839l0826l3373l5380l6535l6366l4722l2250k9923k8109k6372
63144F36410k4157k1330j8071j4693j1686r549q408p971p878p817p408o321m682
63131D86439l093k098j741j655j409p88O7Q64J580K572L997N326N817N374M641
63116E05893M269M372M629M604M048L169K498K261K112J741J420J446J403O87
63102E44552m76j241j354j350j559j692j563j460j527j467j241j346j975k452
$$ plain form
63191 667937 659172 652741 648012 645605 646454 650602 657342 666288 677721 691775 707768 724756 742544
63178 742544 761707 782582 804650 827093 849563 872056 894298 915734 936051 955260 973287
63167 973287 989951 1005459 1020379 1034752 1047405 1056387 1059980 1057243 1048016 1032793 1012506 988105
63155 988105 960266 929440 896067 860687 824152 787786 753064 720814 690891 662782 636410
63144 636410 612253 590923 572852 558159 546473 536924 528516 520545 512667 504850 497442 491121 486439
63131 486439 483346 481248 479507 477852 476443 475655 475722 476586 478166 480738 484735 490061 495878 501252 505893
63116 505893 510162 514534 519163 523767 527815 530984 533482 535743 537855 539596 541016 542462 543865 544552
63102 544552 544076 542835 541481 540131 538572 536880 535317 533857 532330 530863 529622 528276 526301 523849
63088E23849k062j036k06L0l1O7N37J336K207K848L193L411L640L931M453N306
63072E51473O123O341O051O029O724P761Q694R592J0476J0901J0739J0888J2361
63059F64153J4991J7717J9899K1641K3091K4329K5956K8803L2740L6468L8957
63048I48745M0504M2029M3743M5102M5712M5731M5472M5127M4884M4761M4302
63037A436112M2897M0756L9100L8997M0132M1187M1293M0584L9281L6903L2757
63026A869999K6731J9161J0256K44j0118j9857k8688l7025m4953n1668n6214n8388
63014A619480n8603n7123n3873m8896m2710l6146k9830k3842j7869j1657n279
63003A233652J096P423J3647J9505K4688K9064L2540L4961L6491L7761L9172M0211
$$ plain form
63088 523849 521787 520751 520545 520575 520544 520611 521148 522484 524691 527539 530732 534143 537783 541714 546167 551473
63072 551473 557596 563937 569988 576017 582741 590502 599196 608788 619264 630165 640904 651792 664153
63059 664153 679144 696861 716760 738401 761492 785821 811777 840580 873320 909788 948745
63048 948745 989249 1031278 1075021 1120123 1165835 1211566 1257038 1302165 1347049 1391810 1436112
63037 1436112 1479009 1519765 1558865 1597862 1637994 1679181 1720474 1761058 1800339 1837242 1869999
63026 1869999 1896730 1915891 1926147 1926391 1916273 1896416 1867728 1830703 1785750 1734082 1677868 1619480
63014 1619480 1560877 1503754 1449881 1400985 1358275 1322129 1292299 1268457 1250588 1238931 1233652
63003 1233652 1234748 1242171 1255818 1275323 1300011 1329075 1361615 1396576 1433067 1470828 1510000 1550211
62991A550211M0121L9078L8111L7807L7740L7235L6023L3983L0931K6944K2389
62980A930573J7293J1228M059l852j2423k2116l2870m3388n2120n8572o3116o5996
62968A608700o7269o7270o6286o3951n9821n4553m9697m6099m3140l9806l5995
62957A014813l2459k9834k8045k6524k4764k2770k1076k0196k0057k0048j9589
62946G49451j8538j7087j5546j4241j3392j2960j2665j2224j1468j0381r114p971
62934E93864p176o618n990n150m242l435k694j910j171p79q56j007o00M54J372
62919E54062J235j4j538k525k784k526k016j600j658k233k928l379l591l653l472
62904E21380l034k669k681k894k866k431j725q52J60J102J580J366O16k21o84
$$ plain form
62991 1550211 1590332 1629410 1667521 1705328 1743068 1780303 1816326 1850309 1881240 1908184 1930573
62980 1930573 1947866 1959094 1963153 1959301 1946878 1924762 1891892 1848504 1796384 1737812 1674696 1608700
62968 1608700 1541431 1474161 1407875 1343924 1284103 1229550 1179853 1133754 1090614 1050808 1014813
62957 1014813 982354 952520 924475 897951 873187 850417 829341 809145 789088 769040 749451
62946 749451 730913 713826 698280 684039 670647 657687 645022 632798 621330 610949 601835 593864
62934 593864 586688 580070 574080 568930 564688 561253 558559 556649 555478 554699 553843 552836 552236 552690 554062
62919 554062 555297 555283 553745 551220 548436 545910 543894 542294 540636 538403 535475 532096 528505 524852 521380
62904 521380 518346 515677 512996 510102 507236 504805 503080 502228 502388 503490 505070 506436 507052 506831 506147
62889E06147o30l66k74k68N6O66Q64J70q85j312p77J99J049J636J958J866J342
62872E11441O84J55m63j620l214m343m159k917j875j865k354k204j158o6L03N6
62856D86401k45k81k8M00P39Q00Q40J313K038K158J296K43K9O86J339J232K99
62839D99259r70j867j984j712j859k474k621j731n43r9l21m08j80r2j70L2M85
62822D82745O92P62J414K709L660L539K793K192J791J387J368K246L642M462M208
62807E19610L520L375M053N019N554N367M782M420M673N366N957O127O151O572
62793E90546P501Q418Q907R454J1077J4035J7389K0166K2570K5582K9597L4068
62781G99310L8372M2489M6673N0993N5381N9836O4310O8544P2085P4324P4651
$$ plain form
62889 506147 505517 505151 504877 504609 504665 505331 506195 506365 505480 504168 503391 503590 504639 506275 508233 510099 511441
62872 511441 512125 512280 511817 510197 506983 502640 498481 495564 493689 491824 489470 487266 486108 486042 486345 486401
62856 486401 486156 485875 485847 486247 486986 487786 488626 489939 491977 494135 495431 495674 495703 496389 497728 498960 499259
62839 499259 498289 496422 494438 492726 490867 488393 485772 484041 483498 483399 483078 482670 482490 482398 482228 482260 482745
62822 482745 483437 484199 485613 488322 491982 495521 498314 500506 502297 503684 505052 507298 510940 515402 519610
62807 519610 523130 526505 530558 535577 541131 546498 551280 555700 560373 565739 571696 577823 583974 590546
62793 590546 598047 606465 615372 624826 635903 649938 667327 687493 710063 735645 765242 799310
62781 799310 837682 880171 926844 977837 1033218 1093054 1157364 1225908 1297993 1372317 1446968
62770A446968P2888O9598O5522O0596N3908M4791L3659K1563R225l176j5567k7640
62758A832335l8959m9017n7270o3366o7484p0201p1891p2336p1122o8354o4741
62747A137594o0872n6718n2072m7209m2727l8824l5218l1769k8688k5942k3044
62736F94511j9742j6538j4113j2551j1501j0717j0015r015p498n858m648l779
62724E68536k700j295p3N72Q64J318K268L722N326O522P113P676R004J1099J3199
62709F33151J4795J6224J8083K0493K3162K5861K8654L1795L5493L9652M3878
62698I31241M7990N2350N7366O2740O7627P1567P4810P7661P9841Q0632P9321
62687A683146P5411O8802N9827M8892L6083K1467N766r785k4356l7838n0139o0715
$$ plain form
62770 1446968 1519856 1589454 1654976 1715572 1769480 1814271 1847930 1869493 1878718 1875542 1859975 1832335
62758 1832335 1793376 1744359 1687089 1623723 1556239 1486038 1414147 1341811 1270689 1202335 1137594
62747 1137594 1076722 1020004 967932 920723 877996 839172 803954 772185 743497 717555 694511
62736 694511 674769 658231 644118 631567 620066 609349 599334 590319 582821 576963 572315 568536
62724 568536 565836 564541 564468 565040 565904 567222 569490 573212 578538 585060 592173 599849 608853 619952 633151
62709 633151 647946 664170 682253 702746 725908 751769 780423 812218 847711 887363 931241
62698 931241 979231 1031581 1088947 1151687 1219314 1290881 1365691 1443352 1523193 1603825 1683146
62687 1683146 1758557 1827359 1887186 1936078 1972161 1993628 1999394 1989609 1965253 1927415 1877276 1816561
62675A816561o9073p5277p9570q1878q2068q0419p7443p3417o8450o2921n7471
62664A008574n2552m8192m4137m0138l6131l2363k9198k6687k4400k1897j9259
62653F33620j6974j5339j4168j3141j2218j1542j1071j0503r653q716p929p157
62641D95209o076m716l537k855k556k389k222j890j285p44q60j595k112j969j879
62626D58524k554l354l005j459K2O39R10J519K219K427K197K012K045K138K259
62611D66539K527K897L200L360L421L447L589M104N197O834Q717J0360J1431J2238
62597E47861J3666J6233J9314K1835K3620K5510K8198L1511L4826L7494L8752
62586H38820L7964L5367L1988K8478K4474J9365J3244O680O1o469j2727j8533
$$ plain form
62675 1816561 1747488 1672211 1592641 1510763 1428695 1348276 1270833 1197416 1128966 1066045 1008574
62664 1008574 956022 907830 863693 823555 787424 755061 725863 699176 674776 652879 633620
62653 633620 616646 601307 587139 573998 561780 550238 539167 528664 519011 510295 502366 495209
62641 495209 489133 484417 480880 478025 475469 473080 470858 468968 467683 466939 466079 464484 462372 460403 458524
62626 458524 455970 452616 449611 448152 448174 448813 449723 451242 453461 455888 458085 460097 462142 464280 466539
62611 466539 469066 471963 475163 478523 481944 485391 488980 493084 498281 505115 513832 524192 535623 547861
62597 547861 561527 577760 597074 618909 642529 668039 696237 727748 762574 800068 838820
62586 838820 876784 912151 944139 972617 997091 1016456 1029700 1036380 1036441 1029972 1017245 998712
62574I98712k3777k8208l1494l3648l4948l5250l4030l1442k8743k7063k6166
62563F63943k5035k3311k1450j9713j7800j5541j3322j1495r847p958n948m552
62551D87971m313m875n185m578l416k517k158k002j822j715j611j182m47J46L96
62536D52692N93Q36P29J20m09k70L34Q72J341K141L388M933O767Q891J0887J2191
62520E06036J2877J3785J5718J8631K1658K3934K5545K7572L0916L5150L9023
62509G70845M2007M4593M6973M8363M8132M6664M4389M0776L5182K8128K0642
62498A216694J2777M004n106j2870j8358k2171k4995k6412k5809k3656k1045j8296
62486A034757j4790j0140m936j62L762P187J0615J4088J7037J8491J7446J3457
$$ plain form
62574 998712 974935 946727 915233 881585 846637 811387 777357 745915 717172 690109 663943
62563 663943 638908 615597 594147 574434 556634 541093 527771 516276 506429 498471 492523 487971
62551 487971 483658 478783 473598 469020 465604 463087 460929 458927 457105 455390 453779 452597 452150 452296 452692
62536 452692 453285 454121 454850 454970 454561 454291 454625 455497 456838 458979 462367 467300 474067 482958 493845 506036
62520 506036 518913 532698 548416 567047 588705 612639 638184 665756 696672 731822 770845
62509 770845 812852 857445 904418 952781 1000913 1047577 1091966 1132742 1167924 1196052 1216694
62498 1216694 1229471 1233475 1228369 1215499 1197141 1174970 1149975 1123563 1097754 1074098 1053053 1034757
62486 1034757 1019967 1009827 1004891 1004729 1008491 1015678 1026293 1040381 1057418 1075909 1093355 1106812
62474A106812P301Q57m265q162j2361j7990k4652l1100l6357l9899m1421m1183
62462H57580m0133l9072l7893l6110l3745l1052k7793k3697j9451j6260j4284
62451E38090j2387r715o808m696l529k609j421q6J096K133L287M726O259P425
62437E21765P902P884P876Q132Q368Q024O717M505J828q41l363n894q437j0610
62423E53856j1981j2472j2271j1569j0610r773r351r244r025q290o961n497m677
62410D32135m827n238m853l596k386j737j196m50n6l65o25q4P35R50R05J560K690
62393D13562L156K851K881L579L844L017K169K607L993M916M793M329M376N069
62379D65142N950O488O521O411O630P127P453P598Q165R406J0630J1116J1158
$$ plain form
62474 1106812 1114113 1114970 1110705 1102543 1090182 1072192 1047540 1016440 980083 940184 898763 857580
62462 857580 817447 778375 740482 704372 670627 639575 611782 588085 568634 552374 538090
62451 538090 525703 515988 509180 504484 500955 498346 496925 496839 497935 500068 503355 508081 514340 521765
62437 521765 529667 537551 545427 553559 561927 569951 576668 581173 583001 582160 578797 572903 564466 553856
62423 553856 541875 529403 517132 505563 494953 485180 475829 466585 457560 449270 442309 436812 432135
62410 432135 427308 422070 417217 413621 411235 409498 408302 407852 407796 407431 406806 406722 407457 408407 409312 410872 413562
62393 413562 416718 419569 422450 426029 429873 432890 435059 437666 441659 446575 451368 455697 460073 465142
62379 465142 471092 477580 484101 490512 497142 504269 511722 519320 527485 536891 547521 558637 569795
62366E69795J1739J3317J5449J7507J9382K1509K4465K8522L3451L8713M3848
62355H37697M8676N3232N7613O1737O4909O5910O3922N9277N2774M4549L4338
62344A444634K2833J1810K595m865j1192j6722k1859k7388l3589l9517m3889m6309
62332A236542m7109m6473m4486m1606l8333l4619l0371k6260k3225k1249j9505
62321H63306j7712j6541j6525j7375j8637k0248k1975k3012k2777k1745k0793
62310F45966j9954j8460j6059j3621j2141j1555j0942r722q192o893n870m839
62298E07718l776k967k518k202j793j310p94j61O24J479K406L511M576M991M417
62283E14201L333K629K657L044L310L342L270L246L454M053M901N577N827N899
$$ plain form
62366 569795 581534 594851 610300 627807 647189 668698 693163 721685 755136 793849 837697
62355 837697 886373 939605 997218 1058955 1123864 1189774 1253696 1312973 1365747 1410296 1444634
62344 1444634 1467467 1479277 1481872 1477007 1465815 1449093 1427234 1399846 1366257 1326740 1282851 1236542
62332 1236542 1189433 1142960 1098474 1056868 1018535 983916 953545 927285 904060 882811 863306
62321 863306 845594 829053 812528 795153 776516 756268 734293 711281 688504 666759 645966
62310 645966 626012 607552 591493 577872 565731 554176 543234 533512 525320 518427 512557 507718
62298 507718 503942 500975 498457 496255 494462 493152 492358 492197 492821 494300 496706 500217 504793 509784 514201
62283 514201 517534 520163 522820 525864 529174 532516 535786 539032 542486 546539 551440 557017 562844 568743
62269E68743O318P369Q957J0870J2982J5261J7712K0407K3480K7090L1473L6905
62257G87567M3359N0191N6509O2085O7559P3321P8462Q1343Q1098P7946P2113
62246A531553O3368N2005L9517K7513J6401N721m675j4558k4144l3950m3858n3086
62234A561807o1179o8130p3433p5911p5025p1699o7334o2540n7296n1793m6462
62223H51005m1395l6347l1259k6421k2198j8865j6502j4814j3256j1639j0385
62212F07924r847r675r187q239p276o628o157n555m657l463k133r70k03K44O21
62197E34799J095J746K675L801M738N131N171N480O412P638Q498Q716Q656Q951
62183F13507R813J0832J1450J1539J1255J0545R218P504O071N304N026N143O048
$$ plain form
62269 568743 575061 582430 591387 602257 615239 630500 648212 668619 692099 719189 750662 787567
62257 787567 830926 881117 937626 999711 1067270 1140591 1219053 1300396 1381494 1459440 1531553
62246 1531553 1594921 1646926 1686443 1713956 1730357 1736078 1731403 1716845 1692701 1658751 1614893 1561807
62234 1561807 1500628 1432498 1359065 1283154 1208129 1136430 1069096 1006556 949260 897467 851005
62223 851005 809610 773263 742004 715583 693385 674520 658018 643204 629948 618309 607924
62212 607924 598077 588402 579215 570976 563700 557072 550915 545360 540703 537240 535107 534137 533934 534178 534799
62197 534799 535894 537640 540315 544116 548854 553985 559156 564636 571048 578686 587184 595900 604556 613507
62183 613507 623320 634152 645602 657141 668396 678941 688159 695663 701734 707038 712064 717207 723255
62170G23255P982J0483J3003J5814J9677K4718L0252L5605M0573M4971M8306N0110
62158A064749N0112M7939M3105L5705K6808J7811R524K117m323r690j4319j8985
62146A250553k4071k9026l2993l5850l8156l9976m0341l8286l4185k9513k5417
62135H82739k1964j8708j5378j1862q140m671k413j924k648l433l655l428k929
62122G81586j967k61K182N053P917J0378J2214J3252J3164J1545Q444M601Q95
62109H69003k288m850o441o612n543m253l936n200p784j0686j2599j2720j1368
62096G74723r612q175o844m995k481J78K285L534M151M578N030N395N573N755
62082G79095O195O926P872R196J1132J3522J5811J7588J8956K0208K1412K2466
$$ plain form
62170 723255 731237 741720 754723 770537 790214 814932 845184 880789 921362 966333 1014639 1064749
62158 1064749 1114861 1162800 1205905 1241610 1268418 1286229 1295753 1297870 1293547 1283857 1269538 1250553
62146 1250553 1226482 1197456 1164463 1128613 1090457 1050481 1010140 971854 937669 908156 882739
62135 882739 860775 842067 826689 814827 806687 802016 799603 797679 795031 791598 787943 784515 781586
62122 781586 779619 779358 781540 786593 794510 804888 817102 830354 843518 855063 863507 868108 869003
62109 869003 866715 861865 855424 848812 843269 839016 835080 829880 822096 811410 798811 786091 774723
62096 774723 765111 756936 750092 745097 742616 742794 745079 748613 752764 757342 762372 767767 773340 779095
62082 779095 785290 792216 800088 809284 820416 833938 849749 867337 886293 906501 927913 950379
62070I50379K3309K3836K3792K3037K1990K1574K2562K4953K7989L0595L1940
62059A225956L1802L0613K8991K6974K3792J8778J2515O660K332j015m767r489
62047A393142j4601j9421k3949k8493l3105l7621m1700m4692m5959m5629m4588
62036A013384m3381m1623l8890l5673l2805l0315k7518k4089k0351j6659j3205
62025F88875j0444q958q728r041r322r568r848r955r848r861j0068r943r112q093
62011E56086p782q314q902q708p536n741l897k503j630p86N74K317L730M316M221
61996E15445L820L224K458J731J209O29m96k215l941n003n292n331n734o562p123
61981D86819o586m904l052k077k012k064j811j692k128k701k656j902j030n10
$$ plain form
62070 950379 973688 997524 1021316 1044353 1066343 1087917 1110479 1135432 1163421 1194016 1225956
62059 1225956 1257758 1288371 1317362 1344336 1368128 1386906 1399421 1406081 1408413 1407398 1402631 1393142
62047 1393142 1378541 1359120 1335171 1306678 1273573 1235952 1194252 1149560 1103601 1057972 1013384
62036 1013384 970003 928380 889490 853817 821012 790697 763179 739090 718739 702080 688875
62025 688875 678431 669473 660745 651704 642382 632814 622966 613011 603163 593302 583234 573291 564179 556086
62011 556086 548304 539990 531088 522380 514844 509103 505206 502703 501073 500287 500861 503178 506908 511224 515445
61996 515445 519265 522489 524947 526678 527887 528516 528020 525805 521864 516861 511569 506238 500504 493942 486819
61981 486819 480233 475329 472277 470200 468188 466124 464313 462621 460493 457792 455136 453234 452204 451694
61967D51694l50m21o13p12n64m14o48j143j378j235j181j431j510r58l6O71R77
61950D40748J102J276J722K753M358N948O971P639Q620J0159J2007J3998J6139
61937E33440J8072J9141J9219J9013J9212J9599J9415J8397J7130J6263J5647
61926G34548J4433J2070R028O358M534L002R76j647m365o758q631r685r536q194
61912G36133o157l863j319J623M800P738J0041J1737J3271J5019J6635J7058J5461
61899H38177J2130Q081L930l56m611q092j0324j1814j3284j4527j4731j3894j3093
61886G57592j3152j3628j3565j2832j2106j1763j1498j1012j0430r851r109q298
61874F20348p999q417q725p940o300n009m621m413l549k215j088k64P62K262L973
$$ plain form
61967 451694 451344 450923 450310 449598 449034 448620 447972 446829 445451 444216 443035 441604 440094 439136 439100 439771 440748
61950 440748 441850 443126 444848 447601 451959 457907 464878 472517 481137 491296 503303 517301 533440
61937 533440 551512 570653 589872 608885 628097 647696 667111 685508 702638 718901 734548
61926 734548 748981 761051 770079 776437 780971 783973 784949 783302 778937 772179 763548 753863 744327 736133
61912 736133 729976 726113 724794 726417 731217 738955 748996 760733 774004 789023 805658 822716 838177
61899 838177 850307 858388 862318 861962 857351 849259 838935 827121 813837 799310 784579 770685 757592
61886 757592 744440 730812 717247 704415 692309 680546 669048 658036 647606 637755 628646 620348
61874 620348 612349 603932 595207 587267 580967 575958 571337 566924 563375 561160 560072 559808 560570 562832 566805
61859E66805N552P039Q730J0810J3106J5157J6676J7932J9468K1435K3554K5721
61847G51985K8150L0667L2394L2614L1539K9759K7297K3784J9364J4672J0014
61836A032239N155L1m877r023j2199j4286j4997j4117j1741q147l689J094N576
61823I51019R388J2495J4808J5945J5518J3476J0064N573L12n340j0962j6232
61811A016064k0986k5174k8610l0814l1348l0473k9156k8069k6840k4717k1812
61800G18065j9116j7284j6007j4690j3187j1628j0023q470p344o849o645o320
61788E80502n949n772n551m842l822l261l516m081m296m044l523k772j884j363
61774E25826j658k401k706k265j638j274q93k05K89j05j143j843j732j271r42
$$ plain form
61859 566805 572357 579396 588126 598936 612042 627199 643875 661807 681275 702710 726264 751985
61847 751985 780135 810802 843196 875810 907349 937108 964405 988189 1007553 1022225 1032239
61836 1032239 1037394 1037425 1032548 1023525 1011326 997040 982043 967926 956185 948038 944349 945443 951019
61823 951019 960407 972902 987710 1003655 1019173 1032649 1042713 1048286 1048598 1043258 1032296 1016064
61811 1016064 995078 969904 941294 910480 879132 848659 819503 791434 764594 739877 718065
61800 718065 698949 681665 665658 650968 637781 626153 616130 607660 600316 593467 586822 580502
61788 580502 574553 568781 563230 558388 554566 551305 547789 543708 539412 535368 531845 529073 527189 525826
61774 525826 524168 521767 519061 516796 515158 513884 512991 512786 513075 512970 511827 509984 508252 506981 506039
61759E06039n88L2N97O44L07J11K42L62K02r0k22j71k27o30j301j879k120k136
61741D99172k162k158j931j509j136q74n72k57j04L0N25J295J674J347Q85R64
61725D95189J433J705J740K032K724L337L416L061K695K602K717K782K602K230
61711E30265J840J417Q05Pr04k142l960n856o675n955m653m063m373m845n009
61696D85899n012n006m882m604m295m041l897l977m200m207l883l616l638l508
61682D27133k793j879j494j666j903k075k377k652k559k268k166j977j116J15
61668D00323O49J80m41n86o73j198j748j653j010l98K7N54J241J737J736J330
61652D00070R34Q83J064R95N50L94J207K598L389L062K343K192K727L358L471
$$ plain form
61759 506039 505451 505483 506080 506724 507031 507142 507384 507746 507948 507858 507636 507465 507238 506608 505307 503428 501308 499172
61741 499172 497010 494852 492921 491412 490276 489402 488830 488573 488469 488499 489024 490319 491993 493340 494225 495189
61725 495189 496622 498327 500067 502099 504823 508160 511576 514637 517332 519934 522651 525433 528035 530265
61711 530265 532105 533522 534327 534334 533430 531288 527328 521472 514797 508842 504189 500126 495753 490908 485899
61696 485899 480887 475881 470999 466395 462100 458059 454162 450185 445985 441778 437895 434279 430641 427133
61682 427133 424340 422461 420967 419301 417398 415323 412946 410294 407735 405467 403301 401324 400208 400323
61668 400323 400972 401152 400711 400125 399452 398254 396506 394853 393843 393445 393472 394026 395267 397004 398740 400070
61652 400070 401004 401887 402951 403946 404496 404890 406097 408695 412084 415146 417489 419681 422408 425766 429237
61637D29237K767J342k67j474k210k834l474l947m305m836n340n155m178l221
61623C92105k927k917k438j447m82J52N26O15K48m89j127j250r12n80p16j316
61607C77045j935k274k544l047l644m021m244m492m421l517k131j412j945k995
61593C34423l444l009k271j842j840j957j829j433j098j012r84q83r70j291j250
61578C09310m97J75k42j374j873j292m40J07O11J112J088N54L21O51P93L74J45
61561C09523O05J041P50K15J70L82L48L57R00J679K147K408K627K292J122N2J28
61544C26746R00J099N87M04J034J778J836J129N7p35m72J018K764L548L277K715
61528C47685K194J454N92R9K2j14m37o29p32j181j924k315k052j577j332j280
$$ plain form
61637 429237 432004 433346 433079 431605 429395 426561 423087 419140 414835 409999 404659 399504 395326 392105
61623 392105 389178 386261 383823 382376 381894 382046 382572 383187 383435 382946 381819 380569 379657 379077 378361 377045
61607 377045 375110 372836 370292 367245 363601 359580 355336 350844 346423 342906 340775 339363 337418 334423
61593 334423 330979 327970 325699 323857 322017 320060 318231 316798 315700 314688 313704 312821 311851 310560 309310
61578 309310 308813 308988 308746 307372 305499 304207 303767 303874 304485 305597 306685 307239 307560 308211 309004 309378 309523
61561 309523 310128 311169 311919 312134 312304 312686 313034 313391 314291 315970 318117 320525 323152 325444 326566 326618 326746
61544 326746 327646 328745 329332 329736 330770 332548 334384 335513 335570 334835 334363 335381 338145 341693 344970 347685
61528 347685 349879 351333 351925 352024 352046 351932 351495 350866 350134 348953 347029 344714 342662 341085 339753 338473
61512C38473j235j115p07J69J165J617J402J012P14K05o94j574j968j941j890
61497C33633j994k053j723q80J38P00N15n8m85n39k15M67J149J213N71OJ65P02
61479C31312J038J400K224L053L019K241J622J352P39m01j251j220p38m67m50
61464C43473l87j45K97R03J349J236P41M98O91P83M29P6L38J162J861J786Q82
61447C55973j57l55N48J699K051J591J145J245J721K244K579K470J970J797K551
61432C79072L704M182L816L356L064K395J271N49P48J216J092M35j03p2O74K007
61416D07406L250L430K307P19l40n66j82L66L51q14k660l849l675k786k162k084
61400C98711k477l294m092l974k786j673j668k298k352j505l88N52J312J733J530
$$ plain form
61512 338473 337238 336123 335416 335585 336750 338367 339769 340781 341495 341700 341006 339432 337464 335523 333633
61497 333633 331639 329586 327863 326983 327121 327821 328336 328278 327793 327254 327039 327506 328655 329868 330439 330445 330610 331312
61479 331312 332350 333750 335974 339027 342046 344287 345909 347261 348000 347599 346348 345128 344390 343923 343473
61464 343473 343086 342941 343238 344141 345490 346726 347467 347965 348656 349439 349868 349944 350282 351444 353305 355091 355973
61447 355973 355816 355461 356009 357708 359759 361350 362495 363740 365461 367705 370284 372754 374724 376521 379072
61432 379072 382776 386958 390774 394130 397194 399589 400860 401409 402157 403373 404465 404900 404797 404725 405399 407406
61416 407406 410656 414086 416393 417112 416772 416206 416024 416390 416741 415927 413267 409418 405743 402957 400795 398711
61400 398711 396234 392940 388848 384874 382088 380415 378747 376449 374097 372592 372204 372756 374068 375801 377331
61385C77331Q95L46K4l43p48p73k42M69Q34O48J31j82K28J352K571L283L436L222
61367C92482K664J823J169J151J580J814J581J201J113J534K442L538M317M507
61353D22916M492M918N851O682O966P036P552Q551R263Q972P838O679N948N309
61339E18973M364L371K881K937L122L204L156K713J569R4q88j205j551k389l263
61324E37088l623l654l827m059l897l252k439j654q49l7O21J029J323J848K991
61309E17609M781O708Q266R612J1316J3472J5523J6970J7700J7488J5909J3031
61297F68385R652O552M024K154Q99l51k417n134p278q200q722r734j0729j0627
61283F28474r480q368p966q106q473q803q494o959m426j822K18J685K683L203
$$ plain form
61385 377331 378226 378572 378596 378253 377505 376732 376490 376959 377793 378441 378572 378390 378618 379970 382541 385824 389260 392482
61367 392482 395146 396969 398138 399289 400869 402683 404264 405465 406578 408112 410554 414092 418409 422916
61353 422916 427408 432326 438177 444859 451825 458861 466413 474964 484227 493199 501037 507716 513664 518973
61339 518973 523337 526708 529589 532526 535648 538852 542008 544721 546290 546384 545496 544291 542740 540351 537088
61324 537088 533465 529811 525984 521925 518028 514776 512337 510683 509834 509797 510418 511447 512770 514618 517609
61309 517609 522390 529098 537364 546976 558292 571764 587287 604257 621957 639445 655354 668385
61297 668385 678037 684589 688613 690767 691666 691315 688898 683764 676486 668286 659564 649830 639101 628474
61283 628474 618994 610626 602660 594554 586081 577278 568784 561825 557399 555577 555795 557480 560163 563366
61269E63366L412L579L651L413L009K904L285L978M829N819O827P732Q613R442
61255F33859R777R261Q222P254O388N224L758K351J001o33k469l984n088o206
61241F68715p281p477o359m778l973m108m248l659k602j861j792k008j842r96
61227F15731K91J670L113M746O426P754Q517Q837Q840Q523Q072P981Q573R436
61213G08510R704Q953P704O878O779O773O025M452K770J779J769K551L737M960
61199G83344O087P387R212J1493J3711J5476J6923J8365J9799K0810K0813J9372
61187I62792J6523J2847R041N460K340K07n68o33j422l656o502q568r364r528
61173I68969r989j1164j2692j3757j3908j3668j3913j4684j5226j5247j5301j5665
$$ plain form
61269 563366 566778 570357 574008 577421 580430 583334 586619 590597 595426 601245 608072 615804 624417 633859
61255 633859 643636 652897 661119 668373 674761 679985 683743 686094 687095 686462 683993 680009 674921 668715
61241 668715 661434 653957 647598 642820 638847 634739 630491 626832 624230 622369 620577 618569 616727 615731
61227 615731 616022 617692 620805 625551 631977 639731 648248 657085 665925 674448 682520 690501 699074 708510
61213 708510 718214 727167 734871 741749 748528 755301 761326 765778 768548 770327 772096 774647 778384 783344
61199 783344 789431 796818 806030 817523 831234 846710 863633 881998 901797 922607 943420 962792
61187 962792 979315 992162 1001203 1006663 1009003 1009210 1008642 1008009 1006587 1002931 996429 987861 978497 968969
61173 968969 958980 947816 935124 921367 907459 893791 879878 865194 849968 834721 819420 803755
61161H03755j5817j5501j5408j5987j6461j5882j4541j3260j1847r490o399l801
61149F49361k238j004N35J949K432J649l17l184o192q250q784q183p149o002m748
61134E99875l459k196p89R89L041M860N945O396P050Q731J1271J3670J5417J7112
61120F87913J9462K2132K4208K5444K6358K7318K8189K8899K9635L0486L1204
61109I81248L1413L0733K8927K6234K3383K0854J8418J5711J2824R797O074J287
61097A206903l817q165j1820j5705j9978k3739k6407k8395l0077l1012l0707k9542
61085I47539k8474k8049k7985k7482k5915k3454k0984j9147j7632j5786j3545
61074F99086j1340r428p903p004o590n775l948j829n38M3Q39J857K306K355L176
$$ plain form
61161 803755 787938 772437 757029 741042 724581 708699 694158 680898 669051 659561 653162 649361
61149 649361 647123 646119 646654 648603 651035 652684 652367 649183 642991 634741 625957 617774 610625 604623 599875
61134 599875 596416 594220 593431 594420 597461 602321 608266 614662 621712 630443 641714 655384 670801 687913
61120 687913 707375 729507 753715 779159 805517 832835 861024 889923 919558 950044 981248
61109 981248 1012661 1043394 1072321 1098555 1121938 1142792 1161210 1176921 1189745 1199542 1205616 1206903
61097 1206903 1203086 1194921 1183101 1167396 1147418 1123679 1097272 1068877 1038800 1007788 977081 947539
61085 947539 919065 891016 863031 835549 809634 786180 765196 746049 728417 712631 699086
61074 699086 687746 678318 670415 663411 656821 651046 647098 645269 644731 644774 645613 647470 649776 652131 655307
61059F55307M966O424O712O607P054P876Q682R856J1698J3574J4914J6209J8080
61046G87959K0092K1522K2669K4360K6566K8449K9542L0109L0589L1334L2584
61035A085775L4139L5321L5752L5868L6274L7079L8241L9843M1557M2473M2155
61024A504477M1246M0507L9949L9693M0801M4334N0136N7479O6258P6625Q8034
61013B089539R9823J12276J26360J43118J64359J92820K30259K76316L31104L97802
61003D163776M80607N81659P03865Q56107J050384J291365J570873J868843K144963
60994A4712442K319478K278332J935066J317192N90645k1895l65832m14723k35058
60985B2115647P2443L85760N52984M32577j6881o85236j365218j872299k127873
$$ plain form
61059 655307 660273 666697 673409 680016 687070 694946 703628 713484 725182 738756 753670 769879 787959
61046 787959 808051 829573 852242 876602 903168 931617 961159 991268 1021857 1053191 1085775
61035 1085775 1119914 1155235 1190987 1226855 1263129 1300208 1338449 1378292 1419849 1462322 1504477
61024 1504477 1545723 1586230 1626179 1665872 1706673 1751007 1801143 1858622 1924880 2001505 2089539
61013 2089539 2189362 2301638 2427998 2571116 2735475 2928295 3158554 3434870 3765974 4163776
61003 4163776 4644383 5226042 5929907 6786014 7836398 9127763 10698636 12567479 14712442
60994 14712442 17031920 19310252 21245318 22562510 23153155 23131260 22765428 22350705 22115647
60985 22115647 22188090 22573850 23126834 23559411 23542530 22857294 21492076 19619777 17491904
60976A7491904k155030k023687j804956j554320j309049j088583q99013p40437
60968E916829o11024n06840m22465l53663k98463k55479k22577j97427j78058
60959B870833j62583j49324j37473j26749j16500j05935r5187q5130p6137o7966
60949A747849o0906n5928n3352n2289n1689n1148n0358m8735m6151m3379m1205
60938A192709l9594l8148l6833l5730l4563l3078l1489k9979k8167k5699k3116
60927H36313k1392k0613j9832j8292j6185j4115j2296j0696r508r047r122q882
60915F66333p490m967k313n87J18O68J731K922L286K516J371Q79J355K218K597
60900F70637K107J138L58j08p90k044l369l974l852l782m224m764m813m459m233
$$ plain form
60976 17491904 15336874 13313187 11508231 9953911 8644862 7556279 6657266 5916829
60968 5916829 5305805 4798965 4376500 4022837 3724374 3468895 3246318 3048891 2870833
60959 2870833 2708250 2558926 2421453 2294704 2178204 2072269 1977082 1891952 1815815 1747849
60949 1747849 1686943 1631015 1577663 1525374 1473685 1422537 1372179 1323444 1277293 1233914 1192709
60938 1192709 1153115 1114967 1078134 1042404 1007841 974763 943274 913295 885128 859429 836313
60927 836313 814921 794308 774476 756184 739999 725884 713588 702892 693384 684337 675215 666333
60915 666333 658843 653876 651563 650976 651094 651762 653493 656415 659701 662217 663588 664467 665822 668040 670637
60900 670637 672744 673882 674240 674132 673342 671298 667929 663955 660103 656321 652097 647333 642520 638061 633828
60885F33828m358m600m756m919n216n555n756n806n918o356p211q281r097r169
60871E46830q350p107o223o051o096n617m583l660l153k573j522m16J82M80R42
60856D93083J229N67q58j852j769j196q17l85N62J721K377K351K045J804J769
60841E00631J999K277K006Q51p40j983k500k316j500k68P90J158R22N79M43M98
60825E02847N63L78j63o77o19j40o9o83j250j245j227j767k343k184j620j447
60809D88354j573j442j354j979k871l009k656l075m213m463l223k104k691m417
60795D49284n687o007n869n392m392l269k712k699k770k945l513m085l793k529
60781C93622j205o68q74j200j153o10K38J043J548J750J852K162L041M510N832
$$ plain form
60885 633828 629470 624870 620114 615195 609979 604424 598668 592862 586944 580588 573377 565096 555999 546830
60871 546830 538480 531373 525150 519099 513003 507386 502803 499143 495990 493417 491895 491479 491661 492141 493083
60856 493083 494312 494879 494021 492169 490400 489204 488387 488002 488564 490285 492662 495013 497058 498862 500631
60841 500631 502630 504907 506913 507764 507024 505041 502541 500225 498725 498457 499247 500405 501327 501906 502349 502847
60825 502847 503410 503788 503625 502948 502329 502189 502120 501437 500187 498942 497715 495948 493605 491421 489801 488354
60809 488354 486781 485339 483985 482006 479135 476126 473470 470395 466182 461719 458496 456392 453701 449284
60795 449284 443597 437590 431721 426329 421937 418668 415956 413257 410487 407542 404029 399944 396151 393622
60781 393622 392417 391749 390875 389675 388522 387912 388150 389193 390741 392491 394343 396505 399546 404056 409888
60766D09888O013M986L896L814M598N334N534N368N042M556L911L171K321J407
60752D69839N99p9q87j899k751l062k884k443j827j284j390k368l624m447m933
60737D36560n587o322o557o239o042o395o913o960o432n701n067m436l533k348
60723C58028j408j295j821k009j153K96J335J542J255Q52M32J25J38L96N28L34
60707C57575k9l03l29J4P27J500J915J906J824J988K356K685K858K987L289L839
60691C84802M428M713M583M291M154M263M485M583M337L788L371L488L956M251
60677D43493M270M320M284L531J969N18p7k88j043k342l423l937m205m465m648
60662D37957m805n042n030m259k945k027k025k397k243j324j55O20Q00P61J056
$$ plain form
60766 409888 415901 420887 424783 428597 433195 438529 444063 449431 454473 459029 462940 466111 468432 469839
60752 469839 470438 470359 469472 467573 464822 461760 458876 456433 454606 453322 451932 449564 445940 441493 436560
60737 436560 430973 424651 418094 411855 405813 399418 392505 385545 379113 373412 368345 363909 360376 358028
60723 358028 356620 355325 353504 351495 350342 350638 351973 353515 354770 355622 356054 356179 356317 356713 357241 357575
60707 357575 357546 357243 356914 356928 357655 359155 361070 362976 364800 366788 369144 371829 374687 377674 380963 384802
60691 384802 389230 393943 398526 402817 406971 411234 415719 420302 424639 428427 431798 435286 439242 443493
60677 443493 447763 452083 456367 459898 461867 462385 462308 462020 460977 458635 455212 451275 447070 442605 437957
60662 437957 433152 428110 423080 418821 415876 413849 411824 409427 407184 405860 405705 406325 407125 407886 408942
60647D08942J798K470K563K133J519P21n20k134l673m752n234n114m576l989l476
60632C86678k684j420j96L79M65N88O63K96j11L80J704K573K169J212Q42J222
60616C94760J832K441K952K844J693M7j027j230j194j366j504j396j408j854k297
60601C93293j955p16O53J280R46J02o20q39n58l8M88J000J549J977K025J748J582
60584D01917J792K035J771R21j27j034j649j752j178k39M65P98J243K171L489
60569D10623N036O754Q249Q872Q690Q731R702J1030J1751J1748J1401J0462Q357
60556E31406N289K141o84l378n694o819o567n836n461n217m397k839r94P20K172
60541D93842L381M422N360O216P112Q421J0353J2431J3788J4166J4131J4124J3732
$$ plain form
60647 408942 410740 413210 415773 417906 419425 420146 419626 417492 413819 409067 403833 398719 394143 390154 386678
60632 386678 383994 382574 382378 382757 383222 383810 384473 384769 384658 385038 386742 389315 391484 392696 393538 394760
60616 394760 396592 399033 401985 404829 406522 406569 405542 404312 403118 401752 400248 398852 397444 395590 393293
60601 393293 391338 390622 391275 392555 393501 393603 392983 392144 391586 391548 392036 393036 394585 396562 398587 400335 401917
60584 401917 403709 405744 407515 408436 408309 407275 405626 403874 402696 402457 402922 403720 404963 407134 410623
60569 410623 415659 422413 430662 439534 448224 456955 466657 477687 489438 501186 512587 523049 531406
60556 531406 536695 538836 538152 534774 529080 522261 515694 509858 504397 499180 494783 491944 490950 491670 493842
60541 493842 497223 501645 507005 513221 520333 528754 539107 551538 565326 579492 593623 607747 621479
60528F21479J2162R176N315J421j888m433o356p675q000p001n122l499k968l341
60514E99270l748l448k379j166n47n48l26P86K241K931K763K856M065O058Q246
60499F17054J0801J4207J8292K2446K6512L0801L5298L9434M2655M4797M5719
60488I48016M4906M1673L5753K7643J8290Q354k217j3605k5165l5304m2547m6512
60476I59285m7781m7145m5191m2357l9004l5418l1863k8579k5616k2835k0189
60465E73307j7866j6013j4462j2870j1064r171p559o605o314o112n298l896k747
60452D53330k591l208l740l658l153k732k652k751k564j698l15P49O57n35j814
60437D23325k174j597r48r25j332j490j113n76k59m6L56Q34R64N92J8m61q94j419
$$ plain form
60528 621479 633641 642817 648132 649553 647665 643232 636876 629201 621201 614200 609078 605579 602611 599270
60514 599270 595522 592074 589695 588529 587982 587434 587108 587894 590135 593066 595829 598685 602750 608808 617054
60499 617054 627855 642062 660354 682800 709312 740113 775411 814845 857500 902297 948016
60488 948016 992922 1034595 1070348 1097991 1116281 1124635 1122418 1108813 1083648 1048344 1005797 959285
60476 959285 911504 864359 819168 776811 737807 702389 670526 641947 616331 593496 573307
60465 573307 555441 539428 524966 512096 501032 491861 484302 477697 471383 465271 459973 456077 453330
60452 453330 450739 447531 443791 440133 436980 434248 431596 428845 426281 424583 424268 425017 425674 425139 423325
60437 423325 421151 419554 418606 417681 416349 414859 413746 413170 412911 412865 413221 414055 415019 415611 415629 415168 414274 412855
60419D12855j866j803j009K26J281J739J696J534J451J369J229J109R67N95j2
60404D21361m38k66M69J409K229K664K439J606P52N53J063J753K176K335K487
60389D42592K807L231L483L299K783K321K045J713J290J249J804K283J917J059
60375D73876Q48J655K541K546J874J441J650K055K117J871J776K035K297K111
60361E00693J563J184J280J718K385L340M299M603M215M237N719Q267J0515J1757
60347E65775J2295J2390J1715J0000P483M465J038k525n600p707q885r452r685
60334E81307r746r577q821p289n452m148l672l554l221k563j888j666k240l370
60320E14100m184l991l084k321k071j992j649p91P87L001N177O662P663Q948J0815
$$ plain form
60419 412855 410989 409186 408177 408403 409684 411423 413119 414653 416104 417473 418702 419811 420778 421373 421361
60404 421361 420923 420657 421126 422535 424764 427428 429867 431473 432225 432778 433841 435594 437770 440105 442592
60389 442592 445399 448630 452113 455412 458195 460516 462561 464274 465564 466813 468617 470900 472817 473876
60375 473876 474724 476379 478920 481466 483340 484781 486431 488486 490603 492474 494250 496285 498582 500693
60361 500693 502256 503440 504720 506438 508823 512163 516462 521065 525280 529517 535236 543503 554018 565775
60347 565775 578070 590460 602175 612175 619658 624123 625161 622636 617036 609329 600444 590992 581307
60334 581307 571561 561984 553163 545874 540422 536274 532602 529048 525827 523264 521376 519710 517470 514100
60320 514100 509916 505925 502841 500520 498449 496457 494808 494017 494804 497805 502982 509644 517307 526255 537070
60305E37070J2958J5173J7374J9035J9467J8676J7159J4854J1220O398J459k875
60293F87968o836j0720j4174j6654j7903j7734j6061j3498j1204r786q845p761
60281E36792o362m770l329k739l404m535m846m270l931m194m061k920j675j352
60267D84404j656j818j880k165k256j589n62q5l29o84o38j22O56J146P82j20l28
60250D72756P55K129K480J891J459J683K086K077J516N85k36m32j02k4n37j014
60234D87072r13o61p43o36L01J515J983J835K068K844L245K789K059J703J700
60219E06161J944K624L694M574M861M868N160N813O426O710O832P158P717Q051
60205E82593P743O954O091N139L917K964L236M577N435M700L059J856J282O03
$$ plain form
60305 537070 550028 565201 582575 601610 621077 639753 656912 671766 682986 689384 690843 687968
60293 687968 681132 670412 656238 639584 621681 603947 587886 574388 563184 553398 544553 536792
60281 536792 530430 525660 522331 519592 516188 511653 506807 502537 498606 494412 490351 487431 485756 484404
60267 484404 482748 480930 479050 476885 474629 473040 472478 472393 472064 471380 470742 470620 471276 472422 473204 473084 472756
60250 472756 473511 475640 478120 480011 481470 483153 485239 487316 488832 489417 489181 488749 488647 488623 488086 487072
60234 487072 486159 485498 484755 484119 484420 485935 487918 489753 491821 494665 497910 500699 502758 504461 506161
60219 506161 508105 510729 514423 518997 523858 528726 533886 539699 546125 552835 559667 566825 574542 582593
60205 582593 590336 597290 603381 608520 612437 615401 618637 623214 628649 633349 636408 638264 639546 640149
60191F40149m43j457k301l242m258m954n115m822m170l395k992l160l428l331
60177E93081l069k974k803k291j932k341l095l107k010m84O69J066O30k79p86
60162E70275k88O94J107O95J36K4L87J031J712J998J586P47L4k47RQ64J978K576
60144E85318K394K133K400K788K825L090M277N776O406O258O458P240P637P153
60130F52153O502O338O236N335L311N56j977l200k798j683q86l66L28P62J79q66
60114F69924r13L07J478J619J107N50j36j057j839k279k651k965k868k618l063
60099F54596m261n085m744l816l197k937k731k659k683k117m62J707L317L942
60085F28870L904L626L410L436L585L464K953K359J896J386O39l76j784l695n710
$$ plain form
60191 640149 639706 638249 635948 632706 628448 623494 618379 613557 609387 605992 603000 599840 596412 593081
60177 593081 590012 587038 584235 581944 580012 577671 574576 571469 569459 568975 569644 570710 571340 571061 570275
60162 570275 569987 570681 571788 572483 572619 572643 573030 574061 575773 577771 579357 580104 580138 579891 579900 580764 582742 585318
60144 585318 587712 589845 592245 595033 597858 600948 605225 611001 617407 623665 630123 637363 645000 652153
60130 652153 658655 664993 671229 676564 679875 680431 678454 675254 672456 670773 669887 669521 669849 670611 670790 669924
60114 669924 669011 669318 670796 672415 673522 674072 673936 672879 671040 668761 666110 663145 660277 657659 654596
60099 654596 650335 645250 640506 636690 633493 630556 627825 625166 622483 620366 619904 621611 624928 628870
60085 628870 632774 636400 639810 643246 646831 650295 653248 655607 657503 658889 659528 659152 657368 653673 647963
60070F47963p172q068q952r884j0175r510q515p795p168o296n408m839m428l879
60056E45874l221k552j734q20k32j57j65J79P51J213J541J920K500L405M600N606
60040E58708N863N494N079M649L669K150Q41j8j097k654l741l523k674k578l629
60025E66539n053o042o368o164n807n803o335o997p324p278o995o484n890n569
60011D78430n447m830l387j887j355j778k227k043j413q94p96r95j079p67k71
59996D49261m8j04P1P77J771K731L545L984L703K885K321K474K943L181L168K983
59980D85646K280P61j156k665l367l360k846k031j217o96o51j180k093k697k277
59965D62451r38N19J567K308K845L084L231L677M147L785K418R15o3p48j310j264
$$ plain form
60070 647963 640791 632723 623771 613887 603712 594202 585687 577892 570724 564428 559020 554181 549753 545874
60056 545874 542653 540101 538367 537547 537315 537158 536993 537172 537923 539136 540677 542597 545097 548502 553102 558708
60040 558708 564571 570065 575144 579793 583462 585612 586453 586435 585338 582684 578943 575420 572746 570168 566539
60025 566539 561486 555444 549076 542912 537105 531302 524967 517970 510646 503368 496373 489889 483999 478430
60011 478430 472983 468153 464766 462879 461524 459746 457519 455476 454063 453169 452373 451378 450299 449532 449261
59996 449261 449213 449109 449180 449957 451728 454459 458004 461988 465691 468576 470897 473371 476314 479495 482663 485646
59980 485646 487926 488687 487531 484866 481499 478139 475293 473262 472045 471349 470698 469518 467425 464728 462451
59965 462451 461513 462032 463599 465907 468752 471836 475067 478744 482891 486676 489094 490009 489946 489198 487888 486624
59949D86624n21n8o40j566j615p55J4O6l97j001j493j653j514j502j877k359k730
59932D67023l203l651l185j242J306L025L530L520L574L786M264N141O138O819
59918D96845P179P425P414O839N754M342K535N14p96o13O14J711K261K756L432
59903E48212L849L653L002K184J452J230J737K335K036Q11k50k86L87R81J256
59888E72589J481J800K121K441K888L470L982M301M578N077N719O005N601M842
59874F26895M262L737K574N97j468k919l861m652n121m861m028l257k911k792
59860F02195k490j816r97o18j096k064k518j833k77J482L045M377N715P502R788
59845F20395J1624J1712R848P070M176J084k023m013m038k656r87N03J535J317
$$ plain form
59949 486624 486103 486045 485405 483839 482224 481469 481483 481549 481152 480151 478658 477005 475491 473989 472112 469753 467023
59932 467023 463820 460169 456984 455742 457048 460073 463603 467123 470697 474483 478747 483888 490026 496845
59918 496845 504024 511449 518863 525702 531456 535798 538333 538847 538051 537438 538052 539763 542024 544780 548212
59903 548212 552061 555714 558716 560900 562352 563582 565319 567654 569690 570501 570251 569965 570352 571333 572589
59888 572589 574070 575870 577991 580432 583320 586790 590772 595073 599651 604728 610447 616452 622053 626895
59874 626895 631157 634894 637468 638065 636597 633678 629817 625165 620044 615183 611155 607898 604987 602195
59860 602195 599705 597889 596892 596274 595178 593114 590596 588763 588486 589968 593013 597390 603105 610607 620395
59845 620395 632019 643731 653579 660649 664825 665909 663886 659873 655835 653179 652192 652695 654230 655547
59831F55547n86l191n032n831o317o767o812o440o078n773n255m756m893n530
59817E82286n682m761l309k277k052k386k850l207l484l693l493k499j055j34
59803E41404j98o39p71p40r37j138r16l98M8L31K60p10k551m104m373l853l590
59786E17125l499k742j434o43q02j269j523j778k221k512k304j606o02M04R29
59771D95523P63L82L71O70Q81R85J175J388J630K287L427M341M554M699N406O079
59755E34561N895N401N720O667P146P078P376Q130Q454Q177Q109Q387Q120O973
59741F36194N733M911M058K881J769Q29l57j623k129j840j773k321k605k158j871
59726F39698k462l199l080k336j833j828k131k703l272l109k088j232j406k067
$$ plain form
59831 655547 654961 651770 646738 640907 634590 627823 621011 614571 608493 602720 597465 592709 587816 582286
59817 582286 576604 571843 568534 566257 564205 561819 558969 555762 552278 548585 545092 542593 541538 541404
59803 541404 541206 540567 539796 539056 538119 536981 536065 535667 535715 536046 536306 535596 533045 528941 524568 520715 517125
59786 517125 513626 510884 509450 508807 508005 506736 505213 503435 501214 498702 496398 494792 494190 494594 495523
59771 495523 496286 496668 497039 497709 498590 499575 500750 502138 503768 506055 509482 513823 518377 523076 528482 534561
59755 534561 540456 545857 551577 558244 565390 572468 579844 587974 596428 604605 612714 621101 629221 636194
59741 636194 641927 646838 650896 653777 655546 656375 656018 654395 652266 650426 648653 646332 643727 641569 639698
59726 639698 637236 634037 630957 628621 626788 624960 622829 620126 616854 613745 611657 610425 609019 606952
59712F06952k154j622j227j287j518j725j869j723j191o78o43r64j193j167r85
59697E87006p71p38j046j298q18K44P64P3j121j799j947k093k208j895j271p98
59681E70284n70m14m74r80j670k110k370k845l498l945m109m280m626n044n422
59666E27927n604n250m196k838j797j277j083j003r03n47J78J063J861K574L196
59651E12301L446L148K706K715L204L581L286K213O48q90j874k169k136k147k108
59636E25924j733j109o41m53j99M17J176J521J180L84n66j737l239m522m565l122
59620E08716j303l64l02k35O5m8q03j492j472r69m12K69J217K036K195J822J576
59603E10496J916K737L508L541K520J017K08O76J765K377K141J465P26n8q53j421
$$ plain form
59712 606952 604798 603176 601949 600662 599144 597419 595550 593827 592636 591958 591315 590351 589158 587991 587006
59697 587006 586235 585497 584451 583153 582335 582579 583343 583416 582295 580496 578549 576456 574248 572353 571082 570284
59681 570284 569714 569300 568826 567846 566176 564066 561696 558851 555353 551408 547299 543019 538393 533349 527927
59666 527927 522323 517073 512877 510039 508242 506965 505882 504879 503976 503429 503607 504670 506531 509105 512301
59651 512301 515747 518895 521601 524316 527520 531101 534387 536600 537248 536358 534484 532315 530179 528032 525924
59636 525924 524191 523082 522441 521988 521789 522206 523382 524903 526083 526467 525901 524164 520925 516403 511838 508716
59620 508716 507413 507049 506747 506512 506577 506529 505726 504234 502762 501793 501381 501650 502867 504903 507098 508920 510496
59603 510496 512412 515149 518657 522198 524718 525735 525943 526619 528384 530761 532902 534367 535093 535035 534182 532761
59587E32761j633j695j903k205k195j634q79o26j152k034k640k674k111j049J31
59572E08462Q04P45M49M25M93K90Q3M11J144J603J523J267J072P92L91Q7m4j07
59554E19890p3J67M95P97J275J996K438K190J767J939K496K674K586L194M881
59539E48712P105R571J2698J6699K1003K4608K6070K3390J5516M531n027r892
59527F94984j0441r099p439n636l600j550K41J517K067J989J553O41j122l477
59513F60628n569p099q635j0399j1621j1641j0915j0297r877r091p626n792m327
59500E47739l929m571n183m700l365k307j865j389o66l20m71l46K85N10j72q18
59484E18432m59M52R44J042J439K230K960L544M348N563O974Q085Q252P238N780
$$ plain form
59587 532761 531128 529433 527530 525325 523130 521496 520617 519991 518839 516805 514165 511491 509380 508331 508462
59572 508462 509266 510011 510460 510885 511378 511668 511751 512162 513306 514909 516432 517699 518771 519563 519954 520041 519997 519890
59554 519890 519817 519984 520479 521276 522551 524547 526985 529175 530942 532881 535377 538051 540637 543831 548712
59539 548712 555817 565388 578086 594785 615788 640396 666466 689856 705372 709903 704876 694984
59527 694984 684543 675444 668005 662369 658769 657219 657460 658977 661044 663033 664586 665227 664105 660628
59513 660628 655059 647960 639325 628926 617305 605664 594749 584452 574575 565484 557858 552066 547739
59500 547739 543810 539239 534056 529356 525991 523684 521819 520430 519764 519444 518973 518627 518912 519422 519250 518432
59484 518432 517973 518425 519369 520411 521850 524080 527040 530584 534932 540495 547469 555554 563806 571044 576824
59469E76824M942M774M424L676L235L325L186K491K001K202K556K721L294M499
59455F24150N484N831O488Q146R786J0074R144P870O384M547K952K024R42j182
59441G02640l788n790p317r136j0890j1414j0407q627o718m924l546k632j640
59428F15811k85Q70J543K604M734P097Q626R841J1915J4615J6730J7967J8968
59415G31036J9848K0313K0786K1996K3775K5442K6592K5998K0778R144o132j9143
59403I20433k6042k7193k4452j8750j0801k071O064J2546J5496J2549L598p932
59391H53445j7601k3124k4754k3792k1599j9100j6357j2980r322o578n380n072
59379F67786m730m201l772l531l417l318k880j939j111j178j792j740o51O35J567
$$ plain form
59469 576824 581766 586540 590964 594640 597875 601200 604386 606877 608878 611080 613636 616357 619651 624150
59455 624150 629634 635465 641953 650099 659885 669959 679103 686973 693357 697904 700856 702880 703822 702640
59441 702640 698852 693062 685745 676609 665719 654305 643898 635271 628553 623629 620083 617451 615811
59428 615811 615526 616396 617939 620543 625277 632374 641000 650841 662756 677371 694101 712068 731036
59415 731036 750884 771197 791983 813979 837754 863196 889788 915786 936564 945708 939576 920433
59403 920433 894391 867198 842746 823996 813195 811124 817188 829734 845230 857779 861377 853445
59391 853445 835844 812720 787966 764174 742575 723475 707118 694138 684816 678238 672858 667786
59379 667786 663056 658855 655083 651552 648135 644817 641937 639998 638887 637709 635917 634177 633526 634161 635728
59364F35728K618M117N419N896N865N967O343O979Q113R654J0944J1670J2462
59351G31775J3920J5584J6521J6602J6578J7059J7906J8526J8453J7653J6429
59340I17006J4950J2988J0215O679K685j524n665r256j2093j4586j7107j9210
59328H85082k0190k0209k0077k0114j9933j9238j8133j6626j4693j2805j1632
59317F91432j1141j0643r776q794p910p022o114n260m268k945j575n29M49J839
59303F17743L480M897O228Q022J0266J2507J4591J6115J5477J0951L025n521j2113
59290G05668j6069j7786j7647j6133j3932j1335q268n118k681j047M63K114L463
59277F01692M518N929P756R190R991J1054J2856J4515J5150J5133J5110J4740
$$ plain form
59364 635728 638346 642463 647882 653778 659643 665610 671953 678932 687045 696699 707643 719313 731775
59351 731775 745695 761279 777800 794402 810980 828039 845945 864471 882924 900577 917006
59340 917006 931956 944944 955159 961838 964523 962999 957334 948078 935985 921399 904292 885082
59328 885082 864892 844683 824606 804492 784559 765321 747188 730562 715869 703064 691432
59317 691432 680291 669648 659872 651078 643168 636146 630032 624772 620504 617559 615984 615455 615904 617743
59303 617743 621223 626120 632348 640370 650636 663143 677734 693849 709326 720277 723302 717781 705668
59290 705668 689599 671813 654166 638033 624101 612766 604498 599380 596699 595652 596115 598229 601692
59277 601692 606210 612139 619895 629085 639076 650130 662986 677501 692651 707784 722894 737634
59265G37634J3400J1454R688Q001N649K587l78k638m267n480o270o678p045p776
59251G47881q919r924r915q436o045l913k678j916p37J305L796N759O517O479
59237G19254O736P616Q109P279N687M637M414M187L335J926O6k238m557o301p500
59222G52650q587r665j0770j2459j4909j6777j6343j3817j1144r461q119o459
59210F14140n014m380m285m344m732n393n603m905l710k526j385m07J1k1J55O25
59194E68226P33L72M50J496K800L515L775M133M651N093N342N202M463L513L181
59179F16945L670M383M876N149M927L822K426K063L105M561N650O563P388P661
59165F83189P501P789Q558Q532O991M820K885P93j881m426o206p799r775j1391
$$ plain form
59265 737634 751034 762488 772176 780177 785826 788413 788035 785397 781130 775650 769380 762702 755657 747881
59251 747881 738962 729038 719123 710687 704642 700729 698051 696135 695398 696703 700499 706258 712775 719254
59237 719254 725990 733606 741715 748994 754681 759318 763732 767919 771254 773180 773246 771008 766451 760150 752650
59222 752650 744063 734398 723628 711169 696260 679483 663140 649323 638179 628718 620599 614140
59210 614140 609126 604746 600461 596117 591385 585992 580389 575484 571774 569248 567863 567456 567467 567446 567601 568226
59194 568226 568959 569331 569781 571277 574077 577592 581367 585500 590151 595244 600586 605788 610251 613764 616945
59179 616945 620615 624998 629874 635023 639950 643772 646198 648261 651366 655927 661577 668140 675528 683189
59165 683189 690690 698479 707037 715569 722560 727380 730265 731058 729177 724751 718545 710746 700971 689580
59151F89580j1796j1551j1662j1863j1225r832q622p983p599p330p181o821n983
59138E70132n047m505m203l806l488l459l403k991k481k086j337J71J982L366
59124E38845M108M238L693K965L202M818O757P962Q822J0164J1613J2093J1499
59111F30779J0765J0491J0429J0150R491Q470P305O284N363M295L288K805K473
59098G22388J248r35k768l393l505l845l902l059j912j184l93J087K509K674J663
59083G06673L52j220l490n896p217p257o975p092p505p888p945p311o037m859
59069F26333m291l956l498l383l888m121l250k012j684k153k400k363k730l232
59055E83372k764j234J46O18O00N64L08k74p94j044j271j498j305n85J16K46j90
$$ plain form
59151 689580 677784 666233 654571 642708 631483 621651 613029 605046 597447 590117 582936 576115 570132
59138 570132 565085 560580 556377 552571 549083 545624 542221 539230 536749 534663 533326 533497 535479 538845
59124 538845 542953 547191 550884 553849 557051 561869 568626 576588 585410 595574 607187 619280 630779
59111 630779 641544 652035 662464 672614 682105 690575 697880 704164 709527 713822 717110 719915 722388
59098 722388 723636 722701 719933 716540 713035 709190 705288 702229 700317 699133 698740 699827 702336 705010 706673
59083 706673 707025 705805 702315 696419 689202 681945 674970 667878 660373 652485 644540 637229 631192 626333
59069 626333 622042 618086 614588 611205 607317 603196 599946 597934 596250 594097 591697 589334 586604 583372
59055 583372 580608 579374 579520 580138 580738 581302 581610 581336 580542 579498 578227 576729 575424 574839 574955 575201 575011
59038E75011p89j161j228j311j690j914j092P71K447L025L094L734N040O502Q132
59023E98571J0216J2388J3947J4680J4642J3665J1933J0396R538Q324N539J665
59011G25504j772m234o266p857q141o799m584k360m79R01J793K669M022N646P015
58996G05058Q044Q775Q809P884O770O460O771O666N754M494L061J071j494l917
58982G74206n374n433m198k434j169n30N21K664N108O789P956R546J1568J3256
58968H12476J4375J5219J5704J5617J5403J5638J5993J5791J5169J4625J3752
58957I79762J1651Q336M610P79l423p831j1852j5289j8209k0254k1041k0964k0716
58944H65559k0383j9772j9035j8071j6107j2989j0097q637p862o375m432l272
$$ plain form
59038 575011 574222 573061 571833 570522 568832 566918 565826 566597 569044 572069 575163 578897 583937 590439 598571
59023 598571 608787 621175 635122 649802 664444 678109 690042 700438 709976 718300 723839 725504
59011 725504 723732 719498 713232 705375 697234 690435 685851 683491 683012 683913 685706 688375 692397 698043 705058
58996 705058 713102 721877 730686 738570 745340 751800 758571 765237 770991 775485 778546 779617 778123 774206
58982 774206 768832 763399 759201 756767 755598 755068 755589 758253 763361 770150 778106 787652 799220 812476
58968 812476 826851 842070 857774 873391 888794 904432 920425 936216 951385 966010 979762
58957 979762 991413 999749 1004359 1005138 1001715 993884 982032 966743 948534 928280 907239 886275 865559
58944 865559 845176 825404 806369 788298 772191 759202 749105 740468 732606 726231 721799 718527
58932G18527k850k136j155q01q63k30R95J480Q15k9m90r99j623j826j740k072
58916G05003k588k261j098k14O3M96J144J093L86M98K267M806P039Q902J0490
58901G36026J1516J2240J3671J6073J8352J9506J9714J9615J9574J9895K0820
58890I27002K1962K2813K3835K5878K8462K9994K9803K8468K6082K1923J6274
58879A202496J0757O219J752l423q668j3294j7816k2796k7502l0625l1545l0336
58867A035219k7491k4057k1110j8587j5679j2563j0481r777r337q537q219r012
58855H60369j0081j0446j0301j0035r204p560o022n539n711n551n017m842n388
58842G64672o440p687q817r551j0001j0482j0792j0388r407q651q316p735o586
$$ plain form
58932 718527 715677 713541 712386 711585 710722 710492 711487 712967 713782 713753 713263 712264 710641 708815 707075 705003
58916 705003 702415 700154 699056 698842 698905 699401 700545 701638 702024 702522 704789 709595 716634 725536 736026
58901 736026 747542 759782 773453 789526 807878 827384 847098 866713 886287 906182 927002
58890 927002 948964 971777 995612 1021490 1049952 1079946 1109749 1138217 1164299 1186222 1202496
58879 1202496 1213253 1219472 1221224 1217801 1209133 1195839 1178023 1155227 1127725 1097100 1065555 1035219
58867 1035219 1007728 983671 962561 943974 928295 915732 905251 895474 886137 877600 869381 860369
58855 860369 850288 839842 829541 819506 810302 802742 796720 791181 785470 779919 774902 770060 764672
58842 764672 758232 750545 741728 732177 722176 711694 700902 690514 681107 672456 664140 656405 649819
58829F49819n354m253k804r55M50R22J138J985L504N174O439O779O184N702O435
58814F81165P835Q219P162N936N322M573L156J915J483J025l64k109l124l460
58800G18734l901m622n256n719o147o527o944p714q787r600r870r827r385p958
58786F16477n480k747m67J240K173J988J090N87Q95J405J769K342L021K915J700
58771F28908J42j174k519l942m810m876m677m388l542k343j781j897j413J68J601
58756E93457J940K016K808L674L470K341J232M86m4k77k27j79R1J305L264M579
58740F19936M643M605N410O227N937N070M833N193N313N196N549O484P427Q042
58726F99865Q249P828O764N640M948M433L710L027K888L422M533O134P832R000
$$ plain form
58829 649819 644465 640212 637408 636453 636903 637825 638963 640948 644452 649626 656065 662844 669028 674730 681165
58814 681165 689000 697219 704381 710317 715639 720212 723368 725283 726766 727791 727427 725318 722194 718734
58800 718734 714833 710211 704955 699236 693089 686562 679618 671904 663117 653517 643647 633820 624435 616477
58786 616477 610997 608250 607783 609023 611196 613184 614274 614861 615756 617161 618930 621272 624293 627208 628908
58771 628908 629050 627876 625357 621415 616605 611729 607052 602664 599122 596779 594998 593101 591688 591856 593457
58756 593457 595397 597413 600221 603895 607365 609706 610938 611424 611380 611103 610876 610697 610788 612093 615357 619936
58740 619936 624579 629184 634594 640821 646758 651828 656661 661854 667167 672363 677912 684396 691823 699865
58726 699865 708114 715942 722706 728346 733294 737727 741437 744464 747352 750774 755307 761441 769273 778273
58712G78273R456R450Q902P488N542L790K057m91l663o213p914j0119j3634j7387
58698G65537j9951k1147k1438k1000k0085j9180j8109j6095j3218j0633q859p202
58686E68620n388m261m212m367m100l924m134m034l261k452j910j030K73J191
58672E27011J687K848M837O343O855P608R385J1292J2793J4815J7529J9114J8177
58659F60294J5588J2452Q227K560k893o378q265r686j0505j0370j0172j0593j0606
58646F19653r249p503o624o017m569k750j545n78Q48K104K435K562L324M000L649
58631E99740K910K624K130P52m35k68M31N01O76K055L697M095L841M432N530N849
58615F38560N758O533P785Q059P371O815O260M689K363M95q44k490m338n523o023
$$ plain form
58712 778273 787729 797179 806081 813569 819111 822901 824958 824467 820804 814591 806677 796558 782924 765537
58698 765537 745586 724439 703001 682001 661916 642736 624627 608532 595314 584681 575822 568620
58686 568620 563232 558971 554759 550392 546292 542368 538234 534200 530939 528487 526577 525547 525820 527011
58672 527011 528698 531546 536383 542726 549581 557189 566574 577866 590659 605474 623003 642117 660294
58659 660294 675882 688334 696561 699121 696228 689850 681585 671899 661394 651024 640852 630259 619653
58646 619653 610404 602901 596277 590260 585691 582941 581396 580818 581666 583770 586205 588767 592091 596091 599740
58631 599740 602650 605274 607404 608156 607721 607453 607884 608385 609061 611116 614813 618908 622749 627181 632711 638560
58615 638560 644318 650851 658636 666695 674066 680881 687141 691830 694193 694688 693844 691354 687016 681493 675470
58600F75470o302o053n024m223m556n099m634l871m073m442l205n92J616K962
58586F27974M456O342P904R102J0451J1584J1793J1452J1256J0705R156P483O752
58573G46410O269N036M129N285P894R836J0734J2004J4244J6869J9820K3363K6582
58560I08475K8286K8906K9386K8861K5709K0290J4378Q548K494k749n631o729
58548A080224p986r596j0028q922p554o689o238o765r056j2364j5154j7250j9232
58535I43390k0429j9802j8131j6872j5519j2643q865o080m326k184K01J434J787
58522H21961K780M055L687J618j32p92j529k705l222k899k937l681m229m419m885
58507H02671n285m785m087m474n263m759l437l274m254m515l760l494l901l602
$$ plain form
58600 675470 669168 663115 658091 653868 649312 644213 639579 635708 631635 627193 623988 623396 625012 627974
58586 627974 632430 638772 646676 655778 666229 677813 689606 701058 712314 723019 732175 739658 746410
58573 746410 752679 757715 761844 767129 775023 784859 795593 807597 821841 838710 858530 881893 908475
58560 908475 936761 965667 995053 1023914 1049623 1069913 1084291 1092839 1095333 1092584 1086953 1080224
58548 1080224 1072238 1062642 1052614 1043692 1036138 1029449 1023211 1016446 1007390 995026 979872 962622 943390
58535 943390 922961 903159 885028 868156 852637 839994 831129 825049 820723 818539 818740 820174 821961
58522 821961 824741 828796 832483 834101 833969 833177 831648 828943 825721 822822 819885 816204 811975 807556 802671
58507 802671 797386 792601 788514 784040 778777 774018 770581 767307 763053 758538 754778 751284 747383 743781
58493G43781k596k357k831k371q93m6M5J084L310M943N392O104P738R376J0914
58478G81593J3294J5868J6545J5111J3501J2246R633N033J86l572o675r282j0546
58465H52935j0569j0569j0555r358p153n344l859j357J865M165N771Q458J1862
58452H26292J3508J2817J1613J0385P619L449J65j734m258p725r578q568o696
58439H47289n605m400k403q06j49Q31K501L373K999K953L903M646M981O392Q934
58424H75439J0582J0667J0709J0949R478N911K444J21k530n962q263q747r344
58411I01454j0894j1548j0413r401r762j0034r119q206q066p502o036m995m547
58398G90931k892K20K423K628K708L941N051N142N133N063L496R48K13J815K900
$$ plain form
58493 743781 741185 738828 735997 733626 732733 732687 732732 733816 737126 742069 747461 753565 761303 770679 781593
58478 781593 794887 810755 827300 842411 855912 868158 877791 882824 883010 879438 872763 863481 852935
58465 852935 842366 831797 821242 811884 804731 799387 795528 794171 796036 800201 805972 814430 826292
58452 826292 839800 852617 864230 874615 882234 885683 885848 884114 879856 872131 862553 853985 847289
58439 847289 841684 837284 834881 834075 833926 834757 837258 840631 843630 846583 850486 855132 860113 866505 875439
58424 875439 886021 896688 907397 918346 927824 933735 936179 936300 933770 927808 919545 910798 901454
58411 901454 890560 879012 868599 859198 849436 839402 830283 822077 814011 806509 800473 795478 790931
58398 790931 788039 788259 790682 793310 796018 799959 805010 810152 815285 820348 823844 824792 825005 826820 829720
58383H29720J984R87J124Q99j07K88K737M742N144O090Q511R904Q863P711Q131
58368H96728Q367P199O697Q280R929J0023J0152J1574J2589J2074J1841J2895
58356A018348J3066J0954Q509P152N254K007j71J57P76M3j47J655L526L933M491
58341A079553O326P668P799R094J2434J4940J5103J5621J8159J9947J8901J7402
58329A242947J7455J6785J3458R899Q449P242M382J887J598J424m07j539J11K293
58315A325984K614K778M799P094P997R064J1306J2510J1758J1978J4568J6330
58303A438780J5333J4658J6535J8138J7207J6353J7551J8021J6011J4929J7068
58292A620584J9021J8104J7452J9706K1678K0554J9443K1253K3068K2134K1331
$$ plain form
58383 829720 831704 832691 833815 834714 834607 834895 837632 842374 847518 853608 862119 872023 880886 888597 896728
58368 896728 905095 912294 918991 927271 937200 947223 957375 968949 981538 993612 1005453 1018348
58356 1018348 1031414 1042368 1050877 1058029 1063283 1065290 1065119 1065276 1066052 1066095 1065948 1067603 1071129 1075062 1079553
58341 1079553 1085879 1093547 1101346 1110440 1122874 1137814 1152917 1168538 1186697 1206644 1225545 1242947
58329 1242947 1260402 1277187 1290645 1300544 1308993 1316235 1320617 1322504 1324102 1325526 1325119 1323580 1323691 1325984
58315 1325984 1328598 1331376 1336175 1343269 1351266 1360330 1371636 1384146 1395904 1407882 1422450 1438780
58303 1438780 1454113 1468771 1485306 1503444 1520651 1537004 1554555 1572576 1588587 1603516 1620584
58292 1620584 1639605 1657709 1675161 1694867 1716545 1737099 1756542 1777795 1800863 1822997 1844328
58281A844328K3100K4232K2477K1749K4723K7005K5198K3815K7334L2203L3938
58270B130102L5344M0122M5146M6791M8281N2936N6931N6758N6829O1360O5908
58259B696508O5543O4168O6578O8785O5813O1853O2692O5148O4080O2699O5783
58248C409650O9937P1034P3687Q2510R1854R5463R8256J06809J16608J21138J25085
58237D462031J35342J47337J53939J59578J71428J85130J93811K02577K18906
58228F030079K37547K50601K63528K84886L09694L29928L51628L83762M20313
58219H861966M52078M85611N31042N82536O31411O86540P59814Q44383R30807
58210A4766188J030980J160872J314664J483539J684238J939257K246080K598615
$$ plain form
58281 1844328 1867428 1891660 1914137 1935886 1960609 1987614 2012812 2036627 2063961 2096164 2130102
58270 2130102 2165446 2205568 2250714 2297505 2345786 2398722 2455653 2512411 2569240 2630600 2696508
58259 2696508 2762051 2826219 2892797 2961582 3027395 3089248 3151940 3217088 3281168 3343867 3409650
58248 3409650 3479587 3550621 3624308 3706818 3798672 3894135 3992391 4099200 4215808 4336946 4462031
58237 4462031 4597373 4744710 4898649 5058227 5229655 5414785 5608596 5811173 6030079
58228 6030079 6267626 6518227 6781755 7066641 7376335 7706263 8057891 8441653 8861966
58219 8861966 9314044 9799655 10330697 10913233 11544644 12231184 12990998 13835381 14766188
58210 14766188 15797168 16958040 18272704 19756243 21440481 23379738 25625818 28224433
58202B8224433L019985L537886M148665M847479N673314O681567P900722R370011
58194G3404062J1191287J3486017J6343518J9889325K4341394K9837448L6142162
58187B24635213M2512310M7675733M9746331M6425069L6082658J9326265n09250
58180D65894329j8892324l2514467m0503178m3748254m3564940m1028360l7022937
58173B08619869l2337446k7571678k3091006j9107176j5726510j2936718j0649118
58166F7200217q785938p295919o109825n144285m349015l705373l183790k743482
58158B5882590k367776k060619j811501j596671j409482j257612j134576j022892
58150A3221461r20727q37859p69491p00179o29713n70447n22343m73965m24998
$$ plain form
58202 28224433 31244418 34782304 38930969 43778448 49451762 56133329 64034051 73404062
58194 73404062 84595349 98081366 114424884 134314209 158655603 188493051 224635213
58187 224635213 267147523 314823256 364569587 410994656 447077314 466403579 465894329
58180 465894329 447002005 414487538 373984360 330236106 286671166 245642806 208619869
58173 208619869 176282423 148710745 125619739 106512563 90786053 77849335 67200217
58166 67200217 58414279 51118360 45008535 39864250 35515235 31809862 28626072 25882590
58158 25882590 23514814 21454195 19642694 18046023 16636541 15378929 14244353 13221461
58150 13221461 12300734 11462875 10693384 9993205 9363492 8793045 8270702 7796737 7371739
58141G371739l85390l54682l23261k91947k70420k58165k45522k31494k22618
58132D788240k16514k04303j87571j75970j69470j59216j44609j33618j27254
58123C269715j18970j08712j02900j00959r5907q7902q3804q3609q0346p3224
58113B333382o8426o6899o3405n7590n4522n4196n1514m6588m4429m4734m2364
58102A738715l7574l5563l6340l5031l1736l1081l2546l1222k7729k7522l0548
58091A381823l1331k9162k8551k9631k7833k3325k1359k2559k2016j8718j7083
58080A110255j8254j8432j6799j6882j9003j9300j7245j6605j8033j8035j6001
58069I15666j5095j5556j4267j1452j0720j2021j1562r078q084q646p190l959
$$ plain form
58141 7371739 6986349 6631667 6308406 6016459 5746039 5487874 5242352 5010858 4788240
58132 4788240 4571726 4367423 4179852 4003882 3834412 3675196 3530587 3396969 3269715
58123 3269715 3150745 3042033 2939133 2838174 2742267 2654365 2570561 2486952 2406606 2333382
58113 2333382 2264956 2198057 2134652 2077062 2022540 1968344 1916830 1870242 1825813 1781079 1738715
58102 1738715 1701141 1665578 1629238 1594207 1562471 1531390 1498844 1467622 1439893 1412371 1381823
58091 1381823 1350492 1321330 1292779 1263148 1235315 1211990 1190631 1168072 1146056 1127338 1110255
58080 1110255 1092001 1073569 1056770 1039888 1020885 1001585 984340 967735 949702 931667 915666
58069 915666 900571 885015 870748 859296 848576 836555 824993 815915 807831 799185 791995 788036
58057G88036l278n726p254o853p828j0535j1155r018q067r569j0084q249o982
58044F83438p333o559m061l085m702n920n399n396o538o396m721m500o240o817
58030F05771n442n291p570r385r125q719r055q359o600o321p556p126m501l072
58016E07649m025m273k237n23q46j304p24q42k139k177k28R65P3n43N83J558J236
57999D92203J451K984L521J830J16J19N61L26M52J127N26j564k647j828j529l148
57983D94500m698m582m138m607n022m855n313o379o015l906k563l143l636k764
57969D32879k030k363k191p08M51M71R33K458L169K142J069R61N14o96r48R3J31
57952D36335j697l074k572j983k648l028k020j196j676j925q81rj44N40L081N443
$$ plain form
58057 788036 784758 779032 771778 764925 757097 746562 735407 726389 718322 708753 698669 690420 683438
58044 683438 676105 669546 665485 662400 657698 651778 646379 640983 634445 628049 623328 618828 612588 605771
58030 605771 600329 595038 587468 578083 568958 560239 551184 542825 536225 529904 522348 515222 510721 507649
58016 507649 503624 499351 497114 496591 495745 494441 493717 492875 490736 488559 488331 489296 489369 488826 489409 490967 492203
57999 492203 493654 496638 500159 501989 502105 502224 502785 503111 503563 504690 505216 503652 501005 499177 497648 494500
57983 494500 489802 485220 481082 476475 471453 466598 461285 454906 448891 444985 442422 439279 435643 432879
57969 432879 430849 428486 426295 425587 426038 426509 427442 429900 433069 435211 436280 437241 437755 437059 436111 436204 436335
57952 436335 434638 431564 428992 427009 424361 421333 419313 418117 416441 414516 413635 413626 413482 414022 417103 422546
57936D22546N907N884P035Q462Q989R451J0454J0492Q561O093M277K073j076l360
57922E05788l650l822n680q021q929q706q358p480n777m418l912k816m44J481
57908D35256J695J528K314L111K992L100M257M975L973K521K103J973J059J29
57894D70986m9n51k154l429l032k013j869k218k252k461l168l334k542k148k812
57879D36954l185k629k760m394n622n012m154m718n474m730l442l213l266k038
57865C82317j18R71J280J547J409O79P03K342M248N130N883P483Q805Q655Q009
57850D39343Q024P801O399N020M836M546K630J47j229k109l723n223n342n133
57836D55987o227p851q267p739p469o981n354l710l639m341l982k868k494k562
$$ plain form
57936 422546 428453 434337 441372 449834 458823 468274 478728 489220 497781 503874 508151 510224 509148 505788
57922 505788 502138 498316 492636 484615 475686 466980 458622 451142 445365 440947 437035 434219 433775 435256
57908 435256 436951 438479 440793 443904 446896 449996 454253 459228 463201 465722 467825 469798 470857 470986
57894 470986 470937 470386 468232 464803 461771 459758 457889 455671 453419 450958 447790 444456 441914 439766 436954
57879 436954 433769 431140 428380 423986 418364 413352 409198 404480 399006 394276 390834 387621 384355 382317
57865 382317 382199 383170 384450 385997 387406 388085 388788 391130 395378 400508 406391 413874 422679 431334 439343
57850 439343 447367 455168 461567 466587 471423 475969 478599 478746 477517 475408 471685 466462 461120 455987
57836 455987 449760 441909 433642 425903 418434 411453 406099 402389 398750 394409 390427 387559 385065 382503
57822C82503j725l94m2m10n7R46J301R87J066J479J203J36j103k594m498n870
57806C72928o011o029p061p979p095n146m170m205l543j851o44p91j499j781j340
57791C13783l35O25P50L37Q06K485L784L798L937N339O599O143N100N387O580
57776C65118P103P175P920Q745Q346P257O851O678N413L529K440J785J24k349
57762D36135m317n825p711r246r030p685p122p516p445o591n875n311m145k736
57748C45580k014j479k3J808K626K714L335M188M082L480L813M684M474L302K747
57733C83317K891K460J585J638K376K172J091R49K042K577J788R62R03Q63N09
57718D08123N45Q21J21j571k730k758k792l556m421n014n807o646o663o049o025
$$ plain form
57822 382503 380778 380384 380342 379932 379875 380821 382122 383109 384175 385654 386857 386993 385890 383296 378798 372928
57806 372928 366917 360888 353827 345848 338753 333607 329437 325232 321689 319838 319194 318403 316904 315123 313783
57791 313783 313448 314073 314823 315160 315966 318451 322235 326033 329970 335309 341908 348051 353151 358538 365118
57776 365118 372221 379396 387316 396061 404407 411664 418515 425193 430606 434135 436575 438360 438484 436135
57762 436135 431818 425993 418282 409036 400006 392321 385199 377683 370238 363647 357772 352461 348316 345580
57748 345580 343566 342087 342064 343872 346498 349212 352547 356735 360817 364297 368110 372794 377268 380570 383317
57733 383317 386208 388668 390253 391891 394267 396439 397530 398479 400521 403098 404886 405848 406751 407614 408123
57718 408123 408668 409489 409610 408039 405309 402551 399759 396203 391782 386768 380961 374315 367652 361603 355578
57703C55578o611o403m966l587l144l060k801k707k836k631k119j961k067j693
57689C08992r76p48r25p14k94m49p31K6J514K350K582L545N332O731P745R703
57673C43683J2714J5507J8160K2401K8743L5804M3127N1835O1454O8362O8585
57662G70375O0253M2880J7243j2467l8865n6119o3596o3995n9753n2553m4422
57651D98981l7114l1010k5711k1024j6767j2732r462p878p573o820m917l103k461
57638C12409k404k023j583j653j951j918j531r40j74M17M24K93P84J469J203J37
57622C02959l76j18l67j583k590k695k727l201l259k324j242p93n59m4M29O87
57606B82197J175J779J636P23J47K76J76m70o69q8Q4p96j631j495j104j323j778
$$ plain form
57703 355578 348967 342564 337598 334011 330867 327807 325006 322299 319463 316832 314713 312752 310685 308992
57689 308992 308016 307268 306343 305629 305335 304886 304155 304181 305695 308045 310627 314172 319504 326235 333980 343683
57673 343683 356397 371904 390064 412465 441208 477012 520139 571974 633428 701790 770375
57662 770375 830628 873508 890751 878284 839419 783300 719704 655709 595956 543403 498981
57651 498981 461867 430857 405146 384122 367355 354623 345161 337283 329710 322890 317973 314870 312409
57638 312409 310005 307982 306399 304746 302795 300877 299346 298406 298232 298649 299073 299366 300150 301619 302822 302959
57622 302959 302583 302465 302098 300515 297925 295230 292503 289302 286043 283719 282477 281684 281125 281081 281510 282197
57606 282197 283372 285151 286787 287510 287657 287933 288109 287639 286970 286882 286966 286170 284539 283044 281940 280617 278839
57589B78839k028k577l560l938l124k096j728j470q03n44j387k407k397j643j137
57574B48000j046j011j042j124q71m13n23j176j245m30m5r39k071k260j916j870
57558B30018j838j340q59p77l31R89K217K330J836J597J284L76l34J93J414J944
57542B38719J548J100J142J566K212K828K955K594K281J905N77j603k944k362
57528B52518j020n60q35o61J31P83Q71L74p84k095k279q92P53J303J106J152J294
57511B51159Q80K44J77N74Q64J119J483J315J24j280j776j461j141r92q43j060
57495B49386j863k530k317j598j041m58M00Q02R3r57j194q20q12j223j366j131
57479B33371q85n52M7M22P7n44p36n65l18J99Q71P53m66j464j057l4K44J17P65
$$ plain form
57589 278839 276811 274234 270674 266736 263612 261516 259788 258318 257515 256971 255584 253177 250780 249137 248000
57574 248000 246954 245943 244901 243777 242906 242493 241970 240794 239549 239119 239074 238135 236064 233804 231888 230018
57558 230018 228180 226840 225981 225204 224873 225862 228079 230409 232245 233842 235126 235502 235168 235361 236775 238719
57542 238719 240267 241367 242509 244075 246287 249115 252070 254664 256945 258850 259427 257824 254880 252518
57528 252518 251498 250938 250103 249442 249573 250356 251227 251601 250817 248722 246443 245551 246304 247607 248713 249865 251159
57511 251159 252039 252283 252460 253034 253898 255017 256500 257815 257939 256659 254883 253422 252281 251289 250446 249386
57495 249386 247523 244993 242676 241078 240037 239579 239979 240781 240874 239917 238723 237903 237091 235868 234502 233371
57479 233371 232486 231934 231981 232403 232480 231936 231200 230635 230317 230516 231387 232140 231674 230210 229153 229119 229363 229480 230245
57460B30245J859J937P88l11n04l0Q19J872K384J613Q0r11r39o40m03n0M72J035
57442B39316J723K356K117O78q53j187n16J41N55J007J124N15MO86K033K461J570
57425B53730M03k77n23k63P38J958K405J858R05j3o05m04N14J003L44l78J78J413
57407B62986J752J233J228J928K124J389N56n7r30j758j440p5Q21N95K42M51N60
57390B71605J21q1N16J179J170R12J002J142R31Q48J478K453K949K743K142J437
57374B92547Q95Q35J155J233P28N1k59j95m2J17L30N25O44P45R28J278J794K196
57356C05505K026J272N63L50L41J91L24J251K513L046K473J288P3p62p63J77J357
57339C21225J900J758J479J331J210J077Q57L29k31Q2J516K863K857J847J047
$$ plain form
57460 230245 232104 234041 234829 234518 234014 233984 234803 236675 239059 240672 240752 239841 238902 238262 237859 237809 238281 239316
57442 239316 241039 243395 245512 246190 245337 244150 243634 243775 244330 245337 246461 246976 246980 247666 249699 252160 253730
57425 253730 254133 253856 253333 253070 253808 255766 258171 260029 260934 260921 260316 259912 260426 261429 261773 261395 261573 262986
57407 262986 264738 265971 267199 269127 271251 272640 273196 273139 272209 270451 269011 268936 269757 270352 270594 271045 271605
57390 271605 271726 271645 272161 273340 274510 275422 276424 277566 278497 279345 280823 283276 286225 288968 291110 292547
57374 292547 293442 294277 295432 296665 297393 297444 297185 296990 296948 297065 297395 297920 298564 299309 300237 301515 303309 305505
57356 305505 307531 308803 309366 309716 310057 310248 310572 311823 314336 317382 319855 321143 321216 320454 319691 319868 321225
57339 321225 323125 324883 326362 327693 328903 329980 330837 331166 330935 331017 332533 335396 338253 340100 341147
57324C41147P55M74K01L24N55K80k04r7N30R16R80J289J760J698J099P42R41J212
57306C54602J195R56N04n0p2Q25J824J811R98N59R31J606K283K942L050K095Q08
57289C76867M57R80J131M63k01l01k31l18l45k81l58l72P8O63O91K92J63L59M79
57270C80216P69J718K809L091K801K971L678M162M460N241O157O161N476N383
57256D35093N960N894M864M095M103L869K880K196K640L512L974M212M383L879
57242D91554K600J660J917K786L385L746M161M420M416M627N216N556N260M903
57228E46207N116N733O274O595O651O381O045N987N955N515N028N245O008O476
57214F29216O570O915P498P678P537P736Q142Q110Q027Q834J0073J0329R767J0084
$$ plain form
57324 341147 341902 342376 342577 342901 343456 343736 343532 343435 343965 344881 345861 347150 348910 350608 351707 352449 353390 354602
57306 354602 355797 356753 357257 357207 357135 357960 359784 361595 362593 363152 364083 365689 367972 370914 373964 376059 376867
57289 376867 377324 378304 379435 379898 379697 379396 379165 378847 378502 378221 377863 377491 377569 378232 378923 379215 379378 379737 380216
57270 380216 380985 382703 385512 388603 391404 394375 398053 402215 406675 411916 418073 424234 429710 435093
57256 435093 441053 446947 451811 455906 460009 463878 466758 468954 471594 475106 479080 483292 487675 491554
57242 491554 494154 495814 497731 500517 503902 507648 511809 516229 520645 525272 530488 536044 541304 546207
57228 546207 551323 557056 563330 569925 576576 582957 589002 594989 600944 606459 611487 616732 622740 629216
57214 629216 635786 642701 650199 657877 665414 673150 681292 689402 697429 706263 716336 726665 736432 746516
57200G46516J1579J2397J1445R985R446R583R804J0542J2066J3390J3594J3037
57188H83384J2360J1536J0636J0292J0655J1071J1314J1754J1989J0993R172Q363
57176A013519R147J0016J0076J0506J2259J4282J5407J6212J7522J8754J9262
57165A166962J9892K1656K4069K6220K8259L0496L2200L2752L2882L3523L4406
57154A483317L4912L5218L5485L5124L4012L3203L3357L3595L3035L2229L1971
57143A855458L1861L1308L0839L1245L2417L3953L5865L7889L9296M0220M1892
57132B242243M4804M7951N0592N3225N6145N8772O1198O4570O9083P3440P7186
57121B899209Q1582Q7292R3357R9476J07014J16593J26999J37703J50002J64417
$$ plain form
57200 746516 758095 770492 781937 791922 801368 810951 820755 831297 843363 856753 870347 883384
57188 883384 895744 907280 917916 928208 938863 949934 961248 973002 984991 995984 1005156 1013519
57176 1013519 1022666 1032682 1042758 1053264 1065523 1079805 1095212 1111424 1128946 1147700 1166962
57165 1166962 1186854 1208510 1232579 1258799 1287058 1317554 1349754 1382506 1415388 1448911 1483317
57154 1483317 1518229 1553447 1588932 1624056 1658068 1691271 1724628 1758223 1791258 1823487 1855458
57143 1855458 1887319 1918627 1949466 1980711 2013128 2047081 2082946 2120835 2160131 2200351 2242243
57132 2242243 2287047 2334998 2385590 2438815 2494960 2553732 2614930 2679500 2748583 2822023 2899209
57121 2899209 2980791 3068083 3161440 3260916 3367930 3484523 3611522 3749225 3899227 4063644
57111D063644J79715J95968K15910K41536K72132L07404L49829M02086M65158
57102F693382N40894O33378P45675Q78335J033112J214616J426161J667797J940494
57093A6773844K247437K588066K955057L339307L731424M114921M465246M759899
57085D4975201M981148N105911N110733N001970M822618M594675M250464L652740
57077H2495460K708517J461038O5988j308548k552711l615662m477678n133392
57069F9643012n584981n836165n892979n772346n505553n130934m685633m203623
57061B7030798l714853l241918k799069k395431k037101j725876j459239j233272
57053H424039j044168q87015p55798o45813n54478m79358m17068l64586l20060
$$ plain form
57111 4063644 4243359 4439327 4655237 4896773 5168905 5476309 5826138 6228224 6693382
57102 6693382 7234276 7867654 8613329 9491664 10524776 11739392 13165553 14833350 16773844
57093 16773844 19021281 21609347 24564404 27903711 31635135 35750056 40215302 44975201
57085 44975201 49956349 55062260 60172993 65174963 69997581 74592256 78842720 82495460
57077 82495460 85203977 86665015 86731003 85422455 82869744 79254082 74776404 69643012
57069 69643012 64058031 58221866 52328887 46556541 41050988 35920054 31234421 27030798
57061 27030798 23315945 20074027 17274958 14879527 12842426 11116550 9657311 8424039
57053 8424039 7379871 6492856 5737058 5091245 4536767 4057409 3640341 3275755 2955695
57044B955695k81930k48567k19212j93983j72556j53709j36333j20095j05201
57035A324109r2081q0970p1232o1556n1366m1066l0412j7911k863J3390K9139
57024I17181M3053N1413M6978K4678j1439m9588p9075r6138j02079r9217r0078
57013E55689p7979o5947n5367m6431l9249l3862k9882k6836k4492k2560k0567
57002A12517j8325j6123j4302j2955j2012j1194j0037q341B723b202l400j511
56990g113O04K571F29P093J0132J3216J6135J8877K0877K0824J7474J0542J103
56977A36902q616j6218k0476k1669k0675j8222j5098C673f379p966n430k593K33
56964b2135L104N992d474F532J4274J8753K3388K6832K8741K8931K6082J8675
$$ plain form
57044 2955695 2673765 2425198 2205986 2012003 1839447 1685738 1549405 1429310 1324109
57035 1324109 1232028 1151058 1079826 1018270 966904 925838 895426 877515 874652 888042 917181
57024 917181 960234 1011647 1058625 1083303 1071864 1022276 943201 847063 744984 645767 555689
57013 555689 477710 411763 356396 309965 270716 236854 206972 180136 155644 133084 112517
57002 112517 94192 78069 63767 50812 38800 27606 17569 9228 2723 -2202 -5602 -7113
56990 -7113 -6509 -3938 629 7722 17854 31070 47205 66082 86959 107783 125257 135799 136902
56977 136902 128286 112068 91592 69923 49248 31026 15928 3673 -6379 -14345 -19775 -22368 -22135
56964 -22135 -19031 -13039 -4474 6532 20806 39559 62947 89779 118520 147451 173533 192208
56952A92208P173n765j7125k5002k8723k8735k6448k3298j9803H643b990p758
56940a0748m352j113K193N737A646J4990K0400K5572L0760L6499M1886M4223M0696
56927B56672L0367J4753k890j8963l0937l7981m0495l9320l5523l0483k5466A8667
56914A447a2213j0301p346n313m578m733m773m062k855j680p21P2P11J324K110
56899e4358K930L408L662M354N778P438Q789h138B754J1991J3457J5858J9288
56886F3348K3034K6106K7492K5882K0203J1008N87q756j5892k0268k1391j9607
56874A11746j6407j3044r559n711j928J424M896R112J3858J8842K4574L1552L9274
56861B08629M7016N4798O2229O6900O5177N4765L6097J2023j2805l3095m5310
$$ plain form
56952 192208 199381 193616 176491 151489 122766 94031 67583 44285 24482 8643 -2990 -10748
56940 -10748 -15100 -16213 -14020 -8283 1646 16636 37036 62608 93368 129867 171753 215976 256672
56927 256672 287039 301792 298902 279939 249002 211021 170526 131206 95683 65200 39734 18667
56914 1447 -12213 -22514 -29860 -35173 -39751 -44484 -49257 -53319 -56174 -57854 -58575 -58503 -57792 -56468 -54358
56899 -54358 -51428 -48020 -44358 -40004 -34226 -26788 -17999 -8138 2754 14745 28202 44060 63348
56886 63348 86382 112488 139980 165862 186065 197073 197660 188904 173012 152744 131353 111746
56874 111746 95339 82295 72736 67025 65097 66521 71417 80529 94387 113229 137803 169355 208629
56861 208629 255645 310443 372672 439572 504749 559514 595611 607634 594829 561734 516424
56850E16424m9524m8373m4302l8356l1017k3000j4993p336l3P278J5203K3985
56838C05956L3413M3727N5946P0565Q6201J00014J08613J07948R3729O4291K3648
56827A094051j9401n5899q0722r3131r5134q9769p9960o7973n5437m3468l2530
56816C80627k2486j3137m422M035J2947K2647L2884M3650N5294O7036P5913P7877
56804G32865O9761N0411K1525j1686m1850o3256p4563p7575p4457o7092n7788
56793D06295m8694m0474l2643k5015j7862j1143m676J240O466J1899J8618K6293
56781B90304L3428L8648M0722L7777K8246J2929m768k0943l3090m0430m3492m3464
56769B95867m1254l7211l2007k7018k3079j9567j5788j2470j0715j0035q970p208
$$ plain form
56850 516424 466900 418527 374225 335869 304852 281852 266859 259523 259490 266768 281971 305956
56838 305956 339369 383096 439042 509607 595808 695822 804435 912383 1006112 1070403 1094051
56827 1094051 1074650 1018751 938029 844898 749764 659995 580035 512062 456625 413157 380627
56816 380627 358141 345004 340582 344617 357564 380211 413095 456745 512039 579075 654988 732865
56804 732865 802626 853037 874562 862876 821026 757770 683207 605632 531175 464083 406295
56793 406295 357601 317127 284484 259469 241607 230464 225788 227028 233494 245393 264011 290304
56781 290304 323732 362380 403102 440879 469125 482054 477286 456343 423253 382823 339331 295867
56769 295867 254613 217402 185395 158377 135298 115731 99943 87473 76758 66723 57753 50545
56757E0545n675m740l831k794k153k005j843j605j709k085k227k200k436k628
56743A2614k045q99j51J1J89L50j85j136j182N4J246J213L61k56l57k68j68j17
56725I274k00k76LO23J184J507J717J784J658J687K150K490J937Q15K43N63J017
56708B8176J034Q74R08J171J725K526K915K171P16k23j73K15L93M07J89n89j675
56691D0760k228j910j201n18J34O17O52M16L47L80K03M3K47L37k35p43L6J735
56673C9072K678K277J616J476J395J117J247J909K157J561J035J274J632J305
56659F1751N30j94j031k076k628k126j084k92K05O99R85O94m4q08j331j451j138
56642E0661q25j072j687j883j337m58M98J600K524K638K042J518J347J151R45
$$ plain form
56757 50545 44870 40130 36299 33505 31352 29347 27504 25899 24190 22105 19878 17678 15242 12614
56743 12614 10569 9670 9519 9530 9719 10069 9884 8748 7566 7620 8866 10079 10440 10184 9827 9559 9391 9274
56725 9274 9074 8798 8801 9424 10608 12115 13832 15616 17274 18961 21111 23601 25538 26353 26596 27159 28176
56708 28176 29210 30084 30992 32163 33888 36414 39329 41500 42216 41993 41820 42035 42428 42835 43024 42435 40760
56691 40760 38532 36622 35421 34903 35037 35654 36306 36722 37069 37449 37652 37695 37942 38279 38044 37301 37337 39072
56673 39072 41750 44027 45643 47119 48514 49631 50878 52787 54944 56505 57540 58814 60446 61751
56659 61751 62281 62087 61056 58980 56352 54226 53142 52850 53055 53754 54739 55433 55389 54581 53250 51799 50661
56642 50661 49836 48764 47077 45194 43857 43399 43897 45497 48021 50659 52701 54219 55566 56717 57662
56627E7662J122J334P44l79q48n70q18j947k586j856q02o02p94n16r6j18p0P01
56609D9561J556J484P53L57M19L35O7R2L73M16J56l1OJ29L45O53Q73J001J384
56590E9929K014K231J616O95K34L11M76M45K28O8M46J518K436K110Q36J55P68
56573G6516J734K137K309K698K799K200J605J728K019J628J001J299K707M304
56559A06684N334N764N819N667N423M986M139L044K158J555R43N02P52J367J281
56544A55418L63j86K35N62k77j725k592k665k391j855j201j143j972k737k526
56529A35308j833j583j577j066l08j27l40J23J556K950L203K169N90n74q67p71
56513A36853j086j718j755r94m23o39q17p1J000J176L33o33j086j009n15J12L17
$$ plain form
56627 57662 58784 60118 60862 60483 59635 59065 58247 56300 53714 51858 51056 50454 49660 49144 49048 48930 48860 49561
56609 49561 51117 52601 53354 53711 54130 54465 54532 54624 54997 55413 55569 55538 55544 55673 56018 56671 57544 58545 59929
56590 59929 61943 64174 65790 66485 66719 67030 67506 67951 68179 68247 68693 70211 72647 74757 75593 75748 76516
56573 76516 78250 80387 82696 85394 88193 90393 91998 93726 95745 97373 98374 99673 102380 106684
56559 106684 112018 117782 123601 129268 134691 139677 143816 146860 149018 150573 151516 152018 152770 154137 155418
56544 155418 155781 155595 155830 156392 156115 154390 151798 149133 146742 144887 143686 142543 140571 137834 135308
56529 135308 133475 131892 130315 129249 128941 128814 128474 128597 130153 133103 136306 138475 139065 138491 137624 136853
56513 136853 135767 134049 132294 131300 130877 130238 129421 129350 130350 131526 131859 131226 130140 129131 128616 128728 129045
56496A29045j39p88j146j212j035m79J31J36k45R8J321J980J160k1j52L74L76
56479A29404M0M00J287J411L51r00j336r09j00O19R58J016J143J278R23J01l82
56462A35304j44J39j03m11j91L47Q34J386J873J567M20m17k53R1j62l30L16R77
56444A41243O21j32l1P31J045P50M74J73n19j013l98Q98J579J349J016R80Q52
56427A49618M38J7j96l5P08J654J735O79k38N6Q02P48J56K9K78J85PM00Q61M79
56407A58381k81k52L71M19j10l4Q61J465J157N29N0n51j316j696j376o53J52Q52
56389A57968J115Q62O52R67J481J778K169K929L510L466L401L841M066L325K298
56374A93828J907J611M85p81p91K29Q47P15O34P29L48l39l89L16R84J313J617
$$ plain form
56496 129045 128906 128118 126972 125760 124725 124246 124377 124513 124268 124366 125687 127667 128827 128806 128654 129028 129404
56479 129404 129444 129844 131131 132542 132893 131993 130657 129748 129648 130267 131225 132241 133384 134662 135585 135686 135304
56462 135304 135160 135299 135196 134785 134594 134941 135775 137161 139034 140601 141021 140604 140351 140442 140280 139950 140266 141243
56444 141243 141864 141732 141701 142432 143477 144227 144701 144874 144355 143342 142944 143842 145421 146770 147786 148766 149618
56427 149618 150056 150073 149877 149842 150550 152204 153939 154618 154380 154436 155238 155986 156142 156171 156449 156634 156641 157041 157902 158381
56407 158381 158100 157848 158219 158638 158528 158494 159355 160820 161977 162506 162556 162005 160689 158993 157617 156964 157116 157968
56389 157968 159083 159945 160597 161564 163045 164823 166992 169921 173431 176897 180298 184139 188205 191530 193828
56374 193828 195735 197346 197831 197050 196259 196488 197335 198050 198684 199413 199761 199422 199033 199349 200333 201646 203263
56357B03263J812J587J283J376J477J145J040J861K772K492J297L98l2m79n30
56342B20762L43J157N74p65j124m14J15L58J235K370K378J402J117K016K865K945
56326B37334K777K509J678P99J100K482L577L930M181M140K888R59K05J065K011
56311B71635K013J652J481J272J171J776K752L155L189L744M354L770K562K645
56297C07171M057M742L940L223L556L899L587L732N058O474O918O819O852O920
56283C76948P157Q131R386R556Q591Q036Q534R030R078R818J1767J3673J4577
56270E04282J5209J6291J7214J7440J7647J8526J9852K1519K4061K7495L0992
56259G30528L4242L7760M1574M5310M9692N6115O4435P3143Q1934R1969J03349
$$ plain form
56357 203263 205075 206662 207945 209321 210798 211943 212983 214844 217616 220108 221405 221803 221771 221292 220762
56342 220762 221105 222262 222836 222071 220947 220533 220648 221006 222241 224611 226989 228391 229508 231524 234389 237334
56326 237334 240111 242620 244298 245097 246197 248679 252256 256186 260367 264507 267395 268354 268559 269624 271635
56311 271635 273648 275300 276781 278053 279224 281000 283752 286907 290096 293840 298194 301964 304526 307171
56297 307171 311228 315970 319910 323133 326689 330588 334175 337907 342965 349439 356357 363176 370028 376948
56283 376948 384105 392236 401622 411178 419769 427805 436339 445369 454447 464265 476032 489705 504282
56270 504282 519491 535782 552996 570436 588083 606609 626461 647980 672041 699536 730528
56259 730528 764770 802530 844104 889414 939106 995221 1059656 1132799 1214733 1306702 1410051
56248A410051J14735J25946J38332J51825J64165J74018J82368J89662J94016
56239B845118J93686J89120J81088J68648J50466J26632R8024O5514L0825l523
56229D045598l6141o7095r5707j19942j38822j53409j64513j71482j74254j74380
56219B749853j72738j68304j60510j50969j41449j31885j21664j11316j01697
56210A489321r2875q4818p7826p1535o5011n8377n2723m8031m3149l8167l4500
56199H22309l2172k9380k5506k2061j9884j7943j5748j4360j3940j2930j0814
56188F07571r146q689q120o735n769n749n223l597k498k867l241k504j728j748
56174E39957j469k94L44l64r71m59j01q60j373l66J284K508L779N301N918N429
$$ plain form
56248 1410051 1524786 1650732 1789064 1940889 2105054 2279072 2461440 2651102 2845118
56239 2845118 3038804 3227924 3409012 3577660 3728126 3854758 3952782 4018296 4049121 4045598
56229 4045598 4009457 3942362 3846655 3726713 3587891 3434482 3269969 3098487 2924233 2749853
56219 2749853 2577115 2408811 2248301 2097332 1955883 1823998 1702334 1591018 1489321
56210 1489321 1396446 1311628 1233802 1162267 1097256 1038879 986156 938125 894976 856809 822309
56199 822309 790137 760757 735251 713190 693306 675363 659615 645255 631315 618385 607571
56188 607571 598425 589736 581616 574881 569112 563363 558140 554543 552045 549178 545937 543433 541705 539957
56174 539957 538488 538194 538538 538174 537203 536744 536643 535783 534410 534044 535328 537836 541615 546916 552834 558263
56158E58263N520O838P684P159O842P852R041R714J1183J3821J5675J5978J6931
56145F92501J9983K3418K5813K8739L3775L9953M6473N4804O5469P5913Q4023
56134A190864R0654R6083R7364R2239Q2739P1970O0416M8460L9321L5691L5692
56123A941493L5202L2043K5475J4762J373j0152j6804k0242k3085k5441k7869
56112A926755l3922m5794o0382p3145q2955q9953r2172q8442q1489p4163o5417
56101A138921n3882m2248l3785k7490k0959j5161j1943r660n984k471j660k076
56089I11602o95J853L134L691N391P185P069O285P140Q680Q755Q221Q952R883
56075I97146R248Q391R223J0342R866R385J0890J2708J2800J2943J5040J6664
$$ plain form
56158 558263 563783 570621 578305 585464 592306 600158 609199 618913 630096 643917 659592 675570 692501
56145 692501 712484 735902 761715 790454 824229 864182 910655 965459 1030928 1106841 1190864
56134 1190864 1281518 1377601 1474965 1567204 1649943 1721913 1782329 1830789 1870110 1905801 1941493
56123 1941493 1976695 2008738 2034213 2048975 2050348 2040196 2023392 2003150 1980065 1954624 1926755
56112 1926755 1892833 1847039 1786657 1713512 1630557 1540604 1448432 1359990 1278501 1204338 1138921
56101 1138921 1085039 1042791 1009006 981516 960557 945396 933453 923793 917809 915338 913678 911602
56089 911602 910907 912760 915894 919585 924976 932161 939230 945515 952655 961335 970090 978311 987263 997146
56075 997146 1006394 1014785 1024008 1034350 1044216 1053601 1064491 1077199 1089999 1102942 1117982 1134646
56063A134646J5268J3421J4549J6768J6559J5279J6121J7734J6939J5025J5153
56052A307462J6239J5498J4381J5737J7775J7160J5527J6512J8940J9386J8800
56041A493417K0092K1826K1008J9414K0403K2281K1729K0881K3746K8512L0902
56030A744211L2227L6408M1820M4072M4298M6669N0223N1215N0882N2738N4957
56019B249720N3788N1585N2970N6064N6331N5796N9210O4380O5934O5562O8671
56008B900011P4132P7395Q0301Q7308R5515R9342J01412J07607J15410J19028
55998C857461J21818J30705J42544J49532J54140J64301J77875J86956J93848
55989E279180K06867K23849K36450K47436K66396K91430L12992L32914L60812
$$ plain form
56063 1134646 1149914 1163335 1177884 1194652 1211211 1226490 1242611 1260345 1277284 1292309 1307462
56052 1307462 1323701 1339199 1353580 1369317 1387092 1404252 1419779 1436291 1455231 1474617 1493417
56041 1493417 1513509 1535335 1556343 1575757 1596160 1618441 1640170 1661051 1684797 1713309 1744211
56030 1744211 1776438 1812846 1854666 1898738 1943036 1989705 2039928 2091143 2142025 2194763 2249720
56019 2249720 2303508 2355093 2408063 2464127 2520458 2576254 2635464 2699844 2765778 2831340 2900011
56008 2900011 2974143 3051538 3131839 3219147 3314662 3414004 3515416 3623023 3738433 3857461
55998 3857461 3979279 4109984 4252528 4402060 4556200 4720501 4898376 5085332 5279180
55989 5279180 5486047 5709896 5946346 6193782 6460178 6751608 7064600 7397514 7758326
55980G758326L94760M25136M54768M94545N42178N87309O34610O98445P77431
55971A2767508Q59311R48454J062050J201657J357033J536119J761214K038004
55963B3531350K361043K747012L226384L805012M474071N256291O200720P339050
55955E8940933Q700838J0368935J2462328J5075228J8312617K2371973K7448138
55948A73680990L3454722L9817148M5413697M8501954M6800855L8303500K2797531
55941D48770397K851073j7023127l2644235m2021236m5485288m4573214m0958098
55934B28916272l6013209l0734584k5724919k1259154j7436462j4276945j1723795
55927G1747204r663865p997848o665279n605161m743413m029744l446876k974292
$$ plain form
55980 7758326 8153086 8578222 9032990 9527535 10069713 10657022 11291632 11990077 12767508
55971 12767508 13626819 14575273 15637323 16838980 18196013 19732132 21493346 23531350
55963 23531350 25892393 28639405 31865789 35670801 40144872 45401163 51601883 58940933
55955 58940933 67641771 78010706 90473034 105548262 123860879 146232852 173680990
55948 173680990 207135712 246952860 292366557 340868511 387669366 425972866 448770397
55941 448770397 451621470 434598343 401954108 359932872 314447584 269874370 228916272
55934 228916272 192903063 162168479 136443560 115184406 97747944 83470999 71747204
55927 71747204 62083339 54085491 47420212 41815051 37071638 33041894 29595018 26620726
55919B6620726k576935k234821j950057j717105j515030j334151j182364j059357
55911A3050906r49919q47764p61852o93959o32186n71560n20106m79729m40800
55902G153031m00255l66547l42093l18211k91549k69011k52552k34980k14635
55893D463198j98874j89303j78177j63057j50843j43736j34942j21993j11148
55884C071125j04851r7414q6862p9177p7114p6183p4823p7318q3386q5893q2334
55873B145770p8268p6537p3358o7820o4655o4466o1382n3760m7465m5318m2826
55862A469915l7599l3563l2410l0155k5640k3644k5889k7538k6106k5476k7534
55851A154361k8232k5720k4389k6807k9189k8760k8367k9886l0074k6978k3900
$$ plain form
55919 26620726 24043791 21808970 19858913 18141808 16626778 15292627 14110263 13050906
55911 13050906 12100987 11253223 10491371 9797412 9165226 8593666 8073560 7593831 7153031
55902 7153031 6752776 6386229 6044136 5725925 5434376 5165365 4912813 4677833 4463198
55893 4463198 4264324 4075021 3896844 3733787 3582944 3439208 3304266 3182273 3071125
55884 3071125 2966274 2868860 2781998 2702821 2625707 2549524 2474701 2397383 2313997 2228104 2145770
55873 2145770 2067502 1990965 1917607 1849787 1785132 1720666 1659284 1605524 1558059 1512741 1469915
55862 1469915 1432316 1398753 1366343 1336188 1310548 1286904 1261015 1233477 1207371 1181895 1154361
55851 1154361 1126129 1100409 1076020 1049213 1020024 991264 962897 933011 902937 875959 852059
55840H52059k3170k2207j9334j7256j7384j6673j3587j1291j1685j1990j0455
55829F77027r645j0905j1221q938p027p473p796o321n590p279q881q577q471r884
55815E59019j0422q776p537q210q238o067m329m862n170l126p48j02L35K212M240
55800D98219N422P253J0048J1099R172O734N221K463k523o710p981q612j0720
55787E19085j2413j1616r769q491o492l167j485l794p961j0863j2546j3914j3708
55774D02866j0991p660n330k539K067O672R088R677Q957N488q81o760r295r825
55760C91534j0667j1150r802p759o808o364n286m544n305o370o190n439n370n644
55746B94836n847o839q520q719o495m123l627l760k684j131n90o98p22j386k933
$$ plain form
55840 852059 828889 806682 787348 770092 752708 736035 722448 711157 699472 687482 677027
55829 677027 667382 656477 645256 636318 629291 621818 614022 607701 602111 594832 585951 577374 568903 559019
55815 559019 548597 539821 532284 524074 515836 509769 505440 500578 495408 492282 491534 491432 491767 493979 498219
55800 498219 503641 510894 520942 532041 541213 547947 553168 555631 553108 546398 538417 529805 519085
55787 519085 506672 495056 485287 476796 470304 467137 465652 461858 453897 443034 430488 416574 402866
55774 402866 391875 384215 378885 376346 378413 385085 394173 403850 412807 418295 417414 410654 401359 391534
55760 391534 380867 369717 359915 352156 345348 338984 333698 329154 323849 317479 311289 305850 300480 294836
55746 294836 288989 282150 273630 264911 258416 254293 250666 246906 244222 243091 242501 241803 241081 239695 236762
55731B36762l684k700j662k021k633k300k158l280m350m040l417l715l930k895
55717A93977j546r72l67R63J865J593J489K436L102K680K722M103M902L674K067
55702B22688J635Q75j806m821n977o004o476o676n529m424m895n517m298k298
55688A66477j683j951j269k4K66J74J309L141L932L804M139M820M719M018L578
55673A95450K950J443N0m2K11p79k418k990k525k289k384j997j206m93N58K162
55657A85701L125K596J788K088K812K720K293K485K674J950R25K69r21l130m633
55642B02742m068l130m018n847o291n415n018n376n430n225n395n189l624j776
55628A36940j422k178k402j976j857j800j018j77l41q23m48L9o72j797j704r13
$$ plain form
55731 236762 233078 230378 228716 226695 224062 221762 219604 216324 211974 207934 204517 200802 196872 193977
55717 193977 192431 191459 191092 192055 193920 195513 197002 199438 202540 205220 207942 212045 216947 220621 222688
55702 222688 224323 225198 223392 218571 212594 206590 200114 193438 187909 183485 178590 173073 168775 166477
55688 166477 164794 162843 161574 161550 161816 161990 163299 166440 170372 174176 178315 183135 187854 191872 195450
55673 195450 198400 199843 199893 199851 200062 199283 196865 193875 191350 189061 186677 184680 183474 182981 183539 185701
55657 185701 188826 191422 193210 195298 198110 200830 203123 205608 208282 210232 211157 211426 210505 207375 202742
55642 202742 198674 195544 191526 185679 179388 173973 168955 163579 158149 152924 147529 142340 138716 136940
55628 136940 135518 133340 130938 128962 127105 125305 124287 124110 123769 122946 122498 122537 121865 120068 118364 117451
55612A17451j168k325k807k433k216k077j277m69p47j277n18Q79J002p5o47m63
55596A00833p66j621j837j369j297j559j168m08m76j028n36J018K003J663P58
55581I4210j70j157j704j263n21l84j50J289L139L713L094K653K544J974J356
55566A08623J745K628K662K066J950J897Q02n44m44N64M67p66j385j274k011l498
55550A13482l750k414j487j878k122j271l90k94j82N48J191J224J016N79m63j403
55534A02386r59M21R49M07L60J174J347L57l68j43k68j601l018l447l419l520
55518I0658l192k151j363j520j937j929j811j838j550q68m43l34K51J408K175
55503G5556K236K416K981K988J977Q25K76K9j84J8O29Q93M99q1o60j459k066j747
$$ plain form
55612 117451 116283 113958 111151 108718 106502 104425 103148 102679 101932 100655 100137 101016 102018 101943 101296 100833
55596 100833 100067 98446 96609 95240 93943 92384 91216 90808 90332 89304 88768 89786 91789 93452 94210
55581 94210 94040 92883 91179 89916 89395 89011 88861 90150 93289 97002 100096 102749 105293 107267 108623
55566 108623 110368 112996 115658 117724 119674 121571 122373 121829 121385 121949 122416 121650 120265 118991 116980 113482
55550 113482 109732 107318 105831 103953 101831 100560 100170 99876 99694 100242 101433 102657 103673 104252 103789 102386
55534 102386 101427 101848 102797 103204 103564 104738 106085 106442 106074 105931 105663 104062 101044 97597 94178 90658
55518 90658 87466 85315 83952 82432 80495 78566 76755 74917 73367 72499 72056 71722 71973 73381 75556
55503 75556 77792 80208 83189 86177 88154 88979 89255 89284 89100 89118 89747 90640 91139 91058 90398 88939 86873 85126
55485H5126r38q41j377j265l17K11j59m22p1J03k39k70L32P19M93L18L91L5o79
55466H1150p34j75l23j336j589l86P28N35K3L91R86P29O9m3R2k61p57o70k69k44
55446G7916m38l01Q3L21M78P31Q45O32K85j04o43j009o75j8n2p55r43k44K11l14
55426G6006r39p01KL67M96Q21J156J199J192J333J263P41J92P2L20P28J143J151
55408H6542M54l68m31M7P2m47o29k53m4k04j43R7k19r15r56l40k20o91m05R31
55388H1878J699Q58m64q99o46l55J29P45N20p99j820j486o66n73q74o91k77k90
55370G5989l85J73J237K209K870K934J743n35k359k515j537o54k49k03o13j223
55354G6882j172l06K54k62j074j151o78k36K81R44J042K22o20n79n8J93K99N65
$$ plain form
55485 85126 84188 83347 81970 80705 80388 80599 80440 80018 79947 80050 79811 79541 79873 80592 81085 81403 81794 81829 81150
55466 81150 80416 80241 79918 78582 76993 76607 77335 77870 77893 78284 79270 79999 80068 80025 80117 79856 79099 78429 78160 77916
55446 77916 77478 77177 77260 77581 78059 78790 79635 80267 80552 80448 79805 78796 78121 78103 78051 77296 76353 76109 76320 76006
55426 76006 75067 74366 74368 74735 75231 76052 77208 78407 79599 80932 82195 82936 83128 83200 83520 84248 85391 86542
55408 86542 86996 86628 86197 86244 86316 85869 85240 84987 84943 84739 84596 84693 84474 83559 82603 82263 82043 81352 80947 81878
55388 81878 83577 84435 83971 83072 82426 82071 82200 82945 83465 82666 80846 79360 78694 78121 77247 76556 76279 75989
55370 75989 75604 75777 77014 79223 82093 85027 86770 86235 83876 81361 79824 79170 78921 78718 78105 76882
55354 76882 75710 75404 75658 75396 74322 73171 72493 72257 72538 73482 74524 74746 74126 73547 73489 73682 73981 74546
55336G4546O07K07QL52M82nj47P26J488P83q65j919j956j552q64J48P90M20k63
55317G2986j09P22J094O34M1r0K32P21R26M31l63l98M87J017L36o37p08j97m4
55298G7081o6M52J189J253P28M02L63O7n21r36j066j022o58k8K03k49n05K87J538
55279G8512K018J461M35o59j501j416k33J006J214O54J65k18p48r28k43N96N41
55262H0656j97o17o06p62j002o83J17O40O13L47j2m24m68M5M63K54L2N56J239
55243H0191R83l2o51n85n57q83j105r82o69j16P22J230Q22Lk08K56O43O60N83
55224H0305L81r9l93k3M10n3j081j302k31J181J871J589O07n33j017m75L32L97
55206H1866j51l95j09J53J86L21N56N09K22R4J35P9R0M49P70M72j51k89Q6K59
$$ plain form
55336 74546 75153 75360 75368 75720 76202 76197 76050 76776 78264 79047 78182 76263 74307 72755 71891 72039 72829 73249 72986
55317 72986 72877 73599 74693 75327 75368 75278 75510 76231 77157 77588 77225 76827 77314 78331 78667 78030 77322 77125 77081
55298 77081 77015 77467 78656 79909 80637 81039 81402 81469 80948 80012 78946 77924 77266 77238 77441 77192 76687 76974 78512
55279 78512 80530 81991 82426 81767 80266 78850 78617 79623 80837 81491 81656 81438 80690 79762 79519 80115 80656
55262 80656 80459 79842 79236 78474 77472 76789 76906 77546 78159 78506 78494 78070 77602 77647 78110 78364 78396 78952 80191
55243 80191 81174 81142 80491 79906 79349 78466 77361 76379 75710 75594 76316 77546 78368 78371 78163 78419 79062 79722 80305
55224 80305 80686 80587 80194 80171 80581 80528 79447 78145 77914 79095 80966 82555 83162 82629 81612 81137 81469 81866
55206 81866 81715 81320 81211 81364 81550 81871 82427 82936 83158 83252 83387 83466 83556 84005 84775 85247 85096 84807 84893 85152
55186H5152Jj40K09P94J146Q49k24j364j273K80J671J378O6m92k0K70j25m57l34
55167H7387l36p36j003q46o06l22M36J479J764P48p97j630j223O4J310J611Q41
55150H8141j86p68j057j255q12N09J532J003m09r26k30L43J49J4M81Q34M77oJ20
55131H7954O81J087J141Q57K58l07l31O8K19j18n14p64j160j719j878j322l71
55114H3781N69J357J769J516Q10K70J31J4k96m69j07P70J710K053J415K35m90
55097I5038m12k14l60k78N11J316J326R27Q48Q05K86r7M02R59K62j161j547o35
55079I7976J21R7K68J125J733J390P23M40M01L56L96K42o05j658j718p26Q7K23
55061A00871N96J616K179J353k02j361j881j895j254j70N10M48K79L20o6j091
$$ plain form
55186 85152 85153 85013 85222 86016 87162 88011 87787 86423 85150 85430 87101 88479 88545 88053 88033 88303 88178 87721 87387
55167 87387 87051 86315 85312 84466 83860 83538 83974 85453 87217 87965 87168 85538 84315 84379 85689 87300 88141
55150 88141 87955 87187 86130 84875 84063 84572 86104 87107 86698 85772 85542 85885 86034 86048 86529 87363 87840 87834 87954
55131 87954 88635 89722 90863 91720 91978 91671 91340 91408 91627 91509 90995 90231 89071 87352 85474 84152 83781
55114 83781 84350 85707 87476 88992 89802 90072 90203 90217 89921 89452 89345 90115 91825 93878 95293 95528 95038
55097 95038 94626 94412 94052 93774 94285 95601 96927 97854 98702 99507 99793 99696 100098 101057 101319 100158 98611 97976
55079 97976 98097 98194 98462 99587 101320 102710 103433 103873 104274 104630 105026 105268 104663 103005 101287 100561 100648 100871
55061 100871 101467 103083 105262 106615 106413 105052 103171 101276 100022 99852 100362 100810 101089 101409 101343 100252
55045A00252j715j104R0P53P96P54P41O99R48J596K028J704R20K38k79o98q19
55028A06904o52n97p12n34p0j4m87n99L3M07l43j467j704j126p84j052j309j032
55010I4862l04N01R28N73l82j055p60K66J311J937J950J271L08j67M6K93J10j05
54992A01583Q5L43J70k48m31l05k9L73P36O77K83K23P05R71M33l96p16n82m94
54973A03381m10m1M03N08M01M99P08N93J13l07l38K2O00J074J132Q78P37P42L69
54954A11064n41j203p31P22K047K241J189k82j011n70K00K02m39n88J29P37L71
54937A13537n57j167j267j088n76L36J227J663J810K085K514K850L012L058L071
54922A30508L261L823M550N045N375N888O383O138M915L180J251q97k881l975
$$ plain form
55045 100252 98537 97433 97523 98276 99072 99826 100567 101266 102214 103810 105838 107542 108462 108700 108421 107723 106904
55028 106904 106252 105655 104943 104409 104339 104325 103838 103239 103272 103679 103336 101869 100165 99039 98255 97203 95894 94862
55010 94862 94558 95059 95987 96560 96178 95123 94363 94629 95940 97877 99827 101098 101406 101239 101285 101578 101688 101583
54992 101583 101668 102011 102181 101933 101502 101197 101168 101541 102277 102954 103237 103460 104165 105136 105569 105173 104457 103875 103381
54973 103381 102971 102930 103333 103841 104242 104741 105449 106042 106155 105848 105510 105532 106132 107206 108338 109216 109953 110695 111064
54954 111064 110523 109320 108589 109311 111358 113599 114788 114506 113495 112925 113125 113327 112888 112300 112429 113166 113537
54937 113537 112980 111813 110546 109458 108882 109218 110445 112108 113918 116003 118517 121367 124379 127437 130508
54922 130508 133769 137592 142142 147187 152562 158450 164833 170971 175886 179066 180317 179420 176539 172564
54908A72564m218m440m904n002m593m429m737m624l638k684k570k710k225j294
54894A20496m92K53J007J098K16o18l58M63O87L67M27J008J447J632K113L058
54878A32804M114N166O283P102P167O676O051N081L369J358p9r59k116l836n412
54863A72769o109n956n478n131n016m799m073l037k393k344k251j756j447j802
54849A21177k203j875j155q69r76q80o23p26j085j063n76j67j00j59k45l70k48
54832A07857L47R94J094P29L95J24l33p22n46J9L01J07j56k47k53j80NQ4n2m4
54812A09523K95M04j59o78j66J030J619J223P53Q20R20N15o6k73j54p4q1jJ83
54793A15633L32L94M43N50O15L41l82j051r73k72J27j83m40N7Q34J090J032J452
$$ plain form
54908 172564 168346 163906 159002 154000 149407 144978 140241 135617 131979 129295 126725 124015 121790 120496
54894 120496 120004 120257 121264 122362 122578 121960 121602 122065 122752 123119 123546 124554 126001 127633 129746 132804
54878 132804 136918 142084 148367 155469 162636 169312 175363 180444 183813 185171 185092 184133 182017 178181 172769
54863 172769 166660 160704 155226 150095 145079 140280 136207 133170 130777 128433 126182 124426 122979 121177
54849 121177 118974 117099 115944 115075 114099 113219 112596 111870 110785 109722 109146 108979 108879 108720 108475 108105 107857
54832 107857 108204 109198 110292 111021 111416 111540 111207 110485 109939 109958 110259 110366 110210 109963 109710 109530 109535 109619 109567 109523
54812 109523 109818 110222 110063 109385 109219 110249 111868 113091 113844 114664 115584 116099 116033 115760 115606 115532 115451 115450 115633
54793 115633 115965 116359 116802 117352 117967 118308 117926 116875 115902 115630 115757 115574 115134 115191 116025 117115 118147 119599
54775A19599K321K825K593K093J848J994K549L478M522N445O283O998P262P020
54761A76830O740O538N680L625R68j451l706o077p918q398p909p442o961n721
54747A44798l958k823k637k592k261k099k190j821p46K41M64K15oj87l06N8J081
54730A25231K195K750K753K674K865L351L898M198M310M713N541O078N631M524
54716A80712L488K354M22k098m044m810m924m957m868m597m422m358m027l406
54702A40465l009k986k796k058j187q10r90j368j638j667j494j277j034n74O4
54687A17641M24L06J74K90N9r41j784j212M68J710J805J376R30K70m38m28L60
54670A21010R17N84j09m70n91p87r38q97q96j006r18m74K1L39N02L96p0l74J51
$$ plain form
54775 119599 121920 124745 127338 129431 131279 133273 135822 139300 143822 149267 155550 162548 169810 176830
54761 176830 183570 190108 195788 199413 200381 198930 195224 189147 181229 172831 164922 157480 150519 144798
54747 144798 140840 138017 135380 132788 130527 128428 126238 124417 123671 123912 124376 124591 124585 124398 124092 124150 125231
54730 125231 127426 130176 132929 135603 138468 141819 145717 149915 154225 158938 164479 170557 176188 180712
54716 180712 184200 186554 186976 184878 180834 176024 171100 166143 161275 156678 152256 147898 143871 140465
54702 140465 137456 134470 131674 129616 128429 127619 126629 125261 123623 121956 120462 119185 118151 117577 117641
54687 117641 118065 118371 118545 118835 118894 117953 116169 114957 115425 117135 118940 120316 121246 121516 121078 120650 121010
54670 121010 121927 122511 122402 121932 121341 120554 119616 118719 117823 116817 115899 115425 115446 115785 116287 116683 116613 116239 116390
54651A16390J185J651J220O29L93K69K20N91J058O25p12j566j116k95k28n66m20
54634A19328M9J14j18j0L72M02J6k35j41j3M6L19Q37J103O53l43j172j255p90
54615A19162n37p41o71K33J239J193L00j48K12L73k03o96l74K74N93P97J153J187
54597A23346O42K45N52Q56L25n00n68l5R3l18m43M9N15L53l28j066j447j237o56
54578A20378l11l35m0R74J880J681Q01N07J013J276O67k30o91p72p76o41l30k28
54560A24823n74r21o73O1N57L78j64n02n01m82o16o24k02M39Q47R32R37Q48M36
54541A24999n1N1R35J941K430K368J847P12p88j626j071K24R45O83J28j12j58
54524A33457l22n86p97r58j136j293j321j077m81L47J086J451J389R66L43j46
$$ plain form
54651 116390 117575 119226 120446 121075 121468 121737 121957 122548 123606 124231 123519 121953 120837 120542 120314 119748 119328
54634 119328 119377 119491 119373 119363 119735 120137 120153 119918 119777 119764 119810 120129 120966 122069 122722 122379 121207 119952 119162
54615 119162 118625 117884 117213 117446 118685 119878 120178 120030 120242 120615 120412 119716 119342 119616 120209 121006 122159 123346
54597 123346 123988 124233 124785 125641 125966 125466 124898 124863 124956 124638 124195 124244 124759 125112 124784 123718 122271 121034 120378
54578 120378 120067 119732 119692 120666 122546 124227 125028 125535 126548 127824 128491 128261 127570 126798 126022 125381 125051 124823
54560 124823 124249 123328 122655 122716 123273 123651 123487 122985 122484 122002 121386 120762 120560 120999 121846 122778 123715 124563 124999
54541 124999 124948 124999 125934 127875 130305 132673 134520 135232 134444 132818 131747 131971 132916 133599 133727 133615 133457
54524 133457 133135 132549 131752 130794 129658 128365 127044 125967 125486 125833 126919 128370 129759 130725 131068 130922
54508A30922j98M9J20j99o90j099j311j104l67L53K37n92r61k41P38R05M57L31
54490A27350P00R22O71K45j32n32q72q88n88k09K57R24J532J616J244R43Q96P80
54472A34859M69L15N44Q17P58M81L29L36K97K01J99K53J24j57j62L79J041J165
54454A42248P28L60L83L97P8k04n8J21j83n91m33j04o47j958k580j699k29O42
54436A36271R53J260J343O89l14p42n13m34q89j328j133m06L01O49O84O01N37
54419A37529N48P54J367K273K797K280R51k30o69n82l64j54j30m71q07m01O75
54402A45366J313Q22j20m19Q8Q41J442J687J317M78m7K00N94L12m07o70k59K79
54384A52817O00Q50J078J035O09n9p53j128p73K26J079J149P31M74N26P28J209
$$ plain form
54508 130922 130724 130773 130893 130694 130004 128905 127594 126490 126123 126476 126713 126121 125160 124919 125657 126562 127019 127350
54490 127350 128050 128972 129643 129888 129756 129224 128352 127464 126876 126667 126924 127848 129380 130996 132240 133183 134079 134859
54472 134859 135328 135643 136187 137004 137762 138243 138572 138908 139205 139406 139605 139858 139982 139825 139663 140042 141083 142248
54454 142248 142976 143336 143719 144116 144194 143990 143932 144053 143870 143279 142846 142742 142095 140137 137557 135858 135629 136271
54436 136271 137224 138484 139827 140516 140202 139460 138947 138513 137624 136296 135163 134757 135058 135707 136391 136992 137529
54419 137529 138077 138831 140198 142471 145268 147548 148499 148269 147600 147018 146654 146500 146370 145899 145092 144691 145366
54402 145366 146679 147501 147381 146962 147050 147891 149333 151020 152337 152815 152768 152968 153562 153874 153467 152797 152538 152817
54384 152817 153417 154267 155345 156380 156989 156930 156177 155049 154276 154502 155581 156730 157461 157935 158461 159189 160398
54367A60398K007K546K272J549J186J301J443J592K169L152M006M487M798M942
54353A97848M662M062L553L092K096L33j639l103l884m266m545m685m376l496
54339A85652k642k685l581m162l635k678k356k510k233j515j284j827k247j742
54325A50555n55N99J332J541J166M10k95p21r34q40j07J205K331K318Q77j302
54309A57580k985l307k453j317m72J85O86O54N2m47m69o53j497k116j252P67K255
54292A45211K255J382N59k1m83p23p07o24m57J26J182K195K570K143J218L86J00
54275A56312J47j72r27j191l73O12M95m71q39k0J079J459J037K72k45J61J555
54258A58891K736K347P27m24k97K65M01K70J02l89j056r58J92J298J331O91K14
$$ plain form
54367 160398 162405 164951 167223 168772 169958 171259 172702 174294 176463 179615 183621 188108 192906 197848
54353 197848 202510 206572 210125 213217 215313 215646 214007 210904 207020 202754 198209 193524 189148 185652
54339 185652 183010 180325 176744 172582 168947 166269 163913 161403 159170 157655 156371 154544 152297 150555
54325 150555 150000 150599 151931 153472 154638 155048 154753 154032 153098 152258 152151 153356 155687 158005 158882 157580
54309 157580 154595 151288 148835 147518 147046 147231 147917 148571 148623 148176 147707 147054 145557 143441 142189 142956 145211
54292 145211 147466 148848 149407 149386 148903 148180 147473 146849 146392 146518 147700 149895 152465 154608 155826 156212 156312
54275 156312 156459 156287 155360 154169 153796 154408 154903 154432 153593 153573 154652 156111 157148 157420 157175 157336 158891
54258 158891 161627 163974 164701 164277 163980 164245 164646 164916 165018 164629 163573 162615 162807 164105 165436 166127 166341
54241A66341j53q00j356j212n94j34J34M56M85k42j230j431o54K90P48P89O44
54224A62081L70J91M18Q91J021O57L42N63J083J274Q85K12l16n41o28p81r74r73
54206A65775p05m41m95p98r41o95l67n04j207j894j940j433r94q22m26M55J246
54189A53814J341J061J102J373J165L72l60p06r76j260j103m23J23J17oJ93M11
54172A56238L15L63J037J753J510L76n58p51p45r83r71k30O43P09J38oN27O50
54154A60015m18j770j858n31R17J511J439J080L27o97j242r26l81k02QP16J290
54137A59278Q00m33j171r28k84L19R81J661J957J771J397R68N25M58J009J504
54121A69812J083J26j74L93Q80Q30Q28J129J060L71o2L63R09O45j92p10o12j85
$$ plain form
54241 166341 166188 165388 164032 162820 162226 162092 162226 162682 163167 162925 161695 160264 159610 159900 160648 161437 162081
54224 162081 162451 162642 163060 163951 164972 165629 165971 166534 167617 168891 169776 169988 169672 169131 168503 167722 166748 165775
54206 165775 165070 164629 164134 163336 162395 161700 161333 160829 159622 157728 155788 154355 153361 152539 152113 152568 153814
54189 153814 155155 156216 157318 158691 159856 160228 159868 159162 158186 156926 155823 155400 155523 155640 155634 155827 156238
54172 156238 156553 156916 157953 159706 161216 161592 161034 160283 159538 158555 157584 157354 157997 158706 158844 158838 159365 160015
54154 160015 159597 157827 155969 155438 156355 157866 159305 160385 160712 160015 158773 157847 157466 157264 157272 157988 159278
54137 159278 160078 159645 158474 157546 157262 157581 158562 160223 162180 163951 165348 166316 166841 167299 168308 169812
54121 169812 170895 171021 170847 171240 172120 172950 173778 174907 175967 176338 176276 176639 177548 178193 178001 177291 176679 176494
54103A76494L95J020J374J282R84O92L82K20N28J083J251J167J783L231M219L839
54087A99944L032L301M709O272P673R392J1436J2952J3047J1248P411K015l597
54074B88835p963j0520j1535j1412j0540r371q029o209m060k634k672l416l524
54061A96950k822k156j848j405p11l27l92k20N90J489J826J823K105K696L006
54046B00604K667K005J665K011K909M116N589P299Q853R797J0280J0924J1800
54033B80519J2084J1095R211P261N457L453J111j276l300m525m580l684k798k652
54019C07376k879k627j767r24n76p15j258k126l034l736m403n215n743n408m436
54004B62529l737l762m149m434m542m469m097l511l020k638k065j296q37j110
$$ plain form
54103 176494 176889 177909 179283 180565 181549 182241 182623 182843 183371 184454 185705 186872 188655 191886 196105 199944
54087 199944 202976 206277 210986 217258 224931 234323 245759 258711 271758 283006 290417 292432 288835
54074 288835 280872 270352 258817 247405 236865 227494 219465 213256 209196 206562 203890 200474 196950
54061 196950 194128 191972 190124 188719 188008 187681 187289 187069 187659 189148 190974 192797 194902 197598 200604
54046 200604 203271 205276 206941 208952 211861 215977 221566 228865 237718 247515 257795 268719 280519
54033 280519 292603 303698 312909 320170 325627 329080 330191 328915 325615 321090 316510 312826 310028 307376
54019 307376 304497 301870 300103 299179 298603 297888 296630 294504 291470 287734 283331 278116 272373 266965 262529
54004 262529 258792 255030 250881 246447 241905 237436 233339 229828 226808 224170 222105 220809 219972 218862
53990B18862j911k665k962k754k274j872j718j618j328r27p08p04o51l87j1L61
53974A96733P06R43R24O33K40KJ35O40J104R84K87k40rO52J028J027J124J389
53956B08302J303O55R8M30J634K911L559L610L611L911M292M394M334M616N491
53941B53151O782Q430J0707J3622J6555J8878K0447K1056J9804J5759R191J664
53929D16046n035r736j2010j2189j1260j0147q948p227m926k528l85J518L059
53916C36232L882L992M017M551N511O388O860O910O570N811M613L007J102q31
53902C98615k398l348l734l739l467k943k352k076k382l088l736m166m751n797
53888C50638o953p566p480p105o733o259n599m942m439m105m094m534m969m574
$$ plain form
53990 218862 216951 214286 211324 208570 206296 204424 202706 201088 199760 198833 198125 197421 196770 196383 196372 196733
53974 196733 197439 198382 199306 199939 200179 200181 200316 200956 202060 203044 203331 203091 203082 203734 204762 205789 206913 208302
53956 208302 209605 210260 210358 210788 212422 215333 218892 222502 226113 230024 234316 238710 243044 247660 253151
53941 253151 259933 268363 279070 292692 309247 328125 348572 369628 389432 405191 414382 416046
53929 416046 411011 401275 389265 377076 365816 355669 346721 339494 334568 332040 331655 333173 336232
53916 336232 340114 344106 348123 352674 358185 364573 371433 378343 384913 390724 395337 398344 399446 398615
53902 398615 396217 392869 389135 385396 381929 378986 376634 374558 372176 369088 365352 361186 356435 350638
53888 350638 343685 336119 328639 321534 314801 308542 302943 298001 293562 289457 285363 280829 275860 271286
53874B71286l235j930j635k261l010l366l390l375l550l878l849k964j575p99
53860B32469j207k120k582k432k097j806j649j770j950j505k62Q69R65L36r7k03
53844B14959n02r37q64j94L42K67n9j61j59m55j071j510j169MJ202J380M63m48
53826B11088m18K56P57R96J418J972K100J611Q29pp57j025m60O36J552J944J911
53809B24403J590J338J884L439M890M857L472K282K296L083L866M559N351N986
53795B73296N964N117L749K483J995K483L351L754L346K283Q46m96j037o04j28
53780C06402o67k107l526m582n578o365o301n350m276l593l163k942l196l776
53766B50980m024l673l129k740k496k518k932l190k486j106l59q24j601j714j326
$$ plain form
53874 271286 268051 266121 264486 262225 259215 255849 252459 249084 245534 241656 237807 234843 233268 232469
53860 232469 231262 229142 226560 224128 222031 220225 218576 216806 214856 213351 213089 213958 214923 215259 215162 214959
53844 214959 214457 213520 212656 212462 212804 213071 213012 212851 212692 212237 211166 209656 208487 208491 209693 211073 211536 211088
53826 211088 210670 210926 211683 212679 214097 216069 218169 219780 220609 220602 219845 218820 218360 218996 220548 222492 224403
53809 224403 225993 227331 229215 232654 237544 242401 245873 248155 250451 253534 257400 261959 267310 273296
53795 273296 279260 284377 288126 290609 292604 295087 298438 302192 305538 307821 308667 308171 307134 306530 306402
53780 306402 305735 303628 300102 295520 289942 283577 277276 271926 267650 264057 260894 257952 254756 250980
53766 250980 246956 243283 240154 237414 234918 232400 229468 226278 223792 222686 222327 221503 219902 218188 216862
53751B16862r64m97L91J348J719J362N72m25j372j823j521q10k27O4K98P88J614
53734B17379K365K278J175M0JQ26J273Q81M04M00M57K35J71N82J023J133J289
53717B31912J791K117J775J177R97J210J423J612J875J993J902K058K686L166
53703B57694K895K315K237K589K629K207K009K552L591M472M641L925K714J806
53689B98276J656J937K059J841J349M91p18j741j936j284l37M13P73O23m3r07
53673C02452j418j260o49k22n29j389j877j342k92J88j64o04n32j00L82Q03Q07
53656B94254nj149j411m43O44P65J55m05p32r21p01j2M34Q2n15n14J8N22R70J603
53636B92639K132K199K120K228K059J209M74Q23J680J676R39R90K266L361L196
$$ plain form
53751 216862 215898 215401 215792 217140 218859 220221 220793 220368 218996 217173 215652 214842 214615 214679 214977 215765 217379
53734 217379 219744 222022 223197 223237 223238 224064 225337 226218 226622 227022 227479 227714 227885 228467 229490 230623 231912
53717 231912 233703 235820 237595 238772 239769 240979 242402 244014 245889 247882 249784 251842 254528 257694
53703 257694 260589 262904 265141 267730 270359 272566 274575 277127 280718 285190 289831 293756 296470 298276
53689 298276 299932 301869 303928 305769 307118 307609 306891 305150 303214 301930 301593 302006 302779 303402 303359 302452
53673 302452 301034 299774 299125 298903 298374 296985 295108 293766 293474 293662 293498 292894 292362 292262 292644 293447 294254
53656 294254 294249 293100 291689 291246 291890 292655 292810 292405 291673 290752 290051 290039 290473 290555 290040 289526 289544 290066 291036 292639
53636 292639 294771 296970 299090 301318 303377 304586 305060 305883 307563 309239 310178 311168 313434 316795 319991
53621C19991K556K625L234L525L512L877M685N299N467N717O584P946R178R737
53607C93933R559R042Q596Q165P384O153M795L504K051L04j236j874j579j143
53593D47654j375k339l401l851l396k258j011k66k72p23j091j229j428j775j865
53578D21374j464j053j256j877k196k066k007k238k359k182k012j942j555p82
53564C96385k65l85o17m54k71n11o22K60J873K975K806J779P68L21M79Q59R46
53547D06326P45P77J191J310O93J00N49J800K707K889K950L162L096K817L271
53532D34383M865O517O902O202N834O691Q310R708J0523J1110J1799J2414J2559
53519E47817J2253J2091J2659J3935J5364J6452J7171J7910J9135K0906K2720
$$ plain form
53621 319991 322547 325172 328406 331931 335443 339320 344005 349304 354771 360488 367072 375018 384196 393933
53607 393933 403492 412534 421130 429295 436679 442832 447627 451131 453182 453486 452250 450376 448797 447654
53593 447654 446279 443940 440539 436688 433292 431034 430023 429757 429485 428762 427671 426442 425014 423239 421374
53578 421374 419910 418857 417601 415724 413528 411462 409455 407217 404858 402676 400664 398722 397167 396385
53564 396385 396120 395735 395118 394664 394393 393882 393260 393520 395393 398368 401174 402953 403721 404042 404521 405380 406326
53547 406326 407071 407848 409039 410349 411042 411142 411691 413491 416198 419087 422037 425199 428295 431112 434383
53532 434383 439248 445765 452667 458869 464703 471394 479704 489412 499935 511045 522844 535258 547817
53519 547817 560070 572161 584820 598755 614119 630571 647742 665652 684787 705693 728413
53508G28413K3941K4484K4852K5412K5984K6284K6366K6350K6095K5431K4525
53497A008137K3667K2966K2445K2152K1900K1269K0209J9266J8904J8893J8725
53486A238533J8348J8127J8339J9019J9913K0388J9861J8629J7763J7796J8073
53475A444789J7805J7026J5913J4052J1258Q440O553N103K836m39l791o747r649
53462A523149j2507j4630j5649j5990j6077j5993j6037j6719j7923j8920j9547
53451A343157k0523k2261k3998k4706k4258k3386k2769k2515k2177k1172j9499
53440A095893j7993j7357j7061j5835j3318j0449q167o460m996l804k904j919
53428I75630n91P21J567K096K842M099N810P733R564J1084J2398J3786J5266J6659
$$ plain form
53508 728413 752354 776838 801690 827102 853086 879370 905736 932086 958181 983612 1008137
53497 1008137 1031804 1054770 1077215 1099367 1121267 1142536 1162745 1182011 1200915 1219808 1238533
53486 1238533 1256881 1275008 1293347 1312366 1332279 1352667 1372528 1391157 1408920 1426716 1444789
53475 1444789 1462594 1479620 1495533 1509585 1520843 1529283 1535836 1540939 1543775 1543336 1539545 1532798 1523149
53462 1523149 1510642 1496012 1480363 1464373 1448296 1432303 1416266 1399547 1381624 1362704 1343157
53451 1343157 1322634 1300373 1276375 1251669 1227411 1204025 1181256 1158741 1136564 1115392 1095893
53440 1095893 1077900 1060543 1043482 1027647 1014329 1003880 995713 989253 984257 980453 977549 975630
53428 975630 975039 975760 977327 979423 982265 986364 992174 999907 1009471 1020555 1032953 1046739 1062005 1078664
53414A078664J8062J9853K2075K4254K5966K7188K8053K8719K9525L0903L2884
53403A366146L5061L7112L9036M0948M3041M5612M8620N1365N3230N4654N6521
53392A871346N8640N9804N9614N9196N9657O0607O0864N9984N8459N6852N5364
53381B520387N3915N2217M9899M7000M4011M1227L8344L4930L0880K6215K0957
53370B959982J5484J0486O089J500m170j1045j8725k6832l4815m1856m7590n2564
53358B755944n7309o1215o3072o2626o1036n9704n9102n8778n8039n6481n4144
53347B104438n1393m8724m6608m5382m5075m5294m5518m5472m5051m4016m2126
53336A599779l9640l7192l5086l3044l0770k8333k5876k3364k0740j8042j5279
$$ plain form
53414 1078664 1096726 1116579 1138654 1162908 1188874 1216062 1244115 1272834 1302359 1333262 1366146
53403 1366146 1401207 1438319 1477355 1518303 1561344 1606956 1655576 1706941 1760171 1814825 1871346
53392 1871346 1929986 1989790 2049404 2108600 2168257 2228864 2289728 2349712 2408171 2465023 2520387
53381 2520387 2574302 2626519 2676418 2723418 2767429 2808656 2847000 2881930 2912810 2939025 2959982
53370 2959982 2975466 2985952 2992041 2993541 2989371 2978326 2959601 2932769 2897954 2856098 2808508 2755944
53358 2755944 2698635 2637420 2574348 2511722 2450686 2390982 2331880 2273102 2215063 2158582 2104438
53347 2104438 2053045 2004321 1957713 1912331 1867256 1821962 1776444 1730972 1685921 1641905 1599779
53336 1599779 1560139 1522947 1487861 1454817 1424047 1395714 1369838 1346474 1325734 1307692 1292413
53325A292413j2650j0792j0247j0661j1136j1472j2162j3048j2980j1424r448
53314A166393q308p772o794n218l730k445p77J315L025L920M583N660O960P999
53300A164811R004J0715J3313J6010J7875J8865J9863K1650K4067K6288K7808
53289A370269K8838K9795L0783L1666L2191L1917L0421K7897K5194K2986K1162
53278A683119J9258J7096J4670J1816Q480N019J749j568n272r054j2198j4465
53266A718650j6274j8046j9958k2266k5216k8424l0859l1865l1910l1990l2558
53255A429284l3303l3874l4278l4503l4175l2993l1347l0068k9504k9219k8757
53244A077263k8235k7876k7435k6614k5778k5570k5880k5862k5087k3957k2846
$$ plain form
53325 1292413 1279763 1268971 1258724 1248063 1236927 1225455 1213293 1200245 1187265 1175841 1166393
53314 1166393 1158085 1150313 1143519 1138301 1134571 1132126 1131349 1132664 1135689 1139609 1144192 1149852 1156812 1164811
53300 1164811 1173815 1184530 1197843 1213853 1231728 1250593 1270456 1292106 1316173 1342461 1370269
53289 1370269 1399107 1428902 1459685 1491351 1523542 1555459 1585880 1613777 1638971 1661957 1683119
53278 1683119 1702377 1719473 1734143 1745959 1754439 1759458 1761207 1759639 1754367 1745313 1733115 1718650
53266 1718650 1702376 1684330 1664372 1642106 1616890 1588466 1557607 1525742 1493832 1461842 1429284
53255 1429284 1395981 1362107 1327829 1293326 1259151 1226158 1194811 1164743 1135239 1106020 1077263
53244 1077263 1049028 1021152 993717 967103 941325 915755 889875 864013 838926 814969 792123
53233G92123k1527j9778j8004j6722j5809j4714j3155j1302r487q118p581p874
53221F28052q436q680q590q593r007r790j0700j1482j1983j2216j2251j2048j1605
53208D92671j1158j0896j0538r633q295p133o466o047n640n349n245n237n391
53195C95643n782n950n319m300m079m888n471m864l771l380l608l615l385l567
53181C33664m113m263l879l686m001m180l602k510j536j032j061j624k498l177
53167B92502l269k795k112j633j558j693j595j114n72k79j28M6Q3j77m91n81n87
53150B74047o83o50l21q0k39k93L15J018P02n81j504j298o85o09q91p43k1P23
53132B68207J065J029P65L69J5j15nK03M04N92Q37J227J706J987J798J279R19
$$ plain form
53233 792123 770596 750818 732814 716092 700283 685569 672414 661112 651625 643507 635926 628052
53221 628052 619616 610936 602346 593753 584746 574956 564256 552774 540791 528575 516324 504276 492671
53208 492671 481513 470617 460079 450446 442151 435018 428552 422505 416865 411516 406271 401034 395643
53195 395643 389861 383911 378592 374292 370213 365325 359854 354990 351219 347839 344231 340616 337231 333664
53181 333664 329551 325288 321409 317723 313722 309542 305940 303430 301894 300862 299801 298177 295679 292502
53167 292502 289233 286438 284326 282693 281135 279442 277847 276733 276161 275882 275754 275800 275883 275706 275215 274634 274047
53150 274047 273364 272714 272393 272313 272074 271781 272096 273114 273816 273235 271731 270433 269748 269139 268248 267505 267484 268207
53132 268207 269272 270301 271066 271435 271450 271335 271330 271533 271937 272529 273366 274593 276299 278286 280084 281363 282282
53115B82282J037J470J769J578Q60p9q24j235j496j721j746j535j456j755k039
53100B75110j769j120p82j004j395j656j871k021j840j318q62p23o61m61l12m47
53084B56868p14p95n42O6R33J613J498N84k81l56J18L06o4m64l89kJ61j73q05
53065B57562j344j559j487j263r41n00o2R8k07q29j361j448j066n14j28O2L21
53048B45334Q36J384J560J233O27K8l93n22l13N0K53J68l7k27m73q31j094j003
53030B46580o02j74J08L28N65P54Q90J148J604J908J507L13j054j813j607n90
53014B49865Q15J958K149J263oq34j124j229j093l28P79J220N83k30j33P67J471
52997B55893J500J236J070Q57L99q0k41j05pj54m37o23n91l28J34O59Q77M58l40
$$ plain form
53115 282282 283319 284789 286558 288136 288996 288917 288093 286858 285362 283641 281895 280360 278904 277149 275110
53100 275110 273341 272221 271439 270435 269040 267384 265513 263492 261652 260334 259472 258749 258088 257627 257315 256868
53084 256868 256154 255359 254817 254883 255816 257429 258927 259511 259230 258874 258992 259298 259234 258770 258381 258379 258540 258367 257562
53065 257562 256218 254659 253172 251909 250968 250468 250406 250504 250297 249468 248107 246659 245593 245079 244951 245013 245334
53048 245334 246170 247554 249114 250347 250974 251002 250609 250087 249774 249824 250077 250245 250208 249981 249508 248677 247583 246580
53030 246580 245978 245804 245912 246240 246805 247559 248449 249597 251201 253109 254616 254929 253875 252062 250455 249865
53014 249865 250680 252638 254787 256050 256044 255210 254086 252857 251764 251436 252215 253435 254018 253788 253655 254422 255893
52997 255893 257393 258629 259699 260556 260955 260875 260634 260529 260522 260368 259931 259308 258717 258389 258523 259182 260059 260517 260177
52978B60177o97j32Q61J457J516J478J447J143O86O03R21J003N86K48M49Q22Q34
52961B73402N62L30J48l5o2l9m06j136j493j168r05j299j729j362n88l79p92j119
52943B61930j177j280j226n51L20L86m31j139j135p83m24R4O86Q11L97L0m8k89
52925B56171p76q70l87k29j048k049k006r85j60j77n25m87mN31Q53R33Q07N50
52907B50142K76N6k22p04j244j333o01N76J356J351R93P58N82K48o6j69k98o56
52889B51045q65n22J06N55R54J617K160J909J007K07k90q51j409j424r08m68j88
52872B52635M97J546K021J450O24N22J144J911K527K913K867K304J488O81m1n01
52856B74588n10l50o01j292j882k230k743l401l539k994k527k602k696k395k257
$$ plain form
52978 260177 259480 259348 260209 261666 263182 264660 266107 267250 267936 268539 269460 270463 271049 271297 271746 272568 273402
52961 273402 273964 274294 274442 274407 274345 274306 273900 272764 271271 270103 269198 267899 266170 264808 264220 263841 263049 261930
52943 261930 260753 259473 258247 257696 258016 258402 257971 256832 255697 254914 254490 254584 255270 256081 256478 256508 256460 256171
52925 256171 255395 254525 254138 253909 252861 250812 248806 247821 247661 247484 246959 246472 246468 246999 247852 248785 249592 250142
52907 250142 250418 250474 250252 249548 248304 246971 246370 246946 248302 249653 250646 251404 251986 252234 252168 251999 251701 251045
52889 251045 250180 249658 249764 250319 251273 252890 255050 256959 257966 258173 257883 257032 255623 254199 253291 252823 252635
52872 252635 253132 254678 256699 258149 258773 259295 260439 262350 264877 267790 270657 272961 274449 275130 275089 274588
52856 274588 274078 273728 273127 271835 269953 267723 264980 261579 258040 255046 252519 249917 247221 244826 242569
52841B42569k732l089k418j135m30n42n92j0P53J006O59J44q5R4M16N30M63N45
52823B36146Q09Q78O24M09M40M15J76J21N32J053J288J369J454J275Q51R49K059
52806B50848L311L343J979K33j121k156l035l518l367k705j829j047o22m94j76
52791B39644N88J263J048n3j210j713j534r46j56O50J212J364J107O40L37N64
52775B42805J199J668J638J403J333J275R01K68l98j108j795j975j379o94q77
52760B44264j767k142j284J27R43Q99O82R31J499J742J298M81j62m45n06l15L22
52743B46567J262K005K304K384K323J889J166P40Q76J041P35K93L10P45J176J480
52727B67296J672J486Q03R6j95l80q90j349j136n83o59j510k246k191j592r87
$$ plain form
52841 242569 239837 236748 234330 233195 232765 232223 231631 231621 232374 233380 234039 234183 234098 234192 234608 235138 235601 236146
52823 236146 236955 237833 238457 238866 239306 239721 239897 240018 240550 241603 242891 244260 245714 246989 247840 248789 250848
52806 250848 254159 257502 259481 259714 258593 256437 253402 249884 246517 243812 241983 240936 240314 239820 239644
52791 239644 240232 241495 242543 242490 241280 239567 238033 237087 236931 237581 238793 240157 241264 241904 242241 242805
52775 242805 244004 245672 247310 248713 250046 251321 252222 252490 252092 250984 249189 247214 245835 245141 244264
52760 244264 242497 240355 239071 239198 240141 241040 241722 242653 244152 245894 247192 247673 247511 247066 246560 246245 246567
52743 246567 247829 249834 252138 254522 256845 258734 259900 260640 261516 262557 263292 263585 263895 264640 265816 267296
52727 267296 268968 270454 271257 271353 271158 270778 269888 268539 267403 266820 266161 264651 262405 260214 258622 257635
52711B57635o04m88n75n34j27K50L4m84l76N59J353J127J98m70m26J9L81M83M72
52692B58427O06R20J088Q27L09m2n9J10L30M92M06M0l10l83l54m17l01K99J007
52673B62995J178Q59O21N65K22m84r65q05l00P3J20k10q33j268r66q1O00P22P87
52654B62830J304K066K536K545K240J748J098L13n86j454j984k081k087k200j958
52639B64330r57J71M10j24k89L48R51Q93O74Q05Q65M17M3N08J512K177K261K008
52621B77003J261k57j948k727k381j698j181n40L42P91K88n52n88M08J436J441
52605B71098M71n04p03k53J92K42L5j20n4K11M46L16j79m52K4R25J404J264J097
52586B75460J180J019L67o2M17J349J782J617J476J459R53k68j500j919j399l74
$$ plain form
52711 257635 257031 256543 255968 255434 255307 255557 255591 255107 254731 255290 256643 257770 257968 257498 257072 257091 257472 257955 258427
52692 258427 259033 259953 261041 261868 262177 262135 262076 262186 262516 263008 263414 263454 263144 262761 262407 261990 261689 261988 262995
52673 262995 264173 265032 265653 266218 266440 265956 264991 264186 263886 263959 264079 263869 263036 261768 260802 260721 261321 262043 262830
52654 262830 264134 266200 268736 271281 273521 275269 276367 276680 276094 274640 272656 270575 268488 266288 264330
52639 264330 263373 263544 263954 263830 263541 263889 264840 265733 266407 267212 268077 268494 268537 269045 270557 272734 274995 277003
52621 277003 278264 278007 276059 273332 270951 269253 268072 267532 267874 268665 268953 268401 267813 268221 269657 271098
52605 271098 271569 271065 270362 270109 270301 270543 270578 270458 270404 270615 271061 271377 271198 270746 270770 271695 273099 274363 275460
52586 275460 276640 277659 278026 277964 278381 279730 281512 283129 284605 286064 287017 286749 285249 283330 281931 281557
52570B81557O18J132J030O50M39L11j53q64j181q72n60p86j232j288r72p10n24
52553B76595j25L56L98j65r61j659k096j880o37J056J803J006k04m49K4j59j334
52536B71569k237j820n93L25O76R46J312J525J567J689J881J899J766J629J232
52521B83366K60p69p17O77K165K390J461N84M08M75K86J04M07J016J324J193J092
52504B95722J333J621J503R15K5j081k200k790k465j664j219j249j043j75P62
52489B87995R55L94k55n17m16k06j82n26r79r24k09M39L06k29j37Q34J873K255
52471B90471K117J882J524Q48J60J09Q30J635J746J224R48J513K437K703K003
52456C12150R65J42o01j513k340k758k849k792k416j715j265j496j894j695j099
$$ plain form
52570 281557 282175 283307 284337 284987 285426 285737 285584 284720 283539 282667 282107 281321 280089 278801 277829 277119 276595
52553 276595 276470 276826 277224 277059 276098 274439 272343 270463 269826 270882 272685 273691 273487 273038 273062 272903 271569
52536 271569 269332 267512 266919 267244 267920 268866 270178 271703 273270 274959 276840 278739 280505 282134 283366
52521 283366 283626 282857 282140 282817 284982 287372 288833 289417 289825 290300 290586 290690 291097 292113 293437 294630 295722
52504 295722 297055 298676 300179 301094 301119 300038 297838 295048 292583 290919 289700 288451 287408 287233 287995
52489 287995 288950 289344 289089 288572 288156 287950 287768 287242 286263 285339 285130 285569 285875 285646 285509 286343 288216 290471
52471 290471 292588 294470 295994 296842 297002 297111 297941 299576 301322 302546 303494 305007 307444 310147 312150
52456 312150 313115 313257 312656 311143 308803 306045 303196 300404 297988 296273 295008 293512 291618 289923 288824
52441B88824r28j307j532j320j215j546j788j335l32N51Q24M26l10q08o81j53
52425B77370L43P95J394J888J825J404J237J272Q30j43p19k19R90K267L473M576
52409B98583N322N856O961R034J1392J3182J4366J5087J4679J2173P629K237k830
52396D13671p058j0292j2360j3104j2442j0513p959n777m515l845l230k651k335
52383C17590k177j909j526j065k75Q92J825J953J685K006L149M285M548L805K488
52368C37274J244P99J533K902L716L279J997P39r2o24r63r87o91m48o22r69p43
52351C47344L48J543J889J585J787K924L951L781K758K035J955J975J881K108
52337C77864K700K971K591K352L196M925O379O811O569O531P218Q522R981J1181
$$ plain form
52441 288824 287896 286589 285057 283737 282522 280976 279188 277853 277521 278072 278896 279322 279012 278204 277523 277370
52425 277370 277713 278508 279902 281790 283615 285019 286256 287528 288358 288215 287496 287277 288267 290534 294007 298583
52409 298583 303905 309761 316722 325756 337148 350330 364696 379783 394462 406635 414264 416501 413671
52396 413671 406613 396321 383961 370857 358415 347902 339943 334166 329651 325806 322576 319925 317590
52383 317590 315413 313504 311978 310913 310638 311530 313355 315308 316993 318999 322148 326433 330981 334786 337274
52368 337274 338518 339317 340850 343752 347468 350747 352744 353483 353391 352767 351804 350817 350126 349678 349056 348087 347344
52351 347344 347692 349235 351124 352709 354496 357420 361371 365152 367910 369945 371900 373875 375756 377864
52337 377864 380564 383535 386126 388478 391674 396599 402978 409789 416358 422889 430107 438629 448610 459791
52323D59791J2000J2636J3423J4465J5482J6036J5997J5648J5322J5042J4664
52312F20506J4232J3953J3842J3768J3828J4353J5339J6215J6395J5952J5447
52301G83830J5216J5020J4359J3050J1449J0153R373Q674P452N615L493J277j127
52288H97834l556n409o269o354o184o047n968n867n522m708l582k653k113j509
52274H32093l50J253K829M153N246O132O938P973R259J0205J0236R566Q966Q849
52260I23348R087R609J0617J2103J3519J4257J4159J3538J2833J2296J1862J1224
52248A068452J0143Q714P259N910M432K452j01k753m791n877o361o754p022o767
52234A066936o070n668o061o911p548p714p493o913o050n232m670m100l226k341
$$ plain form
52323 459791 471791 484427 497850 512315 527797 543833 559830 575478 590800 605842 620506
52312 620506 634738 648691 662533 676301 690129 704482 719821 736036 752431 768383 783830
52301 783830 799046 814066 828425 841475 852924 863077 872450 881124 888576 894191 897684 898961 897834
52288 897834 894278 888869 882600 876246 870062 864015 858047 852180 846658 841950 838368 835715 833602 832093
52274 832093 831743 832996 835825 839978 845224 851356 858294 866267 875526 885731 895967 905533 914499 923348
52260 923348 932435 942044 952661 964764 978283 992540 1006699 1020237 1033070 1045366 1057228 1068452
52248 1068452 1078595 1087309 1094568 1100478 1104910 1107362 1107261 1104508 1099717 1093840 1087479 1080725 1073703 1066936
52234 1066936 1060866 1055198 1049137 1042226 1034678 1026964 1019471 1012558 1006508 1001276 996606 992506 989280 986939
52220I86939k033k342k614k310j527o27L34J534K931M113M721M984N568O713P686
52205A014070P468O042M558M067M449M890M998N110N647O558P411P777P593P183
52191A097821O871O544N801M545L167K061J216L71p05k127l812n378o466p149
52177A102760p730q215q449q625q982r014p851n648l747l070l108k920k335j634
52163A021432q08J65R62J529K403L706M416L618J940P86N59N44L17J96M10P37
52147A042912J077J567K071K229K056J892J740J153j00j752l327m377m596m089
52133A038456l333k554j442J39J751L112M697O926R372J1554J3848J6699J9446
52120A118671K1093K1790K2344K2697K2184K1063K0336K0107J9576J8664J8146
$$ plain form
52220 986939 984906 982564 979950 977640 976113 975486 975820 977354 980285 984398 989119 994103 999671 1006384 1014070
52205 1014070 1021538 1027580 1032138 1036205 1040654 1045544 1050542 1055652 1061299 1067857 1075268 1083045 1090638 1097821
52191 1097821 1104692 1111236 1117037 1121582 1124749 1126810 1128026 1128397 1127692 1125565 1121753 1116375 1109909 1102760
52177 1102760 1095030 1086815 1078366 1069741 1060759 1051745 1043894 1038246 1034499 1031429 1028321 1025401 1023066 1021432
52163 1021432 1020624 1020789 1021751 1023280 1025683 1029389 1033805 1037423 1039363 1040149 1040708 1041252 1041569 1041765 1042175 1042912
52147 1042912 1043989 1045556 1047627 1049856 1051912 1053804 1055544 1056697 1056597 1054845 1051518 1047141 1042545 1038456
52133 1038456 1035123 1032569 1031127 1031266 1033017 1036129 1040826 1047752 1057124 1068678 1082526 1099225 1118671
52120 1118671 1139764 1161554 1183898 1206595 1228779 1249842 1270178 1290285 1309861 1328525 1346671
52109A346671J7996J7132J5234J3444J2660J2403J2008J1706J1795J1859J1549
52098A494457J1193J0828R620P159M342K017m81m338r301j3797j6665j7932j8113
52085A458989j7580j6524j5003j3085j1187r835q832p298n001l001k281k372k040
52072A344950q14R64L075N467P669R086R865J0649J1553J2066J2022J1956J2430
52059A450938J3338J4023J3817J2626J1180J0408J0291R737Q000N644L579J606
52047A565187j118m564p697r888j1510j3055j4452j5456j6070j6209j5586j4251
52035A425331j2847j2017j1761j1612j1184j0464r854j0025j1280j2986j3943
$$ plain form
52109 1346671 1364667 1381799 1397033 1410477 1423137 1435540 1447548 1459254 1471049 1482908 1494457
52098 1494457 1505650 1516478 1526098 1533257 1537599 1539616 1539135 1534797 1525496 1511699 1495034 1477102 1458989
52085 1458989 1441409 1424885 1409882 1396797 1385610 1375775 1366943 1359645 1354644 1351643 1349362 1346990 1344950
52072 1344950 1344136 1345100 1348175 1353642 1361311 1370397 1380262 1390911 1402464 1414530 1426552 1438508 1450938
52059 1450938 1464276 1478299 1492116 1504742 1515922 1526330 1536621 1546358 1554358 1560002 1563581 1565187
52047 1565187 1564069 1559505 1551808 1541920 1530410 1517355 1502903 1487447 1471377 1455168 1439582 1425331
52035 1425331 1412484 1400467 1388706 1377094 1365910 1355446 1345592 1335567 1324287 1311301 1297358
$$ [...]
##END NTUPLES=NMR SPECTRUM
##END=
