
##TITLE=AC1345_GUAAH12163_6647494_LoplXEoAPo
##JCAMPDX= 6.0         $$ Bruker NMR JCAMP-DX V2.0
##DATA TYPE= NMR SPECTRUM
##DATA CLASS= NTUPLES
##ORIGIN= BRUKER
##OWNER= Administrator
$$ 1.72 TOPSPIN		Version 2.1
$$ 2012-08-10 20:36:47.296 -0500  Administrator@TOPSPIN
$$ Compression mode = diff/dup
##.OBSERVE FREQUENCY= 400.02188249412
##.OBSERVE NUCLEUS= ^1H
##.ACQUISITION MODE= SIMULTANEOUS (DQD)
##.ACQUISITION SCHEME= undefined
##.AVERAGES= 8
##.DIGITISER RES= 22
##SPECTROMETER/DATA SYSTEM= spect
##.PULSE SEQUENCE= zg30
##.SOLVENT NAME= COFFEE_meoh
##.SHIFT REFERENCE= INTERNAL, COFFEE_meoh, 1, 14.98509
##AUDIT TRAIL= $$ (NUMBER, WHEN, WHO, WHERE, PROCESS, VERSION, WHAT)
$$ ##TITLE= Audit trail, TOPSPIN		Version 2.1
$$ ##JCAMPDX= 5.01
$$ ##ORIGIN= Bruker BioSpin GmbH
$$ ##OWNER= Administrator
$$ $$ C:\Bruker\TOPSPIN/data/COFFEE/nmr/AC1345_GUAAH12163_6647494_LoplXEoAPo/20/pdata/1/auditp.txt
$$ ##AUDIT TRAIL=  $$ (NUMBER, WHEN, WHO, WHERE, PROCESS, VERSION, WHAT)
(   1,<2012-08-10 20:36:39.484 -0500>,<Administrator>,<TOPSPIN>,<go>,<TOPSPIN 2.1>,
      <created by zg
	started at 2012-08-10 20:35:32.593 -0500,
	POWCHK enabled, PULCHK disabled,
       configuration hash MD5:
       6B 1B 68 BB D9 2E 58 E2 7F 35 AD 54 07 DF 0E 41
       data hash MD5: 64K
       0F 40 85 5D B9 97 65 18 D9 F8 BB B5 87 DB C8 5C>)
(   2,<2012-08-10 20:36:43.000 -0500>,<Administrator>,<TOPSPIN>,<proc1d>,<TOPSPIN 2.1>,
      <Start of raw data processing
       efp LB = 0 FT_mod = 6 PKNL = 1 PHC0 = 0 PHC1 = 0 SI = 32K 
       data hash MD5: 32K
       FB 82 F7 A0 03 58 7E 4C 4A ED AC BE 07 8B A5 D1>)
(   3,<2012-08-10 20:36:43.328 -0500>,<Administrator>,<TOPSPIN>,<proc1d>,<TOPSPIN 2.1>,
      <pk PHC0 = 178.6761 PHC1 = 0 
       data hash MD5: 32K
       AF 4C B0 7D 14 FB B8 7B D8 7F 6A 96 DD 37 FE 20>)
(   4,<2012-08-10 20:36:43.390 -0500>,<Administrator>,<TOPSPIN>,<proc1d>,<TOPSPIN 2.1>,
      <abs ABSG = 1 
       data hash MD5: 32K
       C1 82 EE FC BE 8E E5 A3 17 46 D3 CE 90 70 E7 66>)
(   5,<2012-08-10 20:36:43.421 -0500>,<Administrator>,<TOPSPIN>,<proc1d>,<TOPSPIN 2.1>,
      <abs ABSG = 2 
       data hash MD5: 32K
       4C A2 F8 C8 38 C4 3C D4 30 67 3D D2 34 55 15 4A>)
(   6,<2012-08-10 20:36:43.453 -0500>,<Administrator>,<TOPSPIN>,<proc1d>,<TOPSPIN 2.1>,
      <abs ABSG = 3 
       data hash MD5: 32K
       26 E0 D4 9B 58 8E 2A 41 81 75 3E 01 59 EA 37 39>)
(   7,<2012-08-10 20:36:43.484 -0500>,<Administrator>,<TOPSPIN>,<proc1d>,<TOPSPIN 2.1>,
      <abs ABSG = 4 
       data hash MD5: 32K
       8F 4B 35 BB 71 4F 41 E3 AF 3A 4A A0 2E 36 B6 4F>)
(   8,<2012-08-10 20:36:43.515 -0500>,<Administrator>,<TOPSPIN>,<proc1d>,<TOPSPIN 2.1>,
      <abs ABSG = 5 
       data hash MD5: 32K
       5E 16 A4 D6 5D 38 28 AC EE FB 36 2F 0D 3D B4 B9>)
$$ ##END=
$$ 
$$ $$ hash MD5
$$ $$ 4A 9A CA A1 C0 29 AE AB E9 F1 11 C1 91 31 23 D8
##$RELAX= 
##$RELAX= 
##$RELAX= 
##$RELAX= 
##$RELAX= 
##$RELAX= 
##$RELAX= 
$$ Bruker specific parameters
$$ --------------------------
$$ [...]
##$TP= (0..7)
150 150 150 150 150 150 150 150
##$TP07= 0
##$TPNAME0= <>
##$TPNAME1= <>
##$TPNAME2= <>
##$TPNAME3= <>
##$TPNAME4= <>
##$TPNAME5= <>
##$TPNAME6= <>
##$TPNAME7= <>
##$TPOAL= (0..7)
0.5 0.5 0.5 0.5 0.5 0.5 0.5 0.5
##$TPOFFS= (0..7)
0 0 0 0 0 0 0 0
##$TUNHIN= 0
##$TUNHOUT= 0
##$TUNXOUT= 0
##$USERA1= <user>
##$USERA2= <user>
##$USERA3= <user>
##$USERA4= <user>
##$USERA5= <user>
##$V9= 5
##$VALIST= <valist>
##$VCLIST= <CCCCCCCCCCCCCCC>
##$VD= 0
##$VDLIST= <DDDDDDDDDDDDDDD>
##$VPLIST= <PPPPPPPPPPPPPPP>
##$VTLIST= <TTTTTTTTTTTTTTT>
##$WBST= 1024
##$WBSW= 4
##$XGAIN= (0..3)
0 0 0 0
##$XL= 0
##$YL= 0
##$YMAX_a= 454253
##$YMIN_a= -591367
##$ZGOPTNS= <>
##$ZL1= 120
##$ZL2= 120
##$ZL3= 120
##$ZL4= 120
##$ABSF1= 14.98509
##$ABSF2= -5.573092
##$ABSG= 5
##$ABSL= 3
##$ALPHA= 0
##$AQORDER= 0
##$ASSFAC= 0
##$ASSFACI= 0
##$ASSFACX= 0
##$ASSWID= 0
##$AUNMP= <proc_prof1d_extract_pilot.lims>
##$AXLEFT= 0
##$AXNAME= <>
##$AXNUC= <1H>
##$AXRIGHT= 0
##$AXTYPE= 0
##$AXUNIT= <>
##$AZFE= 0.1
##$AZFW= 0.1
##$BCFW= 0
##$BC_mod= 0
##$BYTORDP= 0
##$COROFFS= 0
##$CY= 15
##$DATMOD= 1
##$DC= 0
##$DFILT= <>
##$DTYPP= 0
##$F1P= 0
##$F2P= 0
##$FCOR= 0.5
##$FTSIZE= 32768
##$FT_mod= 6
##$GAMMA= 0
##$GB= 0
##$INTBC= 1
##$INTSCL= 1
##$ISEN= 128
##$LB= 0
##$LEV0= 0
##$LPBIN= 0
##$MAXI= 10000
##$MC2= 0
##$MEAN= 0
##$ME_mod= 0
##$MI= 0
##$NCOEF= 0
##$NC_proc= -8
##$NLEV= 6
##$NOISF1= 0
##$NOISF2= 0
##$NSP= 0
##$NTH_PI= 0
##$NZP= 0
##$OFFSET= 14.98509
##$PC= 1
##$PHC0= 178.6761
##$PHC1= 0
##$PH_mod= 1
##$PKNL= yes
##$PPARMOD= 0
##$PPDIAG= 0
##$PPIPTYP= 0
##$PPMPNUM= 2147483647
##$PPRESOL= 1
##$PSCAL= 4
##$PSIGN= 0
##$PYNMP= <proc.py>
##$REVERSE= no
##$SF= 400.02
##$SI= 32768
##$SIGF1= 0
##$SIGF2= 0
##$SINO= 400
##$SIOLD= 32768
##$SPECTYP= <>
##$SREGLST= <1H.CDCl3>
##$SSB= 0
##$STSI= 32768
##$STSR= 0
##$SW_p= 8223.68421052631
##$SYMM= 0
##$S_DEV= 0
##$TDeff= 65536
##$TDoff= 0
##$TI= <>
##$TILT= no
##$TM1= 0
##$TM2= 0
##$TOPLEV= 0
##$USERP1= <user>
##$USERP2= <user>
##$USERP3= <user>
##$USERP4= <user>
##$USERP5= <user>
##$WDW= 1
##$XDIM= 32768
##$YMAX_p= 459407109
##$YMIN_p= -678447
##$CURPLOT= <Network HP LaserJet P1505>
##$CURPRIN= <$Network HP LaserJet P1505>
##$DFORMAT= <normdp>
##$LAYOUT= <+/1D_H.xwp>
##$LFORMAT= <normlp>
##$PFORMAT= <normpl>
##$SURQMSG= 1
$$ End of Bruker specific parameters
$$ ---------------------------------
##NTUPLES= NMR SPECTRUM
##VAR_NAME=  FREQUENCY,     SPECTRUM/REAL,   SPECTRUM/IMAG
##SYMBOL=    X,             R,               I
##VAR_TYPE=  INDEPENDENT,   DEPENDENT,       DEPENDENT
##VAR_FORM=  AFFN,          ASDF,            ASDF
##VAR_DIM=   32768,         32768,           32768
##UNITS=     HZ,            ARBITRARY UNITS, ARBITRARY UNITS
##FACTOR=    0.250966925370066, 1,           1
##FIRST=     8223.43324360094, 136378,       52981
##LAST=      0,             -53429,          93909
##MIN=       0,             -678447,         0
##MAX=       8223.43324360094, 459407109,    0
$$ Real data points
##PAGE= N=1
##DATA TABLE= (X++(R..R)), XYDATA
$$ [...]
19466H3388a2973A84877a32614A14890c3510l9387J02J5478C9667a58116A05139
19454a05096l50091A00483a41664F4176d339B1453a26321A90084f4526H2958P1995
19443A54953g2065m06571c2705H5366a42260K6478L5703A4787L6911g7118A35229
19431A1574d43983J75223F9341c7111d629k28883A27430a77867A34702a0263A92044
19419a42405j38429g1088I1453K2900b429n6859q3826I4302b36827d1334k59995
19408c01329A19167D5422b1804n6079J8730m2978B9129c49259E1439N6999a72578
19396b78896i9724c3069i475C6310a82852G8956a78082a8145o0912O35j57510
19385b35932A60796a21603j72944B22864a48343j22127a27008c9249k3547K0327
$$ y = [83388, -12973, 184877, -132614, 114890, -33510, -72897, -72795, -57317, 39667, -158116, 105139, -105096, -455187, 100483, -141664, 64176, -4339, 21453, -126321, 190084, -64526, 82958, 154953, -72065, -478636, -32705, 85366, -142260, -115782, -80079, 14787, 51698, -77118, 135229, 11574, -443983, -268760, 69341, -37111, -4629, -233512, 127430, -177867, 134702, -10263, 192044, -142405, -280834, -71088, 91453, 114353, -2429, -59288, -143114, 94302, -236827, -41334, -301329, 119167, 45422, -21804, -77883, -59153, -102131, 29129, -349259, 51439, 108438, -172578, -278896, -99724, -33069, -9475, 36310, -182852, 78956, -178082, -18145, -79057, -78422, -235932, 160796, -121603, -294547, 222864, -148343, -270470, -127008, -39249, -62796, -42469]
19375d2469j06636k0420A19510a18433K1860k96366a75754n8773A81013C5963
19364a06406M0704j19316m1981A54958K56551a61083L571B08451a7717o6174q4659
19353a68550B9399O8102a64554B92728b07571e2676j91614N7238M4843J0845o7801
19342a99165A24344g2854l1826J3425F9919J6253c09968a24886k41446a54736
19331c15824J00991H8920d71846a74692A88448d5814k5134j8572H008c10271A98812
19319A92286a18967B73734d12002I2503O418b72281l3463a40659A1949J15343
19309A27292b94103j13809a60941A67011R5277a72034A70712a3372l24724G9405
19298a51062j57158c1651l70I8784O9721d5758k503C45793B1273M9043K62736
$$ y = [-42469, -149105, -169525, 119510, -118433, -96573, -392939, -175754, -234527, 181013, 35963, -106406, -65702, -185018, -226999, 154958, 411509, -161083, -157512, 208451, -17717, -83891, -168550, 29399, 97501, -164554, 292728, -207571, -52676, -244290, -187052, -142209, -131364, -199165, 124344, -72854, -104680, -91255, 69919, 86172, -309968, -124886, -366332, -154736, -315824, -214833, 88920, -471846, -174692, 188448, -45814, -70948, -89520, 8008, -310271, 198812, 192286, -118967, 273734, -412002, 92503, 98921, -272281, -305744, -140659, 11949, 127292, -294103, -407912, -160941, 167011, 262288, -172034, 170712, -13372, -338096, 79405, -151062, -308220, -31651, -32021, 98784, 168505, -45758, -48261, 345793, 21273, 70316, 333052]
19287C33052c3002A10888b45369C14232H114P6830a10798o9380c4901k61037c5690
19275b23139h4908D5173f899j65498j97072a83799m2191G4481j4567a74012p0877
19264b44889i1436b6705E3373J84657c8604A13789a61020K869D63a10606k06916
19253c17522a20787j61881J10479H9976J10904a49423F7002L87173A4843c17547
19242A30117h9608l1974q5818C39346a54837G270a92189Q0008L4178G0487b37556
19230b83221J13174k90261B58424j10081h6598A23475j0111a05392B7366c01836
19219b26392A14450e460k28328J11373b4554j38771P5132D2026c2804k60170B8680
19207G5306c88605i08l8923j63914p1575k18683c5089A35755b83298O7458G5433
$$ y = [333052, -33002, 110888, -245369, 314232, 8114, 84944, -110798, -180178, -34901, -295938, -35690, -223139, -84908, 45173, -6899, -172397, -369469, -183799, -225990, 74481, 59914, -174012, -244889, -91436, -26705, 53373, 238030, -38604, 113789, -161020, -158151, 463, -110606, -317522, -120787, -282668, -172189, 89976, 200880, -149423, 67002, 454175, 14843, -317547, 130117, -89608, -121582, -207400, 339346, -154837, 7270, -192189, -112181, -78003, 70487, -237556, -283221, -170047, -460308, 258424, 148343, -86598, 123475, 113364, -105392, 27366, -301836, -226392, 114450, -5460, -233788, -122415, -24554, -163325, -88193, 42026, -32804, -292974, 28680, 75306, -388605, -908, -39831, -203745, -275320, -494003, -35089, 135755, -283298, -215840, 75433]
19195B16717f3629j63296m03676D6222K08249b46879A2930M6603b82261a35831
19184a25605G055K1476c67462J48922d7437a3257l17257i5333A78723g0382a5433
19172a7509j84776B1752a58652A13081b86199C498a86270A8042J47915G2111l2258
19161C9853a55727B64097o3659b5638E7923j8144Q1599i8026c0257q8934E8641
19149H9752g9153j57494A46573L02696b07438E6710M1653c11429a8661K344k91938
19138c08255l5208A49700d31154a26030A4887c46476J31672R3911A29088J49402
19128B78490A5971e2027j3858I1585K14575H7420m3214a6509j52291m6796M5593
19117a70003j6958D8666b90067N6099F6581a75112j16332B60998c16896Q5512
$$ y = [216717, -63629, -226925, -630601, 46222, 254471, -246879, 12930, 59533, -282261, -135831, -125605, 7055, 28531, -367462, -218540, -47437, -13257, -330514, -95333, 178723, -70382, -15433, -17509, -202285, 21752, -158652, 113081, -286199, 3498, -186270, 18042, 165957, 72111, 39853, -155727, 264097, 200438, -25638, 57923, 39779, 121378, -98026, -30257, -119191, 58641, 89752, -79153, -236647, 146573, 449269, -207438, 56710, 98363, -311429, -18661, -16317, -308255, -343463, 149700, -431154, -126030, 14887, -346476, -214804, -120893, 129088, 278490, 15971, -52027, -65885, 91585, 306160, 87420, 44206, -16509, -168800, -215596, -170003, -186961, 48666, -290067, -233968, 66581, -175112, -291444, 260998, -316896, -231384]
19107b31384P7093G3427b23353K9994d3047l2661r223p6621B13240c42549G7317
19095B38973a62272r9897g117r4685q664q0446B54266G9095j3018J00840B5907
19083A33908M8237b83582N1888f9852o0577j09699A44298J28786e7895A3248a4772
19071h4754J7199E3311O5621K27469i9764k3118n0632A27921n6543d3914j41106
19060a85020a4703A02118b8609A24143b03699A9914I02J13883a57655p5460D1945
19048a4024E1398J17440a02967n3393l8112m5128a12225H3564a242A8501g0923
19036a2708k37558f3316h036q8251m9826C1693J70129a46865B1295a14771M637
19025a10134c3318B89803a16049J9416M4675q3134A29659c20859c0944j06456
$$ y = [-231384, -154291, 73427, -223353, -193359, -43047, -75708, -84931, -161552, 213240, -342549, 77317, 238973, -162272, -262169, -7117, -101802, -110466, -190912, 254266, 79095, 66077, 166917, 25907, 133908, 182145, -283582, -231694, -69852, -130429, -240128, 144298, 273084, -57895, 13248, -14772, -84754, -67555, 53311, 118932, 346401, -99764, -122882, -173514, 127921, 71378, -43914, -185020, -14703, 102118, -28609, 124143, -203699, 19914, 902, 114785, -157655, -233115, 41945, -14024, 51398, 168838, -102967, -156360, -194472, -239600, -112225, 83564, -1242, 18501, -70923, -12708, -250266, -63316, -8036, -96287, -146113, 31693, 201822, -146865, 21295, -114771, -110134, -33318, 289803, -116049, -96633, -51958, -135092, 129659, -320859, -30944, -137400]
19015a37400J2940B511b50371a09527n3073K754r3579A08890J7677a95221N6125
19004a39096B3091R330a02742b6890B97059H0801N9195a93794k7284j5511K0257
18993b16332g9908E7191P3295h4965A51503b31114E6859a45894A88215a66240
18982c61397G4290Q2411f4948A79476J27344G6534C0984J24687D3015J02361k1354
18971A24022P75405k23539j70137A03674O9440a52417j16387B8400a53937A84058
18960d29173J94881q8563b6157A21526d7749A80946a99594f3323k4422l64690
18950d52435E3064Q1825G120K514J90606e7820j70857c5748j02777j46868a33054
18938a2633B18288F8020b45267j70969f9106F487b9476C94411a27788a8829A59027
$$ y = [-137400, -124460, 2511, -250371, -109527, -162600, -159846, -253425, 108890, 126567, -195221, -139096, 23091, 32421, -102742, -26890, 297059, 80801, 139996, -193794, -221078, -236589, -216332, -79908, 57191, 130486, -84965, 151503, -231114, 56859, -145894, 188215, -166240, -361397, 74290, 156701, -64948, 179476, 306820, 76534, 30984, 155671, 43015, 145376, 124022, 899427, 675888, 505751, 103674, 173114, -152417, -268804, 28400, -153937, 184058, -429173, -234292, -322855, -26157, 121526, -47749, 180946, -199594, -63323, -87745, -452435, 53064, 134889, 7120, 9634, 200240, -57820, -228677, -35748, -138525, -285393, -133054, -12633, 218288, 68020, -245267, -416236, -69106, 6487, -29476, 394411, -127788, -18829, 159027]
18926b43448A50865b41294J12755B83975b3598j78472g3711p0511B32809b09010
18915b37281Q554b0815m6169C0022K5596a1620A28521M35488J80892l71658A51558
18903b20797h6808B8330b22251j48504C253Q9668c0070k94498m3729k8083A96736
18891a4857k01077F6269K77113d58590C0784L0812c33171J52275b3544E5955a35046
18879C8948a72565B79866j34102G0567O198i493G4485k1487J32107c06763d4829
18867A8795a5454A57305j6098b11527C05780G1791b61330a16221j09407P4876
18857a50752B66915E2431b39365B69199d0655J4828m9409c7241o3371d1878J8805
18846b3073j29395F7689j8920B1687a76753N7101I4622a01183G9623L60768A32844
$$ y = [-243448, 150865, -241294, -128539, 283975, -23598, -202070, -73711, -144222, 232809, -209010, -237281, -228727, -20815, -66984, 30022, 55618, -11620, 128521, 564009, 744901, 373243, 151558, -220797, -86808, 28330, -222251, -370755, 3253, 92921, -30070, -324568, -368297, -396380, 196736, -14857, -215934, 66269, 343382, -458590, 30784, 61596, -333171, -180896, -23544, 55955, -135046, 38948, -172565, 279866, 145764, 70567, 76765, -9493, 74485, 52998, 185105, -306763, -44829, 18795, -15454, 157305, 141207, -211527, 305780, 71791, -261330, -116221, -225628, -150752, 266915, 52431, -239365, 269199, -40655, -25827, -75236, -37241, -100612, -41878, -23073, -152468, 67689, 48769, 21687, -176753, -119652, 94622, -101183, 79623, 440391, 132844]
18834f2122j24826A17473b60017a04264j73002c8709m3276B55920B1519a53782
18823F7754b47557K1989j80209a14015n00454B08564l1527E2498A9207j347J81234
18812A99094r4912Q3775a40798A9175O9353a69561B46546k2195r4982d0742J9785
18801b0957m4713j81822b2078j84250j21841c1525o6953j86698d475B705J82741
18790A85446J5637k3608a32814A07532b22310D0461J88008b61156i5026M5689
18780d9337m8416L1450J4206m9072j31933B7620c80037c5002k37779Q5110j47228
18769c34899d7658j40992k13694g8572j12694E5095a22162j33451e1018A8654
18758c05540J13143k2123a7539j04181b5307B47500c27168K7336B48681F3623
$$ y = [-62122, -186948, 117473, -260017, -104264, -277266, -38709, -81985, 255920, 21519, -153782, 67754, -247557, -225568, -405777, -114015, -614469, 208564, 177037, 52498, 19207, 17860, 199094, 104182, 187957, -140798, 19175, 88528, -169561, 246546, 224351, 129369, -40742, -20957, -65670, -247492, -22078, -206328, -328169, -31525, -98478, -285176, -4475, 2705, 185446, 201083, 177475, -132814, 107532, -222310, 40461, 228469, -261156, -95026, -49337, -97753, -66303, -52097, -101169, -233102, 27620, -380037, -35002, -272781, -187671, -334899, -47658, -188650, -402344, -78572, -191266, 55095, -122162, -255613, -51018, 18654, -305540, -192397, -214520, -17539, -121720, -25307, 247500, -327168, -299832, 248681, 63623]
18747H3839d69825a34645H4648l1693B2476M33701a10906B9444b73625A53651
18736B6069m717h0175m1978j04757B3843a70201J8562q0236J02960a9398B815
18724B8150J04962E9540b61251J20064C1091a757A19347a47925g1799B56033b10167
18712F7666a92704Q4992A32958L4274c57240i0858r3436Q6751j02002B813e2283
18700g1709B1768a76966L2274E691a34512k05057B3012D632b81099i2086k12416
18689c04502J31959B4488a80157C7458n379a3726k89640a15857j46283D14721
18678G1146f9698I0124c16694R0408A16053h0536k6783I7567L2851i4327j5989
18667a10316n1444F0607a12876a7972l7121A37473g8095q4234e6770B32472B581
$$ y = [83839, -469825, -134645, 84648, 52955, 22476, 456177, -110906, 29444, -273625, 153651, 26069, 21352, -80175, -122153, -226910, 23843, -170201, -151639, -231875, -128915, -19398, 2815, 28150, 133112, 59540, -261251, -141187, 31091, -1757, 119347, -147925, -71799, 256033, -210167, 67666, -192704, -107712, 132958, 167232, -357240, -90858, -184294, -97543, -199545, 2813, -52283, -71709, 21768, -176966, -144692, 5691, -134512, -339569, 23012, 4632, -281099, -92086, -304502, -172543, 24488, -180157, 37458, 32079, -13726, -303366, -115857, -262140, 414721, 71146, -69698, 90124, -316694, -226286, 116053, -80536, -107319, 97567, 130418, -94327, -110316, -161760, 60607, -112876, -17972, -55093, 137473, -78095, -162329, -56770, 232472, 2581]
18655b06189l236e4145B3152E074c85957F2321O4074a17549q0560j86859a16272
18643H3212a01063j29724j63595C17549a53523H6243a43726p7400F6919a43806
18632b5566B3759e3506m7252k6255A99449b48747C74145a4893l95561f6386k07800
18621b74186h7237b6376A9563a45725k66698b06200l2144E3239e6803j56639Q5869
18610a27573k69105A05749b286D92469b08109g0002j65933i1737E064M8284O9400
18599A22748P186B186K9156R2789M3883i9906j90434d7755I3727a97111O211d1396
18586h0033B80749A8928L37767c81064A25964b16023k82563a66555B44168D2624
18575b95581A52179h7293A9241a02499A44839J9785l4204B9991J72951E0599L707
$$ y = [-206189, -209425, -54145, 23152, 5074, -385957, 62321, 126395, -117549, -198109, -384968, -116272, 83212, -101063, -230787, -394382, 317549, -153523, 86243, -143726, -221126, 66919, -143806, -25566, 23759, -53506, -100758, -127013, 199449, -248747, 374145, -14893, -410454, -66386, -274186, -87237, -26376, 19563, -145725, -412423, -206200, -238344, 53239, -56803, -213442, -127573, -396678, 105749, -2286, 492469, -208109, -70002, -235935, -91737, 5064, 53348, 122748, 129934, 2186, 31342, 124131, 168014, -99906, -290340, -47755, 93727, -197111, -190900, -41396, -80033, 280749, 18928, 356695, -381064, 125964, -216023, -498586, -166555, 244168, 42624, -295581, 152179, -87293, 19241, -102499, 144839, 164624, 130420, 29991, 202942, 50599, 54306]
18564E4306J17999f0152m09077e5511j41285A96623r5726J44282A0550a92774
18553b24048a3935C3284a34111j3795K272o6560O1188b5805I2341m1537L13982
18542C64786c5093l04659J26729m4719B3912a49151f5844Q761l640E6243d8150
18530b41580G9953l2287J328g0520n1761o7701e2069A645b57526m5722B57375
18518b75147e6440A5055a20666F907K29027a48931L3018k838A87142a73980E2857
18506c72754h6088k5518A915a8014C3358b7126B05949c58422B4637J53925a23185
18494d15978A49052c9141k76457D6533b55884C14864H795c21623e5642n5132r6219
18483b06993N5647O0624j71562g7773l4687r3731B36691A00482K50549I1969j5671
$$ y = [54306, 172305, -60152, -469229, -55511, -196796, 196623, 100897, 245179, 10550, -192774, -224048, -13935, 33284, -134111, -147906, -145634, -212194, -151006, -25805, 92341, 50804, 364786, -35093, -339752, -213023, -257742, 23912, -149151, -65844, -57083, -60723, 56243, -48150, -241580, 79953, 47666, 48994, -70520, -122281, -189982, -52069, 1645, -257526, -303248, 257375, -275147, -56440, 15055, -120666, 6907, 235934, -148931, -115913, -118751, 187142, -173980, 52857, -372754, -86088, -111606, 1915, -18014, 33358, -27126, 205949, -358422, 24637, 178562, -123185, -415978, 149052, -39141, -315598, 46533, -255884, 314864, 8795, -321623, -55642, -110774, -206993, -151346, -90722, -262284, -77773, -112460, -206191, 236691, 100482, 351031, 91969, 76298]
18472G6298a66817G8933c9890j234j68904P1484a5008n179A98575b13664c0922
18460G7257b57079J5358j30408C34963b41084l32606f570H8170d4713j5832j58940
18449b19485i5218B0894J65454Q3188C2966a5617j10682r568d4044m09546a22503
18437h5734H6745b24270I7562K5307a59144l79300A04043k7403a96482C0183P1204
18426A01387j6417a95656j22514G0625L91800b05476C6916c55743F345J38018
18416A44363i2151J7867f922k9858n828A0572J28124K3530o5490c54C114K5505
18404B8619P9304h5294c9821C59967a00034j17953g939C01295E1173c33868B90156
18392A55839b78289A75143a44952G9879a49116a9488E0415b65894A26470b43440
$$ y = [76298, -166817, 78933, -39890, -41124, -210028, -138544, -15008, -20187, 198575, -213664, -30922, 77257, -257079, -241721, -372129, 334963, -241084, -573690, -6570, 88170, -44713, -60545, -219485, -95218, 20894, 186348, 269536, 32966, -15617, -126299, -135867, -44044, -453590, -122503, -85734, 86745, -224270, 97562, 122869, -159144, -538444, 104043, 76640, -196482, 30183, 101387, 84970, -195656, -318170, 70625, 462425, -205476, 36916, -355743, 6345, 144363, -92151, -74284, -6922, -36780, -42608, 10572, 138696, 162226, 96736, -354, 3114, 28619, 107923, -85294, -39821, 359967, -100034, -217987, -7939, 301295, 51173, -333868, 290156, 155839, -278289, 175143, -144952, 79879, -149116, -19488, 50415, -265894, 126470, -243440]
18381a15609M7655a8006k28155A94469p7562c1980n5783A10856D2689J90373c12848
18369C32946G7309C0469J61585b81001F1431Q1036a14897j01720C5546J03821
18359A39367b66262G9222C3594i6203c0250B74951c93184f5018H8314c49792J15462
18348b34330f8183b0959n5658j31612E1555K17408b75730J35807a8653A19153
18337C54279I0434J19773R377j00388d44979G928a84520k9280k6394J00671n5231
18326a94754C70225B0147b31239a5693q2849j864A68526b06857C11391a7708q1352
18315i9060r6560G181J91389H1794K00314i819B75340a25809A5574e0320A62622
18303i8232A5879c36342j70a46260H6545D090b67220C41167j16290b32374A27929
$$ y = [-115609, -67954, -18006, -246161, 194469, 116907, -31980, -87763, 110856, 42689, 233062, -312848, 332946, 77309, 30469, 192054, -281001, 61431, 142467, -114897, -216617, 35546, 139367, -266262, 79222, 33594, -96203, -30250, 274951, -393184, -65018, 88314, -349792, -234330, -68183, -20959, -76617, -208229, 51555, 268963, -275730, -139923, -18653, 119153, 354279, 90434, 210207, 219584, 119196, -444979, 7928, -184520, -213800, -240194, -139523, -194754, 370225, 20147, -231239, -15693, -98542, -100406, 168526, -206857, 311391, -17708, -99060, -195620, 7181, 198570, 81794, 282108, -9819, 275340, -125809, 15574, -50320, 162622, -98232, 15879, -336342, -336512, -146260, 86545, 4090, -267220, 341167, 224877, -232374, 127929]
18291a24215H1043J62392A17514f3720r4222A2925f8213o1268k43675H1714k5516
18280E6198g1157l2951C15390j52294D763b6902m0219j29458d2735A17771K97324
18269D15095A02548n1154J0867a71716g4498K3130k42213c1368A33499o596a5437
18257D8436M976N1535D9442Q9138a7372G2834a61901O4248j13043f7281a3566
18245b12519I7145f4887C9551b46032N7563c4170A10943O7L5061B6924b201q7004
18233h9205A83202c67397A30569b9242P65A49500a89677d1492j90343f4145A60164
18221a05374A43706h684l2314k27287k83015A610b3662J0135B50220a30037j44759
18210b74796H6528c08246B18432F033b96696A4982c1947j38026D013b04129l1179
$$ y = [-124215, 81043, 243435, 117514, -63720, -157942, 12925, -68213, -129481, -373156, 81714, 56198, -71157, -104108, 315390, 163096, 4763, -26902, -67121, -196579, -42735, 117771, 415095, 102548, 51394, 62261, -171716, -74498, -51368, -293581, -31368, 133499, 126903, -15437, 48436, 53412, 104947, 49442, 138580, -17372, 72834, -161901, -97653, -210696, -67281, -13566, -212519, 97145, -64887, 39551, -246032, -188469, -34170, 110943, 111010, 146071, 26924, -2201, -89205, 183202, -367397, 130569, -29242, -28477, 149500, -189677, -41492, -231835, -64145, 160164, -105374, 143706, -8684, -40998, -268285, -551300, 1610, -23662, -13527, 250220, -130037, -274796, 86528, -308246, 218432, 6033, -296696, 14982, -31947, -169973, 4013, -204129, -235308]
18199b35308a00614c9654B97743o8953a2461j35138N1786C06116A28250b38030
18188A07862Q9990r1127a01556A3395a02677A5384J59885n7579e1777A02784a63617
18176a84313G5053A3724O0922b77347B01729D3601J45014m4177h0876C25520a0660
18164B07209K904n2168c39698a65471M245B22395D8697L9915J15678f02230b71813
18152e7816K626a4063j1938m5632D3022J83035A5018n249h5957B68459b33653
18140b42668D37075B2019J36172b7891A83777A9780e4772j9903k45237B5645a03837
18128c97114M1403A57298a64383D7989c0169j73671h6090A68963i1305q4779K5050
18117a51034b2387C7593e563I5313g2360B1752a46734k28014B9564f8790a4697
$$ y = [-235308, -100614, -39654, 297743, 228790, -12461, -147599, -95813, 306116, 128250, -238030, 107862, 197852, 106725, -101556, 13395, -102677, 15384, 175269, 117690, -51777, 102784, -163617, -184313, 75053, 13724, 74646, -277347, 201729, 43601, 188615, 144438, -80876, 325520, -10660, 207209, 210113, 157945, -339698, -165471, -161226, 222395, 48697, 88612, 204290, -602230, -271813, -57816, -55190, -14063, -26001, -71633, 43022, 226057, 15018, 9769, -85957, 268459, -233653, -242668, 437075, 22019, 158191, -27891, 183777, 19780, -54772, -74675, -319912, 25645, -103837, -397114, -355711, 157298, -164383, 47989, -30169, -203840, -86090, 168963, -91305, -176084, -151034, -22387, 37593, -5563, 95313, -72360, 21752, -146734, -374748, 29564, -68790, -14697]
18105a9742k30594A15577c01992a9036M282A57001b04259p1851e0458J2099A90336
18093F7119b51689f2540D2773a06739a9219j81931n4405B14992Q0343a17971c035
18081A77074a50356h116B84413b45551G3574b63715f7157k44164A60729G5838
18070a05452d7569k6126A40772D6855Q8446E7177J95291k9037n6617b00436H0115
18058F1230A46d7727A51535a61958G9223J74810k4374g6445A55009k0913i7390
18046A39046O8098f0334j4965k2163A20301b23860A35305f659k1163j86550f9681
18034a78028B0752g116A32139a26763A6574b83320N7521a07784d627p9914G559
18022A12114J22852A05607g4783a6828E2209g7822A899N1678a74423D6964J86324
$$ y = [-19742, -250336, 115577, -301992, -19036, -14754, 157001, -204259, -276110, -50458, -38359, 190336, 67119, -251689, -62540, 42773, -106739, -19219, -201150, -255555, 214992, 295335, -117971, -3035, 177074, -150356, -8116, 284413, -245551, 73574, -263715, -67157, -311321, 160729, 75838, -105452, -47569, -73695, 140772, 46855, 135301, 57177, 252468, 223431, 166814, -200436, 80115, 61230, 146, -47727, 151535, -161958, 79223, 254033, 229659, -76445, 155009, 134096, -97390, 139046, 207144, -60334, -75299, -97462, 120301, -223860, 135305, -6659, -27822, -214372, -69681, -178028, 20752, -7116, 132139, -126763, 16574, -283320, -225799, -107784, -4627, -84541, 7559, 112114, 234966, 105607, -74783, -16828, 52209, -77822, 1899, 53577, -174423, 46964, 233288]
18011B33288j10379b8992r9028A89420L0406a72099f4298C14109C2885a01599
18000a55674J5676A55993J37069j10623f8520D22135f1860j57529G0591K39800
17990C10391n8124h9349I0236a92670B02807G9510l8137J14549e5823p1966B01130
17978b59781I8336a62348i237B39592b50966B0355a30936j04804C26453a90095
17967E7656J58637a43419k8685M3759C5853a38649A39031b51492M1067B8673K23894
17956B52567j22261a56272A32499b91902B38706c2391A68412M8664h4974j04608
17946a89582d4787A2104M54757A06750D1502b20510j68006H2072L50552i4275
17935C23970j42118a95402g8648j96605b9j10522q454L8859J3332D4405F679K5421
$$ y = [233288, 122909, -28992, -128020, 189420, 219826, -172099, -64298, 314109, 32885, -101599, -155674, -139998, 155993, 293062, 182439, -68520, 422135, -61860, -219389, 70591, 310391, 252267, -89349, 90236, -192670, 202807, 79510, 41373, 155922, -55823, -127789, 201130, -259781, 98336, -162348, -9237, 239592, -250966, 20355, -130936, -235740, 326453, -190095, 57656, 216293, -143419, -172104, -128345, 35853, -138649, 139031, -251492, -210425, 28673, 252567, 130306, -156272, 132499, -291902, 238706, -32391, 168412, 217076, -84974, -189582, -44787, 12104, 466861, 106750, 41502, -220510, -388516, 82072, 432624, -94275, 323970, 181852, -195402, -78648, -275253, -29, -110551, -119005, -80146, -66814, 44405, 6679, 32100]
17923C2100N9263a45866A00851e7257A81617q2072b01458j5207d6189A68370K38700
17912D07070A82662F1422R507J90477b46113A32673N7740H8238g3607Q590m9555
17901a14572B35208F6895J50082a79744A15321a0416G7579h4194Q871k4878J7481
17890h2720n09800B78807a45828c4423C60963C3553L05677e1281k05093I9620
17879b5247A55605a05890B23067F6508J32602m8102a50088d9616J7247n9404j2502
17868a04275K6289j24881f0144j3292b3005r2935g66F6730c664B28403F1446i829
17855A77046N5420J80959r0130D09a53275d4687D70056k14628M8890a2414k60160
17844b72574B15119G6811a15796E134L72185j61223j3319e4012A64378J04457
$$ y = [32100, 91363, -145866, 100851, -57257, 181617, 99545, -201458, -216665, -46189, 168370, 407070, 182662, 61422, 70929, 261406, -246113, 132673, 190413, 88238, -73607, -65017, -114572, 235208, 66895, 216977, -179744, 115321, -10416, 77579, -84194, -75323, -100201, -82720, -592520, 278807, -145828, -34423, 360963, 33553, 339230, -51281, -256374, 99620, -25247, 155605, -105890, 223067, 66508, 199110, 151008, -150088, -49616, -32369, -91773, -104275, -77986, -202867, -60144, -73436, -23005, -115940, -766, 66730, -3664, 228403, 61446, -9829, 177046, 232466, 413425, 323295, 409, -153275, -44687, 470056, 255428, 304318, -12414, -272574, 215119, 76811, -115796, 5134, 377319, 216096, 202777, -54012, 164378, 268835]
17834B68835j1029e5204a3434k03261D8577K50082I9045b884E8994P4102E2559
17822h0820A26926a81664r8785D0108M1681L6748M9201o001J57274H2420L01413
17811C83833b24827A76420J46499j25559M6006K92297f3240A61752M0785b784
17800b51082D390f94A58446k9579a06011G2201J3365m1487k176a92466P0004I3064
17787A12137i7040L3638k30489H5968l7946L3972a56657d0250C17492F4571a70523
17775A58137A4382J25566a19546B03700m2229m0709n5905J36767N3757F2519a55008
17763C0490a52804k76731A65564o5687d3350k13690J01756B79302F2948b42550
17752A62902E1888b35334B88955A08634R638l6196k6576R359M2844K24121A4846
$$ y = [268835, 257806, -55204, -13434, -216695, 48577, 298659, 99045, -2884, 58994, 133096, 52559, -80820, 126926, -181664, -280449, 40108, 81789, 118537, 167738, 161737, 319011, 82420, 383833, -224827, 176420, 322919, 197360, 243366, 535663, -63240, 161752, 202537, -2784, -251082, 4390, -694, 158446, 128867, -106011, 72201, 85566, 44079, 41903, -192466, -122462, 93064, 112137, -97040, -63402, -293891, 85968, 48022, 81994, -156657, -40250, 317492, 64571, -170523, 158137, 14382, 139948, -119546, 203700, 161471, 120762, 64857, 201624, 255381, 62519, -155008, 30490, -152804, -429535, 165564, 99877, -43350, -257040, -155284, 279302, 62948, -242550, 162902, 51888, -235334, 288955, 108634, 118272, 82076, 55500, 64859, 107703, 331824, 14846]
17740g2727B18138c5149B64103m3165K39840a13679C38845b1753A25485E2617
17729a22571j81040C99068H727a54680C3023K82246g2292j24339A9764a40666
17718C25322i5522K2795A20012K22655j43360b6075j43429b8046B22547c81089
17707a84350M7785M6212B66290I7992N8481J61960a11537r49q9212E1617J27678
17696A79295L02557C6244b00452c4271I4327b98276A31463a71737E5518J0261
17686F5779R135J43456C2453c8089A63704a0152j03602D9678K48150a73472d2602
17674f3247A46330O6488H4523d4481A11926i5549B86996b4861B90107a55950B80721
17662b33211f6728H5216B0872a5861C5208J89574A4937L27921c7074g357B03489
$$ y = [-72727, 218138, -35149, 264103, 220938, 460778, -113679, 338845, -21753, 125485, 52617, -122571, -303611, 399068, 8727, -154680, 33023, 315269, -72292, -196631, 19764, -140666, 325322, -95522, -72727, 120012, 342667, 199307, -26075, -169504, -28046, 222547, -381089, -184350, -136565, -90353, 266290, 97992, 156473, 318433, -111537, -112486, -201698, 51617, 179295, 481852, 36244, -200452, -34271, 94327, -298276, 131463, -171737, 55518, 65779, 74914, 218370, 32453, -38089, 163704, -10152, -113754, 49678, 297828, -173472, -42602, -63247, 146330, 212818, 84523, -44481, 111926, -95549, 286996, -24861, 290107, -155950, 280721, -233211, -66728, 85216, 20872, -15861, 35208, 224782, 14937, 342858, -37074, -7357, 203489]
17650B22409b96352A03470K37058h7474K4862F3102R1153a46501O3041c6843A35575
17638B85553A29279J33209N5917A29953D3128e672G861b06980B42398K911G5471
17626B73579I4971e9916B82929l1624J57968A74725M881A9658a7055j4727A82630
17614A45380o5685k4009B5658N0256J77633K2290A12806k2967f3964B26973c1669
17602C66065A393J49604K18251q0997q3937a99585C4253j3086R4835J2764K39318
17591C68084f309I3410Q1746g1080B23601J9948D3229J12313J57292j55970A2452
17579C0926N2699a02084m0034A14720e455B04265R4548A37632L4405o5577j8372
17568H8088N2314O048k1133A4254M5026a54358B99580G7605M1179J67528A22942
$$ y = [222409, -296352, 103470, 340528, -87474, -62612, 63102, 154255, -146501, -83460, -36843, 135575, 285553, 129279, 262488, 318405, 129953, 43128, -5672, 7861, -206980, 242398, 245309, 75471, 273579, 94971, -59916, 282929, 251305, 409273, 174725, 179606, 19658, -17055, -31782, 182630, 145380, 79695, 55686, 25658, 75914, 253547, 275837, 112806, 89839, -63964, 226973, -31669, 366065, 1393, 150997, 369248, 288251, 204314, -199585, 34253, 21167, 116002, 128766, 368084, -6309, 93410, 175156, -71080, 223601, 243549, 43229, 155542, 312834, 156864, 12452, 30926, 83625, -102084, -142118, 114720, -5455, 204265, 298813, 137632, 172037, 106460, 88088, 140402, 146450, 125317, 14254, 59280, -154358, 299580, 77605, 118784, 286312, 122942]
17556b7760A11454K5098N0975g3736A03487P4482D7068J16921b63359A0971K16904
17545B27875J8946J96595j14530m8183c9591C57140q0694K12423j12876k4719
17535C51274E7931K33709a05671A05037e7479D43075J13441A97373N06936j17758
17525E86551Q10090k7327m98793R2285j7456C96267N5294J32693k8057A53253
17514G09640k75545A49773N52474j33387L27611J40919J58036j65585j88544j16088
17504G25209C14900N9013J56356j11980A80783J31175C3332L24107G6394Q0734
17494A57128b83866C38832N4185k7509r6929a49566C41828L8156l0909K14036
17484E63111B73885J36612K33571A67743M08098k05811R6953A64472O1258K48902
$$ y = [-27760, 111454, 136552, 187527, -73736, 103487, 177969, 47068, 163989, -263359, 10971, 227875, 246821, 443416, 328886, 280703, -39591, 357140, 276446, 488869, 375993, 351274, 57931, 291640, -105671, 105037, -57479, 443075, 556516, 197373, 704309, 586551, 1396641, 1369314, 870521, 962806, 945350, 396267, 451561, 584254, 556197, 153253, 709640, 434095, 149773, 702247, 568860, 896471, 1037390, 1195426, 1029841, 841297, 725209, 314900, 373913, 530269, 418289, 180783, 311958, 33332, 357439, 76394, 157128, -283866, 338832, 393017, 365508, 268579, -149566, 341828, 379984, 349075, 563111, 273885, 410497, 644068, 167743, 575841, 370030, 466983, 164472, 225730, 474632]
17474D74632E0922J43592G1169J82777o9508M09337B85377L7972q8306P038n7664
17463A84417a2569G9856K15300J54527n7653O62p0386R7670A91567q3141a24232
17451A04044C6603L11793L07354G6380J06204K83915j01355G4619A6642K06414
17441B23056J16957Q0482G4716N37490k83139I8406m8608N05337k46007B0538
17430A29586K0927J34767P5574p5665J37836A92363N6639Q0687K92155k44912
17420C76932r3341l3070h730F08973A074M01105k158k5634O5415J94685j02269
17409E32218M6887J7550k03534A34357K32670j55914n0410K52694A94410K31250
17399D25660A76990K5405j4111i2225D13276A39470J90805A7784J51488N960R3488
$$ y = [474632, 50922, 194514, 71169, 253946, 184438, 593775, 285377, 323349, 235043, 242081, 184417, -12569, 79856, 295156, 449683, 392030, 392692, 322306, 419976, 191567, 108426, -124232, 104044, 36603, 348396, 655750, 76380, 182584, 466499, 365144, 74619, 16642, 223056, 340013, 420495, 74716, 612206, 329067, 98406, 49798, 555135, 309128, 20538, 129586, 150513, 285280, 360854, 285189, 423025, 192363, 249002, 329689, 621844, 376932, 283591, 250521, -8730, 608973, 1074, 402179, 400021, 374387, 439802, 634487, 532218, 579105, 596655, 393121, 134357, 367027, 211113, 160703, 413397, 194410, 425660, 176990, 202395, 188284, -92225, 413276, 139470, 330275, 17784, 169272, 175232, 268720]
17388B68720k7354q4082J15960J47322J461A17105a19675B32132a06438B46045
17377B78856P7492J0728p3991a72651g320D58390j84659J27930B8388K18977C6090
17365B62601N9865a2636B75327L7178K07575C7841L45747f6392C17429A075L10898
17354C11973L922I1941b33048a940C04138l56j12523N3517j12936L97456A04441
17342D36166B01565R3774A38014a83524F3404L86111P7894o0503A71719K1330
17332A93049p2933k5063J45282J59022C5611L49907A67685J08083K51178A8257
17321C25760m556e4644B83755N0878J498L13727j89259A68012J83551H8699L25403
17310D14102A49417m5928K82017f9246B62355J07853L3392J88248j92386a85981
$$ y = [268720, 241366, 157284, 273244, 420566, 422027, 117105, -119675, 232132, -106438, 246045, 278856, 356348, 367076, 293085, -172651, -7320, 458390, 273731, 401661, 28388, 247365, 36090, 262601, 322466, -12636, 275327, 312505, 520080, 37841, 383588, -66392, 317429, 1075, 311973, 315895, 91941, -233048, -1940, 304138, 303782, 191259, 244776, 131840, 529296, 104441, 436166, 201565, 295339, 138014, -183524, 63404, 449515, 527409, 466906, 171719, 193049, 120116, 95053, 240335, 399357, 35611, 385518, 167685, 275768, 526946, 18257, 325760, 321204, -54644, 283755, 334633, 336131, 649858, 460599, 168012, 351563, 88699, 414102, 149417, 103489, 385506, -69246, 262355, 370208, 403600, 591848, 399462, -185981]
17299D17768k08795L0090k9833f0917E36409k22389j37704L43910k8848L0201
17289E21579A57769K16439D3336L84404l5834h4250D13840j88066J10377G6845
17278B15253K49831k29800Q887m9045R6304A16586m6959K78126a04115B44731
17267A57031D5029L17877j25211K66715j68391K4162r2821h0227A37879K08043
17257C45922R9718p4768G9320M4065N15411A29456K82381J21815k49714J40582
17247D24520j01164H2335K52382M063m8232K25440o7523q8753A2425P04811j44633
17236E72603k81596P3238K41302j25721B20826m1342O5233J12109R2558j15132
17226C34252K10354j97308J92646r1100A91936l9607R015K87145J2959o4106n710
$$ y = [417768, 208973, 239063, 209230, -60917, 536409, 314020, 176316, 520226, 491378, 521579, 157769, 374208, 43336, 427740, 391906, -84250, 413840, 225774, 336151, 76845, 215253, 465084, 235284, 244171, 195126, 291430, 116586, 69627, 347753, -104115, 244731, 157031, 45029, 362906, 237695, 504410, 336019, 360181, 267360, -80227, 137879, 345922, 445640, 370872, 79320, 123385, 638796, 129456, 411837, 533652, 283938, 424520, 323356, 82335, 334717, 338780, 290548, 515988, 448465, 359712, 12425, 717236, 572603, 291007, 364245, 605547, 479826, 220826, 179484, 244717, 356826, 449384, 334252, 544606, 347298, 539944, 448844, 191936, 152329, 161344, 448489, 461448, 397342, 391632]
17215C91632M46239k54322A23698K27129l1005K72135l2423q1230m2020K83581
17205G19865A96584P41R8225L28137m6140J61956a05521C4107K21650K17324J66753
17194F39834p1865j36362r6711K43967j09045j41582K59308J41300C64114J77051
17184E41165j932B31928O9789O7434j20219R8622K90300n7420k52909J20951K9327
17173D77803k5109K12780l29094L45830l10440J26865J70726l28978l2161J00057
17163D08279j10324K06943j5521j86734M34785C41143J20090c8640F28599k80644
17153C47955M94302C82666r7146J37229N2068j71599J91063m2661n8057j77697
17143B15866L50115k80310L23387j13931K43305k05085k29790K05222J37181J09483
$$ y = [391632, 837871, 583549, 123698, 350827, 319822, 591957, 559534, 478304, 436284, 719865, 196584, 197325, 295550, 623687, 577547, 739503, -105521, 34107, 255757, 473081, 639834, 567969, 431607, 334896, 578863, 469818, 328236, 587544, 728844, 364114, 541165, 539233, 231928, 301717, 369151, 248932, 347554, 637854, 580434, 327525, 448476, 477803, 452694, 665474, 336380, 682210, 371770, 498635, 669361, 340383, 308222, 408279, 297955, 504898, 489377, 302643, 737428, 341143, 461233, -38640, 628599, 347955, 842257, 382666, 285520, 422749, 474817, 303218, 494281, 451620, 393563, 215866, 565981, 285671, 609058, 495127, 738432, 533347, 303557, 508779, 645960, 755443]
17133G55443C71660M98853D28717q3188L35878j72778Q0874P1887m7778k07601
17123D06011M16479p1112L98B03086L2570M09584J3370k38598L43489l47002L10549
17112G27048q1322k27743J70964K16173j76151k20113K92405N4698l4818j85693
17102E35448K44656j10782L1233B12430M53428k21357J78195J76469q0903j29031
17092E89231L37268k29120k19170M52106j18478k71598K99476l14350O6466J87017
17082G78848k44559L51214m30068K74619k3748J77484m22231Q2167M2924K19911
17072H06561j86788j61965J92205k01138L71061J73841Q2344D98801K88084m3451
17062G43434L28692j21468l40226K66303Q9271k63172k59815L70751k82446L1077
$$ y = [755443, 371660, 870513, 428717, 345529, 681407, 508629, 589503, 661390, 613612, 406011, 822490, 751378, 751776, 203086, 235656, 645240, 658610, 420012, 763501, 416499, 727048, 645726, 417983, 588947, 805120, 628969, 408856, 701261, 755959, 721141, 535448, 780104, 669322, 700555, 212430, 665858, 444501, 622696, 799165, 718262, 589231, 926499, 697379, 478209, 930315, 811837, 540239, 839715, 525365, 591831, 778848, 534289, 885503, 455435, 730054, 706306, 883790, 461559, 543726, 586650, 806561, 619773, 457808, 650013, 448875, 819936, 993777, 1076121, 498801, 786885, 743434, 1072126, 950658, 610432, 876735, 966006, 702834, 443019, 813770, 531324, 562401]
17052E62401J59463q2387N87197k31486j06663M7305j84044K48427m1580l10920
17042F47713O43J82400Q7397j71069M022J44459O917m2030J6800J36116j46284
17031H67084O7479K83830j63673k59076J85868k98864M98272J354k42909J57105
17021A096470m14312M50810j33421j44059L78024k58333K7111J55955l79271L98300
17011A177274j12739J04142k03936O4022k01941N51799m03459K61280m8269P4607
17001A262780O7833k42611k27143K91939m4637J78309k84529K55125p111O6190
16991A316145K26993L2346j97951k25265j2513j85179M62285j55293q0043K69837
16981A451362r0133J22551J14160n96628M93200r4856J26526j42979J05060q9246
$$ y = [562401, 721864, 639477, 1226674, 995188, 888525, 935830, 751786, 1000213, 958633, 647713, 648356, 830756, 918153, 747084, 751106, 895565, 902482, 860452, 877252, 1013368, 867084, 934563, 1218393, 1054720, 795644, 981512, 682648, 1180920, 1182274, 939365, 1096470, 682158, 1132968, 999547, 855488, 1233512, 975179, 1002290, 1158245, 778974, 1177274, 1064535, 1168677, 964741, 1028763, 826822, 1378621, 975162, 1236442, 1188173, 1262780, 1330613, 1088002, 860859, 1152798, 1108161, 1286470, 1001941, 1257066, 1249955, 1316145, 1543138, 1575484, 1377533, 1152268, 1139755, 954576, 1416861, 1261568, 1181525, 1451362, 1361229, 1483780, 1597940, 1001312, 1494512, 1399656, 1526182, 1383203, 1488263, 1399017]
16971A399017J75227j1003k73400J37658J96040j04955K16546l27192J87468k5110
16961A570296j16792j15432j6450K38327j32943M04636l31346L35553R1206l06836
16951A620219P621l6725j0236K34156j24841K46541q5333j21523R9970k49320
16941A580529L08628J01414p8864o1408J21113q3992M4747J453K985Q1724L2047
16930B050376j96714L20026j51514J19349J27768R9127j93942n70855N57620k0458
16920B140783J76849j47064L30990j17905J3679L03556k81565m8244K26030j91447
16910B405662m5564k822J93171j54529R4916Q7891O4520J18811J07566j33297
16900B736325L45710k76381k56201O41453m26713J65049N6676P6929J22224k18459
$$ y = [1399017, 1574244, 1563241, 1289841, 1427499, 1623539, 1518584, 1735130, 1407938, 1595406, 1570296, 1453504, 1338072, 1321622, 1559949, 1427006, 1831642, 1500296, 1835849, 1927055, 1620219, 1627840, 1591115, 1580879, 1815035, 1690194, 1936735, 1851402, 1729879, 1829849, 1580529, 1889157, 1990571, 1911707, 1850299, 1971412, 1887420, 1932167, 1933620, 1936605, 2018329, 2050376, 1853662, 2173688, 2022174, 2141523, 2269291, 2368418, 2174476, 1603621, 2161241, 2140783, 2317632, 2170568, 2501558, 2383653, 2397332, 2700888, 2419323, 2371079, 2597109, 2405662, 2360098, 2357276, 2550447, 2395918, 2490834, 2578725, 2643245, 2762056, 2869622, 2736325, 3082035, 2805654, 2549453, 3190906, 2764193, 2929242, 2985918, 3062847, 3185071, 2966612]
16890B966612m0610K64194J54368r6299k37074M95601j92556J67269j32948O2217
16880C410774J41146p8546r8583J69156J01542k7365L25154j42015J13950l1700
16870C883513O0575K75746j10824k4586K44550j2942j479k40105J41358J25718
16860D341524K59695j45906l2775j1618K76141k2037K86577j39150K30293q8287
16850D954457J79609J67512j72572J10699L76148r1364J09754P2319N9602K16505
16840E982669j44106J35423Q5490J27063J13522k3925K28249j0922L32327K1468
16830F847258J13899L41550r5478J58678K20389N49411m15476L05536k89198M30775
16820H167344j4079O09978K44250m1826J79614J05624m7865P1046N91570L37965
$$ y = [2966612, 2926002, 3190196, 3344564, 3248265, 3011191, 3506792, 3314236, 3481505, 3348557, 3410774, 3551920, 3473374, 3374791, 3543947, 3645489, 3618124, 3943278, 3801263, 3915213, 3883513, 3944088, 4219834, 4109010, 4084424, 4328974, 4316032, 4314553, 4074448, 4215806, 4341524, 4601219, 4455313, 4422538, 4410920, 4687061, 4665024, 4951601, 4812451, 5042744, 4954457, 5134066, 5301578, 5129006, 5239705, 5615853, 5524489, 5634243, 5706562, 5766164, 5982669, 5838563, 5973986, 6059476, 6186539, 6300061, 6276136, 6504385, 6493463, 6825790, 6847258, 6961157, 7302707, 7207229, 7365907, 7586296, 8135707, 7720231, 8025767, 7736569, 8167344, 8153265, 8763243, 9007493, 8965667, 9145281, 9250905, 9203040, 9274086, 9865656, 10203621]
16810A0203621J22149J80244K97436k02863J77344Q06043l6625L53764j29672
16801A1771441N57948K43964K21552M41848K93492O14465k60306P74645J1414
16792A4670463L56151L59022M02891Q86440k06132O18280N63443K29954Q26873
16783A8707385M31473N30483J28180O50158O52643N56501P43679Q20458O68376
16774B3889336M58505P71411N90507P64485J015406R59121N36136J143186R32904
16765C1060997O72811J215326J260737O45127J167543J729993Q84447J035451
16757C9672432J807214J244373J524863J535213J729363J802206J285489K080630
16749E2681783J800926J957372J789975K223981K219580J989366K360062K466848
$$ y = [10203621, 10325770, 10506014, 10803450, 10600587, 10777931, 11583974, 11547349, 11901113, 11771441, 12329389, 12573353, 12794905, 13236753, 13530245, 14144710, 13884404, 14659049, 14670463, 15026614, 15385636, 15788527, 16674967, 16468835, 17087115, 17650558, 17880512, 18707385, 19138858, 19669341, 19797521, 20447679, 21100322, 21656823, 22400502, 23220960, 23889336, 24347841, 25119252, 25709759, 26474244, 27489650, 28448771, 28984907, 30128093, 31060997, 31733808, 32949134, 34209871, 34854998, 36022541, 37752534, 38636981, 39672432, 41479646, 42724019, 44248882, 45784095, 47513458, 49315664, 50601153, 52681783, 54482709, 56440081, 58230056, 60454037, 62673617, 64662983, 67023045, 69489893]
16741F9489893K451768J928151K509614K413894K768113K312154K207285K636256
16733H8717128K454267J894753K500069K243288J809709K354387J243335J470756
16725A04687692J664660O83802R81284M95247N51727r90j88005o41121o32374
16716A07601922o04942j475493j282428j709447j535422j939499k375098k034547
16708I4645046k299099k015510k825363k565496k486770k313643k333821k510718
16700G5294626k461120k859820j861870k197253k322734k359631j890492k222073
16692E7119633j889432j817391k028309j802338j433609j730212j724381j644152
16684D3049809j229907j300451j548687j159795j592996j064620j152817q64270
$$ y = [69489893, 71941661, 73869812, 76379426, 78793320, 81561433, 83873587, 86080872, 88717128, 91171395, 93066148, 95566217, 97809505, 99619214, 101973601, 103216936, 104687692, 106352352, 107036154, 108017438, 108512685, 109064412, 109063422, 108875417, 108234296, 107601922, 106996980, 105521487, 104239059, 102529612, 100994190, 99054691, 96679593, 94645046, 92345947, 90330437, 87505074, 84939578, 82452808, 80139165, 77805344, 75294626, 72833506, 69973686, 68111816, 65914563, 63591829, 61232198, 59341706, 57119633, 55230201, 53412810, 51384501, 49582163, 48148554, 46418342, 44693961, 43049809, 41819902, 40519451, 38970764, 37810969, 36217973, 35153353, 34000536, 33136266]
16676C3136266j127245j000811o93461j219798r32157r13573o84330j228944j60821
16667B5175126q79210m61350p59720r42940n36262o37367o54895n22196l46533
16658A9434653n26113o38636n24882p0601q37585l57507k91423n31213l09470
16649A5347223m25899m16051j28393n66895m07981J06350n12142m59708l42552
16640A2193952k8532k68980m12954l64004j96323K5892k28234l79703n26620p0959
16630I743535Q6912k06774n47773j57274K9843j81505l67678K09135q7524j63634
16620H357263k58127l55812j10433j02713J51767k90242l17237K12728l06175
16611F981019k96819k49654J62264k43351k53247J70291l72091k66068L03700
$$ y = [33136266, 32009021, 31008210, 30314749, 29094951, 28162794, 27249221, 26564891, 25335947, 25175126, 24295916, 23834566, 23074846, 22131906, 21595644, 20958277, 20303382, 19781186, 19434653, 18908540, 18269904, 17745022, 17674421, 16836836, 16479329, 16187906, 15656693, 15347223, 14921324, 14505273, 14376880, 13809985, 13402004, 13508354, 12996212, 12536504, 12193952, 12165420, 11896440, 11483486, 11119482, 10923159, 10949051, 10720817, 10341114, 9814494, 9743535, 9830447, 9623673, 9075900, 8918626, 8948469, 8766964, 8399286, 8608421, 8520897, 8357263, 8099136, 7743324, 7632891, 7530178, 7681945, 7391703, 7074466, 7287194, 6981019, 6684200, 6434546, 6596810, 6353459, 6100212, 6270503, 5898412, 5632344, 5936044]
16602E936044j3991k15146k16411L89647p24208K48339J31902n77206K39982N0202
16592E249154O5105l19484n9148k65782K8722j24552j76015K74878j57916j42469
16582D372493K43524j72737k12569o3115L7545j79127j53377J00202O9367k20676
16572C821530K88490l1455l00066J78753l46251L916j15647R7992K3998J11538
16562C732798o19944M34484o91174N22505n21086N91069k41409k74943p2340j71526
16552B688434J46464M8298l40823J95976P174P4863l07075j1024p541R1462j11253
16541B474955l8944L59689j53215j37521j87198R2369l48313L40029K6410O0122
16531B488383j73562J61178l48483M3374n1060J36904O9372l91087J07872q594
$$ y = [5936044, 5922053, 5706907, 5490496, 5880143, 5155935, 5404274, 5536176, 4958970, 5198952, 5249154, 5314259, 4994775, 4935627, 4669845, 4698567, 4574015, 4398000, 4672878, 4514962, 4372493, 4616017, 4443280, 4230711, 4167596, 4205141, 4026014, 3872637, 3972839, 4042206, 3821530, 4110020, 4078565, 3778499, 3957252, 3611001, 3614917, 3499270, 3597262, 3621260, 3732798, 3112854, 3547338, 2856164, 3378669, 2857583, 3448652, 3207243, 2932300, 2859960, 2688434, 2834898, 2883196, 2542373, 2738349, 2745523, 2820386, 2513311, 2502287, 2494746, 2586208, 2474955, 2436011, 2795700, 2642485, 2504964, 2317766, 2410135, 2061822, 2401851, 2428261, 2488383, 2314821, 2475999, 2127516, 2170890, 2119830, 2256734, 2326106, 1935019, 2042891, 2034297]
16521B034297K18104m47513K55835J10019K0659m05938L28921m09189M22279M8645
16511B176119j51157k74528L18687n1035k37012R3194m1691k5628r4599K18469
16501A930819p1317j41787Q2936j10440J32268k38098N5072n6072p6990j08911
16491A397480J13859P3446j00694K17109k52444j75433K31495j90908M75210o01666
16481A187454K46261k3575J3107l7228J99178k69581j08203k85999O67993l33339
16471A256068j03067K1310J84774N1972q4706P8923j80440J28105K21330k35611
16461A338658p0851l17507K86623q15k01882j5091J40606l8880m9130L50650k84916
16450A137465J88758k88898M8033k13817K94359J24251P4476k50581k12934J43565
$$ y = [2034297, 2252401, 1804888, 2060723, 2170742, 2191401, 1785463, 2114384, 1705195, 2127474, 2176119, 2024962, 1750434, 2069121, 2018086, 1781074, 1874268, 1832577, 1806949, 1712350, 1930819, 1859502, 1717715, 1800651, 1690211, 1822479, 1584381, 1639453, 1583381, 1506391, 1397480, 1511339, 1584785, 1484091, 1701200, 1448756, 1273323, 1504818, 1313910, 1789120, 1187454, 1433715, 1410140, 1423247, 1386019, 1585197, 1315616, 1207413, 921414, 1589407, 1256068, 1153001, 1174311, 1359085, 1411057, 1326351, 1405274, 1224834, 1352939, 1574269, 1338658, 1267807, 950300, 1236923, 1236108, 1034226, 1019135, 1159741, 1120861, 1071731, 1422381, 1137465, 1326223, 1037325, 1085358, 871541, 1165900, 1290151, 1364627, 1114046, 901112, 1044677]
16440A044677J63367j57731O2078J61682k03638l2974j18871j14281J19762O4076
16430I88147J19284j03819l30762J01841n9466J1219K09696J15420J04830l62879
16420G93511j08451N41010j68431K09768k45195k3344K9116k59527K67420j2038
16410A023839j07256k03659N62696k40727j44751j82845j21944K96543D20371
16400H57921k96590L73367k2606J66137l54340j8883K21374p0809m23708o5095
16390C66768L55824j0044K16444k02258l22624K29204O6622r2136J88530k05435
16380E90895O09625D78128J66354m7407l9052L40068m43853R3064j24655L19013
16370G41660k22714J76790L2377J9685j21901N0141J46584k03573J59060B84843
$$ y = [1044677, 1208044, 1050313, 1112391, 1274073, 1070435, 1037461, 918590, 804309, 924071, 988147, 1107431, 1003612, 672850, 774691, 715225, 726444, 936140, 1051560, 1156390, 793511, 685060, 1226070, 1057639, 1267407, 1022212, 998868, 1027984, 768457, 1035877, 1023839, 916583, 712924, 1275620, 1034893, 890142, 707297, 585353, 881896, 420371, 857921, 561331, 934698, 912092, 1078229, 723889, 705006, 926380, 855571, 431863, 366768, 722592, 712548, 928992, 726734, 404110, 633314, 699936, 607800, 796330, 590895, 1200520, 478128, 644482, 597075, 558023, 898091, 454238, 547302, 422647, 741660, 518946, 695736, 728113, 747798, 625897, 676038, 822622, 619049, 778109, 284843]
16359G55666l13148J35050l483B03894J17823K79352N6822k58530M23739l87132
16349D35968j41255K48362J00315N6887j09195o7735k49673K91326J85485k17201
16339E33284n7655J1488j46787J08479K02240m1527n6283J74600C39705m3487
16329B96218P4120r2299J49264J54661j13310J1308K49672B71621k0202M31297
16319F82716B00007R4654J34771M02077j21062j96248Q2197J14757k06519B36487
16308E22453n1266J852J37956P9345k06694A18784O23965A01674K63490K54052
16298F19216j16968M0593K91889l55342A10001N76414j69073P6559J45523B72797
16287E00226M26A65498L01588A91035M55385A78747l2814C8957Q8204M37351O6844
$$ y = [755666, 442518, 577568, 574085, 203894, 321717, 601069, 657891, 399361, 823100, 435968, 294713, 543075, 643390, 700277, 591082, 523347, 273674, 565000, 750485, 533284, 475629, 487117, 340330, 448809, 651049, 609522, 553239, 727839, 339705, 296218, 370338, 278039, 427303, 581964, 468654, 479962, 729634, 271621, 251419, 682716, 200007, 294661, 429432, 831509, 710447, 514199, 596396, 711153, 504634, 236487, 522453, 471187, 473039, 610995, 690340, 483646, 118784, 742749, 101674, 365164, 619216, 502248, 542841, 834730, 479388, 110001, 686415, 517342, 593901, 739424, 272797, 500226, 500652, 165498, 467086, 191035, 646420, 178747, 145933, 38957, 127161, 564512, 631356]
16276F31356B88773K72069j61136n0807q8222J8941M21575a6850C35144K89452
16266F24596A31071K57230p3780n2624K15885J17241B19438K13125L9057E834
16255B68224L5770J08389j70946J88661p4911L265J01724O2129k22334J51428
16245D51399R4011B64963q0710B5098L17773q5937J519F8955K70046j68794j0603
16234A59604J75609A44059M9442R9725J28479H3221R4480L77469k37034H8485
16223C74052n985k2559j45624J28282j18029K71527a57196A64926K93667j75305
16213B83288A30151J20846J24689A58183K66023o4178Q6962j63999a46803C15940
16202e3842B94361J27590j4359A73794K41462j92983J66055j24865N3682H3749
$$ y = [631356, 288773, 560842, 399706, 348899, 260677, 279618, 701193, -16850, 335144, 624596, 131071, 388301, 314521, 261897, 477782, 595023, 219438, 432563, 471620, 5834, 268224, 303994, 412383, 241437, 430098, 355187, 358452, 460176, 522305, 299971, 451399, 545410, 264963, 184253, 25098, 342871, 256934, 258453, 68955, 339001, 170207, 159604, 335213, 144059, 193501, 293226, 421705, 83221, 177701, 555170, 318136, 88485, 374052, 368067, 345508, 199884, 328166, 210137, 481664, -157196, 164926, 458593, 283288, 130151, 250997, 375686, 158183, 424206, 360028, 446990, 282991, -146803, 315940, -53842, 294361, 421951, 407592, 173794, 415256, 222273, 388328, 263463, 317145, 83749]
16191A14269L52504A2317K82128q9757j4335J8627F4769L9730m2989K83623j33333
16180B11800K99716B01948e5419A31794J87545A2040K64096N5826H9344N28662
16170F18006B10026P1838k7869J45605a72877C90386J0309j46699H4411a40048
16159A09863A6853L17453A25747J18410l3470n6693Q9998j7148H4129i5246b8899
16147F6937d7965e286k14222I1743B7011J04136J52134l1701a23953E8381a2546
16135B03077n2615c7011A4204J78559E4957a04433E72731A52304F6813J30372
16125A97185g0171B40350L9503A14451j0911L46912k24751b4841C04168j31857
16115A72311N2101m9448J99987A3490K00172B1812R7519J15703D1301n767J21849
$$ y = [114269, 466773, 12317, 294445, 204688, 190353, 208980, 64769, 104499, 61510, 345133, 211800, 511516, 201948, -55419, 131794, 319339, 12040, 276136, 331962, 89344, 618006, 210026, 281864, 253995, 399600, -172877, 390386, 400695, 253996, 84411, -140048, 109863, 16853, 334306, 125747, 244157, 210687, 153994, 243992, 226844, 84129, -95246, -28899, 66937, -47965, -5286, -219508, 91743, 27011, 131147, 283281, 251580, -123953, 58381, -12546, 203077, 150462, -37011, 14204, 192763, 54957, -104433, 572731, 152304, 66813, 197185, -70171, 240350, 279853, 114451, 103540, 450452, 225701, -24841, 304168, 172311, 224412, 174964, 374951, 13490, 213662, 21812, 119331, 235034, 41301, 35534, 157383]
16104A57383N1060a32327B07711b06437I7958a68360C97468G3563a61302j17628
16094b78930Q4713a3421A16352J7225N3777d31444A12709A5709J40208c0915I314
16082a22515j42544m8474A62793K29737a32709N2311B01901a5003E2431o212G065
16070A15544K69O4434J03794e6760k80807a29042C73037A68649k2340a13502j20753
16059b34255A46418j5535a45654A55982M1310a05922k31316B02440a96744f3416
16048f4007N163A77405a41504J2242A94395a32389p49j38943A70889l8168F6203
16036i0146A38389J83092n2994A27396b89588O1676A973b80641h5989A07304D3403
16024B27667J5973A6551M3882k8642J60369C9853M1156b80429A466R5146D4836
$$ y = [157383, 208443, -132327, 207711, -206437, 97958, -168360, 397468, 73563, -161302, -278930, -194217, -13421, 116352, 133577, 187354, -431444, 112709, 15709, 155917, -30915, 9314, -122515, -265059, -313533, 162793, 392530, -132709, -80398, 201901, -15003, 52431, 46219, 7065, 115544, 115813, 180247, 284041, -56760, -337567, -129042, 373037, 168649, 146309, -113502, -234255, 146418, 130883, -145654, 155982, 197292, -105922, -337238, 202440, -196744, -63416, -64007, -58844, 177405, -141504, -129262, 194395, -132389, -133138, -272081, 170889, 132721, 66203, -90146, 138389, 321481, 268487, 127396, -289588, -227912, 1973, -280641, -85989, 107304, 43403, 227667, 243640, 16551, 60433, 31791, 192160, 39853, 81009, -280429, 1466, 96612, 44836]
16012H1976k0182a17372E2557a28349B897L27148E9774b31044I4649G153K09924
16001B17077C5403L12890I6160C293K40097b29393B76741a67496L8200E2308a06357
15989D25060J02857N5718P2300N19368J80753M3026m51374r1166l22686j89141
15979C44715G2216J23659R5232a20001A1603J19884c0859E8941J94037a83138
15968C16855j35147a20505c5872H9219N6245b89072A70346Q1751o2316a00619
15957H7797D1725J94798n2773a60207N5096M4138B97595b37246J17847E4351K06829
15946B61180j24351a05142O513E4207p319f9833F5479M3945b59206B06924b17598
15934D1332d0602B88353b05067b0343r6473B36584j06498c1649j10255f9482j68068
$$ y = [81976, 61794, -117372, 52557, -128349, 2897, 330045, 59774, -231044, 94649, 7153, 217077, 35403, 348293, 96160, 3293, 243390, -229393, 276741, -167496, -129296, 52308, -106357, 425060, 527917, 583635, 655935, 1175303, 1356056, 1399082, 947708, 856542, 533856, 344715, 72216, 195875, 291107, -120001, 11603, 131487, -30859, 58941, 252978, -183138, 316855, 181708, -120505, -35872, 89219, 145464, -289072, 170346, 252097, 189781, -100619, 87797, 41725, 236523, 183750, -160207, -105111, -60973, 297595, -237246, -119399, 54351, 261180, 136829, -105142, -98629, 54207, 46888, -69833, 65479, 109424, -259206, 206924, -217598, 41332, -40602, 288353, -205067, -20343, -116816, 236584, 130086, -31649, -141904, -69482, -237550]
15923b37550B7321c783A74418K2450F1668g5680n8816I1649K49901E4994c25790
15911c22015e3365H6424F144a11252j15847B14215e6214B19607G8379k6758a59604
15899A2599M01314b20614A96245a59570c4622A78876h1449k95775A35276o1042
15889G4234a26435j95397R5507A09778J36856a97803O3567d8585j9945B63352
15878a7248A68329b46522H8352J9111m4613L9967a05224C08021a71737C10982
15867d1321G6577a67396A27748A8981d601A7781f8346E9082b10275A01556J58445
15856B60001c39169C1205J12003Q747Q0406O5047D7609a36247q4199j11047f9482
15844a79957A85865a69361d6385B15371a10168C08145b8483A26165A82J53814
$$ y = [-237550, 27321, -3783, 174418, 196868, 61668, -75680, -134496, 91649, 341550, 54994, -325790, -322015, -53365, 86424, 6144, -111252, -227099, 214215, -56214, 219607, 78379, 51621, -159604, 12599, 413913, -220614, 196245, -159570, -34622, 178876, -81449, -377224, 135276, 74234, -126435, -321832, -226325, 109778, 246634, -197803, -134236, -48585, -68530, 263352, -17248, 168329, -246522, 88352, 107463, 62850, 102817, -105224, 308021, -171737, 310982, -41321, 76577, -167396, 127748, 18981, -4601, 17781, -68346, 59082, -210275, 101556, 260001, -339169, 31205, 143208, 151955, 232361, 297408, 47609, -136247, -220446, -331493, -69482, -179957, 185865, -169361, -46385, 215371, -110168, 308145, -28483, 126165, 182, 153996]
15834A53996L4691q531E6007h6126j08846h6216D2893c10291E7085a76320j85230
15823c61550b6080l9976C0398a07771c2171j31358B76641g9250C8532j4632a28761
15811a08082M0467l6102B2711a53227I9464c2214B30159a44617A60831m3896b05508
15799B41019a75389j2484H5932M3260b63729f155k62771G1510O7934J06914D7964
15787b47068J09762k4432j94336A02832a10322n0679C47956G9873c62783A23219
15776a32278B7991d7030n7641j74317K342K6292A71768h7625K4804e933o2092
15765f8025A54027B2220L3498L7821l7397g0834c81B85810A38685k7319a8802
15753d5939F6524e9284F4473K14638c08248L4774F3140g7980A00360j3816J74785
$$ y = [153996, 188687, 180156, 56007, -86126, -194972, -86216, 42893, -310291, 57085, -176320, -361550, -26080, -66056, 30398, -107771, -32171, -163529, 276641, -79250, 38532, 23900, -128761, -108082, -67615, -103717, 22711, -153227, 99464, -32214, 230159, -144617, 160831, 116935, -205508, 241019, -175389, -187873, 85932, 129192, -263729, -6155, -268926, 71510, 139444, 246358, 47964, -247068, -137306, -161738, -356074, 102832, -110322, -161001, 347956, 79873, -362783, 123219, -132278, 27991, -47030, -104671, -278988, -276646, -250354, 171768, -87625, -62821, -5933, -68025, 154027, 22220, 55718, 93539, 56142, -70834, -381, 285810, 138685, 111366, -18802, -45939, 66524, -59284, 64473, 279111, -308248, -273474, 63140, -77980, 100360, 86544, 261329]
15742B61329a92683A86416J659J8816a43253c0540B8691K52358a1297F0536M0659
15731A01195L52563c23345A8497c4270j19764I3061f0474o5990n51983D10894
15720D3138a75638A7472K45386f973l31471J63992B25712d1144k95809a54119
15709a27457n2017n8878A74904b58487A35013J01242f3331o0908f2118F5009R49
15698F5958J48533c53185J75422h474D6150b58302d3779D555J38388g6168l7196
15687a13364e5747l1766k45671A78665k479a3392j57465A90727c526A35280c27805
15675a76171h41l03364E6973J12283M4055b04501C60892d14460D410M20437a45701
15663c22053A95137B6215a12138j3785P856A42287k8909K170b23544I2597a16637
$$ y = [261329, -192683, 186416, 188075, 206891, -143253, -30540, 28691, 281049, -11297, 60536, 101195, 453758, -323345, 18497, -34270, -154034, 93061, -60474, -126464, -678447, 410894, 43138, -175638, 17472, 262858, -6973, -338444, -174452, 225712, -41144, -336953, -154119, -127457, -179474, -238352, 174904, -258487, 135013, 236255, -63331, -124239, -62118, 65009, 65958, 214491, -353185, -177763, -8474, 46150, -258302, -43779, 4555, 142943, -76168, -113364, -55747, -87513, -333184, 178665, 176186, -13392, -170857, 190727, -3526, 135280, -327805, -176171, -841, -304205, 56973, 169256, 213311, -204501, 360892, -414460, 4410, 424847, -145701, -322053, 195137, 26215, -112138, -125923, -118067, 142287, 113378, 115548, -223544, 92597, -116637]
15651c0417A35114a33101d3997G818b01360A5494b30707E9094e0758m23867b05722
15639G8136a13363D57089F7440P7794a73613l2149O2250k0064m4920O2877G2816
15627G9365d248E7536N0713a85351a5994l58543A49899K01402E1437j5136g0771
15615c198q2439l35022J76288A49097m789J54696G3889f030C64404d6145H9981
15603E7129a30195J8349i512A88022M888J3284m1700l4361b24941f3703j71587
15592b35290R783C50658A52334a43856l1014E2779i1896j39991A26224i3160j1136
15581a04296l6737B45344n3857g9269A29603b86962A19515i5949B2001J11795
15571A33796b24009d4380q7672B06089I2107c447k01991m9776c4765J1730j34823
$$ y = [-30417, 135114, -133101, -43997, 7818, -201360, 15494, -230707, 59094, -50758, -474625, -205722, 78136, -113363, 457089, 67440, 145234, -173613, -205762, -143512, -163576, -208496, -145619, 72816, 79365, -4248, 57536, 108249, -185351, -15994, -374537, 149899, 351301, 51437, 36301, -70771, -3198, -85637, -420659, -244371, 149097, 144308, 299004, 73889, -6030, 364404, -46145, 89981, 57129, -130195, -111846, -9512, 188022, 192910, 206194, 164494, 130133, -224941, -63703, -235290, -225507, 350658, 152334, -143856, -174870, 52779, -91896, -231887, 126224, -93160, -104296, -141033, 245344, 191487, -79269, 129603, -286962, 119515, -95949, 22001, 133796, -224009, -44380, -132052, 206089, 92107, -3447, -205438, -255214, -34765, -23035, -157858]
15560a57858B78262a38010O7817B35062F3459d1182A23051g77A68251C2308J00480
15549A32788a4826q3030B10076a93087g5912B97896I1611j8179l6445L87874a74856
15537B10310f7648b3622j18635l7556M5850j9060D7493d84903D8045K9435h1654
15525a69030C54356A26333K06417G9150j9644K37117a32975C41546L1699A24931
15514A64128B3544M9152K07771o8087k0145J43466l8102j20682J05254j35250
15504A46921L365b7389B23783o7675B3865i4659C18216A54207B7138K86230c38664
15492A98460g4542B89949f7421m2101A58574a81822A79889j3753J48888q6045
15482B28979r6476L0380D5488J43522B9082K66484I2468K47815K30362J4750J39467
$$ y = [-157858, 278262, -138010, -70193, 235062, 63459, -41182, 123051, -777, 168251, 32308, 132788, -14826, -97856, 210076, -193087, -75912, 297896, 91611, 73432, 36987, 424861, -174856, 210310, -67648, -23622, -142257, -179813, -133963, -153023, 47493, -484903, 48045, 77480, -81654, -169030, 354356, 126333, 332750, 79150, 59506, 296623, -132975, 341546, 373245, 124931, 164128, 23544, 72696, 280467, 212380, 192235, 335701, 297599, 176917, 282171, 146921, 150286, -27389, 223783, 156108, 23865, -94659, 318216, 154207, 27138, 313368, -338664, 198460, -74542, 289949, -67421, -109522, 158574, -181822, 179889, 166136, 315024, 228979, 132503, 162883, 45488, 189010, 29082, 295566, 92468, 340283, 570645, 585395, 724862]
15471G24862A85966i3185B18903d7491A33020a02399d3396E8104J08164b49540
15460A11356J60494c9999O231A58715c82067D0971J79277E4916e302j53258f0948
15448B89385B9990J29554a80398A43269J24163l9360L6700J170804L0948m47899
15438A018625k96376k47108A36974E090K85677a42949j6651B873i6562j54450
15428b51012j15405D5965b37051J3407B02240b33250A97750g8458F1480J91662
15418B53142a85520g7639E0820c36495B35680a89773D02492j28834p1291a43256
15407D1735h5897o0223H7070d9235E2472i9991M5133A33958b05720M4035j02988
15396b64673A7880J48981c4820A11727P9064c55001D9929c4358A06746N1613J64185
$$ y = [724862, 185966, -93185, 218903, -47491, 133020, -102399, -43396, 58104, 166268, -249540, 111356, 271850, -39999, -33768, 158715, -382067, 40971, 220248, 54916, -5302, -158560, -60948, 289385, 29990, 159544, -180398, 143269, 267432, 228072, 264772, 1435576, 1466524, 1018625, 722249, 475141, 136974, 5090, 290767, -142949, -159600, 2873, -96562, -251012, -366417, 45965, -237051, -223644, 202240, -233250, 197750, -78458, 61480, 253142, -185520, -77639, 50820, -336495, 235680, -189773, 402492, 273658, 202367, -143256, 41735, -85897, -146120, 87070, -49235, 52472, -99991, -54858, 133958, -205720, -161685, -264673, 17880, 166861, -34820, 111727, 190791, -355001, 49929, -34358, 106746, 158359, 322544]
15385C22544b51091C43219C8941K8941g6696b3542G6253l4954C980f3110I7730
15373a62457C95439j93584m9345e5636A97668K98221a57941D902J85817J8384
15363B09103p2696a500j48198A81794a00050A86068F2866K16424o4000a12152
15352B00098l1871q554c504C34625r5833e587B50095a91169C10273c3823I397
15340B20128K66761k26270q4588a719H9354O2380g5433J4809A81877B1683J2906
15329C4589K15582Q5808g9890E3435M7550Q4701J9398E3042K04921i2686A92006
15317C23639r961A2628L76873a76546d9377k97701a47929i662D2515M9356C5599
15305A64442F3633L25595a61173A66539o9629L3232f600G5065K34937a63424B97070
$$ y = [322544, -251091, 343219, 38941, 67882, -76696, -23542, 76253, 41299, 3980, -63110, 97730, -162457, 395439, 201855, 152510, -55636, 197668, 495889, -157941, 4902, 190719, 209103, 136407, -1500, -149698, 181794, -100050, 186068, 62866, 279290, 215290, -112152, 200098, 168227, 159673, -3504, 334625, 238792, -5587, 250095, -191169, 310273, -33823, 9397, 220128, 486889, 260619, 176031, -1719, 89354, 151734, -75433, -60624, 181877, 21683, 34589, 250171, 335979, -79890, 53435, 100985, 185686, 205084, 53042, 257963, -92686, 192006, 323639, 313678, 12628, 389501, -176546, -49377, -347078, -147929, -9662, 42515, 91871, 35599, 164442, 63633, 389228, -161173, 166539, 96910, 130142, -6600, 75065, 310002, -163424, 297070]
15293a6282A14690Q8984i5809E1794f6853n0692B3117N7217a39256f2629B08613
15281a57207C0732p34i9488A5781g6712D4451J6679L24568a6399A46348R5930
15270B42278D7999e5887l2274B60868A06578L308a22157f0344j70906C476J07308
15259A10784b3463F9785M434N9800A3647A763P3839M9726E9258K73658F5948a05292
15246A74494J41024j51660L51133J77626M06670R31352p22290L76413k43212C67852
15235C06277F4024k5927O130j1973K16136j13497J12871J18623j33284a02794
15224F1301c3113l0538j02524C0494b64066C71812E9075J48797K8201j16173c9539
15212A36875O1375n9791o2642B5015N2004N2002j4963J03461G0601K0637b36263
$$ y = [-16282, 114690, 203674, -95809, 51794, -66853, -117545, 23117, 80334, -139256, -62629, 208613, -157207, 30732, 29998, -99488, 15781, -76712, 44451, 61130, 385698, -16399, 146348, 242278, 47999, -55887, -88161, 260868, 106578, 109886, -122157, -60344, -231250, 3476, 110784, -23463, 69785, 74219, 134019, 13647, 1763, 75602, 125328, 59258, 332916, 65948, -105292, 174494, 315518, 163858, 514991, 692617, 1099287, 2030639, 1308349, 1684762, 1441550, 367852, 306277, 64024, 38097, 44227, 32254, 248390, 134893, 247764, 366387, 233103, -102794, 61301, -33113, -63651, -166175, 30494, -264066, 371812, 59075, 207872, 236073, 119900, -39539, 136875, 198250, 138459, 75817, 25015, 77019, 129021, 114058, 217519, 70601, 91238, -236263]
15200E6423B0641k616H7a34110N7134C8016N9461J25684K2621A2414Q9420J64367
15188B66201B7292J55813a65763L475O7920G8810b66265B22383G0757d6827L902
15177d2925B42178j02391i9085j56753D7737R3049D4409i9719J8372A43445L00838
15166D44283A21137Q4071D3592j7444K31931r1886H1614Q9135M6996R1224a35927
15154C47795M1514b08388P6881A34031J0499n9270J01805J82622b70427B58281
15143D34488A85813E2278b84966G8714J15632b0684n7967A65092K74035I7408
15132G7789K57785a20332A24756K0086g5033H8453M3886M5864p1393a14359k97314
15121d11673A91507k2074k8275K4242N5594n5799g563o8012A42279o8450l3602
$$ y = [56423, 20641, 18025, 87, -134110, -76976, 38016, 97477, 223161, 245782, 12414, 101834, 266201, 27292, 183105, -165763, -162288, -94368, 78810, -266265, 222383, 70757, -46827, -42925, 242178, 139787, -99085, -255838, 47737, 140786, 44409, -99719, -81347, 143445, 444283, 121137, 205208, 43592, 26148, 258079, 166193, 81614, 170749, 217745, 308969, -135927, 347795, 389309, -208388, -131507, 134031, 144530, 85260, 187065, 369687, -270427, 258281, 434488, 185813, 52278, -284966, 78714, 194346, -20684, -78651, 165092, 439127, 97408, 77789, 335574, -120332, 124756, 144842, -75033, 88453, 132339, 178203, 106810, -114359, -411673, 191507, 169433, 141158, 165400, 220994, 165195, -7563, -75575, 142279, 73829, 40227]
15110D0227a15223G9127p370a46167A39650k4698C0793b11913G8374l3012j2891
15099C2471J67062K6395M3050h3231C15002K57170b39449A91822R601E9579M3700
15088A03279L1364K7129D9021Q4071c5573B7383K54344H6511b2620B11111G7729
15076C81728A74493J75560c92755A60444Q1721K6656q383J90133c5092A14509
15065C80066q4869o1587A12607N7208p6992p140j3760J49778L46208j61530K81152
15054F87531D7310K15038O3493O8340K45574B17783J63045j3925J12883j83257
15044B96529j06106L24710q1357J20014A67417K30415J12661J04532A88702L06018
15034D94720B29954l3531L17624j46481K67618j43692j06051L95075o595q1514
$$ y = [40227, -115223, 79127, 71757, -146167, 139650, 114952, 30793, -211913, 78374, 45362, 32471, 199533, 225928, 268978, -83231, 315002, 572172, -239449, 191822, 201423, 59579, 103279, 134643, 161772, 49021, 133092, -35573, 27383, 281727, 86511, -22620, 211111, 77729, 381728, 174493, 350053, -392755, 160444, 242165, 268821, 260438, 450571, -35092, 114509, 380066, 295197, 233610, 112607, 169815, 92823, 85683, 71923, 221701, 567909, 406379, 687531, 47310, 262348, 325841, 394181, 639755, 217783, 380828, 366903, 479786, 296529, 190423, 515133, 433776, 553790, 167417, 397832, 510493, 615025, 188702, 494720, 229954, 196423, 514047, 367566, 635184, 491492, 385441, 780516, 773921, 692407]
15024F92407C43491L01949k13815A60066P21844l58225j35213A70334J66078J17248
15014D53660j36872O7732C6603M08318A69889K50743L0451J53026k45671P7371
15004D35809j89547J35251Q037A36081K65149J77259j9827r3060m5542q0786O2656
14993D01930A62813L86323B32611M50008j69046j27182p7710M24589k60356K79924
14983G52838j92077k25269Q95309C33999N81179R681C47742j18924L65875K28881
14973H23574l35850l90J92433m7391J0942j11014B16052J21513J18977B20107
14962C15162L665j22064K1216j00882L81919c0427F8302A8505K47408L03159k54728
14951C14344L8385K7980l1926o954K22642k21708A68817L99925J82039p0073j30454
$$ y = [692407, 343491, 645440, 431625, 160066, 881910, 523685, 388472, 170334, 336412, 453660, 316788, 384520, 36603, 444921, 169889, 420632, 451083, 604109, 358438, 435809, 246262, 381513, 389550, 136081, 401230, 578489, 558662, 465602, 420060, 339274, 401930, 162813, 549136, 232611, 682619, 513573, 386391, 308681, 733270, 472914, 752838, 560761, 335492, 1230801, 333999, 915178, 924859, 347742, 228818, 594693, 823574, 487724, 487334, 679767, 632376, 643318, 532304, 216052, 337565, 456542, 220107, 315162, 318827, 196763, 217979, 117097, 499016, -30427, 68302, 18505, 265913, 569072, 314344, 352729, 380709, 348783, 341829, 564471, 342763, 168817, 568742, 750781, 680708, 550254]
14940E50254n8205j47165N5042O5885K07357K17653m15272J59823J87373J82451
14930A005196K39551l7528j14957L33901J46225J81483j61086J80754n79546L19554
14920A513547j64750O93002p3542J50886M01037l88297o44993l06307K27205m21784
14910I86004J50070D25460K73627o0820C10427K68801j90399j24015p7141O3061
14900B50734b5137D36275K84474B73557K55750p5620j8208j32317Q2387J44554
14890E30103k34535N32084l49345K31570N2372j49283R6164j24424L87903J13957
14880A086566l35018J26117j90023K32468k45883q0333J8745k04676J6034j21118
14870C02879R8821M3693K34770J45514j86505J36356J35443l86193K02688k20952
$$ y = [550254, 492049, 344884, 399926, 465811, 673168, 890821, 475549, 635372, 822745, 1005196, 1244747, 1207219, 1092262, 1426163, 1572388, 1753871, 1592785, 1773539, 1193993, 1513547, 1348797, 2041799, 1968257, 2119143, 2520180, 2131883, 1486890, 1180583, 1407788, 986004, 1136074, 425460, 699087, 638267, 310427, 579228, 388829, 264814, 187673, 250734, -25137, 436275, 720749, 273557, 529307, 453687, 435479, 303162, 385549, 530103, 295568, 827652, 478307, 709877, 762249, 612966, 709130, 584706, 972609, 1086566, 751548, 877665, 687642, 920110, 674227, 593894, 612639, 407963, 423997, 302879, 401700, 445393, 680163, 825677, 639172, 775528, 910971, 524778, 727466, 506514]
14860E06514R6567j97770J1280A85862D8832R9493K20169n6304L37514k66093
14850C83611M51696k04462k54830K52940K83266j50124K30632N2513M1450Q3224
14840A169916m02093L36126n18496J00895O856K8545k18977B50015N02217l74952
14830C77280J86560A01975K83374K1288p2383L47096j00076j08642J75337L3057
14820F81026k18472J73667K65833j25244k36888J89156Q3951k67478L4091j44160
14810D35482K47794R7325j57619M09155M6331o4668k07518L2530K45709D10557
14799A72165L25407k13983K48296J99441o1604l27948P424L47854j75578k58824
14789B62650j14653P34499j85181C09142M85301k39559j71786J61921J67920O829
$$ y = [506514, 603081, 405311, 416591, 185862, 48832, 148325, 368494, 312190, 649704, 383611, 835307, 630845, 376015, 628955, 912221, 762097, 992729, 1045242, 1086692, 1169916, 767823, 1103949, 585453, 686348, 693204, 721749, 502772, 250015, 752232, 377280, 563840, 101975, 385349, 406637, 334254, 681350, 581274, 472632, 647969, 681026, 462554, 636221, 902054, 776810, 539922, 729078, 813029, 545551, 579642, 435482, 683276, 780601, 622982, 1032137, 1078468, 1013800, 806282, 838812, 1084521, 410557, 172165, 497572, 283589, 531885, 731326, 669722, 341774, 349198, 697052, 521474, 262650, 147997, 882496, 697315, 309142, 794443, 554884, 383098, 545019, 712939, 719768]
14779G19768K5975m0596L21632o4167p8919r5758k42546O2764J44014r1015n0487
14768F10665J66646l56510K58559J67525k46550n6041J87255j88186J64910j05934
14758F02339N9661j51494J00415J92079k27056j20609L59057o0612C09430J54903
14748D64333L65540k10024N6386j74588K4766J43404j46332K4719K10341J69141
14738I27686C27268K84468K31325j46528P8211j08863M27050k76842K53380K18364
14728A287833K05198K839M70942l54046l35511n6195k81173n7593J48716l82451
14718F48559P5401Q5282k25378J55408j52193J09234J84393O0247q6658p1336
14708G82959K34571m2755J74850J50416O5517N5353J80349K21579r4435o0557
$$ y = [719768, 745743, 705147, 1026779, 962612, 883693, 787935, 545389, 608153, 752167, 661152, 610665, 777311, 420801, 679360, 846885, 600335, 544294, 731549, 543363, 708273, 602339, 662000, 510506, 610921, 803000, 575944, 455335, 814392, 753780, 309430, 464333, 829873, 619849, 676235, 501647, 526413, 669817, 523485, 548204, 758545, 927686, 327268, 611736, 843061, 696533, 774744, 665881, 1092931, 816089, 1069469, 1287833, 1493031, 1495870, 1966812, 1612766, 1277255, 1221060, 939887, 882294, 1031010, 648559, 723960, 809242, 583864, 739272, 587079, 696313, 880706, 940953, 854295, 782959, 1017530, 974775, 1149625, 1300041, 1365558, 1420911, 1601260, 1822839, 1728404, 1667847]
14698A667847m87589m61337J50595m9999N40268k37511l32503M2164j11225Q9036
14688H09746P7687j31161K07490l33678M53744k91944j98138J50541k08422L40989
14678H76854k34135j75982N46603l88528L20120k36652K19304o8985O0989l35464
14668E84124n5497M57267k43520K72741l14142J47977l0216k17180K24830J02569
14658I28953Q5524K08249n75532L99542m15111O47404L52011p7256n34624j25160
14648H94000L50145j34885k8927j98265M62725m91214M32355l74398J0138o2150
14638H59524M6431J22798l2056K38029j29740j48251K98014l92203M23248k47518
14628A038276J57066l90390M11284l2551J70114j48653l4074r4735o5655K09451
$$ y = [1667847, 1180258, 718921, 869516, 819517, 1359785, 1122274, 789771, 831935, 720710, 809746, 887433, 756272, 963762, 630084, 1083828, 791884, 593746, 744287, 535865, 876854, 642719, 466737, 1013340, 624812, 944932, 708280, 927584, 858599, 919588, 584124, 528627, 985894, 742374, 1015115, 700973, 848950, 818734, 601554, 826384, 928953, 1014477, 1222726, 647194, 1046736, 631625, 1279029, 1631040, 1553784, 1019160, 894000, 1244145, 1109260, 1080333, 882068, 1344793, 853579, 1285934, 911536, 921674, 859524, 905955, 1028753, 996697, 1234726, 1104986, 956735, 1254749, 862546, 1285794, 1038276, 1195342, 804952, 1216236, 1183685, 1353799, 1205146, 1171072, 1076337, 1010682, 1220133]
14618A220133m28942J37099L03125r4586j38529L44615r8136J15092L9005k21096
14608A177780Q7930L9819k8614j52601L97017J31018p07296K14295K01476L4992
14598A395816m3613j11254O1618J72091l18064L11861j74388r9418J99442K17362
14588A611453p2562N3773l360n237K38526K22930m31983K08705l14149K89760
14578A797856k47032J83876K2509k46472K88694J04576J61677l62613L57784l64852
14568A696003L18964k78555K11055j18699J55091L21782j3194m89291M39751L11532
14558B554439l71595K39536P9289J21051L08389L12216Q6426O18595R91431J760034
14548F699811K941602P158496J7653387J4236554B0333663F563037l246275o19230
$$ y = [1220133, 791191, 928290, 1231415, 1136829, 998300, 1342915, 1244779, 1359871, 1398876, 1177780, 1265710, 1305529, 1276915, 1124314, 1521331, 1652349, 945053, 1159348, 1360824, 1395816, 1352203, 1240949, 1302567, 1474658, 1156594, 1468455, 1294067, 1194649, 1394091, 1611453, 1538891, 1592664, 1589304, 1584067, 1822593, 2045523, 1613540, 1822245, 1508096, 1797856, 1550824, 1734700, 1757209, 1510737, 1799431, 1904007, 2065684, 1703071, 2060855, 1696003, 2014967, 1736412, 1947467, 1828768, 1983859, 2305641, 2292447, 1803156, 2242907, 2554439, 2182844, 2422380, 2501669, 2622720, 2931109, 3243325, 3329751, 3948346, 4939777, 6699811, 9641413, 16799909, 34453296, 48689850, 20333663, 6563037, 3316762, 2697532]
14540B697532l64233o4942N10046K388608j516051j563201k46263K86801m52667
14531A675630J0798K20074J21411o6848j97083K9969k01405Q06875l96026j45290
14521A858105J7766J45304K7115K0997l4612Q1873K37619j87276L00765j41996
14511B325660J5116m7604k7110J44345J04930J03936j41029j96110N80200l34400
14501B527934J29675o373n9079L26553M11941n99098L48687k66351J91437J8595
14491C023921J21414k52045M39498r1032j91887k27590k3419L47914J90688j10270
14481C227192M77329l67199l4524k2187J66167J45106j13938K41996l37699J68843
14471C551086l13371K63446L44317j44914L19491j17148K71740j70557j73415
$$ y = [2697532, 2333299, 2268357, 2778403, 5167011, 3650960, 2087759, 1841496, 2128297, 1675630, 1686428, 1906502, 2027913, 1961065, 1763982, 1793951, 1592546, 2399421, 2003395, 1858105, 1875871, 2021175, 2048290, 2069287, 2034675, 2116548, 2354167, 2166891, 2467656, 2325660, 2340776, 2293172, 2266062, 2410407, 2515337, 2619273, 2478244, 2282134, 2862334, 2527934, 2657609, 2651236, 2592157, 2918710, 3330651, 2731553, 3080240, 2813889, 3005326, 3023921, 3145335, 2893290, 3332788, 3241756, 3049869, 2822279, 2798860, 3146774, 3337462, 3227192, 3704521, 3337322, 3302798, 3280611, 3446778, 3591884, 3477946, 3719942, 3382243, 3551086, 3237715, 3501161, 3845478, 3700564, 4020055, 3902907, 4174647, 4004090, 3830675]
14462C830675K57801j267l5419o3360J48660K0485K29166j94818J90890j16282
14452D266531K85149J62530L0474n9560J43298j78580L57810j12774j12648K52138
14442E034368j0989j08459M30804j82349K28893o1166M1240K47249Q6618J04087
14432E810296j71958O66420n05605L2783J95268K40741l15097M95608j27297K24087
14422F545246M31106J66164K09561j74592J91463q1229J54831k43962L92126o0726
14412G529988J93168Q9811o8610J52865J86037L15668K00116J87997J84899j56370
14402H815569K65374n3171r9890J01043M50507r2739J03350L39672N35878K10843
14392A0576436j65962J04236K49106J21900L69753q1376K42137O23205J99222
$$ y = [3830675, 4088476, 4087209, 4051790, 3988430, 4137090, 4157575, 4386741, 4191923, 4382813, 4266531, 4551680, 4714210, 4744684, 4685124, 4828422, 4649842, 5007652, 4894878, 4782230, 5034368, 5023379, 4914920, 5345724, 5163375, 5392268, 5331102, 5372342, 5619591, 5706209, 5810296, 5638338, 6304758, 5799153, 5831936, 6027204, 6267945, 5952848, 6448456, 6321159, 6545246, 6976352, 7142516, 7352077, 7177485, 7368948, 7287719, 7442550, 7198588, 7590714, 7529988, 7723156, 7812967, 7744357, 7897222, 8083259, 8398927, 8599043, 8787040, 8971939, 8815569, 9080943, 9027772, 8927882, 9028925, 9479432, 9386693, 9490043, 9829715, 10365593, 10576436, 10410474, 10514710, 10763816, 10885716, 11255469, 11174093, 11416230, 12039435, 12238657]
14383A2238657o215M58717K12813K37576N24976p65304O34297L18566L19384K18695
14373A4392162K71570K89321M57814J47082K63789O54678r0876R25446M2678K76820
14363A7630484k8972L31296O19094L1315O92233N81410M64744M31378J86024P16504
14353B1655510M09049M32559M01423J022984K34841P68516P57765O79141O07543
14344B6969331O29218R90128N78909Q75778O74281J215648O20323R66208R27973
14335C4447797J266324O33945J268702R94917J188797J344167J458426J511716
14327D4114791J343289J384295J459420J753334J905702J682231K257362K085996
14319E7986420K035472K067614K221684K598236K319797K991611K555551L202750
$$ y = [12238657, 12232442, 12691159, 12903972, 13141548, 13666524, 12901220, 13535517, 13854083, 14173467, 14392162, 14663732, 14953053, 15410867, 15557949, 15821738, 16476416, 16385540, 17310986, 17353664, 17630484, 17601512, 17932808, 18551902, 18583217, 19275450, 19856860, 20321604, 20752982, 20939006, 21655510, 22064559, 22497118, 22898541, 23921525, 24156366, 24924882, 25682647, 26361788, 26969331, 27598549, 28588677, 29167586, 30043364, 30717645, 31933293, 32553616, 33519824, 34447797, 35714121, 36348066, 37616768, 38611685, 39800482, 41144649, 42603075, 44114791, 45458080, 46842375, 48301795, 50055129, 51960831, 53643062, 55900424, 57986420, 60021892, 62089506, 64311190, 66909426, 69229223, 72220834, 74776385, 77979135]
14311G7979135K974989L769844L574271M042044L534787M380103M866461N009678
14303A10131312N181154N436473O125949O256852O911916O586304Q299527Q040187
14295A62969674Q730630R168371J0251371J0422510J1323421J1912563J2227961
14288B37006501J3384975J3636279J4574908J5127792J5479916J5659273J6395675
14281C41265319J6544228J6303896J5882221J5561758J4624055J3398908J1118801
14274D44699186O975917L279979K398621R53364J100042l39875m509870m610616
14266D49946748q673554j0827893j2224956j3540680j4563747j6125143j6724881
14259C57265894j6766499j6798980j6095691j5639903j5194373j4628979j3759877
$$ y = [77979135, 80954124, 84723968, 88298239, 92340283, 95875070, 100255173, 105121634, 110131312, 115312466, 120748939, 126874888, 133131740, 140043656, 146629960, 154929487, 162969674, 171700304, 180868675, 191120046, 201542556, 212865977, 224778540, 237006501, 250391476, 264027755, 278602663, 293730455, 309210371, 324869644, 341265319, 357809547, 374113443, 389995664, 405557422, 420181477, 433580385, 444699186, 451675103, 454955082, 457353703, 458307067, 459407109, 459067234, 454557364, 449946748, 441273194, 430445301, 418220345, 404679665, 390115918, 373990775, 357265894, 340499395, 323700415, 307604724, 291964821, 276770448, 262141469, 248381592]
14252B48381592j3435935j2862846j1548545j1395158r652929q594829r934227
14245A70957123q696332p869732p383770p426543o523053o687337o012960n248241
14237A15109155m814884m939276m835145m285895m388853m112445k911609k973725
14229H1847323l978819l278056k450861l015876k724968k324076k392845k283709
14221E9398113j997637k155476j245901k227462j907900j770134j366115j305652
14213D5421836o80108j600131j781612j232827j383755r38826m04722j257731
14205C6142124j216752j142832j143980q33850n21481k95095j442984n46207r61282
14196B8037661o91755p62071n31531q74601j75995q78256p08187m21600n48424
$$ y = [248381592, 234945657, 222082811, 210534266, 199139108, 189486179, 180891350, 170957123, 162260791, 154391059, 147007289, 139580746, 133057693, 126370356, 120357396, 115109155, 110294271, 105354995, 100519850, 96233955, 91845102, 87732657, 84821048, 81847323, 77868504, 74590448, 72139587, 69123711, 66398743, 64074667, 61681822, 59398113, 57400476, 55245000, 53999099, 51771637, 49863737, 48093603, 46727488, 45421836, 44741728, 43141597, 41359985, 40127158, 38743403, 37804577, 37399855, 36142124, 34925372, 33782540, 32638560, 31804710, 31283229, 30988134, 29545150, 28998943, 28037661, 27345906, 26583835, 26052304, 25177703, 25001708, 24123452, 23415265, 22993665, 22445241]
14187B2445241o57154k17048n79545o47617l55145m54611l06099n49776o29861
14178A8048385j5711n28056l05276j03402n83916k76209J7937o45195k31761n28967
14168A4847829j04979l94984l46455j61474r6543l70753k96124j86399m37413
14159A2452705M51971n53015j99576p08541K28867k84677j40215k70166Q1937
14150A1059290l20110k18954J8166l64516l41874r9483p9268j96849l0883J50766
14140I576285j06414k13244k84541n12261L23070l03020r827k2656k51918j86283
14130H009191q2166M5960n39758K83605j0630m53850m9865k38564m2153k5488
14120F896282r2358r9999m61642N27915J6700j86146l82872K10161l67548K85685
$$ y = [22445241, 21788087, 21571039, 20991494, 20343877, 19988732, 19534121, 19228022, 18678246, 18048385, 18032674, 17504618, 17199342, 17095940, 16512024, 16235815, 16253752, 15608557, 15376796, 14847829, 14742850, 14347866, 14001411, 13839937, 13743394, 13372641, 13076517, 12890118, 12452705, 12904676, 12351661, 12152085, 11443544, 11672411, 11387734, 11247519, 10977353, 11059290, 10739180, 10520226, 10538392, 10173876, 9832002, 9732519, 9653251, 9456402, 9425519, 9576285, 9469871, 9256627, 8972086, 8459825, 8782895, 8479875, 8470048, 8447392, 8195474, 8009191, 7927025, 7972985, 7433227, 7716832, 7706202, 7252352, 7202487, 6963923, 6921770, 6896282, 6803924, 6703925, 6242283, 6770198, 6786898, 6600752, 6217880, 6428041, 6060493, 6346178]
14110F346178k80595K7497k95682r0247L25647j29995k59926j72147j29514J11790
14100E453006j60894j68323J5932k7289k2773Q504J2048m78754Q7799L18273l16917
14089D720612P2380J39579l03942N5136j11004J70105l94161j3247l09139K05098
14079D231417j49516J10828J30617k52414l48795L10578K3696l2514j40487J01822
14069C985232j40257l3781M4837n5008r8377j28488J41974L10129n50944M15702
14059C891019O0161k48503K02483k79383k37131J2030m8547k27754K08844m90939
14049B842280K03612o1717l3053k06588j131K62972j76515R8587J74279j89575
14039B913151j14033k65070K90839k45935M94815l84128J80861o0150k70251K82180
$$ y = [6346178, 6065583, 6093080, 5797398, 5707151, 6032798, 5902803, 5642877, 5470730, 5341216, 5453006, 5292112, 5123789, 5139721, 5112432, 5089659, 5098163, 5110211, 4631457, 4719256, 5037529, 4720612, 4792992, 4932571, 4628629, 4683765, 4572761, 4742866, 4348705, 4335458, 4026319, 4231417, 4081901, 4192729, 4323346, 4070932, 3722137, 4032715, 4056411, 4023897, 3883410, 3985232, 3844975, 3811194, 3856031, 3801023, 3702646, 3574158, 3716132, 4026261, 3475317, 3891019, 3951180, 3702677, 3905160, 3625777, 3388646, 3400676, 3352129, 3124375, 3333219, 2842280, 3045892, 2984175, 2951122, 2744534, 2743403, 3006375, 2829860, 2928447, 3102726, 2913151, 2799118, 2534048, 2824887, 2578952, 3073767, 2689639, 2870500, 2810350, 2540099, 2822279]
14029B822279l47129J51875j55709M49628k483m77757n5157L29K67983m76689
14019B177170K21729J65191j23781l14102j2260K60895m3394J78048l39679j86856
14009A982961J67021J88124K4365o7120m72426J8984J68669j03274j05513K60730
13999B062521l53374J8949K38987K6046k03070q9515l2858o6891K45148N23944
13989B369887J165076J644494M961903J5159129K5259599k2092165A2437305n414457
13981G022848j860728q80763p56298n65169N556k57760k70845J14085j13600o9264
13971B368062q7116O5560j63348j47583p5860j22814K42097M0883n3332j20854
13961A945695p9572M0130k02454P4445o2597K46318k88741N00148m13169R2951
$$ y = [2822279, 2475150, 2627025, 2471316, 2920944, 2918461, 2440704, 2385547, 2385876, 2653859, 2177170, 2398899, 2564090, 2440309, 2126207, 2113947, 2374842, 2331448, 2509496, 2169817, 1982961, 2149982, 2338106, 2362471, 2295351, 1822925, 1841909, 2010578, 1907304, 1801791, 2062521, 1709147, 1728096, 1967083, 1993129, 1790059, 1700544, 1667686, 1600795, 1845943, 2369887, 3534963, 5179457, 10141360, 25300489, 50560088, 28467923, 12437305, 7022848, 5162120, 4281357, 3525059, 2959890, 2965446, 2707686, 2436841, 2550926, 2437326, 2368062, 2280946, 2346506, 2183158, 2035575, 1959715, 1836901, 2078998, 2119881, 2066549, 1945695, 1866123, 1906253, 1703799, 1778244, 1715647, 1961965, 1673224, 2173372, 1760203, 1853154]
13951A853154j82191k31937K93283J06085j06825j22348j50011k58156O24228
13942A825282L224l05160k15860K51410L915k21350L7743o5011L50608l24762
13932A340039K1782M09722l11347N1207j36935r248j59396J74532J61126r7862
13922A443620k92641M50034l42425j16749K89697J89767m04319L55235q1802j99378
13912A291039k28872L87520k21162k48024J88213O4218m0612M8927K659J40425
13902A384331m24290K71308j52011J18461q7484J88047j48643P8828p8691j86128
13892I63728L63275J80057m75617m0598K28511l10120N46250m39724J48930J80179
13882A344871j98569n0827k56723J05387J45989j19823K09389N2112m69261M8570
$$ y = [1853154, 1670963, 1439026, 1732309, 1838394, 1731569, 1609221, 1459210, 1201054, 1825282, 1828506, 1523346, 1307486, 1558896, 1562811, 1341461, 1379204, 1314193, 1664801, 1340039, 1361821, 1771543, 1460196, 1511403, 1374468, 1365220, 1205824, 1380356, 1541482, 1443620, 1150979, 1601013, 1258588, 1141839, 1431536, 1621303, 1216984, 1572219, 1490417, 1291039, 1062167, 1449687, 1228525, 980501, 1168714, 1232932, 1192320, 1241247, 1243906, 1384331, 960041, 1231349, 1079338, 1197799, 1110315, 1298362, 1149719, 1228547, 1149856, 963728, 1327003, 1507060, 1031443, 990845, 1219356, 909236, 1455486, 1015762, 1164692, 1344871, 1146302, 1095475, 838752, 944139, 1090128, 970305, 1179694, 1231806, 762545, 811115]
13872H11115M06722k23855o805J22641j1878r281j10319P3637k8749L52385n76501
13861G99112K43022j07144J77700k03583p3422L67294m26357L14741q6503j03585
13851I01275r3358J8143M4140o104L08887k83394J15968Q8588L7457l34983K18750
13840A015369l22315M3624N8269l18597O33422k72587l38201K79201J09243k0184
13830H67244j59303L39766n00612K34041o0851r3360L13976j60202J17480o5387
13820H32792N07O9625k17645o0187r1377J30451O6818J71033k64897m7704j25099
13809D64317N18151m38952O7894J97943j24613k95513M41031K31945j92647m07028
13799D62528L25722j15906M29818m44097K48434l93845o9332k7806L5459K06312
$$ y = [811115, 1217837, 993982, 987177, 1109818, 1097940, 1088659, 978340, 1051977, 1023228, 1375613, 799112, 1042134, 934990, 1112690, 909107, 835685, 1202979, 776622, 1091363, 1004860, 901275, 807917, 826060, 870200, 864096, 1172983, 889589, 1005557, 1094145, 1131602, 796619, 1015369, 693054, 736678, 794947, 476350, 1109772, 837185, 498984, 778185, 887428, 867244, 707941, 1047707, 547095, 781136, 720285, 626925, 940901, 780699, 898179, 832792, 833299, 902924, 685279, 625092, 533715, 664166, 730984, 902017, 637120, 589416, 464317, 982468, 543516, 611410, 809353, 684740, 389227, 830258, 1062203, 869556, 462528, 788250, 672344, 1102162, 658065, 906499, 512654, 443322, 415516, 450975, 657287]
13789F57287J13510j27104R8351n4968Q8798J352J71731l71084K06398q5527J38221
13778H36965k30156K07047J10029k15872K2474B16660K07329J8971o0316j6289
13768C66355R8434K14311J40761k93685m2482L55574j08410J92062J57444C46294
13757F13584J2091a4318B93624M06784n5923j00336j87893L70174M171l31866
13747C98735K37334j60215O3080J9005K33750k11455k07393O5585J31338O8902
13737F38666j28546K42130k03698j38233P2877J63854J8550j55465j01254J76297
13727E85178j76509J60996j40354l0031J7802j00260K90974L4030j11052R8467
13717F29241k07464K77271A85149J12678A32335L17473L61555j28086k55561p799
$$ y = [657287, 770797, 643693, 742044, 687076, 775874, 777226, 948957, 577873, 784271, 698744, 836965, 606809, 813856, 923885, 708013, 730487, 216660, 423989, 442960, 382644, 366355, 464789, 679100, 819861, 526176, 483694, 839268, 730858, 922920, 1080364, 346294, 613584, 625675, -14318, 293624, 700408, 644485, 544149, 356256, 726430, 730601, 398735, 636069, 475854, 538934, 557939, 791689, 580234, 372841, 438426, 569764, 638666, 510120, 752250, 548552, 410319, 483196, 647050, 665600, 510135, 408881, 585178, 408669, 569665, 429311, 399280, 417082, 316822, 607796, 641826, 530774, 629241, 421777, 699048, 185149, 297827, 132335, 449808, 811363, 683277, 427716, 419917]
13707D19917l6490j52626L22922r0006R0885Q3827L8506k46082J6873K43327r4876
13696E96177J9683n8271M0934j58957J0638J03994j84709J95430H7605M58797
13686E46402o5883B32582R9736j59317K34598A74573K20904N3660p0221B1283
13675d678C57592R6185j37329p6708P8995K20190j9931J10965k60748J05663j05909
13664C68965M4548J64254j57434n7932R7379K9269q4727J70509O0087k54396O7631
13653D48153L58822l94446J59085B19349e7436B77245J59036o2830J22187k42954
13643B52684K31888L6232K9167A96879K97521j88973K19538k9327K4457m9245
13633D70850A19244K08970O9264o3683j4973L5895r1331N4413K27673j44458A74843
$$ y = [419917, 383427, 230801, 553723, 463717, 554602, 638429, 676935, 430853, 447726, 691053, 596177, 615860, 557589, 598523, 439566, 450204, 554198, 369489, 564919, 87605, 546402, 480519, 232582, 332318, 173001, 407599, 174573, 395477, 449137, 378916, 21283, -4678, 357592, 453777, 316448, 239740, 318735, 538925, 518994, 629959, 369211, 474874, 368965, 413513, 577767, 420333, 362401, 459780, 489049, 404322, 574831, 634918, 380522, 448153, 806975, 412529, 571614, 219349, -57436, 277245, 436281, 373451, 495638, 252684, 484572, 520804, 549971, 196879, 494400, 305427, 524965, 495638, 520095, 470850, 119244, 328214, 397478, 333795, 318822, 354717, 263386, 317799, 545472, 401014, 174843]
13621B68620Q6476j54989K07530k8028A79561m1247J44937F8944M46823B40788
13610C56410n4893j47293L08125j21232K46920j67297p5160N4010j34247R6223
13600C61566P9176j48061K82124E5230K85306J15747A81963M7394L7623j19999
13590A46981K05149r8417L2009J06200R991n1097F4840J97388c1102A93192o9049
13579A24143J20223n9076M34050B59922Q4404l8767J11195j71214K18326A79230
13568B42644E4296M2649N9L8831L74033j69486J09659m3598A56238i9315j59911
13557b59226A45342J38094b02450A32149J72236A27581K03734A52805l6295J96589
13547C13099L25996A32451r258J72363j0878j11895J32230F7829N01242j99958
$$ y = [268620, 355096, 200107, 407637, 379609, 179561, 138314, 283251, 68944, 515767, 240788, 356410, 301517, 154224, 462349, 341117, 588037, 420740, 345580, 399590, 265343, 361566, 440742, 292681, 574805, 55230, 340536, 456283, 181963, 229357, 266980, 146981, 352130, 253713, 285722, 391922, 401913, 350816, 64840, 262228, -31102, 193192, 124143, 244366, 185290, 619340, 259922, 344326, 305559, 416754, 245540, 463866, 179230, 242644, 54296, 96945, 97004, 135835, 509868, 340382, 450041, 406443, 156238, -99315, -259226, 145342, 283436, -202450, 132149, 304385, 127581, 331315, 152805, 116510, 313099, 639095, 132451, 123193, 295556, 284678, 172783, 305013, 67829, 569071, 369113]
13537C69113O1270k12552l1438J22975q3852Q2183J03385g7620B80069n1083a6912
13525C89607j79043P2304J42145A43306J61292j52297M3718a06933B58079J52558
13515D10637j97202Q2300L0370L7294A34947g1662D28107j54710L3006j2793N9448
13504C53058A02213a8028A9597a1350n6449C60863C124M24594A48748Q759K488
13493A59995R7612G5669e2406A37205K74978I6578D5788J39468m5972N9840p9218
13482A19906k3780K04412b4021F06851B39146a77117B12891N5288J1488c2311
13471C65243A42108m3657J72225h420D57223j06168j27740j1355l8088K35745
13461D09617b9888B34669B9040J49253G6147a26116C10543a16995A07565L76193
$$ y = [369113, 430383, 217831, 186393, 309368, 225516, 307699, 411084, -77620, 280069, 228986, -16912, 389607, 210564, 282868, 425013, 143306, 304598, 152301, 196019, -106933, 258079, 410637, 213435, 295735, 326105, 363399, 134947, -71662, 428107, 273397, 306403, 293610, 353058, 102213, -18028, 19597, -11350, -67799, 360863, 3124, 427718, 148748, 157507, 159995, 257607, 75669, -52406, 137205, 412183, 96578, 45788, 185256, 139284, 199124, 119906, 96126, 300538, -24021, 606851, 239146, -177117, 212891, 268179, 279667, -32311, 365243, 142108, 98451, 270676, -8420, 457223, 351055, 223315, 211960, 173872, 409617, -29888, 234669, 29040, 178293, 76147, -126116, 310543, -116995, 107565, 483758]
13451D83758a39259A32076b7677b937B76570c6745E37953I8221a3132D52835a34857
13439B21210j7618J4207K56124A83234J49896C5207K6863L7554k8566l0821J71141
13428B11378P4904N5864E8284J99997J0549J57308o0987I2521P8677D2311J50648
13417A92959p1105D5844L04664E6454B6210P2597K70380I1544R2039H9035A9183
13405B63513n7831c27243d7622D79305K8095b23966D63162A69333K15599e2705
13394h8317B45171d04035B65315a01803A05996L9033K57451b9276B09603o6594
13384A43009F4651J08129B6801L06699F3905K13892b27588A11307a11341B17793
13373B73775I209K14193I0791K13874i446m2493A30652J34722O6352r1758e9005
$$ y = [483758, -139259, 132076, -27677, -2937, 276570, -36745, 537953, 98221, -13132, 452835, -134857, 221210, 203592, 217799, 473923, 183234, 333130, 35207, 62070, 99624, 71058, 40237, 211378, 286282, 342146, 58284, 258281, 268830, 426138, 365151, 92521, 171198, 42311, 192959, 121854, 45844, 350508, 56454, 26210, 98807, 369187, 91544, 183583, 89035, 19183, 263513, 205682, -327243, -47622, 479305, 507400, -223966, 463162, 169333, 384932, -52705, -88317, 245171, -404035, 265315, -101803, 105996, 145029, 402480, -29276, 209603, 143009, 64651, 172780, 26801, 333500, 63905, 277797, -227588, 111307, -111341, 217793, 273775, 9209, 223402, 90791, 304665, -9446, -51939, 130652, 265374, 331726, 239968, -59005]
13361A32768K3499l861P2669G1122K64139a08539B9460h8051C31967A04100C9898
13349B51032n0520G9161J63770A3698N8458M14216A2466K05581L570L16497H1181
13337A97738K17162j84593o4986L06906F2578J45898r2352L32683a41106A31755
13326C19050P9357m7011D4760L16950p809g1377B37009G4847j0125J99167G2621
13314a11553C13826A40390M6320B0217J67753m5762O4572F6406a06131B34863
13303d125B23211H21d5204A90466R9848l9186A20815K81J00360A7962J35439J9779
13291A73180L2408k5396J74448a04192H052K63214N67N5231j8114J341f3561F3575
13278D4207e9141k6249B17684o4232J14908h7534q862A24033K81501I2083J4189
$$ y = [132768, 156267, 152406, 225075, 71122, 335261, -108539, 29460, -88051, 331967, 104100, 39898, 251032, 200512, 79161, 242931, 13698, 72156, 486372, 12466, 218047, 221617, 538114, 81181, 197738, 414900, 230307, 165321, 472227, 62578, 208476, 116124, 448807, -141106, 131755, 319050, 398407, 351396, 44760, 361710, 353901, -71377, 237009, 74847, 64722, 263889, 72621, -111553, 313826, 140390, 186710, 20217, 187970, 142208, 206780, 66406, -106131, 234863, -4125, 223211, 821, -45204, 190466, 290314, 251128, 120815, 121096, 221456, 17962, 153401, 173180, 205588, 180192, 354640, -104192, 8052, 271266, 271833, 327064, 308950, 310291, -63561, 63575, 44207, -59141, -85390, 217684, 153452, 268360, -87534, -96396, 124033, 405534, 92083, 106272]
13267A06272n2719K16414R7846D285a35636B47665A7022J00433J34467M5743A01193
13255e0380B8728d4049j9242C41795D9062J66948e3782H5031N299a65564B8497
13243g0707j4414j52720C00498E4937e8579B59785e2959A16998J19658B3423P6260
13232I9683J37092A4322O9444c4504G5896Q998j7156K54759g9366b1143A98783
13220A18765n14R1783J3437a67523A44382N4953E1478d9179F9547O1965N3378
13209A84890J9935g8004B30248J00840A10615f6427b9899H4658O3629a37544N4464
13198h3080B54324a45991j49803A82627r512M7993E1402K05193K5321a33074A03906
13186A53669b29585A44853J68551H7523c15224B04802N1748K7349A09636L04087
$$ y = [106272, 53553, 269967, 367813, 4285, -135636, 247665, 17022, 117455, 251922, 297665, 101193, -50380, 28728, -44049, -63291, 341795, 49062, 216010, -53782, 85031, 90330, -165564, 28497, -70707, -85121, -237841, 300498, 54937, -58579, 259785, -52959, 116998, 236656, 23423, 99683, 236775, 14322, 83766, -34504, 75896, 84894, 67738, 322497, -79366, -21143, 198783, 118765, 118251, 210034, 223471, -167523, 144382, 199335, 51478, -49179, 69547, 131512, 184890, 204825, -78004, 230248, 331088, 110615, -66427, -29899, 84658, 148287, -137544, -83080, 254324, -145991, -295794, 182627, 173115, 221108, 51402, 256595, 281916, -133074, 103906, 153669, -229585, 144853, 313404, 87523, -315224, 204802, 256550, 283899, 109636, 413723]
13176D13723H3307B6065b7119B38495a59967F9006Q3222b46327A16630b65068
13165I4528J63807I4899N7776f641r3405A06769m3522a77063f1111C19137i3382
13153b13457A72284K01340F022J13816a2377B31235b07553E8131K694c0356p419
13142c7775A15384b27091M5368M3693M1368G068K7493d894I9229M8051a13130
13130B04494r0327L4185l426f261E0005j369K46123m1623C2810J7178j3378b5061
13117A16945b28356n4519E9808j8000Q0708e5478C41309k7608C3563J33290R4671
13106B61524a36728D4657P1251i0881A0273e8812K6110l72290A89550p7796J29784
13095B41538h6623C1805J4405g1486j16908A50301o6721a79187A3554a48107A22949
$$ y = [413723, 83307, 26065, -27119, 238495, -159967, 69006, 152228, -246327, 116630, -265068, 94528, 258335, 94899, 152675, -6641, -100046, 106769, 63247, -177063, -61111, 319137, -93382, -213457, 172284, 373624, 6022, 119838, -12377, 231235, -207553, 58131, 60825, -30356, -37775, 115384, -227091, -181723, -138030, -96662, 7068, 34561, -4894, 99229, 147280, -113130, 204494, 114167, 148352, 144926, -6261, 50005, 48636, 294759, 253136, 32810, 49988, 36610, -25061, 116945, -228356, -282875, 59808, 41808, 122516, -55478, 341309, 313701, 33563, 166853, 261524, -136728, 44657, 115908, -90881, 10273, -58812, -32702, -404992, 189550, 111754, 241538, -86623, 31805, 46210, -71486, -188394, 150301, 83580, -179187, 13554, -148107, 122949]
13083b89632A43718d6301A47888j5847g4428A27668C6415c7593C0255b6211r171
13072c5382l00856J00006q3673C95429j32023A24684R5941J78719p4195A36736
13061B22779b72711B2175K87173j2176N9591b0067F6708J11685p4828d2579B01185
13049g5300C7327a08258Q509D47173f8005A34255K20136A65209a40129d2726I6420
13037b85212B06021Q5555g8942C36960a43194B29350a16127e7397J133E7827J1137
13026F8964i0184H5453J35096e2034A89397A084K34512F2110R7516p7633P4796
13015A56789Q0052H0529L2958e8991A96560a14689A94828K512a76604B90969A11034
13003B76610P2110f2349f380A79324b24905B92405r357b72173A01158K2963b97343
$$ y = [-289632, 143718, -46301, 147888, 132041, -74428, 127668, 36415, -37593, 30255, -26211, -35382, -336238, -236232, -319905, 395429, 263406, 124684, 220625, 399344, 325149, 136736, 222779, -272711, 22175, 309348, 297172, 356763, -20067, 66708, 178393, 103565, -42579, 201185, -75300, 37327, -108258, -99749, 447173, -68005, 134255, 354391, 165209, -140129, -42726, 96420, -285212, 206021, 291576, -78942, 336960, -143194, 229350, -116127, -57397, -56264, 57827, 68964, -90184, 85453, 220549, -52034, 189397, 1084, 235596, 62110, 159626, 81993, 156789, 236841, 80529, 113487, -58991, 196560, -114689, 194828, 197340, -176604, 290969, 111034, 276610, 348720, -62349, -6380, 179324, -224905, 292405, 283048, -272173, 101158, 124121, -297343]
12991A64637o8559D2071J29218q3878b24983G822J7176I706b28761f5771A69555
12979A12433a26185M1690m622c3268I0422b82G1549Q7696b98490B27245h2645
12967C12993j7821f9628C2766L69110k00208B1757J69786G62e7704n3694A28807
12955e976q358A30634P7760j1412c6960G9562i1961j0723C7708P5680c9329B019
12942B92014A37499b18055D18106f947A51462G4510b46223i6624k0846E0830K9352
12931H0182N538C7580J56415J13802M6768A5969b34266B80310f3265n3439b3204
12919c84108A63170R5070A00173K08928b04545F5768a73117j7608Q65I1887b72228
12907b30533A03488a05754c9533p5617A19608b19085O9545j31476d3072l28905
$$ y = [164637, 96078, 42071, 171289, 87411, -224983, 7822, 24998, 9706, -228761, -65771, 169555, 112433, -126185, -84495, -89117, -33268, 90422, -282, 71549, 159245, -298490, 227245, -82645, 312993, 295172, -69628, 32766, 401876, 201668, 21757, 191543, 762, -57704, -111398, 128807, -5976, -14334, 130634, 208394, 196982, -36960, 79562, -91961, -102684, 37708, 113388, -39329, 2019, 292014, 137499, -218055, 418106, -6947, 151462, 74510, -246223, -96624, -117470, 50830, 80182, 85720, 37580, 193995, 307797, 354565, 15969, -234266, 280310, -63265, -116704, -23204, -384108, 163170, 258240, 100173, 309101, -204545, 65768, -173117, -190725, -189860, 91887, -272228, -230533, 103488, -105754, -39533, -115150, 119608, -219085, -149540, -281016, -43072, -371977]
12897c71977D6992a4546A9616K0285a09428q9436B7946q790P4683L1888a63905
12885B17900c31314C87820C3537N5477j6676j9349K06579C3184a64530A8437J87392
12874B05829e2551j03853A0954a00471o6902D6044d0363A18664O48D2848O6764
12863A09612J42259i0214A98668k7378K57199a14867B53395a52649A38681c11082
12852b24452I3349a34506f4475j4214D52795h6999k35780C33361c38735C88682
12841b17501A14933a41165C07535q8895I8043C3168b20207A1608O6754R1225g9495
12829A46889n136G0626a53299A86934d0706k844H8019g7863A71342m2398d8436
12817b11632C352P1533Q1379d24445J35857D46051i2452K5633G6030a3205m842
$$ y = [-371977, 46992, -14546, 19616, 39901, -109428, -198864, 27946, 19156, 93839, 125727, -163905, 217900, -331314, 387820, 33537, 89014, 72338, 52989, 259568, 33184, -164530, 18437, 205829, -52551, -156404, 10954, -100471, -167373, 46044, -40363, 118664, 119312, 42848, 109612, 251871, -90214, 198668, 171290, 428489, -114867, 253395, -152649, 138681, -311082, -224452, 93349, -134506, -64475, -78689, 452795, -86999, -322779, 333361, -338735, 388682, -217501, 114933, -141165, 307535, 218640, 98043, 33168, -220207, 11608, 78362, 169587, -79495, 146889, 141753, 70626, -153299, 186934, -40706, -43550, 88019, -77863, 171342, 128944, -48436, -211632, 3352, 74885, 156264, -424445, -288588, 446051, -92452, -66819, 76030, -13205, -18047]
12806a8047C63460b61212j14563I4138O0651j2774a46831B7246J06066O1503c2478
12794c9067A71641N5308G9687N3738b03367C1234a47295a7541l3813D1952f1437
12782g6045k8447j10811A49866E4873a31125d7893G6031b69749H9106F382f7280
12770a78275k02365J79911B98315C1627N6883R1094b03758D4207f9240D4239K5881
12759G0120g8287B37641j12613k111B1172a40985L8446d4989q881G8884e48541
12747a37715m0618E6517J4694c19386A08252J74364b79237a19430F4701a91372
12736i4384C99559D7854j025f2693k8710A60622b37344e0186E54133B16111d9405
12724a64431o4584L0790C43816A71493g2030A65204I406a76496B71594K37098
$$ y = [-18047, 363460, -261212, -375775, 94138, 154789, 142015, -146831, 27246, 133312, 194815, -32478, -39067, 171641, 226949, 79687, 133425, -203367, 31234, -147295, -17541, -51354, 41952, -61437, -76045, -104492, -215303, 149866, 54873, -131125, -47893, 76031, -269749, 89106, 6382, -67280, -178275, -380640, -200729, 298315, 31627, 88510, 179604, -203758, 44207, -69240, 44239, 70120, -78287, 237641, 125028, 122917, 21172, -140985, -102539, -44989, -53870, 78884, -548541, -137715, -178333, 56517, 71211, -319386, 108252, 282616, -279237, -119430, 64701, -191372, -94384, 399559, 47854, 46829, -62693, -91403, 160622, -237344, -50186, 554133, 216111, -49405, -164431, -229015, -198225, 343816, 171493, -72030, 165204, 9406, -176496, 271594, 508692]
12714E08692A50560b26162C9925a10403o7754j5346B60090C668Q5508M7890d3247
12702b0342q9450I8048K8662K70735d56338J63564A25216n1239c7849j24529B13199
12690B13267I0049c47760A76841a24122A09988c04428H78K2292D336b3761B40841
12678A62430P0819A06059a3849A5405O6656Q0947E2411a16243F4695b27045a5708
12666B27922r5829d076A57939G5652B4445a98277i987k66982C438L1519M9507
12655H4464B2864K42078k6579a06936a0263j7881k01371A79461m4920k9518h6029
12643a42495A49952J05853C7502a04719A59627D0314M4150c6855C9069g948l3629
12632d1577C80825A49428P139O0337J39173A59260E5474M4086e7660j46165I9306
$$ y = [508692, 150560, -226162, 39925, -110403, -178157, -193503, 260090, 3668, 89176, 137066, -43247, -20342, -109792, 98048, 126710, 397445, -456338, -292774, 125216, 73977, -37849, -162378, 213199, 213267, 90049, -347760, 176841, -124122, 109988, -304428, 878, 23170, 4336, -23761, 240841, 162430, 233249, 106059, -13849, 15405, 82061, 163008, 52411, -116243, 64695, -227045, -15708, 227922, 132093, -4076, 157939, 75652, 24445, -198277, -9987, -276969, 3438, 34957, 84464, 22864, 264942, 238363, -106936, -10263, -28144, -229515, 179461, 134541, 105023, -86029, -142495, 149952, 255805, 37502, -104719, 159627, 40314, 84464, -36855, 39069, -7948, -41577, 380825, 149428, 156567, 216904, 356077, 159260, 55474, 99560, -57660, -203825, 99306]
12620C30736A29975K65397j03910A43022e6408A39352b20631C1631a8923n6529
12610g5452B43682E7244a9287G470O8649M221e1042j72799A97540J1261J0966
12599B19767a7991C15720A0639K99413H319J61322L6760a66406g506A86J42037
12588A42223K07766j68801B4271a9430H4906g0771c0785j93784c3414B69287d32458
12576F8412K30143P2007A25363c0432H0647a92959A69533q0420a3272A43998F4780
12564g4193o2408j05778B47138E0159j6487M15234a93746K7564B6397N5989b11362
12552b18515M3202A67635k1391P3644a59447p6591O2036A34448N1601q0291a07280
12540a5684C49665b17538A57591p8215a28592k65119D493O0897L20K74650A12986
$$ y = [330736, 129975, 395372, 291462, 143022, -56408, 139352, -220631, 31631, -18923, -75452, 243682, 57244, -19287, 7470, 76119, 80340, -51042, -223841, 197540, 208801, 219767, -17991, 315720, 10639, 310052, 8319, 169641, 206401, -166406, -7506, 186, 142223, 349989, 181188, 24271, -19430, 84906, -70771, -30785, -224569, -33414, 269287, -432458, 68412, 298555, 370562, 125363, -30432, 80647, -192959, 169533, 89113, -13272, 143998, 64780, -74193, -136601, -242379, 247138, 50159, 33672, 448906, -193746, -166182, 26397, 82386, -211362, -218515, -175313, 167635, 146244, 219888, -159447, -236038, -174002, 134448, 186049, 105758, -107280, -15684, 349665, -217538, 157591, 79376, -128592, -393711, 4493, 65390, 65710, 340360, 112986]
12528a05335C8129K3722N4167i2606A45813l4725B6176c2099B44191A7549J21614
12517A39163a00517A25182b16103g3740r4273J6373G658J09595Q0351a82269B8732
12505b01556a0481A27854a29155e5170B71023j08697d2980G4342R8334a40115
12494a03491A80579B8247a65144C8146a28870c4780H2258b18998A63315n3255
12484A10060i3925m1154c859F6104K83765F0407b31324A53903c85451d2273j0630
12473e2903j24565j86296B2110b23682i6446A53972A138K722c74644A3595D65
12461I5804j2182b62088B49159B8035e6707l355q9089j85624f2153p1224B90481
12449A11164c72674F4511b1395A3539a01146i420n0785l17422a2879E1737b258
$$ y = [-105335, 38129, 61851, 116018, -92606, 145813, 111088, 26176, -32099, 244191, 17549, 139163, -100517, 125182, -216103, -73740, -168013, -151640, 7658, 117253, 197604, -182269, 28732, -201556, -10481, 127854, -129155, -55170, 271023, 162326, -42980, 74342, 172676, -140115, -103491, 180579, 28247, -165144, 38146, -128870, -34780, 82258, -218998, 163315, 110060, -93925, -135079, -3859, 66104, 349869, 60407, -231324, 153903, -385451, -42273, -52903, -177468, -363764, 22110, -223682, -96446, 153972, 1138, 3860, -374644, 13595, 465, 95804, 83622, -262088, 249159, 28035, -56707, -60062, -149151, -334775, -62153, -133377, 290481, 111164, -372674, 64511, -21395, 13539, -101146, -9420, -60205, -377627, -12879, 51737, -2258]
12437A33727b11416C8523N6903a29149B92107a89950i4283r264c6140a4917A01277
12425b60194c0419C55736g8658A27258e0118p0177N5762E5141e5628B57449g8587
12413c77048i7660J5737a8636q7485d7107j0622j12576A37659I551J98967k8604
12402A79914d3596H8264c68114r4503d8354B5670d7628C2997d0432C7153K09953
12391B47106C3067b61173Q6598A91724a10824A77366c7032A4315O55538k80871
12381C88982A41889a46061A15276K4296E7775i8479A65987D9008J8001g7365A87784
12369i048A36462a9204j14587l4761G9954J866B9811a8905n8355A16324J60234
12358B76558j4943h8790K0688C72501b084m64827e222E0166J23129H4424B8413
$$ y = [133727, -211416, 38523, 95426, -129149, 292107, -189950, -94283, -103547, -36140, -14917, 101277, -260194, -30419, 355736, -78658, 127258, -50118, -120295, -64533, 55141, -55628, 257449, -78587, -377048, -97660, -81923, -18636, -106121, -47107, -57729, -170305, 137659, 9551, 208518, 179914, -43596, 88264, -368114, -462617, -48354, 25670, -47628, 32997, -40432, 37153, 247106, 33067, -261173, -174575, 191724, -110824, 177366, -37032, 14315, 669853, 388982, 141889, -146061, 115276, 139572, 57775, -98479, 165987, 49008, 67009, -77365, 187784, -9048, 136462, -19204, -133791, -168552, 79954, 81820, 29811, -18905, -77260, 116324, 276558, 261615, -88790, -68102, 372501, -2084, -466911, -5222, 50166, 173295, 84424, 28413]
12346A8358a20912A6443h015B18414b62961a20946a6080r9318j3135H5592a44321
12334E0988L31729d5798o3159e3981B09593b7114F58475j61365k03828J02123
12324C95405m512B5574K0826L14917A46831E1570J20879K35228o8758J21059A86244
12312B69095j16564l5269C2934J04930B5403J7008J95043E1991A6731b2473C50334
12300C8948J18154a69019A8520N5700a48908k14625d514B20892a12432B53122
12289F960a13959A2194J13749g044A66217p8319k9832K19273I5265O7195j8523
12278A43937N2812B3694J77760M5116G6158a45812A6410N7497R608J4922A0839
12266H1964P7919J61135K52289A60582J01048p3992m6602R6667g437A34458Q7188
$$ y = [18358, -120912, 16443, -8015, 218414, -262961, -120946, -16080, -115398, -128533, 85592, -144321, 50988, 382717, -45798, -108957, -53981, 209593, -27114, 658475, 497110, 293282, 395405, 390893, 25574, 46400, 361317, 146831, 51570, 172449, 407677, 338919, 459978, 186244, 269095, 152531, 117262, 32934, 137864, 25403, 42411, 237454, 51991, 16731, -22473, 350334, 38948, 157102, -169019, 18520, 74220, -148908, -363533, -4514, 220892, -112432, 253122, 6960, -113959, 12194, 125943, -7044, 166217, 87898, 58066, 277339, 95265, 162460, 143937, 196749, 23694, 201454, 246570, 76158, -145812, 16410, 73907, 83515, 98437, 10839, 81964, 159883, 321018, 573307, 160582, 261630, 187638, 141036, 237703, -7437, 134458, 221646]
12255B21646j00568C1364J95367J62405A52261B2823L3677g3750A67521G8341
12244G5176i3473A37193n450k2480J00741d5162L525A19547J13645B7455L6055
12233F3510b212n2318n2563B02521H4667P2566J21101A5884Q3488L45433j53040
12222B91765k7917o9800J03180c4896A10176J91460A41610D7145B413K02609H9287
12210c19791A98128J04806d3778I9101k6614K73719n6489A16085R8481J34013
12200C48579G916M1313L92009A03987b87428B27725M4934B2497K57499m6178J51360
12189C85178j70399I4707K68034A29463o2934r518J29148o1220J71702B5339J94016
12178B19355J16394a21351C47159j31826I8524D7616L66388A07897r705m4263
$$ y = [221646, 121078, 31364, 226731, 389136, 152261, 22823, 56500, -73750, 167521, 78341, 75176, -93473, 137193, 131743, 109263, 210004, -45162, -41637, 119547, 233192, 27455, 63510, -2212, -54530, -107093, 202521, 84667, 157233, 278334, 15884, 99372, 444805, 291765, 263848, 194048, 297228, -34896, 110176, 301636, 141610, 47145, 2413, 205022, 89287, -319791, 198128, 302934, -43778, 99101, 72487, 346206, 289717, 116085, 214566, 348579, 7916, 49229, 441238, 103987, -287428, 227725, 272659, 22497, 279996, 233818, 385178, 214779, 94707, 362741, 129463, 66529, 57011, 186159, 124939, 296641, 25339, 219355, 335749, -121351, 347159, 215333, 98524, 47616, 414004, 107897, 98192, 53929]
12168E3929L64359A10064K91037A0064K52493D2148K28105k0063g3310A85946
12157C15094o3308B8107b25489B26124A10871J31782D4082K6273a36753M0140
12147i6613j86668e9419B22211m5160J39284b06205B88651B3409a390A1707P5039
12136H6746J25171i8021M2712B41165l1647b52230m0522c9349B53366i578B48736
12124A59145K6570m3734E8305d8598B07499a1798F2975J3007B8983a552B02146
12112D01476A23888Q986D271a30070M0550C33220c3203H7816N4977n590a42009
12100A50103J70040j38434F3498c941B74903C9230a85858A63263J81634A09522
12089a7101B17443K06773A74601D6671K59252H5458e1614j275A78802d3355B82639
$$ y = [53929, 418288, 110064, 401101, 10064, 262557, 42148, 270253, 250190, -73310, 185946, 315094, 251786, 28107, -225489, 226124, 110871, 242653, 44082, 70355, -136753, -96613, -283281, -59419, 222211, 177051, 316335, -206205, 288651, 23409, -1390, 11707, 86746, 211917, -98021, -55309, 241165, 209518, -252230, -292752, -39349, 253366, -9578, 248736, 159145, 185715, 141981, 58305, -48598, 207499, -11798, 62975, 75982, 28983, -1552, 202146, 401476, 123888, 132874, 4271, -130070, -89520, 333220, -33203, 87816, 142793, 137203, -142009, 150103, 320143, 181709, 63498, -3941, 274903, 39230, -185858, 163263, 344897, 109522, -17101, 217443, 424216, 174601, 46671, 305923, 85458, -51614, -52889, 178802, -43355, 282639]
12077d1353C05701F8443L08260A12984K754q424J86428o1642d3116B30952N7587
12066B88539b0849B78490f6280B06789a51737B45026a89280b0817k33626I8318
12055I4412a09070b2371E7658a12716B00794Q131l3377q1324d2829j15815C5761
12043D8274d820A08690c78977i6332C54522a89912L3729q898B65506a18589q6745
12032b05334g146F9013P8091b0108j262D1107b8910B8433b36708C09353e8827
12020G6076b14850E9251M2671a51398b2553k6299J400A48313a15165q7033B8565
12008D21231a06946B00354e7201A30082n9250nb48001J04014f8020a0942C8341
11996D6334J99545a36698A24043l9690h3288o0069A19855n4521Q5097a68788e1046
$$ y = [-41353, 305701, 68443, 376703, 112984, 115738, 107314, 293742, 232100, -43116, 230952, 288539, -20849, 278490, -66280, 206789, -151737, 245026, -189280, -20817, -254443, 98318, 94412, -109070, -22371, 57658, -112716, 200794, 208925, 175548, 94224, -42829, -158644, 35761, 48274, -4820, 108690, -378977, -96332, 354522, -189912, -156183, -165081, 265506, -118589, -205334, -7146, 69013, 147104, -20108, -21370, 41107, -28910, 28433, -236708, 309353, -58827, 76076, -214850, 59251, 101922, -151398, -22553, -48852, -47452, 148313, -115165, -202198, 28565, 421231, -106946, 200354, -57201, 130082, 70832, 70827, -248001, -143987, -68020, -10942, 38341, 46334, 245879, -136698, 124043, 84353, -83288, -143357, 119855, 65334, 150431, -168788, -51046]
11984d287k14911M136o1595d7109E6431b5101k73651f7562A62332D4493g2075
11972B47938A04726L02854a08749B3221L3940f5012p8207j4812E6280b0866A46512
11960I6948c30906A15545A5970M96446a10818k2436L562A1968b0919j92689C9113
11948b54033A47095L5247n4500b18546m4213Q3121O4808B05744e5918C64987I9612
11936e4924J624K0818A59155L3668B8835b12408O5719J868A59942m6927m272a125
11923A04994A0418N2864J53724C8966b45490k3494H4887M1165J91629A23903a81080
11911c65769A59006A3224b15915M9775b8324F534b51868h7302j33208i5989p679
11900a03668C72944a61025B99189i4250A4685J09874g3764q1346O7998K3172D8213
$$ y = [-4287, -219198, -215062, -276657, -47109, 56431, -25101, -298752, -67562, 162332, 44493, -72075, 247938, 104726, 407580, -108749, 23221, 57161, -65012, -143219, -158031, 56280, -20866, 146512, 96948, -330906, 115545, 15970, 512416, -110818, -133254, -129692, 11968, -20919, -213608, 39113, -254033, 147095, 182342, 127842, -218546, -262759, -179638, -114830, 205744, -55918, 364987, 99612, -54924, -53300, -32482, 159155, 192823, 28835, -212408, -146689, -144821, 159942, 113015, 108743, -1125, 104994, 10418, 63282, 217006, 38966, -245490, -268984, 84887, 126052, 317681, 123903, -181080, -365769, 159006, 13224, -215915, -166140, -28324, 6534, -251868, -87302, -220510, -95989, -103668, 372944, -161025, 299189, -94250, 14685, 124559, -73764, -155110, -87112, -63940, 48213]
11888A5687f0676A05767i9757J4616o9385F5387Q8326L688J11354b05869A43465
11876C12516a09870k58099A20321J4080E7702A9331b31463o568M6932j88571J32886
11865b46784G7465b29492B6841M3999b12409a03192A65297Q2826j4003b08976
11854a07922d9875J5929m081B56973J18319E1077b99686a37784m4550h9326o0527
11843a49853k4953r3637p2296a32531C19303a16948E4494K67731a13368c3344
11832c09703J00374A3786a46348C8091c1643k6650a4733j58683D8476b77133C3882
11820f7470k00484i558j08345F1961h4530j98866A50895B1093J05950b30664B95814
11808a91986j8439Q7711A23025a22501e7671K6761r2348P109k2115m5488B6389
$$ y = [15687, -60676, 105767, -99757, -85141, -154526, 65387, 153713, 157401, 268755, -205869, 143465, 312516, -109870, -367969, 120321, 134401, 57702, 19331, -231463, -238031, -191099, -379670, -246784, 77465, -229492, 26841, 70840, -212409, -103192, 165297, 248123, 234120, -208976, -107922, -49875, -33946, -38027, 256973, 375292, 51077, -299686, -137784, -182334, -89326, -149853, -174806, -268443, -340739, -132531, 319303, -116948, 54494, 322225, -113368, -33344, -309703, -209329, 13786, -146348, 38091, -31643, -58293, -14733, -173416, 48476, -277133, 33882, -67470, -267954, -9558, -117903, 61961, -84530, -283396, 150895, 21093, 127043, -230664, 295814, -191986, -210425, -122714, 123025, -122501, -57671, -30910, -123258, -116149, -138264, -183752, 26389]
11796B61173D9043a41362e7616J5585a800A59166b99830F245b0707n3660q0928
11785a55295E1175a60027J4472B16139B0637K04828b7537A5782a6544B8938a23532
11773E2595g2071A52921G509a08334D9223b61394p0971K1223E0657b29622I887
11761B85006c40562k2229a2161B07888F4697g8095B65323E040f2997a8637F7847
11749a9381k7623B9932R5283d83347A54455B0779Q7191B6402K63495g4094J9451
11738e4643k27082D4645a09533b7661j88518D819J62054J19699b5219B28594e6975
11726A36736n2147a17451B24428G92c32106c8602O955j41793C01128A43927R8109
11715B42036H8616J19243a94579Q0541d5624A2013R2618a5888N119A16850K69564
$$ y = [261173, 49043, -141362, -57616, -42031, -1800, 159166, -299830, 6245, -20707, -74367, -155295, 51175, -160027, -145555, 216139, 20637, 225465, -27537, 15782, -16544, 28938, -123532, 52595, -72071, 152921, 7509, -108334, 49223, -261394, -332365, -311142, 50657, -229622, 9887, 285006, -340562, -362791, -12161, 207888, 64697, -78095, 265323, 5040, -62997, -18637, 67847, -19381, -47004, 29932, 125215, -483347, 154455, 20779, 107970, 26402, 289897, -74094, -54643, -281725, 44645, -109533, -27661, -216179, 4819, 166873, 286572, -25219, 228594, -56975, 136736, 84589, -117451, 224428, 792, -332106, -38602, -31647, -173440, 301128, 143927, 242036, 88616, 207859, -194579, -114038, -45624, 12013, 104631, -15888, -10769, 116850, 386414]
11704C86414A18720J50022j16043p4157c814C28078b1083B1362i4823B47604m3902
11693B03702I5658a49782O3707B14315F4789J66179b6284j11360A38370a15967
11682A36779Q381h1202l4581j82442b11r190F2558b39762l5223a11419C08001
11670b16359b7030B25884g4876o6119k0602j32306F4613a77864a7515k00118a732
11658A01433D4877a0100E05702f1742I5331l392e8301A40171l7716R4040e4974
11646a36393j59258e6224A97531c86483e3680A47162i1993l6908I8866a52780
11635F5985a64856c2151l252A4550K8042J552K6102a22671C35393C0940K01469
11624B32409j08442J2243J6051a06787l2309A41568a94001B88779q0216e7214
$$ y = [386414, 118720, 268742, 152699, 78542, -3814, 328078, -21083, 21362, -94823, 247604, 203702, 95658, -149782, -86075, 214315, 64789, 230968, -26284, -137644, 138370, -115967, 136779, 145160, -81202, -115783, -298225, -211, -9401, 62558, -239762, -274985, -111419, 308001, -216359, -27030, 225884, -74876, -140995, -161597, -293903, 64613, -177864, -17515, -217633, -1732, 101433, 44877, -10100, 505702, -61742, 95331, 91939, -58301, 140171, 102455, 196495, -54974, -136393, -295651, -56224, 197531, -386483, -53680, 147162, -91993, -128901, 98866, -152780, 65985, -164856, -32151, -35403, 14550, 42592, 44144, 70246, -122671, 335393, 30940, 232409, 123967, 136210, 152261, -106787, -139096, 141568, -194001, 288779, 208563, -57214]
11613A01581h8051l60272H3422a44916j7699B7953K00972m4769a98139O447h6723
11601B15928h2310k08063D14169A6285J28678b58021l76814d0008n031A15843
11590A46136b9039n1820B44902a99525a5861B53204a5755A24138a448j79263g8274
11578e9827K0245C00846b6729m574k89308F5349B6643J02460K16854H0190K0116
11567A00306J87973K6870m6648j3912b50170A10391e8851E5593i8202b1123I5061
11555B5302c43630b6541A65282g774A21543a43863M408A59681e5851A91997K05933
11544C97930i3955G6959d4535E7796J1064K05881j05682B3113J76833b89890a32707
11532b02116C22458A07978l5687g9515o0963a2337A50664h3611c5267p9034e2678
$$ y = [101581, -88051, -448323, 83422, -144916, -162615, 27953, 228925, 184156, -198139, -191692, -86723, 215928, -82310, -290373, 414169, 16285, 144963, -258021, -634835, -40008, -45039, 115843, 146136, -29039, -80859, 244902, -199525, -15861, 253204, -15755, 124138, -1448, -180711, -78274, -59827, -39582, 300846, -26729, -31303, -320611, 65349, 26643, 129103, 345957, 80190, 100306, 288279, 315149, 268501, 254589, -250170, 110391, -58851, 55593, -98202, -21123, 95061, 25302, -343630, -26541, 165282, -7774, 121543, -143863, -139455, 159681, -55851, 191997, 397930, -93955, 76959, -44535, 57796, 68860, 274741, 169059, 23113, 199946, -289890, -132707, -202116, 322458, 107978, 72291, -79515, -140478, -12337, 150664, -83611, -35267, -114301, -52678]
11520C37791j46145f9955A97204N7980B6382g3333N403I7854K0475C3539P1786
11509A05325b7052A15835J8727J25768F1597j9188b0091A27942B1286J11403K60962
11498C93651c17933O0959C65050G2766C3627o067O1060c24495A74990N4985H5091
11486A31089L9803J05709a81980I1253C6413c34467a07567F3354Q2138l7755h9382
11474D10401B0889R0573P8633b67922A77967a08782A77692k290N1827i0352F4275
11462A26998l4288h809q8158B12447g0646B01022o4708C2993J89557e3549g921
11450A27669P9763b01699R9499A69818c49282J07034C17109A01249J38858f0493
11439A00982b66616a14414A45424h6529L0190A46444f2157F696J78531b45145
$$ y = [337791, 191646, -69955, 197204, 255184, 26382, -73333, -67930, 97854, 118329, 33539, 105325, -27052, 115835, 134562, 260330, 61597, 42409, -20091, 127942, 21286, 132689, 393651, -317933, -256974, 365050, 72766, 33627, 27560, 88620, -324495, 174990, 229975, 85091, 131089, 170892, 276601, -181980, 91253, 36413, -334467, -107567, 63354, 145492, 107737, -89382, 410401, 20889, 111462, 190095, -267922, 177967, -108782, 177692, 175402, 227229, -90352, 64275, 126998, 92710, -8809, -96967, 212447, -70646, 201022, 136314, 32993, 222550, -53549, -7921, 127669, 207432, -201699, -102200, 169818, -349282, -242248, 317109, 101249, 240107, -60493, 100982, -266616, -114414, 145424, -86529, -56339, 146444, -62157, 6696, 185227, -245145]
11428d6996k3783j86218A54647a72367k02466a66571H6772a75445B97945r8964
11418A98981J63181a49312d8102k92561c828B26689c21709J57796A46544b98642
11407A50630j8439L1273a73799K1693N0001L0477A95486a15521M4615l25997A12525
11395g8862A34110a22877B4716a64099M0388A83732K4720E4336Q1572b92511g0424
11383B56700A3262K9577b98119h2377A82079n7208a23753d1579G1238e3344A31918
11371A20621h8127q5735B28841d3647C4745a02628D5152b30003D04774a8889l59070
11360c77959A26849b58846d5137j80775j34673a56280d9149q531j79516H6490
11349A7431O2380N6473A8663d2140k51135a20469M4881M826A1598J17905J27880
$$ y = [-46996, -70779, -256997, 154647, -172367, -374833, -166571, 86772, -175445, 297945, 198981, 362162, -149312, -48102, -340663, -3828, 226689, -321709, -163913, 146544, -298642, 150630, 132191, 163464, -173799, -152106, -102105, -71628, 195486, -115521, -70906, -396903, 112525, -78862, 134110, -122877, 24716, -164099, -123711, 183732, 208452, 54336, 135908, -292511, -70424, 256700, 13262, 42839, -298119, -82377, 182079, 124871, -123753, -41579, 71238, -53344, 131918, 120621, -88127, -173862, 228841, -43647, 34745, -102628, 45152, -230003, 404774, -18889, -377959, 126849, -258846, -45137, -225912, -360585, -156280, -49149, -57680, -237196, 86490, 17431, 79811, 136284, 18663, -42140, -293275, -120469, -75588, -70762, 11598, 129503, 257383]
11338B57383a669C41273m6638f3799R417j64903C2265E285J25921c05067a30256
11326a40810C3386f771A40697b22639B5674J51312G7965L4595A0469a85062e1407
11314A54213c09860f0884A27777L79824b8953I0267b996C27273A5271K98809l5806
11303B78274C2584b82636Q4954P0049B972a71156B868c17856L2794d166C8420
11291c80420A12755N9576b24971A40970g0466j7459p9620C0283J13160E5461b56210
11279c6426P64a7401B15313i387k20989A16197D9953b82505h6934k6725j26288
11268b39947A36063b4566j96914C00097d40896d5258m7470j75788A84655q3746
11258A00909a99798R5570K1723D3409J07756b20538B59148n8919b4340B08217
$$ y = [257383, -1669, 341273, 294635, -63799, -54382, -219285, 32265, 5285, 131206, -305067, -130256, -140810, 33386, -6771, 140697, -222639, 25674, 176986, 77965, 112560, 10469, -185062, -51407, 154213, -309860, -60884, 127777, 507601, -28953, 90267, -2996, 327273, 15271, 314080, 278274, 32584, -282636, -197682, -127633, 2972, -171156, 2868, -317856, -285062, -4166, 38420, -380420, 112755, 172331, -224971, 140970, -70466, -87925, -167545, 30283, 143443, 55461, -256210, -36426, -35662, -17401, 215313, -9387, -230376, 116197, 49953, -282505, -86934, -113659, -239947, 136063, -24566, -221480, 300097, -440896, -45258, -92728, -268516, 184655, 100909, -199798, -104228, -82505, 43409, 151165, -220538, 259148, 200229, -24340, 208217]
11247a08014j5283C0324O172b35784C29621o5650i7408A45014A1727a33425A89625
11235e3794m449j65072b025k39736A58871e5194F1615a04616j32138C2286b12345
11223e1365l27180B10175a76839M0168j59769F4553a08153j36860E254a90769
11212f3213j08274A3563J38366J09652f8227j14344n4238c2087j50074B9971b2639
11200d32027g1541k02232l4386B1396c3191A41968E6557a45290A33785a23859
11189a25172j68850J31667q1001J09029A0602a61712o215A7583b18840G1101a09218
11177D1914b79080R6936b0147H1383a01282B6173b94349A78795a92013E0080J31260
11166A81340J10283e32420a39718F5009K78121a59462E1244a2871B09118e5082
$$ y = [-108014, -123297, 30324, 36496, -235784, 329621, 263971, -97408, 145014, 11727, -133425, 189625, -53794, -58243, -223315, -2025, -241761, 158871, -55194, 61615, -104616, -236754, 32286, -212345, -51365, -378545, 210175, -176839, -136671, -296440, 64553, -108153, -245013, 5254, -190769, -63213, -171487, 13563, 151929, 261581, -68227, -182571, -236809, -32087, -182161, 29971, -22639, -432027, -71541, -273773, -308159, 21396, -33191, 141968, 56557, -145290, 133785, -123859, -125172, -294022, -162355, -243356, -134327, 10602, -161712, -167927, 17583, -218840, 71101, -109218, 41914, -279080, -182144, -20147, 81383, -101282, 26173, -294349, 178795, -192013, 50080, 181340, 291623, -532420, -139718, 65009, 343130, -159462, 51244, -12871, 209118, -55082]
11155a47084A50404a69353G9556a22965A00826m3998N6834c23450g2881J1136
11145f1745B24310a35590M0801j30592A0735a83282e0026G0260e5488j16715A17070
11133C90968H263O4283c4452B03468r5444b0580A9259K28371G350J12462b2545
11121H6188K08846a97072A74317g7657B0386a699B042i9647B5J82181a7920C7865
11108D1462R6734R0460N4268r5304D290N1892K2933k5384g9508A97875b25627
11096A74979M0493r8239D7628i2414A72867h6864B36961j06468a6850A00535l9830
11085F0705K52611j36181M04593F3346G400K63302a46212A49128a68905a124C4223
11073A12091J78025j26172D5235J48897L24235B41863G1798d88B06508j5727K60495
$$ y = [-147084, 150404, -169353, 79556, -122965, 100826, 56828, 113662, -323450, -72881, -61745, 224310, -135590, -94789, -225381, 10735, -183282, -50026, 70260, -55488, -172203, 117070, 390968, 8263, 72546, -34452, 203468, 108024, -20580, 19259, 247630, 7350, 119812, -22545, 86188, 295034, -197072, 174317, -77657, 20386, -1699, 2042, -99647, 25, 182206, -17920, 37865, 41462, 138196, 228656, 282924, 187620, 4290, 56182, 79115, 53731, -79508, 197875, -225627, 174979, 215472, 117233, 47628, -92414, 172867, -86864, 236961, 130493, -16850, 100535, 60705, 313316, 177135, 581728, 63346, 7400, 270702, -146212, 149128, -168905, -1124, 34223, 112091, 290116, 163944, 45235, 194132, 518367, 241863, 71798, -488, 206508, 190781, 451276]
11062D51276j86572J09164n1196l6514K41788K4221j42975R0844l182K34310k38217
11051D92947j01538P29844D37027K41855r9055j52457J94185j4364K48504k29636
11041F26059J46324k01951J42971l13510K89730k85144J78036L44141m06614L1339
11031E51381p5729j7620K37722k03916r5872K03284J1036j16447r9735J95594
11021E89698k21494J27377O64715m73775j40705O6273k64427K23477k52519L95795
11011G14415l9028k91813L48235C14338R9380l8265L82711l07334K1648k5709
11001D46769M70010l33055j44548J43263K82085l83503j72720J37885q7735j4397
10991C44054L63289l26998K09623Q1639l8157j84766O58202n38540j54170K93176
$$ y = [451276, 264704, 373868, 322672, 286158, 527946, 552167, 409192, 500036, 496854, 731164, 492947, 391409, 1121253, 437027, 678882, 579827, 427370, 621555, 607191, 855695, 626059, 772383, 570432, 713403, 399893, 689623, 404479, 582515, 926656, 520042, 551381, 475652, 458032, 695754, 491838, 395966, 599250, 610286, 493839, 394104, 589698, 368204, 495581, 1160296, 686521, 545816, 612089, 347662, 571139, 318620, 714415, 675387, 383574, 731809, 314338, 413718, 375453, 758164, 450830, 472478, 446769, 916779, 583724, 439176, 582439, 864524, 481021, 308301, 446186, 358451, 344054, 707343, 380345, 589968, 671607, 633450, 448684, 1106886, 568346, 414176, 707352]
10981G07352J07647L4972j0418J67797k96914J90889K35071L59430k7644P8959
10971A547141K21010J93975J26821K34960K45915l41526n3983r8349k3749m95653
10961A556562R5186j50182k76952K52303o735r6453Q7159O3898l82015M29145
10951A571916j00815l09220r5633k97324P8590k19775j8407K5199B66272L1726
10941B97998M0597A52583J6924f172k2978H2088i9573m9160C3539Q4630a10215
10929a43170C37171G6011J92509a98143C72856A66671Q4217b50215A75490a99684
10918b18352I303e3032o7557M9097a8924A45731J33231a85026B7014b70211g4312
10906a13187A87244A1196a75841A96832D3725i242j00268e1567j67834r4250B367
$$ y = [707352, 814999, 849971, 839553, 1007350, 710436, 901325, 1136396, 1495826, 1468182, 1547141, 1768151, 1962126, 2088947, 2323907, 2569822, 2228296, 2174313, 2075964, 2052215, 1556562, 1651748, 1501566, 1224614, 1476917, 1470182, 1373729, 1460888, 1524786, 1142771, 1571916, 1471101, 1161881, 1066248, 768924, 847514, 627739, 609332, 634531, 266272, 297998, 338595, 152583, 169507, -6172, -29150, 82088, -99573, -148733, 33539, 118169, -110215, -143170, 337171, 76011, 268520, -198143, 372856, 166671, 250888, -250215, 175490, -199684, -218352, 9303, -53032, -120589, -71492, -18924, 145731, 278962, -185026, 27014, -270211, -74312, -113187, 187244, 11196, -175841, 196832, 43725, -9242, -109510, -51567, -219401, -313651, 2367]
10894a05261K7098k4893c3420j5719G3265A5680a8196B5467J8559d57405C52167
10882d9032m9111A64333F0684f3702o7719d6891A07527J87106e14270i768k1057
10871c0825P70P645m5268j92139B17958a6921C67158h5314J3157k09798h2698
10859B1746f2420j51556D28497h9715j02626D527J97206f0517K0181E2452J9482
10848G1934J9395P3402q320a4030A72987a46374A9707D369K45588q8694b621B64496
10835H305c78836a08191N3650j96280A80790K7693o6380i7951H3533b27340l4848
10824b62188l562A20532Q0111b45561K5493A31166b12703q0380H3107k0154K26782
10813B89735c58224A6404h7152j02450b8981B37110H0515c28673C94321a17793
$$ y = [-105261, -78163, -103056, -33420, -49139, 73265, 15680, -18196, 25467, 44026, -457405, 352167, -49032, -98143, 164333, 60684, -63702, -131421, -46891, 107527, 294633, -514270, -9768, -30825, -30055, -22410, -67678, -259817, 217958, -16921, 367158, -85314, -72157, -281955, -82698, 21746, -62420, -213976, 428497, -89715, -192341, 4527, 201733, -60517, -40336, 52452, 71934, 91329, 164731, 156411, -14030, 172987, -146374, 19707, 4369, 249957, 161263, -2621, 264496, 8305, -378836, -108191, -54541, -250821, 180790, 208483, 142103, -97951, 83533, -227340, -262188, -265750, 120532, 200643, -245561, -220068, 131166, -212703, -293083, 83107, 62953, 289735, -358224, 16404, -87152, -189602, -28981, 237110, 80515, -328673, 394321, -117793]
10802a18338C9567a70115q7664A59914E96e0257G6794f0140a3702B4812J01178
10791A25990a79388f9163o9868d1829A77606f409q4754o7405E1887a90091B68547
10779I478J6490b06702f8620A0392b32047A66300R3057j27512i8904F0686a96861
10767A2615J09131c4568k654j18123j5911f0523j1756D4384b4584a1099I5485
10755B68374h5232j8430q3401k75350B18130A6740d03035G8222K07729r3079c5995
10743f0858j07628E4370a94442R6348o4636E186e1316k3971H3672c87031i17l51555
10731c52472i6382C587J91642c9531o1636B91648A04002b7012B49348B5505b62510
10719A93489c07997a06451F4234b54855m76A82173d4313k1990k34556C8013L14108
$$ y = [-118338, 39567, -170115, -257779, 159914, 596, -50257, 76794, -60140, -13702, 24812, 125990, -179388, -69163, -139031, -41829, 177606, -6409, -91163, -158568, 51887, -190091, 268547, 9478, 25968, -206702, -68620, 10392, -232047, 166300, 259357, 131845, -98904, 60686, -196861, 12615, 121746, -34568, -37222, -155345, -171256, -60523, -72279, 44384, -24584, -11099, 95485, 268374, -85232, -103662, -187063, -462413, 218130, 16740, -403035, 78222, 285951, 192872, -35995, -60858, -168486, 54370, -194442, -98094, -162730, 5186, -51316, -75287, 83672, -387031, -917, -352472, -96382, 3587, 195229, -39531, -101167, 291648, 104002, -27012, 249348, 25505, -262510, 193489, -307997, -106451, 64234, -254855, -255331, 182173, -44313, -66303, -300859, 38013, 352121]
10708C52121a77410I4679a86101F2758a99260O3378k0841j41224a12335j61578
10698b73913A38313a98938Q188l09260A55656b76297a17275j31936J1995D460
10687c4330A75988e96258a52495N8267j08897K5777N5392B9699R0250n7346e6950
10675a08277L0165b0411p4428A192a44820A63967F2688a03183E5504B6689b49812
10663b19965L9048q1819O2686M0982d2896l00243P2449D41458h2419n8006p2166
10652b12591d0838B53523a95910P9911L417A63556a27530q3016R1393F2159d7023
10640a19454l4548h77k25900B58546a21823j9842B16332A02759a75872m27720
10630f03592B77395E6569B3230J04918a2682j12741J3564k09495a9007r1426c7253
$$ y = [352121, -177410, 94679, -186101, 62758, -199260, -135882, -156723, -297947, -112335, -273913, 138313, -198938, -190750, -500010, 155656, -276297, -117275, -249211, -237216, 4460, -34330, 175988, -596258, -152495, -94228, -203125, -177348, -121956, 29699, 119949, 62603, -56950, -108277, -78112, -20411, -94839, 1192, -144820, 163967, 62688, -103183, 55504, 26689, -249812, -219965, -180917, -262736, -200050, -159068, -42896, -343139, -270690, 441458, -82419, -140425, -212591, -40838, 253523, -195910, -115999, -112582, 163556, -127530, -210546, -119153, 62159, -47023, -119454, -154002, -877, -226777, 258546, -121823, -141665, 216332, 102759, -175872, -603592, 277395, 56569, 23230, 128148, -12682, -125423, -111859, -321354, -19007, -110433, -37253]
10618g3598J9104r4796e0090b0618A94036H21O0718f1277B06608d82881a64607
10606b36705B8922L28972b2636A85104a68955M2457A89303F1712f2424j43405
10596b05829m8301R0895e9429j7074C02294f738q4490F5347f3075b3366j53953
10585a77319A63642C5508d79196E771J12894b09174J00342A17634m1449J64723
10575B40908b85640D0176a65119J9014O6414q1601F4491b44211J13680A42001
10564C8544a24341B8820H319K31899A05869b27904C0978J4859e1956A14783N437
10553A20220j7262J31109A4952a97957f9139j67041F3758A0030K00844D1559a38073
10541a23087A19414g2084F3580b10067B57395r2912m1625b45494M4326d6099p1563
$$ y = [-73598, -54494, -149290, -50090, -20618, 194036, 821, 61539, -61277, 206608, -482881, -164607, -236705, 28922, 357894, -22636, 185104, -168955, -126498, 189303, 61712, -62424, -205829, -254130, -163235, -59429, -76503, 302294, -6738, -91228, 65347, -63075, -23366, -177319, 163642, 35508, -479196, 5771, 118665, -209174, -108832, 117634, 76185, 240908, -285640, 40176, -165119, -146105, -79691, -161292, 64491, -244211, -130531, 142001, 38544, -124341, 28820, 8319, 240218, 105869, -227904, 30978, 45837, -51956, 114783, 120220, 102958, 234067, 14952, -197957, -69139, -236180, 63758, 10030, 210874, 41559, -138073, -123087, 119414, -72084, 63580, -210067, 257395, 164483, 122858, -245494, -201168, -46099, -117662]
10530a17662Q510A12117m7839l1553a5139A068b09658f7648A27715A0066a45255
10518b39307c1488P376A12432c54505a59292C019K744L4671J08541O2916D0760
10506a94132I2750L4047a94922f7490j04362I9618a87631P4108E686L48529A5664
10494d7104K3059I0952m3271K2708C2104M8229q68e0217o5182c7697q7808j0442
10482a35947a6206A9989R9662D5567f5023j47363B07595r1628c69603B96030d3546
10470C34730r8436D5386J46359C5485a67219A90564J63777a35452M169m5461O9537
10459a07207D5354J60023F4115K6838a90670A3792d4912H7629d93572D286J27203
10448A31489c89247P700a57905H3494a36399B6344d9048J46C68248a06969E9133
$$ y = [-117662, -109152, 112117, 64278, 32725, -15139, 1068, -209658, -67648, 127715, 10066, -145255, -239307, -31488, -24112, 112432, -354505, -159292, 3019, 5763, 40434, 148975, 211891, 40760, -194132, 92750, 126797, -194922, -67490, -171852, 99618, -187631, -113523, 5686, 354215, 15664, -47104, -24045, 90952, 47681, 70389, 32104, 80333, 79465, -50217, -115399, -37697, -125505, -135947, -16206, 19989, 119651, 45567, -65023, -212386, 207595, 115967, -369603, 296030, -43546, 334730, 236294, 45386, 191745, 35485, -167219, 190564, 354341, -135452, -131283, -176744, -107207, 45354, 205377, 64115, 90953, -190670, 13792, -44912, 87629, -493572, 4286, 131489, -389247, -381547, -157905, 83494, -136399, 26344, -49048, -48902, 368248, -106969, 59133]
10436B8774a48953A91994h8649j4862I6995b75933A9356d0283k08091c5505B43609
10424A82935b00187i6178A08664g49n9340m4686k26011C8264a56253A23128h1003
10412a5610k41905d5622q1516A24444f6936l46855A0095a90991a0630j92835c6875
10400a21928L0562n9308j9437b3866r5078A16472a55436a3894B97003i5565A40338
10388B66591J54048A96963g8148A73944I598a61891G6820j4272M7983D6301r8
10377D6203I010L6047j2912a01039B13329L6817l9438q0393j3384Q4029J83801
10366C84761K8611F0518M18652p9935p7322A17248L85835A58489b2488h751f45
10354c9306D04267f7832B45284L11873d9274A0970L72555A42037J89965K78545
$$ y = [28774, -148953, 191994, -88649, -103511, 96995, -275933, 19356, -40283, -248374, -35505, 243609, 182935, -200187, -96178, 108664, -749, -60089, -104775, -330786, 38264, -156253, 123128, -81003, -15610, -257515, -45622, -127138, 124444, -66936, -413791, 10095, -190991, -10630, -203465, -36875, -121928, -91366, -150674, -170111, -23866, -118944, 116472, -155436, -13894, 297003, -95565, 140338, 266591, 420639, 196963, -78148, 173944, 9598, -161891, 76820, 62548, 110531, 46301, 46203, 9010, 45057, 32145, -101039, 213329, 250146, 210708, 130315, 116931, 200960, 384761, 413372, 60518, 479170, 399235, 321913, 117248, 503083, 158489, -22488, -8751, -645, -39306, 404267, -67832, 245284, 557157, -49274, 10970, 383525, 142037, 332002, 610547]
10344F10547k19904G5712M17585l3131j28024F4305e6380B69920h3495B58037
10333C30010C5168g0769B57763b75633Q7319P3641D20552A39497f0762j03547
10323a64309B1014i1741B02831K44261A62186m0597J57593j11849a78985A03609
10312f418A22241J27071b39969B3098K47477p8340a50143D3530a36025d5044j74085
10301b19129K3911C2522q913d056H0149l32a20792A17085a44590C73287A47363
10289b4457H387g9089l56523B29860f084r0860C0781J18015a22263B607e9929
10277D0973d6456n0849D03560h4769h225A34450c05473C15146f9861A42504c37862
10265D1814a9367j23093L6662B23140c0902A32809i300j01083j0799I9009B3820
$$ y = [610547, 390643, 75712, 493297, 460166, 332142, 64305, -56380, 269920, -83495, 258037, 330010, 35168, -70769, 257763, -275633, -188314, -114673, 420552, 139497, -60762, -164309, 21014, -91741, 202831, 447092, 162186, 121589, 279182, 167333, -178985, 103609, -6418, 122241, 249312, -239969, 23098, 270575, 192235, -150143, 43530, -136025, -45044, -219129, -195218, 32522, 23609, -4056, 80149, 79817, -120792, 117085, -144590, 373287, 147363, -24457, 8387, -79089, -435612, 229860, -6084, -96944, 30781, 148796, -122263, 2607, -59929, 40973, -46456, -97305, 403560, -84769, -8225, 134450, -305473, 315146, -69861, 142504, -337862, 41814, -19367, -142460, -105798, 223140, -30902, 132809, -9300, -110383, -121182, 99009, 23820]
10253a5631B8791K2801d8592A02392J3521L202m8590e293F6935M2825B981c11406
10240e8248C56439j48894a5066n8613A69482M5063b21635A85278a51683C7304
10229h1518c6281k43636B55357a85601G5120a13020M715B24998a63420A71331
10218B6093b77875A15140a44584f2388k55152C69679J11916F6604B1085a55961
10207G9337b7992A77429b00211A33071b89534A10034J53276E1900a88479g246
10196A50934A4984o347O7642b13600J9439H2576b12426g5826j44884j20518A33437
10184a4882C9953J81017q1053K8212e817j28658B986b2192l0852j86162k10920
10173d50126K1132b1620j92760B0564b6993j03835j18482L8946b5558j78610g514
$$ y = [-15631, 28791, 51592, -48592, 102392, 115913, 119115, 70525, -5293, 66935, 109760, 2981, -311406, -58248, 356439, 207545, -15066, -73679, 169482, 214545, -221635, 185278, -151683, 37304, -81518, -36281, -279917, 255357, -185601, 75120, -113020, -108305, 224998, -163420, 171331, 26093, -277875, 115140, -144584, -62388, -317540, 369679, 481595, 66604, 21085, -155961, 79337, -27992, 177429, -200211, 133071, -289534, 110034, 263310, 51900, -188479, -7246, 150934, 14984, 8637, 76279, -213600, -194161, 82576, -212426, -75826, -220710, -341228, 133437, -14882, 39953, 220970, 139917, 168129, -5817, -134475, 2986, -22192, -53044, -239206, -450126, -428994, -21620, -214380, 20564, -26993, -130828, -249310, -210364, -25558, -204168, -7514]
10161d08320n4159j35716b7115A27603A1800Q3669e21245C09503b12464B9200
10150b49060a22216j65569h372D0929b84691A3728M3139J50574E1092N6481l9527
10139F8046b0834F9348a62269k6587P7471k32444G5246K0973a43978B02402D6143
10127c79384h9061b7249j5458n8675g473A95774b24019g558A9638R2460b18439
10115a96904m3056A94437b66984O7344j33580a31803D3407N2796b15977b7362
10104b43890g6261a8878C2727c61839h1980B04364G376a48041d848H9340g4866
10092b52725G0606c4625k38923c3169k30083j40958d0745A00988A7909Q237c49515
10080a01397f525j00696D9396R8586b05379p688N3229D4526a01212A6799a97078
$$ y = [-408320, -462479, -598195, -27115, 127603, 11800, 95469, -521245, 309503, -212464, 29200, -249060, -122216, -287785, -8372, 40929, -284691, 13728, 56867, 207441, 51092, 107573, 68046, -20834, 69348, -162269, -188856, -111385, -343829, 75246, 96219, -143978, 202402, 46143, -379384, -89061, -27249, -42707, -101382, -7473, 195774, -224019, -7558, 19638, 112098, -218439, -196904, -239960, 194437, -266984, -199640, -333220, -131803, 43407, 96203, -215977, -27362, -243890, -76261, -18878, 32727, -361839, -81980, 204364, 7376, -148041, -4848, 89340, -74866, -252725, 70606, -34625, -273548, -33169, -263252, -404210, -40745, 100988, 17909, 26146, -349515, -101397, -6525, -107221, 49396, 147982, -205379, -213067, -159838, 44526, -101212, 16799, -197078]
10068E5424e7266n11444a84741q4032h6163B9105p233J51768a02905H7117N8119
10057A45236n8139a31474k4573A1877g3531b7700k95539A7380c31143B77692a61585
10045a82887B80210E7101o946J60678B9500J31708b89117c9705k1311m07433a24496
10033a51516A32378b0753n24k6651K0818j90261M0657O0854d0856f529j4828p0901
10021i2258F3994Q3819c03272c5725k58493N057L2770Q5904e6137C6199b6342
10009G7211A1236b93949A43364F0411K08088a73533l2150G1892g9203n7627j29175
9998b66005h6347k86278R5127E0257a5459p0880K3414j6065l50368H7363a86671
9986a10777D6948A2314J73030i3103A10657a65693O5246B46406E9169B6045a05127
$$ y = [55424, -57266, -568710, -184741, -268773, -86163, 29105, 21872, 173640, -102905, 87117, 145236, 87097, -131474, -156047, 11877, -73531, -27700, -323239, 17380, -331143, 277692, -161585, -182887, 280210, 57101, 50155, 210833, 29500, 161208, -289117, -39705, -61016, -468449, -124496, -151516, 132378, -20753, -21277, -47928, -27110, -217371, -176714, -115860, -40856, -6529, -21357, -92258, 63994, 147813, -303272, -35725, -294218, -289161, -256391, -170487, -56137, 36199, -26342, 77211, 11236, -293949, 143364, 60411, 268499, -173533, -205683, 71892, -79203, -136830, -266005, -86347, -372625, -277498, 50257, -15459, -86339, -62925, -78990, -429358, 87363, -186671, -110777, 46948, 12314, 185344, -93103, 110657, -165693, -100447, 246406, 59169, 26045, -105127]
9974b43227d3041G3381a60654A72113b75361o0773a42048j72350a15469d3843
9963G953a08210N3833E079b13424A06303a04736l26959a7043A00950b8329A09632
9951a97577c1944q7154d6432j5872J4575k30315c4838G761a49658A41073A3942
9939a5771k92163o4740d4856k28340a30660B5391a49525O9811I2717d4230j55243
9928a99473I3658c9172k20430e4479r4528A772b93185a14766D0554d67943F7629
9916b80402h7243D7278A4788J0160a87608H9042a48184j4324a0647B5338b03024
9904b39610k42839A5463K18478a46557B74086A0475P1480J78593B1543K02494
9894B24037c36166J13104J6715e9289p3919M139q2488O6214L9561K9066L7089
$$ y = [-243227, -43041, 73381, -160654, 172113, -275361, -336134, -142048, -314398, -115469, -43843, 7953, -108210, -54377, 5079, -213424, 106303, -104736, -431695, -17043, 100950, -28329, 109632, -197577, -31944, -119098, -46432, -62304, -47729, -278044, -34838, 7761, -149658, 141073, 13942, -15771, -307934, -372674, -44856, -273196, -130660, 25391, -149525, -79714, 92717, -44230, -199473, 93658, -39172, -259602, -54479, -149007, 1772, -293185, -114766, 40554, -467943, 67629, -280402, -87243, 47278, 14788, 24948, -187608, 89042, -148184, -162508, -10647, 25338, -203024, -239610, -482449, 15463, 233941, -146557, 274086, 10475, 81955, 260548, 21543, 224037, -336166, -223062, -206347, -59289, -133208, -129069, -211557, -145343, -105782, -76716, -39627]
9883c9627k25957H465a88461b8488E8141b23892M9474k6050c0947C74284a53994
9871e1926o9965M0940F9596a20809j50834J21872M3295I9410f9437B609O024a24445
9858b72796A77341b99960Q0085j532n693m1544d5361l33313h8112q814A77415
9846C31770E7253R8665e7561A5623a14415A59211a19211B08068A703c95708q285
9835d03993i7514j72438B13743F1779K29889c71140A05405K27153n2545E46a95536
9823c13415F0330b67474A67104Q0578a24398k27338a53018k2440P1926H5226a88983
9811A62243b01554n6184I7343i0031A4530c44099B31562d6622F267a66982A25552
9799A95590a24207P736A32417a21179p1394f7831j57113M3506B27152b50587A56053
$$ y = [-39627, -265584, 8465, -188461, -28488, 58141, -223892, -174418, -200468, -30947, 374284, -153994, -51926, -121891, -80951, 69596, -120809, -271643, -149771, -106476, 99410, -69437, 2609, 8633, -124445, -272796, 177341, -299960, -219875, -221407, -227100, -268644, -45361, -378674, -88112, -96926, 177415, 331770, 57253, 155918, -57561, 15623, -114415, 159211, -119211, 208068, 1703, -395708, -403993, -97514, -269952, 213743, 61779, 291668, -371140, 105405, 332558, 280013, 546, -195536, -313415, 60330, -267474, 167104, 247682, -124398, -351736, -153018, -175458, -103532, 85226, -188983, 162243, -201554, -257738, 97343, -90031, 14530, -344099, 231562, -46622, 6267, -166982, 125552, 195590, -124207, -116471, 132417, -121179, -192573, -67831, -224944, -181438, 227152, -250587, 156053]
9787H9764c05655J06347e2274k880A97472f4113K2474A84879d02188d4877B59493
9775b99685J15521A83261B6284i4786n1944e6954F3175N8396m2715a38088E4429
9763a50791j3501K7582k947A6622a21724b1882o464j46062L4662D9134i941n437
9751a5378o7172A02292a37736b2674l1518j6379j4198k0061n6487C2883K45761
9740B78644j10976b15249P2020j27073r4305a70838L1120A30126G175c8763j90178
9729b28941B68473A03695g3490k26720i5201j54031H8093i0965N577l12268a36056
9717c31571B349a74215j2411q074c6749q4150j56198j307j33274B02929a6261
9705c4313j0100P373q752H8834j0996b57031J26965I585N22N6932b10595F4022
$$ y = [89764, -305655, -199308, -52274, -55154, 197472, -64113, -41639, 184879, -402188, -44877, 259493, -299685, -184164, 183261, 26284, -94786, -146730, -56954, 63175, 121571, 78856, -138088, 54429, -150791, -164292, -136710, -139657, 16622, -121724, -21882, -28346, -174408, -139746, 49134, -9941, -15378, -82550, 102292, -137736, -22674, -54192, -70571, -84769, -104830, -161317, 32883, 278644, 167668, -215249, -143229, -270302, -364607, -170838, -139718, 130126, 7175, -38763, -228941, 268473, 103695, -73490, -300210, -95201, -249232, 88093, -90965, -85388, -397656, -136056, -331571, 2349, -174215, -186626, -194700, -36749, -120899, -277097, -278404, -411678, 202929, -16261, -34313, -44413, -37040, -45792, 88834, 77838, -257031, -130066, 9585, 10107, 67039, -210595, 64022]
9692b33912f2507B9608M5203b0764m8594k2487p594A15765b83819g4635H7795
9680c46794E2507J45849d07894f1128H155K96422A35085d29646E7458b50055C8601
9668h3199M1043j7356k23330A83931g6235A77958i406l9504F3681b5957G9395
9656A92156b9666k26716j26845d8971B7392a68148c0762n0325Q100j64282e1969
9644d9294D1601K22410a78482L1647c0420k47596H2863a86753B20830F7233a40416
9632b6885E6867b0435p4229n5147A16692b80965l875A86247b31939o2091B33122
9620a52215e3238C6496N64L22063A08444a63772i519j20405M1135j15061D2314
9608c06210A44013J6052G6429d2296p9605p9848m8194A72490J01830H4354a93926
$$ y = [-233912, -62507, 29608, 74811, -20764, -69358, -91845, -99439, 115765, -283819, -74635, 87795, -346794, 52507, 198356, -407894, -61128, 8155, 304577, 135085, -429646, 57458, -250055, 38601, -83199, -42156, -59512, -282842, 183931, -76235, 177958, -9406, -48910, 63681, -25957, 79395, 192156, -29666, -256382, -383227, -48971, 27392, -168148, -30762, -81087, -72987, -237269, -51969, -49294, 41601, 264011, -178482, -146835, -30420, -278016, 82863, -186753, 220830, 67233, -140416, -26885, 56867, -20435, -94664, -149811, 116692, -280965, -284840, 186247, -231939, -294030, 233122, -152215, -53238, 36496, 37060, 359123, 108444, -163772, -9519, -129924, -88789, -203850, 42314, -306210, 144013, 160065, 76429, -42296, -121901, -201749, -249943, 172490, 274320, 84354, -193926]
9596C11236G3966d11261c6705j68425C11567a28830A75640g0494A60826E6023
9585B50924a337k85993F2073c53209k7231H7999P5369a02593l09900K02585A49972
9573a06631q8805A26805C1314b8422j05770f4860k5872J8249j98578j38279a11051
9561A0413J7221N7700c45963I1683b61689C3759d41690A554a29143H1158c78722
9549c77018I0284a47417A8220B476Q545J35300h7705a5206A70034a67717A72512
9537a39990B10133d9069I9168B1210L13727H2205b00228j68599b9028B09773I5898
9525i1051I68K41667c73381c6286G6165d88654A05391c1068J3907L131k19146
9514b33176f3771F0978K24140A25601K04872f1137A12716R7340b0095A6418b14413
$$ y = [311236, 73966, -411261, -36705, -205130, 311567, -128830, 175640, -70494, 160826, 56023, 250924, -1337, -287330, 62073, -353209, -380440, 87999, 163368, -102593, -412493, -209908, 149972, -106631, -195436, 126805, 31314, -28422, -134192, -64860, -90732, -72483, -271061, -409340, -111051, 10413, 27634, 85334, -345963, 91683, -261689, 33759, -441690, 1554, -129143, 81158, -378722, -377018, 90284, -147417, 18220, 2476, 11021, 146321, -87705, -15206, 170034, -167717, 172512, -139990, 210133, -49069, 99168, 21210, 334937, 82205, -200228, -368827, -29028, 209773, 95898, -91051, 968, 242635, -373381, -36286, 76165, -488654, 105391, -31068, -17161, -14030, -233176, -63771, 60978, 285118, 125601, 330473, -61137, 112716, 210056, -20095, 16418, -214413]
9502B77385q8634h8954j49147g5210j54886A3248a97830A53505a20936B46483
9491G7424a03542A03529m4990J95707b84198r7381a89653L5470H3253a49694l3091
9480a82785A48374a08837j80837C7636c10138H0597B7801b63010R113R9844A29609
9468b1963k0835l70493e4642P178C3747b95738e7754A25389b28621I9603a1556
9456A45194e3339j40684P3338G9702b32585A15205g3942A19966C6889c88776J62342
9445b26434G186b75208A14310a82791P3368J4437D1496A7963L4004a50044j16274
9434b66318A67322g228j36877B06351D9387a92922j6832F5827M6748c61236A31308
9422i3069j08140N5296E322b44176r3294I2278O9337c55874a21662A65558d4934
$$ y = [277385, 188751, -88954, -238101, -75210, -230096, 13248, -197830, 153505, -120936, 246483, 77424, -103542, 103529, 58539, 254246, -284198, -381579, -189653, -154183, 83253, -149694, -182785, 148374, -108837, -289674, 37636, -310138, 80597, 27801, -263010, -253897, -154053, 129609, -21963, -42798, -413291, -54642, -47464, 33747, -295738, -57754, 125389, -228621, 99603, -11556, 145194, -53339, -194023, -120685, 79702, -232585, 115205, -73942, 119966, 36889, -388776, -226434, 7186, -275208, 114310, -182791, -109423, -94986, 41496, 17963, 51967, -150044, -266318, 167322, -7228, -144105, 206351, 49387, -192922, -209754, 65827, 112575, -361236, 131308, -93069, -201209, -145913, 5322, -244176, -337470, 92278, 161615, -355874, -121662, 165558, -44934]
9410b25240D0726K0728b2520I5103C4528a88949A10215h1462A60360n8351J43384
9399B45393G2379C2402L6734M6039i0810A11740b8907o894M246o241j63538O941
9387a94393N9501b2411B17673b08083O0223P1099j48162D5971c04101A13003C2902
9375A26614g3750k6009j20515F7877J06912b28896i5821O688C640b62535k0440
9364b82975Q1361R5065j81136e7540k58724B85115C3398Q0615r641b2314j66583
9353a88897K7930n8099B60138d58637C3093c6242j64257J2976k2305k1527D18591
9341i2844A89138K3645h2455k82631a63668c0966m0381j4668C5590b16126j47743
9330c63869j52039E8084h403A39250a15151J7623A49026e506l32184J18201J06175
$$ y = [-225240, 40726, 61454, -22520, 95103, 34528, -188949, 110215, -81462, 160360, 102009, 245393, 72379, 32402, 69136, 115175, -90810, 111740, -28907, -35801, -31555, -37796, -201334, -194393, -134892, -22411, 217673, -208083, -147860, -76761, -224923, 45971, -304101, 113003, 32902, 126614, -73750, -99759, -220274, 67877, 174789, -228896, -95821, -89133, 3640, -262535, -282975, -201614, -106549, -287685, -57540, -316264, 285115, 33398, 114013, 104372, -22314, -188897, -160967, -219066, 260138, -458637, 33093, -36242, -200499, -187523, -209828, -231355, 418591, -92844, 189138, 212783, -82455, -365086, -163668, -30966, -71347, -86015, 35590, -216126, -363869, -515908, 58084, -8403, 139250, -115151, -97528, 149026, -5506, -337690, -219489, -113314]
9319a13314A0304b25516D817d11164g9754n1083q01A74745a16524c1393j92964
9308b24357C2138a90987j79639a34823k7497q1955j20630a25995Q33l16293f7618
9296A70307c46558A44395a64721j0707A10720d2431k14929h5318C15127E9214
9285A3883d9671j92996L903M6372b7909j68438B8558R7980n1769a99052D0838
9273b30541P5236n6919o7121b8957j13795B56325n1190n2327b28062j90552a52223
9261a3752j48361b6962A43414a98781O4059C1171J94193m7272b96250R3247i4384
9249B24894a75606p0941A98189B5165a71757C52482D5715J45631g7373p6140H6390
9237H0494b03231p4357c6107r034H4798J215e3484f50A49573g2711l00106J07826
$$ y = [-113314, 10304, -225516, 4817, -411164, -79754, -130837, -131638, 174745, -116524, -31393, -224357, 32138, -190987, -370626, -134823, -162320, -244275, -364905, -125995, -125162, -441455, -67618, 170307, -346558, 144395, -164721, -175428, 110720, -42431, -257360, -85318, 315127, 59214, 13883, -49671, -242667, -238764, -192392, -27909, -196347, 28558, 126538, 74769, -199052, 40838, -230541, -155305, -212224, -279345, -28957, -142752, 256325, 205135, 152808, -228062, -418614, -152223, -13752, -162113, -26962, 143414, -198781, -134722, 31171, 225364, 178092, -296250, -203003, -94384, 224894, -175606, -246547, 198189, 25165, -171757, 352482, 45715, 191346, -77373, -153513, 86390, 80494, -203231, -277588, -36107, -45141, 84798, 86013, -53484, -650, 149573, -72711, -372817, -264991]
9225b64991B8877J03309E8447h796k56537I1457a68308A09731e141B2037a17734
9213a0988B15428c31366J44876Q7953A43435i2228b0430A65100D8314c9377l7900
9202g7277j45584B16864a75046F5785j2581L0017a96477e955A13910f3047l8145
9191a01192A88911c37800A07120b84611A64197a44366Q065K8251p8114h3288j28317
9180b11605h0371A82555a07149A392a03451B05152a57764A04960M5638B1209a11616
9168D2668d07123b9391j36030L7180n3039g0148E7398c29187O7352H6554k214
9157H4340h7810j05984A9421a24733J4184G0329L4313a94689k1653C6069f1548
9145B78512b36521A29156b00306h1991l43489A54934a35208K9440a4848B06515
$$ y = [-264991, 28877, 132186, 58447, -8796, -265333, 91457, -168308, 109731, -5141, 22037, -117734, -10988, 215428, -331366, -186490, -98537, 143435, -92228, -20430, 165100, 48314, -39377, -77277, -222861, 216864, -175046, 65785, 53204, 83221, -196477, -5955, 113910, -63047, -101192, 188911, -337800, 107120, -284611, 164197, -144366, -136301, -108050, -186164, -83288, -211605, -80371, 182555, -107149, 1392, -103451, 205152, -157764, 104960, 150598, 21209, -111616, 42668, -407123, -29391, -165421, -128241, -181280, -70148, 57398, -329187, -261835, 86554, 84340, -87810, -193794, 19421, -124733, -110549, 70329, 104642, -194689, -216342, 36069, -61548, 278512, -236521, 129156, -200306, -81991, -425480, 154934, -135208, -105768, -14848, 206515]
9134i499A06147b5059D4204J02312E6975F598K28893e6007C27031a1924j91434
9123b03358e737k08045A7950K88159a1560n27776m7540a78644j53954A84587F7236
9111F0591C64i6937c0336A2326e03363g9343j8423A47222e9295A51140b07079
9099f1440J4606k72781A87946o6268K4609J15414b49698f8557l09241G6499e9346
9087b13701Q594F0598R8885a00262j5624b6482C0824b78196P3132c6292j84602
9076b20894j2221P4218B76039F478b73346N9962d6696k68550B26290c69369d6929
9064B32626a06730p3012h9729K4187E9854b79643A72357c10816a1744q2388c9671
9052C746K54844H6918a34023l4723C17749I0262M4762a91881B2557R1654a65140
$$ y = [-9499, 106147, -25059, 44204, 146516, 56975, 6598, 235491, -56007, 327031, -11924, -203358, -5737, -213782, 17950, 306109, -11560, -539336, -586876, -178644, -332598, 184587, 67236, 60591, 364, -96937, -30336, 12326, -503363, -79343, -97766, 147222, -59295, 151140, -207079, -61440, -46834, -319615, 187946, 121678, 146287, 261701, -249698, -68557, -377798, 76499, -59346, -213701, -205107, 60598, 159483, -100262, -115886, -26482, 30824, -278196, -205064, -36292, -220894, -233115, -158897, 276039, 6478, -273346, -213384, -46696, -315246, 226290, -369369, -46929, 232626, -106730, -179742, -89729, -65542, 59854, -279643, 172357, -310816, -11744, -94132, -39671, 3746, 258590, 86918, -134023, -168746, 317749, 90262, 135024, -191881, 22557, 114211, -165140]
9040a40722j70861b3800D3806e6866j64569i5791A85116b53422a18273C8886N6018
9029I4904g2888k19095O5413J0395A12591C7682R2744g9899C7990K6282c82721
9017C76310b20014A96944D5640k1608a25183K5979b5953A39236C8698J01373b91342
9005A2856a68223d5222q0990K109N0031B55025E7263c30506k544i4097K6438r8538
8993a66197b5828H6675b05323D86203i7860N342A01816l4668g8661A65247b86664
8981i8935l56069a58037O9430c8207k23253A40309L3295i899K526j73548C0147
8969I2937d04348h6426B08808c05038e9797B1820R3443b46794a05770m9206H1310
8957a51176B89169b40012i7143C5083a33295j25540b1301C48891q196e1825j65791
$$ y = [-140722, -311583, -23800, 43806, -56866, -221435, -95791, 185116, -253422, -118273, 38886, 94904, -72888, -291983, -226570, -216175, 112591, 37682, 130426, -79899, 37990, 64272, -382721, 376310, -220014, 196944, 45640, 24032, -125183, -99204, -25953, 139236, 38698, 140071, -291342, 12856, -168223, -45222, -126212, -124103, -74072, 255025, 57263, -330506, -333050, -94097, -67659, -166197, -25828, 86675, -205323, 486203, -97860, -92518, 101816, 67148, -78661, 165247, -286664, -98935, -455004, -158037, -88607, -38207, -261460, 140309, 173604, -9899, -7373, -180921, 30147, 92937, -404348, -86426, 208808, -305038, -59797, 21820, 115263, -246794, -105770, -154976, 81310, -151176, 289169, -240012, -97143, 35083, -133295, -258835, -21301, 348891, 340695, -51825, -217616]
8946b17616A90987a6434l16525e4071C5357o800c12509a18839e6436A78705b3015
8934b69426A04165e9889D93169A12318M0741b21551C882b02098D6438r317K59758
8923B96879J18030N5554R02985K296714J0261132l443950B354330H38324l33300
8914E05024k50456G2195J01809p6283L33370d9367p5488O0046A6422J28123b5585
8902h402k20087A11176f9984F8016d5421l1428l55781B42802a87431p6040a5952
8890a37289r1355Q9700k8354A22181D6403a48174c6817B4983J21515k7221A8239
8878f7047m3723l4927j11080c7881j53566M8594o0962E2835J64326a99720H4444
8866a32885k2506k52238H6639g517E39160A89814P4113c72588A4605a34351a123
$$ y = [-217616, 190987, -16434, -332959, -54071, 35357, 28557, -312509, -118839, -56436, 178705, -23015, -269426, 104165, -59889, 493169, 112318, 153059, -221551, 3882, -202098, 46438, 37121, 296879, 414909, 470463, 1373448, 3670162, 13931294, 10487344, 2354330, 838324, 505024, 254568, 72195, 174004, 97721, 431091, -49367, -124855, -64809, 16422, 144545, -25585, -8402, -228489, 111176, -69984, 68016, -45421, -76849, -432630, 242802, -187431, -263471, -15952, -137289, -228644, -138944, -167298, 122181, 46403, -148174, -36817, 24983, 146498, 119277, 18239, -67047, -110770, -145697, -256777, -37881, -191447, -142853, -203815, 52835, 217161, -199720, 84444, -132885, -155391, -407629, 86639, -7517, 539160, 189814, 263927, -372588, 14605, -134351, -1123]
8854a77266F1922d6455I9739L2553J0273c37285G3766K1154d7550J2190o4207
8843i9567j77416Q9866o0509i7244j78720A10926a76620H1214c03887A07998a89412
8831a38659A30874a96283f3220k7148r5244j3294A28158g0284r0529k04220A31874
8819b75648O5332o9419j6656a29172d5358q6952N733A6854J25825a61257K0893
8808a40364e2760b0048j5555r2922A47017d1363p7199q2861d451C5269b86767
$$ y = [-177266, 61922, -46455, 99739, 132292, 142565, -337285, 73766, 94920, -47550, -35360, -99567, -276983, -187117, -247626, -97244, -275964, 110926, -176620, 81214, -303887, 107998, -189412, -138659, 130874, -196283, -63220, -90368, -185612, -198906, 128158, -70284, -160813, -365033, 131874, -275648, -210316, -279735, -296391, -129172, -45358, -132310, -126577, 16854, 142679, -161257, -140364, -52760, -20048, -35603, -128525, 147017, -41363, -118562, -201423, -4451, 35269, -286767]
$$ [...]
##END NTUPLES=NMR SPECTRUM
##END=
