
##TITLE=AC1345_GUAAH12163_6647494_LoplXEoAPo
##JCAMPDX= 6.0         $$ Bruker NMR JCAMP-DX V2.0
##DATA TYPE= NMR SPECTRUM
##DATA CLASS= NTUPLES
##ORIGIN= BRUKER
##OWNER= Administrator
$$ 1.72 TOPSPIN		Version 2.1
$$ 2012-08-10 20:49:50.515 -0500  Administrator@TOPSPIN
$$ Compression mode = diff/dup
##.OBSERVE FREQUENCY= 400.02188249412
##.OBSERVE NUCLEUS= ^1H
##.ACQUISITION MODE= SIMULTANEOUS (DQD)
##.ACQUISITION SCHEME= undefined
##.AVERAGES= 64
##.DIGITISER RES= 22
##SPECTROMETER/DATA SYSTEM= spect
##.PULSE SEQUENCE= noesygpps1d.comp
##.SOLVENT NAME= COFFEE_meoh
##.SHIFT REFERENCE= INTERNAL, COFFEE_meoh, 1, 14.96266
##AUDIT TRAIL= $$ (NUMBER, WHEN, WHO, WHERE, PROCESS, VERSION, WHAT)
$$ ##TITLE= Audit trail, TOPSPIN		Version 2.1
$$ ##JCAMPDX= 5.01
$$ ##ORIGIN= Bruker BioSpin GmbH
$$ ##OWNER= Administrator
$$ $$ C:\Bruker\TOPSPIN/data/COFFEE/nmr/AC1345_GUAAH12163_6647494_LoplXEoAPo/22/pdata/1/auditp.txt
$$ ##AUDIT TRAIL=  $$ (NUMBER, WHEN, WHO, WHERE, PROCESS, VERSION, WHAT)
(   1,<2012-08-10 20:49:45.359 -0500>,<Administrator>,<TOPSPIN>,<go>,<TOPSPIN 2.1>,
      <created by zg
	started at 2012-08-10 20:38:15.140 -0500,
	POWCHK enabled, PULCHK disabled,
       configuration hash MD5:
       6B 1B 68 BB D9 2E 58 E2 7F 35 AD 54 07 DF 0E 41
       data hash MD5: 64K
       33 FF 2F 01 30 4F 1D 95 52 FB A1 6F 0D 5C 7A C1>)
(   2,<2012-08-10 20:49:48.187 -0500>,<Administrator>,<TOPSPIN>,<proc1d>,<TOPSPIN 2.1>,
      <Start of raw data processing
       efp LB = 0.3 FT_mod = 6 PKNL = 1 PHC0 = 0 PHC1 = 0 SI = 128K 
       data hash MD5: 128K
       94 93 D6 83 F9 9C D9 E1 52 70 B5 49 B6 52 B9 EC>)
(   3,<2012-08-10 20:49:49.625 -0500>,<Administrator>,<TOPSPIN>,<proc1d>,<TOPSPIN 2.1>,
      <pk PHC0 = 0.8624268 PHC1 = 0 
       data hash MD5: 128K
       D9 F0 10 E9 61 64 CE 7E 5A B9 7E A6 7F E6 9A 73>)
(   4,<2012-08-10 20:49:50.187 -0500>,<Administrator>,<TOPSPIN>,<proc1d>,<TOPSPIN 2.1>,
      <abs ABSG = 1 
       data hash MD5: 128K
       C0 5A 01 CA F9 8E C8 A4 BD 69 6F 87 52 4D D9 61>)
(   5,<2012-08-10 20:49:50.265 -0500>,<Administrator>,<TOPSPIN>,<proc1d>,<TOPSPIN 2.1>,
      <abs ABSG = 2 
       data hash MD5: 128K
       D6 42 2C A1 E9 5F D9 7B 66 8D DE 4A A7 44 E7 51>)
(   6,<2012-08-10 20:49:50.312 -0500>,<Administrator>,<TOPSPIN>,<proc1d>,<TOPSPIN 2.1>,
      <abs ABSG = 3 
       data hash MD5: 128K
       1F B5 CC 6F C5 DE 90 5E 65 45 69 F3 4E 4C 50 4B>)
(   7,<2012-08-10 20:49:50.390 -0500>,<Administrator>,<TOPSPIN>,<proc1d>,<TOPSPIN 2.1>,
      <abs ABSG = 4 
       data hash MD5: 128K
       D1 30 DC 69 B1 CA E2 7F E4 37 83 DC E5 4C 2C E3>)
(   8,<2012-08-10 20:49:50.437 -0500>,<Administrator>,<TOPSPIN>,<proc1d>,<TOPSPIN 2.1>,
      <abs ABSG = 5 
       data hash MD5: 128K
       09 45 51 0C B0 24 98 56 2E 18 1D BB 84 D9 FA 58>)
$$ ##END=
$$ 
$$ $$ hash MD5
$$ $$ 6A 6B 57 19 1E D3 E1 FD 0A AE FC CB A9 0F C8 76
##$RELAX= 
##$RELAX= 
##$RELAX= 
##$RELAX= 
##$RELAX= 
##$RELAX= 
##$RELAX= 
##$RELAX= 
$$ Bruker specific parameters
$$ [...]
##$TP07= 0
##$TPNAME0= <>
##$TPNAME1= <>
##$TPNAME2= <>
##$TPNAME3= <>
##$TPNAME4= <>
##$TPNAME5= <>
##$TPNAME6= <>
##$TPNAME7= <>
##$TPOAL= (0..7)
0.5 0.5 0.5 0.5 0.5 0.5 0.5 0.5
##$TPOFFS= (0..7)
0 0 0 0 0 0 0 0
##$TUNHIN= 0
##$TUNHOUT= 0
##$TUNXOUT= 0
##$USERA1= <user>
##$USERA2= <user>
##$USERA3= <user>
##$USERA4= <user>
##$USERA5= <user>
##$V9= 5
##$VALIST= <valist>
##$VCLIST= <CCCCCCCCCCCCCCC>
##$VD= 0
##$VDLIST= <DDDDDDDDDDDDDDD>
##$VPLIST= <PPPPPPPPPPPPPPP>
##$VTLIST= <TTTTTTTTTTTTTTT>
##$WBST= 1024
##$WBSW= 4
##$XGAIN= (0..3)
0 0 0 0
##$XL= 0
##$YL= 0
##$YMAX_a= 15558822
##$YMIN_a= -9003377
##$ZGOPTNS= <>
##$ZL1= 120
##$ZL2= 120
##$ZL3= 120
##$ZL4= 120
##$ABSF1= 14.96266
##$ABSF2= -5.595522
##$ABSG= 5
##$ABSL= 3
##$ALPHA= 0
##$AQORDER= 0
##$ASSFAC= 0
##$ASSFACI= 0
##$ASSFACX= 0
##$ASSWID= 0
##$AUNMP= <proc_prof1d_extract.lims>
##$AXLEFT= 0
##$AXNAME= <>
##$AXNUC= <1H>
##$AXRIGHT= 0
##$AXTYPE= 0
##$AXUNIT= <>
##$AZFE= 0.1
##$AZFW= 0.1
##$BCFW= 0
##$BC_mod= 0
##$BYTORDP= 0
##$COROFFS= 0
##$CY= 15
##$DATMOD= 1
##$DC= 0
##$DFILT= <>
##$DTYPP= 0
##$F1P= 0
##$F2P= 0
##$FCOR= 0.5
##$FTSIZE= 131072
##$FT_mod= 6
##$GAMMA= 0
##$GB= 0
##$INTBC= 1
##$INTSCL= 1
##$ISEN= 128
##$LB= 0.3
##$LEV0= 0
##$LPBIN= 0
##$MAXI= 10000
##$MC2= 0
##$MEAN= 0
##$ME_mod= 0
##$MI= 0
##$NCOEF= 0
##$NC_proc= -2
##$NLEV= 6
##$NOISF1= 0
##$NOISF2= 0
##$NSP= 0
##$NTH_PI= 0
##$NZP= 0
##$OFFSET= 14.96266
##$PC= 1
##$PHC0= 0.8624268
##$PHC1= 0
##$PH_mod= 1
##$PKNL= yes
##$PPARMOD= 0
##$PPDIAG= 0
##$PPIPTYP= 0
##$PPMPNUM= 2147483647
##$PPRESOL= 1
##$PSCAL= 4
##$PSIGN= 0
##$PYNMP= <proc.py>
##$REVERSE= no
##$SF= 400.020008972064
##$SI= 131072
##$SIGF1= 0
##$SIGF2= 0
##$SINO= 400
##$SIOLD= 131072
##$SPECTYP= <>
##$SREGLST= <1H.CDCl3>
##$SSB= 0
##$STSI= 131072
##$STSR= 0
##$SW_p= 8223.68421052631
##$SYMM= 0
##$S_DEV= 0
##$TDeff= 65536
##$TDoff= 0
##$TI= <>
##$TILT= no
##$TM1= 0
##$TM2= 0
##$TOPLEV= 0
##$USERP1= <user>
##$USERP2= <user>
##$USERP3= <user>
##$USERP4= <user>
##$USERP5= <user>
##$WDW= 1
##$XDIM= 131072
##$YMAX_p= 442384433
##$YMIN_p= -11973
##$CURPLOT= <Network HP LaserJet P1505>
##$CURPRIN= <$Network HP LaserJet P1505>
##$DFORMAT= <normdp>
##$LAYOUT= <+/1D_H.xwp>
##$LFORMAT= <normlp>
##$PFORMAT= <normpl>
##$SURQMSG= 1
$$ End of Bruker specific parameters
$$ ---------------------------------
##NTUPLES= NMR SPECTRUM
##VAR_NAME=  FREQUENCY,     SPECTRUM/REAL,   SPECTRUM/IMAG
##SYMBOL=    X,             R,               I
##VAR_TYPE=  INDEPENDENT,   DEPENDENT,       DEPENDENT
##VAR_FORM=  AFFN,          ASDF,            ASDF
##VAR_DIM=   131072,        131072,          131072
##UNITS=     HZ,            ARBITRARY UNITS, ARBITRARY UNITS
##FACTOR=    0.0627417313425164, 1,          1
##FIRST=     8223.62146879497, -3756,        -55423
##LAST=      0,             -1114,           -56578
##MIN=       0,             -11973,          0
##MAX=       8223.62146879497, 442384433,    0
$$ Real data points
##PAGE= N=1
##DATA TABLE= (X++(R..R)), XYDATA
$$ [...]
63215G35701J5066J5788J5973J5573J5044J4659J3840J1684Q148M088O3m213q930
$$ 735701 750767 766555 782528 798101 813145 827804 841644 853328 861476 865564 865627 861414 852484
63202H52484j3499j7344k0618k3526k5518k6067k5632k4955k3795k1434j8196
$$ 852484 838985 821641 801023 777497 751979 725912 700280 675325 651530 630096 611900
63191F11900j5232j2825j0072o523k950p9K452N224Q029J0374J2448J4722J6961
$$ 611900 596668 583843 573771 567248 564298 564219 566671 571895 579924 590298 602746 617468 634429
63178F34429J8394J8781J8801J9297K0446K1601K1906K1156K0086J9549J9533
$$ 634429 652823 671604 690405 709702 730148 751749 773655 794811 814897 834446 853979
63167H53979J9377J8845J8286J7633J6078J3260J0029P359M911J386l839j0034
$$ 853979 873356 892201 910487 928120 944198 957458 967487 974846 979757 981143 977304 967270
63155I67270j5886k0436k3345k4911k5925k7043k8111k8382k7533k6119k4823
$$ 967270 951384 930948 907603 882692 856767 829724 801613 773231 745698 719579 694756
63144F94756k3552k1576j8643j5490j3144j1870j1151j0509r844q955p459n505
$$ 694756 671204 649628 630985 615495 602351 590481 579330 568821 558977 550022 542563 537058
63132E37058m017l621l780l617l136k769k208p80J131K250K191J966K381L008
$$ 537058 533041 529420 525640 522023 518887 516118 513910 513130 514261 516511 518702 520668 523049 526057
63118E26057L260L460M078M779N036N035N233N539N714O004O605P016O721O092
$$ 526057 529317 532777 536855 541634 546670 551705 556938 562477 568191 574195 580800 587816 594537 600629
63104F00629N799N744N445N041N014N172M842L938K932J969Q57k02q42j306k068
$$ 600629 606428 612172 617617 622658 627672 632844 637686 641624 644556 646525 647382 647180 646338 645032 642964
63089F42964k796k742k067j668j618j084m6K89o68j749j615l83J050K440L905
$$ 642964 640168 637426 635359 633691 632073 630989 630943 631232 630564 628815 627200 626817 627867 630307 634212
63074F34212N013N373N597O499P643P922P416P441Q561R795J0176J0150J0797
$$ 634212 639225 644598 650195 656694 664337 672259 679675 687116 695677 705472 715648 725798 736595
63061G36595J2387J4434J6631J9015K1407K3430K5074K6749K8712L0746L2504
$$ 736595 748982 763416 780047 799062 820469 843899 868973 895722 924434 955180 987684
63050I87684L3953L5399L7172L9267M1220M2443M2772M2588M2258M1705M0654
$$ 987684 1021637 1057036 1094208 1133475 1174695 1217138 1259910 1302498 1344756 1386461 1427115
63039A427115L9148L7491L5883L4390L3236L2658L2516L2410L2251L2276L2302
$$ 1427115 1466263 1503754 1539637 1574027 1607263 1639921 1672437 1704847 1737098 1769374 1801676
63028A801676L1517K9284K5829K1640J6531R770J109q737j8697k8008l6260m3145
$$ 1801676 1833193 1862477 1888306 1909946 1926477 1936247 1937356 1928619 1909922 1881914 1845654 1802509
63016A802509m8421n1960n3786n4076n3071n0869m7375m2617l6972l0947k4867
$$ 1802509 1754088 1702128 1648342 1594266 1541195 1490326 1442951 1400334 1363362 1332415 1307548
63005A307548j8986j3576q589l369K668R195J5239K0285K4618K8531L1792L4083
$$ 1307548 1288562 1274986 1266397 1263028 1265696 1274891 1290130 1310415 1335033 1363564 1395356 1429439
62993A429439L5476L6321L6958L7623L8176L7893L6107L3282L0791K9337K8131
$$ 1429439 1464915 1501236 1538194 1575817 1613993 1651886 1687993 1721275 1752066 1781403 1809534
62982A809534K6004K2769J8933J4600R269K528n565j4566k3695l2150l9758m7043
$$ 1809534 1835538 1858307 1877240 1891840 1901109 1903637 1898072 1883506 1859811 1827661 1787903 1740860
62970A740860n4207o0400o4565o6638o7274o6688o4586o1105n7035n2949m8762
$$ 1740860 1686653 1626253 1561688 1495050 1427776 1361088 1296502 1235397 1178362 1125413 1076651
62959A076651m4259l9575l4997l0753k7082k4117k1600j9118j6651j4503j2741
$$ 1076651 1032392 992817 957820 927067 899985 875868 854268 835150 818499 803996 791255
62948G91255j1131r666q625q043p589p096o778o814p095p455p719p522o599n377
$$ 791255 780124 770458 761833 753790 746201 739105 732327 725513 718418 710963 703244 695722 689123 683746
62934F83746m682m732m936m924n032n487n727n142m015l058k421j870j653k348
$$ 683746 679064 674332 669396 664472 659440 653953 648226 643084 639069 636011 633590 631720 630067 627719
62920F27719l740m643m187k860j814j446j190o18k07o44j714k366k009j209q54
$$ 627719 623979 619336 615149 612289 610475 609029 607839 607221 607014 606370 604656 602290 600281 599072 598218
62905E98218r77r81p41q03j404j928j703q91k59l64j279k751m239n002m728l981
$$ 598218 597241 596260 595519 594716 593312 591384 589681 588790 588531 588167 586888 584137 579898 574896 570168 566187
62889E66187l647l912m218m139l932m013m354m623m655m505m194l749l405l424
$$ 566187 562540 558628 554410 550271 546339 542326 537972 533349 528694 524189 519995 516246 512841 509417
62875E09417l661l630l101k383j806j235m60J73O4o78j213j042o07m61l38L30
$$ 509417 505756 502126 499025 496642 494836 493601 493141 493314 493378 492700 491487 490445 489838 489377 489039 489369
62859D89369J324J811J453P70K77k2j98l9N42J212J671J979K176K020J481J132
$$ 489369 490693 492504 493957 494727 495004 494982 494784 494745 495287 496499 498170 500149 502325 504345 505826 506958
62843E06958J542K465L137L242L107L002K784K386K245K879M194N422N736M926
$$ 506958 508500 510965 514102 517344 520451 523453 526237 528623 530868 533747 537941 543363 549099 554025
62829E54025L483K141J265P26L51K57N80J020J058O09J57M2k9m83j155j536j584
$$ 554025 557508 559649 560914 561640 561991 562248 562828 563848 564906 565515 565672 565714 565685 565202 564047 562511 560927
62812E60927j824k410k673j984p45j7k73r83j385j162l37R88K431L389L569L241
$$ 560927 559103 556693 554020 552036 551291 551274 551001 550018 548633 547471 547134 548122 550553 553942 557511 560752
62796E60752K849K668L030M249N993P313P824Q379R873J1833J3072J3501J4285
$$ 560752 563601 566269 569299 573548 579541 586854 594678 603057 612930 624763 637835 651336 665621
62783F65621J6225J8979K1977K5141K8410L1416L4209L7492M1618M5969M9900
$$ 665621 681846 700825 722802 747943 776353 807769 841978 879470 921088 967057 1016957
62772A016957N3626N7476O0916O3182O4446O5375O5747O4491O1083N5962M9431
$$ 1016957 1070583 1128059 1188975 1252157 1316603 1381978 1447725 1512216 1573299 1629261 1678692
62761A678692M1030L0443J8341N813o584j8688l0043l9922m7974n4445n9722o3960
$$ 1678692 1719722 1750165 1768506 1774319 1767735 1749047 1719004 1679082 1631108 1576663 1516941 1452981
62749A452981o7041o8649o8402o6234o2755n8947n5384n1909m8127m4042l9961
$$ 1452981 1385940 1317291 1248889 1182655 1119900 1060953 1005569 953660 905533 861491 821530
62738H21530l6006l2134k8604k5963k4245k2592k0105j7042j4599j3493j3156
$$ 821530 785524 753390 724786 698823 674578 651986 631881 614839 600240 586747 573591
62727E73591j2511j1204r711q621q105p926p604o665n118l572k609j997j058K27
$$ 573591 561080 549876 540165 531544 523439 515513 507909 501244 496126 492554 489945 487948 486890 487117
62713D87117J031R41Q62K022M283O211O948P342Q724J1166J3626J5564J7514K0054
$$ 487117 488148 489089 489951 491973 496256 502467 509415 516757 525481 536647 550273 565837 583351 603405
62699F03405K3004K5961K8986L2268L5649L8980M2552M6572N0624N4260N7834
$$ 603405 626409 652370 681356 713624 749273 788253 830805 877377 928001 982261 1040095
62688A040095O1919O5992O8544O8586O6373O2524N7097M9850M0797L0195J8368
$$ 1040095 1102014 1168006 1236550 1305136 1371509 1434033 1491130 1540980 1581777 1611972 1630340
62677A630340N851o636j8604k9903m0364m9617n7329o3256o7111o8897o9206o8587
$$ 1630340 1636191 1629555 1610951 1581048 1540684 1491067 1433738 1370482 1303371 1234474 1165268 1096681
62665A096681o6684o2899n7961n3709n0886m8229m4372l9703l5454l1847k8334
$$ 1096681 1029997 967098 909137 855428 804542 756313 711941 672238 636784 604937 576603
62654E76603k5028k2647k1209j9904j8239j6429j4656j2811j1111j0107r890r888
$$ 576603 551575 528928 507719 487815 469576 453147 438491 425680 414569 404462 394572 384684
62642C84684r587q947q060p026o231o127o620p116p205o921o317n365m207l076
$$ 384684 375097 366150 358090 351064 344833 338706 332086 324970 317765 310844 304527 299162 294955 291879
62628B91879j982j033q12j703k991l463k984k541k628k567j721n01M10R88J504
$$ 291879 289897 288864 288052 286349 283358 279895 276911 274370 271742 269175 267454 266953 267363 268351 269855
62613B69855J817J690J340J124J103J293J899K831L508L652L836M699O038P204
$$ 269855 271672 273362 274702 275826 276929 278222 280121 282952 286460 290112 293948 298647 304685 311889
62599C11889Q009Q701R463J0509J2228J4604J6822J8199J9270K1172K4123K7300
$$ 311889 319898 328599 338062 348571 360799 375403 392225 410424 429694 450866 474989 502289
62587E02289L0083L2602L4958L6721L7524L7483L6657L4635L1050K6224K0902
$$ 502289 532372 564974 599932 636653 674177 711660 748317 782952 814002 840226 861128
62576H61128J5495R935M077k005q092j4016j9595k4426k7889k9593k9855k9484
$$ 861128 876623 886558 890635 888630 880538 866522 846927 822501 794612 765019 735164 705680
62564G05680k8917k7913k6289k4541k3312k2478k1336j9586j7534j5459j3357
$$ 705680 676763 648850 622561 598020 574708 552230 530894 511308 493774 478315 464958
62553D64958j1473j0421j0394j0722j0607j0055r692r859j0219j0239r764r033
$$ 464958 453485 443064 432670 421948 411341 401286 391594 381735 371516 361277 351513 342480
62541C42480q249p340o135m773l701l204l086k923k558k056j394m35P71J973K979
$$ 342480 334231 326891 320756 315983 312282 309078 305992 303069 300511 298455 297061 296626 297397 299370 302349
62526C02349L706M114M337M766N608O450O682O425O537P633R516J1648J3750J5785
$$ 302349 306055 310169 314506 319272 324880 331330 338012 344437 350974 358607 368123 379771 393521 409306
62512D09306J7768J9906K2500K5457K8224L0431L2267L3987L5489L6648L7560
$$ 409306 427074 446980 469480 494937 523161 553592 585859 619846 655335 691983 729543
62501G29543L8042L7317L4854L1162K7113K2648J6834R291Q40p379j4898k1674
$$ 729543 767585 804902 839756 870918 898031 920679 937513 946804 947644 940265 925367 903693
62489I03693k7337l1173l2913l3251l3423l4080l4538l3454l0407k6633k3774
$$ 903693 876356 845183 812270 779019 745596 711516 676978 643524 613117 586484 562710
62478E62710k2095k0426j7795j4560j1805j0108r182q368p133n371l452j887p41
$$ 562710 540615 520189 502394 487834 476029 465921 456739 448371 441238 435867 432415 430528 429787
62465D29787L94J791L208M291N051N651O020O062O060O438P136P621P648P613
$$ 429787 430181 431972 435180 439471 444522 450173 456193 462255 468315 474753 481889 489510 497158 504771
62451E04771Q004Q691R126R184R385J0076J0647J0057Q116N758L717J446k045
$$ 504771 512775 521466 530592 539776 549161 559237 569884 579941 588057 593815 597532 598978 596933
62438E96933o496j0453j3041j4921j6965j8747j9106j7883j6263j5322j4919j4204
$$ 596933 590437 579984 566943 552022 535057 516310 497204 479321 463058 447736 432817 418613
62426D18613j2698j0540q144n959m426l648l072j846L02K627M079M469M694N661
$$ 418613 405915 395375 387231 381272 376846 373198 370126 368280 368582 371209 375288 379757 384451 390112
62412C90112P231Q541R203R638J0163J0373R781Q678P786P368P088O642N922M711
$$ 390112 397343 405884 415087 424725 434888 445261 455042 463720 471506 478874 485962 492604 498526 503237
62398E03237K778L67j893l670n078o111o472o184n907o205o826p059o606n707
$$ 503237 506015 506382 504489 500819 495741 489630 483158 476974 471067 464862 458036 450977 444371 438664
62384D38664m587l180j431M09J930K960L779M945O817R244J1844J4520J7423K0458
$$ 438664 434077 430897 429466 429875 431805 434765 438544 443489 450306 459550 471394 485914 503337 523795
62370E23795K3212K5568K8069L1341L5391L9705M3821M7484N0430N2535N4087
$$ 523795 547007 572575 600644 631985 667376 707081 750902 798386 848816 901351 955438
62359I55438N5508N6637N6677N4920N1246M5852L8843L0401K1053J1443J925p321
$$ 955438 1010946 1067583 1124260 1179180 1230426 1276278 1315121 1345522 1366575 1378018 1379943 1372622
62347A372622j5776k2569k7148k9864l1727l3662l6049l8750m1293m3016m3293
$$ 1372622 1356846 1334277 1307129 1277265 1245538 1211876 1175827 1137077 1095784 1052768 1009475
62336A009475m1930l9311l6056l2534k8813k5111k2087k0473k0289k0563k0119
$$ 1009475 967545 928234 892178 859644 830831 805720 783633 763160 742871 722308 702189
62325G02189j8665j6968j5765j4812j3327j1170r041p431o050m561l380l132l636
$$ 702189 683524 666556 650791 635979 622652 611482 602441 595010 588960 584399 581019 577887 574251
62312E74251m081m168m390n117n956o334o334o580p463q718r677r867r337q526
$$ 574251 570170 566002 561612 556495 550539 544205 537871 531291 523828 515110 505433 495566 486229 477703
62298D77703p746o923n909m782l644k346p53Q13J841K259K441K676L118M051N654
$$ 477703 469957 463034 457125 452343 448699 446353 445600 446413 448254 450513 452954 455630 458748 462799 468453
62283D68453P450Q628R043R331R998J0899J1684J2177J2265J2111J2519J4144
$$ 468453 475903 484531 493574 502905 512903 523802 535486 547663 559928 572039 584558 598702
62271E98702J6187J6944J6108J5409J6267J7964J9112J9978K1938K5316K9162
$$ 598702 614889 631833 647941 663350 679617 697581 716693 736671 758609 783925 813087
62260H13087L2876L6668M0559M4243M7856N1569N4289N4192N0835M5466L8827
$$ 813087 845963 882631 923190 967433 1015289 1066858 1121147 1175339 1226174 1271640 1310467
62249A310467L0129J8929O850l828j2453j9762k6112l1101l4778l7994m1297m4241
$$ 1310467 1340596 1359525 1366375 1362547 1350094 1330332 1304220 1273119 1238341 1200347 1159050 1114809
62237A114809m5935m5924m4413m1993l9195l6076l2341k8042k3839k0354j7487
$$ 1114809 1068874 1022950 978537 936544 897349 861273 828932 800890 777051 756697 739210
62226G39210j4800j2286j0313r027q251p843p699p522p049o412n897n479m997
$$ 739210 724410 712124 701811 692784 684533 676690 668991 661469 654420 648008 642111 636632 631635
62213F31635m597m446m136l091j574n79m72l83O46K488M322N747O896P807Q336
$$ 631635 627038 622592 618456 615365 613791 613212 612740 612357 613003 615491 619813 625560 632456 640263 648599
62198F48599Q678R321J0415J1568J2433J3114J3963J5269J7245J9815K2248K3493
$$ 648599 657277 666598 677013 688581 701014 714128 728091 743360 760605 780420 802668 826161
62186H26161K3240K2340K1693K1050J9428J6559J3314J0691Q946P833P172O952
$$ 826161 849401 871741 893434 914484 933912 950471 963785 974476 983422 991255 998427 1005379
62174A005379P290Q537J0993J4334J7807K1197K5095K9775L4404L7814L9619L9964
$$ 1005379 1012669 1021206 1032199 1046533 1064340 1085537 1110632 1140407 1174811 1212625 1252244 1292208
62162A292208L8667L5439L0612K4897J8584J1788N333L72l008n855q825j1465
$$ 1292208 1330875 1366314 1396926 1421823 1440407 1452195 1457528 1457900 1454892 1449037 1440212 1428747
62150A428747j3355j5004j7012j9045k0302k0491j9733j7936j5035j1629q755
$$ 1428747 1415392 1400388 1383376 1364331 1344029 1323538 1303805 1285869 1270834 1259205 1250450
62139A250450p017o276o009n684m997m161l726l788l688k807j294M29K433M913
$$ 1250450 1243433 1237157 1231148 1225464 1220467 1216306 1212580 1208792 1205104 1202297 1201003 1201432 1203865 1208778
62125A208778P384R017R745J0349J1466J3029J4773J6654J8588K0271K1447K2132
$$ 1208778 1216162 1225179 1234924 1245273 1256739 1269768 1284541 1301195 1319783 1340054 1361501 1383633
62113A383633K2479K2762K3416K4708K6318K7596K8262K8491K8503K8504K9008
$$ 1383633 1406112 1428874 1452290 1476998 1503316 1530912 1559174 1587665 1616168 1644672 1673680
62102A673680L0472L2491L3938L4261L4127L4493L5540L6888L8385M0184M2316
$$ 1673680 1704152 1736643 1770581 1804842 1838969 1873462 1909002 1945890 1984275 2024459 2066775
62091B066775M4681M7154M9166M9532M7381M3387L9525L7435L7371L8803M1391
$$ 2066775 2111456 2158610 2207776 2257308 2304689 2348076 2387601 2425036 2462407 2501210 2542601
62080B542601M4986M8834N1383N1118M7668M2181L6639L2700L0953L1196L3050
$$ 2542601 2587587 2636421 2687804 2738922 2786590 2828771 2865410 2898110 2929063 2960259 2993309
62069B993309L6160L9976M3910M7826N1989N6197N9371O0366N9051N6159N2335
$$ 2993309 3029469 3069445 3113355 3161181 3213170 3269367 3328738 3389104 3448155 3504314 3556649
62058C556649M7799M2893L8222L4030K9997K5885K1927J8230J4303R781N101Q99
$$ 3556649 3604448 3647341 3685563 3719593 3749590 3775475 3797402 3815632 3829935 3839716 3844817 3845716
62046C845716l023p290j1668j5023j6707j7261j7563j7887j8134j8375j8724j9102
$$ 3845716 3842693 3835403 3823735 3808712 3792005 3774744 3757181 3739294 3721160 3702785 3684061 3664959
62034C664959j9517k0135k0708k0460j9104j7601j7201j7926j8582j8215j6978
$$ 3664959 3645442 3625307 3604599 3584139 3565035 3547434 3530233 3512307 3493725 3475510 3458532
62023C458532j5567j4318j3078j1618r938q242o632m874k686l06J560K628L511
$$ 3458532 3442965 3428647 3415569 3403951 3394013 3385771 3379139 3374265 3371579 3371273 3372833 3375461 3378972
62010C378972M907O651Q055Q980R943J1244J2664J3973J5168J6035J6091J5167
$$ 3378972 3383879 3390530 3398585 3407565 3417508 3428752 3441416 3455389 3470557 3486592 3502683 3517850
61998C517850J3693J2150J0513Q360N136L63o000j3213k0202k6438l2055l6968
$$ 3517850 3531543 3543693 3554206 3562566 3567702 3568065 3562065 3548852 3528650 3502212 3470157 3433189
61986C433189m0544m2440m3345m4299m5492m6154m5590m4008m2347m1491m1607
$$ 3433189 3392645 3350205 3306860 3262561 3217069 3170915 3125325 3081317 3038970 2997479 2955872
61975B955872m2088m2124m1354l9950l8206l6320l4487l2872l1400k9894k8456
$$ 2955872 2913784 2871660 2830306 2790356 2752150 2715830 2681343 2648471 2617071 2587177 2558721
61964B558721k7344k6438k5205k3348k1108j8861j6889j5584j5306j5698j5703
$$ 2558721 2531377 2504939 2479734 2456386 2435278 2416417 2399528 2383944 2368638 2352940 2337237
61953B337237j4713j3195j1874j0813r839r254r304r294q191o030l950k770k234
$$ 2337237 2322524 2309329 2297455 2286642 2276803 2267549 2258245 2248951 2240760 2234730 2230780 2228010 2225776
61940B225776j709q92L41K084M029N519O342P124Q616J0917J3637J6449J9181
$$ 2225776 2224067 2223175 2223516 2225600 2229629 2235148 2241490 2248614 2257230 2268147 2281784 2298233 2317414
61927B317414K1778K4520K8003L2577L8027M3983N0443N7674O6013P6036Q8459
$$ 2317414 2339192 2363712 2391715 2424292 2462319 2506302 2556745 2614419 2680432 2756468 2844927
61916B844927J03400J20070J37758J56971J78974K04370K32837K64295K99612
$$ 2844927 2948327 3068397 3206155 3363126 3542100 3746470 3979307 4243602 4543214
61907D543214L39830L85219M35585M91142N52560O19922O91527P63060Q27180
$$ 4543214 4883044 5268263 5703848 6194990 6747550 7367472 8058999 8822059 9649239
61898I649239Q73697Q90379Q64269P83846O42676M43854K02426n7014l06955n24055
$$ 9649239 10522936 11413315 12277584 13061430 13704106 14147960 14350386 14293372 13986417 13462362
61888A3462362o93221q08227q70489q87146q68612q25885p68528p03852o36984
$$ 13462362 12769141 11960914 11090425 10203279 9334667 8508782 7740254 7036402 6399418
61879F399418n71193n08432m50029l97087l50256l09405k73909k43204k16760
$$ 6399418 5828225 5319793 4869764 4472677 4122421 3813016 3539107 3295903 3079143
61870C079143j93642j72720j53564j36652j22338j10037r8849q8573p9501p1522
$$ 3079143 2885501 2712781 2559217 2422565 2300227 2190190 2091341 2002768 1923267 1851745
61860A851745o4168n7407n1583m6452m1127l5265k9616k4983k1258j7997j5258
$$ 1851745 1787577 1730170 1678587 1632135 1591008 1555743 1526127 1501144 1479886 1461889 1446631
61849A446631j3220j1477r480p379n713m471l272k332k342l246l964l641k599
$$ 1446631 1433411 1421934 1412454 1405075 1399362 1394891 1391619 1389287 1386945 1383699 1379735 1376094 1373495
61836A373495j676j123n11N97K191L810M806M883M504M470M965N424N389N031
$$ 1373495 1371819 1370696 1370185 1370782 1372973 1376783 1381589 1386472 1390976 1395446 1400411 1405835 1411224 1416255
61822A416255M635M094L344K910L479N081P039Q679R906J1202J3244J6317J9976
$$ 1416255 1420890 1424984 1428328 1431238 1434717 1439798 1446837 1455516 1465422 1476624 1489868 1506185 1526161
61809A526161K3442K6392K9108L1866L4747L8116M2652M8404N4418N9813O4794
$$ 1526161 1549603 1575995 1605103 1636969 1671716 1709832 1752484 1800888 1855306 1915119 1979913
61798A979913P0099P5940Q2187Q9245R7764J07592J17921J28620J40652J54918
$$ 1979913 2050012 2125952 2208139 2297384 2395148 2502740 2620661 2749281 2889933 3044851
61788C044851J71366J89651K10109K33588K60653K91413L25955L64609M07869
$$ 3044851 3216217 3405868 3615977 3849565 4110218 4401631 4727586 5092195 5500064
61779E500064M56368N10984N72846O43089P22600Q11814R10764J019198J136170
$$ 5500064 5956432 6467416 7040262 7683351 8405951 9217765 10128529 11147727 12283897
61770A2283897J258679J379944J488314J567114J595284J549381J408244J160252
$$ 12283897 13542576 14922520 16410834 17977948 19573232 21122613 22530857 23691109
61762B3691109Q10477L83774p8832n29682r25927j238054j452893j571963j607423
$$ 23691109 24501586 24885360 24806528 24276846 23350919 22112865 20659972 19088009 17480586
61753A7480586j577249j500534j394215j272121j145336j022130r07332q02528
$$ 17480586 15903337 14402803 13008588 11736467 10591131 9569001 8661669 7859141
61745G859141p07685o22837n48369m84209m29256l81727l40071l03437k71305
$$ 7859141 7151456 6528619 5980250 5496041 5066785 4685058 4344987 4041550 3770245
61736C770245k42819k16942j93336j72615j55240j40405j26589j13131j00714
$$ 3770245 3527426 3310484 3117148 2944533 2789293 2648888 2522299 2409168 2308454
61727B308454r0191q1414p3492o5852n8809n3165m9311m6664m4081m0978l7864
$$ 2308454 2218263 2136849 2063357 1997505 1938696 1885531 1836220 1789556 1745475 1704497 1666633
61716A666633l5530l3974l2515l0700k8604k6336k3926k1747k0456k0223k0439
$$ 1666633 1631103 1597129 1564614 1533914 1505310 1478974 1455048 1433301 1412845 1392622 1372183
61705A372183k0392j9890j9153j8426j7962j7963j8396j8999j9498j9581j8844
$$ 1372183 1351791 1331901 1312748 1294322 1276360 1258397 1240001 1221002 1201504 1181923 1163079
61694A163079j7292j5710j4987j4956j4599j3476j2232j1501j1005j0160q997
$$ 1163079 1145787 1130077 1115090 1100134 1085535 1072059 1059827 1048326 1037321 1027161 1018164
61683A018164p987p392p215p331p367o835n727m628l867l131k222j570j552j783
$$ 1018164 1010177 1002785 995570 988239 980872 974037 968310 963682 959815 956684 954462 952892 951340 949557
61669I49557j756j676k073k864l530l924m309m775n204n628o116o496o690o971
$$ 949557 947801 946125 944052 941188 937658 933734 929425 924650 919446 913818 907702 901206 894516 887545
61655H87545p429p517o767n660n007m800m414l749l208k743j944j092j071j931
$$ 887545 880116 872599 865832 860172 855165 850365 845951 842202 838994 836251 834307 833215 832144 830213
61641H30213k521k005q24K80J426L032M781N938O396O708P252P940Q612R120R196
$$ 830213 827692 825687 824863 825143 826569 829601 834382 840320 846716 853424 860676 868616 877228 886348 895544
61626H95544Q672P865P202O526N208L075Q16p59j539k002k507l042l583m369n559
$$ 895544 904216 912081 919283 925809 931017 934092 934908 934149 932610 930608 928101 925059 921476 917107 911548
61611I11548o851p688p939q091q670r603j0393j0740j0750j0594j0278r739q947
$$ 911548 904697 897009 889070 880979 872309 862706 852313 841573 830823 820229 809951 800212 791265
61598G91265p879o578n330m511m226m172l948l305k142n59J020K045K388K547
$$ 791265 783386 776808 771478 766967 762741 758569 754621 751316 749174 748615 749635 751680 754068 756615
61584G56615L200M619O545Q492J0097J1353J2637J4412J6751J9210K1177K2340
$$ 756615 759815 764434 770979 779471 789568 800921 813558 827970 844721 863931 885108 907448
61572I07448K2884K3401K4548K6523K8778L0464L1253L1549L1847L2176L2318
$$ 907448 930332 953733 978281 1004804 1033582 1064046 1095299 1126848 1158695 1190871 1223189
61561A223189L2263L2072L1497L0138K8026K5735K3791K2191K0651J9081J7596
$$ 1223189 1255452 1287524 1319021 1349159 1377185 1402920 1426711 1448902 1469553 1488634 1506230
61550A506230J6157J4507J2535J0476Q545O431L427q26n734j0042j2790j4084
$$ 1506230 1522387 1536894 1549429 1559905 1568450 1574881 1578308 1577482 1571748 1561706 1548916 1534832
61538A534832j4942j6314j8188j9686k0041j9285j7929j6269j4310j2286j0630
$$ 1534832 1519890 1503576 1485388 1465702 1445661 1426376 1408447 1392178 1377868 1365582 1354952
61527A354952r322p643m972j555J861M987Q228J1999J6185K0460K4889L0075L6651
$$ 1354952 1345630 1337987 1333015 1331460 1333321 1338308 1346536 1358535 1374720 1395180 1420069 1450144 1486795
61514A486795M4673N3506O2384P1085Q0044Q9833J00737J12808J26111J40735
$$ 1486795 1531468 1584974 1647358 1718443 1798487 1888320 1989057 2101865 2227976 2368711
61504B368711J56741J74243J93388K14032K35478K56622K76101K92097L02146
$$ 2368711 2525452 2699695 2893083 3107115 3342593 3599215 3875316 4167413 4469559
61495D469559L03332K92829K68442K29421J77301J15984N0588j3991p3652j25081
$$ 4469559 4772891 5065720 5334162 5563583 5740884 5856868 5907456 5893465 5819813 5694732
61485E694732j66037j95845k15270k25669k28300k24221k14569k00794j84624
$$ 5694732 5528695 5332850 5117580 4891911 4663611 4439390 4224821 4024027 3839403
61476C839403j67585j50349j32797j14939r7505q1311o6321n1826l7405k3311
$$ 3839403 3671818 3521469 3388672 3273733 3176228 3094917 3028596 2976770 2939365 2916054
61466B916054r961K370J3427K3010L1347L9004M6267N2774N7844O0948O1939O1083
$$ 2916054 2906093 2908463 2921890 2944900 2976247 3015251 3061518 3114292 3172136 3233084 3295023 3356106
61454C356106N8961N6097N2656M8702M4589M0902L8110L6529L6424L7783M0150
$$ 3356106 3415067 3471164 3523820 3572522 3617111 3658013 3696123 3732652 3769076 3806859 3847009
61443C847009M3074M6526N0432N4073N6586N7887N8387N7868N5461N0846M4647
$$ 3847009 3890083 3936609 3987041 4041114 4097700 4155587 4213974 4271842 4327303 4378149 4422796
61432D422796L7397K8862J8878Q137k419j2569k2642l2622m1838m9407n4684n7563
$$ 4422796 4460193 4489055 4507933 4516070 4513651 4501082 4478440 4445818 4403980 4354573 4299889 4242326
61420D242326n8506n8073n6280n2776m7718m1948l6037k9732k2733j5480q710
$$ 4242326 4183820 4125747 4069467 4016691 3968973 3927025 3890988 3861256 3838523 3823043 3814333
61409C814333k632K880P574J0903J2566J2528J0774P476L261j266o085j1395j6774
$$ 3814333 3811701 3814581 3822155 3833058 3845624 3858152 3868926 3876402 3879663 3878397 3872312 3860917 3844143
61396C844143k1166k3630k3653k0880j5092o579L947J6019K9735M5361O2827Q1709
$$ 3844143 3822977 3799347 3775694 3754814 3739722 3733143 3737090 3753109 3782844 3828205 3891032 3972741
61384C972741J01611J22498J44732J68604J93766K19306K44451K68822K91637
$$ 3972741 4074352 4196850 4341582 4510186 4703952 4923258 5167709 5436531 5728168
61375E728168L10994L24317L29324L24226L07270K76960K33068J77395J13659
$$ 5728168 6039162 6363479 6692803 7017029 7324299 7601259 7834327 8011722 8125381
61366H125381M6870j7667p5771j25525j67096k01544k29881k52951k71337k85068
$$ 8125381 8172251 8154584 8078813 7953288 7786192 7584648 7354767 7101816 6830479 6545411
61356F545411k93678k96881k95057k89049k79669k67575k53370k37633k20883
$$ 6545411 6251733 5954852 5659795 5370746 5091077 4823502 4570132 4332499 4111616
61347D111616k03553j85946j68223j50622j33605j17541j02315q7531p3145n9544
$$ 4111616 3908063 3722117 3553894 3403272 3269667 3152126 3049811 2962280 2889135 2829591
61337B829591m6882l4685k2519j0780l53Q558J6803K5234L3599M0910M6692N1288
$$ 2829591 2782709 2748024 2725505 2714725 2714372 2722930 2739733 2764967 2798566 2839476 2886168 2937456
61325B937456N4961N7389N8390N8478N8024N6397N2877M8184M4059M1165L8426
$$ 2937456 2992417 3049806 3108196 3166674 3224698 3281095 3333972 3382156 3426215 3467380 3505806
61314C505806L4771L0669K7333K5224K3928K2878K1445J8868J4880J0038M818
$$ 3505806 3540577 3571246 3598579 3623803 3647731 3670609 3692054 3710922 3725802 3735840 3740658
61303C740658j185q317j5741k2199k7611l2839l8192m3243m8089n3426n9051o3508
$$ 3740658 3739473 3731156 3715415 3693216 3665605 3632766 3594574 3551331 3503242 3449816 3390765 3327257
61291C327257o5724o6165o5839o4981o3237o0445n6470n0978m4130l7082l1047
$$ 3327257 3261533 3195368 3129529 3064548 3001311 2940866 2884396 2833418 2789288 2752206 2721159
61280B721159k5999k0982j5532j0274o181l748k889l237m449o358q856j1578j4001
$$ 2721159 2695160 2674178 2658646 2648372 2642191 2638443 2635554 2632317 2627868 2621510 2612654 2601076 2587075
61267B587075j5907j7452j8623j8976j8186j6481j4243j1515q162m185O60P135
$$ 2587075 2571168 2553716 2535093 2516117 2497931 2481450 2467207 2455692 2447530 2443345 2444005 2451140
61255B451140J5836K6381L7839M9883O2901P6989R1382J05165J18055J30216J41427
$$ 2451140 2466976 2493357 2531196 2581079 2643980 2720969 2812351 2917516 3035571 3165787 3307214
61244C307214J50645J56172J56104J48763J33007J08285P4766L3745j1999n8499
$$ 3307214 3457859 3614031 3770135 3918898 4051905 4160190 4234956 4268701 4256702 4198203
61234D198203j01577j37866j65316j83327j92490j94037j89256j79473j66381
$$ 4198203 4096626 3958760 3793444 3610117 3417627 3223590 3034334 2854861 2688480
61225B688480j52002j37871j24403j11288r8480q6511p5888o6590n8381n1267
$$ 2688480 2536478 2398607 2274204 2162916 2064436 1977925 1902037 1835447 1777066 1725799
61215A725799m5282m0019l4908k9852k5152k0788j6339j1804p765m382q30L664
$$ 1725799 1680517 1640498 1605590 1575738 1550586 1529798 1513459 1501655 1493890 1489508 1488678 1492342
61203A492342Q633J2945J6275J9077K1249K1748J9899J6379J2476Q833N299J665
$$ 1492342 1500975 1513920 1530195 1549272 1570521 1592269 1612168 1628547 1641023 1649856 1655155 1656820
61191A656820j841m709o560p571q433r682j1178j2507j3765j5389j7321j9004
$$ 1656820 1654979 1650270 1643710 1636139 1627706 1618024 1606846 1594339 1580574 1565185 1547864 1528860
61179A528860k0272k1567k3091k4336k4823k4726k4507k4410k4525k4865k5092
$$ 1528860 1508588 1487021 1463930 1439594 1414771 1390045 1365538 1341128 1316603 1291738 1266646
61168A266646k4819k4389k4692k5852k6862k6923k6435k6096k5808k5182k4444
$$ 1266646 1241827 1217438 1192746 1166894 1140032 1113109 1086674 1060578 1034770 1009588 985144
61157I85144k4002k3525k2399k0726j9122j7890j7135j7285j8623k0506k1909
$$ 985144 961142 937617 915218 894492 875370 857480 840345 823060 804437 783931 762022
61146G62022k2525k2612k2054k0434j7861j4934j1969r132p005o029n474m029
$$ 762022 739497 716885 694831 674397 656536 641602 629633 620501 613496 607467 601993 597964
61134E97964j515R42K518L555M678N970P217Q210Q606Q358Q295R358J1121J2074
$$ 597964 596449 597391 599909 603464 608142 614112 621329 629539 638145 646503 654798 664156 675277 687351
61120F87351J1698J1186J1716J2945J3838J4096J4057J3933J3772J3756J3896
$$ 687351 699049 710235 721951 734896 748734 762830 776887 790820 804592 818348 832244
61109H32244J3888J3515J2777J1353Q723N109J488j685m932q431j1245j2528j2737
$$ 832244 846132 859647 872424 883777 892500 897609 899097 897412 892480 884049 872804 860276 847539
61096H47539j2811j2876j2599j2113j1703j1125j0188r486r621j0109r994r306
$$ 847539 834728 821852 809253 797140 785437 774312 764124 754638 745017 734908 724914 715608
61084G15608q896r069r277r109q704q242p719p238o868o337n382m291l449k656
$$ 715608 706712 697643 688366 679257 670553 662311 654592 647354 640486 634149 628767 624476 621027 618371
61070F18371j508k38N14O64O38N65J72n87j496k542l753m667m741m286m198m740
$$ 618371 616863 616625 617139 617803 618441 619006 619178 618591 617095 614553 610800 606133 601392 597106 592908 588168
61054E88168n174m752l510k043r25l99j70M51J820L503M878N915O871P658Q124
$$ 588168 582994 578242 574732 572689 571764 571365 571195 571646 573466 576969 581847 587762 594633 602291 610415
61039F10415Q626R565J0603J1098J1061J0927J0731J0338J0150J0583J1072J0675
$$ 610415 619041 628606 639209 650307 661368 672295 683026 693364 703514 714097 725169 735844
61027G35844R573Q805Q597Q130P157O620P257Q607R833J0767J1691J2740J3889
$$ 735844 745417 754222 762819 770949 778106 784726 791983 800590 810423 821190 832881 845621 859510
61014H59510J5061J6135J7206J8704K0730K2647K4051K5727K8577L2062L5005
$$ 859510 874571 890706 907912 926616 947346 969993 994044 1019771 1048348 1080410 1115415
61003A115415L7710M1661M7076N2293N5914N8210O0157O2441O5884P1541P9921
$$ 1115415 1153125 1194786 1241862 1294155 1350069 1408279 1468436 1530877 1596761 1668302 1748223
60992A748223R0986J04975J21939J40600J59183J77378J96053K15591K36826K63232
$$ 1748223 1839209 1944184 2066123 2206723 2365906 2543284 2739337 2954928 3191754 3454986
60982C454986K99392L47053M05770M77497N67041O78050Q13422R80772J192639
$$ 3454986 3754378 4101431 4507201 4984698 5551739 6229789 7043211 8023983 9216622
60973I216622J461082J798106K213837K682563L084330L201241K835166J980985
$$ 9216622 10677704 12475810 14689647 17372210 20456540 23657781 26492947 28473932
60965B8473932Q86109q7474o78942q26276o00516j15069M69403R03395R11710
$$ 28473932 29360041 29272567 28593625 27767349 27166833 27051764 27521167 28424562 29336272
60956B9336272L67662n87623j620598k415868k833808k908829k749626k459029
$$ 29336272 29703934 29116311 27495713 25079845 22246037 19337208 16587582 14128553
60948A4128553k114146j770768j461854j197589r76367p95437o51097n36029m42624
$$ 14128553 12014407 10243639 8781785 7584196 6607829 5812392 5161295 4625266 4182642
60939D182642l67411l09442k66271k34020k09782j91519j76738j63207j50287
$$ 4182642 3815231 3505789 3239518 3005498 2795716 2604197 2427459 2264252 2113965
60930B113965j38104j26199j14060j02042r0652p9820o9835o2027n7411n5396
$$ 2113965 1975861 1849662 1735602 1633560 1542908 1463088 1393253 1331226 1273815 1218419
60920A218419n4515n3699n2190m9361m5430m1447l7900l4158k9874k5779k2516
$$ 1218419 1163904 1110205 1058015 1008654 963224 921777 883877 849719 819845 794066 771550
60909G71550j9854j7717j6635j6353j5402j3096j0669r326q511p305o158n759
$$ 771550 751696 733979 717344 700991 685589 672493 661824 652498 643987 636682 630524 624765
60897F24765n321l735j532jR66K440M469O153P351Q706J0101J0661J0251R674
$$ 624765 619444 615709 614177 614176 615142 617582 622051 628204 635555 644261 654362 665023 675274 684948
60883F84948R356R003Q505Q055P358N823L576J361o09k744n163p487r545j1378
$$ 684948 694304 703307 711812 719867 727225 733048 736624 737985 737376 734632 729469 721982 712437 701059
60869G01059j2604j2747j2095j1489j1167j0648r713q740p984p212o125m705l171
$$ 701059 688455 675708 663613 652124 640957 630309 620596 611856 603872 596660 590535 585830 582659
60856E82659j962j475j423r16L94J823K822L903N663P716R573J1688J4410J6690
$$ 582659 580697 579222 577799 576883 577277 579100 581922 585825 591488 599204 608777 620465 634875 651565
60842F51565J7367J7159J7746J9115J9557J8263J6229J4405J2625J0801R637R451
$$ 651565 668932 686091 703837 722952 742509 760772 777001 791406 804031 814832 824469 833920
60830H33920R481R043Q352P665O579M819K914J496O12J44J46L55J29p21j689k445
$$ 833920 843401 852444 860796 868461 875040 879859 882773 884269 884881 885025 885171 885526 885655 884934 883245 880800
60814H80800l282m392n548o792q618j1038j3253j4696j5643j6371j6521j5878
$$ 880800 877518 873126 867578 860786 852168 841130 827877 813181 797538 781167 764646 748768
60802G48768j4965j4250j3374j1907j0201q870p827o547m981l516k200o76J219
$$ 748768 733803 719553 706179 694272 684071 675201 667374 660827 655846 652330 650130 649454 650673
60789F50673L170M827O242P817R764J1664J2836J3320J4037J5501J6836J6865
$$ 650673 653843 658670 664912 672729 682493 694157 706993 720313 734350 749851 766687 783552
60777G83552J5849J5088J4972J4605J3529J2493J2108J1800J0839R450Q262P364
$$ 783552 799401 814489 829461 844066 857595 870088 882196 893996 904835 914285 922547 929911
60765I29911O597O083N795N230M180L312L309L838M022L492K482J314L46l3Q7
$$ 929911 936508 942591 948386 953616 957796 961108 964417 968255 972277 975769 978251 979565 979911 979878 979965
60750I79965K8n16q91m31N12J127J307J494J679J324K17j274k741l999m941n629
$$ 979965 979993 979477 978586 978155 978667 979794 981101 982595 984274 985598 985815 984541 981800 977801 972860 967231
60734I67231o449p736r219j0208j0281r548q409p271o349n480m331k951j836j216
$$ 967231 960782 953046 943827 933619 923338 913790 905381 898110 891761 886281 881950 878999 877163 875947
60720H75947p02P2Q69J227J074N48m39j989l840n545o900p844q250q155p909p732
$$ 875947 875245 875317 876186 877413 878487 879035 878596 876607 872767 867222 860322 852478 844228 836073 828164 820432
60704H20432p400o593n347l840k088j79J502K627L234L451L303L022K974K918
$$ 820432 813032 806439 801092 797252 795164 794985 796487 799114 802348 805799 809102 812124 815098 818016
60690H18016J875p09m092p078r342j1354j3394j5271j6727j7524j7436j6670j5969
$$ 818016 819891 819182 815090 808012 798670 787316 773922 758651 741924 724400 706964 690294 674325
60677F74325j5698j5161j3541j1197r185p723o052l766j396M93J952L128L826
$$ 674325 658627 643466 629925 618728 609543 601820 595768 592002 590606 591099 593051 596179 600005
60664F00005M009M181M735N231M795L227J397M38N96J008P02k30p22m8J364K641
$$ 600005 604014 608195 612930 618161 622956 626183 627580 628018 628614 629622 630324 630094 629372 629324 630688 633329
60648F33329L508M225M824N062N035N172N564N661M887L384K058J904L139M882
$$ 633329 636837 641062 645886 650948 655983 661155 666719 672380 677267 680651 682709 684613 687752 692634
60634F92634N982O240O589P873R846J1703J3214J4795J6683J8604K0173K1237
$$ 692634 698616 704856 711445 719318 729164 740867 754081 768876 785559 804163 824336 845573
60622H45573K1774K1821K1438K0536J8851J6315J3242J0006O718L404K10k824
$$ 845573 867347 889168 910606 931142 949993 966308 979550 989556 996274 999678 999888 997064
60610I97064n815q590j0590j1522j1709j1435j0518q950p402o475n905n280m989
$$ 997064 991249 982659 972069 960547 948838 937403 926885 917935 910533 904058 898153 892873 887884
60597H87884n653p001q308r586j1294j2998j3535j2583j0976r211o794l553n61
$$ 887884 882231 875230 866922 857336 846042 833044 819509 806926 795950 786739 779945 776392 775831
60584G75831J020J330J389J667J777J252J03j268k294k564k176j596j026j45J257
$$ 775831 776851 778181 779570 781237 783014 784266 784369 783101 780807 778243 776067 774471 773445 773300 774557
60569G74557K809L993M776N446O021O196N782M889L735K494J240j23j834l938
$$ 774557 777366 781359 786135 791581 797602 803798 809580 814469 818204 820698 821938 821815 819981 816043
60555H16043n981p255p400o698n735m834l860k588j142R1R23J534K209L099M433
$$ 816043 810062 802807 795407 788709 782974 778140 774280 771692 770550 770641 771564 773098 775307 778406 782839
60540G82839O574R698J3521J7607K1843K6407L1394L6566M1177M3864M3052L7937
$$ 782839 789413 799111 812632 830239 852082 878489 909883 946449 987626 1031490 1074542 1112479
60528A112479K9012J7515M723q002j9027k7109l2141l4643l4629l1672k6109j9404
$$ 1112479 1141491 1159006 1163729 1155727 1136700 1109591 1077450 1042807 1008178 976506 950397 930993
60516I30993j2969p045j152M712R710J2872J3865J3086J1297R260P586O621O272
$$ 930993 918024 910979 909827 914539 924249 937121 950986 964072 975369 984629 992215 998836 1005108
60503A005108O173O356P656J0985J6211K2374K9127L7202M7055N7882O8662P9617
$$ 1005108 1011281 1017637 1025293 1036278 1052489 1074863 1103990 1141192 1188247 1246129 1314791 1394408
60491A394408R1695J04965J18542J31928J45676J60735J78079J98894K24359K54888
$$ 1394408 1486103 1591068 1709610 1841538 1987214 2147949 2326028 2524922 2749281 3004169
60481C004169K89895L27636L63661L89204L92854L65703L05494K16266J05404
$$ 3004169 3294064 3621700 3985361 4374565 4767419 5133122 5438616 5654882 5760286
60472E760286j7875j42050k53820l41168l97148m21482m19178l97619l64184l25131
$$ 5760286 5742411 5600361 5346541 5005373 4608225 4186743 3767565 3369946 3005762 2680631
60462B680631k85193k47239k12423j81161j54028j31481j13026r7377q3583p1592
$$ 2680631 2395438 2148199 1935776 1754615 1600587 1469106 1356080 1258703 1175120 1103528
60452A103528o1546n3098m5722l9349l4237l0397k7407k4848k2655k0951j9604
$$ 1103528 1041982 988884 943162 903813 869576 839179 811772 786924 764269 743318 723714
60441G23714j8169j6455j4957j4298j4188j3554j1923j0159r298r173q811p762
$$ 723714 705545 689090 674133 659835 645647 632093 620170 610011 600713 591540 582729 574967
60429E74967o392n094m012l331l102k845k010q46j24m8j05J41P52J801L232M312
$$ 574967 568575 563481 559469 556138 553036 550191 548181 547335 547211 547163 547058 547199 547951 549752 552984 557296
60413E57296M188L126K334K366K530K163J546J210J133J138J426K151L048L891
$$ 557296 561484 564610 566944 569310 571840 574003 575549 576759 577892 579030 580456 582607 585655 589546
60399E89546M819N772O222N889N243M868M751M673M723M994N134M721L831K900
$$ 589546 594365 600137 606359 612248 617491 622359 627110 631783 636506 641500 646634 651355 655186 658086
60385F58086K246J970J883J445K38j275k084k011k008k746l610l712l136k458
$$ 658086 660332 662302 664185 665630 665868 664593 662509 660498 658490 655744 652134 648422 645286 642828
60371F42828j663m36Q49J335P87k34j136j661j601r31j29K01J11K11Q38J722K487
$$ 642828 641165 640729 641578 642913 643700 643466 642330 640669 639068 638137 638008 638209 638320 638531 639369 641091 643578
60354F43578K991L175L058K938L303M333N707O956P812Q269Q523Q806R123R153
$$ 643578 646569 649744 652802 655740 659043 663376 669083 676039 683851 692120 700643 709449 718572 727725
60340G27725Q571P401N925M384K927J763J092Q86Q04M34k80p73j46J940M778P228
$$ 727725 736296 743697 749622 754006 756933 758696 759788 760674 761478 761912 761632 760859 760713 762653 767431 774659
60324G74659Q761R569R850R511Q535P003M675J256k709n939p762q784r762j0437
$$ 774659 783420 792989 802839 812350 820885 827888 832563 833819 831110 825171 817409 808625 798863 788426
60310G88426j0046q510o530m686l079j694n51M04J181J573J459J137J132J691
$$ 788426 778380 769870 763340 758654 755575 753881 753330 753734 754915 756488 757947 759084 760216 761907
60296G61907K683L849M972N966O923P865Q409P983O498M502K584R47l65j302k020
$$ 761907 764590 768439 773411 779377 786300 794165 802574 810557 817055 821557 824141 825088 824723 823421 821401
60281H21401k779l407l336k382j037J87J235K161K861L464M369N653O938Q095
$$ 821401 818622 815215 811879 809497 808460 808647 809882 812043 814904 818368 822737 828390 835328 843423
60267H43423R469J1105J2472J3406J4580J6535J8870K0978K2959K5279K8064L1327
$$ 843423 852892 863997 876469 889875 904455 920990 939860 960838 983797 1009076 1037140 1068467
60255A068467L5258L9713M4020M7880N1928N6783O2279O8207P5013Q2879R0986
$$ 1068467 1103725 1143438 1187458 1235338 1287266 1344049 1406328 1474535 1549548 1632427 1723413
60244A723413R8633J06452J15261J24290J31788J37011J40342J41681J40084J35025
$$ 1723413 1822046 1928498 2043759 2168049 2299837 2436848 2577190 2718871 2858955 2993980
60234B993980J26896J16263J03579Q9607P5039N9638M2732K4605O450j0935k7327
$$ 2993980 3120876 3237139 3340718 3430325 3505364 3565002 3607734 3632339 3638789 3627854 3600527
60223C600527m1953n3528o1678o7138p0136o9670o5022n7020m7143l6153k4151
$$ 3600527 3558574 3505046 3443368 3376230 3306094 3236424 3171402 3114382 3067239 3031086 3006935
60212C006935j1306K133J6131L0573M5058N9346P3705Q8469J03472J18044J31095
$$ 3006935 2995629 2997762 3013893 3044466 3089524 3148870 3222575 3311044 3414516 3532560 3663655
60201C663655J41259J47551J50035J49290J45103J36416J22756J05050Q4745O2803
$$ 3663655 3804914 3952465 4102500 4251790 4396893 4533309 4656065 4761115 4845860 4908663
60191D908663L9835J6475o868l0086n2670p3492r1633j06852j18873j26772j29702
$$ 4908663 4948498 4964973 4958105 4928019 4875349 4801857 4710224 4603372 4484499 4357727 4228025
60180D228025j27757j21521j11284r7316q0642o2788m4790k6844q803R406K7640
$$ 4228025 4100268 3978747 3867463 3770147 3689505 3626717 3581927 3555083 3546280 3555686 3583326
60169C583326M5404O1916P6584Q9226R9523J06420J08525J05089R6443Q3699O8261
$$ 3583326 3628730 3690646 3767230 3856456 3955979 4062399 4170924 4276013 4372456 4456155 4524416
60158D524416N1452L4134J6629r03j7916l3384m6091n4999n9509n9520n5206m6814
$$ 4524416 4575868 4610002 4626631 4625728 4607812 4574428 4528337 4473338 4413829 4354309 4299103 4252289
60146D252289l4787j9931l112J5202L4800N5187P5681R6121J17019J38904J61893
$$ 4252289 4217502 4197571 4194459 4209661 4244461 4299648 4375329 4471450 4588469 4727373 4889266
60135D889266J86064K11766K39178K67910K97221L26388L54592L80740M03602
$$ 4889266 5075330 5287096 5526274 5794184 6091405 6417793 6772385 7153125 7556727
60126G556727M21925M34335M39539M36836M26089M07086L79438L43393L00275
$$ 7556727 7978652 8412987 8852526 9289362 9715451 10122537 10501975 10845368 11145643
60117A1145643K51652J98445J41258Q1168J9561m2632j04885j66195k24741k78429
$$ 11145643 11397295 11595740 11736998 11818166 11837727 11795095 11690210 11524015 11299274 11020845
60107A1020845l25333l63545l91140m06745m10186m02365l84643l58459l25435
$$ 11020845 10695512 10331967 9940827 9534082 9123896 8721531 8336888 7978429 7652994
60098G652994k87452k46317k03325j59416j15685p3300l2726O527M4849Q1249
$$ 7652994 7365542 7119225 6915900 6756484 6640799 6567499 6534773 6541300 6586149 6667398
60088F667398J13599J40042J59681J71982J76214J71809J58802J37648J09095
$$ 6667398 6780997 6921039 7080720 7252702 7428916 7600725 7759527 7897175 8006270
60079H006270P4653L6866j369l7793p1041j00393j25822j48047j67970j85801
$$ 8006270 8080923 8117789 8116420 8078627 8007586 7907193 7781371 7633324 7465354 7279553
60069G279553k00955k12751k20917k25399k26033k22715k15692k05430j92192
$$ 7279553 7078598 6865847 6644930 6419531 6193498 5970783 5755091 5549661 5357469
60060E357469j76014j57206j36652j15377r3852p1938m9462k6537l367J9878M2846
$$ 5357469 5181455 5024249 4887597 4772220 4678368 4606430 4556968 4530431 4527064 4546942 4589788
60049D589788O5041Q6260J06578J25538J41824J54120J61905J64815J61726J51469
$$ 4589788 4654829 4741089 4847667 4973205 5115029 5269149 5431054 5595869 5757595 5909064
60039E909064J34470J12811Q8354O1425L1690k40l2557o3335r1551j17135j40147
$$ 5909064 6043534 6156345 6244699 6306124 6337814 6337574 6305017 6241682 6150131 6032996 5892849
60028E892849j59870j74738j83468j86173j83965j77668j67427j53603j37254
$$ 5892849 5732979 5558241 5374773 5188600 5004635 4826967 4659540 4505937 4368683
60019D368683j19448j00580q0815o0679m0779k1158j356J9050M0146O1732Q3500
$$ 4368683 4249235 4148655 4067840 4007161 3966382 3945224 3943868 3962918 4003064 4064796 4148296
60008D148296J05289J27331J49857J72312J93211K10938K24349K32314K33195
$$ 4148296 4253585 4380916 4530773 4703085 4896296 5107234 5331583 5563897 5797092
59999E797092K25464K08941J85171J56496J24849R1247N6070J9686j7119n3216
$$ 5797092 6022556 6231497 6416668 6573164 6698013 6789260 6845330 6865016 6847897 6794681
59989F794681q7498j19020j46835j69820j86800j96804j99384j94907j84600j70051
$$ 6794681 6707183 6588163 6441328 6271508 6084708 5887904 5688520 5493613 5309013 5138962
59979E138962j52529j32721j10983q7660o3187l8056j2732J2296L6274N8165P7218
$$ 5138962 4986433 4853712 4742729 4655069 4591882 4553826 4541094 4553390 4589664 4647829 4725047
59968D725047R3559J07686J19272J27175J30964J31678J30412J26800J19757J09200
$$ 4725047 4818606 4926292 5045564 5172739 5303703 5435381 5565793 5692593 5812350 5921550
59958E921550R6084Q1117O4646M7593L1274J6154J917j0959k0768k6083k6859
$$ 5921550 6017634 6098751 6163397 6210990 6242264 6258418 6260335 6249376 6228608 6202525 6175666
59947F175666k3609j6316m593J1838L3225N9615R0283J24023J60349J99590K41439
$$ 6175666 6152057 6135741 6131148 6142986 6176211 6235826 6326109 6450132 6610481 6810071 7051510
59936G051510K84528L27972L72243M17380M61033M99274N28798N47213N51563
$$ 7051510 7336038 7664010 8036253 8453633 8914666 9413940 9942738 10489951 11041514
59927A1041514N37819N02284M43147L61014K58908J42046J7219j07979k25709
$$ 11041514 11579333 12081617 12524764 12885778 13144686 13286732 13303951 13195972 12970263
59918A2970263l28707m11727m72553n11509n30233n31052n16934m91038m56151
$$ 12970263 12641556 12229829 11757276 11245767 10715534 10184482 9667548 9176510 8720359
59909H720359m14767l69467l22698k76105k30342j85494j41469r8232n6064j5462
$$ 8720359 8305592 7936125 7613427 7337322 7106980 6921486 6780017 6681785 6625721 6610259
59899F610259K3385O0811R7117J31989J64720J94649K20965K42117K55794K59510
$$ 6610259 6633644 6694455 6791572 6923561 7088281 7282930 7503895 7746012 8001806 8261316
59889H261316K51251K29833J95020J47348Q8093J9727n3681j27191j96386k57905
$$ 8261316 8512567 8742400 8937420 9084768 9172861 9192588 9138907 9011716 8815330 8557425
59879H557425l08887l46949l71128l82277l82102l72342l54993l32438l06592
$$ 8557425 8248538 7901589 7530461 7148184 6766082 6393740 6038747 5706309 5399717
59870E399717k78466k48997k19689j91835j65752j41450j19489j00425q4146p0626
$$ 5399717 5121251 4872254 4652565 4460730 4294978 4153528 4034039 3933614 3849468 3778842
59860C778842o0841n5837n5082n6687n9090o1661o3813o4598o3331n9864n4080
$$ 3778842 3718001 3662164 3607082 3550395 3491305 3429644 3365831 3301233 3237902 3178038 3123958
59849C123958m5842l5658k4806j4674o188Q1L747M476J735n025j5416k7579l9270
$$ 3123958 3078116 3042458 3017652 3002978 2996790 2996871 3000618 3005094 3006829 3001804 2986388 2958809 2919539
59836B919539m9293n7282o2444o3675o0954n5701m9392m2491l4937k6884j8479
$$ 2919539 2870246 2812964 2750520 2686845 2625891 2570190 2520798 2478307 2443370 2416486 2398007
59825B398007r599l34Q735J7213K5549L4291M2979N0240N5181N8351O1197O4738
$$ 2398007 2388408 2388074 2396809 2414022 2439571 2473862 2516841 2567081 2622262 2680613 2741810 2806548
59813B806548O8896P2994P6563P9334Q0547P8715P2352O0999M5537K7891J0559
$$ 2806548 2875444 2948438 3025001 3104335 3184882 3263597 3335949 3396948 3442485 3470376 3480935
59802C480935m128j4832k1469k4640k4926k2748j8378j1796k768Q597K1640L5713
$$ 3480935 3476807 3461975 3440506 3415866 3390940 3368192 3349814 3338018 3335250 3343847 3365487 3401200
59790C401200N0745O6995Q4698J04143J25730J49685J76140K05817K40008K79422
$$ 3401200 3451945 3518940 3603638 3707781 3833511 3983196 4159336 4365153 4605161 4884583
59780D884583L23403L70571M19345M66659N06121N27849N20312M73189L81286
$$ 4884583 5207986 5578557 5997902 6464561 6970682 7498531 8018843 8492032 8873318
59771H873318K48872R1188o9691k12559l22977l94888m29468m33084m14574l82377
$$ 8873318 9122190 9213378 9143687 8931128 8608151 8213263 7783795 7350711 6936137 6553760
59761F553760l42973l00944k59296k19615j82569j48714j18530r1824o7683m5270
$$ 6553760 6210787 5909843 5650547 5430932 5248363 5099649 4981119 4889295 4821612 4776342
59751D776342k4229m388J4347L1856M8154O4006Q0590R8326J16565J34697J53130
$$ 4776342 4752113 4747725 4762072 4793928 4842082 4906088 4986678 5085004 5201569 5336266 5489396
59740E489396J72870J94437K17558K41817K67425K95291L26185L60002L96123
$$ 5489396 5662266 5856703 6074261 6316078 6583503 6878794 7204979 7564981 7961104
59731G961104M34550M75992N20498N66609O12355O56335O96926P30856P53732
$$ 7961104 8395654 8871646 9392144 9958753 10571108 11227443 11924369 12655225 13408957
59722A3408957P61953P53561P27833O85623O30578N69048N08284M54975M15065
$$ 13408957 14170910 14924471 15652304 16337927 16968505 17537553 18045837 18500812 18915877
59713A8915877L93427L92590M12009M48839M99126N58208O20654O80376P30808
$$ 18915877 19309304 19701894 20113903 20562742 21061868 21620076 22240730 22921106 23651914
59704B3651914P65186P77269P62134P16453O38863N31235L99759K53928J03979
$$ 23651914 24417100 25194369 25956503 26672956 27311819 27843054 28242813 28496741 28600720
59695B8600720m0647j71226k79872l60725m10821m29843m19606l83824l27252
$$ 28600720 28560073 28388847 28108975 27748250 27337429 26907586 26487980 26104156 25776904
59686B5776904k54282j68280p2057L1895J41861K57017L76801N00641O28215P59030
$$ 25776904 25522622 25354342 25282285 25314180 25456041 25713058 26089859 26590500 27218715 27977745
59676B7977745Q91086J020137J140018J242785J318067J353100J334230J249108
$$ 27977745 28868831 29888968 31028986 32271771 33589838 34942938 36277168 37526276
59668C7526276J089063Q52139N46125J89150j92989n70997r16093j204041j418895
$$ 37526276 38615339 39467478 40013603 40202753 40009764 39438767 38522674 37318633 35899738
59659C5899738j554546j613381j603776j538080j430771j296573j149798j005273
$$ 35899738 34345192 32731811 31128035 29589955 28159184 26862611 25712813 24707540
59651B4707540q78926p86192p38876p41846p90226q68615r54678j026682j070405
$$ 24707540 23828614 23042422 22303546 21561700 20771474 19902859 18948181 17921499 16851094
59642A6851094j081029j060695j015263r52225q79227q02740p27323o55586n88598
$$ 16851094 15770065 14709370 13694107 12741882 11862655 11059915 10332592 9677006 9088408
59633I088408n26687m70150m19282l73801l32882k95868k62562k32653k05571
$$ 9088408 8561721 8091571 7672289 7298488 6965606 6669738 6407176 6174523 5968952
59624E968952j81110j59505j40448j22740j05486q9137p4724o2561n2324m3969
$$ 5968952 5787842 5628337 5487889 5365149 5259663 5170526 5095802 5033241 4980917 4936948
59614D936948l7874l4369l3834l7024m4422n5202o7335p8957q9278r8207j05578
$$ 4936948 4899074 4864705 4830871 4793847 4749425 4694223 4626888 4547931 4458653 4360446 4254868
59603D254868j10935j13883j14324j12319j07809j00797r1964q2705p4110o5967
$$ 4254868 4143933 4030050 3915726 3803407 3695598 3594801 3502837 3420132 3346022 3280055
59593C280055n7365m8112l8987l0616k2866j5487q556k049M295J0360J5543J9634
$$ 3280055 3222690 3174578 3135591 3104975 3082109 3066622 3058066 3056017 3060312 3070672 3086215 3105849
59581C105849K3016K5746K7192K7128K6261K5223K3893K2495K2319K4329K7808
$$ 3105849 3128865 3154611 3181803 3208931 3235192 3260415 3284308 3306803 3329122 3353451 3381259
59570C381259L1603L6160M2958N2134O2118P1738Q1461R2208J04010J16367J29258
$$ 3381259 3412862 3449022 3491980 3544114 3606232 3677970 3759431 3851639 3955649 4072016 4201274
59559D201274J43120J58252J74667J92305K11091K30911K51619K72895K94077
$$ 4201274 4344394 4502646 4677313 4869618 5080709 5311620 5563239 5836134 6130211
59550F130211L14296L32749L48612L60889L68614L71191L68290L59728L45867
$$ 6130211 6444507 6777256 7125868 7486757 7855371 8226562 8594852 8954580 9300447
59541I300447L27941L07512K85727K63647K42847K24661K08379J91153J70610
$$ 9300447 9628388 9935900 10221627 10485274 10728121 10952782 11161161 11352314 11522924
59532A1522924J47687J26602J11984J06043J08034J15769J27086J39826J50755
$$ 11522924 11670611 11797213 11909197 12015240 12123274 12239043 12366129 12505955 12656710
59523A2656710J55176J48205J26701R0134L9916k1810r2709j69905k49438l26354
$$ 12656710 12811886 12960091 13086792 13176926 13216842 13195032 13102323 12932418 12682980 12356626
59513A2356626l95731m53835m98490n28694n44455n46976n38476n21296m97317
$$ 12356626 11960895 11507060 11008570 10479876 9935421 9388445 8849969 8328673 7831356
59504G831356m68273m36189m02946l69547l36162l02853k70011k38262k08277
$$ 7831356 7363083 6926894 6523948 6154401 5818239 5515386 5245375 5007113 4798836
59495D798836j80687j55777j33231j12430r3038p5081n8355m2081k5509q748P364
$$ 4798836 4618149 4462372 4329141 4216711 4123673 4048592 3990237 3948156 3922647 3913899 3921263
59484C921263K2467L7347N3084O9658Q6091J02046J18611J36982J57003J77672
$$ 3921263 3943730 3981077 4034161 4103819 4189910 4291956 4410567 4547549 4704552 4882224
59474D882224J98703K20663K43655K66673K88308L07237L21907L30471L31390
$$ 4882224 5080927 5301590 5545245 5811918 6100226 6407463 6729370 7059841 7391231
59465G391231L23494L05220K74605K30651J74452J08800L7072l7220j10433j78938
$$ 7391231 7714725 8019945 8294550 8525201 8699653 8808453 8845525 8808305 8697872 8518934
59455H518934k39304k88646l25404l50053l64341l69604l66306l55259l38471
$$ 8518934 8279630 7990984 7665580 7315527 6951186 6581582 6215276 5860017 5521546
59446E521546l18236k96082k73054k50268k28530k07817j87801j68619j50699
$$ 5521546 5203310 4907228 4634174 4383906 4155376 3947559 3759758 3591139 3440440
59437C440440j34157j18859j04758r1822p9945o9228n9878n1553m3357l4843k6584
$$ 3440440 3306283 3187424 3082666 2990844 2910899 2841671 2781793 2730240 2686883 2652040 2625456
59426B625456j9280j2874o977j593L161P468J1448J4825J7558K0270K3460K6773
$$ 2625456 2606176 2593302 2586325 2584732 2587893 2595361 2606809 2621634 2639192 2659462 2682922 2709695
59414B709695K9772L3034L7730M4168N1087N6012N6289N0930M2419L5999L5974
$$ 2709695 2739467 2772501 2810231 2854399 2905486 2961498 3017787 3068717 3111136 3147135 3183109
59403C183109M2762N4015O7853Q4136J03185J24577J46962J68017J85074J97373
$$ 3183109 3225871 3279886 3347739 3431875 3535060 3659637 3806599 3974616 4159690 4357063
59393D357063K08032K22554K44856K75254L12110L54148M00721M50891N03179
$$ 4357063 4565095 4787649 5032505 5307759 5619869 5974017 6374738 6825629 7328808
59384G328808N55844O06732O52814O90116P14246P21412P09734O79885O34469
$$ 7328808 7884652 8491384 9144198 9834314 10548560 11269972 11979706 12659591 13294060
59375A3294060N76947N11373M42432L74745L11687K55056K05509J62625J24560
$$ 13294060 13871007 14382380 14824812 15199557 15511244 15766300 15971809 16134434 16258994
59366A6258994Q8341N0864R649l7000q9895j48926k13151k80342l45987m03444
$$ 16258994 16347335 16398199 16407848 16370848 16280953 16132027 15918876 15638534 15292547 14889103
59356A4889103m46278m70833m76499m64530m37845m01679l62743l26914k98028
$$ 14889103 14442825 13971992 13495493 13030963 12593118 12191439 11828696 11501782 11203754
59347A1203754k78585k70314k73509k86441l06052l28932l51768l71663l86514
$$ 11203754 10925169 10654855 10381346 10094905 9788853 9459921 9108153 8736490 8349976
59338H349976l94870l95544l88038l73335l53482l30145l04203k76750k49403
$$ 8349976 7955106 7559562 7171524 6798189 6444707 6114562 5810359 5533609 5284206
59329E284206k23214j98080j73825j51120j30653j12034r4403p7727o2673m9353
$$ 5284206 5060992 4862912 4689087 4537967 4407314 4295280 4200877 4123150 4060477 4011124
59319D011124l7022k5064j3566k697P931J8857L0028M0923N1275O1223P0664P8904
$$ 4011124 3974102 3949038 3935472 3932775 3940706 3959563 3989591 4030514 4081789 4143012 4213676 4292580
59307D292580Q5251Q9674R2396R3048R0806Q5375P7236O6793N4025L9359K4245
$$ 4292580 4377831 4467505 4559901 4652949 4743755 4829130 4906366 4973159 5027184 5066543 5090788
59296E090788J0225k141j2888k1643k7704l0767l0824k7490k0248r378L940J8643
$$ 5090788 5101013 5098872 5085984 5064341 5036637 5005870 4975046 4947556 4927308 4917930 4921870 4940513
59284D940513L4405N1313O9388Q8427J07936J27091J45093J61353J75041J84671
$$ 4940513 4974918 5026231 5095619 5184046 5291982 5419073 5564166 5725519 5900560 6085231
59274F085231J88740J86685J78776J65224J46079J21825R3366O1175K5188j3927
$$ 6085231 6273971 6460656 6639432 6804656 6950735 7072560 7165926 7227101 7252289 7238362
59264G238362n3495q9118j16360j32693j38395j35807j27570j15481j00855q5254
$$ 7238362 7184867 7095749 6979389 6846696 6708301 6572494 6444924 6329443 6228588 6143334
59254F143334p0254n6754m4989l5201k7806k3009k0590k0003k0455k1040k1009
$$ 6143334 6073080 6016326 5971337 5936136 5908330 5885321 5864731 5844728 5824273 5803233 5782224
59243E782224j9692j6069q972J961J6124L3246N4250Q0234J11082J45819J83786
$$ 5782224 5762532 5746463 5737491 5739452 5755576 5788822 5843072 5923306 6034388 6180207 6363993
59232F363993K24677K67780L12094L56770M00400M39864M70650M88214M88619
$$ 6363993 6588670 6856450 7168544 7525314 7925714 8365578 8836228 9324442 9813061
59223I813061M68589M26355L62596K79853J81132O9987m8346j67164k80051l81703
$$ 9813061 10281650 10708005 11070601 11350454 11531586 11601573 11553227 11386063 11106012 10724309
59213A0724309m67421n33117n76559n98092n99968n85456n58434n22819m81912
$$ 10724309 10256888 9723771 9147212 8549120 7949152 7363696 6805262 6282443 5800531
59204E800531m38442l94942l53250l13858k76779k42964k13858j89479j68051
$$ 5800531 5362089 4967147 4613897 4300039 4023260 3780296 3566438 3376959 3208908
59195C208908j47976j29292j12912r9179q7701p7931o9478o2172n6097n1211m7061
$$ 3208908 3060932 2931640 2818728 2719549 2631848 2553917 2484439 2422267 2366170 2314959 2267898
59184B267898m3162l9472l5923l1905k7065k2280j8731j6111j2948q676m162n
$$ 2267898 2224736 2185264 2149341 2117436 2090371 2068091 2049360 2033249 2020301 2011625 2007463 2007458
59172B007458M359R376J4370J8519K1998K5544K9520L3882L8481M3044M7367N1755
$$ 2007458 2011817 2021193 2035563 2054082 2076080 2101624 2131144 2165026 2203507 2246551 2293918 2345673
59160B345673N6676O1822O6335P0104P4127P9263Q5425R2034R8455J03733J06940
$$ 2345673 2402349 2464171 2530506 2600610 2674737 2754000 2839425 2931459 3029914 3133647 3240587
59149C240587J08164J08265J07295J04056R7626Q8387P7086O3745M8226L1166
$$ 3240587 3348751 3457016 3564311 3668367 3765993 3854380 3931466 3995211 4043437 4074603
59139D074603J3729l012j8023l0315l9572m6287n0787n2568n0981m6106l8585
$$ 4074603 4088332 4085320 4067297 4036982 3997410 3951123 3900336 3847768 3796787 3750681 3712096
59128C712096k9065j7999n527Q575K4377M1312N8802P7170R7001J17714J37948
$$ 3712096 3683031 3665032 3659505 3668080 3692457 3733769 3792571 3869741 3966742 4084456 4222404
59117D222404J57478J77446J98458K19619K39940K59445K78184K95171L08897
$$ 4222404 4379882 4557328 4755786 4975405 5215345 5474790 5752974 6048145 6357042
59108F357042L17818L19662L11255K89965K54943K06890J47817Q1621J3673n1133
$$ 6357042 6674860 6994522 7305777 7595742 7850685 8057575 8205392 8287013 8300686 8249553
59098H249553j09355j58064j94749k19247k34423k43551k47985k48425k47033
$$ 8249553 8140198 7982134 7787385 7568138 7333715 7090164 6842179 6593754 6346721
59089F346721k46368k46863k47127k46455k45335k43625k39995k33632k25328
$$ 6346721 6100353 5853490 5606363 5359908 5114573 4870948 4630953 4397321 4171993
59080D171993k16360k07125j97287j86527j74765j62175j49368j37233j26351
$$ 4171993 3955633 3748508 3551221 3364694 3189929 3027754 2878386 2741153 2614802
59071B614802j16639j07615r8833r0139q1723p3875o6663n9976n3828m8300m3168
$$ 2614802 2498163 2390548 2291715 2201576 2119853 2045978 1979315 1919339 1865511 1817211 1774043
59060A774043l8030l2878k8149k4177k0996j8773j7790j7982j9060k1103k4286
$$ 1774043 1736013 1703135 1674986 1650809 1629813 1611040 1593250 1575268 1556208 1535105 1510819
59049A510819k7981l0948l2623l3382l3413l2322l0154k7727k5467k2840j9478
$$ 1510819 1482838 1451890 1419267 1385885 1352472 1320150 1289996 1262269 1236802 1213962 1194484
59038A194484j6013j3186j0898q714o585m523k247L06K812N288Q230J1579J4392
$$ 1194484 1178471 1165285 1154387 1145673 1139088 1134565 1132318 1132624 1135436 1140724 1148954 1160533 1174925
59025A174925J5985J6584J6382J4975J2284R119O196L431Q07j015j555j137q1
$$ 1174925 1190910 1207494 1223876 1238851 1251135 1260254 1266450 1269881 1270688 1269673 1268118 1266981 1266900
59012A266900J736M059O036P488R268J1708J3904J5277J6489J7810J7971J5934
$$ 1266900 1268636 1272695 1278731 1286219 1295487 1307195 1321099 1336376 1352865 1370675 1388646 1404580
59000A404580J2650R777P593N507L625K411J558O11J07P55K147L459M708O137
$$ 1404580 1417230 1427007 1434600 1440107 1443732 1446143 1447701 1448312 1448419 1449174 1451321 1454780 1459488 1465625
58986A465625P105P069O915P882R641J0860J1205J1375J1649J1867J2449J4000
$$ 1465625 1472730 1479799 1486714 1494596 1504237 1515097 1526302 1537677 1549326 1561193 1573642 1587642
58974A587642J6112J7919J9583K1951K5034K8131L1262L5101L9535M3505M6324
$$ 1587642 1603754 1621673 1641256 1663207 1688241 1716372 1747634 1782735 1822270 1865775 1912099
58963A912099M8184M9344M9762M9446M8358M6275M3459M1003L9751L9359L9266
$$ 1912099 1960283 2009627 2059389 2108835 2157193 2203468 2246927 2287930 2327681 2367040 2406306
58952B406306L9926M2094M5628N0103N5806O2942P0615P7978Q5630R4480J03969
$$ 2406306 2446232 2488326 2533954 2584057 2639863 2702805 2773420 2851398 2937028 3031508 3135477
58941C135477J13047J22221J32845J45003J57889J71845J87940K05847K24303
$$ 3135477 3248524 3370745 3503590 3648593 3806482 3978327 4166267 4372114 4596417
58932D596417K43594K65515K90686L17899L46568L77789M12406M49794M89419
$$ 4596417 4840011 5105526 5396212 5714111 6060679 6438468 6850874 7300668 7790087
58923G790087N31975N78160O27452O78867P31700P84804Q36012Q82744R22155
$$ 7790087 8322062 8900222 9527674 10206541 10938241 11723045 12559057 13441801 14363956
58914A4363956R50156R61216R49700R10875Q40819P36933N99567M32863K43948
$$ 14363956 15314112 16275328 17225028 18135903 18976722 19713655 20313222 20746085 20990033
58905B0990033M2130j61347l54573n27417o73046p87566q69525r20068r42609
$$ 20990033 21032163 20870816 20516243 19988826 19315780 18528214 17658689 16738621 15796012
58896A5796012r41527r21306q86539q41760p90728p36254o80509o24967n70326
$$ 15796012 14854485 13933179 13046640 12204880 11414152 10677898 9997389 9372422 8802096
58887H802096n17225m66971m20841l79121l41642l08816k81182k58288k39095
$$ 8802096 8284871 7817900 7397059 7017938 6676296 6367480 6086298 5828010 5588915
58878E588915k23136k10167j99103j88590j78243j68147j57566j45687j33235
$$ 5588915 5365779 5155612 4956509 4767919 4589676 4421529 4263963 4118276 3985041
58869C985041j21746j11419j01338r1589q3313p6512o9741o2301n5058m8641m2459
$$ 3985041 3863295 3751876 3650538 3558949 3475636 3399124 3329383 3267082 3212024 3163383 3120924
58858C120924l6021k9838k4334j9072j3522p587j114N971J2972J9088K4858L1498
$$ 3120924 3084903 3055065 3030731 3011659 2998137 2990550 2989436 2995407 3008379 3027467 3052325 3083823
58846C083823L8824M5390N0894N6676O3475P0461P7055Q4069R2226J01110J10362
$$ 3083823 3122647 3168037 3218931 3275607 3339082 3409543 3486598 3570667 3662893 3764003 3874365
58835C874365J20630J32482J45547J59417J74320J90303K07004K24757K44717
$$ 3874365 3994995 4127477 4273024 4432441 4606761 4797064 5004068 5228825 5473542
58826E473542K67319K91915L18412L47927L81163M17516M56565M99093N45751
$$ 5473542 5740861 6032776 6351188 6699115 7080278 7497794 7954359 8453452 8999203
58817H999203N95808O48076P01848P56034Q08222Q55289Q93904R19811R27598
$$ 8999203 9595011 10243087 10944935 11700969 12509191 13364480 14258384 15178195 16105793
58808A6105793R11962Q68524P93542O84622N42860L73460J83980j6763k17915
$$ 16105793 17017755 17886279 18679821 19364443 19907303 20280763 20464743 20447980 20230065
58799B0230065m07085n73709p11543q17694q90972r32452r46270r38049r12834
$$ 20230065 19822980 19249271 18537728 17720034 16829062 15896610 14950340 14012291 13099457
58790A3099457q75027q29059p78682p26158o73045o21118n71774n25344m81805
$$ 13099457 12224430 11395371 10616689 9890531 9217486 8596368 8024594 7499250 7017445
58781G017445m41450m04178l69182l36219l06343k80412k57691k36882k17757
$$ 7017445 6575995 6171817 5802635 5466416 5160073 4879661 4621970 4385088 4167331
58772D167331k00933j86664j74674j64531j55423j46267j36738j27515j18899
$$ 4167331 3966398 3779734 3605060 3440529 3285106 3138839 3002101 2874586 2755687
58763B755687j10087j00481r0856q2284p4683o7265n9823n2718m6202m0459l5823
$$ 2755687 2645600 2545119 2454263 2371979 2297296 2230031 2170208 2117490 2071288 2030829 1995006
58752A995006l2293k9312k6480k3933k1735j9655j7809j6740j6453j6346j6292
$$ 1995006 1962713 1933401 1906921 1882988 1861253 1841598 1823789 1807049 1790596 1774250 1757958
58741A757958j6716j7264j6780j5203j4126j4601j5656j5910j5603j5903j7100
$$ 1757958 1741242 1723978 1707198 1691995 1677869 1663268 1647612 1631702 1616099 1600196 1583096
58730A583096j8532j9743k0815k2056k3920k6613k9304l0596l0217k9438k9437
$$ 1583096 1564564 1544821 1524006 1501950 1478030 1451417 1422113 1391517 1361300 1331862 1302425
58719A302425l0159l0986l1388l0616k8176k5029k2947k2102k0795j8237j5855
$$ 1302425 1272266 1241280 1209892 1179276 1151100 1126071 1103124 1081022 1060227 1041990 1026135
58708A026135j4962j4721j3649j1712r769q265p484p775q351p377m511j901j315
$$ 1026135 1011173 996452 982803 971091 961322 953057 945573 937798 929447 922070 917559 915658 914343
58695I14343j733j282j67J14p08j901l543o186r300j1780j3549j5197j6440j6421
$$ 914343 912610 911328 911161 911275 910567 908666 905123 898937 889637 877857 864308 849111 832671 816250
58681H16250j5116j3241j1117q835o961n892n016l603k026j060o67n22q85j740
$$ 816250 801134 787893 776776 767941 760980 755088 750072 746469 744443 743383 742716 742194 741309 739569
58667G39569j929n61J406K456K856M143O573Q556Q663P064M940L391K791K710
$$ 739569 737640 737079 738485 740941 743797 747940 754513 763069 771732 778796 783736 787127 789918 792628
58653G92628K535K529L629N892Q095R477J0746J2605J4388J5238J5549J6196J7244
$$ 792628 795163 797692 801321 807213 815308 824785 835531 848136 862524 877762 893311 909507 926751
58640I26751J8535K0635K3967K7876L1629L5564M0163M4935M9342N3943N9439
$$ 926751 945286 965921 989888 1017764 1049393 1084957 1125120 1170055 1219397 1273340 1332779
58629A332779O5563P2074P9926R0081J01940J14250J26890J40677J56149J73527
$$ 1332779 1398342 1470416 1550342 1640423 1742363 1856613 1983503 2124180 2280329 2453856
58619B453856J93081K14439K36306K57675K78085K95848L07390L09456L00466
$$ 2453856 2646937 2861376 3097682 3355357 3633442 3929290 4236680 4546136 4846602
58610D846602K78652K41086J86772J19558M5950k8658r9899j62374k10951k43916
$$ 4846602 5125254 5366340 5553112 5672670 5718620 5689962 5590063 5427689 5216738 4972822
58600D972822k62842k69768k66428k55617k40829k24332k07037j89886j73881
$$ 4972822 4709980 4440212 4173784 3918167 3677338 3453006 3245969 3056083 2882202
58591B882202j59103j45303j32993j22585j13057j03074r2770q2880p2935o2148
$$ 2882202 2723099 2577796 2444803 2322218 2209161 2106087 2013317 1930437 1857502 1795354
58581A795354n1362m2235l4999k8905k4315k2411k3220k5701k9382l3994l8031
$$ 1795354 1743992 1701757 1666758 1637853 1613538 1591127 1567907 1542206 1512824 1478830 1440799
58570A440799l9689l9120l7869l6332l3593k9621k5632k2308j9406j7203j6620
$$ 1440799 1401110 1361990 1324121 1287789 1254196 1224575 1198943 1176635 1157229 1140026 1123406
58559A123406j7623j8928j9486j9212j8312j6948j5401j3664j1189p880m667k173
$$ 1123406 1105783 1086855 1067369 1048157 1029845 1012897 997496 983832 972643 964763 960096 957923
58547I57923K04K862M812N282N290O008O751O306N107M131K761q5l705o606r022
$$ 957923 958127 960989 965801 971083 976373 982381 989132 995438 1000545 1004676 1007437 1007352 1003647 997041 988019
58532I88019j2119j5480j7640j8558j9368k0129k0033j9386j9233j9368j8821
$$ 988019 975900 960420 942780 924222 904854 884725 864692 845306 826073 806705 787884
58521G87884j7835j7364j7106j6064j4540j3503j2539j0613q257o862o294n385
$$ 787884 770049 752685 735579 719515 704975 691472 678933 668320 660063 653201 646907 641522
58509F41522m176l439k709j146L30K40o92n41O19J240J342K259L648L683K214
$$ 641522 637346 633907 631198 630052 630382 630622 629930 629389 630008 631248 632590 634849 638497 642180 644394
58494F44394J037J029J513K361M059N804O078N146M577M573M233M093N507P885
$$ 644394 645431 646460 647973 650334 654393 660197 666275 671421 675998 680571 684804 688897 694404 702289
58480G02289R375J0179J2138J5083J6744J6449J5824J5546J4334J1608Q239M258
$$ 702289 711664 721843 733981 749064 765808 782257 798081 813627 827961 839569 847808 852066
58468H52066j268p631j2530j5269j7250j8945j9195j7932j6825j6573j6160j5254
$$ 852066 850798 843167 830637 815368 798118 779173 759978 742046 725221 708648 692488 677234
58456F77234j4729j4458j3205j1096r582q734p258n349m589m824m215k683k061
$$ 677234 662505 648047 634842 623746 614164 605430 598172 592823 588234 583410 579195 576512 574451
58443E74451k460j828K21J520J214J262K946M926N861O275O689O516N803N551
$$ 574451 571991 570163 570384 571904 573118 574380 577326 582252 588113 594388 601077 607593 613396 618947
58429F18947N651M946L826M088N829P314Q193R773J1856J2641J2281J2988J4959
$$ 618947 624598 629544 633370 637458 643287 650601 658794 668567 680423 693064 705345 718333 733292
58416G33292J5709J4279J2502J1245R044N541K593P54j728n133p125o834o530
$$ 733292 749001 763280 775782 787027 796071 801612 804205 804959 803231 798098 790973 784139 777609
58403G77609p621q494p965p468q072q477p809p342p808p895o888n926n393m093
$$ 777609 769988 761494 753529 746061 737989 729512 721703 714361 706553 698658 691770 685844 680451 676358
58389F76358k105j227j524r16P97J209j56o07J007K410K370K936N245P156P228
$$ 676358 674253 673026 671502 670586 671383 672592 672436 671829 672836 675246 677616 680552 685797 692953 700181
58374G00181P246Q565R655R433R318R864R123O570M815N119N092L236J806K513
$$ 700181 707427 715992 725647 735080 744398 754262 763385 769955 774770 779889 784981 788217 790023 792536
58360G92536L323K268Q41P83J076P98J365L223L974K544J567K872M303L848L091
$$ 792536 795859 798127 798968 799751 800827 801625 802990 806213 810187 812731 814298 817170 821473 825321 828412
58345H28412L606L743K209J130K250L591L163K527L485M672M710N288P797J0199
$$ 828412 832018 835761 837970 839100 841350 844941 848104 850631 854116 858788 863498 868786 876583 886782
58331H86782J0488J0042J0444J0405Q881P783Q504R177Q328P723Q667R231Q121
$$ 886782 897270 907312 917756 928161 937042 944825 953329 962506 970834 978557 987224 996455 1004576
58318A004576P402Q408Q980P895P761J0209J2479J2172J1124J1199J0772Q847
$$ 1004576 1011978 1020386 1029366 1037261 1045022 1055231 1067710 1079882 1091006 1102205 1112977 1121824
58306A121824Q051R750J0908R583Q783J0835J2963J2626J2266J4250J6144J5654
$$ 1121824 1129875 1139625 1150533 1160116 1168899 1179734 1192697 1205323 1217589 1231839 1247983 1263637
58294A263637J5262J7150J8519J7040J5852J7934K0405J9837J8392J9250K0686
$$ 1263637 1278899 1296049 1314568 1331608 1347460 1365394 1385799 1405636 1424028 1443278 1463964
58283A463964K0168J9584K1103K2606K2488K3854K8541L2441L2368L1938L4719
$$ 1463964 1484132 1503716 1524819 1547425 1569913 1593767 1622308 1654749 1687117 1719055 1753774
58272A753774L7389L6058L3537L3670L4190L2065L0223L2024L4699L5145L6329
$$ 1753774 1791163 1827221 1860758 1894428 1928618 1960683 1990906 2022930 2057629 2092774 2129103
58261B129103M0939M4894M4584M4145M7931N2340N3010N3326N7431O1738O2107
$$ 2129103 2170042 2214936 2259520 2303665 2351596 2403936 2456946 2510272 2567703 2629441 2691548
58250B691548O2397O6908P1520P1728P2056P7647Q4177Q6316Q8433R6012J04478
$$ 2691548 2753945 2820853 2892373 2964101 3036157 3113804 3197981 3284297 3372730 3468742 3573220
58239C573220J07955J11132J20421J31431J37603J43175J54598J67329J74654
$$ 3573220 3681175 3792307 3912728 4044159 4181762 4324937 4479535 4646864 4821518
58230D821518J81150J93645K07584K16777K27471K47481K70810K89008L07829
$$ 4821518 5002668 5196313 5403897 5620674 5848145 6095626 6366436 6655444 6963273
58221F963273L35870L67116L92777M19718M58190N02352N43081N88436O50245
$$ 6963273 7299143 7666259 8059036 8478754 8936944 9439296 9982377 10570813 11221058
58212A1221058P22574P96183Q81439R93041J126445J275972J461730J709661K018786
$$ 11221058 11943632 12739815 13621254 14614295 15740740 17016712 18478442 20188103 22206889
58203B2206889K376235K786802L256452L768596M315374M934053N676660O570751
$$ 22206889 24583124 27369926 30626378 34394974 38710348 43644401 49321061 55891812
58195E5891812P653467R014641J0759933J2970491J5753482J9288350K3774784
$$ 55891812 63545279 72559920 83319853 96290344 112043826 131332176 155106960
58188A55106960K9390010L6225355M3798451N0122401N1475636M4137350K7351988
$$ 155106960 184496970 220722325 264520776 314643177 366118813 410256163 437608151
58181D37608151M776282j7376435l3983015m3240011m6131437m4614147m0457646
$$ 437608151 442384433 425007998 391024983 347784972 301653535 257039388 216581742
58174B16581742l5053966k9449115k4267983j9759055j5989520j2949215j0533689
$$ 216581742 181527776 152078661 127810678 108051623 92062103 79112888 68579199
58167F8579199q587280p005848n741459m727079l876250l146922k533115k000112
$$ 68579199 59991919 52986071 47244612 42517533 38641283 35494361 32961246 30961134
58159C0961134j490717r83739m83081M0967O42489J350713K182618L144414M089531
$$ 30961134 29470417 28486678 28003597 28044564 28687053 30037766 32220384 35364798 39454329
58150C9454329M581103M074298K381108o1209k449418m145353m969312n092073
$$ 39454329 44035432 48109730 50490838 50429629 47980211 43834858 38865546 33773473
58142C3773473m776945m233875l606656k992424k447045j990274j619424j323426
$$ 33773473 28996528 24762653 21155997 18163573 15716528 13726254 12106830 10783404
58134A0783404j090472r08685p64373o44864n44049m61541l96157l44491l05058
$$ 10783404 9692932 8784247 8019874 7375010 6830961 6369420 5973263 5628772 5323714
58125E323714k77549k58044k41272k27315k19363k15159k07958j95891j82750
$$ 5323714 5046165 4788121 4546849 4319534 4100171 3885012 3677054 3481163 3298413
58116C298413j69580j53370j34637j18247j05516r2810p9237o8897o4358o4164
$$ 3298413 3128833 2975463 2840826 2722579 2617063 2524253 2445016 2376119 2311761 2247597
58106B247597o7285p3666q0024q1553p8449p4868p1634o6089n8650n2832m8921
$$ 2247597 2180312 2106646 2026622 1945069 1866620 1791752 1720118 1654029 1595379 1542547 1493626
58095A493626m4221l9276l7172l6926l4548l0516k9215l0824l0877k8270k6648
$$ 1493626 1449405 1410129 1372957 1336031 1301483 1270967 1241752 1210928 1180051 1151781 1125133
58084A125133k7238k7157k5695k5556k6871k6413k3830k2400k2657k1389j7994
$$ 1125133 1097895 1070738 1045043 1019487 992616 966203 942373 919973 897316 875927 857933
58073H57933j5758j5684j5056j3147j2506j3413j2905j0579r601j0631j0442p998
$$ 857933 842175 826491 811435 798288 785782 772369 759464 748885 739284 728653 718211 710213
58061G10213o338o831o986n629n069o405p616p942r365j2051j3044j1196q962
$$ 710213 703875 697044 690058 684429 679360 672955 665339 657397 648032 635981 622937 611741 602779
58048F02779p825o320m000k850l295l056j443n54r47l51J912L436L039K555L061
$$ 602779 594954 588634 584634 581784 578489 575433 573990 573436 572489 572138 574050 577486 580525 583080 586141
58033E86141L319L167M260O198O105L488J361J192P96j149k724k572k220k756
$$ 586141 589460 592627 596887 603085 609190 612678 614039 615231 616027 614878 612154 609582 607362 604606
58019F04606k883k020j834l043m025m081m652n979o061m470l706n169p069p844
$$ 604606 601723 599703 597869 594826 590801 586720 582068 576089 570028 565558 561852 556683 549614 541770
58005E41770q258q727p971n938m781n279n406m010k746k807k891j983j147r92
$$ 541770 533512 524785 516814 510876 506095 500816 495410 491400 488654 485847 482956 480973 479826 478834
57991D78834l59R84J370L85PJ184K277K329K741M181M992M310L743M175M018K457
$$ 478834 478475 479459 480829 481214 481221 482405 484682 487011 489752 493933 498925 503235 506978 511153 515171 517628
57975E17628J411K223L212K574J101Jj463m077o664q020q806r735r953q897p669
$$ 517628 519039 521262 524474 527048 528149 528150 526687 522610 515946 507926 499120 489385 479432 470535 462866
57960D62866p022n921l730j799j393j934k595l642m970n340m419l534l282k491
$$ 462866 455844 449923 446193 444394 443001 441067 438472 434830 429860 424520 420101 416567 413285 410794
57946D10794o03J054J517J556J747J359K66l31r6k89j378k289k794m004n638n695
$$ 410794 410191 411245 412762 414318 416065 417424 417690 417359 417263 416974 415596 413307 410513 406509 400871 395176
57930C95176m010l126m280n599n765o300q219r482q140n485l668k397m04J910
$$ 395176 391166 388040 383760 378161 372396 366096 357877 348395 340255 334770 331102 328705 328301 330211
57916C30211L467M489N506O068O072O574P723P916O562N630O683Q528R458R681
$$ 330211 333678 338167 343673 349741 355813 362387 370110 378026 384588 390218 396901 405429 414887 424568
57902D24568R722Q655N941L106J593P24m90j439j590k072l702n347o012o575p715
$$ 424568 434290 442945 448886 451992 453585 454309 453819 452380 450790 448718 445016 439669 433657 427082 419367
57887D19367q250p367o407o497o523n503m623m842m706l008j382j636k491j730
$$ 419367 411117 403750 397343 390846 384323 378820 374197 369355 364649 361641 360259 358623 356132 354402
57873C54402K29J681K782M453N751N363M473N139O820P365O583O049O096N661
$$ 354402 354631 356312 359094 363547 369298 374661 379134 384273 391093 398458 405041 411090 417186 422847
57859D22847M673M034L655K676J323M28l00j622k990l353l093l324l986m432m995
$$ 422847 427520 431554 435209 437885 439208 439636 439336 437714 434724 431371 428278 424954 420968 416536 411541
57844D11541o074o641n687m310m193m896m782l833l261l086k423j676k086l462
$$ 411541 405467 398826 393139 388829 384636 379740 374958 371125 367864 364778 362355 360679 358593 355131
57830C55131m465m898n643o664p068o974p336q096q376q250q475q720p924o322
$$ 355131 350666 345768 340125 333461 326393 319419 312083 303987 295611 287361 278886 270166 262242 255920
57816B55920n286n210n207m795m332l822k920k038j964k453k452j695p87K6R56
$$ 255920 250634 245424 240217 235422 231090 227268 224348 222310 220346 217893 215441 213746 212959 212985 213941
57801B13941J821K314K809L794M913N651O389P594Q708Q988Q753Q490P608N620
$$ 213941 215762 218076 220885 224679 229592 235243 241632 249226 257934 266922 275675 284165 291773 297393
57787B97393L621K918K930K192P95m4k35q00j941k974l882n207o548o886o222
$$ 297393 301014 303932 306862 309054 309849 309805 309570 308770 306829 303855 299973 294766 288218 281332 275110
57772B75110n415m655l554k461k084k058j434l21M14P62J431K366K976L450M363
$$ 275110 269695 265040 261486 259025 256941 254883 253449 253128 253542 254304 255735 258101 261077 264527 268890
57757B68890N318N515N300N625O250O135N328M870M997M976M539M029L352K336
$$ 268890 274208 279723 285023 290648 296898 303033 308361 313231 318228 323204 327743 331772 335124 337460
57743C37460J736K366L493L692K962K444K394K178J921K378L297L724L825M622
$$ 337460 339196 341562 345055 348747 351709 354153 356547 358725 360646 363024 366321 370045 373870 378492
57729C78492O032O923P112P452Q022Q042P747Q420J0291J2190J3557J5066J6892
$$ 378492 384524 391447 398559 406011 414033 422075 429822 438242 448533 460723 474280 489346 506238
57716E06238J8137J8543J9181K0787K2743K4322K5694K7235K8981L1206L4516
$$ 506238 524375 542918 562099 582886 605629 629951 655645 682880 711861 743067 777583
57705G77583L8911M3721M8706N4316O0771O7844P5658Q4632R4625J05176J16674
$$ 777583 816494 860215 908921 963237 1024008 1091852 1167510 1252142 1346767 1451943 1568617
57694A568617J30199J46106J63764J82686K02966K24560K46990K69522K90675
$$ 1568617 1698816 1844922 2008686 2191372 2394338 2618898 2865888 3135410 3426085
57685C426085L07620L16909L15494L00484K69086K20502J57747Q6560J3100n6414
$$ 3426085 3733705 4050614 4366108 4666592 4935678 5156180 5313927 5400487 5413587 5357173
57675E357173j15398j58731j84789j94179j87186j64215j28001q3539l7271R38
$$ 5357173 5241775 5083044 4898255 4704076 4516890 4352675 4224674 4141135 4103864 4104802
57665D104802J6777j881n4464j25427j93734k44000k70021k72631k57167k31039
$$ 4104802 4121579 4119698 4065234 3939807 3746073 3502073 3232052 2959421 2702254 2471215
57655B471215k00572j69459j39990j14034r2174p3488n7193m3451l2057k1859
$$ 2471215 2270643 2101184 1961194 1847160 1754986 1681498 1624305 1580854 1548797 1526938
57645A526938j2234l605M137J2240K1398L0881M0183N0028O1037P2778Q5004R8410
$$ 1526938 1514704 1511099 1515236 1527476 1548874 1579755 1619938 1669966 1731003 1803781 1888785 1987195
57633A987195J13331J29068J45366J63174J82934K03382K22925K40863K56197
$$ 1987195 2100526 2229594 2374960 2538134 2721068 2924450 3147375 3388238 3644435
57624C644435K66392K68378K59801K38538K02407J50973Q7209J6645n4614j20901
$$ 3644435 3910827 4179205 4439006 4677544 4879951 5030924 5118133 5134778 5080164 4959263
57614D959263j77572k21902k53066k71075k76657k72324k61874k47969k31260
$$ 4959263 4781691 4559789 4306723 4035648 3758991 3486667 3224793 2976824 2745564
57605B745564k12351j93072j74982j58092j42074j27428j14464j02522r1283q1636
$$ 2745564 2533213 2340141 2165159 2007067 1864993 1737565 1623101 1520579 1429296 1347660
57595A347660p4115o7626o1019n4799m9923m5978m1894l7714l4161l1121k7942
$$ 1347660 1273545 1205919 1144900 1090101 1040178 994200 952306 914592 880431 849310 821368
57584H21368k4838k2663k1473k0423j8893j6908j4763j2836j1542j0819r984q613
$$ 821368 796530 773867 752394 731971 713078 696170 681407 668571 657029 646210 636226 627613
57572F27613p058n727m437k951j494k35J110K656M017N011O029P351Q843J0567
$$ 627613 620555 614828 610391 607440 605946 605711 606821 609477 613494 618505 624534 631885 640728 651295
57558F51295J2778J5003J6222J6383J6679J7879J9585K1616K4693K9025L3611
$$ 651295 664073 679076 695298 711681 728360 746239 765824 787440 812133 841158 874769
57547H74769L7777M2246M7716N3722N9878O6918P5373Q4468R3607J03676J15541
$$ 874769 912546 954792 1002508 1056230 1116108 1183026 1258399 1342867 1436474 1540150 1655691
57536A655691J28433J41314J54757J69706J85143J98703K08925K15084K15218
$$ 1655691 1784124 1925438 2080195 2249901 2435044 2633747 2842672 3057756 3272974
57527C272974K06095J85293J52245J07798N4432l163n9343j09832j52227j84684
$$ 3272974 3479069 3664362 3816607 3924405 3978837 3975674 3916331 3806499 3654272 3469588
57517C469588k05670k15183k15193k08464j97418j83869j68899j52935j36590
$$ 3469588 3263918 3048735 2833542 2625078 2427660 2243791 2074892 1921957 1785367
57508A785367j21204j07881r6273q5177p4248o4226n5647m8139m1085l4248k7702
$$ 1785367 1664163 1556282 1460009 1374832 1300584 1236358 1180711 1132572 1091487 1057239 1029537
57497A029537k1610j6162j1400p187l466j81L167P258J1950J6296K0017K4123
$$ 1029537 1007927 991765 980365 973178 969712 969531 972698 979956 991906 1008202 1028219 1052342
57485A052342K9463L5556M1635M8054N5695O4617P4302Q4701R6079J08284J21127
$$ 1052342 1081805 1117361 1158996 1207050 1262745 1327362 1401664 1486365 1582444 1690728 1811855
57474A811855J34990J50077J65465J79807J92476K02929K09145K07811J95955
$$ 1811855 1946845 2096922 2262387 2442194 2634670 2837599 3046744 3254555 3450510
57465C450510J71932J35401Q7664L2113k6507q3443j34506j76123k06007k23882
$$ 3450510 3622442 3757843 3845507 3877620 3851113 3767670 3633164 3457041 3251034 3027152
57455C027152k31048k29462k21374k09050j94031j77068j59242j42325j27346
$$ 3027152 2796104 2566642 2345268 2136218 1942187 1765119 1605877 1463552 1336206
57446A336206j13740j00823q9259p9909p2175o4814n7828n2088m7531m3210l8864
$$ 1336206 1222466 1121643 1032384 952475 880300 815486 757658 705570 658039 614829 575965
57435E75965l5046l1862k8845k6042k3939k2346k0545j8561j7086j6118j4880
$$ 575965 540919 509057 480212 454170 430231 407885 387340 368779 351693 335575 320695
57424C20695j3234j2088j2046j2541j2635j1908j0495q817p436o576n885n136
$$ 320695 307461 295373 283327 270786 258151 246243 235748 226931 219495 212919 207034 201898
57412B01898m833n359n938n506m339l685l890m051l557k863k474k171j631r87
$$ 201898 197065 191706 185768 180262 175923 172238 168348 164297 160740 157877 155403 153232 151601 150614
57398A50614m46L9M64O24M11o1o25j000q65m40n76j640k707k698j891j419j612
$$ 150614 150168 150207 150671 151295 151706 151645 151020 150020 149155 148715 148139 146499 143792 141094 139203 137784 136172
57381A36172j821j671j482j514j704k085k621k839k425j923j929j999j445p57
$$ 136172 134351 132680 131198 129684 127980 125895 123274 120435 118010 116087 114158 112159 110714 109957
57367A09957r47j678j560l59N51K46o20j139j379j679j764j272m62J53M08L99
$$ 109957 109010 107332 105772 105413 105964 106210 105590 104451 103072 101393 99629 98357 97895 98048 98456 98855
57351I8855L27M84R25J104N36l31o24l14p8l2L51J048J357J058O99M81K8n74n88
$$ 98855 99182 99666 100591 101695 102231 101900 101276 100962 100884 100852 101203 102251 103608 104666 105365 105846 105874 105300 104712
57332A04712J16O27L29k54l67O4Q02J789K814L439L641L880M240M262L832L469
$$ 104712 104828 105455 105784 105530 105163 105227 106029 107818 110632 114071 117712 121592 125832 130094 133926 137395
57316A37395L445L504L611M121M926N345N195N099N402N788O194P027Q118Q654
$$ 137395 140840 144344 147955 152076 157002 162347 167542 172641 178043 183831 190025 197052 205170 213824
57302B13824Q607R021J0234J1128J1098J1413J3352J6007J7482J7613J8060J9942
$$ 213824 222431 231452 241686 252814 263912 275325 288677 304684 322166 339779 357839 377781
57290C77781K2731K5446K7719K9536L0955L2282L3820L5273L6021L5970L5483
$$ 377781 400512 425958 453677 483213 514168 546450 580270 615543 651564 687534 723017
57279G23017L4435L2081K8041K2766J6752R846J774p067j5769k3613l0245l5324
$$ 723017 757452 789533 817574 840340 857092 866938 868712 861645 845876 822263 792018 756694
57267G56694l8561m0177m0851m0977m0282l8470l5980l3586l1451k9146k6562
$$ 756694 718133 677956 637105 596128 555846 517376 481396 447810 416359 387213 360651
57256C60651k4123k2008j9854j7542j5448j3582j1314q630o792o811p824q144
$$ 360651 336528 314520 294666 277124 261676 248094 236780 228150 221358 214547 206723 198579
57244A98579p405o537n933n004l634k739k946l673l948l532k859k445k536k939
$$ 198579 191174 184637 178704 173700 170066 167327 164381 160708 156760 153228 150369 147924 145388 142449
57230A42449l036k470j704j414j486j305p77k98P0M78N40k14j179j147n2Q29O81
$$ 142449 139413 136943 135239 133825 132339 131034 130257 129959 130029 130507 131047 130833 129654 128507 128455 129284 129965
57213A29965Q8j28Q5N01J181J984K400K238J873J546J186J039J506K147J998J104
$$ 129965 130053 129925 130010 130511 131692 133676 136076 138314 140187 141733 142919 143958 145464 147611 149609 150713
57197A50713O29J045J472J349J455K405L356L249K491K213K590K934K980L134
$$ 150713 151342 152387 153859 155208 156663 159068 162424 165673 168164 170377 172967 175901 178881 182015
57183A82015L761M931O526Q005Q648Q605R038J0531J2025J2269J1713J1982J3832
$$ 182015 185776 190707 197233 205238 213886 222491 231529 242060 254085 266354 278067 290049 303881
57170C03881J6532J9028K0771K1640K1970K2559K3854K5155K5407K4696K4156
$$ 303881 320413 339441 360212 381852 403822 426381 450235 475390 500797 525493 549649
57159E49649K4313K4402K3666K2621K2490K3757K5737K7567K9103L0682L2331
$$ 549649 573962 598364 622030 644651 667141 690898 716635 744202 773305 803987 836318
57148H36318L3618L4307L4770L5508L6596L7841L9179M0481M1302M1415M1397
$$ 836318 869936 904243 939013 974521 1011117 1048958 1088137 1128618 1169920 1211335 1252732
57137A252732M2049M3340M4575M5452M6267M7108M7702M8137M8935N0160N1186
$$ 1252732 1294781 1338121 1382696 1428148 1474415 1521523 1569225 1617362 1666297 1716457 1767643
57126A767643N1588N1671N1916N2538N3726N5729N8382O1107O3531O5645O7424
$$ 1767643 1819231 1870902 1922818 1975356 2029082 2084811 2143193 2204300 2267831 2333476 2400900
57115B400900O9006P1260P5188Q0533Q5922R1006R7738J08795J25156J45868J70090
$$ 2400900 2469906 2541166 2616354 2696887 2782809 2873815 2971553 3080348 3205504 3351372 3521462
57104C521462J98898K35055K81459L39992M11791M97952N99493P16980Q51215
$$ 3521462 3720360 3955415 4236874 4576866 4988657 5486609 6086102 6803082 7654297
57095G654297J004579J181248J386351J625710J905541K229900K597111K998360
$$ 7654297 8658876 9840124 11226475 12852185 14757726 16987626 19584737 22583097
57087B2583097L417218L826654M188482M463845M627775M666959M558618M261002
$$ 22583097 26000315 29826969 34015451 38479296 43107071 47774030 52332648 56593650
57079E6593650L739292L003221K111210J136399J36102q46697j768266k584001
$$ 56593650 60332942 63336163 65447373 66583772 66719874 65873177 64104911 61520910
57071F1520910l260056l777109m125504m305125m329855m225300m019965l740962
$$ 61520910 58260854 54483745 50358241 46053116 41723261 37497961 33477996 29737034
57063B9737034l415665l070530k725816k394288k085144j805707j559126j344335
$$ 29737034 26321369 23250839 20525023 18130735 16045591 14239884 12680758 11336423
57055A1336423j159685j004220q75265p67981o78222o03368n40007m83722m32072
$$ 11336423 10176738 9172518 8297253 7529272 6851050 6247682 5707675 5223953 4791881
57046D791881l85361l43683l05638k70584k39697k13628j91226j71483j54760
$$ 4791881 4406520 4062837 3757199 3486615 3246918 3033290 2842064 2670581 2515821
57037B515821j41047j29015j17761j07814r9442r1687q3965p6971p1131o5649
$$ 2515821 2374774 2245759 2127998 2020184 1920742 1829055 1745090 1668119 1596988 1531339
57027A531339o0048n5048n1045m7164m2849l8921l6105l3768l1195k8820k7173
$$ 1531339 1471291 1416243 1365198 1318034 1275185 1236264 1200159 1166391 1135196 1106376 1079203
57016A079203k5728k3820k1773k0164j8808j7211j5285j2973j0025o548k796J911
$$ 1079203 1053475 1029655 1007882 987718 968910 951699 936414 923441 913416 906868 904072 905983
57004I05983Q841J8116K8673M0488N5185P4177R8168J28923J67415K06235K25723
$$ 905983 914824 932940 961613 1002101 1057286 1131463 1229631 1358554 1525969 1732204 1957927
56993A957927K03743J33520L2089o9709j46218j88439k01514j95155j76942j51738
$$ 1957927 2161670 2295190 2327279 2257570 2111352 1922913 1721399 1526244 1349302 1197564
56983A197564j23696r6857p4446n8520m9970m7989m9766n1816n1925m9543m4740
$$ 1197564 1073868 977011 902565 844045 794075 746086 696320 644504 592579 543036 498296
56972D98296l7861l0067k2979j7377j2909r120n947l183l45K671N580Q508J2023
$$ 498296 460435 430368 407389 390012 377103 367983 362036 358853 358508 361179 366759 375267 387290
56959C87290J6311K1065K6172L1390L5176L4849K8536J6685J841j2470k3020k8457
$$ 387290 403601 424666 450838 482228 517404 552253 580789 597474 599315 586845 563825 535368
56947E35368k9892k9286k7291k3530j8579j4089j0800p888m645j518J072L759
$$ 535368 505476 476190 448899 425369 406790 392701 381901 374013 369368 367850 368922 372681
56935C72681P376J1976J7252K3284L0249L7724M4086M6131M0110K4871M100j5878
$$ 372681 380057 392033 409285 432569 462818 500542 544628 590759 630869 655740 659840 643962
56923F43962l0798m0101m4607m4762m1513l6752l1746k6475k1174j6974j4239
$$ 643962 613164 573063 528456 483694 442181 405429 373683 347208 326034 309060 294821
56912B94821j1828r023o791o064o059n537m516l621k710j429k23L27M92P10O81
$$ 294821 282993 273970 267179 261115 255056 249519 245003 241382 238672 237243 237020 237347 237839 238549 239230
56897B39230J77J2J079K982M667N928P407R513J2221J5607J9912K5218L1271L6969
$$ 239230 239407 239419 240498 243480 248147 254075 261482 270995 283216 298823 318735 343953 375224 412193
56883D12193L9839L7125K8157J5194J644r851j7613k0844k0285j7846j4729j0677
$$ 412193 452032 489157 517314 532508 534152 524301 506688 485844 465559 447713 432984 422307
56871D22307n716j258J493L260N666R302J3803J9053K5249L2502M1307N2648O6263
$$ 422307 416591 415333 416826 420086 425752 435054 448857 467910 493159 525661 566968 619616 685879
56858F85879P8914Q5099P9662O0356K9596n355l5530n5311o4597o6132o2162n4275
$$ 685879 764793 849892 929554 989910 1019506 1014151 978621 923310 858713 792581 730419 676144
56846F76144m4540l4754k5195j5500o085K498J0863K0113L0444M1567N4030O8955
$$ 676144 631604 596850 571655 556155 550070 552568 563431 583544 613988 655555 709585 778540
56834G78540Q6871J07199J27247J40173J35836J07259N7506q63n3541r1552j12642
$$ 778540 865411 972610 1099857 1240030 1375866 1483125 1540631 1539768 1486227 1394675 1282033
56823A282033j18995j14777j04270r0593p5660o0869m7177l4698k3038j2095j996
$$ 1282033 1163038 1048261 943991 853398 777738 716869 669692 634994 611956 599861 597865
56812E97865P597J7436K8182M0437N4902P1616Q8476J00589J01191Q4468M9798
$$ 597865 605462 622898 651080 691517 746419 818035 906511 1007100 1108291 1192759 1242557
56801A242557M337l9789p2571r0865r6886r4054q5378p3999o2587n2012m1831
$$ 1242557 1246894 1207105 1134534 1043669 946783 852729 767351 693352 630765 578753 536922
56790E36922l1940k2831j4728p541j381L941R534J6669K5618L5742M5829N3385
$$ 536922 504982 482151 467423 459882 458501 462442 471976 488645 514263 550005 595834 649219
56778F49219N4558M6419K9391O884j6740l7226n1023n6857n6529n2925m7512m0750
$$ 649219 703777 750196 779587 786471 769731 732505 681482 624625 568096 515171 467659 426909
56766D26909l3864k8369k4203k0060j5598j1915r845q988q491p784o574n049l937
$$ 426909 393045 364676 340473 320413 304815 292900 283055 274067 265576 257792 251218 246169 242232
56753B42232l592l358k663k067k245k716k676k455k765l255l155k772k803k824
$$ 242232 238640 235282 232619 230552 228307 225591 222915 220460 217695 214440 211285 208513 205710 202886
56739B02886k050j062j079j902k305k108k066k037j182J14M20m56j205j125q75
$$ 202886 200836 199774 198695 196793 194488 192380 190314 188277 187095 187209 187629 187173 185968 184843 183968
56724A83968q98p54l67l65q71j245j337j636j999j563k35J021J553J486Q36m82
$$ 183968 183070 182316 181949 181584 180713 179468 178131 176495 174496 172933 172698 173719 175272 176758 177594 177112
56708A77112j768k017j389q60n06L91J586J940J348R49J175J259R80J148J905
$$ 177112 175344 173327 171938 171078 170572 170963 172549 174489 175837 176786 177961 179220 180200 181348 183253
56693A83253K212J564P75N00L99K51M68J013J154P60N05N08J60m19l62J91J1j012
$$ 183253 185465 187029 187804 188304 188703 188954 189422 190435 191589 192349 192854 193362 193522 193103 192741 192932 192943 191931
56675A91931j431o48J7m08r43m24O17R61M07n79j809k928l149k339j380p67K4
$$ 191931 190500 189852 189869 189461 188518 188094 188711 189672 190079 189500 187691 184763 181614 179275 177895 177128 177152
56658A77152J065J304K91p76q11m26o18j035q44l34k59m03j50J78j56q50q96r8
$$ 177152 178217 179521 179812 179036 178225 177799 177181 176146 175302 174968 174709 174306 174156 174334 174178 173328 172432 172334
56640A72334P02Q31M23M8K16J001J776J727Q77J48R6K96K63K17M86Q76J132J298
$$ 172334 173036 173867 174290 174338 174554 175555 177331 179058 179935 180083 180179 180475 180738 180955 181441 182317 183449 184747
56622A84747J279P41j16n31l17k00n85q73n42pK28M39J002J466J128R4q38j080
$$ 184747 186026 186767 186651 186120 185803 185603 185018 184145 183603 183596 183824 184263 185265 186731 187859 187953 187115 186035
56604A86035o89j87j33m98n63J18Q55O91j89q12r16r55q79k52M50K05q19j324
$$ 186035 185346 185159 185026 184528 183965 184083 184938 185629 185440 184628 183712 182757 181878 181626 182076 182281 181462 180138
56586A80138r17n28n76l41M54J020J049J283J893J886R09K19Q70K251L241L670
$$ 180138 179221 178693 178117 177776 178230 179250 180299 181582 183475 185361 186270 186489 187359 189610 192851 196521
56570A96521L849L775L629L963M779N438N883O686P586P568O799O759P719Q017
$$ 196521 200370 204145 207774 211737 216516 221954 227837 234523 242109 249677 256476 263235 270954 278971
56556B78971O752N295M966N059M541L989M181M257L048J110k60j134k416l968
$$ 278971 285723 291018 295984 301043 305584 309573 313754 318011 321059 322169 321909 320775 318359 314391
56542C14391m760m455l693l238l617m945o417o856o311o095o663o850n930m799
$$ 314391 309631 305176 301483 298245 294628 289683 283266 276410 270099 264004 257341 250491 244561 239762
56528B39762m211l448j944o47m95r71j514k701m576n427m060j886r00q28k54O29
$$ 239762 235551 232103 230159 229512 229017 228046 226532 223831 219255 213828 209768 207882 206982 206154 205900 206529
56512B06529N61l50q53p07p48j221j679k062k430k190j059j17m11j145q37L72
$$ 206529 207090 206740 205887 205180 204432 203211 201532 199470 197040 194850 193791 193674 193263 192118 191281 191653
56496A91653J136J066Q78P40J35q96j621j623r52K50J398J500M95k05M01J479
$$ 191653 192789 193855 194733 195473 195608 194712 193091 191468 190516 190766 192164 193664 194159 193954 194355 195834
56480A95834J872J938K547L316L369K853K292J372j38j176p66L18Q02Q85J371
$$ 195834 197706 199644 202191 205507 208876 211729 214021 215393 215255 214079 213313 213631 214433 215318 216689
56465B16689J866J586J043J131J324O61k68k00O48J114J105J278J412R25L82O57
$$ 216689 218555 220141 221184 222315 223639 224300 224032 223832 224480 225594 226699 227977 229389 230314 230696 231353
56449B31353J256J234J063J724K657K623J927J818K280K384K257K571K742J747
$$ 231353 232609 233843 234906 236630 239287 241910 243837 245655 247935 250319 252576 255147 257889 259636
56435B59636K05m60m33r70k008k596l044m273n429m773k781j745k259k575j708
$$ 259636 259841 259381 258948 257978 255970 253374 250330 246057 240628 235855 233074 231329 229070 226495 224787
56420B24787o91l81k23J87L11l2k88m04q52j258p83J62L39j58oR64J379N41q04
$$ 224787 224096 223715 223492 223679 223990 223958 223670 223266 222414 221156 220373 220535 220874 220716 220710 221674 223053 223594 222790
56401B22790k002l028l432k535r03P9J91L16N32J34m95m4J519K721K733K103J350
$$ 222790 220788 217760 214328 211793 210890 210969 211160 211476 212008 212142 211647 211603 213122 215843 218576 220679 222029
56384B22029N94M64J528K902L259L011L565M686M858M042L703M093L928K941K312
$$ 222029 222623 223087 224615 227517 230776 233787 237352 242038 246896 250938 254641 258734 262662 265603 267915
56369B67915K231J570L75K14J382K108J290r5r29j261r94M33K339K799J354j22
$$ 267915 270146 271716 272091 272305 273687 275795 277085 276990 276061 274800 273806 274239 276578 279377 280731 280609
56353B80609q9Q49J537J883K092J941J599J732K291K538K558L261M735O132P209
$$ 280609 280520 281369 282906 284789 286881 288822 290421 292153 294444 296982 299540 302801 307536 313668 320877
56338C20877Q257Q643P491N683N012N322M876L639L478M897O283O984Q237J0206
$$ 320877 329134 337777 345268 350951 355963 361285 366161 369800 373278 378175 384458 391442 399679 409885
56324D09885J0921R476P695P235P325O745N897N436M713L109J282j14j476k950
$$ 409885 420806 430282 437977 445212 452537 459282 465179 470615 475328 478437 479719 479605 478129 475179
56310D75179l658l227k600k475k334j795j328j029l08O76R03L61K60R69J571J892
$$ 475179 471521 468294 465694 463219 460885 459090 457762 456733 456425 457101 458004 458365 458625 459594 461165 463057
56294D63057K931M753O021O252O513P355Q085Q589R704J1313J2316J2987J4949
$$ 463057 465988 470741 476762 483014 489527 496882 504967 513556 523260 534573 546889 559876 574825
56281E74825J8247K0948K2298K3723K5999K8114K9814L2508L6570M0401M3379
$$ 574825 593072 614020 636318 660041 686040 714154 743968 776476 813046 853447 896826
56270H96826M7072N2374N8090O3699P0813Q0295R0560J00310J10616J22573J35273
$$ 896826 943898 996272 1054362 1118061 1188874 1269169 1359729 1460039 1570655 1693228 1828501
56259A828501J47706J60545J74319J87937K00364K11769K21582K27587K28286
$$ 1828501 1976207 2136752 2311071 2499008 2699372 2911141 3132723 3360310 3588596
56250C588596K24066K14894J99281J76863J49564J18835Q4233M6300Q347k6358
$$ 3588596 3812662 4027556 4226837 4403700 4553264 4672099 4756332 4802632 4810979 4784621
56240D784621n6952q3211j04003j19136j30265j38239j41887j40969j37868j34722
$$ 4784621 4727669 4644458 4540455 4421319 4291054 4152815 4010928 3869959 3732091 3597369
56230C597369j31391j27787j25456j25030j24827j23890j23699j24970j25593
$$ 3597369 3465978 3338191 3212735 3087705 2962878 2838988 2715289 2590319 2464726
56221B464726j23973j21616j20052j17914j13580j08235j03611r8957r2870q6052
$$ 2464726 2340753 2219137 2099085 1981171 1867591 1759356 1655745 1556788 1463918 1377866
56211A377866p9747p3442o6530o0151n5118n0009m3677l7645l3673l1001k8091
$$ 1377866 1298119 1224677 1158147 1097996 1042878 992869 949192 911547 877874 846873 818782
56200H18782k5191k2909k0477j7515j5419j4850j4033j1646r105p896p079n554
$$ 818782 793591 770682 750205 732690 717271 702421 688388 676742 667637 659741 652662 647108
56188F47108m274l823k545M55L030L368L108M385O400P580Q662J0602J1877J0932
$$ 647108 642834 639011 636466 636921 639951 643319 646427 650812 657212 664792 673454 684056 695933 706865
56174G06865R163Q500Q165O581M402K842J206j201k940k964k917m279n605n346
$$ 706865 716028 724528 732693 739274 743676 746518 747724 746523 743583 740619 737702 733423 727818 722472
56160G22472m746n140n049l011o36L25J244L709O050O320O166Q172J1580J4148
$$ 722472 717726 712586 707537 704526 703890 704215 705459 709168 715218 721538 727704 735876 747456 761604
56146G61604J6040J8640K1652K4583K8787L5075M1796M8207N6881O9647Q4249
$$ 761604 777644 796284 817936 842519 871306 906381 948177 996384 1053265 1122912 1207161
56135A207161R8038J11539J24768J33708J34561J28344J17478J01788Q2327O5235
$$ 1207161 1305199 1416738 1541506 1675214 1809775 1938119 2055597 2157385 2239712 2304947
56125B304947N6094N3228N1340M8619M5169L8019K4159O499q887j9735k7141l0967
$$ 2304947 2361041 2414269 2465609 2514228 2559397 2597416 2621575 2628074 2619187 2599452 2572311 2541344
56113B541344l1464l3203m1369n5383p0909q6005j00194j10087j12018j07498
$$ 2541344 2509880 2476677 2435308 2379925 2309016 2223011 2122817 2012730 1900712 1793214
56103A793214j00765r2717q2350p1773o4047n8017n0900m3969m0075l7735l3493
$$ 1793214 1692449 1599732 1517382 1445609 1381562 1323545 1272645 1228676 1188601 1150866 1117373
56092A117373k8102k4485k1758j7401j3127j2184j2902j1357q471p742p961n239
$$ 1117373 1089271 1064786 1043028 1025627 1012500 1000316 987414 976057 967586 959844 951883 946644
56080I46644o41J351P63J534M077N290N010N786P149O665N553O893R429R652Q522
$$ 946644 946003 947354 948117 949651 953728 959018 964028 969814 976963 983628 989181 996074 1005503 1015155 1023677
56065A023677R512J1665J1424R743J0318J2368J2358J1171J2286J4647J4734J3773
$$ 1023677 1033189 1044854 1056278 1066021 1076339 1088707 1101065 1112236 1124522 1139169 1153903 1167676
56053A167676J5261J7435J6292J3863J5015J8188J8228J6286J7521K0809K0641
$$ 1167676 1182937 1200372 1216664 1230527 1245542 1263730 1281958 1298244 1315765 1336574 1357215
56042A357215J7787J8069K1500K2855K2140K4209K8521K9642K7749K8351L1725
$$ 1357215 1375002 1393071 1414571 1437426 1459566 1483775 1512296 1541938 1569687 1598038 1629763
56031A629763L2867L1713L3106L6725L7552L6048L7381M0820M0783L8068L8841
$$ 1629763 1662630 1694343 1727449 1764174 1801726 1837774 1875155 1915975 1956758 1994826 2033667
56020B033667M2806M3755M1637M2321M5701M6152M4563M7383N3800N6660N6097
$$ 2033667 2076473 2120228 2161865 2204186 2249887 2296039 2340602 2387985 2441785 2498445 2554542
56009B554542N9019O5258O7886O7418P1410P9640Q4308Q5336R0479R9768J05388
$$ 2554542 2613561 2678819 2746705 2814123 2885533 2965173 3049481 3134817 3225296 3325064 3430452
55998C430452J07600J14694J26408J34070J37967J47218J61366J70238J73324
$$ 3430452 3538052 3652746 3779154 3913224 4051191 4198409 4359775 4530013 4703337
55989D703337J80587J92789K00637K05066K17597K38460K55758K68701K89393
$$ 4703337 4883924 5076713 5277350 5482416 5700013 5938473 6194231 6462932 6752325
55980F752325L18974L45491L68465M01195M45179M87704N28426N81698O48958
$$ 6752325 7071299 7416790 7785255 8186450 8631629 9119333 9647759 10229457 10878415
55971A0878415P17323P89507Q84800J006414J140850J294877J498240J763384
$$ 10878415 11595738 12385245 13270045 14276459 15417309 16712186 18210426 19973810
55963A9973810K077933K440941K866065L345152L855827M413815N071974N865200
$$ 19973810 22051743 24492684 27358749 30703901 34559728 38973543 44045517 49910717
55955D9910717O812452P976850R461059J1343975J3699698J6681180K0504770
$$ 49910717 56723169 64700019 74161078 85505053 99204751 115885931 136390701
55948A36390701K5368403L1436618L8631274M5846953N0168739M7581889L5590896
$$ 136390701 161759104 193195722 231826996 277673949 327842688 375424577 411015473
55941D11015473J5719478o758343k5928950l8396131m3993262m4358340m1374853
$$ 411015473 426734951 419976608 394047658 355651527 311658265 267299925 225925072
55934B25925072l6585093l1173269k5933680k1254971j7268990j4005322j1409915
$$ 225925072 189339979 158166710 132233030 110978059 93709069 79703747 68293832
55927F8293832r348496p691955o372361n336433m506468l821070l264192k823023
$$ 68293832 58945336 51253381 44881020 39544587 35038119 31217049 27952857 25129834
55919B5129834k458525k140988j874015j659696j475265j304093j155893j036897
$$ 25129834 22671309 20530321 18656306 16996610 15521345 14217252 13061359 12024462
55911A2024462r30611q25619p33509o62402n99411n34939m79068m38845m02861
$$ 12024462 11093851 10268232 9534723 8872321 8272910 7737971 7258903 6820058 6417197
55902F417197l62835l28346l06402k87181k62973k41644k28876k15759j96062
$$ 6417197 6054362 5726016 5419614 5132433 4869460 4627816 4398940 4183181 3987119
55893C987119j78212j68611j59773j45844j33827j28901j23918j13571j04358
$$ 3987119 3808907 3640296 3480523 3334679 3200852 3071951 2948033 2834462 2730104
55884B730104j01019r7284q9141q3239q3315q1941p4477o7870o7076o5870n9673
$$ 2730104 2629085 2531801 2442660 2359421 2276106 2194165 2119688 2051818 1984742 1918872 1859199
55873A859199n4579n5018n4831m9244m3815m2982m1498l5787l2278l5541l9003
$$ 1859199 1804620 1749602 1694771 1645527 1601712 1558730 1517232 1481445 1449167 1413626 1374623
55862A374623l6396l2180l1779l1271k5829j9218j6071j2952n470L331R203J3507
$$ 1374623 1338227 1306047 1274268 1242997 1217168 1197950 1181879 1168927 1163457 1166788 1175991 1189498
55850A189498J6785J3647J649j2179k0753k5763l0726l3148l0675k7616k8020
$$ 1189498 1206283 1219930 1221579 1209400 1188647 1162884 1132158 1099010 1068335 1040719 1012699
55839A012699k8814k6560k4328k5358k6523k4634k2787k3966k4789k2004j8951
$$ 1012699 983885 957325 932997 907639 881116 856482 833695 809729 784940 762936 743985
55828G43985j9119j9384j6083j1908j0543j0196q550q225j1162j3358j1460q991
$$ 743985 724866 705482 689399 677491 666948 656752 648202 639977 628815 615457 603997 595006
55816E95006r728j0542p368k862j351j172J219M052L941K596L291M372K592n82
$$ 595006 585278 574736 567368 564506 563155 561983 563202 567254 571195 573791 577082 581454 584046 583464
55802E83464j865k092l685n446n207m514n714p577q428j0017j3684j6397j5418
$$ 583464 581599 579507 575822 570376 565169 560655 554941 547364 538936 528919 515235 498838 483420
55789D83420j3238j3144j3609j1953r708r393r472p558n265m895m683k126J037
$$ 483420 470182 457038 443429 431476 421768 412375 402903 395345 390080 385185 380502 378376 379413
55776C79413J799O88p34l695q956j3259j3758j2707j3154j3505j1071p592o061
$$ 379413 381212 381900 381166 377471 368515 355256 341498 328791 315637 302132 291061 283469 277408
55763B77408n310k849j29K6j471k230k966n087o567n121k886l093m655m683l754
$$ 277408 272098 269249 269120 269146 267675 265445 262479 257392 250825 245704 242818 239725 235070 230387 226633
55748B26633l924m135k525q41j680l599l729k939l614m626l421j111n56j307j046
$$ 226633 222709 218574 216049 215208 213528 209929 206200 203261 199647 195021 191600 190489 189933 188626 187580
55733A87580j86m16o00J130L139K671P20j04n70k924n840o221m631m053m591m069
$$ 187580 187394 186978 186378 187508 190647 193318 194038 193934 193364 190440 184600 178379 173748 169695 165104 161035
55717A61035k729k540k951j834J70O93O6M64J602J564R92K197M795O426P046Q503
$$ 161035 158306 155766 152815 150981 151151 151844 151910 152374 153976 155540 156532 158729 163524 169950 176996 185499
55701A85499J0489J0873R403P497N160J788r86j076K37K6j700k816l300m657o132
$$ 185499 195988 206861 216264 223761 228921 230709 229723 228647 228884 228910 227210 224394 221094 216437 210305
55686B10305n654l886l322l845l092p85J107K092L452N131N839N832O289O536
$$ 210305 204651 200765 197443 193598 190506 189721 190828 192920 196372 201503 207342 213174 219463 225999
55672B25999N127K929J906J578J99j542j595m30k40r56p90R7J19l16L22J174K86
$$ 225999 231126 234055 235961 237539 237738 236196 234601 234171 233931 232975 232185 232282 232401 232085 232407 233581 233867
55655B33867j329r50J041J752P31J64L59o83l165n049o006p856j0644j2101j1481
$$ 233867 232538 231588 232629 234381 235112 235276 235635 234952 231787 226738 220732 212876 202232 190131 178650
55640A78650j0452r721q275o333n594o048n842m711m282m661m167k803k587l788
$$ 178650 168198 158477 150202 143869 138275 132227 126385 121674 117392 112731 108564 105761 103174 99386
55626I9386m231l037j862j710j598j132j363k261k267j189q37j882k687k058p90
$$ 99386 95155 92118 90256 88546 86948 85816 84453 82192 79925 78736 77899 76017 73330 71272 70482
55611G0482J99R98J451R48n9m48l83q09j277o51K67l40j940k108m96O69K64m20
$$ 70482 70681 71679 73130 74078 74019 73571 73188 72379 71102 70451 70718 70378 68438 66330 65834 66503 66767 66347
55593F6347m10l13l70J06Q56O53m56j194j369j797k054j040L67J33j395j811o28
$$ 66347 65937 65624 65254 65360 66216 66869 66413 65219 63850 62053 59999 58959 59326 59459 58064 56253 55625
55576E5625J26l88o70OM00m2j66M92Q84P57J252K534L281L060K820K656J592r4
$$ 55625 55751 55363 54693 54699 55099 55057 54891 55383 56267 57024 58276 60810 64091 67151 69971 72627 74219 74125
55558G4125r02q12j300k402k546j658j531k591l110k243j050n0J498L288L856
$$ 74125 73223 72411 71111 68709 66163 64505 62974 60383 57273 55030 53980 53930 55428 58716 62572
55543F2572L360L579M650M726L474K746L114K913J692J322K503L343K717K039
$$ 62572 65932 69511 74161 78887 82361 85107 88221 91134 92826 94148 96651 99994 102711 104750
55529A04750K284K259J302Q17J481J631J45j565k078k118k630k980k694k683l312
$$ 104750 107034 109293 110595 111412 112893 114524 114669 113104 111026 108908 106278 103298 100604 97921 94609
55514I4609l396k538k215l149l872l324k652k934l343l023k645k640k102r29p46
$$ 94609 91213 88675 86460 83311 79439 76115 73463 70529 67186 64163 61518 58878 56776 55847 55101
55499E5101k157l260k563j241q24q06l65k91j222j870j085m2m16j871l124m035
$$ 55101 52944 49684 47121 45880 45056 44250 43885 43594 42372 40502 39417 39375 38959 37088 33964 29929
55483B9929m853m853l530j933j217r87n13k17n55o98K25J582K259K158J652P29
$$ 29929 25076 20223 16693 14760 13543 12556 12043 11826 11271 10573 10798 12380 14639 16797 18449 19178
55467A9178l25o73k51n2l43q9J063J864J438M87k18q40j192m51R41J095m53j794
$$ 19178 18853 18180 17929 17877 17534 17445 18508 20372 21810 22297 22079 21239 20047 19596 20537 21632 21179 19385
55449A9385j619r67q79n64N39J199N86K4O51J355Q26j13k02J2l79o12K54J217
$$ 19385 17766 16799 15920 15356 15895 17094 17680 17704 18355 19710 20536 20423 20221 20233 19854 19242 19496 20713
55431B0713Q75j66m06O1R2l90o23m75k17L35J127J322O27J34O16J273J261J020
$$ 20713 21588 21422 21016 21077 21169 20779 20156 19681 19464 19799 20926 22248 22875 23009 23625 24898 26159 27179
55413B7179R34K87j059j592l79J187J515J193J477J870J197n8m71P6N75N84L27
$$ 27179 28113 28400 27341 25749 25370 26557 28072 29265 30742 32612 33809 33751 33280 33356 33931 34515 34842
55396C4842j22n65m69j1j53q28o53N67R95k72j381o77N17J30j323j957j557j166
$$ 34842 34720 34155 33686 33675 33522 32694 32041 32608 33603 33331 31950 31273 31790 31920 30597 28640 27083 25917
55378B5917q39j14L08m17j420j320m49j8M1M59Q15L18m28l22L13N35O71J483K353
$$ 25917 25078 24964 25272 24855 23435 22115 21666 21648 21689 22148 22963 23281 22853 22531 22844 23379 24050 25533 27886
55359B7886K146J221O46K81o09j519j432p06m12m92k88p7l43l52O28J512Q68n55
$$ 27886 30032 31253 31899 32180 31571 30052 28620 27914 27502 27010 26722 26645 26302 25950 26578 28090 28958 28403
55341B8403q34J65Q94P04K62k08j080j920j803r21k71m2K40L92Pl22J74Q81O90
$$ 28403 27569 27734 28628 29332 29594 29386 28306 26386 24583 23662 23391 23349 23589 23981 23988 23666 23840 24721 25411
55322B5411r3l60j67l68q27p48l17k46k15M64J145P08l34n26R1K25k56j79P05
$$ 25411 25318 24958 24791 24423 23596 22848 22531 22285 22070 22534 23679 24387 24053 23527 23618 23843 23587 23408 24113
55303B4113J278R35K62k97r26j508j575j232r69p34l03r8m23m39N95J747J612
$$ 24113 25391 26326 26588 26291 25365 23857 22282 21050 20081 19347 19044 18946 18523 18084 18679 20426 22038
55286B2038N66J52O57J013P17J53n49j344j398j38J267J230J56l47j31l89j145
$$ 22038 22604 22756 23413 24426 25143 25296 24747 23403 22005 21867 23134 24364 24520 24173 24042 23653 22508
55269B2508j049K39J465J799J703J588J201N46N5k27m25j11Q75J438O35n48n47
$$ 22508 21459 21698 23163 24962 26665 28253 29454 30000 30055 29828 29403 29292 30167 31605 32240 31692 31145
55252C1145J86k8j205j759j232p33o65k69M54N24n2j38M35N73J0k62Pp9o19n35
$$ 31145 31331 31303 30098 28339 27107 26374 25709 25440 25894 26418 26366 26228 26663 27236 27246 26984 26991 26912 26293 25758
55232B5758L75Q69L29l14k85L0K78O76R75N17k60j00R00J230M49j57M9L0p53j110
$$ 25758 26133 27002 27331 27017 26732 26762 27040 27716 28691 29208 28948 28848 29748 30978 31427 31270 31319 31349 30596 29486
55212B9486k36P33N39j95k07L54M14j99p26o78k17K94N02K32k23l96k94k12M1
$$ 29486 29250 29983 30522 30327 30120 30474 30888 30689 29963 29285 29068 29362 29864 30096 29873 29477 29183 28971 29012
55193B9012Q52J823K083J591J154J096R99P00N28M91K56p4k14n03j270j760j099
$$ 29012 29864 31687 33770 35361 36515 37611 38610 39310 39838 40329 40585 40511 40297 39794 38524 36764 35665
55176C5665j2J5q71j132m14jm66q57n97l86n75m11M05R66P08K93K47R2m56p09
$$ 35665 35653 35668 34797 33665 33251 33250 32784 31927 31330 30944 30369 29958 30363 31329 32037 32330 32577 32669 32213 31504
55156C1504k49K38J28k02k29q8m4j2l6l23n86l09K00J69k68k21L43N29J43p3Q8
$$ 31504 31255 31493 31621 31419 31190 31102 31058 31046 31010 30687 30101 29792 29992 30161 29893 29672 30015 30544 30687 30614 30702
55135C0702L1k37j3O34R09Q91J367J933J282k75p25N70J777J436M26Q9K06P0q1
$$ 30702 30733 30496 30483 31117 32026 32917 34284 36217 37499 37224 36499 37069 38846 40282 40708 40797 41003 41073 40992
55116D0992M1p4o58r41n85m07q13q74j7Q12P26L41N22R56J050J037J198J152Q72
$$ 40992 41033 40959 40301 39360 38775 38368 37555 36681 36664 37476 38202 38543 39065 40021 41071 42108 43306 44458 45330
55097D5330J118J939K115J141L02O92J465J391Q54Q37J134R95O33O50Q62Q73R78
$$ 45330 46448 48387 50502 51643 51945 52637 54102 55493 56347 57184 58318 59313 59946 60596 61458 62331 63309
55080F3309J346J181l1j307j423o35k6J01J28J47J07K31M17Q6o15m81Q91K074
$$ 63309 64655 65836 65805 64498 63075 62440 62414 62515 62643 62790 62897 63128 63545 63631 63016 62535 63426 65500
55062F5500J711M22l80m79m14j49M52P79L74j00j06m08j633k688k224q67k66n20
$$ 65500 67211 67633 67253 66774 66360 66211 66663 67442 67816 67716 67610 67202 65569 62881 60657 59790 59524 59004
55044E9004m10K92N43r3q61j146j022n46K99R51P11j23n84l89o5Q9K66N17O94
$$ 59004 58594 58886 59429 59336 58475 57329 56307 55761 56060 57011 57722 57599 57015 56626 56561 56650 56916 57433 58127
55025E8127R00J216J296R30O43R08J242J030P01J022J619J420M00l35k25J6m38
$$ 58127 59027 60243 61539 62469 63112 64020 65262 66292 66993 68015 69634 71054 71454 71119 70894 70910 70472
55008G0472j439k216k288j848j508j630j843j516q13n42q21p12K70J262J349R34
$$ 70472 69033 66817 64529 62681 61173 59543 57700 56184 55371 54829 54008 53296 53566 54828 56177 57111
54992E7111R25J267J251O96k7o47q62k02J183K156J885R62M28L69K85K27M82Q04
$$ 57111 58036 59303 60554 61250 61223 60576 59714 59512 60695 62851 64736 65698 66126 66495 66780 67007 67489 68293
54974F8293R03J161J850K225J552N23M72J516K584L017L108L241L488L919M580
$$ 68293 69196 70357 72207 74432 75984 76507 76979 78495 81079 84096 87204 90445 93933 97852 102432
54959A02432N289O072P408R396J1229J2294J3138J4465J5805J6194J5579J4475
$$ 102432 107721 113793 121201 130597 141826 154120 167258 181723 197528 213722 229301 243776
54947B43776J2683R543N135J63m996j0067j4134j6288j6797j6636j6036j4551
$$ 243776 256459 266002 271137 271300 266304 256237 242103 225815 209018 192382 176346 161795
54935A61795j2317j0200q752p915p534p310o576n051l516k792k415j314N01J961
$$ 161795 149478 139278 130526 122611 115077 107767 101191 96140 92624 89832 87417 86103 86604 88565
54921H8565K473K366K044J763K075L473N532P260Q275Q914R469J0110J1300J3293
$$ 88565 91038 93404 95448 97211 99286 102759 108291 115551 123826 132740 142209 152319 163619 176912
54907A76912J5382J6452J6046J4257J1021O441J349l407p874j2203j5570j6997
$$ 176912 192294 208746 224792 239049 250070 256511 257860 254453 246579 234376 218806 201809
54895B01809j6891j6396j5627j3844j1197q850p417o511n790n292m695l551k270
$$ 201809 184918 168522 152895 139051 127854 119004 111587 105076 99286 93994 89299 85748 83478
54882H3478j716j797j609r66n27m46j73K40Pq93j391r33l08l62q93j277j320j037
$$ 83478 81762 79965 78356 77390 76863 76417 76244 76484 76491 75598 74207 73274 72966 72604 71711 70434 69114 68077
54864F8077m47N1j79j117k069k641k992k990k130n67O43Q09L05k71q94j623k121
$$ 68077 67630 67681 67502 66385 64316 61675 58683 55693 53563 52996 53639 54448 54753 54482 53588 51965 49844
54847D9844k047j439m84M60O64l22j638j768n23O08N58J00M67J485K067J930J764
$$ 49844 47797 46358 45874 46334 46998 46676 45038 43270 42747 43355 43913 44013 44480 45965 48032 49962 51726
54830E1726J893J814J202N65N52R91J180R21Q28J313J735J151k04j002n73K17
$$ 51726 53619 55433 56635 57200 57752 58743 59923 60844 61672 62985 64720 65871 65667 64665 64092 64309
54814F4309M35N79J745L692M876M377K990K236K873M514O242P436Q292R493J1222
$$ 64309 64744 65323 67068 70760 75636 80013 83003 85239 88112 92626 98868 106304 114596 124089 135311
54799A35311J2796J3634J4129J5072J6486J7508J7119J4647J0112M569l88m085
$$ 135311 148107 161741 175870 190942 207428 224936 242055 256702 266814 271383 270995 266910
54787B66910p284j0642j3441j4628j4348j3444j2069j0037q017o976o720o219
$$ 266910 259626 248984 235543 220915 206567 193123 181054 171017 163000 156024 149304 143085
54775A43085n265m501l963k971j553o07m44l06K80Q18R14J006J628K696L926N266
$$ 143085 137820 133319 129356 126385 124832 124225 123781 123475 123755 124573 125487 126493 128121 130817 134743 140009
54759A40009O591P686Q738J0287J2432J4691J6611J7929J8148J6746J3953J0585
$$ 140009 146600 154286 163024 173311 185743 200434 217045 234974 253122 269868 283821 294406
54747B94406P057L191r95n078q873j2512j5755j7885j8472j7636j5722j3240j1049
$$ 294406 301463 304654 303659 298581 289708 277196 261441 243556 225084 207448 191726 178486 167437
54734A67437r801r220q560p632o736n895m943m172l978m049l763l200k818k432
$$ 167437 157636 148416 139856 132224 125488 119593 114650 110478 106500 102451 98688 95488 92670 90238
54720I0238j529l50L82O47Q95Q97J24r47j305j115j435k199k099p72M82O64L20
$$ 90238 88709 88359 88741 89388 90283 91180 91304 90357 89052 87937 86502 84303 82204 81432 81914 82578 82898
54703H2898K74M89Q03J454K179J922L66j266j722j141l42L87J024J230Q36K86
$$ 82898 83172 83661 84464 85918 88097 90019 90385 89119 87397 86256 85914 86301 87325 88555 89391 89677
54687H9677n3l82p76p28j3P38Q93O90O56P69P36N98N56O52R64J625K413K810K740
$$ 89677 89624 89242 88466 87738 87725 88463 89356 90046 90702 91471 92207 92805 93361 94013 94977 96602 99015 101825 104565
54668A04565K608K520K239K053K674L989M836M600M093M230M669M530L832L351
$$ 104565 107173 109693 111932 113985 116659 120648 125484 130084 134177 138407 143076 147606 151438 154789
54654A54789L419L531L043J894P21L09P69J293J158P20Q46J648K580L498M683
$$ 154789 158208 161739 164782 166676 167397 167706 168475 169768 170926 171646 172492 174140 176720 180218 184901
54639A84901N889O464O435O335N963M468J899o42k592m484o629q495r763j0684
$$ 184901 190790 197254 203689 210024 215987 220455 222354 221712 219120 214636 208007 199512 189749 179065
54625A79065j0952r635o974m889m761n738o132n465m278k913j512n38k42j22L96
$$ 179065 168113 158478 151504 146615 141854 136116 129984 124519 120241 117328 115816 115278 115036 114914 115310
54610A15310J173J825K324K667K564J998J476J285J148Q82O85M39l05j382j998
$$ 115310 116483 118308 120632 123299 125863 127861 129337 130622 131770 132652 133337 133776 133471 132089 130091
54595A30091k044k254k741k697k078k149l450m604m243l008k419k715l010k859
$$ 130091 128047 125793 123052 120355 118277 116128 112678 108074 103831 100823 98404 95689 92679 89820
54581H9820k465j972j511j487j947k214j844j306j091r43n98m09m81k56L22L46
$$ 89820 87355 85383 83872 82385 80438 78224 76380 75074 73983 73040 72442 72033 71552 71296 71618 71964
54565G1964m34p84J10J087P25m64j029q18o40m79K10J009J073P76J130J828J535
$$ 71964 71530 70746 70856 71943 72668 72204 71175 70357 69717 69238 69448 70457 71530 72306 73436 75264 76799
54548G6799J33r36p80r9J84J17J66M17O83P80N25J0j91L10J114J708K362L499
$$ 76799 76932 75996 75216 75117 75301 75418 75584 76001 76684 77464 77989 77999 77808 78118 79232 80940 83302 86801
54530H6801M581M642L745K856K435K117J711J408J041O2j496k871l520l586l352
$$ 86801 91382 96024 99769 102625 105060 107177 108888 110296 111337 111399 109903 107032 103512 99926 96574
54515I6574k916k488k359k503k663k762k801k495j590m01M75Q09P44L08m13r57
$$ 96574 93658 91170 88811 86308 83645 80883 78082 75587 73997 73596 74071 74880 75624 75932 75519 74562
54499G4562r00m05P9M10N93M82J49R9N33Q95P44N15P14R45O25J54L54J154J756
$$ 74562 73662 73257 73336 73746 74339 74821 74970 75069 75602 76497 77241 77756 78470 79415 80040 80194 80548 81702 83458
54480H3458J834J641J183L57l29j26Q82J837K206K045J433N08j36P6Q15J158P54
$$ 83458 85292 86933 88116 88473 88144 88018 88900 90737 92943 94988 96421 96929 96793 96869 97684 98842 99596
54463I9596Lo37r21o10J67O43K34o02j038j120j434j889j884j469j329j587j578
$$ 99596 99599 98962 98041 97431 97598 98241 98475 97873 96835 95715 94281 92392 90508 89039 87710 86123 84545
54446H4545r69j99K48L32J21l34p36p51n24m72o18o95p10q51r84q24m13LL84O38
$$ 84545 83576 83377 83625 83957 84078 83744 83008 82257 81733 81261 80643 79948 79238 78387 77403 76579 76166 76169 76553 77191
54426G7191M13l16q34n66J11N65Q90J353J526R62K35K13O77P90N29N41Q54R55
$$ 77191 77604 77288 76454 75888 75999 76564 77454 78807 80333 81295 81530 81743 82420 83210 83739 84280 85134 86089
54408H6089R06J192J620J569J284J559K287K529K187K207K930L493L272K836K938
$$ 86089 86995 88187 89807 91376 92660 94219 96506 99035 101222 103429 106359 109852 113124 115960 118898
54393A18898L497L991M195M119L750L122K293J204rq49j118j379k066k608k380
$$ 118898 122395 126386 130581 134700 138450 141572 143865 145069 145060 144211 143093 141714 139648 137040 134660
54378A34660j947k271l087l390l191l326l734l480k591k221k732l044k354j209
$$ 134660 132713 130442 127355 123965 120774 117448 113714 110234 107643 105422 102690 99646 97292 96083
54364I6083l95L1J59k10q82j220j094r96r18l06O36Q40P0n07o5P65J138J229J466
$$ 96083 95688 95719 95878 95668 94786 93566 92472 91476 90558 90252 90888 91728 91798 91291 91226 91991 93129 94358 95824
54345I5824J593J338J177J552K098K406K816L743M783N278N187M823M204L265
$$ 95824 97417 98755 99932 101484 103582 105988 108804 112547 117330 122608 127795 132618 136822 140087
54331A40087K204J179M9j181k213l056m039m983n113m293l499l525l931l935l586
$$ 140087 142291 143470 143519 142338 140125 137069 133030 128047 122934 118641 115142 111617 107686 103751 100165
54316A00165l371l249k858k296k049k310k825l155k850j771n24p2o68j573k011
$$ 100165 96794 93545 90687 88391 86342 84032 81207 78052 75202 73431 72907 72835 72167 70594 68583
54301F8583j845j233l71K32M4o01p20j38J68l86j078j072p31q54j366j619j445
$$ 68583 66738 65505 65134 65366 65410 64809 64089 63951 64119 63733 62655 61583 60852 59998 58632 57013 55568
54284E5568j097n50K69R35J002Q01J049J738K068J498L82m29m05L06J106J535
$$ 55568 54471 53921 54190 55125 56127 56928 57977 59715 61783 63281 63663 63234 62829 63135 64241 65776
54268F5776J653J758J870J858J829J876J614O27o39j194q14k59p5q0r2l18o42
$$ 65776 67429 69187 71057 72915 74744 76620 78234 78861 78222 77028 76214 75955 75880 75800 75708 75390 74748
54251G4748m86J83O11M40K76N41O23n1r35j099n28J21M98O04L00m35j030q70r9
$$ 74748 74262 74445 75056 75496 75772 76313 76936 76885 75950 74851 74323 74444 74942 75546 75846 75411 74381 73511 73412
54232G3412N54O05J01o49j224j283r26o41o25n57k10J74L73N29O87N85K35Q3K66
$$ 73412 73966 74571 74672 74023 72799 71516 70590 69949 69324 68767 68557 68731 69104 69633 70320 70905 71140 71223 71489
54213G1489K81j56n39l21K53N76M99J92l12r78j541j797j846j716j198l65L07
$$ 71489 71770 71614 71075 70754 71007 71583 72082 72274 71962 70984 69443 67646 65800 64084 62886 62521 62828
54196F2828N45N93O09L91l8l05m09q30j464j401l19P16O74Nk09J17K41J0J7M39
$$ 62828 63373 63966 64575 64966 64928 64623 64214 63384 61920 60519 60200 60916 61590 61595 61386 61503 61744 61754 61771 62210
54176F2210P54O09K98K31L90M68K29l06r05j333j583j741j713j366q56l88J64
$$ 62210 62964 63573 63871 64102 64492 64960 65189 64883 63978 62645 61062 59321 57608 56242 55386 54998 55162
54159E5162Q63J115K92j077j674j039J8P58J194J295P11k38n55q1R6n28r22j76
$$ 55162 56025 57140 57432 56355 54681 53642 53660 54418 55612 56907 57618 57380 56825 56744 56840 56312 55390 55214
54141E5214J022J582J597J664J564Q72O4k38m16j020j472r26R4L82o7k32R3P6
$$ 55214 56236 57818 59415 61079 62643 63515 63579 63341 62925 61905 60433 59507 59601 59983 59916 59684 59777 59853
54123E9853o22j315j444j146o12J35P56Q01M62L27L94K20q5L7M54L68l57q43m59
$$ 59853 59231 57916 56472 55326 54714 54849 55605 56406 56868 57195 57589 57809 57724 57761 58215 58583 58226 57383 56924
54104E6924L07O36L59j44n39p32p92r07j138j221q53j63M15O27M84P1m07n37j11
$$ 56924 57231 57867 58226 58082 57543 56811 56019 55112 53974 52753 51900 51737 52152 52779 53263 53334 52927 52390 52279
54085E2279N77J068J218J040M76l16q27p34k68K41P56J126R47K86o6K97P58O83
$$ 52279 52856 53924 55142 56182 56658 56342 55515 54781 54513 54754 55510 56636 57583 57869 57803 58100 58858 59541
54067E9541L74K86R4m50o03K86J361J369O63O26J343J483N57k71o6N77P48N95
$$ 59541 59915 60201 60295 59845 59242 59528 60889 62258 62921 63547 64890 66373 66930 66659 66593 67170 67918 68513
54049F8513P90J368J834J891J598J139Q30R67J402J662J611J587J751J809J575
$$ 68513 69303 70671 72505 74396 75994 77133 77963 78930 80332 81994 83605 85192 86943 88752 90327
54034I0327J447K028L422N028N902N577M635M205M619N022M707M173M231M659
$$ 90327 91774 93802 97224 102252 108154 113731 118366 122571 127190 132212 136919 141092 145323 149982
54020A49982M642M140L758L559L084K454K317K662K739K352K144K305K117J131
$$ 149982 154624 158764 162522 166081 169165 171619 173936 176598 179337 181689 183833 186138 188255 189386
54006A89386o3p85j130j452j693j757j861k050j946j487j256j533j626r18l2j42
$$ 189386 189323 188538 187408 185956 184263 182506 180645 178595 176649 175162 173906 172373 170747 169829 169797 169655
53990A69655j332k455k642k194j857j851k004k342k964l543l569l169l108l641
$$ 169655 168323 165868 163226 161032 159175 157324 155320 152978 150014 146471 142902 139733 136625 132984
53976A32984l874k943j428p80j377k137k149j754j485j004P6J059R29r5p58m57
$$ 132984 129110 126167 124739 123959 122582 120445 118296 116542 115057 114053 114129 115188 116117 116022 115264 114807
53960A14807J39J91l12p22m31O45J947K702K737K641K832K952K594K168K317K947
$$ 114807 114946 115137 114825 114103 113672 114317 116264 118966 121703 124344 127176 130128 132722 134890 137207 140154
53944A40154L513M001M736N604O229O821P926R390J0372J0439R913R136P989O247
$$ 140154 143667 147668 152404 158008 164237 171058 178984 188374 198746 209185 219098 228234 236223 242470
53930B42470L845Q55k347m922o195o356o158n979n728n332m766l827k410r15K25
$$ 242470 246315 247170 244823 239901 233706 227350 221192 215213 209485 204153 199387 195560 193150 192235 192460
53915A92460J115K006K692K957L199L868M642M984N105N543O097O150N807N680
$$ 192460 193575 195581 198273 201230 204429 208297 212939 217923 223028 228571 234668 240818 246625 252305
53901B52305N761N503M809L956K759Q49j238k445k658k738l054l086k589k086
$$ 252305 258066 263569 268378 272334 275093 275942 274704 272259 269601 266863 263809 260723 258134 256048
53887B56048k004k246k798l826n003n602n485n206n107n133n400o019o418n942
$$ 256048 254044 251798 249000 245174 240171 234569 229084 223878 218771 213638 208238 202219 195801 189859
53873A89859n040m719m841m330l169k709l568m570m405l232k075j602k046l313
$$ 189859 184819 180100 175259 170929 167760 165051 161483 156913 152508 149276 147201 145599 143553 140240
53859A40240m620m931m242l600l496l211k218j111o16o26q63j449k209k394j823
$$ 140240 135620 130689 126447 122847 119351 116140 113922 112811 112195 111569 110706 109257 107048 104654 102831
53844A02831j429j869k451k232j408q08o30n13k71J02O66J220J256P24K75L00
$$ 102831 101402 99533 97082 94850 93442 92634 92004 91491 91220 91322 91988 93208 94464 95188 95463 95763
53828I5763M08K75K83O87R85P44L31J91L7n48j295j748j905j839j314m04K25L11
$$ 95763 96171 96446 96729 97416 98401 99145 99476 99667 99704 99156 97861 96113 94208 92369 91055 90651 90876 91187
53810I1187N34J304J846J351M24L17J223K273K829K912K635K172K052K672L622
$$ 91187 91721 93025 94871 96222 96646 96963 98186 100459 103288 106200 108835 111007 113059 115731 119353
53795A19353M165M282M513N009N319N085M404L636L200L321L671L507K611J645
$$ 119353 123518 127800 132313 137322 142641 147726 152130 155766 158966 162287 165958 169465 172076 173721
53781A73721J282J380J427J347J271J043N13o4m69r37j710k511l001l283l472
$$ 173721 175003 176383 177810 179157 180428 181471 181984 181920 181451 180514 178804 176293 173292 170009 166537
53766A66537l230k404j604j536k087k705l211l583l370k177n47M74N81L41K06
$$ 166537 163307 160903 159299 157763 155676 152971 149760 146177 142807 140630 140083 140557 141138 141479 141685
53751A41685K9l60p39q34p14o71q38r84p80l52m46j574l073l670l021k012j386
$$ 141685 141714 141354 140615 139781 139067 138396 137558 136574 135794 135442 134996 133422 130349 126679 123658 121646 120260
53734A20260r23l18L0k45o93o08R4J121K336L469L946L620L174L215L529L755
$$ 120260 119337 119019 119049 118804 118111 117503 117597 118718 121054 124523 128469 132089 135263 138478 142007 145762
53718A45762M105M715M944M170K782J563O03l70j091j159r44j160j778k174k156
$$ 145762 149867 154582 159526 163696 166478 168041 168644 168274 167183 166024 165080 163920 162142 159968 157812
53703A57812k033j920j707j495j324q06K93J392J827J941K517L358L396K191M74
$$ 157812 155779 153859 152152 150657 149333 148527 148820 150212 152039 153980 156497 159855 163251 165442 165916
53688A65916p98j208p37L37J392J897K010K227K536K553K308K243K421K438K150
$$ 165916 165118 163910 163173 163510 164902 166799 168809 171036 173572 176125 178433 180676 183097 185535 187685
53673A87685J875J814J777J597J426J497J849K303K529K294J825J602J634J434
$$ 187685 189560 191374 193151 194748 196174 197671 199520 201823 204352 206646 208471 210073 211707 213141
53659B13141R12O70R88J132L74q59j642j853k062k478k827l044l241l226k743
$$ 213141 214053 214723 215711 216843 217217 216358 214716 212863 210801 208323 205496 202452 199211 195985 193242
53644A93242k080j764j824j945k026k048j785j312j310k060k559j671K01J563
$$ 193242 191162 189398 187574 185629 183603 181555 179770 178458 177148 175088 172529 170858 171059 172622
53630A72622J699J083K53o45j184p71M12J500K077K383K444K009J429J519K246
$$ 172622 174321 175404 175657 175012 173828 173057 173469 174969 177046 179429 181873 183882 185311 186830 189076
53615A89076K559J943J234J389K197K786K798K566K441K491K636K780K929L208
$$ 189076 191635 193578 194812 196201 198398 201184 203982 206548 208989 211480 214116 216896 219825 223033
53601B23033L638L941L859L567L418L424L378L364L636M109M434M532M578M558
$$ 223033 226671 230612 234471 238038 241456 244880 248258 251622 255258 259367 263801 268333 272911 277469
53587B77469M297L801L222K618K131K059K297K183J471R91J522K423K415J458
$$ 277469 281766 285567 288789 291407 293538 295597 297894 300077 301548 302539 304061 306484 308899 310357
53573C10357P61R77J478J536J241J003R42J103J522J874J625P63o3k85J80J169
$$ 310357 311118 312095 313573 315109 316350 317353 318295 319398 320920 322794 324419 325182 325119 324834 325014 326183
53557C26183K290K857K499J877J994K773L106K379J262P98J381K763M381N545
$$ 326183 328473 331330 333829 335706 337700 340473 343579 345958 347220 348018 349399 352162 356543 362088
53543C62088N903N780N667N462M879M309M342M673M445L736L483L848L833K884
$$ 362088 367991 373771 379438 384900 389779 394088 398430 403103 407548 411284 414767 418615 422448 425332
53529D25332J836J699K412L350M218M911N213N204N382N873O132N923N899O606
$$ 425332 427168 428867 431279 434629 438847 443758 448971 454175 459557 465430 471562 477485 483384 489990
53515D89990P532P850P698P991R128J0528J1381J1532J1555J2185J3626J5398
$$ 489990 497522 505372 513070 521061 530189 540717 552098 563630 575185 587370 600996 616394
53503F16394J6963J8257J9419K0305K0785K1243K2168K3328K4123K4597K5346
$$ 616394 633357 651614 671033 691338 712123 733366 755534 778862 802985 827582 852928
53492H52928K6424K7198K7414K7493K7630K7446K6834K6262K5897K5238K4063
$$ 852928 879352 906550 933964 961457 989087 1016533 1043367 1069629 1095526 1120764 1144827
53481A144827K2966K2483K2365K2214K2173K2432K2593K2204K1492K1048K1025
$$ 1144827 1167793 1190276 1212641 1234855 1257028 1279460 1302053 1324257 1345749 1366797 1387822
53470A387822K1046K0672J9692J8241J6811J5812J5100J4263J3270J2284J0928
$$ 1387822 1408868 1429540 1449232 1467473 1484284 1500096 1515196 1529459 1542729 1555013 1565941
53459A565941Q614N665L167J553J59j520l158m584o422r025j1681j3597j4953
$$ 1565941 1574555 1580220 1583387 1584940 1585099 1583579 1580421 1575837 1569415 1560390 1548709 1535112 1520159
53446A520159j6290j7492j8254j8958k0208k1844k3198k4052k4613k4883k4777
$$ 1520159 1503869 1486377 1468123 1449165 1428957 1407113 1383915 1359863 1335250 1310367 1285590
53435A285590k4622k4843k5264k5339k4985k4607k4416k4180k3604k2514k0835
$$ 1285590 1260968 1236125 1210861 1185522 1160537 1135930 1111514 1087334 1063730 1041216 1020381
53424A020381j8783j6911j5539j4247j2375r961p805o629o432o587o280n035l061
$$ 1020381 1001598 984687 969148 954901 942526 932565 924760 918131 911699 905112 898832 893797 890736
53411H90736j114K39J164K287M036O277Q466J0085J1137J2251J4013J6223J8135
$$ 890736 889622 889861 891025 893312 897348 903625 912091 922176 933313 945564 959577 975800 993935
53398I93935J9412K0423K1555K2765K4001K5489K7339K9295L1178L3213L5585
$$ 993935 1013347 1033770 1055325 1078090 1102091 1127580 1154919 1184214 1215392 1248605 1284190
53387A284190L7962L9830M1062M1955M2838M3882M5136M6531M7912M9079M9837
$$ 1284190 1322152 1361982 1403044 1444999 1487837 1531719 1576855 1623386 1671298 1720377 1770214
53376A770214N0146N0334N0807N1325N1027M9623M7998M6997M6136M4490M2309
$$ 1770214 1820360 1870694 1921501 1972826 2023853 2073476 2121474 2168471 2214607 2259097 2301406
53365B301406M0552L9036L6576L2964K9271K5821K1494J5730R869N365J789k254
$$ 2301406 2341958 2380994 2417570 2450534 2479805 2505626 2527120 2542850 2552719 2558084 2559873 2557619
53353B557619p063j1915j6527k1179k5641k9149l1465l3174l4921l6928l9206
$$ 2557619 2550556 2538641 2522114 2500935 2475294 2446145 2414680 2381506 2346585 2309657 2270451
53342B270451m1680m4067m6070m7607m8641m8988m8519m7291m5359m2856m0488
$$ 2270451 2228771 2184704 2138634 2091027 2042386 1993398 1944879 1897588 1852229 1809373 1768885
53331A768885l9339l9787m0932m1540m1145m0031l8623l7218l5900l4378l2285
$$ 1768885 1729546 1689759 1648827 1607287 1566142 1526111 1487488 1450270 1414370 1379992 1347707
53320A347707k9842k7721k6066k4288k2127k0099j8543j7009j5159j3514j2682
$$ 1347707 1317865 1290144 1264078 1239790 1217663 1197564 1179021 1162012 1146853 1133339 1120657
53309A120657j2458j2337j2298j2434j2307j1395r740p687n378l037j181J4J049
$$ 1120657 1108199 1095862 1083564 1071130 1058823 1047428 1037688 1030001 1024623 1021586 1020405 1020419 1021468
53296A021468K320L588M709O165Q202J0123J1206J1709J2276J3014J3921J5510
$$ 1021468 1023788 1027376 1032085 1038250 1046452 1056575 1067781 1079490 1091766 1104780 1118701 1134211
53284A134211J8002K0462K1871K2601K3799K5644K7280K8261K9014K9818L0325
$$ 1134211 1152213 1172675 1194546 1217147 1240946 1266590 1293870 1322131 1351145 1380963 1411288
53273A411288L0139K9250K7796K5942K3938K1866J9560J7142J5209J3931J2452
$$ 1411288 1441427 1470677 1498473 1524415 1548353 1570219 1589779 1606921 1622130 1636061 1648513
53262A648513R884O510L271M66k168m509o059o845p496q546j0184j2396j4733
$$ 1648513 1658397 1664907 1668178 1668644 1666476 1661967 1655908 1649063 1641567 1633021 1622837 1610441 1595708
53249A595708j6356j7012j7629j9185k1370k3141k4192k4951k5508k5542k5102
$$ 1595708 1579352 1562340 1544711 1525526 1504156 1481015 1456823 1431872 1406364 1380822 1355720
53238A355720k4509k3709k2567k1549k1143k0844j9792j8291j7568j8008j8643
$$ 1355720 1331211 1307502 1284935 1263386 1242243 1221399 1201607 1183316 1165748 1147740 1129097
53227A129097j8461j7381j5852j4397j3596j3674j4034j3838j3064j2227j1269
$$ 1129097 1110636 1093255 1077403 1063006 1049410 1035736 1021702 1007864 994800 982573 971304
53216I71304r674p609o012n370n311n384n489n466n155m952n446o476p416q240
$$ 971304 961630 954021 948009 942639 937328 931944 926455 920989 915834 910882 905436 898960 891544 883304
53202H83304r382j0543j0876j0459j0462j1431j2533j2871j2582j2146j1600j1030
$$ 883304 873922 863379 852503 842044 831582 820151 807618 794747 782165 770019 758419 747389
53190G47389j0943j1502j2062j2113j2067j2525j3363j4047j4446j4743j4986
$$ 747389 736446 724944 712882 700769 688702 676177 662814 648767 634321 619578 604592
53179F04592j5175j5469j5883j6023j5504j4406j3211j2452j2442j2967j3307
$$ 604592 589417 573948 558065 542042 526538 512132 498921 486469 474027 461060 447753
53168D47753j2971j2371j2175j2182j1549j0176q990q688q950r142r062q699p974
$$ 447753 434782 422411 410236 398054 386505 376329 367339 358651 349701 340559 331497 322798 314824
53155C14824p111o592o396n949n105m528m674n063n022m580m106l613k997k497
$$ 314824 307713 301121 294725 288776 283671 279143 274469 269406 264384 259804 255698 252085 249088 246591
53141B46591k395k472k254j579o27L76J171J475J256Q36N99P56J373K229K732
$$ 246591 244196 241724 239470 237891 237264 237640 238811 240286 241542 242378 242977 243733 245106 247335 250067
53126B50067K430J651J149J095R74M98j07p22j565k563l268l646m192n014n510
$$ 250067 252497 254148 255297 256392 257366 257864 257757 257035 255470 252907 249639 245993 241801 236787 231277
53111B31277n338m958m804m646m250l977m184m559m665m569m442m012l085k154
$$ 231277 225939 220981 216177 211531 207281 203304 199120 194561 189896 185327 180885 176873 173788 171634
53097A71634j879k257k760k963k718k061j384j233j554j649j220r02j198j603
$$ 171634 169755 167498 164738 161775 159057 156996 155612 154379 152825 151176 149956 149054 147856 146253
53083A46253j387p73n10o74p25m84k63j87j44k63p58j345j474j107o82l82j05
$$ 146253 144866 144093 143583 142909 142184 141700 141437 141250 141106 140843 140085 138740 137266 136159 135477 135095 134990
53066A34990o1o35j562j954j402m97mO2J37L12K35l29j111j556j322o55k33n40
$$ 134990 134929 134294 132732 130778 129376 128879 128875 128937 129074 129386 129621 129292 128181 126625 125303 124648 124415 123875
53048A23875j327j816j446l84O77J102P41ln02m52o6K49L79N15P84J027Q81J52
$$ 123875 122548 120732 119286 118902 119579 120681 121422 121419 120917 120465 120399 120648 121027 121542 122326 123353 124234 124386
53030A24386r15j633j400l45O54P74M1q28j198j001n21n5J97J81R5K35O15Q53
$$ 124386 123471 121838 120438 120093 120747 121521 121562 120734 119536 118535 118014 117959 118156 118337 118432 118667 119282 120135
53012A20135O95M63O55J113J086L33l62k18L46K83n14j030o29J57N96P40Q89Q26
$$ 120135 120830 121293 121948 123061 124147 124480 124118 123900 124246 124529 124015 122985 122356 122513 123109 123849 124738 125564
52994A25564L46rM12J319J888J970K081K357K441K407K881M007N045N349N106
$$ 125564 125910 125901 126313 127632 129520 131490 133571 135928 138369 140776 143657 147664 152709 158058 163164
52979A63164M857M734M544M181L597K666J373Rj008j452j469j510j939k554k748
$$ 163164 168021 172755 177299 181480 185077 187743 189116 189125 188117 186665 185196 183686 181747 179193 176445
52964A76445k344j884j853k011j987k028k486l005k957k409j858j339p23n23j281
$$ 176445 174101 172217 170364 168353 166366 164338 161852 158847 155890 153481 151623 150284 149561 149038 147757
52949A47757k315k261j028N4J72l3K03O36P67O77M94p3r74j394p77L08R71J089
$$ 147757 145442 143181 142153 142207 142379 142346 142549 143185 143952 144629 145123 145050 144076 142682 141905 142213 143184 144273
52931A44273J022Q61N94M75O30P01M20J76M31R49J088N76l27j168j473j020j79
$$ 144273 145295 146156 146750 147225 147855 148556 148976 149152 149583 150532 151620 152196 151869 150701 149228 148208 148029
52914A48029L52L74K79K76J64QK69R48J360J191R62J108J291J123P90M99Q0l66
$$ 148029 148381 148755 149034 149310 149474 149482 149751 150699 152059 153250 154212 155320 156611 157734 158524 159023 159103 158737
52896A58737k38N04R98Q20P80J492K107J615N61K92R14J386J229R55Q58O38K07
$$ 158737 158499 159003 160001 160821 161601 163093 165200 166815 167376 167668 168582 169968 171197 172152 173010 173648 173855
52879A73855n6k7rj14j64j90l55m39q8N11Q52R15J057J261J286J469K415L853
$$ 173855 173799 173772 173763 173649 173485 173295 172940 172501 172413 172924 173776 174691 175748 177009 178295 179764 182179 186032
52861A86032M688M434L791L522L442K949K045J276J013J156J414J516J231M17
$$ 186032 190720 195154 198945 202467 205909 208858 210903 212179 213192 214348 215762 217278 218509 218926
52847B18926q18k037k687k539j946j421j038n58p6ll22m88l49m78j211j998k313
$$ 218926 218108 216071 213384 210845 208899 207478 206440 205882 205806 205803 205481 204993 204644 204166 202955 200957 198644
52830A98644k564l329m251m449l757k757j835j001l78j26m5Q6l4p41j595j930
$$ 198644 196080 192751 188500 184051 180294 177537 175702 174701 174323 174197 174152 174238 174204 173463 171868 169938
52814A69938j932k331l074l280k624j838j611j754j755j485j033m26J65L73J11
$$ 169938 168006 165675 162601 159321 156697 154859 153248 151494 149739 148254 147221 146795 146960 147333 147444
52799A47444l27p60j265j755j820j353q41q17j281j807j993j701j128o96o32o59
$$ 147444 147117 146357 145092 143337 141517 140164 139323 138506 137225 135418 133425 131724 130596 129900 129268 128609
52783A28609m36j50k53o50p46l84j22m08r24j185j272j567k007k062j448m94K62
$$ 128609 128173 128023 127770 127120 126374 125990 125868 125460 124536 123351 122079 120512 118505 116443 114995 114501 114763
52766A14763O23P35O66J99p98j939k531k292j640j186j161j406j719j980k154
$$ 114763 115386 116121 116787 116986 116188 114249 111718 109426 107786 106600 105439 104033 102314 100334 98180
52751I8180k322k573k710k366j551q24p15j166j675j799j401p08k57l97p56n94
$$ 98180 95858 93285 90575 88209 86658 85834 85119 83953 82278 80479 79078 78370 78113 77716 76960 76366
52735G6366J83Q99J142J301J686J837J216J83m02k29L15P45P78L73q4K7P79J421
$$ 76366 76549 77448 78590 79891 81577 83414 84630 84813 84411 84182 84497 85242 86020 86393 86309 86336 87115 88536
52717H8536J345Q85P52J116J716K417L064L245K869K517K653K863K537J802J107
$$ 88536 89881 90766 91518 92634 94350 96767 99831 103076 105945 108462 111115 113978 116515 118317 119424
52702A19424L40q19k013k570k436k042j528r08n61q35j410j894k595l799m718
$$ 119424 119764 118945 116932 114362 111926 109884 108356 107448 106887 106052 104642 102748 100153 96354 91636
52687I1636m281k686j101o5O54Q34j04j727k573j965q17l05n69j053j346j397
$$ 91636 87355 84669 83568 83503 84157 84991 84887 83160 80587 78622 77805 77500 76931 75878 74532 73135
52671G3135j413j740k288k258j160J47M00k26m08L51J153J298J111R26M88j60
$$ 73135 71722 69982 67694 65436 64276 64423 64823 64597 64189 64540 65693 66991 68102 69028 69516 69356
52655F9356l57J1J27m47j005q67l89j42N4M85P01J88o94j158j031p06m01m4L80
$$ 69356 68999 69010 69137 68690 67685 66818 66429 66287 66341 66826 67527 67715 67021 65863 64832 64126 63725 63681 64061
52636F4061P50Q87O01jk29M98J636J949J129J65j33p0j06m7K26J79m24q04l07
$$ 64061 64811 65698 66299 66298 66069 66567 68203 70152 71281 71446 71313 71243 71137 71090 71316 71495 71071 70267 69960
52617F9960M71N71J29l1J96K21j32m51n85p11o62k3R82J460J004L05L14J098J832
$$ 69960 70431 71002 71131 71100 71296 71517 71385 70934 70349 69638 68976 68953 69935 71395 72399 72704 73018 74116 75948
52598G5948J828J275R10J018J049M40m85q41l89J98L34K32L79P96J160J268J090
$$ 75948 77776 79051 79961 80979 82028 82468 81983 81142 80753 80951 81285 81517 81896 82692 83852 85120 86210
52581H6210O49R4l21m64l57J1N91J062J215J371J893K374K080J162N45N49N91
$$ 86210 86859 86953 86632 86168 85811 85822 86413 87475 88690 90061 91954 94328 96408 97570 98115 98664 99255
52564I9255M08N08J045J308R39O59J087J665J658J391J570K009K010J572J282
$$ 99255 99663 100171 101216 102524 103463 104122 105209 106874 108532 109923 111493 113502 115512 117084 118366
52549A18366J319J429J589J880J924J295L36j49L9M25O90Q89R76P52L66K38M80
$$ 118366 119685 121114 122703 124583 126507 127802 128138 127989 128028 128453 129143 130032 131008 131760 132126 132364 132844
52532A32844Q43J137J352J433J336J235J245J129O57P5j90j42q2j11j38k51n27
$$ 132844 133687 134824 136176 137609 138945 140180 141425 142554 143211 143286 143096 142954 142872 142761 142623 142372 141845
52515A41845p14m87K4M02M86M01K39J40M61J287K002J862R69J16k39l40m55n01
$$ 141845 141131 140644 140668 141070 141556 141957 142196 142336 142797 144084 146086 147948 148917 149033 148794 148454 147999 147498
52497A47498m22n08r81j574j789j417p47k99l65p49r51o73q7M29O71P02P53J079
$$ 147498 147076 146568 145587 144013 142224 140807 140060 139761 139396 138647 137696 137023 136936 137365 138036 138738 139491 140570
52479A40570J740K416K763K882L138L408L048J827M08l78m45k84k53l18k93m1
$$ 140570 142310 144726 147489 150371 153509 156917 159965 161792 162200 161822 161377 161093 160840 160522 160229 160188
52463A60188M06O84L96l00p00l53M43J123J446J409J044N93N08Q98J340J467J405
$$ 160188 160594 161278 161674 161374 160674 160321 160764 161887 163333 164742 165786 166379 166887 167785 169125 170592 171997
52446A71997J441J591J829K213K614K700K467K313K353K246J869J615J702J825
$$ 171997 173438 175029 176858 179071 181685 184385 186852 189165 191518 193764 195633 197248 198950 200775
52432B00775J862K199K890L232K678J614O57j34q48j288j573k358l699m497l979
$$ 200775 202637 204836 207726 210958 213636 215250 215907 215773 214925 213637 212064 209706 206007 201510 197531
52417A97531l048k990l533l429k536j939k161k550k537k341k172j756j000l84
$$ 197531 194483 191493 187960 184531 181995 180056 177895 175345 172808 170467 168295 166539 165539 165155
52403A65155l51p89j317j597j384o96O8N83R65J298J219N92J26N39J421J780J486
$$ 165155 164804 164015 162698 161101 159717 159021 159089 159672 160637 161935 163154 163746 163872 164411 165832 167612 169098
52386A69098J184J004M92j90j80P33J651J802J433J136J046J064J212J466J648
$$ 169098 170282 171286 171778 171588 171408 172141 173792 175594 177027 178163 179209 180273 181485 182951 184599
52371A84599J722J775J677J326J109J424J795J373L52k8Q68K289L313L869M166
$$ 184599 186321 188096 189773 191099 192208 193632 195427 196800 197152 197124 197992 200281 203594 207463 211629
52356B11629L963L144K375K394K981L269K864K156J709J685J840J853J662J589
$$ 211629 215592 218736 221111 223505 226486 229755 232619 234775 236484 238169 240009 241862 243524 245113
52342B45113J878K297K458K435K627L086L518L873M270M358L515J920O51L46N12
$$ 245113 246991 249288 251746 254181 256808 259894 263412 267285 271555 275913 279428 281348 281999 282345 282857
52327B82857N04N39J159K188K860K732K035J384J434K492M031M931M532L371K520
$$ 282857 283361 283900 285059 287247 290107 292839 294874 296258 297692 300184 304215 309146 313678 317049 319569
52312C19569K509L042L595L876L940M089M552N143N459N540N899O762P680Q196
$$ 319569 322078 325120 328715 332591 336531 340620 345172 350315 355774 361314 367213 373975 381655 389851
52298C89851Q503R031R727J0170J0245J0209J0230J0212J0189J0534J1615J3316
$$ 389851 398354 407385 417112 427282 437527 447736 457966 468178 478367 488901 500516 513832
52286E13832J4977J5880J5833J5286J4833J4689J4761J5044J5612J6299J6739
$$ 513832 528809 544689 560522 575808 590641 605330 620091 635135 650747 667046 683785
52275F83785J6705J6180J5142J3655J2141J1161J0703J0100Q801P018N426M454
$$ 683785 700490 716670 731812 745467 757608 768769 779472 789572 798373 805391 810817 815271
52263H15271L928L288K098M64j051k027k516k676k399j760j369j703k260k199
$$ 815271 819199 822487 824585 825049 823998 821971 819455 816779 814380 812620 811251 809548 807288 805089
52249H05089j686j699k433k878k302j261n66l2R77K277L081L202L325M049N286
$$ 805089 803403 801704 799271 796393 794091 792830 792264 792232 793209 795486 798567 801769 805094 809143 814429
52234H14429O595P684Q485R098R691J0229J0358R807Q862Q187Q126Q404Q437P834
$$ 814429 821024 828708 837193 846291 855982 866211 876569 886376 895238 903425 911551 919955 928392 936226
52220I36226O634N279M271L704L150K219J094L26Q4o6n63j304j917k409l223m614
$$ 936226 942860 948139 952410 956114 959264 961483 962577 962903 962987 962921 962358 961054 959137 956728 953505 948891
52204I48891o231p483q150q401q359q019p545p283p357p498p431p112o581n855
$$ 948891 942660 935177 927027 918626 910267 902248 894703 887420 880063 872565 865134 858022 851441 845586
52190H45586n153m786m672m357l695l054k587j849o28L98L76o27j840k688k936
$$ 845586 840433 835647 830975 826618 822923 819869 817282 815433 814805 815203 815579 814952 813112 810424 807488
52175H07488k387j216l07l90r75j014m34j56n77j065j091r75j151j467j580j498
$$ 807488 805101 803885 803578 803188 802213 801199 800765 800609 800032 798967 797876 796901 795750 794283 792703 791205
52159G91205j367j262j347j695j862j296l99l50j549k985l609l630l829m281m428
$$ 791205 789838 788576 787229 785534 783672 782376 781977 781627 780078 777093 773484 769854 766025 761744 757316
52144G57316m051l475l074l078l590m326m619m201l743m027m794n010m245l192
$$ 757316 753265 749790 746716 743638 740048 735722 731103 726902 723159 719132 714338 709328 705083 701891
52130G01891k752l022l470l689l748l865m065m228m302m333m293m106l845l659
$$ 701891 699139 696117 692647 688958 685210 681345 677280 673052 668750 664417 660124 656018 652173 648514
52116F48514l381k615j398m67m13q78j063p52l04J26P04J394J993K640L649M833
$$ 648514 645133 642518 641120 640653 640240 639362 638299 637547 637243 637369 638073 639467 641460 644100 647749 652582
52100F52582N684O219O975Q107R237J0286J1587J3033J3951J4146J4288J4912
$$ 652582 658266 664485 671460 679567 688804 699090 710677 723710 737661 751807 766095 781007
52088G81007J5777J6558J7364J8130J8311J7811J7466J7878J8381J7976J6713
$$ 781007 796784 813342 830706 848836 867147 884958 902424 920302 938683 956659 973372
52077I73372J5390J4275J3031J1609J0346R218P864O347N183M425L389J617l35
$$ 973372 988762 1003037 1016068 1027677 1038023 1047241 1055105 1061452 1066635 1071060 1074449 1076066 1075731
52064A075731j485j634j645k414l824m950n285n349n886o816p510p845q194q465
$$ 1075731 1074246 1072612 1070967 1068553 1064729 1059779 1054494 1049145 1043259 1036443 1028933 1021088 1012894 1004429
52050A004429p911o270m400l287k946k663j973r85p9L17l3q04j223q09J86J191
$$ 1004429 996518 990248 985848 982561 979615 976952 974979 973994 973915 974232 974199 973395 972172 971363 971549 972740
52034I72740J849K058J925J881K364L181L642L522L328L384L295K716K010J649
$$ 972740 974589 976647 978572 980453 982817 985998 989640 993162 996490 999874 1003169 1005885 1007895 1009544
$$ [...]
##END NTUPLES=NMR SPECTRUM
##END=
