
##TITLE=AC1346_GUAAH12164_7433086_bwJptFMpsF
##JCAMPDX= 6.0         $$ Bruker NMR JCAMP-DX V2.0
##DATA TYPE= NMR SPECTRUM
##DATA CLASS= NTUPLES
##ORIGIN= BRUKER
##OWNER= Administrator
$$ 1.72 TOPSPIN		Version 2.1
$$ 2013-01-29 23:18:59.312 -0500  Administrator@X
$$ Compression mode = diff/dup
##.OBSERVE FREQUENCY= 400.02188249412
##.OBSERVE NUCLEUS= ^1H
##.ACQUISITION MODE= SIMULTANEOUS (DQD)
##.ACQUISITION SCHEME= undefined
##.AVERAGES= 8
##.DIGITISER RES= 22
##SPECTROMETER/DATA SYSTEM= spect
##.PULSE SEQUENCE= zg30
##.SOLVENT NAME= COFFEE_meoh
##.SHIFT REFERENCE= INTERNAL, COFFEE_meoh, 1, 14.98509
##AUDIT TRAIL= $$ (NUMBER, WHEN, WHO, WHERE, PROCESS, VERSION, WHAT)
$$ ##TITLE= Audit trail, TOPSPIN		Version 2.1
$$ ##JCAMPDX= 5.01
$$ ##ORIGIN= Bruker BioSpin GmbH
$$ ##OWNER= Administrator
$$ $$ E:\/data/COFFEE/nmr/AC1346_GUAAH12164_7433086_bwJptFMpsF/10/pdata/1/auditp.txt
$$ ##AUDIT TRAIL=  $$ (NUMBER, WHEN, WHO, WHERE, PROCESS, VERSION, WHAT)
(   1,<2013-01-29 23:18:50.984 -0500>,<Administrator>,<X>,<go>,<TOPSPIN 2.1>,
      <created by zg
	started at 2013-01-29 23:17:44.093 -0500,
	POWCHK enabled, PULCHK disabled,
       configuration hash MD5:
       86 BA 57 50 F2 9D 5C 9B 26 00 A9 28 5F 66 2E 89
       data hash MD5: 64K
       6A B6 B5 5A E8 C7 B1 90 6A 52 C3 66 16 A6 BF 77>)
(   2,<2013-01-29 23:18:54.093 -0500>,<Administrator>,<X>,<proc1d>,<TOPSPIN 2.1>,
      <Start of raw data processing
       efp LB = 0 FT_mod = 6 PKNL = 1 PHC0 = 0 PHC1 = 0 SI = 32K 
       data hash MD5: 32K
       2C A9 6E A2 93 16 F9 57 8D B9 C8 F6 A8 ED 8E B6>)
(   3,<2013-01-29 23:18:54.546 -0500>,<Administrator>,<X>,<proc1d>,<TOPSPIN 2.1>,
      <pk PHC0 = 98.81104 PHC1 = 0 
       data hash MD5: 32K
       C4 94 30 94 34 43 81 7C 5E EC 9B 2E 75 0B CA 91>)
(   4,<2013-01-29 23:18:54.780 -0500>,<Administrator>,<X>,<proc1d>,<TOPSPIN 2.1>,
      <abs ABSG = 1 
       data hash MD5: 32K
       7C CE 4D 52 70 73 34 01 0D 99 3D A2 0F AE FA DE>)
(   5,<2013-01-29 23:18:54.921 -0500>,<Administrator>,<X>,<proc1d>,<TOPSPIN 2.1>,
      <abs ABSG = 2 
       data hash MD5: 32K
       F0 9E FE 79 94 3A 6D 85 5D 58 3A DB 27 10 FE F1>)
(   6,<2013-01-29 23:18:55.077 -0500>,<Administrator>,<X>,<proc1d>,<TOPSPIN 2.1>,
      <abs ABSG = 3 
       data hash MD5: 32K
       A5 42 6B 50 2B 65 F3 4B 59 5E 9B 8F A0 D4 95 03>)
(   7,<2013-01-29 23:18:55.218 -0500>,<Administrator>,<X>,<proc1d>,<TOPSPIN 2.1>,
      <abs ABSG = 4 
       data hash MD5: 32K
       9F 66 F3 F8 24 00 6B EC 35 51 68 18 31 84 B0 83>)
(   8,<2013-01-29 23:18:55.390 -0500>,<Administrator>,<X>,<proc1d>,<TOPSPIN 2.1>,
      <abs ABSG = 5 
       data hash MD5: 32K
       85 0E 4B BD 87 62 8C A5 8C 22 4E EF A5 C5 78 3B>)
$$ ##END=
$$ 
$$ $$ hash MD5
$$ $$ 92 1C 67 7D 1F 75 3E 15 35 0D 51 D1 A6 0B 6F 8B
##$RELAX= 
##$RELAX= 
##$RELAX= 
##$RELAX= 
##$RELAX= 
##$RELAX= 
##$RELAX= 
$$ Bruker specific parameters
$$ --------------------------
##$DU= <E:\>
##$EXPNO= 10
##$NAME= <AC1346_GUAAH12164_7433086_bwJptFMpsF>
$$ [...]
150 150 150 150 150 150 150 150
##$TP07= 0
##$TPNAME0= <>
##$TPNAME1= <>
##$TPNAME2= <>
##$TPNAME3= <>
##$TPNAME4= <>
##$TPNAME5= <>
##$TPNAME6= <>
##$TPNAME7= <>
##$TPOAL= (0..7)
0.5 0.5 0.5 0.5 0.5 0.5 0.5 0.5
##$TPOFFS= (0..7)
0 0 0 0 0 0 0 0
##$TUNHIN= 0
##$TUNHOUT= 0
##$TUNXOUT= 0
##$USERA1= <user>
##$USERA2= <user>
##$USERA3= <user>
##$USERA4= <user>
##$USERA5= <user>
##$V9= 5
##$VALIST= <valist>
##$VCLIST= <CCCCCCCCCCCCCCC>
##$VD= 0
##$VDLIST= <DDDDDDDDDDDDDDD>
##$VPLIST= <PPPPPPPPPPPPPPP>
##$VTLIST= <TTTTTTTTTTTTTTT>
##$WBST= 1024
##$WBSW= 4
##$XGAIN= (0..3)
0 0 0 0
##$XL= 0
##$YL= 0
##$YMAX_a= 601974
##$YMIN_a= -514213
##$ZGOPTNS= <>
##$ZL1= 120
##$ZL2= 120
##$ZL3= 120
##$ZL4= 120
##$ABSF1= 14.98509
##$ABSF2= -5.573092
##$ABSG= 5
##$ABSL= 3
##$ALPHA= 0
##$AQORDER= 0
##$ASSFAC= 0
##$ASSFACI= 0
##$ASSFACX= 0
##$ASSWID= 0
##$AUNMP= <proc_prof1d_extract_pilot.lims>
##$AXLEFT= 0
##$AXNAME= <>
##$AXNUC= <1H>
##$AXRIGHT= 0
##$AXTYPE= 0
##$AXUNIT= <>
##$AZFE= 0.1
##$AZFW= 0.1
##$BCFW= 0
##$BC_mod= 0
##$BYTORDP= 0
##$COROFFS= 0
##$CY= 15
##$DATMOD= 1
##$DC= 0
##$DFILT= <>
##$DTYPP= 0
##$F1P= 0
##$F2P= 0
##$FCOR= 0.5
##$FTSIZE= 32768
##$FT_mod= 6
##$GAMMA= 0
##$GB= 0
##$INTBC= 1
##$INTSCL= 1
##$ISEN= 128
##$LB= 0
##$LEV0= 0
##$LPBIN= 0
##$MAXI= 10000
##$MC2= 0
##$MEAN= 0
##$ME_mod= 0
##$MI= 0
##$NCOEF= 0
##$NC_proc= -8
##$NLEV= 6
##$NOISF1= 0
##$NOISF2= 0
##$NSP= 0
##$NTH_PI= 0
##$NZP= 0
##$OFFSET= 14.98509
##$PC= 1
##$PHC0= 98.81104
##$PHC1= 0
##$PH_mod= 1
##$PKNL= yes
##$PPARMOD= 0
##$PPDIAG= 0
##$PPIPTYP= 0
##$PPMPNUM= 2147483647
##$PPRESOL= 1
##$PSCAL= 4
##$PSIGN= 0
##$PYNMP= <proc.py>
##$REVERSE= no
##$SF= 400.02
##$SI= 32768
##$SIGF1= 0
##$SIGF2= 0
##$SINO= 400
##$SIOLD= 32768
##$SPECTYP= <>
##$SREGLST= <1H.CDCl3>
##$SSB= 0
##$STSI= 32768
##$STSR= 0
##$SW_p= 8223.68421052631
##$SYMM= 0
##$S_DEV= 0
##$TDeff= 65536
##$TDoff= 0
##$TI= <>
##$TILT= no
##$TM1= 0
##$TM2= 0
##$TOPLEV= 0
##$USERP1= <user>
##$USERP2= <user>
##$USERP3= <user>
##$USERP4= <user>
##$USERP5= <user>
##$WDW= 1
##$XDIM= 32768
##$YMAX_p= 456138586
##$YMIN_p= -733226
##$CURPLOT= <Network HP LaserJet P1505>
##$CURPRIN= <$Network HP LaserJet P1505>
##$DFORMAT= <normdp>
##$LAYOUT= <+/1D_H.xwp>
##$LFORMAT= <normlp>
##$PFORMAT= <normpl>
##$SURQMSG= 1
$$ End of Bruker specific parameters
$$ ---------------------------------
##NTUPLES= NMR SPECTRUM
##VAR_NAME=  FREQUENCY,     SPECTRUM/REAL,   SPECTRUM/IMAG
##SYMBOL=    X,             R,               I
##VAR_TYPE=  INDEPENDENT,   DEPENDENT,       DEPENDENT
##VAR_FORM=  AFFN,          ASDF,            ASDF
##VAR_DIM=   32768,         32768,           32768
##UNITS=     HZ,            ARBITRARY UNITS, ARBITRARY UNITS
##FACTOR=    0.250966925370066, 1,           1
##FIRST=     8223.43324360094, 1886,         -205222
##LAST=      0,             36483,           -227589
##MIN=       0,             -733226,         0
##MAX=       8223.43324360094, 456138586,    0
$$ Real data points
##PAGE= N=1
##DATA TABLE= (X++(R..R)), XYDATA
$$ [...]
$$ plain form
19575 263949 106900 280952 -333260 -372743 -218461 -332904 -118621 49757 74270 -30702
19564 -7029 108763 -238382 -29396 -89540 -57238 -155678 194074 -146488 -131684 161537 -140602
19552 -99037 -105028 22090 -366645 110946 131728 -281673 53974 177553 -30703 -111573 -199337
19541 -199337 -85994 -394509 86656 180859 -13086 -84042 -266229 132483 -203611 -45548 166517
19529 -75534 111564 -186070 608 -4237 -175835 -92713 -84930 -18887 -93129 -136941 197767 -29125
19516 -64096 -59524 119205 -118880 -44444 18019 -131289 -190725 142608 143315 30795 -312539
19504 22414 -191674 -18021 -12290 168514 -258002 -104203 128643 -26400 -154206 251446
19493 -303916 -115980 -147185 -182277 -272283 -370388 -12949 85109 -188629 196961 248345 54070
$$ packed form
19575B63949A06900J74052c33260l9483J54282j14443a18621D9757K4513c0702
19564g029A08763b38382b9396o0144L2302r8440A94074a46488J4804A61537a40602
19552i9037n991B2090c66645A10946K0782b81673E3974J23579c0703q0870q7764
19541a99337h5994l08515H6656R4203a3086p0956j82187A32483b03611d5548A66517
19529g5534A11564a86070F08d237j71598Q3122P783a8887p4242m3812A97767b9125
19516f4096M572A19205a18880d4444A8019a31289n9436A42608P07C0795c12539
19504B2414a91674a8021N731A68514b58002a04203A28643b6400j27806B51446
19493c03916a15980l1205l5092r0006r8105a2949H5109a88629A96961N1384E4070
$$ plain form
19481 154158 18175 -151225 -304954 -272701 110853 -62596 -284035 19925 -199240 -148455
19471 -148455 -40993 -136750 162386 -116555 -58005 97801 -157032 46710 -191194 12720 -180229
19459 -53413 5803 -333372 -32738 -80814 -216662 -54045 -237957 23378 97102 -53575 126480
19447 4333 -56968 -124679 -48785 42758 -47946 -365959 -122417 -6801 -473321 -153043 -23392
19435 -147372 -130008 6273 -153667 217731 94534 268959 -109750 -313105 124397 -158657
19424 233882 89469 128621 -179194 62613 56461 -232088 -93813 186668 32217 146658 243608
19413 243608 -178364 -228834 -183560 -185876 -48734 75889 115340 -177926 9978 20892 207137
19402 207137 190227 102358 -369588 -146416 -68848 106467 -80541 -110569 -53326 -321793 -105007
$$ packed form
19481A54158A8175a51225j53729L2253A10853f2596k21439A9925a99240N0785
19471a48455d0993r5757A62386a16555e8005I7801a57032D6710a91194A2720a80229
19459e3413E803c33372c2738m8076j35848e4045j83912B3378P3724e3575A26480
19447D333e6968o7711d8785D2758d7946l18013a22417f801m66520a53043b3392
19435a47372J7364F273a53667B17731I4534J74425a09750k03355A24397a58657
19424B33882H9469L9152a79194F2613o152b32088i3813A86668C2217J14441R6950
19413B43608a78364n0470M5274k316d8734G5889L9451a77926I978J0914J86245
19402B07137j6910q7869c69588a46416f8848A06467h0541l0028e3326k68467a05007
$$ plain form
19390 -217644 -38116 -421146 32313 -52938 -405949 -1034 26596 -399180 21913 -213283 -298187
19379 -298187 -316776 -258267 -101608 -241063 106807 -1074 -231479 55478 -37519 -79306 47089
19367 -434 113419 199815 233488 72557 89959 -310642 -112923 -14059 -258407 -271240 -303757
19356 -303757 -41775 296341 -119432 87519 169235 -415400 -235264 -288542 -3148 83712 -96672
19344 4870 29632 -408414 -69553 -332855 281868 100805 143063 -69150 -32949 -110207 -323448
19333 -323448 -61599 -121549 -163394 -107639 161554 -55081 -58967 -49171 -164298 -13143 -104121
19322 -104121 -109855 54588 -336178 71571 -113797 -35561 -444180 -315105 -49663 -54481 165102
19310 284753 -297879 -106025 89795 169223 139350 -408233 -212920 64188 62987 -437114 -86534
$$ packed form
19390b17644c8116l83030C2313e2938l53011a034B6596c99180B1913b13283q4904
19379b98187j8589N8509a01608j39455A06807a074k30405E5478c7519m1787D7089
19367d34A13419Q6396L3673G2557J7402c10642a12923a4059k44348j2833l2517
19356c03757d1775B96341a19432H7519Q1716d15400J80136n3278c148H3712i6672
19344D870K4762d08414f9553k63302B81868A00805M2258f9150c2949p7258k13241
19333c23448f1599n9950m1845N5755A61554e5081l886R796j15127a3143r0978
19322a04121n734E4588c36178G1571a13797c5561m08619J29075d9663m818A65102
19310B84753b97879a06025H9795P9428k9873d08233J95313F4188j201d37114h6534
$$ plain form
19298 90363 92984 21570 137417 -42195 -197043 -103944 -83971 -196451 -118275 -136723 -7602
19286 -75095 8432 237721 -27415 -136930 190519 151909 54242 370564 146217 91831 -92547
19274 -446866 -350020 379101 24063 -359 -71003 -227603 -377620 -205098 242816 117345 -178125
19262 -36089 101218 -111739 -66051 -97555 -27197 -425983 139969 -114411 56533 -205522
19251 -285807 -257613 -350488 134561 100902 46906 20933 151170 116373 -22854 -189203 -288363
19240 -288363 132691 -108491 110451 -174164 -242806 24068 17473 115578 39921 123683 328639
19229 328639 -175885 -359898 339089 -7849 62440 44135 -51445 -502969 -12859 75302 -35071
19217 143493 -75311 -49926 48267 24734 -344129 -137096 49616 -27084 -347920 -301872 373420
$$ packed form
19298I0363K621B1570J15847d2195j54848R3099J9973j12480P8176j8448g602
19286g5095H432K29289b7415j09515A90519l8610E4242L16322A46217n4386i2547
19274d46866R6846C79101B4063c59p0644j56600j50017J72522B42816A17345a78125
19262c6089A01218a11739M5688l1504b7197l98786A39969a14411E6533b05522
19251b85807K8194r2875A34561l3659D6906B0933J30237l4797b2854j66349r9160
19240b88363A32691a08491A10451a74164o8642B4068o595R8105C9921Q3762K04956
19229C28639a75885j84013C39089g849F2440j8305e1445m51524a2859G5302c5071
19217A43493g5311K5385D8267k3533c44129a37096D9616b7084l20836M6048C73420
$$ plain form
19205 108511 -174378 -24290 -160847 323567 101148 44090 -1116 -110700 26877 -75234 280365
19193 -136 -219484 -65221 203743 240552 100348 66792 -221363 37680 41253 27539 -323805
19181 30251 80786 27318 146329 -34721 -83778 85748 -45838 -103268 118531 53409 -232299
19169 192206 -295379 -55357 25515 -95165 17411 -150918 -95529 20652 -6026 -15258 -95446
19158 -95446 -128066 -123436 -64181 191604 181659 -238430 102938 72770 14029 -327445 -112634
19146 -175981 -95335 36261 -276429 -97879 -64861 179554 -85398 107289 138731 -140138 -425422
19135 -425422 29345 -352972 -174622 111525 -219516 -277616 202487 -152150 -60999 -101511
19125 -101511 -359971 -232485 121009 -121572 -276666 95193 15590 22024 51466 -362508
$$ packed form
19205A08511a74378b4290j36557C23567A01148D4090a116j09584B6877g5234B80365
19193a36k19348f5221B03743L6809A00348l3556b21363C7680L573j3714c23805
19181C0251N0535B7318J19011c4721m9057H5748d5838n7430A18531E3409b32299
19169A92206b95379e5357B5515i5165A7411a50918N5389B0652f026r232q0188
19158i5446l2620M630N9255A91604r945b38430A02938l0168A4029c27445a12634
19146a75981Q0646C6261b76429i7879L3018A79554h5398A07289L1442a40138k85284
19135d25422B9345c52972a74622A11525b19516n8100B02487a52150f0999m0512
19125a01511k58460J27486A21009a21572j55094I5193A5590O434K9442c62508
$$ plain form
19114 -69268 -29154 -208095 14155 -46968 42471 -267105 -14168 -92924 88434 116847 94000
19103 94000 -34884 -104707 -228813 -254962 158727 -200641 -22699 -4181 145864 -319704 -423754
19092 -423754 16738 -118878 -268723 -104682 66813 -100739 -60918 -171711 -223212 -179274
19082 -179274 -206195 -133899 -242830 -8453 -245740 254982 -72686 -200248 31230 -97537 -155555
19071 -155555 -106125 158455 -77849 -33127 -176122 -209483 -316318 -195674 -41400 29977 -148005
19059 -39801 275 -274519 51828 139391 -222371 102030 -176021 298893 -175089 -298189 -96215
19047 -213268 -240336 43079 -101875 -98009 295703 89744 -168250 -55339 36240 -53454 99822
19035 -147208 152829 -168237 114352 -236506 61591 327226 -825 57910 -102660 45255 -74948
$$ packed form
19114f9268b9154j78941A4155d6968D2471b67105a4168p8756H8434K8413k2847
19103I4000c4884o9823j24106k6149A58727b00641b2699d181A45864c19704j04050
19092d23754A6738a18878j49845a04682F6813a00739L9821j10793n1501M3938
19082a79274k6921P2296j08931h453k37287B54982g2686j27562C1230i7537n8018
19071a55555M9430A58455g7849c3127j42995l3361j06835J20644d1400B9977a48005
19059c9801B75b74519E1828Q7563b22371A02030a76021B98893a75089j23100i6215
19047b13268k7068D3079a01875L866B95703H9744a68250e5339C6240e3454I9822
19035a47208A52829a68237A14352b36506F1591K65635h25E7910a02660D5255g4948
$$ plain form
19023 287275 232949 -185495 -36157 95192 -236191 -56584 -61968 -141946 -165427 14256 -139960
19011 123447 -186244 15907 -36047 -243072 -39782 85933 -185893 -35778 -56417 116479 -33411
18999 85483 -133007 -73239 -112944 -312289 103464 -65190 -221155 -119419 -174910 39432 -77062
18987 -64136 200364 43974 66309 -7343 -50052 224807 -189421 -185550 430244 -219471 -94586
18975 -212265 107624 129745 -60046 -274839 216546 139508 -245444 -206505 3734 65537 142324
18964 142324 54272 -247037 -200852 -25702 -125629 -104385 256051 -85709 -46628 -236050 26359
18952 -64031 -230196 -385207 -170417 -43662 29852 -773 -147717 -258569 -75710 271725 19012
18940 -163697 -585720 -357145 210160 111531 -332010 -34479 -243744 -245342 -85393 -101623 137501
$$ packed form
19023B87275n4326a85495c6157I5192b36191e6584n384p9978k3481A4256a39960
19011A23447a86244A5907c6047k07025c9782H5933a85893c5778k0639A16479c3411
18999H5483a33007N9768l9705j99345A03464f5190j55965J01736n5491C9432g7062
18987f4136B00364D3974K2335g343m2709B24807a89421L871D30244b19471i4586
18975b12265A07624K2121f0046k14793B16546p7038b45444L8939C734O1803P6787
18964A42324E4272b47037M6185b5702r9927K1244B56051h5709L9081j89422B6359
18952f4031j66165j55011a70417d3662B9852g73j46944j10852g5710B71725A9012
18940a63697m22023K28575B10160r8629c32010c4479k09265j598h5393j6230A37501
$$ plain form
18928 183445 152676 -20777 -117422 154584 -62112 -315272 -232231 148329 -543335 -27614 -22373
18917 -22373 -288505 -99819 242117 -119721 -69168 348413 103643 250061 -30452 -455964
18907 -455964 -182018 -12491 -223266 -95682 -128829 -145579 -108597 -62980 -234637 63071 95652
18896 95652 -133063 184922 -246252 -86223 -141895 -183671 -178065 127087 -158980 -286300 -250173
18885 -250173 -56279 103013 71013 -339783 183596 -116555 -103762 280661 -155453 -176305
18875 -176305 40649 -212124 -221424 -221279 -1105 -100131 16299 99020 -102435 -97598 124209 24842
18862 -123814 -115196 -109372 -19344 64161 121549 118779 46476 31588 63742 172366 51049 -104028
18849 -219415 -260566 3296 128301 -157955 -109170 3657 19094 -190857 -75909 -185883 -3220
$$ packed form
18928A83445l0769b0777r6645A54584f2112k53160Q3041A48329e43335b7614N241
18917b2373k66132i9819B42117a19721N0553C48413A03643J46418c0452m25512
18907d55964a82018a2491k10775i5682l3147j6750L6982M5617j71657F3071L2581
18896I5652a33063A84922b46252h6223n5672m1776N606A27087a58980j27320L6127
18885b50173e6279A03013l2000c39783A83596a16555J2793B80661a55453k0852
18875a76305D0649b12124r300J45a105r9026A6299Q2721a02435M837A24209B4842
18862a23814Q618N824a9344F4161N7388k770D6476j4888L2154J08624E1049a04028
18849b19415m1151C296J25005a57955M8785C657J5437a90857g5909j09974c220
$$ plain form
18837 -62055 47409 -49225 -296149 -192087 108892 -99644 56337 -191739 291390 -95652 316019
18825 374360 -208992 41099 175640 13723 -234072 -95542 -29865 90826 -44914 203218 -346329
18813 9997 -108713 35140 -35512 49197 -173455 51822 56306 137932 -85219 -4835 -92718 41485
18800 -50971 -181683 -12458 -2466 -143428 -82755 -460798 -223605 149006 -302389 -206234 -67575
18788 10687 123337 -177541 96852 239834 -81093 255017 43838 -4363 -113558 -231695 -43434
18776 23498 -92917 -126157 -223321 47963 632 -40879 -200751 -135812 38642 -72311 22302 21204
18764 21204 230547 -59656 -221614 159196 17066 22869 312719 -230102 147467 -250629
18753 -49741 240897 -234527 84613 -216508 -10402 -207656 -302945 -30908 69969 131347 -148053
$$ packed form
18837f2055D7409d9225k46924J04062A08892i9644E6337a91739B91390i5652C16019
18825C74360b08992D1099J34541A3723b34072i5542b9865I0826d4914B03218c46329
18813I997a08713C5140c5512D9197a73455E1822M484Q1626h5219d835q7883D1485
18800e0971j30712a2458b466j40962O0673l78043b23605A49006c02389R6155f7575
18788A0687J12650a77541I6852J42982h1093B55017D3838d363j09195j18137d3434
18776B3498i2917l3240r7164D7963F32d0879j59872O4939C8642g2311B2302j098
18764B1204K09343e9656j61958A59196A7066N803K89850b30102A47467b50629
18753d9741B40897b34527H4613b16508a0402j97254r5289c0908F9969O1378a48053
$$ plain form
18741 -241873 152282 222763 -96744 -231140 -212623 -166781 -406295 -15178 -106011 -292841 -17426
18729 -221399 -23741 397614 104832 -240655 282178 215275 -147104 -135489 -3027 28022 -64054
18717 203478 333101 -97646 244566 50626 101912 177535 -58081 -170475 -93404 151338 52349
18705 -95359 -150275 -13523 -234109 -479160 265820 -68778 -335528 -206567 -115088 -139898 -207909
18694 -207909 -62913 -945 -79573 -112984 -41159 -94781 -94611 157349 -180250 -10455 246859 4174
18681 -61905 -217349 139473 112146 156083 141561 5967 -205970 -306093 14977 86752 -69470
18669 -108626 -155224 -201582 -143974 -42904 -129383 -152511 45998 -187108 -62732 -8531 -71570
18658 -71570 -164176 -364661 -173538 -241996 -270970 -420599 57140 -125523 -111016 -52885 -231498
$$ packed form
18741b41873A52282P0481i6744j34396J8517M5842k39514a5178r0833j86830a7426
18729b21399b3741C97614A04832b40655B82178o6903a47104J1615c027B8022f4054
18717B03478J29623i7646B44566E0626N1286P5623e8081j12394P7071A51338E2349
18705i5359n4916a3523k20586k45051B65820f8778k66750J28961R1479k4810o8011
18694b07909f2913i45p8628l3411d1159n3622J70A57349a80250a0455B46859D174
18681f1905j55444A39473k7327M3937j4522E967b05970j00123A4977P1775f9470
18669a08626m6598m6358N7608d2904q6479k3128D5998a87108f2732h531o3039
18658g1570r2606k00485a73538o8458k8974j49629E7140a25523J4507e2885j78613
$$ plain form
18647 -231498 -303512 228281 -145855 -58606 57694 -259145 163148 -266198 204479 62736
18636 73812 -103798 224569 46270 152551 -87920 72322 -308276 87327 17144 265031 -6627
18624 -315245 -139927 -37202 198455 -298636 4168 -92783 111835 -51586 -221099 -259379 -81110
18612 -251953 -75504 -326853 39497 42995 -183807 -96078 413911 -37374 209673 -112622 23380
18600 -231631 -46695 -56678 -88940 -106241 -56005 -118792 -100036 -54742 16990 145948 -159553
18588 -178938 -375191 76273 -181124 -75076 -81740 -80192 -260013 -146533 -205613 -83358 83518
18576 -175456 12018 126487 101575 -249246 21824 -103817 49337 364020 -240520 -131491
18566 -131491 -302248 129278 -257362 166156 257730 158470 52838 42874 -299689 89277 -164330
$$ packed form
18647b31498p2014B28281a45855e8606E7694b59145A63148b66198B04479F2736
18636G3812a03798B24569D6270J06281h7920G2322c08276H7327A7144K47887f627
18624c15245a39927c7202A98455b98636D168i2783A11835e1586j69513l8280h1110
18612b51953g5504k51349C9497L498a83807Q7729D13911c7374B09673a12622B3380
18600b31631d6695r983l2262j7301N0236o2787J8756M5294A6990J28958a59553
18588a78938j96253G6273a81124g5076o664J548j79821J13480n9080h3358H3518
18576a75456A2018J14469k4912b49246B1824a03817D9337L14683b40520J09029
18566a31491j70757A29278b57362A66156R1574r9260E2838r964b99689H9277a64330
$$ plain form
18554 -315789 224068 -465161 -169949 -144484 -161413 130339 29790 -204754 324316 -20550
18543 342668 -11203 183024 -233191 -306213 110490 237036 -47726 -365151 -69806 24403
18532 97888 -199175 63759 -175817 -231238 -202855 126151 -247801 -63871 -346258 -357829 142774
18520 135617 -10758 11407 -209304 -126444 117370 -201925 -16617 -63760 -295729 228672
18509 -132768 -124346 -5294 -242586 117048 266886 -194236 -51413 -115657 36558 51852 23192
18497 -63781 -135510 215539 -197273 -190314 123665 -227143 -309812 -95510 -88844 -22936 -128044
18486 -128044 52118 3835 124084 80097 -399739 -222551 192934 -40562 -154139 -170653 -253266
18475 -253266 -20923 -140740 189857 59843 178070 -255609 106394 -112753 384289 54070
$$ packed form
18554c15789B24068d65161a69949K5465j6929A30339B9790b04754C24316b0550
18543C42668a1203A83024b33191p3022A10490J26546d7726l17425f9806B4403
18532I7888a99175F3759a75817n5421K8383A26151b47801f3871k82387j1571A42774
18520A35617a0758A1407b09304Q2860A17370b01925a6617m7143k31969B28672
18509a32768Q422e294k37292A17048J49838a94236e1413o4244C6558J5294B3192
18497f3781p1729B15539a97273O959A23665b27143q2669i5510O666b2936j05108
18486a28044E2118C835J20249m3987c99739J77188A92934d0562j13577j6514q2613
18475b53266b0923j19817A89857E9843J18227b55609A06394a12753C84289E4070
$$ plain form
18464 82552 179485 -8698 32474 195270 13553 -59200 -205998 114977 -217372 74891 6104
18452 155478 -37912 -65587 23585 -122486 -82443 -84846 44139 -103230 242630 17478 96093
18441 96093 -62358 -242321 7113 143647 -62725 -52655 -23262 -14839 -84067 5479 -181380 -159227
18429 -159227 -100830 -162876 -43285 8601 -418034 -86013 -316105 119528 292953 -127562 14330
18417 147840 -152094 44646 -332227 -236431 350474 -198307 123705 -45111 -149794 113114
18406 -67622 54470 288809 -110723 211349 339178 112200 106150 -334163 -11966 100083
18395 253510 -130983 -4920 -180936 115618 -122708 -157850 35050 148248 -304170 -254580
18385 -254580 -113584 -228861 -83565 -148641 -177039 -102490 -228161 -20716 -18794 -415355 -115824
$$ packed form
18464H2552R6933h698C2474J62796A3553e9200j46798A14977b17372G4891F104
18452A55478c7912k7675B3585a22486M0043k403D4139a03230B42630A7478P8615
18441I6093f2358j79963G113J36534f2725J0070b3262Q423o9228E479a81380K2153
18429a59227N8397o2046d3285H601d18034h6013k30092A19528J73425a27562A4330
18417A47840a52094D4646c32227R5796C50474a98307A23705d5111j04683A13114
18406f7622E4470K34339a10723B11349J27829A12200o050c34163a1966A00083
18395B53510a30983d920j76016A15618a22708l5142C5050J13198c04170M9590
18385b54580a13584j15277h3565o5076k8398P4549j25671b0716J922l96561a15824
$$ plain form
18373 -126097 -216973 27936 -96839 149730 -148370 -6240 -7346 -75894 176551 19840 129800
18362 129800 -88390 288914 210018 -116456 -242900 -119238 -174102 341611 -171886 -194288
18352 -194288 77749 -1422 -145272 -183765 134005 -190398 -76717 172426 115617 -17108 -39411
18341 -39411 -32212 -250902 64612 -152593 17415 -59602 7229 -12457 -16827 -62332 190649 230358
18329 230358 81207 238049 -12405 -342184 317586 -158910 -121913 203692 -54289 225499
18318 -289331 87944 -265799 -90800 -159031 -270803 -85206 -7653 -157393 303603 65928 -60284
18306 -29592 -241394 171236 -158423 108797 -289580 60170 162755 -362965 120506 142862
18296 142862 -8153 131734 13256 -194721 -66189 92862 165589 -85391 149470 -285744 173439
$$ packed form
18373a26097r0876B7936i6839A49730a48370f240j106o8548A76551A9840J09960
18362A29800h8390B88914p8896a16456j26444a19238n4864C41611a71886k2402
18352a94288G7749a422j43850l8493A34005a90398g6717A72426n6809a7108k2303
18341c9411P199k18690F4612a52593A7415e9602G229a2457m370m5505A90649L9709
18329B30358H1207J56842a2405l29779C17586a58910L6997B03692e4289B25499
18318b89331H7944b65799i0800o8231j11772h5206g653j49740C03603F5928f0284
18306b9592k11802A71236a58423A08797b89580F0170J02585c62965A20506K2356
18296A42862h153A31734A3256a94721f6189I2862P2727h5391A49470b85744A73439
$$ plain form
18284 -466207 65691 -46541 317195 1848 -19815 -94873 -100186 -52850 -77818 -167496 -87104 13900
18271 -66468 -181142 -111553 -82523 -22190 28925 -381726 29743 -121456 -21481 -28988 -169565
18260 -169565 -232391 153928 3428 190103 73089 38833 120604 113247 44289 132187 -196571
18248 32993 -128497 253691 -186513 -73284 -105764 67249 -154409 -218441 50373 -273569 -195436
18237 -195436 2618 187045 151792 -110235 6049 51017 46407 -214818 -267417 201144 -107147
18225 -300174 -308232 99108 -231904 -182321 -378843 -217535 220013 92643 76668 -281797 -280931
18214 -280931 48000 240570 -168776 -137891 -141994 -147771 -18080 -112834 1149 -467057 -143549
18202 42793 9784 80424 260562 98107 -78730 -343957 135203 2004 315463 28213 -175809
$$ packed form
18284d66207F5691d6541C17195A848a9815p5058n313M7336k4968q9678Q0392A3900
18271f6468j14674O9589K9030b2190B8925c81726B9743a21456b1481p507j40577
18260a69565o2826A53928C428J86675G3089l4256Q1771p357D4289Q7898a96571
18248C2993a28497B53691a86513g3284l2480F7249a54409o4032E0373b73569P8133
18237a95436B618J84427l5253a10235F049M4968m610b14818n2599B01144a07147
18225c00174q058I9108b31904M9583j96522J61308B20013I2643j5975b81797Q66
18214b80931D8000J92570a68776L0885m103n777a8080r4754A149d67057a43549
18202D2793I784P0640J80138I8107g8730k65227A35203B004L13459B8213a75809
$$ plain form
18190 -19659 41695 -94583 -4853 11080 -37801 168844 -67561 4724 114248 -135346 -453586
18179 -453586 -316869 -134745 -141233 -45790 31787 -176001 213779 -262489 153997 -15027
18168 -156503 -158314 -134561 270162 -68000 -242940 -34481 -340731 -119071 -88687 47227 -177085
18156 82694 -280397 -355072 -13593 -265626 26069 57379 100901 -13834 -236511 91185 5257
18144 -68127 48541 302767 -288147 -18844 -27754 105124 -100640 110551 -294487 69828 89261
18133 89261 20690 -144510 250109 17653 -157899 -546678 162911 -106968 170156 -33335
18122 79846 -189533 267670 -28563 165873 -65547 67178 18481 86557 -2459 -153838 -128877
18111 -128877 92549 -4091 193110 -185638 321974 -95288 -34104 340795 -314122 13895 154265
$$ packed form
18190a9659D1695i4583d853A1080c7801A68844f7561D724J09524a35346l18240
18179d53586J36717a34745o488d5790C1787a76001B13779b62489A53997a5027
18168a56503j811K3753B70162f8000j74940c4481l06250a19071L0384D7227a77085
18156H2694b80397p4675a3593k52033B6069L1310M3522a3834k22677I1185E257
18144f8127D8541K54226b88147a8844q910A05124a00640A10551b94487F9828J9433
18133H9261B0690a44510B50109A7653a57899l88779A62911a06968A70156c3335
18122G9846a89533B67670b8563A65873f5547F7178A8481O8076b459j51379K4961
18111a28877I2549d091A93110a85638C21974i5288c4104C40795c14122A3895J40370
$$ plain form
18100 154265 -268950 -89174 26270 -197191 -10069 -419086 235587 152799 167627 -168768
18089 82399 22957 245578 -337012 159963 219838 -204431 190889 78449 -18532 -138701
18079 -138701 -165284 67709 -125203 -60842 -96574 -6909 -64581 -61748 -54467 49310 -33463 108771
18066 -254213 -275773 69607 54663 -414262 326153 -60018 -288210 -193529 -61670 -200671 -134743
18055 -134743 -55747 -152549 -19655 310527 294106 11404 219694 218040 -147999 -76611 181459
18043 -22178 86476 -315858 -364670 -106397 -7850 -289966 -217761 135864 113610 78530 -2306
18031 -139264 57724 138580 -389808 18449 100765 -246957 -348412 156383 -243146 -104056
18020 -15141 38177 -312909 -18720 -163565 63346 246099 -141037 91659 37381 55473 225100
$$ packed form
18100A54265b68950h9174B6270a97191a0069m09017B35587q2788J4828a68768
18089H2399B2957K22621c37012A59963N9875b04431A90889G8449a8532j20169
18079a38701k6583F7709a25203f0842l5732f909n7672K833P281D9310c3463A08771
18066b54213k1560F9607j4944d14262C26153f0018k28192R4681f1670j39001O5928
18055a34743e5747r6802a9655C10527j6421A1404K08290j654a47999P1388A81459
18043b2178H6476c15858m8812a06397g850k82116P2205A35864k2254l5080b306
18031a39264E7724Q0856c89808A8449Q2316b46957j01455A56383b43146a04056
18020a5141C8177c12909a8720j44845F3346J82753a41037I1659C7381J8092J69627
$$ plain form
18009 225100 193782 -69806 -376140 -155193 42268 -85546 35682 -381454 52659 -227510 410032
17997 64818 -124612 -138919 122724 -67717 -324732 -7853 51383 -58148 -19614 99838 73263
17986 73263 -267917 -244574 170843 131205 163717 19930 -204946 170809 8040 -129688 -172575
17975 -172575 130005 -261870 152454 -9444 -257138 4722 326546 217601 -118074 3676 -8531
17963 -134418 3151 99971 120812 -260222 -5836 -187499 -255068 36466 -302635 -143457 80774
17951 -59275 -21100 -191106 -70178 122379 -155624 158860 214713 -132778 163444 1575 -214775
17939 -132702 -31589 29208 -169356 -199519 305455 -457102 238098 -94608 6663 49526 -195944
17927 319335 -295199 108549 70240 148166 -219533 188396 -172031 165372 -146589 -140951
$$ packed form
18009B25100l1318f9806l06334a55193D2268h5546C5682c81454E2659b27510D10032
17997F4818a24612j4307A22724f7717k57015g853E1383e8148a9614I9838k6575
17986G3263b67917K3343A70843l9638L2512A9930b04946A70809H040a29688m2887
17975a72575A30005b61870A52454i444k47694D722L21824j08945a18074C676h531
17963a34418C151R6820K0841b60222e836j81663o7569C6466c02635a43457H0774
17951e9275b1100j70006g0178A22379a55624A58860N5853a32778A63444A575b14775
17939a32702c1589B9208a69356l0163C05455d57102B38098i4608F663M2863a95944
17927C19335b95199A08549l8309P7926b19533A88396a72031A65372a46589N638
$$ plain form
17917 -140951 -156146 -102827 280823 383271 -149736 -26554 335384 22860 158462 -24571
17906 189347 -125472 20368 192833 -134884 156760 -236967 -2880 -184883 -139292 -221612
17896 -221612 75584 30960 -83320 172776 -367815 -70976 6467 262904 154667 -414597 172186
17884 -135088 96784 -60766 116990 -40496 -210754 118324 11120 139607 11701 -132218
17873 -136583 -104920 131608 165247 163692 146180 -199003 -218928 -239609 246245 34750 -110744
17861 79707 115660 105860 -114482 -318765 50507 -153883 -64646 -197576 -107057 -59471 -35959
17850 -35959 204081 187806 -322788 -16059 -64751 -79446 262193 11856 -283902 -20371 -35788
17839 -35788 -205181 62485 -1399 5770 127122 -273826 103619 210255 -153125 -164400 -89363
$$ packed form
17917a40951j5195N3319B80823J02448a49736b6554C35384B2860J35602b4571
17906A89347a25472B0368J72465a34884A56760b36967b880j82003M5591q2320
17896b21612G5584C0960h3320A72776c67815g0976F467K56437j08237d14597A72186
17884a35088I6784f0766A16990d0496j70258A18324A1120J28487A1701a32218
17873a36583L1663A31608L3639j555j7512a99003j9925k0681B46245C4750a10744
17861G9707L5953r800a14482k04283E0507a53883f4646j32930R0519M7586K3512
17850c5959B04081j6275c22788a6059m8692j4695B62193A1856b83902b0371j5417
17839c5788j69393F2485a399E770J21352b73826A03619J06636a53125j1275P5037
$$ plain form
17828 -89363 289381 240677 43440 301624 160126 -96229 163441 -14949 77161 -49578 239373
17816 19780 81410 -6322 -157683 -29044 -47553 -100809 306865 52701 261407 98967 57538
17805 57538 29229 -335961 -86886 -72224 158117 -107422 -263955 -304289 -270589 -321584 49897
17793 9613 -69284 -197055 3702 94851 12142 49441 98547 119294 68368 154796 -165791 -17842
17780 -54633 181076 -81641 -8020 -11758 391088 -10534 -62309 11831 145482 -2144 -6192 128865
17767 319799 -251464 60210 -65109 274519 392599 -37698 -238274 -245022 706 164065 114813
17756 114813 -9350 16631 109270 -80585 -131421 38563 -51136 179055 -142280 -293406 -430494
17745 -430494 -25904 -34809 55987 44285 -13265 159788 111348 -107212 34811 -59837 230475
$$ packed form
17828h9363B89381m8704D3440K58184j41498i6229A63441a4949G7161d9578B39373
17816A9780O1630f322j51361b9044j8509n3256C06865E2701K08706I8967m1429
17805E7538k8309c35961h6886J4662A58117a07422j56533m0334L3700n0995D9897
17793I613f9284j27771C702R1149A2142L7299M9106K0747n0926Q6428a65791a7842
17780e4633A81076h1641h020l738C91088a0534n1775A1831J33651b144m048A28865
17767C19799b51464F0210f5109B74519J18080c7698k00576o748G06J63359m9252
17756A14813i350A6631R2639h0585n0836C8563e1136A79055a42280j51126j37088
17745d30494b5904q905E5987j1702a3265A59788m8440a07212C4811e9837B30475
$$ plain form
17733 -87565 2651 15153 124360 401696 -122127 -165909 47275 39810 -324996 -48830 -31692
17722 -31692 -93316 89296 93776 34682 62687 -53813 -49397 206378 44931 -292190 -72361 233566
17709 130658 -91733 165932 -210790 -74546 -65941 88469 -12828 -58155 -67953 -66653 -145365 108481
17696 -12580 88995 143681 165905 -233168 83845 -313168 -38151 -166817 42318 -99080 -130011
17685 -130011 -51215 -22906 35348 -44694 -250967 144507 -47107 119119 -48140 -95563 -193466
17674 -193466 -448059 219104 50536 -181686 58008 80428 -188322 45220 -24018 -325019
17664 -325019 133152 212643 190902 -63454 -85885 84069 53057 123734 -132317 -150354 -131498
17653 -131498 34423 28524 -269887 -271186 50688 60681 100897 125180 -159269 -350680 -120486
$$ packed form
17733h7565B651J2502J09207K77336a22127m3782D7275p465c24996d8830J7138
17722c1692o1624H9296M480C4682K8005e3813M416B06378D4931b92190g2361B33566
17709A30658i1733A65932b10790g4546Q605H8469a2828m5327r798J300p8712A08481
17696a2580H8995N4686K2224b33168H3845c13168c8151j28666D2318i9080l0931
17685a30011e1215b2906C5348d4694k06273A44507d7107A19119d8140m7423r7903
17674a93466k54593B19104E0536a81686E8008K2420a88322D5220b4018l01001
17664c25019A33152P9491k1741f3454k2431H4069l1012P0677a32317j8037J8856
17653a31498C4423n899b69887j299E0688R993M0216K4283a59269j91411a20486
$$ plain form
17641 289185 40269 13083 84768 189779 188202 232177 25124 433 237634 77045 -9823 -196298
17629 -196298 -87012 111727 172467 53887 37204 -53493 31737 -247299 283602 14260 -204481
17617 109200 -62291 -117591 111252 -111624 223979 -145827 210901 484001 154766 146430
17607 146430 -213360 59224 -66803 92611 -176567 -168750 -4913 128306 262989 364789 96884
17595 118831 -156294 -52906 61866 353180 -215924 -283969 97859 299625 73935 -131587
17584 -170556 30936 191973 206849 90940 217772 -70112 -131217 157967 -184276 164964
17573 -26380 75461 -141330 318395 -50218 192635 200993 -205009 120461 110784 292070 -117664
17561 96164 206090 217891 -131234 -174525 -514166 -209300 132091 26292 -8921 -296259 254475
$$ packed form
17641B89185D0269A3083P1685J05011j577M3975B5124D33K37201G7045i823j86475
17629a96298h7012A11727O0740E3887j6683e3493C1737b47299B83602A4260b04481
17617A09200f2291n5300A11252a11624B23979a45827B10901K73100A54766q336
17607A46430b13360E9224f6803I2611a76567P817d913A28306J34683J01800I6884
17595A18831a56294e2906F1866K91314b15924o8045I7859K01766G3935a31587
17584a70556C0936J61037J4876I0940J26832g0112o1105A57967a84276A64964
17573b6380G5461a41330C18395e0218A92635Q358b05009A20461r677J81286a17664
17561I6164J09926J1801a31234m3291l39641b09300A32091B6292h921k87338B54475
$$ plain form
17549 399893 63157 268649 -1357 -8264 326661 -108914 256577 71049 -92625 185570 189654
17538 189654 -57131 -54355 101156 11146 6938 -102668 15561 255565 -241674 63049 -91868
17526 6469 -4070 -38155 15978 -434806 149364 210911 176501 186210 311332 -13839 64532 169581
17514 169581 118946 -43714 4950 -87103 131007 189136 210858 -148795 -287398 88558 64082
17503 64082 -436083 252245 -216031 50193 163334 398772 -4818 278480 -142459 60604
17492 -2830 -40760 143391 176372 397945 303307 301942 57411 57251 -31679 136228 74341 -85286
17479 86389 -50479 -116354 303143 65519 -146758 321208 235637 395783 179791 -200067
17468 -63526 168174 -1708 306768 -2230 -290261 170458 36314 -119549 39945 236086 198238
$$ packed form
17549C99893F3157K05492a357o907C26661a08914B56577G1049i2625A85570M084
17538A89654e7131K776A01156A1146m208a02668A5561K40004b41674F3049i1868
17526F469d070l4085A5978d34806A49364O1547l4410R709J25122a3839F4532J05049
17514A69581n0635d3714D950h7103A31007N8129K1722a48795j38603H8558k4476
17503F4082d36083B52245b16031E0193J13141K35438d818B78480a42459F0604
17492b830l7930A43391L2981K21573r4638j365E7411j60c1679A36228o1887h5286
17479H6389e0479o5875C03143F5519a46758C21208q5571J60146A79791b00067
17468f3526A68174a708C06768b230k88031A70458C6314a19549C9945J96141l7848
$$ plain form
17457 198238 34556 257248 -79247 242558 209821 144802 495412 79118 50574 95924 231094
17446 231094 486770 -143587 -26745 369330 252607 241923 164901 257767 332692 -29084 69411
17434 478632 64126 452009 14404 78584 -67009 338107 88282 -81091 16548 327763 203413
17423 203413 84645 271941 -6375 -159947 146832 292544 143707 144970 84014 -87892 128026
17411 -76629 167502 83023 363016 57146 220225 6833 380349 31015 15241 241019 45828
17399 93429 -86349 18658 -203192 -97911 161105 257528 77696 291231 364397 -93652 342471
17387 -25064 82921 34070 142759 43572 -122298 211833 -92799 145437 -26625 38524 -17867
17375 336692 236187 15425 206445 15980 132655 94525 190606 360756 -167262 5688 117216
$$ packed form
17457A98238C4556K22692g9247B42558l2737o5019L50610G9118k8544M5350J35170
17446B31094K55676a43587b6745C69330j16723j0684p7022R2866P4925b9084F9411
17434D78632F4126L87883A4404O4180f7009C38107H8282h1091A6548L11215j24350
17423B03413H4645J87296f375j53572A46832J45712A43707J263o0956h7892A28026
17411g6629A67502H3023K79993E7146J63079F833L73516C1015A5241K25778D5828
17399I3429h6349A8658b03192i7911A61105R6423G7696K13535P3166i3652C42471
17387b5064H2921C4070J08689D3572a22298B11833i2799A45437b6625C8524a7867
17375C36692j00505A5425J91020A5980J16675l8130R6081J70150a67262E688J11528
$$ plain form
17364 117216 53818 213534 336698 87503 275177 -108369 57695 -43894 271616 96666
17353 210439 82551 -125073 119212 246427 117173 -71530 -492517 -19840 328598 37146
17342 163730 169172 186971 118915 208274 125478 -60824 -80343 -71285 1075 47397 352497 32845
17329 -6831 89975 161789 -11502 185778 -64174 38750 134234 24947 171510 240380 141902
17318 141902 -73989 -33782 67673 67568 691744 24158 15696 223423 400741 20942 119967
17307 119967 167760 105088 168118 -92979 -148319 87872 -48134 234337 -113290 360301 219865
17296 219865 91666 91175 238186 384440 380788 259657 159507 -122078 50684 27502 -28494
17284 408115 22492 207661 -96621 102218 175598 103467 52318 148087 -31517 51294 -15023
$$ packed form
17364A17216E3818J59716J23164H7503J87674a08369E7695d3894B71616I6666
17353B10439H2551a25073A19212J27215A17173g1530m20987a9840C28598C7146
17342A63730N442J7799o8056Q9359q2796f0824j9519R058A075M6322L05100C2845
17329f831H9975P1814a1502A85778f4174C8750R5484B4947J46563O8870r8478
17318A41902g3989c3782F7673j05O24176B4158q462K07727J77318B0942R9025
17307A19967M7793o2672O3030i2979n5340H7872d8134B34337a13290C60301j40436
17296B19865I1666m91J47011J46254l652j21131j00150a22078E0684k3182b8494
17284D08115B2492J85169i6621A02218P3380p2131n1149R5769c1517E1294a5023
$$ plain form
17272 38665 -78230 706363 458434 89849 128407 7204 37528 187053 224137 -7819 -88542
17261 -88542 -5370 326562 -34170 -56134 215447 -96975 -161640 267119 386 347703 361184
17250 361184 259041 203369 272748 162509 10238 68631 213678 52872 38902 379624 377416
17239 377416 -11312 464737 108407 170376 1047 72168 230697 155244 -15025 203092 121476
17228 121476 24195 4975 -4519 95040 50313 262582 12043 -43414 107030 -8476 158831
17216 215258 345240 71849 209656 94913 257807 23521 275257 -211216 355338 67091
17205 455156 426404 144168 12539 227230 -26364 155965 356037 456459 83580 239255
17195 239255 285640 380266 323788 -27434 423141 491167 222290 333404 277059 172841 90391
$$ packed form
17272C8665g8230G06363k47929H9849L8558G204L0324J49525L7084g819q0723
17261h8542e370C26562c4170k1964B15447i6975o4665B67119C86L47317J3481
17250C61184j02143n5672O9379j10239A0238N8393J45047E2872j3970L40722k208
17239C77416a1312D64737A08407O1969A047P1121J58529p5453a5025B03092q1616
17228A21476B4195D975d519I5040m4727K12269A2043d3414A07030h476A58831
17216B15258J29982G1849J37807I4913J62894B3521K51736b11216C55338F7091
17205D55156k8752A44168A2539K14691b6364A55965K00072J00422H3580J55675
17195B39255M6385R4626n6478b7434D23141O8026B22290J11114n6345j04218q2450
$$ plain form
17184 90391 389683 333707 155434 -47710 413582 97545 31150 259072 387506 -207300
17173 331418 678545 252719 276729 19486 327213 468865 178984 146569 583132 4252
17162 351659 276423 90175 394489 288260 336610 172054 371141 220708 244594 269652
17152 269652 194451 255640 415649 385574 43084 534985 -120094 461634 468331 423368 164723
17140 147617 336766 211886 720667 157174 176806 504630 371748 147066 179879 106612
17130 106612 305844 447626 255705 400403 178105 336134 -24921 11585 1279 183585
17120 183585 228993 511940 708436 455400 68519 146176 377698 364040 251163 261373
17110 261373 274656 284551 117254 330023 211481 336690 400649 211699 174009 284496
$$ packed form
17184I0391K99292n5976A55434d7710D13582I7545C1150K27922J28434b07300
17173C31418L47127B52719K4010A9486L07727J41652A78984l2415M36563D252
17162C51659p5236I0175L04314j06229M8350j64556J99087j50433K3886K5058
17152B69652p5201O1189J60009l0075D3084M91901a20094D61634O697m4963A64723
17140A47617J89149j24880N08781A57174J9632L27824j32882A47066L2813p3267
17130A06612J99232J41782j91921J44698A78105J58029b4921A1585A279J82306
17120A83585M5408K82947J96496k53036F8519P7657K31522j3658j12877J0210
17110B61373J3283R895A17254K12769j18542J25209O3959j88950l7690J10487
$$ plain form
17100 284496 -36647 204285 316298 576431 210206 252259 465951 471064 550273 35788 313503
17089 313503 307640 347048 376091 241363 304872 244821 516427 114104 359458 527819 369988
17078 369988 318978 369635 63173 375161 393243 439276 604576 266049 492145 395674 453730
17067 453730 375858 521440 461071 343904 346577 539867 289701 443227 456374 646336
17057 646336 325559 541289 476858 411562 446389 351610 431759 242846 386074 666072
17047 666072 611381 380677 623474 581038 705559 309159 736523 396539 633468 589390
17037 589390 682691 598483 554686 695807 258775 337027 247368 425642 721876 747214 783436
17026 783436 610442 624368 713951 604202 659039 486765 401567 497535 558470 911759 416274
$$ packed form
17100B84496c6647B04285J12013K60133B10206M2053K13692N113P9209C5788K77715
17089C13503n863L9408K9043j34728O3509o0051K71606A14104K45354J68361j57831
17078C69988n1010N0657F3173L11988J8082M6033J65300B66049K26096r6471N8056
17067D53730p7872J45582o0369j17167K673J93290k50166J53526J3147J89962
17057F46336l20777K15730o4431o5296L4827r4779Q0149j88913J43228K79998
17047F66072n4691k30704K42797m2436J24521C09159M27364l39984K36929m4078
17037E89390R3301q4208m3797J41121B58775P8252q9659J78274K96234K5338L6222
17026G83436j72994J3926Q9583j09749N4837j72274q5198R5968O0935L53289D16274
$$ plain form
17014 707574 528931 846540 628449 520448 490425 704805 408343 560833 650058 731440
17004 731440 694711 328037 655215 788445 490241 619039 467552 713036 733290 659630
16994 659630 850279 443685 630746 861968 896191 927111 1099449 676688 674542 691038
16984 691038 622047 732737 628682 698221 878470 504654 888256 734518 1249116 1099895
16974 1099895 726929 813600 469533 942038 1117455 991473 1236946 695126 821807 737471
16964 737471 681010 820912 825146 963099 1057726 663996 904381 1015732 1141119 1012143
16954 1012143 419470 1086316 800114 833560 1141185 1068258 1027292 1189524 1004905 1287356
16944 1287356 1275079 865428 1170439 1153480 788799 815072 1236210 1131711 1307954 1336124
$$ packed form
17014G07574j78643L17609k18091j08001l0023K14380k96462J52490Q9225Q1382
17004G31440l6729C28037L27178J33230k98204J28798j51487K45484K0254p3660
16994F59630J90649m06594J87061K31222L4223L0920J72338m22761k146J6496
16984F91038o8991J10690j04055O9539J80249l73816L83602j53738N14598j49221
16974A099895l72966Q6671l44067M72505J75417j25982K45473n41820J26681q4336
16964G37471n6461J39902M234J37953R4627l93730K40385J11351J25387j28976
16954A012143D19470O66846k86202L3446L07625p2927m0966J62232j84619K82451
16944A287356j2277m09651L05011j6959l64681K6273M21138j04499J76243K8170
$$ plain form
16934 1336124 788594 979704 1178570 1030955 979881 1171520 1118436 1187948 1149720 995261
16924 995261 1345301 1096211 1116652 1278322 1164617 1432492 1402646 1379327 1333178 1592088
16914 1592088 1316830 1199359 1280668 1343596 1156458 1320630 1560263 1381611 1567777 1335111
16904 1335111 1600739 1705152 1558803 1597375 1501121 1693365 1849794 1776713 1622274 1623250
16894 1623250 1986454 1866736 1753407 1605662 1690964 1861994 1880298 1803022 1976284 1841951
16884 1841951 2067816 1781994 1704879 2183235 1783927 2190880 2273904 2019297 2218673 2221758
16874 2221758 2116310 2455547 2146770 2430707 1954376 2330328 2146600 2415092 2346375 2110231
16864 2110231 2411944 2314834 2489608 2644985 2380495 2765195 2860448 2662916 2633711 2696269
$$ packed form
16934A336124n47530J91110J98866j47615n1074J91639n3084O9512l8228j54459
16924I95261L50040k49090K0441J61670j13705K67875k9846k3319m6149K58910
16914A592088k75258j17471Q1309O2928j87138J64172K39633j78652J86166k32666
16904A335111K65628J04413j46349L8572r6254J92244J56429p3081j54439R76
16894A623250L63204j19718j13329j47745Q5302J71030J8304p7276J73262j34333
16884A841951K25865k85822p7115M78356l99308M06953Q3024k54607J99376L085
16874B221758j05448L39237l08777K83937m76331L75952j83728K68492o8717k36144
16864B110231L01713r7110J74774J55377k64490L84700R5253j97532k9205O2558
$$ plain form
16854 2696269 2852281 2702997 2770217 3153549 2936263 2991284 3360832 3178801 3082849 3221611
16844 3221611 3087748 3292792 3300724 3327964 3482594 3438232 3749909 3587794 3970033 3401652
16834 3401652 3625871 3600974 3693724 4162965 3992077 3862640 4358521 4232041 4325364 4273009
16824 4273009 4429464 4360913 4739100 4604276 4987500 4620272 5128005 5375965 5232365 5422530
16814 5422530 5563025 5294640 5481919 5826062 5658737 6024171 5967842 5969925 6212553 6588767
16804 6588767 6329735 6641598 6731177 6963373 7331267 7741508 7663648 7596558 7934060 7857403
16794 7857403 8283324 8507077 9071941 8711384 9100641 9690939 9591347 9964305 10049495 10393640
16784 10393640 10811113 11178203 11197303 11715953 12180294 12067609 12602541 13213392 13244478 13811084
$$ packed form
16854B696269J56012j49284O7220L83332k17286N5021L69548j82031r5952J38762
16844C221611j33863K05044P932K7240J54630m4362L11677j62115L82239n68381
16834C401652K24219k4897R2750M69241j70888j29437M95881j26480R3323n2355
16824D273009J56455o8551L78187j34824L83224l67228N07733K47960j43600J90165
16814E422530J40495k68385J87279L44143j67325L65434n6329K083K42628L76214
16804F588767k59032L11863Q9579K32196L67894M10241p7860o7090L37502p6657
16794G857403M25921K23753N64864l60557L89257N90298r9592L72958Q5190L44145
16784A0393640M17473L67090J9100N18650M64341j12685N34932O10851L1086N66606
$$ plain form
16774 13811084 14279521 14623890 15377179 15846412 16284309 16735024 17208714 17910221 18482961
16765 18482961 19230200 19842108 20445092 21523358 22474830 23175484 23913257 24778118 25875429
16756 25875429 26866438 28206107 29228102 30763706 32000765 33294923 35280178 36587761
16748 36587761 38230826 40098919 42387395 44073756 46623122 48937757 51509413 54580714
16740 54580714 57502325 60675523 64129017 67638005 71512841 75802535 80212297 85013820
16732 85013820 90136371 95389241 100692866 106608925 112701203 118919881 126156305 132322445
16724 132322445 139426295 145563293 151708832 157452546 162764586 167439547 171339917 174361883
16716 174361883 176576809 176970480 176648592 175201972 172684685 169006670 164346379 159105756
$$ packed form
16774A3811084M68437L44369P53289M69233M37897M50715M73690P01507N72740
16765A8482961P47239O11908O02984J078266R51472P00654P37773Q64861J097311
16756B5875429R91009J339669J021995J535604J237059J294158J985255J307583
16748C6587761J643065J868093K288476J686361K549366K314635K571656L071301
16740E4580714K921611L173198L453494L508988L874836M289694M409762M801523
16732H5013820N122551N252870N303625N916059O092278O218678P236424O166140
16724A32322445P103850O136998O145539N743714N312040M674961L900370L021966
16716A74361883K214926L93671l21888j446620k517287l678015m660291n240623
$$ plain form
16708 159105756 153549776 147524006 140920697 133858369 127056029 120658275 114085992 107753896
16700 107753896 101686422 95918431 90317337 85396198 80521586 75773019 71517527 67336857
16692 67336857 63675232 60186238 57006005 53578143 51102777 48236233 45722273 43519748
16684 43519748 41465136 39789361 37345905 35946130 33940751 32460767 31047196 29532638
16676 29532638 28359084 27081023 26025791 25144026 23649865 22903452 22032013 20844945
16668 20844945 20273098 19637275 18853864 17867835 17347853 16744922 16342519 15624265 15145359
16659 15145359 14831594 14235514 13859526 13118815 12992232 12661586 11733096 11774374 11243730
16650 11243730 11049805 10675480 10322219 10110469 9859603 9267073 9339239 9233181 8621503
$$ packed form
16708A59105756n555980o025770o603309p062328o802340o397754o572283o332096
16700A07753896o067474n767991n601094m921139m874612m748567m255492m180670
16692F7336857l661625l488994l180233l427862k475366k866544k513960k202525
16684D3519748k054612j675775k443456j399775k005379j479984j413571j514558
16676B9532638j173554j278061j055232q81765j494161p46413q71439j187068
16668B0844945n71847o35823p83411r86029n19982o02931m02403p18254m78906
16659A5145359l13765n96080l75988p40711j26583l30646r28490M1278n30644
16650A1243730j93925l74325l53261k11750k50866n92530P2166j06058o11678
$$ plain form
16641 8621503 8668115 8312202 8085344 8001062 7697088 7410371 7279458 7074992 6921729 6756043
16631 6756043 6391050 6379112 6214638 5941664 6143759 5816414 5917975 5299956 5709696 5474430
16621 5474430 5331177 5137269 5109507 5015751 4763544 4818844 4712417 4584954 4429835 4325780
16611 4325780 4589937 3951723 3701765 3969292 3807952 3884231 4093997 3926413 3939432 3897185
16601 3897185 3754230 3548729 3250009 3261287 3406132 2923954 3070535 3194930 3223858 3254763
16591 3254763 2920201 2729430 2994065 2940760 2345566 2780126 2764265 2603093 2344457 2816574
16581 2816574 2679080 2505845 2096490 2165264 2591327 2284125 1977486 2116558 2117477 2480092
16571 2480092 1990554 2060287 1690244 2041872 2083802 2285407 1661685 2160579 1878790 1967950
$$ packed form
16641H621503M6612l55913k26858q4282l03974k86717j30913k04466j53263j65686
16631F756043l64993j1938j64474k72974K02095l27345J01561o18019M09740k35266
16621E474430j43253j93908k7762r3756k52207N5300j06427j27463j55119j04055
16611D325780K64157o38214k49958K67527j61340P6279K09766j67584J3019m2247
16601C897185j42955k05501k98720J1278J44845m82178J46581J24395K8928L0905
16591C254763l34562j90771K64635n3305n95194M34560j5861j61172k58636M72117
16581B816574j37494j73235m09355O8774M26063l07202l06639J39072R19L62615
16571B480092m89538O9733l70043L51628M1930K01605o23722M98894k81789Q9160
$$ plain form
16561 1967950 1811415 1969729 1836856 1930488 1423242 1566207 1669595 1486416 1899089 1846631
16551 1846631 1453862 1624612 1736310 1852380 1446719 1638982 1323817 1624874 1421918
16542 1421918 1526891 1511876 1371382 1569188 1586553 1297019 1560143 1260163 1375362 1484492
16532 1484492 1538813 1376185 1175643 1444055 1100315 1161257 986307 1363391 1262678 1163812
16522 1163812 1246449 884116 1079430 940839 1277586 1007638 1222596 1128850 1148170 1091596
16512 1091596 1081440 1015369 822208 783932 765191 765147 963898 821947 837614 776000 979353
16501 979353 1220895 910387 874744 1225724 1050132 818115 769834 958387 740259 1062860
16491 1062860 760552 553440 518675 858571 494214 571324 642768 854015 725453 672623
$$ packed form
16561A967950j56535J58314j32873R3632n07246J42965J03388j83179M12673n2458
16551A846631l92769J70750J11698J16070m05661J92263l15165L01057k02956
16542A421918J04973j5015j40494J97806J7365k89534K63124k99980J15199J09130
16532A484492N4321j62628k00542K68412l43740O0942j74950L77084j00713r8866
16522A163812Q2637l62333J95314j38591L36747k69948K14958r3746J9320n6574
16512A091596j0156o6071j93161l8276j8741m4J98751j41951J5667o1614K03353
16501I79353K41542l10508l5643L50980j75592k32017m8281J88553k18128L22601
16491A062860l02308k07112l4765L39896l64357P7110P1444K11247j28562n2830
$$ plain form
16481 672623 936098 523135 695477 818791 824738 445114 595935 691408 659415 585074
16471 585074 557512 701042 389497 792569 815033 450102 707330 641055 499341 389619
16461 389619 545940 484385 669546 990800 582218 296945 435294 417977 644029 620744
16451 620744 301990 405175 639415 669304 458332 526368 835984 409038 467254 554856
16441 554856 920824 510230 508407 703482 733875 293528 136163 434962 576794 331008
16431 331008 342504 548981 361269 442819 186484 258132 706196 354818 190929 352354
16421 352354 440044 328686 453116 568700 240961 214798 345176 290470 371260 282126
16411 282126 286021 552869 492625 366785 58067 519173 311829 196580 499431 199383
$$ packed form
16481F72623K63475m12963J72342J23314N947l79624J50821R5473l1993p4341
16471E85074k7562J43530l11545M03072K2464l64931K57228o6275j41714j09722
16461C89619J56321o1555J85161L21254m08582k85273J38349j7317K26052k3285
16451F20744C01990J03185K34240K9889k10972O8036L09616D09038N8216Q7602
16441E54856L65968m10594j823J95075L0393B93528A36163K98799J41832k45786
16431C31008J1496K06477j87712Q1550A86484P1648M48064l51378j63889J61425
16421C52354Q7690j11358J24430J15584B40961k6163J30378n4706Q0790q9134
16411B82126L895K66848o0244j25840E8067M61106k07344j15249L02851A99383
$$ plain form
16400 208348 395612 206571 527600 364365 455810 635204 225612 312735 333261 443577
16390 443577 43295 381502 357228 231412 478804 110855 356066 379641 232704 644195
16380 644195 510056 351687 -15532 473724 300876 442019 322228 238353 352068 625927
16370 625927 102058 235610 325773 289346 390893 413745 429307 696703 134094 376716
16360 376716 399949 308367 -29905 287967 137685 298963 233675 172978 243504 196478 351609
16349 351609 247870 107372 271747 437788 70789 241184 542403 263692 255664 1012
16338 -34417 136931 442940 71078 -105196 576513 345135 237885 564128 -7470 161877
16327 241085 343067 158941 553484 229914 -82926 167850 256328 241052 49716 119935
$$ packed form
16400B08348J87264j89041L21029j63235R1445J79394B25612Q7123K0526J10316
16390D43577D3295L38207k4274j25816K47392A10855K45211K3575j46937M11491
16380F44195j34139j58369a5532D73724j72848J41143j19791q3875J13715K73859
16370F25927A02058J33552R0163l6427J01547K2852J5562K67396A34094K42622
16360C76716K3233r1582b9905B87967A37685J61278o5288o0697P0526m7026J55131
16349C51609j03739A07372J64375J66041G0789J70395L01219B63692q028A012
16338c4417A36931L06009G1078a05196E76513k31378j07250L26243g470A61877
16327B41085J01982A58941L94543B29914h2926A67850Q8478j5276D9716P0219
$$ plain form
16317 119935 296065 75187 560904 97963 113112 -70284 -177741 -74043 7202 431045 440771
16306 440771 153202 10839 87475 6942 319386 280778 363195 -123259 -111377 202671 77089
16294 183297 340099 126211 469466 -78027 -31398 93102 109185 98066 -359068 113254
16283 9185 89187 228781 297383 268769 244455 -32372 304963 117241 13231 23202 103044
16272 103044 -22343 294913 -114782 -45738 127608 455287 13340 142124 -69754 -32627
16261 -49253 374935 -204320 69636 353908 -106025 64420 285450 162492 239212 79287
16250 -48463 161601 505875 2925 240678 60996 -37130 24485 179628 -20279 -47010 -203977
16239 -203977 5171 -234001 161172 77777 211025 19761 128789 144151 445880 189989
$$ packed form
16317A19935J76130G5187M85717I7963J5149g0284j07457g4043G202M23843R726
16306D40771A53202A0839P6636F942L12444l8608Q2417a23259J1882B02671G7089
16294A83297J56802A26211L43255g8027c1398I3102J6083j1119c59068A13254
16283I185Q0002J39594O8602k8614k4314c2372C04963A17241A3231R971P9842
16272A03044b2343B94913a14782d5738A27608L27679A3340J28784f9754c2627
16261d9253C74935b04320F9636K84272a06025F4420K21030j22958P6720G9287
16250d8463A61601L44274B925K37753F0996c7130B4485J55143b0279k6731j56967
16239b03977E171b34001A61172G7777J33248A9761J09028J5362L01729A89989
$$ plain form
16228 -163437 -64917 7811 95647 135473 317086 217870 65127 6446 108943 32816 -95814
16216 293770 238384 22860 22786 -6093 184603 -117159 138640 86011 150868 -106037 31595
16204 249851 242222 -98959 140889 374659 -86316 175375 264195 54506 230398 110335 -44952
16192 -165422 -60672 115845 -149748 349113 140829 -165775 71165 431295 86450 126600
16182 126600 408188 32750 -2661 113412 51282 37082 138604 142565 15815 120040 357703
16171 357703 14609 -108819 151305 157527 235329 154138 79922 -114642 96051 -395765 134341
16159 48412 37965 -118271 35419 -18757 250663 38596 99534 -245467 176943 -49527 -149280
16148 -149280 35192 -168644 -69612 -153124 283742 11261 109611 250846 197991 -74873 111060
$$ packed form
16228a63437f4917G811Q7836L9826J81613r9216F5127F446J02497C2816i5814
16216B93770n5386B2860p4f093A84603a17159A38640n2629O4857a06037C1595
16204B49851p629i8959A40889K33770h6316A75375Q8820E4506J75892A10335d4952
16192a65422f0672A15845a49748C49113A40829a65775G1165L60130H6450M0150
16182A26600K81588C2750b661A13412E1282j4200J01522L961A5815J04225K37663
16171C57703A4609a08819A51305O222P7802q1191p4216a14642I6051c95765A34341
16159D8412j0447a18271C5419a8757B50663C8596O0938b45467A76943d9527r9753
16148a49280C5192a68644f9612q3512B83742A1261R8350J41235n2855g4873A11060
$$ plain form
16136 -159749 -28036 -133596 12868 5407 64465 -56807 -165398 33771 7454 222178 -421043
16124 31088 291726 -355505 77079 229126 -13933 156125 -85774 46078 -126121 -180070 -66731
16112 92623 -121374 -6988 131944 -99359 44854 123654 39398 210231 43017 97341 222523
16101 222523 183764 86903 50909 -165019 -142581 -30488 -74529 141989 64351 403751 -170875
16089 -117302 14980 -17761 -105775 -23870 -63565 29451 -94972 -94526 80249 218272 -40251 274587
16076 308605 -127043 -252098 -94622 -139965 -60019 124474 195745 -48437 5042 -55379 36629
16064 -186442 -129611 -227759 -300220 -7423 -300664 -103955 469537 193945 104173 -95828 291832
16052 -217037 -188096 -164203 -38733 201643 -192641 115108 -107298 34523 18021 7008 5827
$$ packed form
16136a59749b8036j05560A2868E407N9058e6807j08591C3771G454K14724d21043
16124C1088K60638c55505G7079J52047a3933A56125h5774D6078a26121n3949f6731
16112I2623a21374f988A31944i9359D4854P8800C9398J70833D3017N4324J25182
16101B22523l8759H6903l5994a65019K2438c0488m4041A41989F4351L39400a70875
16089a17302A4980a7761q8014b3870l9695B9451i4972M46H0249J38023d0251B74587
16076C08605a27043j25055i4622m5343f0019A24474P1271d8437E042e5379C6629
16064a86442N6831r8148p2461g423k93241a03955D69537A93945q9772i5828B91832
16052b17037K8941K3893c8733B01643a92641A15108a07298C4523j6502G008j181
$$ plain form
16041 5827 164964 -125224 -105860 311224 -3390 -231233 -69958 -35599 -270446 -81042 58637
16029 -259310 -168537 -70120 22267 107017 161234 -155543 11755 -29888 34369 -299264 153744
16017 -8391 28920 113497 -128204 53698 -42282 -69231 185300 -18594 146763 -58871 282863
16005 106781 -91709 148706 -191716 256006 16215 10390 184008 100443 85204 -8865 -15351
15994 -15351 -48403 92938 -155692 19409 -132574 44378 179456 -3153 -77253 71641 288534
15983 288534 238288 189318 256913 59357 87467 33238 10785 -330005 -180365 62487 103961
15972 103961 109915 -123767 101237 -160457 21245 -71467 173991 189638 -52766 -239939 62196
15960 199595 214131 -62323 165847 9865 -75822 -57260 -319880 -614314 -268683 -23345 179320
$$ packed form
16041E827J59137a25224J9364C11224c390k27843f9958L4359k34847h1042E8637
16029b59310R0773g0120B2267Q4750N4217a55543A1755b9888C4369b99264A53744
16017h391B8920Q4577a28204E3698d2282k6949A85300a8594A46763e8871B82863
16005A06781i1709A48706a91716B56006A6215n825J73618q3565j5239h865o486
15994a5351l3052I2938a55692A9409a32574D4378J35078c153p4100G1641K16893
15983B88534n0246m8970O7595E9357K8110C3238A0785c30005J49640F2487M1474
15972A03961N954a23767A01237a60457B1245g1467A73991J5647e2766j87173F2196
15960A99595J4536f2323A65847I865g5822J8562k62620k94434b68683b3345A79320
$$ plain form
15948 290905 -104130 -193774 149418 -14910 -53756 -32500 -160640 53133 -165930 42800 -225267
15936 -189247 -102995 -61689 -126553 -75349 234733 -481896 -36165 274230 -167889 -87787 -118385
15925 -118385 72061 -151804 -157270 -145246 251863 181450 74148 -166162 90261 -61981 79863
15913 -132003 372731 -325428 51401 102614 177621 134275 -202790 -331855 85240 -440222
15902 -214487 6519 -343221 107116 12626 84705 -365629 -203364 -410557 -10874 153782
15891 231764 -35036 -253826 -17423 -116626 -157028 -329658 69348 232522 -254109 -61350 415180
15879 -48693 -226381 -17275 9523 -229918 -20238 -87770 -144836 70288 -94953 75182 -154087
15867 -342021 93052 -185172 239108 -263364 27469 -108488 171855 151174 113998 55301
$$ packed form
15948B90905a04130q9644A49418a4910l8846K1256j28140E3133a65930D2800b25267
15936a89247Q6252M1306o4864N1204B34733d81896c6165B74230a67889Q0102l0598
15925a18385G2061a51804n466J2024B51863p0413G4148a66162I0261f1981G9863
15913a32003C72731c25428E1401N1213P5007m3346b02790j29065H5240d40222
15902b14487F519c43221A07116A2626P2079c65629J62265k07193a0874A53782
15891B31764c5036k18790a7423r9203m0402j72630F9348J63174b54109f1350D15180
15879d8693j77688a7275I523b29918b0238o7532n7066G0288i4953G5182a54087
15867c42021I3052a85172B39108b63364B7469a08488A71855k0681l7176E5301
$$ plain form
15856 -37076 -27038 -192634 266423 -1826 131531 74152 -147225 25517 146165 -63279 -141573
15845 -141573 -275399 -90836 149753 -129803 -13554 47942 175740 -41436 -13898 -139011
15835 -139011 181716 296471 -189045 -21884 -132429 10298 371204 -104019 -200983 39789
15824 -62348 -19443 79828 129218 -1896 -149706 186332 -133961 -386541 -292691 -220244 -76333
15812 -62402 -29245 486884 -98252 -144766 -299741 46548 -62912 193525 -88816 117567 -161898
15800 58820 54840 -312957 -123376 -43071 -126903 -165667 -254357 109860 312203 -69983 174988
15788 -49294 22830 64733 315583 -142319 -142810 -287563 -90204 49458 -128208 295795 90852
15776 -129257 -113274 -400057 184891 7388 77427 -362706 -92537 -154280 12794 -111479 -104738
$$ packed form
15856c7076J0038j65596B66423a826A31531n7379a47225B5517J20648f3279p8294
15845a41573j33826i0836A49753a29803a3554D7942J27798d1436a3898j25113
15835a39011A81716J14755a89045b1884j10545A0298L60906a04019r6964C9789
15824f2348a9443G9828M9390a896j47810A86332a33961k52580R3850P2447g6333
15812f2402b9245D86884i8252m6514j54975D6548f2912A93525h8816A17567a61898
15800E8820l980c12957a23376d3071q3832l8764q8690A09860K02343f9983A74988
15788d9294B2830M1903K50850a42319m91j44753i0204D9458a28208B95795I0852
15776a29257J5983k86783A84891G388P0039c62706i2537o1743A2794a11479O741
$$ plain form
15765 -104738 -154520 -136101 -294784 -190794 199210 223138 -26096 432063 112354 -32252
15754 126168 26062 151964 47956 -138807 -139135 164976 -71406 -179413 175780 142595 19865
15742 227393 124669 338462 -94780 -2858 79850 298893 -56374 17038 162699 47351 -34594
15730 266396 -22140 279704 -121589 -57327 -35854 -420404 -453288 69788 -54114 126347 -99253
15718 -297925 -23815 -40325 -138023 185525 118618 72361 177706 -204086 105994 -279816
15707 123768 61201 -144135 -198712 -43843 -27459 275993 72892 -75937 -317027 95537 221447
15696 221447 -130627 62694 -180248 49936 228647 106446 -297457 -242467 -243349 -355415 136324
15684 -53693 -55364 -176899 216181 64126 -95153 75525 -145569 57381 1200 -160171 -310428
$$ packed form
15765a04738m9782J8419j58683J03990A99210K3928b6096D32063A12354c2252
15754A26168B6062J25902D7956a38807l28A64976g1406j08007A75780l3185A9865
15742B27393j02724K13793i4780b858G9850K19043e6374A7038J45661D7351c4594
15730B66396b2140B79704a21589e7327K1473l84550l2884F9788e4114A26347i9253
15718b97925b3815j6510r7698A85525o6907m6257J05345b04086A05994b79816
15707A23768F1201a44135n4577d3843J6384B75993G2892g5937k41090I5537J25910
15696B21447a30627F2694a80248D9936J78711A06446b97457N4990q82j12066A36324
15684e3693j671j21535B16181F4126i5153G5525a45569E7381A200a60171j50257
$$ plain form
15673 -310428 28820 314508 1909 269384 -2096 17312 88230 188584 -30970 -224936 -127779
15662 -127779 -434395 -7442 -8791 -115011 23109 -248065 -408969 -151878 -163771 15525 -142927
15650 224879 -108977 -122274 178304 -168856 189258 -165133 -94010 -226009 304270 32520
15639 -132187 -225109 -280165 -94294 2116 122900 17475 -132398 -135121 -305481 64064 274824
15628 274824 -130357 -536957 -53544 -141842 69720 -165355 20020 -84327 420666 -242983
15617 2660 171957 -29939 -56575 -154781 200968 -65976 133570 -142762 -80111 15160 -117527
15605 -289362 -22539 143257 -117146 174154 -56631 -138895 -9362 -137937 -296724 63690 -160341
15593 -177563 121030 -47010 -19164 147436 428199 166486 -198339 4448 -255015 246188
$$ packed form
15673c10428B8820K85688A909K67475b096A7312P0918J00354c0970j93966R7157
15662a27779l06616g442j349j06220B3109b48065j60904a51878j1893A5525a42927
15650B24879a08977j3297A78304a68856A89258a65133P1123j31999C04270C2520
15639a32187r2922n5056i4294B116J20784A7475a32398k723j70360F4064K10760
15628B74824a30357m06600e3544q8298F9720a65355B0020h4327D20666b42983
15617B660J69297b9939k6636r8206B00968f5976A33570a42762O2651A5160a17527
15605b89362b2539A43257a17146A74154e6631q2264i362j28575j58787F3690a60341
15593a77563A21030d7010a9164A47436K80763A66486a98339D448b55015B46188
$$ plain form
15582 -326510 241531 49616 -149185 -152247 101322 -477464 -287638 72748 164335 280867
15572 280867 -136360 -17679 10207 -171712 48785 -110653 -49454 -32672 -238888 358735
15561 -112397 385482 52959 99325 -25788 -47798 -221356 92916 123672 104864 -169434 -134772
15550 -134772 180405 71591 62438 -221176 53105 -183520 100037 -162942 -415159 -328118
15540 -328118 -207336 -72721 -210861 198465 -160589 222541 -93666 -32237 -36002 -212944
15530 -212944 288849 -86969 100121 -74492 -109833 -313504 -188176 -116228 68577 -372299
15519 71954 -127616 53649 -352720 -81088 432521 88145 404951 100472 -348078 -316516
15509 -316516 57062 17888 -281788 -402052 -4277 58793 -72949 137716 107250 89221 191894
$$ packed form
15582c26510B41531D9616a49185l062A01322d77464J89826G2748R1587J16532
15572B80867a36360a7679A0207a71712D8785a10653d9454J6782k06216C58735
15561a12397C85482E2959M6366b5788k2010j73558I2916L0756j8808a69434L4662
15550a34772A80405G1591r153b21176E3105a83520A00037a62942k52217Q7041
15540c28118J20782g2721j38140A98465a60589B22541i3666c2237l765j76942
15530b12944B88849h6969A00121g4492l5341k03671J25328P1948F8577c72299
15519G1954a27616E3649c52720h1088D32521H8145L16806A00472c48078L1562
15509c16516E7062A7888b81788j20264d277E8793g2949A37716l0466j8029J02673
$$ plain form
15498 191894 -127009 -213662 177543 -219601 79578 10942 20676 -74959 234406 -107122 -16466
15486 -37099 102141 179015 -179516 28504 -111768 -71416 132754 113105 246069 332749 108309
15474 172373 -130125 128083 188058 312026 78055 -245328 -225196 111797 -249374 55753
15463 34486 145191 -264812 72068 39924 -114718 2729 260633 -120807 165611 -47547 -275117
15452 -275117 -245023 -93389 128327 -263615 -337159 -109682 -78996 52090 32869 63053 -2550
15440 -232125 206135 -9936 5219 -92729 111076 79732 112564 201299 72845 -159998 12428
15428 83474 -216382 41155 270142 23928 -20911 30217 4578 215984 1828 273397 -181778
15416 -66573 -255383 36403 256294 134804 -84021 -86052 37462 -99273 142141 -113408 -52806
$$ packed form
15498A91894a27009q6653A77543b19601G9578A0942R734g4959B34406a07122a6466
15486c7099A02141P6874a79516B8504a11768M0352A32754j9649J32964Q6680A08309
15474A72373a30125A28083N9975J23968G8055b45328K0132A11797b49374E5753
15463C4486J10705b64812G2068l2144a14718B729K57904a20807A65611d7547k27570
15452b75117L0094i3389A28327b63615p3544a09682L0686E2090j9221L0184b550
15440b32125B06135i936E219i2729A11076l1344L2832Q8735G2845a59998A2428
15428H3474b16382D1155K28987B3928b0911C0217D578K11406A828K71569a81778
15416f6573j88810C6403K19891j21490h4021k031C7462i9273A42141a13408e2806
$$ plain form
15404 -316629 11167 -88855 -81049 94651 -143960 -157380 5537 -75427 -172072 -297525 303997
15392 211904 3610 -158861 167118 412920 123851 -37109 -60823 227562 -136153 235704
15381 -52332 313850 551167 -60754 -83507 159976 221223 172447 -104332 159993 178354 -21313
15369 -40694 -462763 240596 339500 -264651 161485 237035 -171006 -260841 -141855 246760
15358 -112856 -247107 -79085 266757 -150 -332296 -162771 -65785 292045 -91523 -62726 -91480
15347 -91480 -146822 3387 96309 98956 72410 171636 -70223 102963 80449 134761 12599 -35306
15334 -125090 305926 -139984 -62121 245187 -212320 222043 -47952 -158173 -85255 194350
15323 286770 406603 -88106 -41733 113412 -126060 -148868 168393 141812 24377 -92594 313870
$$ packed form
15404c16629A1167h8855P806I4651a43960j3420E537g5427r6645j25453C03997
15392B11904C610a58861A67118K45802A23851c7109k3714B27562a36153B35704
15381e2332C13850K37317f0754k2753A59976O1247m8776a04332A59993J8361b1313
15369d0694m22069B40596R8904b64651A61485P5550a71006q9835J18986B46760
15358a12856j34251g9085B66757a50l32146a62771f5785B92045i1523K8797k8754
15347i1480n5342C387R2922K647k6546R9226g0223A02963k2514N4312A2599c5306
15334a25090C05926a39984f2121B45187b12320B22043d7952j10221P2918A94350
15323B86770J19833h8106d1733A13412a26060k2808A68393k6581B4377i2594C13870
$$ plain form
15311 5337 -31716 -187346 220518 -1729 16716 132601 26473 -265136 -161554 138371 138552
15300 138552 -102940 67118 38566 46260 11771 67154 -170840 -111733 61647 -53255 3746
15288 108182 80999 -149873 63259 -326879 185124 -433 221210 -298718 49411 77378 225752
15277 225752 72554 143361 -4561 384298 -181488 301575 -200165 -248447 -242147 -124130 289425
15265 194708 123832 55010 391151 18605 316884 -234694 -77802 105160 -198589 164979
15254 -16336 243883 176573 257338 347542 524222 1065032 1146268 984919 1210448 392600
15243 -52335 186014 41083 417716 200849 5192 -156030 -277315 220873 233208 -7859 -164565
15232 -164565 -15209 300905 221380 -37094 114597 267246 -165501 203136 -87709 -136584
$$ packed form
15311E337c1716j55630B20518a729A6716J15885B6473b65136J03582A38371J81
15300A38552a02940F7118k8552P694A1771N5383a70840N9107F1647e3255C746
15288A08182k7183a49873F3259c26879A85124d33B21210b98718D9411K7967J48374
15277B25752G2554P0807d561C84298a81488C01575b00165m8282O300J18017B89425
15265A94708p0876E5010L36141A8605K98279b34694g7802A05160a98589A64979
15254a6336B43883o7310Q0765R0204J76680N40810Q1236j61349K25529C92600
15243e2335A86014D1083L76633B00849E192a56030j21285B20873J2335g859j56706
15232a64565a5209C00905p9525c7094A14597J52649a65501B03136h7709m8875
$$ plain form
15222 -136584 -39533 242362 125674 95385 127488 -162772 -5238 -171405 272558 72564 -117927
15210 -23255 -146154 -83463 206457 -19355 -30774 -6805 287989 -36537 67421 232960 64475
15198 179654 154818 -181058 65864 -31412 192046 -87032 190939 -192125 -131100 163310
15187 -152131 104831 -199434 -261181 240221 -40903 15168 49915 191972 199378 223070 123134
15176 123134 305097 -109022 273968 203760 132360 -21637 150294 -68070 -157481 44071 -199770
15164 112349 95233 -31234 40836 -144621 -46458 261657 -159806 246974 6777 59506 117489
15153 117489 148713 108175 220160 310965 57158 337921 4595 131090 -84962 19841 200657
15142 200657 -171585 -241061 -72238 91385 189996 482040 241129 182293 -248352 5191 344643
$$ packed form
15222a36584c9533B42362j16688l0289L2103a62772e238j66167B72558G2564a17927
15210b3255j22899O2691B06457a9355j1419f805B87989c6537F7421J65539F4475
15198A79654k4836a81058F5864c1412A92046h7032A90939a92125O1025A63310
15187a52131A04831a99434o1747B40221d0903A5168L4747J42057P406K3692r9936
15176A23134J81963a09022B73968p0208p1400b1637A50294f8070q9411D4071a99770
15164A12349j7116c1234D0836a44621d6458B61657a59806B46974F777N2729N7983
15153A17489L1224m0538J11985R0805E7158K80763D595J26495h4962A9841J80816
15142B00657a71585o9476g2238I1385R8611K92044k40911n8836b48352E191L39452
$$ plain form
15131 344643 -54863 47122 410329 264282 -165519 -204383 101616 19547 273829 -28311
15120 156832 58299 383301 330280 279620 346439 70203 38302 175154 605719 -141127 -50077
15108 -114925 14091 332868 90745 15248 -17244 -75665 -14115 26201 18845 -73943 7251 -259242
15095 121186 -29424 236994 -157906 36893 -46279 190477 -34233 -94108 141025 188987 60922
15083 -67977 11642 242730 239156 -167827 23848 86565 -72896 -80436 62895 130288 -96452 112306
15070 7063 -247248 225546 -48513 618682 11483 390683 349795 236512 90629 233712 210928
15059 210928 297363 106109 324354 257610 -12436 -2764 144073 394926 25520 165530 162443
15048 162443 236160 144994 103196 225083 212305 152301 56146 435994 95392 -119086 30962
$$ packed form
15131C44643e4863D7122L63207j46047a65519l8864A01616A9547K54282b8311
15120A56832E8299L25002n3021n0660O6819G0203l1901J36852M30565a41127e0077
15108a14925A4091L18777I0745A5248a7244n8421a4115B6201p356g3943G251b59242
15095A21186b9424B36994a57906C6893d6279A90477c4233n9875A41025M7962F0922
15083f7977A1642K31088l574a67827B3848O2717g2896p540F2895O7393i6452A12306
15070G063b47248B25546d8513F18682A1483L79200m0888j13283I0629J43083k2784
15059B10928Q6435A06109K18245o6744a2436b764A44073K50853B5520J40010l087
15048A62443P3717r1166m1798J21887j2778o0004E6146L79848I5392a19086C0962
$$ plain form
15036 255122 385131 59639 157741 57689 173341 -19423 68851 115614 237081 -79936 35221
15024 47220 -62048 145473 -48661 144214 79388 285547 181412 169211 51927 229334 183646
15013 183646 278025 27751 -32021 436302 -147377 302254 329574 197895 293500 94214 70131
15002 70131 341282 175913 160709 151237 -126698 270697 88571 143543 244980 121856 631977
14991 631977 489191 -7155 211812 155901 195862 110141 84035 149802 84360 11558 181199
14980 181199 32163 406481 105370 322390 93532 74973 302727 284962 227571 397917
14970 397917 85289 182293 259470 276204 406376 337354 190452 473538 148738 341924
14960 341924 64145 209068 359064 227503 128043 51331 410522 142179 248437 102471
$$ packed form
15036B55122J30009E9639R8102E7689J15652a9423F8851M6763J21467g9936C5221
15024D7220f2048A45473d8661A44214o4826K06159j04135j2201E1927J77407m5688
15013A83646R4379B7751c2021D36302a47377C02254K7320j31679R5605I4214k4083
15002G0131K71151j65369j5204r472a26698B70697H8571N4972J01437A21856N10121
14991F31977j42786g155B11812n5911L9961q5721k6106O5767o5442A1558J69641
14980A81199C2163L74318A05370K17020I3532j8559K27754j7765n7391J70346
14970C97917H5289R7004P7177J6734J30172o9022j46902K83086A48738J93186
14960C41924F4145J44923J49996j31561r9460E1331L59191A42179J06258A02471
$$ plain form
14949 323023 -48864 176635 568657 184238 288571 249705 319967 275671 181530 347470
14939 347470 182583 21705 106272 176679 257342 -30145 284842 275072 298203 136767 -110017
14927 328648 298377 50923 -1247 297054 145185 -172267 410332 467705 227352 113045
14916 -32376 351677 366647 167753 71405 272576 347961 44414 356756 308597 262375 433677
14905 433677 491849 335503 305365 454576 130159 156584 290961 356708 305239 303189 200057
14894 200057 205764 406080 476989 199140 534660 629025 302906 351959 243221 270107 322856
14883 322856 677810 417381 -31818 54108 350207 457253 320938 242270 404766 457573
14873 457573 478438 392000 226286 351140 174530 143520 254627 44459 272489 333794
$$ packed form
14949C23023d8864A76635L92022A84238J04333l8866P0262m4296r4141J65940
14939C47470j64887B1705Q4567P0407Q0663c0145B84842r770K3131A36767a10017
14927C28648l0271E0923a247B97054A45185a72267D10332N7373B27352A13045
14916c2376C51677J4970A67753G1405K01171P5385D4414L12342m8159m6222J71302
14905D33677N8172j56346l0138J49211A30159K6425J34377O5747n1469k050j03132
14894B00057N707K00316P0909A99140L35520R4365C02906M9053j08738K6886N2749
14883C22856L54954k60429c1818E4108K96099J07046j36315p8668J62496N2807
14873D57573K0865q6438j65714J24854A74530l1010J11107D4459K28030O1305
$$ plain form
14863 333794 467992 43367 384448 425693 364125 208651 409833 9338 297045 448143
14853 448143 275087 474867 334383 421227 497403 473062 86979 379604 279782 335274 526771
14842 526771 429885 272782 42829 296768 301670 388487 643298 309197 556601 409816
14832 409816 138263 548109 299719 307535 216687 29836 -153 305610 340604 459915 464048
14821 464048 103534 412031 682071 474728 199148 647207 183398 401339 591740 500170
14811 500170 308364 117311 91015 337072 605292 397521 227271 322776 610616 129744
14800 437507 141465 655850 386856 471487 416896 526049 543442 513128 647115 365439
14790 365439 170828 512740 -138438 626293 343760 457478 428485 265925 679941 663661
$$ packed form
14863C33794J34198D3367L41081M1245o1568j55474K01182I338K87707J51098
14853D48143j73056J99780j40484Q6844P6176k4341H6979K92625r9822N5492J91497
14842E26771r6886j57103D2829K53939M902Q6817K54811C09197K47404j46785
14832D09816A38263M09846k48390P816r0848B9836a53C05610L4994J19311M133
14821D64048A03534L08497K70040k07343A99148M48059A83398K17941J90401r1570
14811E00170j91806A17311k6296K46057K68220k07771j70250R5505K87840A29744
14800D37507A41465N14385k68994Q4631n4591J09153J7393l0314J33987k81676
14790C65439A70828L41912a38438F26293k82533J13718k8993j62560M14016j6280
$$ plain form
14780 663661 341267 508210 606710 532923 547354 768850 316624 587372 722341 613007
14770 613007 662928 772136 516946 225522 921766 409044 295596 320461 487468 642368
14760 642368 665682 624340 435891 242025 612817 497953 668190 469886 371468 597211
14750 597211 533071 336504 504848 329610 390723 631116 536486 538617 166978 366784
14740 366784 695384 616253 409398 677680 798067 924708 558990 597235 742698 591339
14730 591339 786601 632442 607154 722169 529269 833817 533421 568085 596763 563430
14720 563430 720347 593883 623035 441023 618194 804610 665428 653626 813896 683616
14710 683616 521150 328810 603506 709643 831742 759609 950318 618833 833052 562438
$$ packed form
14780F63661l22394J66943R8500p3787J4431K21496C16624K70748J34969j09334
14770F13007M9921J09208k55190B25522O96244D09044j13448K4865J67007J54900
14760F42368K3314m1342j88449j93866L70792j14864J70237j98304r8418K25743
14750E97211o4140j96567J68344j75238O1113K40393r4630K131A66978J99806
14740C66784L28600p9131k06855K68282J20387J26641l65718L8245J45463j51359
14730E91339J95262j54159k5288J15015j92900L04548l00396L4664K8678l3333
14720E63430J56917j26464K9152j82012J77171J86416j39182j1802J60270j30280
14710F83616j62466j92340K74696J06137J22099p2133J90709l31485K14219k70614
$$ plain form
14700 562438 1101836 631333 803511 980002 730232 798771 774021 817441 882128 1282482
14690 1282482 530720 1210620 917075 864795 1101784 979768 1063748 925612 880199 1178036
14680 1178036 1071484 824141 858448 510567 987136 1005593 854718 1060913 562824 832190
14670 832190 790768 809648 838206 872744 913224 983465 983278 1185573 780038 927480 849790
14659 849790 911991 1129894 875091 1124505 780978 1088037 825932 837279 1143828 744731
14649 744731 1073399 1088232 1077380 1190142 898793 980854 1155899 1088756 907270 704325
14639 704325 1271779 1127847 922972 1203269 1157154 1142512 1196638 1130991 817627 1231204
14629 1231204 1076925 948123 1263755 1354253 1468179 1270264 1596729 1321367 1183874 1325834
$$ packed form
14700E62438N39398m70503J72178J76491k49770O8539k4750M3420O4687M00354
14690A282482E30720O79900k93545n2280K36989j22016Q3980j38136m5413K97837
14680A178036j06552k47343L4307l47881M76569J8457j50875K06195m98089K69366
14670H32190m1422J8880K8558L4538M0480P0241j87K02295m05535J47442p7690
14659H49790O2201K17903k54803K49414l43527L07059k62105J1347L06549l99097
14649G44731L28668J4833j0852J12762k91349Q2061J75045o7143j81486k02945
14639G04325N67454j43932k04875K80297m6115j4642N4126o5647l13364M13577
14629A231204j54279j28802L15632R0498J13926j97915L26465k75362j37493J41960
$$ plain form
14619 1325834 1188914 934406 1154240 1375695 1344345 1407017 1446755 1530061 1113264 1442991
14609 1442991 1465051 868832 1167222 1337032 1364306 1048213 1417410 1434833 1402727 1297758
14599 1297758 1093130 1611153 1183148 1414970 1332905 1221450 1708133 1412971 1146995 1334218
14589 1334218 1525261 1577581 1650913 1276624 1135853 1629817 1856849 1549699 1589981 1884058
14579 1884058 1786362 1559783 1863086 1567514 1602261 1650185 1970890 1967791 1816956 1656333
14569 1656333 2186907 2255566 2208137 1651166 2203451 2211079 2376482 2437657 2111218 2156448
14559 2156448 2447905 2221773 2631480 2826320 3059108 3095577 3628556 3301348 4121049 5098325
14549 5098325 7161671 11002852 19774836 36974695 45432890 20341719 6251685 3446622
$$ packed form
14619A325834j36920k54508K19834K21455l1350O2672L9738Q3306m16797L29727
14609A442991K2060n96219K98390J69810K7274l16093L69197J7423l2106j04969
14599A297758k04628N18023m28005K31822q2065j11455M86683k95162k65976J87223
14589A334218J91043N2320P3332l74289j40771M93964K27032l07150M0282K94077
14579A884058r7696k26579L03303k95572L4747M7924L20705l099j50835j60623
14569A656333N30574O8659m7429n56971N52285P628J65403O1175l26439M5230
14559B156448K91457k26132M09707J94840K32788L6469N32979l27208Q19701R77276
14549E098325K063346L841181Q771984J7199859Q458195B0341719F251685k805063
$$ plain form
14541 3446622 2479348 1956682 1500485 1730590 1583476 1806285 1667551 1501364 1740215
14532 1740215 1669684 1823084 1876886 1718771 1699698 2047459 1977411 2075559 2064519 2106590 2371709
14521 2371709 2131393 1983134 2087664 2170298 1881606 2188343 1899625 2538480 2316452 2407096
14511 2407096 2518962 2259625 2410958 2612028 2546370 2404189 2475636 2849277 2283105 2454104
14501 2454104 2471242 3137540 2605242 2624666 2898612 2802626 2717561 3215317 2952567 2713527
14491 2713527 3012607 3060040 3080929 2634793 3337799 3480702 3421541 3299190 3101346 3235791
14481 3235791 3157502 3308109 3504263 3591538 3508910 3590878 3717459 3334673 3578093 3692257
14471 3692257 3684191 3619452 3777768 3732570 4014076 3700272 3857097 4080099 4357926 4348187
$$ packed form
14541C446622r67274n22666m56197K30105j47114K22809j38734j66187K38851
14532A740215p0531J53400N3802j58115j9073L47761p0048R8148j1040M2071K65119
14521B371709k40316j48259J04530Q2634k88692L06737k88718O38855k22028R0644
14511B407096J11866k59337J51333K01070o5658j42181P1447L73641n66172J70999
14501B454104J7138O66298n32298J9424K73946r5986q5065M97756k62750k39040
14491B713527K99080M7433K0889m46136P03006J42903n9161j22351j97844J34445
14481C235791p8289J50607J96154Q7275q2628Q1968J26581l82786K43420J14164
14471C692257q066o4739J58316m5198K81506l13804J56825K23002K77827r739
$$ plain form
14461 4348187 4011230 4096793 4356325 4231568 4712352 4304802 4412645 4764349 4566277 4793425
14451 4793425 4955845 4617968 4840155 4737901 5029567 5279205 4703256 5115127 5140580 5010839
14441 5010839 5488796 5230324 5118333 5595003 5584409 5800445 5781727 5490579 5783088 6177066
14431 6177066 5789332 6350282 6034735 6040672 6206726 6450689 6670158 6367587 6847033 6541165
14421 6541165 6679082 6608050 7053223 6965045 7350544 7474994 7569985 7415865 7377233 7617275
14411 7617275 7597986 7508362 7689133 8045744 8091792 8300810 8439682 8297014 8506842 8816442
14401 8816442 9086882 9208809 9568092 9232203 9326011 9679212 9740654 10098663 10194878 10175729
14391 10175729 10804644 10883951 11133168 10999073 11158873 11449061 11628900 11646609 12067985 12257821
$$ packed form
14461D348187l36957Q5563K59532j24757M80784m07550J07843L51704j98072K27148
14451D793425J62420l37877K22187j02254K91666K49638n75949M11871K5453j29741
14441E010839M77957k58472j11991M76670j0594K16036j8718k91148K92509L93978
14431F177066l87734N60950l15547N937J66054K43963K19469l02571M79446l05868
14421F541165J37917p1032M45173q8178L85499J24450R4991j54120l8632K40042
14411G617275j9289q9624J80771L56611M6048K09018J38872j42668K09828L09600
14401H816442K70440J21927L59283l35889R3808L53201O1442L58009R6215j9149
14391A0175729O28915P9307K49217j34095J59800K90188J79839J7709M21376J89836
$$ plain form
14381 12257821 12433764 12637760 12939546 13184454 13100059 13706704 14015451 14483263 14504387 14694949
14371 14694949 15215535 15186593 15657068 16110040 16362104 16754860 16881711 17500259 17758955
14362 17758955 18191939 18758753 19165142 19728811 19829126 20710785 21218617 21162044 21823041
14353 21823041 22640153 22938654 23152597 24124802 24617049 25064628 25630202 26566566 27105380
14344 27105380 27849507 28605989 29276852 30137168 30771624 31814541 32676354 33619409 34102946
14335 34102946 35444711 36416040 37868884 38539164 39844806 41515990 42732142 43904643
14327 43904643 45156840 46711280 48356885 49847022 51553933 53287809 54719007 57441746
14319 57441746 59213146 61320139 63933363 66026353 68687736 71422163 74568365 77270781
$$ packed form
14381A2257821J75943K03996L01786K44908q4395O06645L08747M67812K1124J90562
14371A4694949N20586k8942M70475M52972K52064L92756J26851O18548K58696
14362A7758955M32984N66814M06389N63669J00315Q81659N07832n6573O60997
14353B1823041Q17112K98501K13943R72205M92247M47579N65574R36364N38814
14344B7105380P44127P56482O70863Q60316O34456J042917Q61813R43055M83537
14335C4102946J341765R71329J452844O70280J305642J671184J216152J172501
14327D3904643J252197J554440J645605J490137J706911J733876J431198K722739
14319E7441746J771400K106993K613224K092990K661383K734427L146202K702416
$$ plain form
14311 77270781 80903561 84090427 87391431 91601092 95352046 99834938 104166025 109149520
14303 109149520 114168109 119623688 125586376 131888384 138894123 145725751 152876872 160809629
14295 160809629 169460899 178880877 188331052 198767525 209735989 221590659 233633955
14288 233633955 246705565 260383961 274528478 289160145 304538462 320621153 336698452
14281 336698452 352758888 369108987 385406403 400626636 415463993 428888285 440730247
14274 440730247 448674721 452790634 454939793 455623014 456138586 456039119 454939662 451328105
14266 451328105 442968447 432255397 420022266 406623138 391885318 376512074 360109983
14259 360109983 343102511 326525414 309749230 294406443 279286819 264749560 250735495
$$ packed form
14311G7270781L632780L186866L301004M209661L750954M482892M331087M983495
14303A09149520N018589N455579N962688O302008P005739O831628P151121P932757
14295A60809629Q651270R419978R450175J0436473J0968464J1854670J2043296
14288B33633955J3071610J3678396J4144517J4631667J5378317J6082691J6077299
14281C36698452J6060436J6350099J6297416J5220233J4837357J3424292J1841962
14274D40730247P944474M115913K149159O83221N15572r9467j099457l611557
14266D51328105q359658j0713050j2233131j3399128j4737820j5373244j6402091
14259C60109983j7007472j6577097j6776184j5342787j5119624j4537259j4014065
$$ plain form
14252 250735495 237033535 224837328 212880290 201506608 191265343 180972372 171756320
14245 171756320 162719007 155261078 147475070 140161686 133320987 126789994 120889243 115743334
14237 115743334 110547563 105420733 100513712 96269295 92131395 88260022 85286422 81440343
14229 81440343 78171309 75239349 71890608 69019359 66872926 64110058 61845206 59557758
14221 59557758 57152847 55429155 53922931 51515516 49800262 47947894 46617530 45516362
14213 45516362 44138579 42610522 40954568 39921660 38585566 37744103 36842708 35802680
14205 35802680 34731601 33262850 32546500 31998955 31202072 30601288 29380541 28587878 27844843
14196 27844843 26878188 26373601 25982100 25557370 24464040 23857158 23354797 22715899 21955710
$$ packed form
14252B50735495j3701960j2196207j1957038j1373682j0241265j0292971r216052
14245A71756320r037313p457929p786008p313384o840699o530993n900751n145909
14237A15743334n195771n126830m907021m244417m137900l871373k973600l846079
14229H1440343l269034k931960l348741k871249k146433k762868k264852k287448
14221E9557758k404911j723692j506224k407415j715254j852368j330364j101168
14213D5516362j377783j528057j655954j032908j336094q41463r01395j040028
14205C5802680j071079j468751p16350n47545p96883o00784j220747p92663p43035
14196B7844843r66655n04587l91501m24730j093330o06882n02361o38898p60189
$$ plain form
14187 21955710 21661406 20985803 20868999 19987421 19691908 19383839 18763926 18711627 18066777
14178 18066777 17918252 17697836 17000715 17201391 16354969 15860062 15702547 15394058 14844998
14169 14844998 14788615 14547725 14539757 14089892 14006439 13530835 13000059 13092465 12674986 12642834
14159 12642834 12258790 12078371 11677971 11836703 11200480 11559231 10946237 11010493 10848267
14150 10848267 11053769 10457126 10023357 9928928 9944295 9642817 9462664 9744529 9412792 9097188
14140 9097188 9186322 9105409 8577158 8925181 8418156 8599446 8253567 8158036 7870276 8039249
14130 8039249 7698675 7729256 7477274 7402427 7332340 7181914 6656196 7049476 6989661 6899317
14120 6899317 6712013 6591028 6840937 6578387 6499546 6759908 6068376 6083432 6150980 6039132
$$ packed form
14187B1955710k94304o75603j16804q81578k95513l08069o19913n2299o44850
14178A8066777j48525k20416o97121K00676q46422m94907j57515l08489n49060
14169A4844998n6383k40890p968m49865q3453m75604n30776R2406m17479l2152
14159A2642834l84044j80419m00400J58732o36223L58751o12994O4256j62226
14150A0848267K05502n96643m33769r4429J5367l01478j80153K81865l31737l15604
14140I097188Q9134q0913n28251L48023n07025J81290l45879r5531k87760J68973
14130H039249l40574L0581k51982p4847p0087j50426n25718L93280n9815r0344
14120F899317j87304j20985K49909k62550p8841K60362o91532J5056O7548j11848
$$ plain form
14110 6039132 5886325 5919713 5833251 5811682 5678790 5335303 5432998 5548509 5205084 5490795
14100 5490795 5272923 5070563 5270626 4920232 4969023 4853710 4989580 4849657 4900631 4550456
14090 4550456 4672793 4421808 4531169 4608219 4630845 4494955 4539816 4449427 4483571 4136710
14080 4136710 4146013 4019207 4240971 4132199 4253510 3782250 3786260 3876198 4099269 3914942
14070 3914942 3643856 3577392 3712441 3923848 3657971 3429867 3145583 3422514 3406553 3484678
14060 3484678 3670706 3497207 3709988 3426918 3240466 3178696 3297731 3284537 3411057 3394658
14050 3394658 3182445 3116100 3058456 3250805 2832947 2721195 2708735 2532342 2946616 2812764
14040 2812764 2993886 2665707 2809338 2988236 2298579 2823942 2581636 2447904 2674351
$$ packed form
14110F039132j52807L3388q6462k1569j32892l43487R7695J15511l43425K85711
14100E490795k17872k02360K00063l50394M8791j15313J35870j39923N0974l50175
14090D550456J22337k50985J09361P7050K2626j35890M4861r0389L4144l46861
14080D136710R303j26806K21764j08772J21311m71260M010Q9938K23071j84327
14070C914942k71086o6464J35049K11407k65877k28104k84284K76931j5961P8125
14060C484678J86028j73499K12781k83070j86452o1770J19035j3194J26520j6399
14050C394658k12213o6345n7644J92349m17858j11752j2460j76393M14274j33852
14040B812764J81122l28179J43631J78898o89657N25363k42306j33732K26447
$$ plain form
14031 2674351 2800652 2692202 2895903 2829434 2254622 2716897 2302213 2517735 2377300 2538688
14021 2538688 2456726 2158078 2502231 2422601 2204388 2189248 2192123 2230500 2023415 1993524 1937723
14010 1937723 2129928 2328104 2102004 2059290 2089683 1842304 1932331 2013904 1858559 2039219
14000 2039219 1872963 1883604 1722269 1955717 1596471 1474036 1889144 1931625 1852473 1907052
13990 1907052 2222624 3645195 6467627 12539090 29069447 44852998 26377327 11280516
13981 6933125 4997819 4030577 3401928 3083332 2944365 2506125 2645645 2457965 2421141
13972 2421141 2471675 2143143 2378203 1993757 1947785 1674868 1654078 1973403 1869247 1907359
13962 1907359 2123796 1888022 1532863 1556319 1728246 1657937 1716596 1635840 1759207 1529924
$$ packed form
14031B674351J26301j08450K03701o6469n74812M62275m14684K15522j40435J61388
14021B538688q1962k98648L44153p9630k18213j5140K875L8377k07085k9891n5801
14010A937723J92205J98176k26100m2714L0393k47379R0027Q1573j55345J80660
14000B039219j66256J0641j61335K33448l59246j22435M15108M2481p9152N4579
13990A907052L15572J422571K822432O071463J6530357J5783551j8475671A1280516
13981F933125j935306r67242o28649l18596j38967m38240J39520j87680l6824
13972B421141N0534l28532K35060l84446m5972k72917k0790L19325j04156L8112
13962A907359K16437k35774l55159K3456J71927p0309N8659q0756J23367k29283
$$ plain form
13952 1529924 1638804 1542852 1901439 1961175 1578704 1268700 1588343 1677780 1411272 1591359
13942 1591359 1785575 1617015 1733114 1685658 1627162 1549207 1180693 1510875 1532239 1705906
13932 1705906 1397900 1567565 1345128 1385817 1450750 1521725 1307527 1534641 1516447 1551741
13922 1551741 1492739 1230480 1345541 1364253 1203539 1302203 1509796 1358942 1180919 1555367
13912 1555367 1278430 1228377 1176069 1341453 1396128 1263771 1253326 1059972 1009164 1230475
13902 1230475 1504874 1212275 1279556 1183838 1165387 951160 1126315 1262333 1024390 1024360 1317900
13891 1317900 972538 1237460 1079975 1087747 715953 1117344 1267930 1164587 1164005 669365
13881 669365 1153634 991010 904511 1137497 1204556 1085894 875086 960682 1194033 1078550
$$ packed form
13952A529924J08880r5952L58587N9736l82471l10004L19643Q9437k66508J80087
13942A591359J94216j68560J16099m7456n8496p7955l68514L30182K1364J73667
13932A705906l08006J69665k22437M0689O4933P0975k14198K27114j8194L5294
13922A551741n9002k62259J15061J8712j60714R8664K07593j50854j78023L74448
13912A555367k76937n0053n2308J65384N4675j32357j0445j93354n0808K21311
13902A230475K74399k92599O7281r5718j8451k14227J75155J36018k37943l0K93540
13891A317900l45362K64922j57485P772l71794M01391J50586j03343n82m94640
13881F69365M84269j62624q6499K32986O7059j18662k10808Q5596K33351j15483
$$ plain form
13871 1078550 897630 1221240 1060594 1277111 1102452 1011295 1095496 877185 891645 803441
13861 803441 755530 838230 664851 761048 1017498 427017 918608 1086236 699859 744360
13851 744360 1021446 912921 1124804 575987 1060765 800809 763514 1149213 1121794 907774
13841 907774 721205 1146593 903465 1123772 237945 684035 742753 786226 904299 866604
13831 866604 687754 950080 749200 871797 788030 541359 770957 978739 796718 781101
13821 781101 950226 943466 886547 600488 587407 1006556 777885 1113672 453746 749371
13811 749371 815917 599777 405882 809660 761554 547943 1049545 908080 781776 682143
13801 682143 763952 741216 371103 695214 348164 553636 926810 898112 530386 637790
$$ packed form
13871A078550j80920L23610j60646K16517j74659r1157Q4201k18311J4460q8204
13861H03441m7911Q2700j73379R6197K56450D27017M91591J67628l86377M4501
13851G44360K77086j08525K11883n48817M84778k59956l7295L85699k7419k14020
13841I07774j86569M25388k43128K20307B37945M46090N8718M3473J18073l7695
13831H66604j78850K62326k00880J22597q3767k46671K29598K07782j82021j5617
13821G81101J69125o760n6919k86059j3081M19149k28671L35787D53746K95625
13811G49371O6546k16140j93895M03778m8106k13611N01602j41465j26304r9633
13801F82143Q1809k2736l70113L24111l47050K05472L73174k8698l67726J07404
$$ plain form
13791 637790 268964 881535 424467 1053895 505876 676423 486447 439257 674163 521516
13781 521516 515294 541877 496345 469032 711665 352352 884357 736822 848029 494709
13771 494709 705350 593553 749772 144744 641235 786400 371561 146715 797931 317709
13760 689793 352368 737437 499375 378257 619275 389193 591164 585875 585867 447248 700902
13749 700902 983687 529329 632889 471517 586960 682491 778643 396922 367855 792863
13739 792863 427009 283972 487523 709991 605916 452033 844713 582982 486706 502434
13729 502434 595136 279173 445999 732182 419362 735937 799703 158961 717700 519419
13719 519419 335357 332331 476835 433026 481497 409204 482650 743848 565611 600843 674995
$$ packed form
13791F37790B68964O12571D24467O29428E05876J70547j89976m7190K34906j52647
13781E21516o222K6583m5532k7313K42633C52352N32005j47535J11207l53320
13771D94709K10641j11797J56219A44744M96491J45165C71561A46715O51216C17709
13760F89793l37425L85069k38062j21118K41018k30082K01971n289qj38619K53654
13749G00902K82785m54358J03560j61372J15443R5531R6152l81721k9067M25008
13739G92863l65854j43037K03551K22468j04075j53883L92680k61731r6276J5728
13729E02434R2702B79173J66826K86183l12820L16575O3766A58961N58739j98281
13719E19419j84062l026J44504m3809M8471p2293P3446K61198j78237L5232P4152
$$ plain form
13708 674995 439733 522002 750897 658396 518960 523775 259460 628422 301989 616066
13698 616066 546884 376548 172469 528943 596893 358619 185894 152737 144228 183288 298046
13687 298046 455403 475417 208845 247412 396660 312468 490918 458356 465733 196592 504967
13676 504967 461619 353575 271189 377617 605745 636057 605272 417441 329689 506949
13666 506949 352113 649236 123854 355248 346253 268132 365527 110880 356458 452448
13656 452448 434997 403232 276932 469926 269623 518627 156891 404047 592346 495900
13646 495900 306082 572827 258930 422371 318580 398793 250518 222905 481281 617013
13636 617013 299520 290566 274381 314450 205824 539394 206001 395731 529961 172975
$$ packed form
13708F74995k35262Q2269K28895r2501j39436M815B59460L68962C01989L14077
13698F16066o9182j70336A72469L56474O7950k38274j72725l3157q509L9060J14758
13687B98046J57357K0014B08845L8567J49248q4192J78450l2562P377A96592L08375
13676E04967m3348j08044q2386J06428K28128L0312l0785j87831q7752J77260
13666E06949j54836K97123A23854K31394q995p8121R7395A10880K45578R5990
13656D52448j7451l1765j26300J92994k00303K49004A56891K47156J88299r6446
13646D95900j89818K66745B58930J63441j03791Q0213j48275k7613K58376J35732
13636F17013B99520q954j6185M0069j08626L33570B06001J89730J34230A72975
$$ plain form
13625 106508 59214 164641 285895 342692 357148 623333 381906 758759 550506 265523
13614 535979 119087 316375 126794 447296 -66239 757068 659848 189948 401528 153973
13603 401012 448458 53878 263471 671751 347359 146963 14628 434611 254092 310410
13593 310410 255568 548 192948 214146 341579 282553 294218 252184 26161 286712 282296
13582 282296 487679 283317 184196 311008 334379 60553 160655 138104 67014 510321
13572 510321 719461 400065 59268 168800 260740 440692 95766 390468 247640 229094
13562 229094 148658 -22747 631912 319123 226051 139255 80834 145835 84908 332270 243297
13551 243297 192415 363978 100614 -10047 105262 303991 -9174 324575 161681 333333
$$ packed form
13625A06508m7294J05427J21254N6797J4456K66185k41427L76853k08253B65523
13614E35979A19087J97288A26794L20502f6239G57068r7220A89948K11580A53973
13603D01012M7446E3878K09593M08280l24392A46963A4628M19983j80519N6318
13593C10410n4842E48J92400K1198J27433n9026J1665m2034B6161K60551m416
13582B82296K05383k04362r9121J26812K3371F0553J00102k2551F7014M43307
13572E10321K09140l19396E9268J09532R1940J79952I5766K94702j42828j8546
13562B29094q0436b2747F31912l12789r3072q6796n8421O5001o0927K47362q8973
13551B43297n0882J71563A00614a0047A05262J98729i174C24575A61681J71652
$$ plain form
13541 333333 492171 222637 113324 372287 510834 79988 113696 439108 147913 251624
13531 251624 228986 106476 251325 311924 277316 31565 378368 224354 298490 447171
13521 447171 519759 545968 358777 -40119 521236 417800 541905 6475 126821 -125012
13510 273610 339673 6070 401008 270432 338657 -86646 304705 -77976 394824 322152 293125
13499 293125 217930 455878 168272 231656 194485 169914 -20910 374461 158564 -66498 170095
13487 80896 234002 299133 -13578 -176880 242302 208043 -65869 210144 125095 8467 269174
13476 269174 290771 630035 130853 421951 131597 128306 217948 304171 284805 135018 243304
13465 243304 -6834 151189 294477 425010 138521 209125 -240902 269601 59932 299255
$$ packed form
13541C33333J58838B22637j09313K58963J38547G9988L3708L25412A47913J03711
13531B51624k2638A06476J44849O0599l4608C1565L46803j54014P4136J48681
13521D47171P2588K6209j87191d0119E21236j03436J24105F475J20346a25012
13510B73610O6063F070L94938j30576O8225h6646C04705g7976C94824p2672k9027
13499B93125p5195K37948A68272O3384l7171k4571b0910C74461A58564f6498A70095
13487H0896J53106O5131a3578j63302B42302l4259f5869B10144q5049H467K60707
13476B69174K1597L39264A30853K91098A31597l291Q9642Q6223j9366A35018J08286
13465B43304f834A51189J43288J30533A38521P0604b40902B69601E9932K39323
$$ plain form
13455 299255 239875 69790 -32831 419799 378381 186134 81477 127187 274423 86074 -99929
13443 141192 219013 89153 290868 101942 191847 499367 242224 -7327 252158 158838 185216
13432 185216 445771 137460 329071 13906 522200 315346 95616 41475 264824 256276
13422 256276 290105 194063 299362 -93480 -78483 173572 321223 156693 369167 219737
13412 219737 206515 297755 386658 75243 439425 453860 -27079 146880 30152 -118284 76173
13400 227614 173475 321032 7254 285214 254846 234558 -241248 -6914 252447 135812 306813
13389 306813 179073 -154559 95946 229741 173233 68679 -95225 178256 -78885 -305933
13379 -305933 142319 279198 334932 232803 102210 453638 27387 126256 144319 367384
$$ packed form
13455B99255n9380F9790c2831D19799m1418A86134H1477M5710J47236H6074i9929
13443A41192P7821H9153K01715A01942Q9905L07520B42224g327B52158r3320K6378
13432A85216K60555A37460J91611A3906N08294k06854I5616D1475K23349q548
13422B56276L3829r6042J05299i3480J4997A73572J47651A56693K12474j49430
13412B19737j3222R1240Q8903G5243L64182J4435b7079A46880C0152a18284G6173
13400B27614n4139J47557G254K77960l0368k0288b41248f914B52447j16635J71001
13389C06813j27740a54559I5946J33795n6508F8679i5225A78256g8885k27048
13379c05933A42319J36879N5734j02129A02210L51428B7387R8869J8063K23065
$$ plain form
13369 367384 133189 130316 44915 193313 342609 -109687 -134865 290089 382950 299122 353131
13358 353131 -85857 -88578 219925 275505 104741 131103 -89318 259891 56660 116407 73899
13347 73899 148533 199209 242065 414195 337893 310685 137707 -6620 191917 232279 477623
13336 477623 75547 62144 333441 458219 439051 72999 200376 20959 247080 390487
13326 390487 86515 316639 268747 209295 107545 375780 154042 460766 225301 161975
13316 161975 -113222 88872 176684 221132 256488 -183712 151675 99310 -73794 111999 16241
13304 105003 -97091 2998 12738 -67215 19794 92273 376800 -241218 38183 -59224 98389
13292 327399 11694 207401 85519 72489 111308 -14740 -72343 168619 -129030 17099 259536
$$ packed form
13369C67384A33189k873D4915J48398J49296a09687k5178B90089R2861q3828N4009
13358C53131h5857k721B19925N5580A04741K6362h9318B59891E6660N9747m2508
13347G3899P4634N0676M2856J72130p6302k7208A37707f620A91917M0362K45344
13336D77623G5547j3403K71297J24778j9168G2999J27377B0959K26121J43407
13326C90487H6515K30124m7892n9452j01750K68235A54042L06724B25301o3326
13316A61975a13222H8872Q7812M4448L5356a83712A51675n2365g3794A11999A6241
13304A05003i7091B998R740f7215A9794P2479K84527b41218C8183e9224I8389
13292C27399A1694J95707H5519j3030L8819a4740n7603A68619a29030A7099K42437
$$ plain form
13281 259536 112413 -28484 -227366 -116581 193374 -9322 371270 -213911 41773 -85303
13270 82250 -208085 149336 -106864 -19257 47520 63943 198587 -2624 188128 -268832 188262
13258 -4165 34288 124233 -86024 -250027 324619 104514 60100 -45256 194121 62998 30931
13246 -107876 -25258 91709 19188 487896 -118217 110 66513 -2810 -61230 209332 54390
13234 122352 -39190 65476 -42443 39061 107544 -153607 71340 111116 -47967 -192166 3689
13222 -207186 233750 -64233 108169 61694 -116219 73872 100672 325775 285486 98159 -11447
13210 223095 294688 51681 -125806 -49819 88619 -62746 105025 -44498 417150 233923 152729
13199 152729 -5387 269199 63475 1147 120176 103842 331467 261892 401390 83459 304783
$$ packed form
13281B59536A12413b8484j98882J10785A93374i322C71270b13911D1773h5303
13270H2250b08085A49336a06864a9257D7520J6423J34644b624A88128b68832A88262
13258d165C4288Q9945h6024j64003C24619A04514m4414d5256A94121F2998C0931
13246a07876b5258I1709A9188M68708a18217A10O6403b810n8420B09332E4390
13234A22352c9190F5476d2443C9061O8483a53607G1340L9776d7967j44199C689
13222b07186B33750f4233A08169m6475a16219G3872K6800K25103m0289I8159a1447
13210B23095P1593E1681a25806d9819H8619f2746A05025d4498D17150j83227q1194
13199A52729e387B69199F3475A147J19029j6334K27625o9575J39498H3459K21324
$$ plain form
13188 304783 -6594 311782 509304 254113 3176 99833 34121 -42920 -37683 -92040 225790
13176 -86012 -465007 176306 60670 97414 340452 -9521 73443 80858 230370 20782 117775
13165 117775 -162110 272603 -139040 342823 55430 -134133 -170700 110853 169626 24557
13154 -60056 -65970 -30096 112225 145176 157028 436554 239584 322066 4915 89583 -182489
13142 -90237 276010 -2027 -6965 -192654 270222 -243252 92573 33980 -456410 -8769 21895
13130 -69378 273965 223953 -81198 43895 -142734 127167 21149 23697 -59373 140332 -193261
13118 421318 -78269 314856 287386 -245085 -30524 165146 -35363 274555 149292 7627 157681
13107 157681 -177201 92002 56717 -93353 -206470 35307 183018 -268 252429 -19874 -44093
$$ packed form
13188C04783f594C11782J97522B54113C176R6657C4121d2920N237n4357B25790
13176h6012l78995A76306F0670L6744K43038i521G3443P415J49512B0782R6993
13165A17775a62110B72603a39040C42823E5430a34133l6567A10853N8773B4557
13154f0056n914c0096A12225L2951J1852K79526j96970Q2482D915Q4668a82489
13142i0237B76010b027m938j85689B70222b43252I2573C3980d56410h769B1895
13130f9378B73965n0012h1198D3895a42734A27167B1149K548e9373A40332a93261
13118D21318g8269C14856k7470b45085c0524A65146c5363B74555j25263G627J50054
13107A57681a77201I2002l5285i3353j13117C5307J47711b68B52429a9874k4219
$$ plain form
13096 -44093 402640 22993 357607 -3588 649 -18834 140 -111300 97911 -67609 92076 -92703
13083 -114566 -84422 288980 -151186 111889 -148702 -36771 232958 140198 -70365 -26693
13072 168927 -231407 97075 -13416 39831 259921 310175 477989 154515 85816 156932 281511
13061 281511 64522 357493 24644 113569 356213 -72675 297443 -145925 102732 190060
13051 190060 72937 -114430 -83809 213746 292836 227703 106299 310560 214233 -1927 115118
13039 104807 259372 111326 280306 4112 123055 27141 280728 291072 254289 195652 170818
13028 170818 317620 113338 167495 181983 -28558 32597 413479 128204 332618 -99140
13017 -165514 6541 -24357 258834 118361 -125943 -195337 -34721 -328427 175089 -131658
$$ packed form
13096d4093D02640B2993L34614c588F49a8834A40a11300I7911f7609I2076i2703
13083a14566L0144B88980a51186A11889a48702c6771B32958r2760g0365b6693
13072A68927b31407I7075a3416C9831K20090N0254J67814A54515o8699P1116J24579
13061B81511F4522K92971B4644Q8925K42644g2675B97443a45925A02732Q7328
13051A90060G2937a14430L0621B13746P9090o5133A06299K04261r6327a927A15118
13039A04807J54565A11326J68980D112J18943B7141K53587J0344l6783n8637k4834
13028A70818J46802A13338N4157J4488b8558C2597L80882A28204K04414i9140
13017a65514F541b4357B58834A18361a25943o9394c4721k93706A75089a31658
$$ plain form
13006 240448 35999 -115842 127165 141778 190794 -139358 97356 -23500 -55874 345209 -126829
12994 -116245 192192 147790 41911 148499 252590 236710 -103061 83169 -192712 133332
12983 36444 89512 -101693 -161419 -59793 -101084 -165960 157827 76806 -152539 155277 159640
12972 159640 -170737 43898 -41225 -75875 -32455 -24543 5885 -202680 98370 -75437 63097
12960 289715 -52706 -140809 170090 -82538 31447 428275 -105327 -66268 198222 -146543
12949 79400 -252585 121318 171804 54020 252989 13529 -137104 133400 -60082 -15194 -109538
12938 -109538 136511 -78157 64780 36923 126285 187169 61973 4293 99610 88051 -52804
12926 153213 -224055 174111 201867 36465 231641 150578 -71248 22884 52195 -193167 235486
$$ packed form
13006B40448C5999a15842A27165J4613M9016a39358I7356b3500l2374C45209a26829
12994a16245A92192m4402D1911J06588J04091j5880a03061H3169a92712A33332
12983C6444N3068a01693n9726e9793m1291o4876A57827G6806a52539A55277M363
12972A59640a70737D3898d1225l4650c2455P912E885b02680I8370g5437F3097
12960B89715e2706q8103A70090h2538C1447L96828a05327L9059A98222a46543
12949G9400b52585A21318N0486E4020J98969A3529a37104A33400f0082a5194r4344
12938a09538A36511g8157F4780k7857Q9362O0884F1973D293R5317j1559e2804
12926A53213b24055A74111K7756C6465J95176q1063g1248B2884K9311a93167B35486
$$ plain form
12914 -145607 -18679 -28870 356026 -166929 -109795 -33988 -276184 19491 172799 282394
12904 282394 -12306 43694 24755 74873 152876 135735 140518 105457 252216 126285 -235928
12892 -7894 -288834 -313414 -261638 -229448 266102 144138 -73631 203110 238237 39767 113136
12881 113136 -19915 -231493 284884 257210 229055 -299818 -350673 -171945 -214333 -29453 185434
12869 -199655 36660 26257 -105424 122802 -8453 -37095 -68680 161130 62210 121111 85879
12858 85879 18222 192519 -90525 -102784 75186 46822 59597 -157227 157531 2963 -243415
12846 17996 -137054 139834 206481 252711 -70620 -117407 41809 152371 184210 -15565 286160
12834 34128 64151 -438189 -299972 175764 -45997 218764 299370 245971 49367 79227 226998
$$ packed form
12914a45607a8679j0191C56026a66929N7134c3988k42196A9491J53308J09595
12904B82394a2306D3694j8939N0118P8003j7141M783l5061J46759j25931b35928
12892g894k80940k4580N1776L2190B66102j21964g3631B03110L5127C9767P3369
12881A13136a9915k11578B84884k7674k8155b99818n0855a71945m2388b9453A85434
12869a99655C6660j0403a05424A22802h453k8642l1585A61130F2210N8901l5232
12858H5879A8222J74297i0525j2259G5186k8364J2775a57227A57531B963b43415
12846A7996a37054A39834O6647M6230g0620m6787D1809J10562L1839a5565B86160
12834C4128L0023d38189J38217A75764d5997B18764Q0606n3399D9367K9860J47771
$$ plain form
12823 226998 197323 64649 -81765 168917 -91596 74734 -69 137682 -9776 157360 66520 -237152
12810 -146828 87446 271363 -19666 25205 210564 -224525 79085 281686 -72275 62836 -112789
12798 -3670 10595 58532 347926 -145114 -186099 -238307 297650 -211461 -131999 140663 159588
12787 159588 -56288 -275198 -77079 -119890 -318649 155681 56954 -328954 -15146 -100082 -257920
12776 -257920 -54734 -188613 143169 89855 181502 38363 -177025 -214007 416065 -381014
12765 20516 84656 24128 -19241 103688 -223658 -231385 -105921 -414003 -129125 -82851 -53533
12754 -53533 78563 121990 -418771 -15335 178823 -182753 20240 -194658 104001 49478 344741
12743 344741 -211105 -177555 239141 68345 148691 178513 -34084 130018 462268 40833 -33847
$$ packed form
12823B26998k9675F4649h1765A68917i1596G4734f9A37682i776A57360F6520b37152
12810a46828H7446J83917a9666B5205J85359b24525G9085K02601g2275F2836a12789
12798c670A0595M7937K89394a45114m0985n2208B97650b11461P9462A40663J8925
12787A59588e6288k18910g7079m2811j98759A55681E6954c28954a5146q4936j57838
12776b57920e4734j33879A43169n3314R1647C8363a77025l6982D16065c81014
12765B0516O4140B4128a9241A03688b23658p727a05921l08082a29125M6274K9318
12754e3533G8563M3427d18771a5335A78823a82753B0240a94658A04001D9478K95263
12743C44741b11105L3550B39141F8345Q0346K9822c4084A30018L32250D0833c3847
$$ plain form
12731 -153089 414260 -6721 -5774 96697 105600 -173787 304705 -197091 -196001 94041 44003 -177779
12718 229859 376889 91460 -368237 217815 -16854 92717 148149 -82296 86405 58466 17953
12706 -25554 41208 540900 91858 288671 -46288 249535 10067 177864 38410 78822 -16091
12694 157957 8811 -354260 95537 -259631 62908 -171376 -241597 -220564 93836 -93577 -127405
12683 -127405 -13270 69635 -212036 148124 39662 414862 249623 69458 229007 103286
12672 -52145 -169220 71178 77519 -44806 152749 -37165 23414 -220431 20940 409144 29001
12660 -2865 -37444 -33295 -202719 159145 30459 362894 122279 166740 -79447 67824 139639
12649 139639 132536 118246 -99607 257752 129906 232947 -93511 -444292 404445 75661 141740
$$ packed form
12731a53089D14260f721R47I6697Q903a73787C04705a97091J090I4041D4003a77779
12718B29859J47030I1460c68237B17815a6854I2717N5432h2296H6405k7939A7953
12706b5554D1208M99692I1858J96813d6288B49535A0067J67797C8410M0412a6091
12694A57957H811c54260I5537b59631F2908a71376p0221K1033I3836i3577l3828
12683a27405a3270F9635b12036A48124C9662L75200j65239F9458J59549A03286
12672e2145j17075G1178O341d4806A52749c7165B3414b20431B0940L88204B9001
12660b865l4579M149j69424A59145C0459L32435A22279M4461g9447F7824P1815
12649A39639p103j4290i9607B57752j27846J03041i3511l50781D04445G5661O6079
$$ plain form
12638 141740 -11600 41335 -191902 190847 -7973 -51458 378126 330482 492659 300596 219166
12627 219166 122887 272925 301694 143137 8084 60599 696 -160264 95033 232698 -13348
12615 -112820 -78681 27199 -139084 136613 119334 90878 -147948 58096 176621 -217300
12604 -147047 -38643 -131458 388937 -48913 53398 375958 98378 127998 58127 220316 99181
12592 -178045 -227666 214880 -214312 136914 191898 -15686 99537 253695 117158 278348
12582 278348 38444 76264 145295 -17725 -119198 159682 206645 99065 38027 205404 -6414
12570 -201231 -236258 108314 251118 230883 -71959 10419 -15051 -75884 180114 249759 69206
12558 -206471 -18981 -220932 -338133 214879 -58462 41137 -211550 351841 50912 142395
$$ packed form
12638A41740a1600D1335a91902A90847g973m3485C78126m7644J62177j92063q1430
12627B19166r6279J50038K8769A43137H084N2515F96a60264I5033J37665a3348
12615a12820L4139B7199a39084A36613j7279k8456a47948E8096J18525b17300
12604a47047c8643r2815C88937d8913E3398L22560I8378K9620E8127J62189I9181
12592a78045m9621B14880b14312A36914N4984a5686I9537J54158A17158J61190
12582B78348C8444L7820O9031a7725j01473A59682M6963I9065C8027J67377f414
12570b01231l5027A08314J42804k0235g1959A0419a5051o0833A80114O9645F9206
12558b06471a8981k01951j17201B14879e8462D1137b11550C51841E0912R1483
$$ plain form
12548 142395 -35179 13329 -80208 90723 -163296 110279 324466 80388 200134 38065 -144134
12536 361465 -185522 117201 -180087 90947 50605 57144 42369 39035 -30199 60034 103801
12525 103801 88052 -266851 77944 78009 179668 35067 159060 89732 -118099 114127 -34223
12513 5620 100604 -84238 -172427 -41685 214242 42194 -69518 288766 207700 -21650 -45755
12502 -45755 21619 -69390 -299169 -224427 61172 -126838 -71516 74852 38673 49332 353268
12491 353268 64298 -136228 -12834 7539 179057 -194445 89650 121824 136282 48677 255022
12480 255022 10847 -525480 -76194 -130868 -156015 -104041 -247905 -135193 -39728 177267 223130
12469 223130 -169190 93261 71666 56215 -139246 -144736 205095 147364 -310003 88294 59056
$$ packed form
12548A42395c5179A3329h0208I0723a63296A10279K14187H0388J19746C8065a44134
12536C61465a85522A17201a80087I0947m0342O539j4775l334c0199F0034M3767
12525A03801j5749b66851G7944O5J01659C5067J23993o9328a18099A14127c4223
12513E620R4984h4238q8189d1685B14242D2194f9518B88766q1066b1650k4105
12502d5755B1619f9390k29779P4742F1172a26838N5322G4852l6179J0659L03936
12491C53268F4298a36228a2834G539J71518a94445H9650L2174J4458D8677K06345
12480B55022A0847e25480g6194n4674k5147N1974j43864J12712c9728A77267M5863
12469B23130a69190I3261k1595j5451a39246n490B05095n7731c10003H8294k9238
$$ plain form
12458 59056 211683 184304 70637 -83339 -36152 -23448 -202294 -34005 -156097 59967 -191647
12446 -150962 -193534 206029 185198 67619 -333261 -111912 135499 -85541 136432 -150373
12435 -96340 -190684 -129031 -103375 -41452 183680 -175013 -317042 133451 132344 430703 273836
12424 273836 65808 74692 -208770 44212 303389 -42004 -199124 201775 -110405 233437
12413 129636 -120091 -14462 -183862 181090 161167 108800 158748 -325521 61755 336695
12403 336695 -18372 -164173 131287 143393 -166254 -194841 39380 81846 31944 59165 13398
12391 -167143 66433 45691 -153224 66905 118555 124405 -240442 -9594 -400089 52622 50157
12380 50157 -257 47059 178455 -243102 -37793 174399 316877 -29231 211584 -225226 -331549
$$ packed form
12458E9056J52627k7379G0637h3339c6152J2704j78846c4005j22092E9967a91647
12446a50962m2572B06029k0831F7619c33261a11912A35499h5541A36432a50373
12435i6340r4344O1653K5656d1452A83680a75013j42029A33451j107K98359j56867
12424B73836F5808Q884b08770D4212K59177d2004j57120B01775a10405B33437
12413A29636a20091a4462j69400A81090j9923n2367M9948c25521F1755K74940
12403C36695a8372j45801A31287J2106a66254k8587C9380M2466C1944K7221A3398
12391a67143F6433k0742a53224F6905N1650N850b40442i594l90495E2622k465
12380E0157b57D7059J31396b43102c7793A74399J42478b9231B11584b25226j06323
$$ plain form
12369 -331549 172159 -151130 3507 60327 -139601 -121726 -216339 120103 19086 33729 -19977
12357 -33157 -25791 280433 238928 218786 110409 -16282 31989 211358 -70232 54266 -389723
12345 -170469 -77500 -99711 -13880 188178 91102 -119339 281770 321390 22417 241983 -243561
12333 -102378 -281488 164096 -95350 -31790 -210355 -18703 -157124 -152572 -344164 -103895
12322 -171599 -39455 1701 -101911 -56798 -124104 240486 139267 -55922 -81450 -218453 -53012
12310 189260 -31401 -247966 97008 25957 12001 -52298 213121 207452 264873 -21405 14544
12298 149346 -172688 243 -74635 126279 72672 187598 216086 42067 -8522 -77237 147203
12286 -47553 -90855 16931 162994 87546 136505 -72669 -136891 -17139 26250 93463 223924
$$ packed form
12369c31549A72159a51130C507N6820a39601J7875r4613A20103A9086J4643a9977
12357c3157P366B80433m1505k0142j08377a6282C1989J79369g0232E4266c89723
12345a70469g7500k2211a3880A88178I1102a19339B81770L9620B2417K19566b43561
12333a02378j79110A64096i5350c1790j78565a8703j38421M552j91592a03895
12322a71599c9455A701a01911M5113o7306B40486j01219e5922k5528j37003e3012
12310A89260c1401k16565I7008B5957A2001e2298B13121n669N7421b1405A4544
12298A49346a72688B43g4635A26279n3607J14926K8488D2067h522o8715A47203
12286d7553m3302A6931J46063p5448M8959g2669o4222a7139B6250O7213J30461
$$ plain form
12275 223924 263525 156265 138566 416037 171386 -43253 -153509 64931 -110286 158893
12264 362921 99886 -219944 -43309 253849 -20167 176085 -247643 -114574 247898 -57022
12253 211695 -122706 114884 237123 534089 206926 -264280 43270 146723 47977 28867
12243 28867 301979 44919 326217 -227611 34364 179859 319315 246988 36104 134372 141406
12232 141406 275228 380594 129805 240196 160954 30662 150020 61103 235654 87367
12221 -117395 368650 355883 257969 499322 -163779 -53913 126985 -31901 -1649 -107434 59896
12209 -7926 -17307 334258 226986 276153 239207 -77445 164793 -8517 218937 262713 69738
12197 139489 137352 -203021 -255188 -116620 -5994 99391 305860 102406 288732 109454 170609
$$ packed form
12275B23924L9601j07260j7699K77471A71386d3253j10256F4931a10286A58893
12264C62921I9886b19944d3309B53849b0167A76085b47643a14574B47898e7022
12253B11695a22706A14884J22239K96966B06926b64280D3270J03453D7977j9110
12243B8867K73112D4919K81298b27611C4364J45495J39456p2327C6104R8268P034
12232A41406J33822J05366A29805J10391p9242C0662J19358F1103J74551H7367
12221a17395C68650j2767r7914K41353a63779e3913A26985c1901a649j05785E9896
12209g926r381C34258j07272M9167l6946g7445A64793h517B18937M3776F9738
12197A39489k137b03021n2167a16620e994I9391K06469A02406J86326A09454O1155
$$ plain form
12186 170609 -29838 167433 85851 45813 106715 -143229 258266 450943 135042 84478
12176 84478 -116005 -160964 73007 -19659 269704 5168 318626 36513 262493 29945 319893
12165 319893 389473 304956 -65722 245784 89292 25851 5514 133025 -43023 48004 -35341
12153 -151506 58772 98864 155964 85653 111947 124220 137816 -134507 -221789 -89321 -132676
12142 -132676 -102430 80558 95592 133111 -152248 -97460 222488 228742 -15412 -178706 -336227
12131 -336227 626 9007 -67290 166328 -245319 13678 94927 -91830 -128913 -181242 269740
12119 22395 -154092 -66588 14468 352115 -347106 -112727 43116 -7361 271798 -16559 -40825
12108 -40825 -102099 126035 -60195 -179187 -469365 223614 168804 -108574 236604 204061
$$ packed form
12186A70609b9838A67433q1582m0038O0902a43229B58266J92677A35042n0564
12176H4478a16005m4959G3007a9659B69704E168L13458C6513K25980B9945K89948
12165C19893O9580q4517f5722B45784H9292B5851E514J27511d3023D8004c5341
12153a51506E8772M0092N7100p0311K6294J2273J3596a34507q7282h9321m3355
12142a32676L0246H0558J5034L7519a52248N4788B22488O254a5412j63294j57521
12131c36227F26Q381f7290A66328b45319A3678Q1249i1830l7083n2329B69740
12119B2395a54092f6588A4468L37647c47106a12727D3116g361B71798a6559k4266
12108d0825o1274A26035f0195j18992k90178B23614n4810a08574B36604l2543
$$ plain form
12098 204061 3097 27372 8520 243520 -186382 120431 -133192 -92035 -182139 12297 136006
12087 136006 24619 -196866 117997 151413 -264813 35195 360742 732655 1779440 1474194
12077 1474194 589675 196513 111341 204390 -178247 18573 88716 139521 54109 -373521
12066 -56294 -45147 -91007 -70255 -58267 168167 155266 -37862 77164 158113 514994 168991
12054 58386 -55487 3335 192973 315732 -71692 243859 -128407 13655 -197257 -178146 -17045
12042 -53970 -18214 342365 41139 18322 -68663 -265724 58620 133813 -30949 45783 50671
12031 50671 -157395 -232365 -46299 220498 -478365 -115551 -113550 92984 62708 19636 161382
12020 161382 162435 -145505 78974 164184 -250694 69741 106668 -35970 -199350 210494 -255725
$$ packed form
12098B04061C097K4275H520K35000a86382A20431a33192M1157r0104A2297J23709
12087A36006B4619a96866A17997L3416b64813C5195L25547L71913J046785l05246
12077A474194E89675A96513q5172R3049a78247A8573P0143N0805E4109c73521
12066e6294J1147m5860K0752J1988A68167j2901c7862G7164Q0949L56881A68991
12054E8386e5487C335J89638J22759g1692B43859a28407A3655a97257J9111a7045
12042e3970a8214C42365D1139A8322f8663j97061E8620P5193c0949D5783M888
12031E0671a57395p4970d6299B20498d78365a15551K001I2984l0276A9636J41746
12020A61382J053a45505G8974Q5210b50694F9741L6927c5970j63380B10494b55725
$$ plain form
12008 -156021 45206 17367 -227515 281619 -21774 155957 73957 98853 -177934 18375 -462121
11996 45978 -51856 288139 -196592 100744 119058 63880 305800 -37101 -182561 -353046
11986 -353046 -67517 -131922 -27577 -65193 -68614 204989 -158412 -63866 163260 -46153 -276572
11975 -276572 -165796 153054 294455 -204955 66235 -12802 -214446 96902 -89299 -390995
11965 -390995 -117306 -127871 -4395 -251367 284895 -103685 -28032 153376 -168200 -16130
11954 225562 184637 -107222 -6493 72078 -134857 -132911 46036 -46515 -320478 43424 101886
11943 101886 -6055 -47119 78471 137544 -79892 185642 116759 70528 -93253 -84205 -249839
11932 -249839 -128325 173532 21173 -279053 89871 -118271 -96455 -192509 192176 -40266
$$ packed form
12008a56021D5206A7367b27515B81619b1774A55957G3957K4896a77934A8375d62121
11996D5978e1856B88139a96592A00744J8314n5178K41920c7101j45460j70485
11986c53046f7517o4405b7577l7616l421B04989a58412f3866A63260d6153k30419
11975b76572J10776A53054J41401b04955F6235a2802k01644I6902h9299l01696
11965c90995a17306j0565d395k46972B84895a03685b8032A53376a68200a6130
11954B25562m0925a07222f493G2078a34857J946D6036d6515k73963D3424N8462
11943A01886f055m1064G8471N9073g9892A85642o8883m6231i3253R048j65634
11932b49839J21514A73532B1173b79053H9871a18271K1816r6054A92176d0266
$$ plain form
11921 3810 -30878 -46156 -196106 -289759 207261 -42640 -168647 -35946 -111116 -125864 -411357
11910 -411357 -114344 119526 -89050 107364 85897 156137 33851 234729 -32205 99634 125418
11899 125418 81364 88526 -170935 35111 -105965 -252148 585564 -409256 8748 -86303 -52540
11888 -52540 -217402 262986 275570 -140298 17527 -124801 105570 -164162 -186980 -192956 -56716
11876 -300922 72842 -158777 115761 -137978 35362 -339656 -41653 -227887 12791 -197133
11865 -301494 -302147 -236074 225781 208149 153888 300771 24814 -72221 -198467 183999 -425954
11853 -118563 134976 -58083 292626 -288848 158116 367789 32167 -119163 -100198 -42036
11842 608838 -27927 39548 -28035 24481 -370247 -306216 -109735 -26219 -101676 326102 -166397
$$ packed form
11921C810c0878j5278j49950r3653B07261d2640j26007c5946p5170j4748k85493
11910d11357a14344A19526h9050A07364k1467P0240C3851K00878c2205I9634K5784
11899A25418m4054P162a70935C5111a05965j46183E85564d09256H748h6303L3763
11888e2540j64862B62986J2584a40298A7527a24801A05570a64162k2818n976e6716
11876c00922G2842a58777A15761a37978C5362c39656d1653j86234A2791a97133
11865c01494o53O6073B25781j7632n4261J46883B4814g2221j26246A83999d25954
11853a18563A34976e8083B92626b88848A58116K09673C2167a19163J8965d2036
11842F08838b7927C9548b8035B4481c70247O4031a09735b6219p5457C26102a66397
$$ plain form
11830 -109774 195858 -142594 -61182 -169828 145876 69555 160397 -21112 -232342 29228
11819 97037 -236170 -83320 -71104 272282 188734 29790 135965 71553 -157392 -295608 96248
11807 -50119 -101811 -82897 184563 -57597 -35944 -59334 4252 37930 -59765 -163565 -258064
11796 -258064 17273 -94063 180089 -16995 -279016 174500 88435 60717 5603 315553 210862
11785 210862 55069 -172909 -83212 -288776 123684 80377 -104392 -71480 -172911 -213338
11775 -213338 -253816 -43764 -169039 257362 -212694 84720 -51389 -42668 -68824 159456 -429544
11763 -200598 -41373 148516 196236 67853 102300 -65177 -260831 -43097 63202 198197 -111846
11751 125777 240847 -76258 -18484 193066 -167408 -75122 152370 -40795 194616 -109748
$$ packed form
11830a09774A95858a42594f1182j08646A45876F9555R0842b1112k11230B9228
11819I7037b36170h3320J2216B72282q3548B9790J06175o4412a57392j38216I6248
11807e0119n1692J8914A84563e7597K1653k3390D252L3678e9765j03800r4499
11796b58064A7273i4063A80089a6995k62021A74500q6065k7718E603L09950j04691
11785B10862E5069a72909h3212k05564A23684m3307a04392L2912j01431m0427
11775b13338m0478d3764j25275B57362b12694H4720e1389Q721k6156A59456d29544
11763b00598d1373A48516M7720F7853L4447f5177j95654d3097F3202J34995a11846
11751A25777J15070g6258a8484A93066a67408g5122A52370d0795A94616a09748
$$ plain form
11740 48160 -175392 -10489 1450 -27448 -169753 -107083 21556 179493 -29157 39020 -200554
11728 48379 391310 59658 120646 -119357 -27086 176571 30666 4933 -424897 516 -55371
11716 -263648 -30276 289513 -116719 186698 183199 249084 -166514 136361 102748 -354942
11705 70774 116572 87352 219957 -240366 34050 -74536 -106933 196833 -326432 20668 -118109
11693 92324 -36768 65884 -208195 191226 97533 6036 -183259 -88312 262459 -60503 -259193
11682 -259193 146213 5920 -133822 393308 205639 20575 142235 -16722 91763 19057 227160
11671 227160 -39984 13196 -231918 120879 -137406 -72620 46498 -295398 -88135 -345167
11661 -345167 -84925 128798 86034 -95119 -98987 35479 141825 230259 -483 146128 93892
$$ packed form
11740D8160a75392a0489A450b7448j42305O2670B1556J57937b9157C9020b00554
11728D8379L42931E9658O0988a19357b7086A76571C0666D933d24897E16e5371
11716b63648c0276B89513a16719A86698l499O5885a66514A36361l3613c54942
11705G0774M5798k9220J32605b40366C4050g4536l2397A96833c26432B0668a18109
11693I2324c6768F5884b08195A91226r3693F036a83259h8312B62459f0503j98690
11682b59193A46213E920a33822C93308j87669B0575J21660a6722I1763A9057K08103
11671B27160c9984A3196b31918A20879a37406O4786D6498b95398h8135k57032
11661c45167h4925A28798m2764i5119l868C5479J06346Q8434d83A46128n2236
$$ plain form
11650 93892 -53086 2516 -113722 303302 4039 -319467 85344 65913 -24223 -24729 12117 -73435
11637 178421 -275152 -321135 81977 -51965 -228439 207682 -92618 39702 33095 176808 -192068
11625 -44299 93425 245645 179405 247494 88818 57849 -24916 -6677 -260097 -300781 -191338
11614 -191338 -128429 10752 173861 -54550 631497 25879 169477 70767 -272839 -159573
11604 -159573 199827 193455 158593 -252767 63059 -87956 213037 -36959 96066 79066 -140342
11592 102729 72683 346807 151883 -81418 -98310 283043 -59328 -138690 -234914 -219918 -113295
11581 -113295 28916 -140118 28459 35426 141976 62777 57865 -103129 -7883 -130848 49546
11569 262871 -39343 243967 71925 66944 177552 -96065 18557 93034 112342 333446 99367
$$ packed form
11650I3892e3086B516a13722C03302D039c19467H5344j9431b4223n06A2117g3435
11637A78421b75152m5983H1977e1965j76474B07682i2618C9702o607J43713a92068
11625d4299I3425J52220o6240O8089H8818l0969b4916f677k53420m0684J09443
11614a91338O2909A0752J63109e4550F31497B5879J43598G0767b72839J13266
11604a59573A99827o372l4862b52767F3059h7956B13037c6959I6066j7000a40342
11592A02729l0046K74124A51883h1418j6892B83043e9328p9362r6224J4996J06623
11581a13295B8916a40118B8459O967J06550F2777m912a03129g883j22965D9546
11569B62871c9343B43967G1925m981J10608i6065A8557P4477J9308K21104I9367
$$ plain form
11557 390687 -171634 107973 48293 44635 -135582 -275371 -238777 253399 1937 305727 307447
11546 307447 -174294 186267 -36845 1394 -79470 -63635 47248 -28133 24015 -98 -192564 133717
11533 -15444 168046 68160 -352932 173800 80064 -138157 109320 31071 -23560 6373 337135
11522 337135 150653 -58411 245371 -100259 -27241 262127 265151 60341 -237618 280883
11511 -2039 339367 354029 -28640 -84486 300294 270720 -95481 267155 199880 -142891 -146993
11500 -146993 -1932 -346746 190845 27900 -60810 119403 -115870 -65100 377105 34989 115294
11489 115294 387471 -94201 -66598 206135 24917 -23057 250995 203507 -235043 177797
11478 125473 40736 58671 397500 225312 -44538 138447 77284 209836 280859 179030
$$ packed form
11557C90687a71634A07973D8293l658a35582j39789L6594B53399A937L03790J720
11546C07447a74294A86267c6845A394g9470J5835D7248b8133B4015i8j92466A33717
11533a5444A68046F8160c52932A73800H0064a38157A09320C1071b3560F373L30762
11522C37135A50653e8411B45371a00259b7241B62127L024F0341b37618B80883
11511b039C39367J4662b8640n5846C00294k9574i5481B67155o7275a42891m102
11500a46993a932l44814A90845B7900f0810A19403a15870N0770C77105C4989Q0305
11489A15294K72177i4201K7603B06135B4917b3057B50995m7488b35043A77797
11478A25473D0736J7935L38829j72188d4538A38447o1163J32552P1023j01829
$$ plain form
11468 179030 210662 -363376 65865 148518 75793 -13348 -43342 61284 -48532 245356 108326
11456 447841 18154 -164662 -78107 214334 41878 41524 164089 116460 29831 168133 -88092
11444 278660 46921 83759 204554 93352 340421 74633 155085 -92377 135357 51784 131898
11433 131898 -152168 -44970 -324133 -59503 139685 -211359 247111 71918 -120625 -251869
11423 -251869 12367 -118886 -83270 -249538 40900 68998 -174516 324075 79652 -62848 227830
11411 -257126 -19236 -134595 -143231 -197267 133257 108680 153763 -21010 -199510 -65598 153990
11399 71077 -54810 52672 -138665 142362 -28885 -145428 -293384 19712 -233438 -107411
11388 -15219 -117281 -342401 -138050 -43583 -14040 -149847 -16420 -55109 -172744 -9216 -141542
$$ packed form
11468A79030L1632c63376F5865Q2653p2725a3348k9994F1284d8532B45356A08326
11456D47841A8154a64662g8107B14334D1878l54J22565m7629B9831J38302h8092
11444B78660D6921L6838J20795I3352K47069G4633Q0452i2377A35357E1784Q0114
11433A31898a52168d4970k79163e9503A39685b11359B47111G1918a20625j31244
11423b51869A2367a18886L5616j66268D0900K8098a74516C24075G9652f2848B27830
11411b57126a9236j15359q636n4036A33257k4577M5083b1010j78500f5598A53990
11399G1077e4810E2672a38665A42362b8885j16543j47956A9712b33438a07411
11388a5219j02062k25120a38050d3583a4040j35807a6420l8689j17635i216j32326
$$ plain form
11377 -141542 144738 3111 232540 -102641 74835 262795 -150884 -7244 290453 -63729 210364
11365 37929 -184991 48793 17968 -311888 -30796 -105451 -199499 -162881 -225449 222849 -141281
11353 -82185 90600 238593 -9732 -133657 -14539 12484 -22034 173943 22278 -31111 -234505
11342 -234505 -61184 63449 -145157 -51091 -256093 45507 -530799 88623 108182 -238626 158243
11330 20030 73361 60118 232944 103889 125320 176104 -101775 -138541 11128 -147390 -312012
11319 -312012 -41305 143723 -32589 -204343 89319 -141737 -61470 70645 -9608 -12883 -268127
11308 -268127 295329 -140788 -114951 119522 61513 -184299 60462 -61670 57194 -140760
11297 -19877 -100883 -131336 -236694 194659 -100920 -293586 -113439 -288518 -106661 -141524
$$ packed form
11377a41542A44738C111K29429a02641G4835J87960a50884g244B90453f3729B10364
11365C7929a84991D8793A7968c11888c0796p4655r4048L6618o2568B22849a41281
11353h2185I0600J47993i732j23925a4539A2484b2034A73943B2278c1111k03394
11342b34505f1184F3449a45157e1091k05002D5507e30799H8623J9559b38626A58243
11330B0030N3331j3243J72826A03889K1431N0784a01775l6766A1128a47390j64622
11319c12012d1305A43723c2589j71754H9319a41737f1470G0645i608l275k55244
11308b68127B95329a40788K5837A19522n8009a84299F0462f1670E7194a40760
11297a9877q1006l0453j05358A94659a00920j92666a13439j75079a06661l4863
$$ plain form
11287 -141524 17150 -52869 -69056 233977 -286946 -143911 90703 149667 129379 60630 -218203
11275 69095 230612 -533873 311311 50283 -494786 -122113 -169808 -49295 71195 -255508
11264 -150236 139971 45842 263583 71913 -91862 -74505 134129 -82917 -251428 -10767 -343052
11253 -343052 -223859 -14510 143318 61068 170501 234245 -3775 -93945 -15251 40330 15575
11241 -35870 22407 238061 -109756 -68427 34938 -122509 -78661 7479 -82087 161875 106688
11230 106688 83370 -89934 -149295 71305 -53026 -70806 64411 121690 223649 -287944 126942
11218 115681 235103 -304772 -337919 4587 53245 51624 -88046 -192834 64494 38534 -93785
11206 -175240 -199557 -418383 -35780 86921 -458689 124024 154469 91366 31695 -282236 60614
$$ packed form
11287a41524A7150e2869j6187B33977b86946J43035I0703N8964k0288F0630b18203
11275F9095J61517e33873C11311E0283d94786a22113m7695d9295G1195b55508
11264a50236A39971D5842K17741G1913i1862J7357A34129h2917j68511a0767l32285
11253c43052J19193a4510A43318F1068J09433O3744c775r0170a5251D0330A5575
11241c5870B2407K15654a09756M1329C4938a22509M3848G479h2087A61875n5187
11230A06688k3318h9934n9361G1305e3026j7780F4411N7279J01959b87944A26942
11218A15681J19422c04772l3147D587M8658j621h8046j04788F4494k5960i3785
11206a75240k4317k18826c5780H6921d58689A24024L0445o3103C1695b82236F0614
$$ plain form
11194 -76542 11229 -92407 -133268 -174629 -140090 100755 114658 -196085 -54348 -108008 -351837
11183 -351837 212564 -383211 -345623 -33675 -480994 47429 208291 -148562 90061 -551678
11172 -55247 38639 -213556 62555 283512 273349 210946 91202 131001 -109449 71723 -184262
11160 -123565 363239 115563 45795 -56817 165838 64989 105603 99617 197095 -139462 158294
11148 89041 -134743 95331 9413 128558 268184 -229119 419381 -250276 -259775 -245475 -221075
11137 -221075 377418 41162 -24933 -139501 130248 49157 165519 -374450 116505 284007
11127 284007 227520 -197128 -175164 -5774 183247 -211628 -105943 40939 -34120 -156780 209811
11115 100580 454360 -153823 -11602 19163 86865 8002 -62192 381455 431518 331742 188964
$$ packed form
11194g6542A1229i2407m0861m1361L4539A00755J3903a96085e4348n3660k43829
11183c51837B12564c83211L7588c3675m47319D7429J60862a48562I0061e51678
11172e5247C8639b13556F2555K20957j0163o2403I1202L9799a09449G1723a84262
11160a23565C63239A15563D5795e6817A65838F4989M0614n986R7478a39462A58294
11148H9041a34743I5331I413J19145J39626b29119D19381b50276r499J4300K4400
11137b21075C77418D1162b4933j14568A30248D9157J16362c74450A16505J67502
11127B84007n6487a97128K1964e774A83247b11628J05685D0939c4120j22660B09811
11115A00580L53780a53823a1602A9163O7702H002f2192C81455N0063r9776j42778
$$ plain form
11104 188964 58493 -185250 150215 120135 123223 435757 213930 108104 -72561 282958
11093 -11602 172181 298642 68838 162702 117813 123621 349873 50246 433142 6428 385863
11082 385863 -50213 -185091 288974 59598 -82019 171053 378679 158134 300740 275624
11072 275624 405166 217963 380406 638515 288906 195045 23030 330660 189038 330389
11062 330389 221568 177122 616795 563644 313152 538019 573409 844801 677610 613512
11052 613512 831399 395264 748296 537252 379686 464362 727166 452710 690237 502690
11042 502690 572188 563495 434204 834311 604742 433961 800789 335112 536613 541988
11032 541988 467732 460828 741600 755754 683741 715930 641009 377719 658384 665298 271402
$$ packed form
11104A88964E8493a85250A50215l0080L088L12534B13930j05826g2561B82958
11093a1602A72181J26461F8838R3864m4889N808K26252E0246L82896F428L79435
11082C85863e0213j34878B88974E9598h2019A71053K07626A58134J42606k5116
11072B75624J29542j87203J62443K58109B88906r3861B3030L07630j41622J41351
11062C30389j08821m4446M39673n3151k50492K24867L5390K71392j67191o4098
11052F13512K17887C95264L53032k11044j57566Q4676K62804k74456K37527j87547
11042E02690O9498q693j29291M00107k29569j70781L66828C35112K01501N375
11032E41988p4256o904K80772J4154p2013L2189p4921k63290K80665O914B71402
$$ plain form
11020 436949 299349 279629 318145 403778 197886 359163 538125 410145 547348 336664
11010 336664 585019 337441 212496 404757 535438 690134 531994 244299 306558 571854
11000 571854 443623 639194 589660 623965 653031 333183 419206 661834 564582 409449
10990 409449 541037 404190 535732 941989 915683 704218 893377 1012214 1023828 733076
10980 733076 874483 1255208 1380228 1218623 1800114 1803769 2126452 1969953 2018136 2199004
10970 2199004 2309269 1953799 1846856 1657580 1529833 1326241 1233846 1048180 1220397 1337806
10960 1337806 1318362 1366845 1475714 1038696 1294441 1395911 1061504 977661 820090 930215
10950 930215 570998 428653 186384 71253 112135 412917 143079 169465 409504 292408
$$ packed form
11020D36949j37600j9720L8516Q5633A97886J61277J78962j27980J37203k10684
11010C36664K48355k47578j24945J92261J30681J54696j58140B44299O2259K65296
11000E71854j28231J95571m9534L4305K9066l19848Q6023K42628r7252j55133
10990D09449J31588j36847J31542M06257k6306k11465J89159J18837J1614k90752
10980G33076J41407L80725J25020j61605N81491L655L22683j56499M8183J80868
10970B199004J10265l55470j06943j89276j27747k03592r2395j85666J72217J17409
10960A337806j9444M8483J08869m37018K55745J01470l34407q3843j57571J10125
10950I30215l59217j42345A86384G1253M0882L00782A43079K6386K40039j17096
$$ plain form
10940 292408 303331 77912 166311 -37824 314260 142133 -365052 -148780 -70791 104437
10929 278810 216734 -132840 232533 12579 -45591 153555 296729 -7690 133055 58917 -229402
10917 -290593 -38443 -174944 249525 -380675 2166 116814 179353 22879 -145156 -42378 110074
10905 220144 31847 14216 -31906 15078 -323239 -289648 -3887 46143 -165287 -85957 -21818
10893 413337 -172458 1895 122296 180381 336585 -6987 -381788 -170768 87830 -6754 145960
10881 40110 -140937 8032 -17975 118981 27140 13876 -279433 -220219 162660 -58604 -32270
10870 -32270 -168275 225175 41629 92586 -212837 -217824 133552 176959 -65823 5654 -68726
10858 203448 -223263 63077 159788 31929 17488 -251860 89056 324416 -174212 -66979 -6998
$$ packed form
10940B92408J0923G7912Q8399c7824C14260A42133c65052a48780g0791A04437
10929B78810o2076a32840B32533A2579d5591A53555J43174g690A33055E8917b29402
10917b90593c8443j36501B49525c80675B166J14648O2539B2879a45156d2378A10074
10905B20144C1847A4216c1906A5078c23239L3591c887D6143a65287P9330b1818
10893D13337a72458A895J20401N8085J56204f987l74801a70768H7830f754A45960
10881D0110a40937H032a7975A18981B7140j3264b79433N9214A62660e8604K6334
10870c2270j36005B25175D1629N0957b12837m987A33552M3407f5823E654f8726
10858B03448b23263F3077R6711C1929j4441b51860H9056K35360a74212f6979f998
$$ plain form
10846 76252 -51112 -25498 80280 -73020 145091 -189634 102566 -67396 27217 -286462 381911
10834 -43221 -258283 216104 4839 88804 324525 -12410 -87247 148702 115889 119614 211165
10823 211165 230298 -12046 -53443 -100832 140003 -89126 -128668 83044 -121232 286398 159604
10812 159604 30053 94630 -154389 -24288 -31732 68201 -226621 -131920 -124875 102891 186630
10801 186630 -127831 50535 -294020 228175 66135 190164 47907 208540 -87794 -28537
10790 -164237 -73310 5835 -470389 -14077 -28503 -101035 -172988 91912 -297706 23308 -69067
10778 -181540 49604 -141677 44328 -19018 -214957 -158578 216965 7861 -91631 -68417 -8234
10766 -153289 42281 -282484 94173 -152060 154801 81789 89323 188994 -215608 -85182 -44542
$$ packed form
10846G6252e1112b5498H0280g3020A45091a89634A02566f7396B7217b86462C81911
10834d3221k15062B16104D839Q3965K35721a2410p4837A48702l2813L725R1551
10823B11165J9133a2046m1397m7389A40003h9126l9542H3044a21232B86398j26794
10812A59604C0053O4577a54389b4288p444F8201b26621R4701P045A02891Q3739
10801A86630a27831E0535b94020B28175F6135J24029D7907J60633h7794b8537
10790a64237g3310E835d70389a4077j4426p2532p1953I1912b97706B3308f9067
10778a81540D9604a41677D4328a9018j95939N6379B16965G861i1631K3214h234
10766a53289D2281b82484I4173a52060A54801p3012P534R9671b15608h5182M0640
$$ plain form
10755 -44542 -72574 87978 -319554 -19525 -363585 -188517 106534 -51259 293657 -103012
10744 195482 1255 -356380 167096 148806 -169087 -298470 -156582 -11830 21264 62851 -139932
10732 67422 82651 -215691 79516 -76093 -115099 -67785 -358728 277460 70342 65305 11736
10720 -150847 115144 193012 -241654 -143899 -96804 68218 28042 -37603 -44347 150394 -185051
10708 -80277 -165148 -105194 73979 -182088 -240093 -165426 125228 105918 7226 -72009 -66118 -84902
10696 -84902 29027 -16071 -26669 4114 340163 78203 9220 158273 -418731 -298722 -59417
10684 -247439 98865 -31319 -235002 161480 -35998 56580 121930 46450 32847 -230085 -57304
10672 62431 47861 362109 -29046 52582 -530400 -92169 301679 -190804 -187384 -230070 34281
$$ packed form
10755d4542k8032H7978c19554a9525l44060J75068A06534e1259B93657a03012
10744A95482A255c56380A67096j8290a69087j29383J41888a1830B1264M1587a39932
10732F7422J5229b15691G9516g6093l9006M7314k90943B77460G0342n037A1736
10720a50847A15144P7868b41654R7755M7095F8218B8042c7603o744A50394a85051
10708h0277q4871N9954G3979a82088n8005P4667A25228j9310G226g2009N891j8784
10696h4902B9027a6071j0598D114L36049G8203I220J49053d18731J20009e9417
10684b47439I8865c1319k03683A61480c5998E6580O5350D6450j3603b30085e7304
10672F2431j4570L14248b9046E2582e30400i2169C01679a90804L420m2686C4281
$$ plain form
10660 -182697 11020 -117714 -80410 69569 237919 -188447 -27483 -231383 387905 -401044
10649 -109799 -79002 -172976 -71682 162342 14586 -41207 142658 -239694 37886 153997 -230294
10637 -150187 -132383 191435 -50027 84 -11969 135241 258384 106347 79633 -155799 84043
10625 89969 170532 -31947 -42404 -70037 -31780 -183357 67356 307251 243297 -130845 -219683
10614 -219683 134054 -101365 -59279 -109100 173102 -145957 -69525 120030 67181 -73068
10603 21228 145226 48608 103396 265500 -417869 -32577 -5881 117948 -56129 -79775 -89831
10592 -89831 122099 77170 112519 -187451 86860 -197922 -190074 -314841 -310047 -132364 -289019
10581 -289019 -219834 -206972 -406191 -70780 -52212 175958 202419 -120686 313560 134869
$$ packed form
10660a82697A1020a17714L7304F9569J68350a88447b7483k03900C87905d01044
10649a09799L0797r3974g1682A62342A4586d1207A42658b39694C7886J16111b30294
10637a50187J7804A91435e0027H4a1969A35241J23143A06347k6714a55799H4043
10625H9969Q0563c1947j0457k7633c1780j51577F7356K39895o3954a30845q8838
10614b19683A34054a01365M2086m9821A73102a45957f9525A20030n2849g3068
10603B1228J23998D8608N4788J62104d17869c2577e881A17948e6129k3646j0056
10592h9831A22099m4929L5349a87451H6860a97922P848j24767M794a32364j56655
10581b89019O9185J2862j99219g0780J8568A75958K6461a20686C13560A34869
$$ plain form
10570 -368488 -153372 -201865 2567 -357582 67308 -191024 -144247 107337 -182756 -130359 50487
10558 -330152 -9550 -95729 174331 -136880 19709 275846 -361071 215507 -27909 -120376 -186384
10547 -186384 687 -259215 35129 -147544 -167056 194566 -175333 -302052 119576 -124345
10536 -514922 -140373 230464 -224927 90608 -48290 70940 34613 -72234 -195488 13912 -290084
10524 -5674 30360 112500 -32630 38821 14062 -242543 -82722 124448 -60915 -141341 200029
10512 165274 -45758 40394 129741 -159405 63863 161438 -121822 -82009 -221493 -179799 -167219
10501 -167219 101214 -34488 -135837 318364 -26406 60450 -188187 452205 -31172 73157
10490 -63149 1142 188141 -176738 -59683 191300 159117 69683 457073 175269 340531 658371
$$ packed form
10570c68488a53372m8493B567c57582F7308a91024M6777A07337a82756N2397E0487
10558c30152i550q6179A74331a36880A9709K56137c61071B15507b7909r2467o6008
10547a86384F87b59215C5129a47544j9512A94566a75333j26719A19576a24345
10536e14922a40373B30464b24927I0608d8290G0940C4613g2234j23254A3912b90084
10524e674C0360Q2140c2630C8821A4062b42543h2722A24448f0915q0426B00029
10512A65274d5758D0394Q9347a59405F3863R7575a21822L9813j39484M1694J2580
10501a67219A01214c4488j01349C18364b6406F0450a88187D52205c1172G3157
10490f3149A142J86999a76738e9683A91300l2183F9683L87390A75269J65262L17840
$$ plain form
10479 658371 363557 132336 23522 180814 -310041 36291 113289 95566 -141271 -106228
10469 -106228 157850 26484 -338520 -181207 66154 -252970 140039 -136336 32083 176605
10459 176605 177607 32753 -5229 202263 -25150 9477 -291349 141153 128708 -150804 -121782
10448 -121782 105996 1289 -476 58057 122258 -176029 10096 360085 529783 -333310 -187680
10437 -187680 -275675 121830 -306825 -210956 139950 -230525 27512 38723 101742 -306118
10426 19253 -116903 -405784 -167254 -92807 -96275 -20696 104202 49470 315009 -69006 38343
10414 282043 117052 -125563 -356022 -83061 203855 266660 -37555 -87222 -116948 95022 -80103
10402 12495 155474 30008 34252 -117858 173473 124882 -146202 -116946 218623 331863 326995
$$ packed form
10479F58371k94814A32336B3522J57292c10041C6291P6998j7723a41271L5043
10469a06228A57850B6484c38520J57313F6154b52970A40039a36336C2083J44522
10459A76605J002C2753e229B02263b5150I477b91349A41153j2445a50804K9022
10448a21782A05996A289d76E8057O4201a76029A0096L49989J69698c33310J45630
10437a87680q7995A21830c06825R5869A39950b30525B7512J1211O3019c06118
10426A9253a16903k88881a67254P4447l468b0696A04202D9470K65539f9006C8343
10414B82043A17052a25563k30459h3061B03855O2805c7555m9667k9726I5022h0103
10402A2495J42979C0008M244a17858A73473m8591a46202K9256B18623J13240m868
$$ plain form
10391 326995 359656 236055 -35247 147113 -243385 -84467 236879 112648 129230 19462
10380 12944 258433 192470 474485 161967 221462 64349 400298 13293 -67562 427642 319929
10369 319929 -71284 285993 226664 369740 610510 330526 180677 279165 43953 197128
10359 197128 262393 -147009 111691 -148583 109066 280717 161770 538506 537699 672201
10349 672201 15552 50212 216575 413789 17425 158927 314812 -57422 -60664 220229 336511
10338 336511 90821 260275 -17387 77605 49867 251592 296482 21343 256575 -283754 -56318
10326 -95436 323137 -315980 -77227 953 91823 8103 -45081 85090 162568 -54648 274582 122875
10313 -196286 269314 -38964 160595 -138253 -67365 48089 -69911 169577 -115640 -114713 230034
$$ packed form
10391C26995L2661j23601c5247A47113b43385h4467B36879A12648J6582A9462
10380A2944K45489o5963K82015A61967N9495F4349L35949A3293f7562D27642j07713
10369C19929g1284B85993n9329J43076K40770k79984j49849R8488D3953J53175
10359A97128O5265a47009A11691a48583A09066J71651j18947L76736q07J34502
10349F72201A5552L4660J66363J97214A7425J41502J55885e7422l242B20229J16282
10338C36511I0821J69454a7387G7605k7738K01725M4890B1343K35232b83754e6318
10326i5436C23137c15980g7227I53R0870H103d5081H5090P7478e4648B74582A22875
10313a96286B69314c8964A60595a38253f7365D8089f9911A69577a15640R27B30034
$$ plain form
10301 -249233 9554 -16788 325312 -9008 173472 -283874 150584 28771 284645 -24555 189685
10289 224362 -314781 -226459 276050 -203063 -25699 -102059 116999 30652 -226680 -23380
10278 199991 216837 -450483 45835 -918 3956 -107110 -12989 -139086 145820 -155031 -137195
10267 -137195 -287588 -7529 101398 -159990 -9168 -88896 -5625 160896 410856 21420 186239
10256 186239 179785 414959 295333 8003 -81070 -85119 1292 54010 156067 288972 7303 124344
10244 124344 200974 -216074 17609 240730 112847 -42066 -60517 139536 156917 108023 87685
10233 87685 -198175 197954 -16778 278277 67996 -169923 233405 -13159 -190781 -88062
10222 -78098 -487369 -88004 -68657 -16439 68136 -15106 -103840 -40447 152695 -316659 122
$$ packed form
10301b49233I554a6788C25312i008A73472b83874A50584B8771K55874b4555A89685
10289B24362c14781Q8322B76050b03063b5699p6360A16999C0652b26680b3380
10278A99991J6846d50483D5835i18C956a07110a2989j26097A45820a55031J7836
10267a37195j50393g529A01398a59990i168p9728e625A60896K49960B1420J64819
10256A86239o454K35174j19626H003h1070m049A292N2718J02057J32905G303J17041
10244A24344P6630b16074A7609K23121A12847d2066j8451A39536J7381m8894k0338
10233H7685a98175A97954a6778B78277F7996a69923B33405a3159j77622h8062
10222g8098m09271h8004J9347a6439F8136a5106q8734d0447A52695c16659A22
$$ plain form
10210 -151369 200352 57969 -73 -98128 -219461 -10152 -510779 -56267 -7650 -317662 -364872
10199 -364872 -209816 76665 -287575 -26126 -584 -49135 250019 16701 -173033 -195992 -51922
10187 -269324 -67631 -290591 97024 -79820 -99180 -73160 -228456 -107498 -530341 68716 -199135
10175 -177886 41985 41774 123895 -186072 -378489 206176 -176580 -58958 -148196 -22646 -130569
10164 -130569 237041 179148 -293743 42232 66196 24289 18093 114612 52080 120510 -341420
10152 92730 -220846 20370 -136657 63438 -16352 -180067 162100 288213 -98707 -32751 246062
10140 45794 -57826 -134434 -94586 -80890 -212579 -216349 39412 135856 -145933 242977 -167188
10128 -258154 -46411 -78432 -124507 200047 43641 -98252 -109488 -176070 -132282 24829 71308
$$ packed form
10210a51369B00352E7969g3r8055j21333a0152n00627e6267g650l10012m7210
10199c64872J55056G6665b87575b6126e84m8551B50019A6701a73033k2959e1922
10187b69324f7631k22960I7024g9820j9360K6020j55296a07498m22843F8716a99135
10175a77886D1985k11Q2121a86072j92417B06176a76580e8958q9238b2646j07923
10164a30569B37041n7893b93743D2232K3964B4289o196R6519E2080O8430c41420
10152I2730b20846B0370a36657F3438a6352j63715A62100J26113i8707c2751B46062
10140D5794e7826p6608L9848J3696j31689l770C9412R6444a45933B42977a67188
10128b58154d6411l2021m6075B00047D3641i8252j1236o6582M3788B4829M6479
$$ plain form
10117 71308 -28232 5773 71501 -65721 -202702 -142600 59609 -266864 -108769 270678 -178030
10105 -58644 -100668 76810 -90895 -122050 -352331 98214 -21206 76512 -161758 -324932 102076
10093 48168 -119321 140028 -82662 -306324 -79738 40258 -121494 566950 -79110 -235259
10083 -235259 -23193 -279273 172297 -238887 -250356 90541 -58275 -57251 -11356 -348782 20426
10071 95201 -34173 -38133 -76748 -6842 -191901 -50051 -63551 19277 -315321 56545 59167 147412
10059 147412 -365743 292182 171086 107394 111501 -282913 -120714 -294558 -91184 490076
10048 289660 -84653 62406 -13118 182763 232035 -216832 -21295 -285799 -124981 -346853
10038 -346853 -158874 223821 70148 -41451 -89761 44917 -170105 63652 97393 119613 64388
$$ packed form
10117G1308b8232E773O5728f5721j36981O0102E9609b66864a08769B70678a78030
10105e8644m2024G6810i0895l1155k30281I8214b1206G6512a61758j63174A02076
10093D8168a19321A40028h2662k23662g9738D0258a21494E66950g9110j56149
10083b35259b3193k56080A72297b38887j1469I0541e8275J024a1356l37426B0426
10071I5201c4173l960l8615f842j85059e0051j3500A9277c15321E6545K622Q8245
10059A47412c65743B92182j21096o3692M107b82913a20714j73844i1184D90076
10048B89660h4653F2406a3118A82763M9272b16832b1295k64504a24981k21872
10038c46853a58874B23821G0148d1451m8310D4917a70105F3652L3741K2220n5225
$$ plain form
10027 64388 -36236 -254474 148284 -235730 -353640 -221454 12693 -31062 -235773 -327231
10017 -327231 -389785 262438 -134830 -218221 -250232 -83170 -15221 -50863 342469 -223072 -209137
10006 -209137 -47776 170064 -76107 -64416 -343511 328472 -419656 -107172 -88177 -201440
9996 -201440 -348651 -163302 -409137 -326452 9743 171890 169303 -89148 179473 29231 113391
9985 113391 47350 -140766 123119 -24505 319256 -8911 -210515 229 -81955 2118 -228396
9973 26805 -114196 -211709 -177736 39750 18192 -184206 229348 37814 70786 156509 293814
9962 293814 221737 28168 -101313 -322830 -304297 67225 -132489 53709 378850 -18570 -17180
9951 -17180 89596 -97324 -361 -113740 -52418 -23630 -136035 -109169 -131354 93257 147936 -90608
$$ packed form
10027F4388c6236k18238A48284b35730j17910J32186A2693c1062k04711r1458
10017c27231o2554B62438a34830q3391l2011h3170a5221l5642C42469b23072J3935
10006b09137d7776A70064g6107J1691k79095C28472d19656a07172J8995j13263
9996b01440j47211a63302k45835Q2685I743J62147k587h9148A79473B9231Q4160
9985A13391D7350a40766A23119b4505C19256h911k01604B29h1955B118b28396
9973B6805a14196r7513L3973C9750A8192a84206B29348C7814L2972Q5723J37305
9962B93814p2077B8168a01313k21517J8533F7225a32489E3709L25141a8570J390
9951a7180H9596i7324c61j13379e2418b3630j12405K6866k2185I3257N4679i0608
$$ plain form
9938 78948 157529 -56176 -88541 -24328 -97474 -83579 -110882 100266 -410284 313213 11370
9926 -141833 140674 -21979 237778 132862 130772 142983 -457975 91986 147797 118560 -57781
9914 -100032 -92402 70330 36178 32907 -265089 -17814 -10105 -119731 -48568 59147 35328 -1781
9901 -146054 -427735 158516 -17198 -116660 -36016 10273 -82312 -382734 2374 223471 -116173
9889 -149458 -192591 -258050 58938 -14270 -26636 -189393 -2390 108364 -46910 19647 22763 -375660
9876 -127279 -73135 -21897 -173806 -85927 -60696 172959 -165368 6923 -122072 -70527 83776
9864 -115042 -116889 -294207 -139784 -288032 -40314 184837 -195031 -73315 7335 -142325 -146232
9853 -146232 -168424 -63068 -97827 133370 -46668 40694 -272707 114913 -21363 -172783 -304076
$$ packed form
9938G8948P8581e6176l2365b4328p3146J3895k7303A00266d10284C13213A1370
9926a41833A40674b1979B37778j04916k090J2211d57975I1986N5811k9237e7781
9914a00032P630G0330l4152l271b65089a7814P709j09626d8568E9147k3819a781
9901a46054k81681A58516a7198r9462c6016A0273h2312l00422B374K21097a16173
9889a49458m3133o5459E8938a4270j2366j62757b390A08364d6910A9647L116c75660
9876a27279N4144b1897j51909h5927K5231A72959a65368F923a22072N1545H3776
9864a15042j847j77318a39784j48248d0314A84837a95031g3315G335a42325l907
9853a46232k2192f3068l4759A33370d6668D0694b72707A14913b1363j51420j31293
$$ plain form
9842 -304076 65590 203999 -160877 288589 -267483 25299 -103763 89845 -303016 236869
9831 -27411 135358 -30288 41859 -370857 -91034 126313 317170 -92495 47747 -104448 60069
9819 -108518 -278051 -20247 115336 -46560 -19632 -127369 130150 -85887 -152102 -145307 198438
9807 -234629 -152342 73181 -292511 -47292 -115990 123358 -230307 -296650 -132190 -74397 75198
9795 -59464 140800 175587 78749 -5302 -53569 232391 49976 -278843 177936 -256985 -231054
9784 -231054 119127 7495 -188858 67063 -133790 -5608 146508 -63393 -52770 48406 -74871
9772 -19453 43072 -20353 -225732 -99039 220537 -273747 196716 -313207 -281393 137323 -318089
9760 53955 -1913 -258666 -40060 -344989 53634 -58774 85781 -128666 -425641 -126809 -121085
$$ packed form
9842c04076F5590J38409a60877B88589b67483B5299a03763H9845c03016B36869
9831b7411A35358c0288D1859c70857i1034A26313J90857i2495D7747a04448F0069
9819a08518j69533b0247A15336d6560a9632j07737A30150h5887o6215O795A98438
9807b34629Q2287G3181b92511d7292o8698A23358b30307o6343a32190N7793G5198
9795e9464A40800L4787G8749e302m8267B32391D9976b78843A77936b56985K5931
9784b31054A19127G495a88858F7063a33790e608A46508f3393J0623D8406g4871
9772a9453D3072b0353k05379i9039B20537b73747A96716c13207L1814A37323c18089
9760E3955a913k56753d0060l04929E3634e8774H5781a28666k96975a26809N724
$$ plain form
9749 -121085 -360279 -303584 -335990 -19634 -41570 -110349 37088 368 -13247 -61449 -121553 -204255
9737 -204255 390698 -291493 -178376 28430 -68737 -82416 -9309 -8660 -37501 184532 -154492
9725 -254027 -177646 137107 -249700 101486 -138665 58708 175190 154397 149166 -322403 -52656
9713 -26260 95672 -64675 -57149 -151719 102783 43512 -183490 10166 22165 -151930 -41495
9701 228235 -127681 167485 137271 -12377 -455009 285603 -95377 125973 -205055 164080
9690 -34002 -363940 -154109 46579 -94279 -71339 7162 -104358 10672 47162 196107 -34404
9678 211384 -146883 73592 113931 19537 -104995 -213093 -229922 272831 -12490 23126 3432
9666 -192340 -204276 128645 19178 -82854 308575 -80620 -247371 146765 -131534 263964
$$ packed form
9749a21085k39194N6695l2406a9634k1936o8779C7088C68a3247m8202o0104q2702
9737b04255C90698b91493J13117B8430f8737j3679i309O49k8841A84532a54492
9725b54027P6381A37107b49700A01486a38665E8708J16482k0793n231c22403e2656
9713b6260I5672f4675P526r4570A02783D3512a83490A0166J1999a51930d1495
9701B28235a27681A67485l0214a2377m42632B85603i5377A25973b05055A64080
9690c4002l29938a54109D6579i4279K2940G162a04358A0672L6490J48945c4404
9678B11384a46883G3592M0339A9537a04995j08098j6829B72831a2490B3126C432
9666a92340j1936A28645A9178h2854C08575h0620j66751A46765a31534B63964
$$ plain form
9655 -95122 -110914 -82766 -76158 193642 -437543 -57692 118588 -139855 -186728 244567 63484
9643 38466 198355 -6773 240043 -97943 -49683 -385371 -295097 -333675 -73570 -60487 44106
9631 45180 -137557 81893 13317 -367298 -311134 150772 -60843 39603 75808 53310 126953
9620 126953 -161366 -74094 -15682 -99931 -147970 -67542 98040 147288 17268 -203186 -318297
9609 -318297 -170058 -154992 12987 -116953 348827 -71440 45375 21665 -219531 -84154 -113501
9598 -113501 108813 -100806 -186151 -160918 -344758 256017 -143925 -54947 -115546 -248051
9588 -248051 -280906 140202 -107562 -217719 -222424 72995 -137508 22337 60032 -213706 -337471
9577 -337471 122999 98251 -273404 -222370 -1479 -52548 53796 -109346 52488 -237660 -253967
$$ packed form
9655i5122j5792K8148O608A93642d37543e7692A18588a39855m6873B44567F3484
9643C8466J59889f773B40043i7943M8260l35688R0274l8578g3570J3083D4106
9631D5180a37557H1893A3317c67298N6164A50772f0843C9603L6205k2498P3643
9620A26953a61366g4094a5682q4249m8039f7542I8040M9248A7268b03186j15111
9609c18297J48239J5066A2987a16953C48827g1440D5375B1665b19531h4154k9347
9598a13501A08813a00806q5345K5233j83840B56017a43925e4947o0599j32505
9588b48051l2855A40202a07562j10157m705G2995a37508B2337L7695b13706j23765
9577c37471A22999k4748b73404N1034a479n1069E3796a09346E2488b37660j6307
$$ plain form
9566 -253967 -154580 -351674 44487 182107 -20755 63047 187024 -352631 -87315 46728 338367
9555 338367 -15500 -27551 -268676 -65772 21800 -31497 141977 -111942 -128276 -48248 266548
9543 -183830 -195491 -552242 -132974 98941 -176115 38173 246158 -280527 -168227 -150336
9533 -150336 65313 72014 78118 -100679 -268389 -269386 -6184 -53155 -132688 47421 44974 -315424
9520 -107162 -91320 -76044 -311425 219489 114579 -165692 -42161 324414 -210294 147347
9509 103071 -86779 198102 92065 -305427 -336270 -80588 7490 -56763 74900 -220782 47927
9497 -148716 -136871 240985 -151365 -124302 -193143 60645 58067 -98604 -321411 -19577 -40302
9486 -40302 -263327 41343 6615 28309 -242347 -76206 -201880 -221023 177342 104398 -303879
$$ packed form
9566b53967R9387j97094D4487J37620b0755F3047J23977c52631h7315D6728K91639
9555C38367a5500j2051k41125f5772B1800c1497A41977a11942j6334d8248B66548
9543a83830j1661l56751a32974I8941a76115C8173K07985b80527J12300J7891
9533a50336F5313O701O104a00679j67710r97f184m6971p9533D7421k447c15424
9520a07162J5842J5276k35381B19489j04910a65692d2161C24414b10294A47347
9509A03071h6779A98102I2065c05427l0843h0588G490e6763G4900b20782D7927
9497a48716J1845B40985a51365K7063o8841F0645k578i8604k22807a9577k0725
9486d0302k23025D1343F615K1694b42347g6206j25674j9143A77342p2944c03879
$$ plain form
9474 -213038 -59726 -84113 194044 70299 -94766 307223 265765 276807 -109575 -114296 232362
9462 -11422 -246465 -222097 -85556 -184751 133287 -183613 51424 -111906 6397 -175565 298156
9450 -308963 -178033 -260490 25813 1225 -154299 35941 67309 75083 -124897 -265517 -31256
9438 -27512 -297077 266624 -454772 -158170 -68166 -104650 -208782 -196860 -36900 -733226 -167809
9426 -318473 -221915 -95014 199279 -131648 -411635 176631 55421 114188 -257159 172193
9415 -47541 -24142 -114462 -333910 -2147 -124858 -198874 -206865 37306 12027 -234744 8303 50732
9403 50732 -273144 -99008 -84407 -7174 -26494 29230 -472056 109526 299125 31178 11499
9391 -8805 -159483 211753 -155104 6210 -45430 140107 20237 -64092 -275642 8459 -85716
$$ packed form
9474b13038e9726k4387A94044G0299i4766C07223m1458J1042a09575m721B32362
9462a1422k35043K4368h5556r9195A33287a83613E1424a11906F397a75565B98156
9450c08963J30930q2457B5813A225a54299C5941L1368P774a24897j40620c1256
9438b7512k69565B66624d54772a58170f8166l6484j04132J1922c6900o96326a67809
9426c18473R6558i5014A99279a31648k79987A76631E5421N8767b57159A72193
9415d7541K3399r0320k19448b147j22711p4016p991C7306A2027b34744H303M2429
9403E0732b73144i9008J4601g174j9320B9230d72056A09526J89599C1178A1499
9391h805j50678B11753a55104F210d5430A40107B0237f4092k11550H459h5716
$$ plain form
9379 47092 -424193 -155041 4413 -593686 206701 -55632 -34953 -257996 178710 76598 -77331
9367 -148870 40786 -5156 -135862 -449620 -346349 -134723 106431 -33895 -74316 222882 360803
9356 360803 -41205 13379 85927 -73121 -78328 -69630 16440 225244 -412407 295983 -6664 -102841
9344 -102841 41343 -275890 -413116 93192 -31361 -159672 34499 -57492 342915 -128612 1449
9332 80153 -39408 251047 2395 -334991 -350630 -372852 -246394 -290776 191749 -26302 -23009
9321 -23009 -71174 -25434 128089 -19521 230549 -75206 -298216 25345 264763 -63664 -78209
9310 -78209 65010 289464 229937 -216139 -304428 -13806 -252170 -98724 94622 -60609 109172
9298 50836 21961 -132242 53131 -26338 -345701 18522 -261064 174999 -174990 285796 21429
$$ packed form
9379D7092d24193a55041D413e93686B06701e5632K0679k23043A78710G6598g7331
9367a48870D0786e156j30706l13758J03271a34723A06431c3895m0421B22882J37921
9356C60803d1205A3379P2548g3121n207Q698A6440K08804d12407B95983f664r6177
9344a02841D1343b75890j37226I3192c1361j28311C4499e7492C42915a28612A449
9332H0153c9408B51047B395c34991j5639k2222J26458m4382A91749b6302L293
9321b3009m8165b5434A28089a9521B30549g5206k23010B5345K39418f3664j4545
9310g8209F5010K24454n9527b16139q8289a3806k38364i8724I4622f0609A09172
9298E0836B1961a32242E3131b6338l19363A8522b61064A74999a74990B85796B1429
$$ plain form
9286 44360 41162 -115476 -159368 -180322 -281014 20963 102783 102230 -71267 173776 -157591 99205
9273 140419 -19839 74497 -306617 -9487 172024 -37882 -38135 -212105 -290418 -90079 -69717 -137523
9261 -137523 -238191 -400613 132 -33481 -49419 -120015 137367 -155565 104380 37581 -136707
9249 -88211 -193649 -204479 -245796 -99406 -184572 -138601 -129316 44456 -124822 -319941 -48699
9237 -139614 75843 -108259 -229777 -93347 -236491 -164807 -6906 -307526 -42682 422984 204125
9225 -50873 38079 51917 47384 -357182 116618 -107139 -176191 -164657 32747 -348555 4830
9213 -131476 39384 46832 105622 68142 -90172 30519 -270468 15954 -136828 -251780 -11209
9201 -107336 111386 183962 86555 -144813 -93787 -298830 -101525 405826 -2999 137759 -481922
$$ packed form
9286D4360l198a15476m3892k0954j00692B0963Q1820n53g1267A73776a57591I9205
9273A40419a9839G4497c06617i487A72024c7882k53j73970p8313i0079K0362o7806
9261a37523j00668j62422A32c3481j5938p0596A37367a55565A04380C7581a36707
9249h8211j05438j0830m1317i9406q5166M5971R285D4456a24822j95119d8699
9237a39614G5843a08259j21518i3347j43144P1684f906l00620d2682D22984B04125
9225e0873C8079J3838m533c57182A16618a07139o9052J1534C2747c48555D830
9213a31476C9384P448N8790l7480i0172C0519b70468A5954a36828j14952a1209
9201a07336A11386P2576H6555a44813N1026k05043a01525D05826b999A37759d81922
$$ plain form
9189 -306496 166076 159305 -108012 -13109 -157629 62284 -169102 -36522 -29762 -53218 247467
9177 -538240 -183635 92461 127595 60414 6182 86168 -53754 -227563 27986 21916 40190 -292715
9164 -162651 -146029 -159964 -272973 231808 -89703 -66120 -79289 -182626 388255 -221291 -164893
9153 -164893 -161738 -4548 81364 307276 -248852 -55006 238219 -174922 66090 -171945 85556
9141 130083 -335454 -118460 -18072 -33079 -84415 252916 -160941 170689 -344321 -12768
9130 -31674 -25921 -52658 -125249 46309 95773 -178664 -21821 -186503 -259337 290658 77289
9118 -315500 -313637 -152127 2121 -89309 95949 -161227 228251 -118056 -65462 -99819 -181891
9107 -181891 -44164 145802 68043 164958 -195482 -169047 80934 -68195 3760 78128 1230 -124532
$$ packed form
9189c06496A66076o771a08012a3109j44520F2284a69102c6522O760k3456B47467
9177e38240a83635I2461L5134F0414F182P9986e3754j73809B7986o070J8274b92715
9164a62651J6622j3935j13009B31808h9703K3583j3169j03337C88255b21291N6398
9153a64893L155d548H1364K25912b48852e5006B38219a74922F6090a71945H5556
9141A30083c35454a18460a8072j5007n1336B52916a60941A70689c44321a2768
9130c1674N753k6737p2591D6309M9464a78664b1821j64682p2834B90658G7289
9118c15500J863a52127B121h9309I5949a61227B28251a18056N2594l4357q2072
9107a81891d4164A45802F8043R6915a95482K6435H0934f8195C760P4368A230a24532
$$ plain form
9094 41584 -239979 -245917 -209381 86665 -115231 -159543 84977 75078 -91921 -352070 -50653 -283815
9082 -283815 243830 -21447 -363595 -66838 15298 -164121 224367 -106247 -311671 -33742
9071 -297425 293238 271569 235212 -34517 -54967 -19285 108774 -89501 34758 24716 -95705
9059 36450 29125 136623 -70110 -55827 -432123 65246 -166887 -187800 -21961 -14102 -119924
9048 -119924 -105729 221049 55740 -69850 137329 -6146 -282276 -129481 264973 -43693 -50588
9037 -50588 -99325 40823 123823 137005 -224676 -617035 23578 -45900 186626 -42046 -70128
9026 -70128 64851 24 -50334 7519 -186964 43912 139538 -170790 4405 -31496 257712 45456
9013 -130933 -277372 80182 -137379 -43340 -81158 116348 -184298 -312964 -55641 5591 118005
$$ packed form
9094D1584b39979n938L6536H6665a15231m4312H4977r899i1921k60149e0653k33162
9082b83815B43830b1447l42148f6838A5298a64121B24367a06247k05424c3742
9071b97425B93238k1669l6357c4517k0450a9285A08774h9501C4758j0042i5705
9059C6450p325J07498g0110J4283l76296F5246a66887k0913b1961P859j05822
9048a19924J4195B21049E5740f9850A37329f146k76130a29481B64973d3693o895
9037e0588m8737D0823Q3000J3182b24676l92359B3578d5900A86626d2046k8082
9026g0128F4851B4e0334G519a86964D3912R5626a70790D405c1496B57712D5456
9013a30933j46439H0182a37379d3340l7818A16348a84298j28666e5641E591J12414
$$ plain form
9002 118005 80198 -268456 -237788 47586 -211320 284590 53745 -53191 100951 -226444 102975
8990 262807 65852 -151864 219783 -158854 117756 -224795 -95069 44040 89988 -22519 -120717
8979 -120717 80963 38812 -153915 24924 -5635 -178059 -335463 17388 -151047 -442354 -107353
8967 35824 -197942 -156553 -114821 -227707 300803 -124753 -392472 215957 -454427 6232 -74588
8955 -220478 -246549 26911 -8169 -133774 -73815 66871 -157848 53803 235170 -34467 136441
8943 -149688 -126170 -105443 1502 -35319 72341 66530 65949 15156 204412 174308 -94990 17382
8930 -229028 -150553 -3759 67125 -23347 307686 838178 904331 3652729 11348015 14021836
8920 14021836 3305468 1110622 287934 282938 102093 -150164 -13709 -183186 -92754 121654
$$ packed form
9002A18005l7807b68456L0668D7586b11320B84590E3745e3191A00951b26444A02975
8990B62807F5852a51864B19783a58854A17756b24795i5069D4040M5948b2519r8198
8979a20717H0963C8812a53915B4924e635j72424j57404A7388a51047k91307a07353
8967C5824a97942M1389M1732j12886C00803a24753k67719B15957d54427F232g4588
8955b20478k6071B6911h169j25605N9959F6871a57848E3803J81367c4467A36441
8943a49688K3518K0727A502c5319G2341n811n81A5156J89256l0104i4990A7382
8930b29028P8475c759F7125b3347C07686N30492O6153K748398P695286K673821
8920A4021836C305468A110622B87934m996A02093a50164a3709j69477R0432A21654
$$ plain form
8909 366841 178254 493741 -172961 168686 134974 -23501 102231 250785 -28519 -13396
8898 -275281 -284566 -114855 9166 40293 -10184 81143 -182085 353965 21201 -475851 178552
8886 -87767 27378 80854 109869 -77014 75887 -44922 -300741 -206785 -148093 -33193 -59623 -199117
8874 -199117 -39203 -125293 -41831 -245806 -83756 -147969 90017 -114338 185792 -133735 -307659
8863 -307659 228265 -6070 50698 -14745 18249 -120289 -81259 52041 -188437 47622 -149328
$$ packed form
8909C66841A78254L15487a72961A68686l3712b3501A02231J48554b8519a3396
8898b75281r285a14855I166L1127a0184H1143a82085C53965B1201d75851A78552
8886h7767B7378N3476K9015g7014G5887d4922k55819R3956N8692c3193k6430j39494
8874a99117c9203q6090d1831k03975h3756o4213I0017a14338A85792a33735j73924
8863c07659B28265f070E0698a4745A8249a20289L9030E2041a88437D7622a49328
$$ [...]
##END NTUPLES=NMR SPECTRUM
##END=
