
##TITLE=AC1346_GUAAH12164_7433086_bwJptFMpsF
##JCAMPDX= 6.0         $$ Bruker NMR JCAMP-DX V2.0
##DATA TYPE= NMR SPECTRUM
##DATA CLASS= NTUPLES
##ORIGIN= BRUKER
##OWNER= Administrator
$$ 1.72 TOPSPIN		Version 2.1
$$ 2013-01-29 23:32:03.202 -0500  Administrator@X
$$ Compression mode = diff/dup
##.OBSERVE FREQUENCY= 400.02188249412
##.OBSERVE NUCLEUS= ^1H
##.ACQUISITION MODE= SIMULTANEOUS (DQD)
##.ACQUISITION SCHEME= undefined
##.AVERAGES= 64
##.DIGITISER RES= 22
##SPECTROMETER/DATA SYSTEM= spect
##.PULSE SEQUENCE= noesygpps1d.comp
##.SOLVENT NAME= COFFEE_meoh
##.SHIFT REFERENCE= INTERNAL, COFFEE_meoh, 1, 14.96093
##AUDIT TRAIL= $$ (NUMBER, WHEN, WHO, WHERE, PROCESS, VERSION, WHAT)
$$ ##TITLE= Audit trail, TOPSPIN		Version 2.1
$$ ##JCAMPDX= 5.01
$$ ##ORIGIN= Bruker BioSpin GmbH
$$ ##OWNER= Administrator
$$ $$ E:\/data/COFFEE/nmr/AC1346_GUAAH12164_7433086_bwJptFMpsF/12/pdata/1/auditp.txt
$$ ##AUDIT TRAIL=  $$ (NUMBER, WHEN, WHO, WHERE, PROCESS, VERSION, WHAT)
(   1,<2013-01-29 23:31:57.312 -0500>,<Administrator>,<X>,<go>,<TOPSPIN 2.1>,
      <created by zg
	started at 2013-01-29 23:20:26.812 -0500,
	POWCHK enabled, PULCHK disabled,
       configuration hash MD5:
       86 BA 57 50 F2 9D 5C 9B 26 00 A9 28 5F 66 2E 89
       data hash MD5: 64K
       BA D3 E8 38 FD F4 4C A6 8A A5 1B 7D C7 A6 CA 11>)
(   2,<2013-01-29 23:32:00.452 -0500>,<Administrator>,<X>,<proc1d>,<TOPSPIN 2.1>,
      <Start of raw data processing
       efp LB = 0.3 FT_mod = 6 PKNL = 1 PHC0 = 0 PHC1 = 0 SI = 128K 
       data hash MD5: 128K
       36 9F 71 DD BA 9D 1A 5D 55 C5 F7 BA 91 60 55 69>)
(   3,<2013-01-29 23:32:01.499 -0500>,<Administrator>,<X>,<proc1d>,<TOPSPIN 2.1>,
      <pk PHC0 = -78.82141 PHC1 = 0 
       data hash MD5: 128K
       74 FE 42 89 17 6C 48 1A 54 D7 D8 5F D5 BD 45 CE>)
(   4,<2013-01-29 23:32:02.187 -0500>,<Administrator>,<X>,<proc1d>,<TOPSPIN 2.1>,
      <abs ABSG = 1 
       data hash MD5: 128K
       BE 94 DB C9 49 2C F5 A3 7A 9A E2 2E B9 F6 D7 AF>)
(   5,<2013-01-29 23:32:02.359 -0500>,<Administrator>,<X>,<proc1d>,<TOPSPIN 2.1>,
      <abs ABSG = 2 
       data hash MD5: 128K
       B0 F4 C4 94 50 58 7B 74 0A 9E 8B CA 9D BE A1 6B>)
(   6,<2013-01-29 23:32:02.530 -0500>,<Administrator>,<X>,<proc1d>,<TOPSPIN 2.1>,
      <abs ABSG = 3 
       data hash MD5: 128K
       3A EF C7 F7 79 9E 8E 36 3B C0 85 93 CB C4 BF 2E>)
(   7,<2013-01-29 23:32:02.702 -0500>,<Administrator>,<X>,<proc1d>,<TOPSPIN 2.1>,
      <abs ABSG = 4 
       data hash MD5: 128K
       57 FB FA CB 41 48 AF 80 DD FB 1A 09 03 90 43 60>)
(   8,<2013-01-29 23:32:02.874 -0500>,<Administrator>,<X>,<proc1d>,<TOPSPIN 2.1>,
      <abs ABSG = 5 
       data hash MD5: 128K
       59 48 CF 50 0F A8 9B B7 54 68 A5 1B 81 FB CF 66>)
$$ ##END=
$$ 
$$ $$ hash MD5
$$ $$ D2 24 0C 58 D4 1F FF 35 35 0C 8F C3 9A 9F F5 FD
##$RELAX= 
##$RELAX= 
##$RELAX= 
##$RELAX= 
##$RELAX= 
##$RELAX= 
##$RELAX= 
##$RELAX= 
$$ Bruker specific parameters
$$ --------------------------
##$DU= <E:\>
##$EXPNO= 12
$$ [...]
##$TP07= 0
##$TPNAME0= <>
##$TPNAME1= <>
##$TPNAME2= <>
##$TPNAME3= <>
##$TPNAME4= <>
##$TPNAME5= <>
##$TPNAME6= <>
##$TPNAME7= <>
##$TPOAL= (0..7)
0.5 0.5 0.5 0.5 0.5 0.5 0.5 0.5
##$TPOFFS= (0..7)
0 0 0 0 0 0 0 0
##$TUNHIN= 0
##$TUNHOUT= 0
##$TUNXOUT= 0
##$USERA1= <user>
##$USERA2= <user>
##$USERA3= <user>
##$USERA4= <user>
##$USERA5= <user>
##$V9= 5
##$VALIST= <valist>
##$VCLIST= <CCCCCCCCCCCCCCC>
##$VD= 0
##$VDLIST= <DDDDDDDDDDDDDDD>
##$VPLIST= <PPPPPPPPPPPPPPP>
##$VTLIST= <TTTTTTTTTTTTTTT>
##$WBST= 1024
##$WBSW= 4
##$XGAIN= (0..3)
0 0 0 0
##$XL= 0
##$YL= 0
##$YMAX_a= 5174598
##$YMIN_a= -11307546
##$ZGOPTNS= <>
##$ZL1= 120
##$ZL2= 120
##$ZL3= 120
##$ZL4= 120
##$ABSF1= 14.96093
##$ABSF2= -5.597252
##$ABSG= 5
##$ABSL= 3
##$ALPHA= 0
##$AQORDER= 0
##$ASSFAC= 0
##$ASSFACI= 0
##$ASSFACX= 0
##$ASSWID= 0
##$AUNMP= <proc_prof1d_extract.lims>
##$AXLEFT= 0
##$AXNAME= <>
##$AXNUC= <1H>
##$AXRIGHT= 0
##$AXTYPE= 0
##$AXUNIT= <>
##$AZFE= 0.1
##$AZFW= 0.1
##$BCFW= 0
##$BC_mod= 0
##$BYTORDP= 0
##$COROFFS= 0
##$CY= 15
##$DATMOD= 1
##$DC= 0
##$DFILT= <>
##$DTYPP= 0
##$F1P= 0
##$F2P= 0
##$FCOR= 0.5
##$FTSIZE= 131072
##$FT_mod= 6
##$GAMMA= 0
##$GB= 0
##$INTBC= 1
##$INTSCL= 1
##$ISEN= 128
##$LB= 0.3
##$LEV0= 0
##$LPBIN= 0
##$MAXI= 10000
##$MC2= 0
##$MEAN= 0
##$ME_mod= 0
##$MI= 0
##$NCOEF= 0
##$NC_proc= -2
##$NLEV= 6
##$NOISF1= 0
##$NOISF2= 0
##$NSP= 0
##$NTH_PI= 0
##$NZP= 0
##$OFFSET= 14.96093
##$PC= 1
##$PHC0= -78.82141
##$PHC1= 0
##$PH_mod= 1
##$PKNL= yes
##$PPARMOD= 0
##$PPDIAG= 0
##$PPIPTYP= 0
##$PPMPNUM= 2147483647
##$PPRESOL= 1
##$PSCAL= 4
##$PSIGN= 0
##$PYNMP= <proc.py>
##$REVERSE= no
##$SF= 400.020009664183
##$SI= 131072
##$SIGF1= 0
##$SIGF2= 0
##$SINO= 400
##$SIOLD= 131072
##$SPECTYP= <>
##$SREGLST= <1H.CDCl3>
##$SSB= 0
##$STSI= 131072
##$STSR= 0
##$SW_p= 8223.68421052631
##$SYMM= 0
##$S_DEV= 0
##$TDeff= 65536
##$TDoff= 0
##$TI= <>
##$TILT= no
##$TM1= 0
##$TM2= 0
##$TOPLEV= 0
##$USERP1= <user>
##$USERP2= <user>
##$USERP3= <user>
##$USERP4= <user>
##$USERP5= <user>
##$WDW= 1
##$XDIM= 131072
##$YMAX_p= 397596336
##$YMIN_p= -15737
##$CURPLOT= <Network HP LaserJet P1505>
##$CURPRIN= <$Network HP LaserJet P1505>
##$DFORMAT= <normdp>
##$LAYOUT= <+/1D_H.xwp>
##$LFORMAT= <normlp>
##$PFORMAT= <normpl>
##$SURQMSG= 1
$$ End of Bruker specific parameters
$$ ---------------------------------
##NTUPLES= NMR SPECTRUM
##VAR_NAME=  FREQUENCY,     SPECTRUM/REAL,   SPECTRUM/IMAG
##SYMBOL=    X,             R,               I
##VAR_TYPE=  INDEPENDENT,   DEPENDENT,       DEPENDENT
##VAR_FORM=  AFFN,          ASDF,            ASDF
##VAR_DIM=   131072,        131072,          131072
##UNITS=     HZ,            ARBITRARY UNITS, ARBITRARY UNITS
##FACTOR=    0.0627417313425164, 1,          1
##FIRST=     8223.62146879497, -414,         -53920
##LAST=      0,             849,             -54300
##MIN=       0,             -15737,          0
##MAX=       8223.62146879497, 397596336,    0
$$ Real data points
##PAGE= N=1
##DATA TABLE= (X++(R..R)), XYDATA
$$ [...]
61772D14363j527j728j669p12P29J468R74k4n83n92n08m62o6R80K400L473L572
$$ 414363 412836 411108 409439 408727 409456 410924 411898 411874 411291 410699 410191 409729 409663 410643 413043 416516 420088
61755D20088K695J497O99M52L43Nm96r06j101j082q88o65o95j195k029k735k855
$$ 420088 422783 424280 424979 425431 425774 425779 425283 424377 423276 422194 421306 420641 419946 418751 416722 413987 411132
61738D11132k298j433q13o85q43r16p45l90O1N13Q29J028J336J833K102J697R28
$$ 411132 408834 407401 406588 405903 405060 404144 403399 403009 403070 403583 404412 405440 406776 408609 410711 412408 413336
61721D13336P11J421K320K482J946J502J520J552J204Q03Q17R56M36q93k176k616
$$ 413336 414047 415468 417788 420270 422216 423718 425238 426790 427994 428797 429614 430570 431006 430113 427937 425321
61705D25321k472k602l207l580l245k771l082m185n141n235m756m398m266l884
$$ 425321 422849 420247 417040 413460 410215 407444 404362 400177 395036 389801 385045 380647 376381 372497
61691C72497l106k451k372k560k392j898j729k102k358j900j070o56p92r98j067
$$ 372497 369391 366940 364568 362008 359616 357718 355989 353887 351529 349629 348559 347903 347111 346113 345046
61676C45046j281j742k139k322k465k526k125j247m62q0L20J020J402P61m50r49
$$ 345046 343765 342023 339884 337562 335097 332571 330446 329199 328737 328657 328977 329997 331399 332160 331710 330761
61660C30761j20J446K826L523L343K220N21q94j290p28R7O03Q20J138J683K112
$$ 330761 330641 332087 334913 338436 341779 343999 344520 343626 342336 341608 341705 342308 343128 344266 345949 348061
61644C48061K205K393L144L966L732K259P63L36N89M68k25r38j420j731j609r26
$$ 348061 350266 352659 355803 359769 363501 365760 366523 366859 367448 367916 367691 366753 365333 363602 361993 361067
61628C61067n46j497l254m157l711l182l456l628k619j052l82p71j117q56n92
$$ 361067 360521 359024 355770 351613 347902 344720 341264 337636 335017 333965 333583 332812 331695 330839 330247
61613C30247q24j140r70m83l12p69j598k307k621k691k912l369l647l359k753
$$ 330247 329423 328283 327313 326830 326518 325749 324151 321844 319223 316532 313620 310251 306604 303245 300492
61598C00492k472k796l349l511k951j916j166j396k353k832k007n91m3p35j573
$$ 300492 298020 295224 291875 288364 285413 283497 282331 280935 278582 275750 273743 273152 273109 272374 270801
61583B70801j561r88o44n05M0R90J505R81k57j398j868j514n18N31R30O05K94
$$ 270801 269240 268252 267608 267103 267143 268133 269638 270619 270362 268964 267096 265582 265064 265595 266525 267130 267424
61566B67424O31J264J295N01m21p80n52p3M15P19P02O10R61J795K429K316J750
$$ 267424 268055 269319 270614 271115 270694 269914 269362 269289 269704 270423 271125 271735 272696 274491 276920 279236 280986
61549B80986J277Q89L37j15K8N66P94N77N09Q97J307J366J302J329J084K53o68
$$ 280986 282263 283152 283489 283374 283402 283968 284762 285339 285848 286745 288052 289418 290720 292049 293133 293386 292718
61532B92718q52k21M85O55L73K5k49n51q63r36n54J82Q99J333J498J431R13k63
$$ 292718 291866 291645 292130 292785 293158 293183 292934 292383 291520 290584 290030 290212 291111 292444 293942 295373 296286 296023
61514B96023j824l034l282k495j110J84P88O97N74R92J618J565O01n24j043r57
$$ 296023 294199 291165 287883 285388 284278 284462 285250 285947 286521 287513 289131 290696 291297 290773 289730 288773
61498B88773o46k40J88K84j74p48p58j89K79J41l60o44m62k8L66O41Q80J117J248
$$ 288773 288127 287887 288075 288359 288185 287437 286679 286490 286769 286910 286550 285906 285444 285416 285782 286423 287303 288420 289668
61479B89668J159Q81N90M39M24L45j7n97r58p26j39K61M42Q49J435J412N22k78
$$ 289668 290827 291708 292298 292737 293161 293506 293489 292892 291934 291208 291069 291330 291772 292621 294056 295468 295990 295712
61461B95712j44K37k64j186r82M85J535J098J67Q0N89O80L23K53O13R53J184J552
$$ 295712 295568 295805 295541 294355 293373 293858 295393 296491 296658 296738 297327 298007 298330 298583 299196 300149 301333 302885
61443C02885J878J770J393J272J461J630J717J811J614R70O40J547L230M083L371
$$ 302885 304763 306533 307926 309198 310659 312289 314006 315817 317431 318401 319041 320588 323818 327901 331272
61428C31272K051J347J315J318J133J064J391K154L169L913L765K742J685J412
$$ 331272 333323 334670 335985 337303 338436 339500 340891 343045 346214 350127 353892 356634 358319 359731
61414C59731J829K190J961J157O3j052j951k421k341j834j349j480k385l477l920
$$ 359731 361560 363750 365711 366868 366931 365879 363928 361507 359166 357332 355983 354503 352118 348641 344721
61399C44721l470k564j680j021p39j034j791k512k766k532j997j363r03q19q82
$$ 344721 341251 338687 337007 335986 335247 334213 332422 329910 327144 324612 322615 321252 320349 319530 318648
61384C18648n31L99J412J905J767J234M95k45o58o38n03n27m28K84J484K373K278
$$ 318648 318117 318516 319928 321833 323600 324834 325329 325084 324426 323788 323285 322758 322330 322614 324098 326471 328749
61367C28749J337L78K68J209K526L200K885K231K026K197K152J916K235L421M736
$$ 328749 330086 330464 330732 331941 334467 337667 340552 342783 344809 347006 349158 351074 353309 356730 361466
61352C61466N349N420N626O020O119N887N793N812N264L969K809K553K773K674
$$ 361466 366815 372235 377861 383881 390000 395887 401680 407492 412756 416725 419534 422087 424860 427534
61338D27534K418K697L324L337K538J808J615J235J2j427k032j827j735k175k654
$$ 427534 429952 432649 435973 439310 441848 443656 445271 446506 446518 445091 443059 441232 439497 437322 434668
61323D34668k618k120j531j123r62q37k62J107L036M889O221O944P130P000P040
$$ 434668 432050 429930 428399 427276 426314 425477 425215 426322 429358 434247 440468 447412 454542 461542 468582
61308D68582P696Q898J0160J1118J1748J2138J2258J1999J1199R745P807N764
$$ 468582 476278 485176 495336 506454 518202 530340 542598 554597 565796 575541 583348 589112
61296E89112L709J313j486l982n395n911o455p451q416q837q869q910q943q684
$$ 589112 592821 594134 592648 588666 583271 577360 570905 563454 555038 546201 537332 528422 519479 510795
61282E10795q106p498p075o729o137n092l737k514j726j247p13lO53R18O86K57
$$ 510795 502689 495191 488116 481387 475250 470158 466421 463907 462181 460934 460221 460218 460871 461789 462475 462732
61266D62732J78P80J723K345K583L179M690O642Q065Q530Q223P322N938M440L301
$$ 462732 462910 463690 465413 467758 470341 473520 478210 484852 492917 501447 509670 516992 522930 527370 530671
61251E30671K567J985J494J135O41k26j085j324j127j394k422l412l526k906k266
$$ 530671 533238 535223 536717 537852 538493 538267 537182 535858 534731 533337 530915 527503 523977 521071 518805
61236E18805j853j283k76Q29J326R98N92J196K876M417M831M709N307O691P704
$$ 518805 516952 515669 515393 516222 517548 518546 519138 520334 523210 527627 532458 537167 542474 549165 556869
61221E56869P718P320P107O871O414O260O845P684Q030P857P501O832N555M050
$$ 556869 564587 571907 579014 585885 592299 598559 605404 613088 621118 628975 636476 643308 648863 652913
61207F52913L192L319L930M357M365M128M020M425N454O815Q156R442J0804J2138
$$ 652913 656105 659424 663354 667711 672076 676204 680224 684649 690103 696918 705074 714516 725320 737458
61193G37458J3116J3507J3291J2424J0771Q332N451K730O56p35j734k503k981
$$ 737458 750574 764081 777372 789796 800567 808899 814350 817080 817736 817001 815267 812764 809783
61180H09783l287l849m802n644n981o244p014p964q290q080q213q824q949q098
$$ 809783 806496 802647 797845 792201 786220 779976 772962 764998 756708 748628 740415 731591 722642 714544
61166G14544p138o998p324p222o664o315o333o254n821n162m262k912j230K90
$$ 714544 707406 700408 693084 685862 679198 672883 666550 660296 654475 649313 645051 642139 640909 641199
61152F41199J322J934K422L113M263N730O923P255O628N341L862K801K640L187
$$ 641199 642521 644455 646877 649990 654253 659983 666906 674161 680789 686130 689992 692793 695433 698620
61138F98620L680L844M378O046Q605J1151J3146J4615J5709J6624J7724J9203
$$ 698620 702300 706144 710522 716568 725173 736324 749470 764085 779794 796418 814142 833345
61126H33345K0786K2151K3345K4468K5373K6146K7355K9126L0491L0560K9936
$$ 833345 854131 876282 899627 924095 949468 975614 1002969 1032095 1062586 1093146 1123082
61115A123082K9943L0659L0835K9753K8056K6419K4493K1724J8420J5301J2526
$$ 1123082 1153025 1183684 1214519 1244272 1272328 1298747 1323240 1344964 1363384 1378685 1391211
61104A391211R758O818L712K83l661q016j2475j6806k0722k3760k5698k7020k8525
$$ 1391211 1400969 1407787 1411499 1411782 1408121 1400105 1387630 1370824 1350102 1326342 1300644 1273624 1245099
61091A245099l0490l2412l3602l3851l3432l2637l1500k9989k8330k6887k5648
$$ 1245099 1214609 1182197 1148595 1114744 1081312 1048675 1017175 987186 958856 931969 906321
61080I06321k4104k1888j9395j7439j6290j5339j3929j2184j0792j0049r498q571
$$ 906321 882217 860329 840934 823495 807205 791866 777937 765753 754961 744912 735414 726843
61068G26843p358o413n886n300m302l262k733k654k573k442k489k429j562J22
$$ 726843 719485 713072 707186 701886 697584 694322 691589 688935 686362 683920 681431 679002 677440 677562
61054F77562J759K820L798N270O951Q269R295J0376J1400J2122J2830J3970J5370
$$ 677562 679321 682141 685939 691209 698160 706429 715724 726100 737500 749622 762452 776422 791792
61041G91792J6588J7750J9302K1165K2932K4700K6880K9268L1141L2325L3363
$$ 791792 808380 826130 845432 866597 889529 914229 941109 970377 1001518 1033843 1067206
61030A067206L4603L5811L6694L7219L7416L7726L9386M3583N0088N7656O5855
$$ 1067206 1101809 1137620 1174314 1211533 1248949 1286675 1326061 1369644 1419732 1477388 1543243
61019A543243P5458Q6806R9005J11479J25355J42558J64316J91359K24922K66638
$$ 1543243 1618701 1705507 1804512 1915991 2041346 2183904 2348220 2539579 2764501 3031139
61009C031139L17972L80656M57148N49623O59118P87086R37412J113928J312015
$$ 3031139 3349111 3729767 4186915 4736538 5395656 6182742 7120154 8234082 9546097
61000I546097J509080J660669J707196J593656J299191Q62272L80467k4772k60920
$$ 9546097 11055177 12715846 14423042 16016698 17315889 18178161 18558628 18533856 18272936
60991A8272936l01221j85988J242J60102J95537M4701k92655p43258j188941j522119
$$ 18272936 17971715 17785727 17786969 17947071 18142608 18187309 17894654 17151396 15962455 14440336
60981A4440336j689618j698266j590138j414210j211228j010221q28972o75248
$$ 14440336 12750718 11052452 9462314 8048104 6836876 5826655 4997683 4322435
60973D322435n49317m47484l65288k99153k46486k04989j72392j46913j27440
$$ 4322435 3773118 3325634 2960346 2661193 2414707 2209718 2037326 1890413 1762973
60964A762973j12913j01775r2309q3378p4604o6113n8276n1352m5087l8946l2983
$$ 1762973 1650060 1548285 1455976 1372598 1297994 1231881 1173605 1122253 1077166 1038220 1005237
60953A005237k8034k4702k2618k1118k0169j9982k0019j9254j7389j5179j3468
$$ 1005237 977203 952501 929883 908765 888596 868614 848595 829341 811952 796773 783305
60942G83305j2427j1896j1871j2338j2948j3179j2853j2333j2176j2564j3056
$$ 783305 770878 758982 747111 734773 721825 708646 695793 683460 671284 658720 645664
60931F45664j3052j2504j1965j1829j1827j1441j0528r301p997o894o360o434
$$ 645664 632612 620108 608143 596314 584487 573046 562518 553217 545220 538326 531966 525532
60919E25532o562o113n122m194l780l845m085m103l564k600j942k171k965l421
$$ 525532 518970 512857 507735 503541 499761 495916 491831 487728 484164 481564 479622 477451 474486 471065
60905D71065l114k321j414n68p5k57r13j397j458j529j969k538k903l206l613
$$ 471065 467951 465630 464216 463648 463573 463316 462403 461006 459548 458019 456050 453512 450609 447403 443790
60890D43790l768l237k300j770j977k415k500k315k430l146m154m883n012m595
$$ 443790 440022 436785 434485 432715 430738 428323 425823 423508 421078 417932 413778 408895 403883 399288
60876C99288l750k489r60L00P94P20Q55J568K349K579K417K505K997L430L537
$$ 399288 395538 393049 392089 392389 393183 393903 394758 396326 398675 401254 403671 406176 409173 412603 416140
60861D16140L582L773L764L148K026Q39j31p82r85p65n36o98j072j136q19o02
$$ 416140 419722 423495 427259 430407 432433 433272 433141 432359 431374 430609 430073 429375 428303 427167 426348 425746
60845D25746p98j240j756k377k937l050k904l440n156p149q104p906p495p334
$$ 425746 424948 423708 421952 419575 416638 413588 410684 407244 402088 394939 386835 378929 371434 364100
60831C64100o965o147n416n100m620l410j989j360j653k017j736r34j91O9k18
$$ 364100 357135 350988 345572 340472 335852 332442 330453 329093 327440 325423 323687 322753 322562 322631 322413
60816C22413q12j344j620j754j862j807j461j020p42m88P8Q61J335J232Q94Q36
$$ 322413 321601 320257 318637 316883 315021 313214 311753 310733 309991 309503 309581 310442 311777 313009 313903 314739
60800C14739J154J581J895K165K582L106L322K740J398J3p01p51o98q48r83q43
$$ 314739 315893 317474 319369 321534 324116 327222 330544 333284 334682 334695 333994 333243 332545 331697 330714 329871
60784C29871n26k38K8L55N33K10p05j806k538k697k579k533k466j966r46L9L31
$$ 329871 329345 329107 329135 329490 330023 330233 329528 327722 325184 322487 319908 317375 314909 312943 311997 312036 312367
60767C12367j62r38j412j253m55N45R88M90m43r33p67m53l48k73j23j87n65p73
$$ 312367 312205 311267 309855 308602 308147 308692 309680 310170 309727 308794 308027 307574 307226 306953 306830 306643 306078 305305
60749C05305l64M72J361K356L555M486M538L841L054K350J313j55j537k458l089
$$ 305305 304941 305413 306774 309130 312685 317171 321709 325550 328604 330954 332267 332112 330575 328117 325028
60734C25028l514l378k538j559j048q39l87L25P71O38P7n91j025q33J08J294J956
$$ 325028 321514 318136 315598 314039 312991 312152 311765 312090 312861 313499 313576 312985 311960 311127 311235 312529 314485
60717C14485J833J288P92N43M97M33N3o31j181j386j679k426l032k631j477p97
$$ 314485 316318 317606 318398 318941 319438 319871 319924 319293 318112 316726 315047 312621 309589 306958 305481 304684
60701C04684j060j440j200o97n51o51o58p03r09q32j98L35Q0m89m12K16M19n8
$$ 304684 303624 302184 300984 300287 299736 299085 298427 297724 296815 295983 295785 296120 296200 295711 295299 295515 295934 295876
60683B95876l67J25J057J813K242K426K407K436K912L805M570M762M275L029J071
$$ 295876 295509 295634 296691 298504 300746 303172 305579 308015 310927 314732 319302 324064 328339 331368 332439
60668C32439r09j938j905j670j806j956j728j454j536j679j376o58R9P02R90P14
$$ 332439 331530 329592 327687 326017 324211 322255 320527 319073 317537 315858 314482 313824 313923 314625 315615 316329
60652C16329J32J97J436L016L660L221K585K251J850J072K39k87o88j410k640
$$ 316329 316461 316658 318094 321110 324770 327991 330576 332827 334677 335749 335988 335701 335013 333603 330963
60637C30963m135n257n216l738j624j50K05O6J15K83K39J56M07P99P60K88J17
$$ 330963 326828 321571 316355 312617 310993 310843 311048 311114 311229 311512 311751 311907 312314 313113 313873 314161 314278
60620C14278O75J345J193K35o05o98l52p9J74N63O55j03j314j813j055L24J456
$$ 314278 314953 316298 317491 317726 317121 316423 316071 315992 316166 316729 317384 317281 315967 314154 313099 313423 314879
60603C14879K123K403K089J055j71p43l80M54J126J325J104P16L67J6l84n29l6
$$ 314879 317002 319405 321494 322549 322378 321635 321255 321709 322835 324160 325264 325980 326347 326363 325979 325450 325414
60586C25414Q40J258Q19Q5k88l33l47j33O18J611K266K566K928L419L770M049
$$ 325414 326254 327512 328331 328416 328128 327795 327448 327315 327933 329544 331810 334376 337304 340723 344493 348542
60570C48542M664N625O469O951P301P701P990P962P476O285M262J921J11r82j966
$$ 348542 353206 358831 365300 372251 379552 387253 395243 403205 410681 416966 421228 423149 423260 422278 420312
60555D20312l250m410m807m357l362k057p22K15O00R40J883L513N343O901Q039
$$ 420312 417062 412652 407845 403488 400126 398069 397347 397562 398162 399102 400985 404498 409841 416742 424781
60540D24781Q898R784J0976J2372J3472J3908J3788J3370J2557J1059Q841O054
$$ 424781 433679 443463 454439 466811 480283 494191 507979 521349 533906 544965 553806 559860
60528E59860K790p29l851n949p168q172r056r115q030o636n913n645m800l120
$$ 559860 562650 561921 558070 552121 544953 536781 527725 518610 510580 503944 498031 492386 487586 484466
60514D84466j503p27n08j48N43J446K655M177N530O390P406R580J2899J6306J9163
$$ 484466 482963 482236 481728 481580 482123 483569 486224 490401 495931 502321 509727 519307 532206 548512 567675
60499E67675K1937K5222K8748L1791L4062L5715L6778L7016L6059L3445K8815
$$ 567675 589612 614834 643582 675373 709435 745150 781928 818944 855003 888448 917263
60488I17263K2356J4818O864j373r896j8422k6561l3959l9965m3608m4391m2922
$$ 917263 939619 954437 961301 959928 950032 931610 905049 871090 831125 787517 743126 700204
60476G00204m0395l7671l5041l2369k9156k4950k0269j6571j4681j3634j1842
$$ 700204 659809 622138 587097 554728 525572 500622 480353 463782 449101 435467 423625
60465D23625r126o747n628n408n357n330n448n421m695l162j454n20q07j770k386
$$ 423625 414499 407752 402124 396716 391359 386029 380581 375160 370465 367303 365849 365329 364522 362752 360366
60450C60366k267j955j925j894j507j101j087j066m48M33P14L98K61M71L19m93
$$ 360366 358099 356144 354219 352325 350818 349717 348630 347564 347116 347549 348263 348661 348922 349393 349712 349219
60434C49219j381j893k241k443j926n83N81O50K9k00K38O81N49n4o59q23l53N52
$$ 349219 347838 345945 343704 341261 339335 338752 339333 339983 340012 339812 340050 340731 341280 341226 340567 339744 339391 339943
60416C39943J386J824J975K092K274K601L117L555L469K895K405K260K012J326
$$ 339943 341329 343153 345128 347220 349494 352095 355212 358767 362236 365131 367536 369796 371808 373134
60402C73134O77O66J085J257J096J059J284J387J258J328J835K331K262J745J401
$$ 373134 373811 374477 375562 376819 377915 378974 380258 381645 382903 384231 386066 388397 390659 392404 393805
60387C93805J610K183K761L089K975K291J347R20J536K721L423L223K666K327
$$ 393805 395415 397598 400359 403448 406423 408714 410061 410981 412517 415238 418661 421884 424550 426877
60373D26877K123J809J566J546J394R22P68J505K456K443J629J506K835M697N917
$$ 426877 429000 430809 432375 433921 435315 436237 437005 438510 440966 443409 445038 446544 449379 454076 459993
60358D59993O549P298Q369R525J0720J1879J2514J2138J0881R135O946M195J050
$$ 459993 466542 473840 482209 491734 502454 514333 526847 538985 549866 559001 565947 570142 571192
60345E71192k197n430q366j0291j0747j0266r814r660r238q109o512m972l781
$$ 571192 568995 563565 555199 544908 534161 523895 514081 504421 495183 487074 480562 475590 471809
60332D71809k931k302j823j555j599j927k413l013l596l666k734j068M62J471
$$ 471809 468878 466576 464753 463198 461599 459672 457259 454246 450650 446984 444250 443182 443644 445115
60318D45115K468L874N380O680Q194J0263J2128J2556J1341R428P624N861L747
$$ 445115 447583 451457 456837 463517 471711 481974 494102 506658 517999 527427 535051 540912 544659
60305E44659J241j247l020l416k450j137o58j235k261l477n344q073j0863j2450
$$ 544659 545900 544653 541633 538217 535767 534630 533972 532737 530476 526999 521655 513582 502719 490269
60291D90269j2252j0756q973p615o649n532l952k296j249j058j369j773k177k616
$$ 490269 478017 467261 458288 450673 444024 438492 434540 432244 430995 429937 428568 426795 424618 422002
60277D22002k908k694j883r87q29j632k552k522j585r08j275k142k463j991j277
$$ 422002 419094 416400 414517 413530 412701 411069 408517 405995 404410 403502 402227 400085 397622 395631 394354
60262C94354q01o16n62l92J12P82J040P05M02P23J333J531J356J402J757J925
$$ 394354 393553 392937 392375 391983 392095 392877 393917 394622 395024 395747 397080 398611 399967 401369 403126 405051
60246D05051J770J725J975K132J877J334O30k76j175j592j448j239j257j174o56
$$ 405051 406821 408546 410521 412653 414530 415864 416494 416218 415043 413451 412003 410764 409507 408333 407677
60231D07677ML36L92O00J101J589J763J631J439J435J727K272K964L666M176M334
$$ 407677 407681 408017 408409 409009 410110 411699 413462 415093 416532 417967 419694 421966 424930 428596 432772 437106
60215D37106M299M523N205N968O356O388O355O306O181O218O646P089O921O180
$$ 437106 441405 445928 451133 457101 463457 469845 476200 482506 488687 494905 501551 508640 515561 521741
60201E21741N523N267N095M794M576M422L826K612J381O89K56m88j439k025k148
$$ 521741 527264 532531 537626 542420 546996 551418 555244 557856 559237 559926 560182 559694 558255 556230 554082
60186E54082k316k928l855m758n423n741n658n288m856m520m271m000l610l093
$$ 554082 551766 548838 544983 540225 534802 529061 523403 518115 513259 508739 504468 500468 496858 493765
60172D93765k583k243k105k104k206k349k274j824j306j213j448j353p18j84k18
$$ 493765 491182 488939 486834 484730 482524 480175 477901 476077 474771 473558 472110 470757 470039 469855 469637
60157D69637k26O22J967K467J470j87j201j087k27P20J176Q65J82%O96J591J898
$$ 469637 469411 470033 472000 474467 475937 475750 474549 473462 473235 473955 475131 475996 476178 476178 476874 478465 480363
60140D80363J903K588M124N537O029N994O255O856P195P066O825O576N899M531
$$ 480363 482266 484854 488978 494515 500544 506538 512793 519649 526844 533910 540735 547311 553210 557741
60126E57741K953J923J676J773J617J020K88k09m71p39r28n85L34J026O78m18
$$ 557741 560694 562617 564293 566066 567683 568703 568991 568782 568311 567572 566644 566059 566393 567419 568097 567679
60110E67679j260j415j326j352j324j249j623k647l728m211m115l800l382k909
$$ 567679 566419 565004 563678 562326 561002 559753 558130 555483 551755 547544 543429 539629 536247 533338
60096E33338k616k521k189j458r38j223j970k352k143j735j373r58m90j13J77
$$ 533338 530722 528201 526012 524554 523616 522393 520423 518071 515928 514193 512820 511862 511372 511259 511436
60081E11436M10M03J35L7L96P37M76j41m60o01j368k938m541n443n651n439m925
$$ 511436 511846 512249 512384 512421 512817 513554 514030 513889 513429 512828 511460 508522 503981 498538 492887 487448 482523
60064D82523m342m138m473n018n420n603n483m853l688k250q05M18J060R31M36
$$ 482523 478181 474043 469570 464552 459132 453529 448046 443193 439505 437255 436450 436868 437928 438859 439295
60049D39295K69O77J420K329L367M275M807N193N666N691M596K938K143K531K859
$$ 439295 439564 440241 441661 443990 447357 451632 456439 461632 467298 472989 477585 480523 482666 485197 488056
60034D88056K201J215Q46P92K28o93j178j224j667k939m668o397p933q954r022
$$ 488056 490257 491472 492318 493110 493338 492645 491467 490243 488576 485637 480969 474572 466639 457685 448663
60019D48663q245p357o874o551n855m719l598k916k614k270j683j256j525k341
$$ 448663 440418 433061 426187 419636 413781 409062 405464 402548 399934 397664 395981 394725 393200 390859
60005C90859k803k261j058j00J62k0j99j73L5L23N84P82R59J150J289J273J102
$$ 390859 388056 385795 384737 384637 384799 384779 384580 384407 384442 384765 385349 386131 387090 388240 389529 390802 391904
59988C91904R41J094J751K604K907K208R73J27NJ13j42q43j671k204k120j493
$$ 391904 392845 393939 395690 398294 401201 403409 404382 404509 404514 404627 404485 403642 401971 399767 397647 396154
59972C96154r16q66j019o98L8M28K46K16R22K009K863L465M050M516M667M675
$$ 396154 395238 394372 393353 392655 392693 393121 393367 393583 394505 396514 399377 402842 406892 411408 416075 420750
59956D20750M693M412L489K084N71r45k397l331l353k729k083j668j355j131j096
$$ 420750 425443 429855 433344 435428 435999 435054 432657 429326 425973 423244 421161 419493 418138 417007 415911
59941D15911j164j208j335j641j896j782j341p87r2Q68J985L043L947M549M553
$$ 415911 414747 413539 412204 410563 408667 406885 405544 404757 404665 405533 407518 410561 414508 419057 423610
59926D23610L908K972J952N82j141k520k978k937l081l197k607j511p88n40J27
$$ 423610 427518 430490 432442 433024 431883 429363 426385 423448 420367 417170 414563 413052 412264 411724 411851
59911D11851J595L007L503L363L353L569L572L272K992K827K531K001J471J106
$$ 411851 413446 416453 419956 423319 426672 430241 433813 437085 440077 442904 445435 447436 448907 450013
59897D50013P38J33n89j016q81l75Q2L95Q88J821K948L786M166M293M366M402
$$ 450013 450751 450884 450295 449279 448398 448023 448105 448500 449388 451209 454157 457943 462109 466402 470768 475170
59881D75170M423M499M573M483M190L867L672L560L276K471R77q55k200k470j949
$$ 475170 479593 484092 488665 493148 497338 501205 504877 508437 511713 514184 515161 514306 512106 509636 507687
59866E07687j525j744k292k415j681l74P14R01K26n61p20k04N49J323K362L822
$$ 507687 506162 504418 502126 499711 498030 497656 498370 499271 499497 498936 498216 498012 498561 499884 502246 506068
59850E06068N323O195O096N224L927K333M93j185j975j526l22P82J400J689J713
$$ 506068 511391 517586 523682 528906 532833 535166 535659 534474 532499 530973 530651 531433 532833 534522 536235
59835E36235J168j14j783l164l666k997j392L10J227J227P80Q7j113k779m276
$$ 536235 537403 537289 535506 532342 528676 525679 524287 524597 525824 527051 527831 527918 526805 524026 519750
59820E19750n163n644n920n760n124m561m366m000l047k187k345l280l952l988
$$ 519750 514587 508943 503023 497263 492139 487578 483212 479212 476165 473978 471633 468353 464401 460413
59806D60413l827l592k876j740r60r43j158r89o45p42j406k104k205j598q25m97
$$ 460413 456586 452994 450118 448378 447418 446475 445317 444328 443683 442941 441535 439431 437226 435628 434803 434306
59790D34306m86K0J267K239J898P60L34J038J700J279K09m36k95J97N68O41M94
$$ 434306 433820 433840 435107 437346 439244 440004 440338 441376 443076 444355 444564 444128 443833 444030 444598 445239 445733
59773D45733M41P39J135J177J018J341K154K476J741Q05Q66J835K586K533K117
$$ 445733 446174 446913 448048 449225 450243 451584 453738 456214 457955 458760 459626 461461 464047 466580 468697
59758D68697J875J836J985K572L666M839N640O045O270O436O650P103P760Q121
$$ 468697 470572 472408 474393 476965 480631 485470 491110 497155 503425 509861 516511 523614 531374 539495
59744E39495P702O700N861N623N668N447M905M354L869L107J842L70p33j130r41
$$ 539495 547197 553897 559758 565381 571049 576496 581401 585755 589624 592731 594573 594943 594210 593080 592139
59729E92139o41o75j028j205q74m70o79j391j766j572j645k548l460l247k162
$$ 592139 591498 590823 589795 588590 587716 587246 586567 585176 583410 581838 580193 577645 574185 570938 568776
59714E68776j498j789k370k736l217l958m286l700k810k514k712k581j878j142
$$ 568776 567278 565489 563119 560383 557166 553208 548922 545222 542412 539898 537186 534605 532727 531585
59700E31585p28l18L35Q62P71K32m8L15R55J248J034O74M94M40L05J67K96P54
$$ 531585 530857 530539 530874 531736 532507 532739 532691 533006 533961 535209 536243 536917 537411 537851 538156 538323 538619 539373
59682E39373J183J108M13m90r92q91o05p52j498k525l528m405m987n019m639m395
$$ 539373 540556 541664 542077 541587 540595 539704 539099 538347 536849 534324 530796 526391 521404 516385 511746 507351
59666E07351m517m557m103l468l177l092k675j934j406j222q21K04J486K346K553
$$ 507351 502834 498277 494174 490706 487529 484437 481762 479828 478422 477200 476379 476583 478069 480415 482968
59651D82968K395K175J844J148R9p55q25l24k20j069k334l214l695m148m316l581
$$ 482968 485363 487538 489382 490530 490629 489874 489049 488725 488505 487436 485102 481888 478193 474045 469729 466148
59635D66148k154j087r34j172j132q54o78o71q04j297k267l325l847l538k633
$$ 466148 463994 462907 461973 460801 459669 458815 458137 457466 456662 455365 453098 449773 445926 442388 439755
59620D39755j728j456j981k761l095k937k789k833k709k208j600j044k42R19J856
$$ 439755 438027 436571 434590 431829 428734 425797 423008 420175 417466 415258 413658 412614 412372 413291 415147
59605D15147J928J380J151J731K553K657J809P92M99Q86J167R71Q18J131J478
$$ 415147 417075 418455 419606 421337 423890 426547 428356 429148 429647 430533 431700 432671 433489 434620 436098
59590D36098J312J001J283J995K277J899J460J181N31o78j659j639q35n7J96q1
$$ 436098 437410 438411 439694 441689 443966 445865 447325 448506 449037 448359 446700 445061 444226 444169 444365 444284
59574D44284o29j043j028p61o27o02m18k91o73j291j310p08m49r15j166m34O29
$$ 444284 443655 442612 441584 440823 440196 439594 439176 438885 438212 436921 435611 434903 434454 433539 432373 431939 432568
59557D32568R39M76k9k53k24K54J185J836J560Q36O63J213J949K784M086N729
$$ 432568 433507 433983 433954 433701 433477 433731 434916 436752 438312 439148 439811 441024 442973 445757 449843 455572
59541D55572P112Q167R465J1217J2999J4404J5123J4247J0572M238k695p827j0246
$$ 455572 462684 470851 480316 491533 504532 518936 534059 548306 558878 563116 560421 552594 542348
59528E42348j0452r099o594l577r58P78J890K692K957K296R92o4m00n38j222k431
$$ 542348 531896 522797 516203 512626 511668 512446 514336 517028 519985 522281 523273 523209 522809 522271 521049 518618
59512E18618l599m542n519o405o628o125n694n938o419o330n544m527l659l110
$$ 518618 515019 510477 504958 498553 491925 485800 480106 474168 467749 461419 455875 451348 447689 444579
59498D44579l027l239l163k506j831j778k053j823q91J68R24J425J696J613J363
$$ 444579 441552 438313 435150 432644 430813 429035 426982 425159 424268 424436 425360 426785 428481 430094 431457
59483D31457J369J662J855J815J857K163K547K965L646M536N131N136M804M328
$$ 431457 432826 434488 436343 438158 440015 442178 444725 447690 451336 455872 461003 466139 470943 475271
59469D75271L419J966O67M08J157J979K147J827J610J775K189K606K840K792K589
$$ 475271 478690 480656 481323 481731 482888 484867 487014 488841 490451 492226 494415 497021 499861 502653 505242
59454E05242K622L187M087M758M890M736M739M963N010M371K835P59j044j983
$$ 505242 507864 511051 515138 519896 524786 529522 534261 539224 544234 548605 551440 552199 551155 549172
59440E49172k347k975m004m550l986k989k535k393j582j69O47L56o0L57J291K061
$$ 549172 546825 543850 539846 535296 531310 528321 525786 523393 521811 521642 522289 522645 522585 522942 524233 526294
59424E26294K883M365O350Q232J0001J2062J4275J6060J7406J8977K1134K3488
$$ 526294 529177 533542 539892 548124 558125 570187 584462 600522 617928 636905 658039 681527
59412F81527K5500K6777K6496K3215J6037O009l967j0978j3962j3753j1511p569
$$ 681527 707027 733804 760300 783515 799552 805561 801594 790616 776654 762901 751390 743821
59400G43821k063L873Q336R976Q425L602m198j3235k0507k3991k4175k2796k0772
$$ 743821 741758 745631 753967 763943 772368 775970 771772 758537 738030 714039 689864 667068 646296
59387F46296j8125j5186j2624j0450q109n658l999l683m140m349l880l032k253
$$ 646296 628171 612985 600361 589911 581802 576144 572145 568462 564322 559973 556093 553061 550808
59374E50808j624q49K21J182J376P64O3q2L36J091K076K999L353L184L261M035
$$ 550808 549184 548335 548556 549738 551114 551878 551941 551859 552195 553286 555362 558361 561714 564898 568159 572194
59358E72194M988N591O207P299Q417Q858Q854R136R736J0173J0516J1232J2175
$$ 572194 577182 582773 588980 596279 604696 613554 622408 631544 641280 651453 661969 673201 685376
59345F85376J2666J2488J1928J1056R819Q600P714O533M157Q63k128m344o389
$$ 685376 698042 710530 722458 733514 743333 751933 759647 766180 770337 771200 769072 764728 758339
59332G58339q616j0588j2060j3338j4459j4962j4851j4743j4781j4357j3255j2114
$$ 758339 749723 739135 727075 713737 699278 684316 669465 654722 639941 625584 612329 600215
59320F00215j1320j0379q935p514o644n971m885l488k318j600j151o26L97K097
$$ 600215 588895 578516 569581 562067 555423 549452 544567 541079 538761 537161 536010 535384 535781 537878
59306E37878L964N311O399Q212J0769J2539J2048R302N149J05n412j0386j3696
$$ 537878 541842 547153 553552 561764 572533 585072 597120 606422 611571 611676 606264 595878 582182
59293E82182j5034j4749j3193j0802q356o448m942l506k298j587j069k20R31K000
$$ 582182 567148 552399 539206 528404 520048 513600 508658 505152 502854 501267 500198 499978 500909 502909
59279E02909K937L943M942N706O351P117P870Q378Q913R998J1515J2636J2751
$$ 502909 505846 509789 514731 520437 526788 533905 541775 550153 559066 569064 580579 593215 605966
59266F05966J2067J1201J0465R647Q336O433M347K622J360K53q68j852k628l277
$$ 605966 618033 629234 639699 649346 657682 664115 668462 671084 672444 672697 671829 669977 667349 664072
59252F64072l580l111k076j469j901k772l176l139l297l731l904l630l286l099
$$ 664072 660492 657381 655305 653836 651935 649163 645987 642848 639551 635820 631916 628286 625000 621901
59238F21901k879k565k356k184j637p59l59j126k683l983m478m550m794n291n740
$$ 621901 619022 616457 614101 611917 610280 609521 609162 608036 605353 601370 596892 592342 587548 582257 576517
59223E76517o021o279o504o425n964n491n340n273m736l665k621k164k321k630
$$ 576517 570496 564217 557713 551288 545324 539833 534493 529220 524484 520819 518198 516034 513713 511083
59209E11083k527j691l94N82P28M22M43R11J210R02K83j09l7M17R66J151P42J69
$$ 511083 508556 506865 506471 507053 507781 508203 508646 509557 510767 511669 511952 511843 511806 512223 513189 514340 515082 515251
59191E15251P3M07N34K64M6O9q7o07j003r43p49o08m5J206K445K867K625K315
$$ 515251 515324 515731 516265 516529 516575 516644 516557 515950 514947 514004 513255 512647 512602 513808 516253 519120 521745 524060
59173E24060J961J256M14o8k25l79l46K70J141J565J651K201L266L743K793R60
$$ 524060 526021 527277 527691 527623 527398 527019 526673 526943 528084 529649 531300 533501 536767 540510 543303 544263
59157E44263o56j714k642l652m475m893n101n380n688n756n494n153m995m955
$$ 544263 543607 541893 539251 535599 531124 526231 521130 515750 510062 504306 498812 493659 488664 483709
59143D83709m769m410m143m061l927l595l298l177k865j966q18k61n78j098r87
$$ 483709 478940 474530 470387 466326 462399 458804 455506 452329 449464 447498 446680 446419 445841 444743 443756
59128D43756j47Q87J683K269K840L398L856M368N199O255O969O987O710O777P217
$$ 443756 443609 444496 446179 448448 451288 454686 458542 462910 468109 474364 481333 488320 495030 501807 509024
59113E09024P495P409P328P460P433O927O163N461M673L581K492J951J953J882
$$ 509024 516519 523928 531256 538716 546149 553076 559239 564700 569373 572954 575446 577397 579350 581232
59099E81232J204l2j348k243k567k631k872l276l349k781j881j180q68q55j033
$$ 581232 582436 582404 581056 578813 576246 573615 570743 567467 564118 561337 559456 558276 557408 556553 555520
59084E55520j225j164r10j034j952l294m320m772m886m743m224l533l211l406
$$ 555520 554295 553131 552221 551187 549235 545941 541621 536849 531963 527220 522996 519463 516252 512846
59070E12846l595l257k558k065k049k294k480k445k134j586j074j005j465j998
$$ 512846 509251 505994 503436 501371 499322 497028 494548 492103 489969 488383 487309 486304 484839 482841
59056D82841k097j817j633j730j805j637j347r45j21J088J946J887J331J015Q54
$$ 482841 480744 478927 477294 475564 473759 472122 470775 469830 469709 470797 472743 474630 475961 476976 477830
59041D77830L26l05j74P36J353R78J79j96o1K50O90J293J805K115K720M180O389
$$ 477830 478156 477851 477677 478413 479766 480744 480923 480727 480666 480916 481606 482899 484704 486819 489539 493719 500108
59024E00108Q690J0510J1616J2023J1959J1651J0981R714Q111O808N902M684K539
$$ 500108 508798 519308 530924 542947 554906 566557 577538 587252 595363 602171 608073 612757 615296
59011F15296l27l270n740p283p628p100o351n435l792j443O53J817K431K990L266
$$ 615296 614969 611699 605959 598676 591048 583948 577597 572162 568370 566927 567580 569397 571828 574818 578084
58996E78084L054K916L276L501K847J790J398J765K066J895J541J106L97l27l93
$$ 578084 581138 584054 587330 590831 593678 595468 596866 598631 600697 602592 604133 605239 605636 605309 604916
58981F04916L41J307K076K819L770M907O198P687R163J0206J0653J0765J0845
$$ 604916 605257 606564 608640 611459 615229 620136 626334 634021 643184 653390 664043 674808 685653
58968F85653J0992J1254J1710J2306J2772J2699J1753R997P945O028M120K081
$$ 685653 696645 707899 719609 731915 744687 757386 769139 779136 787081 793109 797229 799310
58956G99310M48k55q26k790o177r160j0525j1305j2947j5053j6142j5822j4830
$$ 799310 799758 799503 798677 795887 789710 780550 770025 758720 745773 730720 714578 698756 683926
58943F83926j3481j1550r380p724o599n472m385l791l411k536j379q42r13o00
$$ 683926 670445 658895 649515 641791 635192 629720 625335 621544 618133 615597 614218 613376 612463 611863
58929F11863L87J118J027Q04J179J750J677Q64j49r02j248j250j229j561k231
$$ 611863 612250 613368 614395 615199 616378 618128 619805 620669 620520 619618 618370 617120 615891 614330 612099
58914F12099k864l166k988k142o96P18J550K139L222M795O264P511Q912J0333
$$ 612099 609235 606069 603081 600939 600243 600961 602511 604650 607872 612667 618931 626442 635354 645687
58900F45687J1108J1135J1034J1063J0819J0223R859J0036J0399J0774J1533J2726
$$ 645687 656795 667930 678964 690027 700846 711069 720928 730964 741363 752137 763670 776396
58888G76396J3781J4426J5100J5961J6307J5552J4046J2306J0148P291M235J724
$$ 776396 790177 804603 819703 835664 851971 867523 881569 893875 904023 911314 915549 917273
58876I17273l49k723n667q635j0940j2334j2972j3084j2642j1374r328p326o339
$$ 917273 916924 914201 908534 899899 888959 876625 863653 850569 837927 826553 817225 809899 803560
58863H03560o289o077n022l742l342m194n834p501q493q482p964p946q711r315
$$ 803560 797271 791194 786172 782430 779088 774894 769060 761559 753066 744584 736620 728674 719963 710648
58849G10648q757p289o009n526n586n754n861n848n781o056p029q372r210r084
$$ 710648 701891 694602 688593 683067 677481 671727 665866 660018 654237 648181 641152 632780 623570 614486
58835F14486q415p788p229o449n537m818m207l256j932p65NQ37J996K874K924
$$ 614486 606071 598283 591054 584605 579068 574250 570043 566787 564855 564090 564095 564932 566928 569802 572726
58820E72726K804L596N101N988N684M986M619M336L826L365K959J949K10j250
$$ 572726 575530 579126 584227 590215 595899 600885 605504 609840 613666 617031 619990 621939 622149 620899
58806F20899j755k037k931l970m385m548n140n713n527n157n714o909p478p220
$$ 620899 619144 617107 614176 610206 605821 601273 596133 590420 584893 579736 574022 567113 559635 552415
58792E52415p078p317p198o484n788n317m569l487k616k004j181k58K36O12J720
$$ 552415 545337 538020 530822 524338 518550 513233 508664 505177 502561 500557 499376 499118 499354 499966 501686
58777E01686L235L799L137K494K573K492J394l81k310m459o471p203o312n169
$$ 501686 504921 508720 511857 514351 516924 519416 520810 520429 518119 513660 507189 499986 493674 488505
58763D88505n179o020o366n529l657j178J176K548K914L208L975M663M795M817
$$ 488505 483326 477306 470940 465411 461754 460576 461752 464300 467214 470422 474397 479060 483855 488672
58749D88672N101M999L856K207J117Q86J137J584J997J982J528J327J891K860
$$ 488672 493773 498772 502628 504835 505952 506838 507975 509559 511556 513538 515066 516393 518284 521144
58735E21144L668M297M844M976M472L805L536L644L896M318M789M757M042L334
$$ 521144 524812 529109 533953 538929 543401 547206 550742 554386 558282 562600 567389 572146 576188 579522
58721E79522L341L915M556N202N974O690P146P529Q008Q329Q175P484O213M301
$$ 579522 582863 586778 591334 596536 602510 609200 616346 623875 631883 640212 648387 655871 662084 666385
58707F66385K136L58j060k811n105p345r216j1153j3282j4916j5641j5959j6235
$$ 666385 668521 668879 667819 665008 659903 652558 643342 632189 618907 603991 588350 572391 556156
58694E56156j5950j4778j3410j2514j1630r984p778n832m514l762l584l795l805
$$ 556156 540206 525428 512018 499504 487874 477890 470112 464280 459766 456004 452420 448625 444820
58681D44820l356k965l018l066k574j792j198o95L2Q94J737K698L690M257M447
$$ 444820 441464 438499 435481 432415 429841 428049 426851 426156 426188 427082 428819 431517 435207 439464 443911
58666D43911N101O644Q275R198R838J0986J2251J2270J0176O284J684k391n137
$$ 443911 449012 455656 463931 473129 482967 493953 506204 518474 528650 534934 536618 534227 529090
58653E29090o649p532p986p800p118o313n124l106j045m61j351j915j170j97m0
$$ 529090 522441 514909 506923 499123 492005 485692 480568 477462 476417 475956 474605 472690 471520 471323 471283
58638D71283m7N92J202R17L08K75M29J7n72o62o96j302j930j841j613k073k591
$$ 471283 471236 471828 473030 473947 474255 474530 474959 474976 474404 473742 473046 471744 469814 467973 466360 464287 461696
58621D61696k036p56M4L25R75K024K748L169L893M707M832M382M128L993L226
$$ 461696 459660 458904 458948 459273 460248 462272 465020 468189 472082 476789 481621 486003 490131 494124 497350
58606D97350J922J054R97J177J166R98N84k10r60j207j308j852k518k529j864
$$ 497350 499272 500326 501323 502500 503666 504664 505248 505038 504078 502871 501563 499711 497193 494664 492800
58591D92800j051j26J147K427L258L986N151O378O947P045P298P582P438P255
$$ 492800 491749 491623 492770 495197 498455 502441 507592 513970 520917 527962 535260 542842 550280 557535
58577E57535P708Q358Q085O750N311M490M400N080O375P654Q622J0016J2509J5523
$$ 557535 565243 573601 581686 588436 593747 598237 602637 607717 614092 621746 630368 640384 652893 668416
58563F68416J8128K0398K2691K4375K4711K4212K3603K2154J8749J4059R823O339
$$ 668416 686544 706942 729633 754008 778719 802931 826534 848688 867437 881496 891319 897658
58551H97658K490j922n680p947q936q818p557n906n108n412o150p155q860j1145
$$ 897658 900148 898226 892546 884599 875663 866845 859288 853382 848274 842862 836712 829557 820697 809552
58537H09552j3413j5637j8032j9892k0157j8937j7159j5044j2359r780q359p842
$$ 809552 796139 780502 762470 742578 722421 703484 686325 671281 658922 649142 640783 632941
58525F32941p020n635m416l560k752k369l017m043m130l216k246j408l48K94m80
$$ 632941 625921 620286 615870 612310 609558 607189 604172 600129 595999 592783 590537 589129 588781 589075 588595
58510E88595k070k892k788k849l074k424j105n89j134j497j275j329j628r96M54
$$ 588595 586525 583633 580845 577996 574922 572498 571393 570804 569670 568173 566898 565569 563941 562945 563399
58495E63399R97J07n32L74K035L316M293N191N532N277N327O071O840P383Q381
$$ 563399 564396 564503 563971 564345 566380 569696 573989 579180 584712 589989 595316 601387 608227 615610 623991
58480F23991R963J1249J1913J2608J3423J3517J2749J1944J0995Q544M203n87
$$ 623991 633954 645203 657116 669724 683147 696664 709413 721357 732352 740896 745099 744512
58468G44512m567p805j0249j1036j0101q777p856o633m583k369m13J914M836P431
$$ 744512 739945 732140 721891 710855 700754 691977 684121 677488 672905 670536 670123 672037 676873 684304
58454F84304R158J0503J1494J1226R698Q331P693O395L266r22m864q266j0935
$$ 684304 693462 703965 715459 726685 736383 744714 752407 758802 762068 761146 756282 748016 737081
58441G37081j1974j1064r360q004o976o028n421m896l459j124O25R85J026J850
$$ 737081 725107 714043 704683 696679 689703 683675 678254 673358 669899 668775 669400 670385 671411 673261
58427F73261L092M119N226O555P308P096O725O663O058M266K009N5j906m092n656
$$ 673261 676353 680472 685698 692253 699561 706657 713382 720045 726103 730369 732378 732433 730527 726435 720779
58412G20779n945n545n190m811m382m463n049n194m469l607l066k313j125j28
$$ 720779 714834 709289 704099 699288 694906 690443 685394 680200 675731 672124 669058 666745 665620 665492
58398F65492N31J577L072M067M340M766N441N273M137L454L815M019L377K937
$$ 665492 666023 667600 670672 674739 679079 683845 689286 694559 698696 702150 705965 709984 713361 716298
58384G16298L351L518K706K113K936M415N121M845M153L378L010L648M859N453
$$ 716298 719649 723167 725873 727986 730922 735337 740458 745303 749456 752834 755844 759492 764351 769804
58370G69804N327N433N719N162M140M373O004P276P766R038J1241J2114J0773
$$ 769804 775131 780564 786283 791445 795585 799958 805962 813238 821004 830042 841283 853397 864170
58357H64170R400R600R836Q436O432N373M716L517K463K307K282J909K193L451
$$ 864170 873570 883170 893006 901442 907874 913247 917963 921480 923943 926250 928532 930441 932634 936085
58343I36085M171L796M098O032P749P782P631Q969J0795J1642J2250J3613J4701
$$ 936085 940256 944052 948150 954182 961931 969713 977344 986313 997108 1008750 1021000 1034613 1049314
58330A049314J4505J4118J4371J3740J1040P959O401N496L823K345K390K877K381
$$ 1049314 1063819 1077937 1092308 1106048 1117088 1125047 1131448 1136944 1140767 1143112 1145502 1148379 1150760
58317A150760J936L056M709N161N041N963P622Q789R626J0724J1494J1593J2076
$$ 1150760 1152696 1155752 1160461 1165622 1170663 1176626 1184248 1193037 1202663 1213387 1224881 1236474 1248550
58304A248550J3255J3600J2685J2681J4730J6633J6548J6032J6809J7484J6483
$$ 1248550 1261805 1275405 1288090 1300771 1315501 1332134 1348682 1364714 1381523 1399007 1415490
58293A415490J5349J5884J6791J6432J6215J7808J9642J9662J9077J9938K1464
$$ 1415490 1430839 1446723 1463514 1479946 1496161 1513969 1533611 1553273 1572350 1592288 1613752
58282A613752K2131K2822K4521K5541K4581K3715K4893K6353K6152K6123K8456
$$ 1613752 1635883 1658705 1683226 1708767 1733348 1757063 1781956 1808309 1834461 1860584 1889040
58271A889040L1507L3036L4496L7764M0912M1738M2302M5229M8648M9711N0029
$$ 1889040 1920547 1953583 1988079 2025843 2066755 2108493 2150795 2196024 2244672 2294383 2344412
58260B344412N2502N5743N6896N7018N8429N9649N8421N6825N7918O0252O1180
$$ 2344412 2396914 2452657 2509553 2566571 2625000 2684649 2743070 2799895 2857813 2918065 2979245
58249B979245O2438O6662P1724P4561P7311Q3344R0545R5179R9029J05852J14103
$$ 2979245 3041683 3108345 3180069 3254630 3331941 3415285 3505830 3601009 3700038 3805890 3919993
58238C919993J20297J26190J35243J45325J52565J59085J69016J80355J89041
$$ 3919993 4040290 4166480 4301723 4447048 4599613 4758698 4927714 5108069 5297110
58229E297110J97620K11155K27953K43278K58833K79294L03052L25985L50690
$$ 5297110 5494730 5705885 5933838 6177116 6435949 6715243 7018295 7344280 7694970
58220G694970L81966M17127M51316M88252N34543N87833O42656P03405P78597
$$ 7694970 8076936 8494063 8945379 9433631 9968174 10556007 11198663 11902068 12680665
58211A2680665Q67118R64262J076507J215249J381284J572819J804260K097986
$$ 12680665 13547783 14512045 15588552 16803801 18185085 19757904 21562164 23660150
58203B3660150K460402K884546L372603L936158M580791N317249O188082P259408
$$ 23660150 26120552 29005098 32377701 36313859 40894650 46211899 52399981 59659389
58195E9659389Q586963J0212225J2182813J4542235J7305284K0487720K4155113
$$ 59659389 68246352 78458577 90641390 105183625 122488909 142976629 167131742
58188A67131742K8351734L2864402L6956453L9260802L7989264L1578669J9664692
$$ 167131742 195483476 228347878 265304331 304565133 342554397 374133066 393797758
58181C93797758L798578j2845108k6843060l6043182m0129780m0074442l7245566
$$ 393797758 397596336 384751228 357908168 321864986 281735206 241660764 204415198
58174B04415198l2885951k7983909k3237742j9025455j5467743j2557199j0234008
$$ 204415198 171529247 143545338 120307596 101282141 85814398 73257199 63023191
58167F3023191q398394o937231n767028m835576m092138l485195k984105k575906
$$ 63023191 54624797 47687566 41920538 37084962 32992824 29507629 26523524 23947618
58159B3947618k242081j959013j716924j517290j353308j210485j083460r75246
$$ 23947618 21705537 19746524 18029600 16512310 15159002 13948517 12865057 11889811
58151A1889811q82167p95077p13338o42980n82889n26034m72230m26893l89189
$$ 11889811 11007644 10212567 9499229 8856249 8273360 7747326 7275096 6848203 6459014
58142F459014l53605l21327k98097k82337k66589k49342k34798k22417k07347
$$ 6459014 6105409 5784082 5485985 5203648 4937059 4687717 4452919 4230502 4023155
58133D023155j90183j76183j65465j53425j40115j30043j23258j15482j06639
$$ 4023155 3832972 3656789 3491324 3337899 3197784 3067741 2944483 2829001 2722362
58124B722362j00788r7861r3571q7365q2779q0122p6131p0695o6882o4579o0830
$$ 2722362 2621574 2523713 2430142 2342777 2259998 2179876 2103745 2033050 1966168 1901589 1840759
58113A840759n6058n3384n2340m9765m6212m4869m4866m2409l7994l5693l5631
$$ 1840759 1784701 1731317 1678977 1629212 1583000 1538131 1493265 1450856 1412862 1377169 1341538
58102A341538l3979l0333k8260k8383k7492k5050k4212k5620k6257k5245k5062
$$ 1341538 1307559 1277226 1248966 1220583 1193091 1168041 1143829 1118209 1091952 1066707 1041645
58091A041645k6142k5833k3596k1921k1265j9255j5732j3497j3192j2459j1041
$$ 1041645 1015503 989670 966074 944153 922888 903633 887901 874404 861212 848753 837712
58080H37712j1595j4438j6325j5809j5159j5760j6078j5367j5186j5804j5223
$$ 837712 826117 811679 795354 779545 764386 748626 732548 717181 701995 686191 670968
58069F70968j2996j1273j0920j0328r017q593r164q632o702n822o948p853p019
$$ 670968 657972 646699 635779 625451 616434 607841 598677 590045 583343 577521 570573 562720 555701
58056E55701n823n712o257p076q585j0000r583p718o717o996o573m916l902m212
$$ 555701 549878 544166 537909 530833 522248 512248 502665 494947 488230 481234 474661 469745 465843 461631
58042D61631m210l284k960l765m272m159m899o407o479m727l711m721n777n404
$$ 461631 457421 454137 451177 447412 443140 438981 434082 427675 421196 416469 412758 408037 402260 396856
58028C96856n111o312p671p584o808o636o645o013n191m609l554j717j88K51J96
$$ 396856 391745 385433 377762 370178 363370 356734 350089 344076 338885 334276 330722 329005 328817 329068 329264
58013C29264Q3n73j636k010j628j804k803l078j838l33K26J00l39j318k257j785
$$ 329264 329347 328774 327138 325128 323500 321696 318893 315815 313977 313644 313870 313970 313631 312313 310056 308271
57997C08271r8P80l6j044r47m63n88j028j342j808k303k027j077o13q46p64k39
$$ 308271 308173 308953 308917 307873 306926 306463 305875 304847 303505 301697 299394 297367 296290 295677 294831 294067 293828
57980B93828l87j321j763j447j631k567k890k312k371l512l863k250q3J023J306
$$ 293828 293441 292120 290357 288910 287279 284712 281822 279510 277139 273627 269764 267514 267431 268454 269760
57965B69760J288M51j027j424l4J372J243N50P46J302J033K75j03m52j342k146
$$ 269760 271048 271499 270472 269048 269014 270386 271629 272179 272925 274227 275260 275535 275432 274980 273638 271492
57949B71492k168k060k559l005k601j987k046k113r50J301L488N091O290P094
$$ 271492 269324 267264 264705 261700 259099 257112 255066 252953 252003 253304 256792 261883 268173 275267
57935B75267P426P566P674P434O782O150N512M145J837o52k804m881o870q138
$$ 275267 282693 290259 297933 305367 312149 318299 323811 327956 329793 329141 326337 321456 314586 306448
57921C06448q575q800q855q110o840o273o568o429n281m047l189j907j23P75K99
$$ 306448 297873 289073 280218 272108 265268 258995 252427 245998 240717 236670 233481 231574 231451 232226 232525
57906B32525l9P74J480Q02l56n31j40n43j782k829l134k716j651o02o97j883k537
$$ 232525 232486 233260 234740 235542 235186 234655 234515 233972 232190 229361 226227 223511 221860 221258 220561 218678 216141
57889B16141j685l43L43O93J155J024j4o18K09J247R13k24o02k59l34q56r13m92
$$ 216141 214456 214113 214456 215149 216304 217328 217314 216696 216905 218152 219065 218841 218239 217980 217646 216790 215877 215385
57871B15385m32q37j046q47m65K35J382K414K875L326M423N639O024N617N088
$$ 215385 214953 214116 213070 212223 211758 211993 213375 215789 218664 221990 226413 232052 238076 243693 248781
57856B48781M638M328M714N976P060O852N670M555L694K662J509M93p13k396l908
$$ 248781 253419 257747 262461 268437 275497 282349 288019 292574 296268 298930 300439 300932 300219 297823 293915
57841B93915m423m156l880l761l568l385l273k833j986j505j858k341k225j913
$$ 293915 289492 285336 281456 277695 274127 270742 267469 264636 262650 261145 259287 256946 254721 252808
57827B52808k018k092j445l62N28J382K506L452L871M424N603O356N347K890M28
$$ 252808 250790 248698 247253 246891 247419 248801 251307 254759 258630 263054 268657 275013 280360 283250 283678
57812B83678j421k946m065m379m189m213m422m232l600k963k414j813j384j402
$$ 283678 282257 279311 275246 270867 266678 262465 258043 253811 250211 247248 244834 243021 241637 240235
57798B40235j646j858k208k710k881k685k893l704l986k967j607j187j398j192
$$ 240235 238589 236731 234523 231813 228932 226247 223354 219650 215664 212697 211090 209903 208505 207313
57784B07313o18l94l78K5N50O22O93J598K982L706L532L090K588J764Q20J95l50
$$ 207313 206695 206301 205923 205948 206498 207120 207813 209411 212393 216099 219631 222721 225309 227073 227893 228088 227738
57767B27738j310k429l116l426l698l791l610l721m381m757m224l620l880m314
$$ 227738 226428 223999 220883 217457 213759 209968 206358 202637 198256 193499 189275 185655 181775 177461
57753A77461l715k373j404p88J52J005Q91L54P22J826K283J900J882K623L062
$$ 177461 173746 171373 169969 169181 169333 170338 171229 171583 172305 174131 176414 178314 180196 182819 185881
57738A85881K531J617R84O96Q94J744K670K915K845L346M116M114L549L680M524
$$ 185881 188412 190029 191013 191709 192603 194347 197017 199932 202777 206123 210239 214353 217902 221582 226106
57723B26106M638L472K229J843J643P29o49j724k236k239j914j824k458l314l490
$$ 226106 230744 234216 236445 238288 239931 240660 240011 238287 236051 233812 231898 230074 227616 224302 220812
57708B20812l186l439m271m535l791k917k527k166j525j103j094q41l2O72P43
$$ 220812 217626 214187 209916 205381 201590 198673 196146 193980 192455 191352 190258 189417 189385 190057 190800
57693A90800N15L05j03o16o40j63J1k58N9J508L119L829M041M819O272P618Q398
$$ 190800 191315 191620 191517 190901 190261 190098 190109 189851 189910 191418 194537 198366 202407 207226 213498 221116 229514
57676B29514Q893R717J1464J4356J7888K1257K4342K7757L1826L6152M0154M2954
$$ 229514 238407 248124 259588 273944 291832 313089 337431 365188 397014 433166 473320 516274
57664E16274M2516L6138K2833M777j4057l0192m1589m7470m8278m5476m0738l5305
$$ 516274 558790 594928 617761 622538 608481 578289 536700 489230 440952 395476 354738 319433
57652C19433l0041k5440k1403j7517j3829j0799q497o562n024m363m415m115k767
$$ 319433 289392 263952 242549 225032 211203 200404 191907 185345 180321 175958 171543 167428 164661
57639A64661r52K39M01m1l94k21K72K44q58k355k935k192r17M6M81L86j91p87
$$ 164661 163709 163948 164349 164308 163914 163693 163965 164209 163351 160996 158061 155869 154952 154998 155479 155865 155674 154887
57621A54887q76o70p92j135j067p09q17j270r92K21J078O15m54r26o68k74m7q9
$$ 154887 154011 153341 152549 151414 150347 149638 148821 147551 146559 146780 147858 148473 148019 147093 146425 146151 146104 146015
57603A46015o25j511k017j802j521j828k372k395j828j170p32n84q47j501k152
$$ 146015 145390 143879 141862 140060 138539 136711 134339 131944 130116 128946 128214 127630 126783 125282 123130
57588A23130k400k195j696j166j050j562k139j976j200p54r56j089o79k37l38
$$ 123130 120730 118535 116839 115673 114623 113061 110922 108946 107746 106992 106036 104947 104268 104031 103693
57573A03693q25j333j786j926j285q0O46L57k53l91j35J07L17M37J25m42m26L35
$$ 103693 102868 101535 99749 97823 96538 96458 97104 97461 97208 96817 96682 96789 97106 97543 97668 97226 96800 97135
57555I7135P20j14j386j762j079j05P06J323J574J455J505J990K171J325Q8k08
$$ 97135 97855 97741 96355 94593 93514 93409 94115 95438 97012 98467 99972 101962 104133 105458 105546 105338
57539A05338Q00K312L531M154L970K939J581N60r5o79j011p01j6K67p4m90n35
$$ 105338 106138 108450 111981 116135 120105 123044 124625 125185 125090 124411 123400 122699 122683 122950 122876 122386 121851
57522A21851l25j29o5k46o82j036r63p25r88j890k734k773k003j033l57L6M13
$$ 121851 121526 121397 121332 121086 120404 119368 118405 117680 116692 114802 112068 109295 107292 106259 105902 105938 106351
57505A06351P71Q01M07k1j40k27p10j383j731j932k612l522l494k117n90j94o59
$$ 106351 107122 107923 108330 108309 108169 107942 107232 105849 104118 102186 99574 96052 92558 90441 89851 89657 88998
57488H8998q06k71K15l5q91j634j520l63J050J501P31j82k30K45K49l85r85j169
$$ 88998 88192 87921 88136 88101 87210 85576 84056 83693 84743 86244 86975 86793 86563 86808 87057 86672 85687 84518
57470H4518j196j249j160q58n67m68n10o04o65n33j58J95K37J03K26P79J473J833
$$ 84518 83322 82073 80913 80055 79488 79020 78510 77906 77241 76708 76550 76745 76982 77085 77311 78090 79563 81396
57452H1396J594Q37q7p81j035p92j15O84J087R39P75J129J659J522N53n04r57
$$ 81396 82990 83827 83740 82959 81924 81132 81017 81701 82788 83727 84502 85631 87290 88812 89365 88861 87904
57435H7904p36r8O18R70P83N18O16O85J91k91K54J451J766P65l07o11p71j172
$$ 87904 87168 87070 87688 88658 89441 89959 90575 91260 91451 91160 91414 92865 94631 95396 95089 94478 93707 92535
57417I2535q57P57K384K503J495P36M76J7n73n29J51O01M05o9n26r41j079p22
$$ 92535 91678 92435 94819 97322 98817 99553 100029 100046 99473 98944 99095 99696 100101 100032 99506 98565 97486 96764
57399I6764k82l54q02j057j041r82o73J57R86J018M53K94R12J659J941J853J709
$$ 96764 96482 96128 95326 94269 93228 92246 91573 91730 92716 93734 94187 94481 95393 97052 98993 100846 102555
57382A02555J668J822K055J874R98%l03P4M63O33Q99J300J440J147O71K04j81
$$ 102555 104223 106045 108100 109974 110972 110972 110669 110743 111206 111839 112738 114038 115478 116625 117296 117500 117319
57365A17319k83k5J36k52q84j069o47P4J006K035K485J770M70k42j47Pj5L51J129
$$ 117319 117036 117011 117147 116895 116011 114942 114295 114369 115375 117410 119895 121665 122135 121893 121746 121753 121738 122089 123218
57346A23218J404P37oJ12Q34J256J063N78R0k96m28k96k15m27o76n40k8M32M84
$$ 123218 124622 125359 125353 125465 126299 127555 128618 129196 129286 128990 128562 128266 128051 127624 126948 126408 126380 126812 127296
57327A27296J43k94m57j12O17J269J423J078O08L65L41K12k26p84j069q51j30
$$ 127296 127439 127145 126688 126576 127193 128462 129885 130963 131571 131936 132277 132489 132263 131479 130410 129559 129429
57310A29429R67K053K460J825O06l46o90n93j35N67Q22rj230j332m9J201J375
$$ 129429 130396 132449 134909 136734 137340 136994 136304 135711 135576 136143 136965 136956 135726 134394 134345 135546 136921
57293A36921J063J084J094N62L2J25K41m10j148o65R20K231K640K765L071L280
$$ 136921 137984 139068 140162 140724 140756 140881 141122 140712 139564 138899 139819 142050 144690 147455 150526 153806
57277A53806L210L144L284L669M609O225P728Q089P427O756O494O201N689N294
$$ 153806 157016 160160 163444 167113 171722 177947 185675 193764 201191 207947 214441 220642 226331 231625
57263B31625N035M577M056L939L984L444K425J918K265K706K714K669K808K646
$$ 231625 236660 241237 245293 249232 253216 256660 259085 261003 263268 265974 268688 271357 274165 276811
57249B76811K012J701K270L007K888K055J574J974K711K978K632K306K729L911
$$ 276811 278823 280524 282794 285801 288689 290744 292318 294292 297003 299981 302613 304919 307648 311559
57235C11559N047N380N058M803M980N313N411N068M284L455L289M010M865N000
$$ 311559 316606 321986 327044 331847 336827 342140 347551 352619 356903 360358 363647 367657 372522 377522
57221C77522M585M363M446M366M111M207M757N304N687O204O873P294P329P230
$$ 377522 382107 386470 390916 395282 399393 403600 408357 413661 419348 425552 432425 439719 447048 454278
57207D54278P101O916O954P455P940P747P159P087P641Q083Q178Q541R426J0272
$$ 454278 461379 468295 475249 482704 490644 498391 505550 512637 520278 528361 536539 545080 554506 564778
57193E64778J0749J1238J1884J2129J1675J1100J1008J1254J1447J1564J1702
$$ 564778 575527 586765 598649 610778 622453 633553 644561 655815 667262 678826 690528
57182F90528J1718J1554J1430J1485J1676J2042J2552J2764J2333J1884J2409
$$ 690528 702246 713800 725230 736715 748391 760433 772985 785749 798082 809966 822375
57171H22375J3761J4691J4589J4234J4431J4976J5433J6078J7307J8795J9906
$$ 822375 836136 850827 865416 879650 894081 909057 924490 940568 957875 976670 996576
57160I96576K0599K1358K2469K3758K4918K5885K6996K8608L0385L1350L1150
$$ 996576 1017175 1038533 1061002 1084760 1109678 1135563 1162559 1191167 1221552 1252902 1284052
57149A284052L0847L1642L3238L4476L5318L6852L9317M1430M2095M1659M1076
$$ 1284052 1314899 1346541 1379779 1414255 1449573 1486425 1525742 1567172 1609267 1650926 1692002
57138A692002M0764M0779M1195M1810M2231M2679M4129M7204N1478N6109O0626
$$ 1692002 1732766 1773545 1814740 1856550 1898781 1941460 1985589 2032793 2084271 2140380 2201006
57127B201006O4928O9031P3071P6994Q0366Q2981Q5508Q8815R2890R7251J02145
$$ 2201006 2265934 2334965 2408036 2485030 2565396 2648377 2733885 2822700 2915590 3012841 3114986
57116C114986J08402J16247J25276J35521J47497J61424J77306J95533K16364
$$ 3114986 3223388 3339635 3464911 3600432 3747929 3909353 4086659 4282192 4498556
57107D498556K39230K63878K92088L27169L72204M29882N03247N94803P05420
$$ 4498556 4737786 5001664 5293752 5620921 5993125 6423007 6926254 7521057 8226477
57098H226477Q35944R89664J171604J386129J637071J929043K265667K646359
$$ 8226477 9062421 10052085 11223689 12609818 14246889 16175932 18441599 21087958
57090B1087958L066023L515710L980126M436059M857229N219543N499165N672705
$$ 21087958 24153981 27669691 31649817 36085876 40943105 46162648 51661813 57334518
57082E7334518N731810N695252N585394N376152M971808M258020L186922J817867
$$ 57334518 63066328 68761580 74346974 79723126 84694934 88952954 92139876 93957743
57074I3957743K84760j267439k723926m006883n065784n867033o389426o627970
$$ 93957743 94242503 92975064 90251138 86244255 81178471 75311438 68922012 62294042
57066F2294042o601484o353137n940094n420805m848167m266588l708812l194574
$$ 62294042 55692558 49339421 43399327 37978522 33130355 28863767 25154955 21960381
57058B1960381k733657k329919j982578j686726j435904j224694j048627r02974
$$ 21960381 19226724 16896805 14914227 13227501 11791597 10566903 9518276 8615302
57050H615302p82943o84450o03802n37307m81743m34590l93403l55859l20772
$$ 8615302 7832359 7147909 6544107 6006800 5525057 5090467 4697064 4341205 4020433
57041D020433k88163k57946k29493k02602j77802j55214j34073j13689r3887p4204
$$ 4020433 3732270 3474324 3244831 3042229 2864427 2709213 2575140 2461451 2367564 2293360
57031B293360n3817l2952j3889n22K692p665l1188o1928r0946j11610j22085j23445
$$ 2293360 2239543 2206591 2192702 2192180 2194872 2187207 2156019 2094091 2003145 1891535 1769450 1646005
57019A646005j17421j06398r3522q1185p0051o0163n2010m5892m1218l7191l3606
$$ 1646005 1528584 1422186 1328664 1247479 1177428 1117265 1065255 1019363 978145 940954 907348
57008I07348l0471k7693k5434k3998k3044k1758k0056j8643j7678j6513j4963
$$ 907348 876877 849184 823750 799752 776708 754950 734894 716251 698573 682060 667097
56997F67097j3687j2946j2184j1215j0553j0111q901o665m482l065j621P22L573
$$ 667097 653410 640464 628280 617065 606512 596401 587500 580835 576353 573288 571667 572389 575962
56984E75962O209Q669J0923J1790R829M772k573j0954j8614k3642k5397k5008
$$ 575962 582171 590840 601763 613553 623382 628154 625581 614627 596013 572371 546974 521966
56972E21966k3724k1626j8589j5438j3038j0990q413n392k664l09K213N096Q149
$$ 521966 498242 476616 458027 442589 429551 418561 410148 404756 402092 401783 403996 409092 417241
56959D17241J1410J5055J8894K2429K4823K4448J9384R461k760j3881k2179k7529
$$ 417241 428651 443706 462600 485029 509852 534300 553684 563145 560385 546504 524325 496796
56947D96796k9783k8619k4730j9843j5357j1669q697o213l677n46L084O716J0266
$$ 496796 467013 438394 413664 393821 378464 366795 358098 351885 348208 347662 350746 357462 367728
56934C67728J4145J8536K3194K7873L2183L4842L3684K6943J4705q22j6346k9001
$$ 367728 381873 400409 423603 451476 483659 518501 552185 579128 593833 593011 576665 547664
56922E47664l7296m1038m0785l7601l2954k8219k4041k0454j7508j5270j3404
$$ 547664 510368 469330 428545 390944 357990 329771 305730 285276 267768 252498 239094
56911B39094j1458r650q616q287p826o773n452m073k402o51L16K62J37P49J683
$$ 239094 227636 217986 209370 201083 193257 186484 181032 176959 174557 173906 174222 174484 174621 175370 177053
56896A77053K341L170N027P852J0885J3747J6538J9277K2029K5211K9002L2566
$$ 177053 179394 182564 187591 195443 206328 220075 236613 255890 277919 303130 332132 364698
56884C64698L4427L3452K9125K1467J1381P81q311j4754j8242j8902j7434j5041
$$ 364698 399125 432577 461702 483169 494550 495331 487020 472266 454024 435122 417688 402647
56872D02647j2525r686o028j619L242Q533J4067J9185K3731K8816L5744M4348
$$ 402647 390122 380436 374408 372789 376031 384564 398631 417816 441547 470363 506107 550455
56860E50455N3182O0846O6088O6754N9956M4080K0635n839k9739m6927n6211n8735
$$ 550455 603637 664483 730571 797325 857281 901361 921996 916157 886418 839491 783280 724545
56848G24545n6046m9179l9404k8680j8601r365m38Q316J6832K5570L5224M6023
$$ 724545 668499 619320 579916 551236 532635 523270 522832 531148 547980 573550 608774 654797
56836F54797N7916P0960Q4772R7807J07431J10119J01487P7963M0391m295m6410
$$ 654797 712713 783673 868445 966252 1073683 1183802 1285289 1363252 1403643 1399348 1352938
56825A352938p8859r9066j07259j05040r5453q2259o8034n3695l9889k7614j7095
$$ 1352938 1274079 1175013 1067754 962714 867261 785002 716968 663273 623384 595770 578675
56814E78675p292K725J2666K1917L0856M0620N1819O3691P3931P8974P5071O0032
$$ 578675 571383 574108 586774 608691 639547 680167 731986 795677 869608 948582 1023653 1083685
56802A083685L4483J999l1627n9994p8508q6311q5719p9762p0465n9190m7414
$$ 1083685 1118168 1120167 1088540 1028546 950038 863727 778008 698246 627781 568591 521177
56791E21177l6502k7132j9336j2819o944q97N713J2529J8990K4999L0802L6230
$$ 521177 484675 457543 438207 425388 418444 417547 423260 435789 454779 479778 510580 546810
56779E46810M0060M0040L3842K0733K656j6465l2796m4165n0133n1349m9061m4727
$$ 546810 586870 626910 660752 681485 684141 667676 634880 590715 540582 489233 440172 395445
56767C95445l9531l4096k8715k3658j9234j5620j2769j0448q478o944o010n486
$$ 395445 355914 321818 293103 269445 250211 234591 221822 211374 202896 195952 189942 184456
56755A84456m867l997l396l589m334m838m621l842k929k224j887j791j586j107
$$ 184456 179589 175592 172196 168607 164273 159435 154814 150972 148043 145819 143932 142141 140555 139448
56741A39448o09m16m58m17j36L18P84J019Q08L10mN3J93K21L33N62M83q8o40p44
$$ 139448 138839 138423 137965 137548 137412 137730 138514 139533 140341 140651 140647 140700 140893 141114 141447 142009 142492 142404 141764 141020
56721A41020o82p83o78n0N42M57J97O99J699J989J261N51O34J083J242J216J350
$$ 141020 140338 139555 138877 138827 139369 139826 140023 140722 142421 144410 145671 146222 146856 147939 149181 150397 151747
56704A51747J525J464J265J115R13N55K41J81L05N20R01J376J573J207M09m92
$$ 151747 153272 154736 156001 157116 158029 158584 158825 159006 159311 159831 160732 162108 163681 164888 165297 164805
56688A64805j207j433r50K0P98Q68L16l26n61j85O00J273J375R15K32m52j055
$$ 164805 163598 162165 161215 161235 162033 162901 163217 162891 162330 162145 162745 164018 165393 166308 166540 166088 165033
56671A65033j322r26K1Q65J067P12K80R1R1N0j84o34j284k067k721k848k359j763
$$ 165033 163711 162785 162806 163671 164738 165450 165730 165821 165912 165962 165778 165144 163860 161793 159072 156224 153865 152102
56653A52102j595j683j477j029r68j371j514j028m94m04l80j2L17K53L22J057
$$ 152102 150507 148824 147347 146318 145350 143979 142465 141437 140943 140539 140159 140147 140464 140717 141039 142096
56637A42096J859J844J283J111J417J556J507J870K603K940K626K201J968J646
$$ 142096 143955 145799 147082 148193 149610 151166 152673 154543 157146 160086 162712 164913 166881 168527
56623A68527J123N89k9q78j423j015j73j30r50j457j196j097j661j962j241k72
$$ 168527 169650 170239 170210 169332 167909 166894 166721 166591 165641 164184 162988 161891 160230 158268 157027 156755
56607A56755r9m02k59K36L17o5k57r3J6k1J11L36J95k85m45L2O26P52N45N40P92
$$ 156755 156656 156254 155995 156231 156548 156483 156226 156133 156149 156128 156239 156575 156770 156485 156040 156072 156698 157450 157995 158535 159327
56586A59327P58J02p14q94k79M49O61N24O00J037J525J823J879J537P15j86n27
$$ 159327 160085 160187 159473 158579 158300 158749 159410 159934 160534 161571 163096 164919 166798 168335 169050 168864 168337
56569A68337j41N70J246J830K257K368K259K338K963M249O008P514P639N902L245
$$ 168337 168196 168766 170012 171842 174099 176467 178726 181064 184027 188276 194284 201798 209437 215339 218584
56554B18584J151J4r65k314l535l911l369k268r65J13M59r1j131k003k190j563
$$ 218584 219735 219749 218784 216470 212935 209024 205655 203387 202422 202535 202994 202903 201772 199769 197579 196016
56538A96016o04j35m10p27m64oJ0j24K10O47L27m07k66R51J908J632O64r7m92
$$ 196016 195412 195277 194867 194140 193676 193670 193680 193556 193766 194413 194740 194333 194067 195018 196926 198558 199222 199125 198633
56519A98633n31M9R67J179K66q33j206j230j667k264k212j448o52l37n80j225
$$ 198633 198102 198151 199118 200297 200563 199730 198524 197294 195627 193363 191151 189703 189051 188714 188134 186909
56503A86909j783j594o32K98N93N28M43pj049j927j736p42KQ7J7J65K81Q6k60
$$ 186909 185126 183532 182900 183198 183791 184319 184762 184755 183706 181779 180043 179301 179303 179390 179407 179572 179853 179939 179679
56484A79679m06k30P3J73p9m37m96j85K16M72N13K36k70m72lN70L90k73k53P57
$$ 179679 179273 179043 179116 179289 179210 178773 178277 178092 178308 178780 179293 179529 179259 178787 178784 179354 179744 179471 179218 179975
56464A79975J668J594R90P27R56J439K092K542K043N86p03r97q54j104j415r56
$$ 179975 181643 183237 184227 184954 185910 187349 189441 191983 194026 194612 193909 192912 192058 190954 189539 188583
56448A88583O7O34L37k69n40k57M80J253J446Q77J34j91k05k73l82l55k46l5N32
$$ 188583 188650 189284 189621 189352 188812 188555 189035 190288 191734 192611 192745 192554 192349 192076 191694 191339 191093 191058 191590
56429A91590J282J443O92j79l07J06L67L76M52O11P87J225J905K042J076k72p66
$$ 191590 192872 194315 195007 194828 194521 194627 194994 195370 195822 196433 197220 198445 200350 202392 203468 203196 202430
56412B02430j89O44J082J053N96k05r11j043o32q7K66K18j88l03O85K389L203
$$ 202430 202241 202885 203967 205020 205616 205411 204500 203457 202825 202738 203004 203222 203034 202731 203416 205805 209008
56395B09008K364J143J026J531J124l11j293r10J77R34J039P09L16L74J097J853
$$ 209008 211372 212515 213541 215072 216196 215885 214592 213682 213859 214793 215832 216541 216857 217231 218328 220181
56379B20181J771R11K50M70J343K240K717K609K042J414J042R15J003J366J698
$$ 220181 221952 222863 223113 223583 224926 227166 229883 232492 234534 235948 236990 237905 238908 240274 241972
56364B41972J418N65K0K36N01J41l09m8N59O05J47m3J18P0j71K3P27J270J291
$$ 241972 243390 243955 243975 244211 244712 244853 244544 244496 245055 245660 245807 245764 245882 245952 245781 245804 246531 247801 249092
56345B49092J102R64P82N62N14O73R40J396K041K465K321J861J502J290J242J593
$$ 249092 250194 251158 251940 252502 253016 253689 254629 256025 258066 260531 262852 264713 266215 267505 268747 270340
56329B70340K114J916Q16J00Q11K041K192J374J058J665K180K055K006K588L304
$$ 270340 272454 274370 275186 275286 276097 278138 280330 281704 282762 284427 286607 288662 290668 293256 296560
56314B96560L481L039K097Q05j83N4J566L297M233M250L777L282L156L545M155
$$ 296560 300041 303080 305177 305982 305799 305853 307419 310716 314949 319199 322976 326258 329414 332959 337114
56299C37114M626M940N148N023M505M074M136M482M872N534O437O819O358O028
$$ 337114 341740 346680 351828 356851 361356 365430 369566 374048 378920 384454 390891 397710 404068 410096
56285D10096O717P764Q008P673P865Q801R845J0821J1853J2392J1995J1606J2613
$$ 410096 416813 424577 432585 440258 448123 456924 466769 477590 489443 501835 513830 525436 538049
56272E38049J4767J6629J7751J8895K0321K1560K2811K4849K7468K9651L1425
$$ 538049 552816 569445 587196 606091 626412 647972 670783 695632 723100 752751 784176
56261G84176L4009L7971M2723M7952N4056O0969O8154P5909Q5156R5728J06419
$$ 784176 818185 856156 898879 946831 1000887 1061856 1130010 1205919 1291075 1386803 1493222
56250A493222J16900J27998J39777J51017J60849J69376J76294J80507J81558
$$ 1493222 1610122 1738120 1877897 2028914 2189763 2359139 2535433 2715940 2897498
56241B897498J79787J74714J64882J49849J30666J07946Q1149N0548J8217j3767
$$ 2897498 3077285 3251999 3416881 3566730 3697396 3805342 3886491 3937039 3955256 3941489
56231C941489m4605p3585r9163j20317j37485j51240j61172j66955j69283j68863
$$ 3941489 3896884 3823299 3724136 3603819 3466334 3315094 3153922 2986967 2817684 2648821
56221B648821j65577j59452j51469j42699j33550j24345j15557j07026r8121q9146
$$ 2648821 2483244 2323792 2172323 2029624 1896074 1771729 1656172 1549146 1451025 1361879
56211A361879q1306p4862o8705o2177n5880n0209m4730l9583l5791l3324l0651
$$ 1361879 1280573 1205711 1137006 1074829 1018949 968740 924010 884427 848636 815312 784661
56200G84661k7133k4060k2317k0785j8410j6074j4853j3969j2295j0528r940r938
$$ 784661 757528 733468 711151 690366 671956 655882 641029 627060 614765 604237 594297 584359
56188E84359q902o789n170m819m895m459l536k641k175k345l011l646l827l513
$$ 584359 575457 568668 563498 558679 553784 549325 545789 543148 540973 538628 535617 531971 528144 524631
56174E24631k712j378J43J280K009K787L575L863L756L977M613N052N238N712
$$ 524631 521919 520541 520684 521964 523973 526760 530335 534198 537954 541931 546544 551596 556834 562546
56160E62546O314O315N982O413P560Q228Q383R496J2000J4452J6058J7978K1141
$$ 562546 568860 575175 581157 587570 595130 603358 611741 621237 633237 647689 663747 681725 702866
56147G02866K4747K8103L2040L7223M2906M8672N5571O4027P2283P8352Q1850
$$ 702866 727613 755716 787756 824979 867885 916557 972128 1036155 1108438 1186790 1268640
56136A268640Q2553P9103P1072O0707N0827M2314L5224L0492K8448K7024K3686
$$ 1268640 1351193 1430296 1501368 1562075 1612902 1655216 1690440 1720932 1749380 1776404 1800090
56125A800090J8176J1686M597k985r684j4076j6801j9768k3990k9693l7462m7372
$$ 1800090 1818266 1829952 1834549 1831564 1821880 1807804 1791003 1771235 1747245 1717552 1680090 1632718
56113A632718n7788o6593p2933p6547p6655p3056o7150o0309n2362m3229l4611
$$ 1632718 1574930 1508337 1435404 1358857 1282202 1209146 1141996 1081687 1029325 986096 951485
56102I51485k8191k3399j8768j4369j1156q987p100n431l894j661J163K764K301
$$ 951485 923294 899895 881127 866758 855602 846615 839515 834084 830190 828529 829692 832456 834757
56089H34757J643K432L350K720J932L287N989P403P252P373Q156Q393Q092Q408
$$ 834757 836400 838832 842182 844902 846834 850121 856110 863513 870765 878138 886294 894687 902779 911187
56075I11187R084Q836Q105Q690J0692J2362J2942J3256J3662J3704J3724J4595
$$ 911187 920271 929107 937212 945902 956594 968956 981898 995154 1008816 1022520 1036244 1050839
56063A050839J5909J6421J6140J6096J6370J6269J5995J6176J6284J5470J4336
$$ 1050839 1066748 1083169 1099309 1115405 1131775 1148044 1164039 1180215 1196499 1211969 1226305
56052A226305J3993J4022J3422J2730J3120J4235J5038J5904J7629J9343J9710
$$ 1226305 1240298 1254320 1267742 1280472 1293592 1307827 1322865 1338769 1356398 1375741 1395451
56041A395451J9383J9912K1124K1804K1985K2364K2664K2797K4186K7473L0579
$$ 1395451 1414834 1434746 1455870 1477674 1499659 1522023 1544687 1567484 1591670 1619143 1649722
56030A649722L1668L2300L4618L7440L8493L8678M0293M2646M3465M3314M4494
$$ 1649722 1681390 1713690 1748308 1785748 1824241 1862919 1903212 1945858 1989323 2032637 2077131
56019B077131M6684M7863M8419N0241N2702N3903N4882N8149O2895O6208O8198
$$ 2077131 2123815 2171678 2220097 2270338 2323040 2376943 2431825 2489974 2552869 2619077 2687275
56008B687275P1386P5751P9164Q2000Q6414R1750R5660R9219J05694J14644J22430
$$ 2687275 2758661 2834412 2913576 2995576 3081990 3173740 3269400 3368619 3474313 3588957 3711387
55997C711387J28320J34782J42129J48398J54257J62451J72570J81931J91351
$$ 3711387 3839707 3974489 4116618 4265016 4419273 4581724 4754294 4936225 5127576
55988E127576K04157K19837K34887K49713K68188K90591L13629L37418L65408
$$ 5127576 5331733 5551570 5786457 6036170 6304358 6594949 6908578 7245996 7611404
55979G611404L97471M30407M65377N07240N56349O09002O66158P33498Q12788
$$ 7611404 8008875 8439282 8904659 9411899 9968248 10577250 11243408 11976906 12789694
55970A2789694R02272J005868J132575J286764J469975J693024J974305K323479
$$ 12789694 13691966 14697834 15830409 17117173 18587148 20280172 22254477 24577956
55962B4577956K737757L215963L764683M390885N106029N944336O964129Q225144
$$ 24577956 27315713 30531676 34296359 38687244 43793273 49737609 56701738 64926882
55954F4926882R774403J1652481J3893053J6513154J9530974K3003982K6999543
$$ 64926882 74701285 86353766 100246819 116759973 136290947 159294929 186294472
55947A86294472L1423260L5743970L8774640L8748543L3901101K3472592Q547514
$$ 186294472 217717732 253461702 292236342 330984885 364885986 388358578 396906092
55940C96906092q031674k2846757l3409568l8936751m0059636l8030049l4118481
$$ 396906092 388874418 366027661 332618093 293681342 253621706 215591657 181473176
55933A81473176k9382996k4602850k0245996j6507426j3417101j0928753q953396
$$ 181473176 152090180 127487330 107241334 90733908 77316807 66388054 57434658
55926E7434658p384033o130724n131497m334123l688253l157882k723250k365765
$$ 57434658 50050625 43919901 38788404 34454281 30766028 27608146 24884896 22519131
55918B2519131k063949j805261j587554j405864j249254j111846r95102q96996
$$ 22519131 20455182 18649921 17062367 15656503 14407249 13295403 12300301 11403305
55910A1403305q09451p28445o56888n95610n40473m89966m46984m11253l78084
$$ 11403305 10593854 9865409 9208521 8612911 8072438 7582472 7135488 6724235 6346151
55901F346151l46184l18987k96814k75201k52678k32857k17020k01567j84788
$$ 6346151 5999967 5680980 5384166 5108965 4856287 4623430 4406410 4204843 4020055
55892D020055j69589j57434j45597j32659j21079j12244j04234r6492r1656r0743
$$ 4020055 3850466 3693032 3547435 3414776 3293697 3181453 3077219 2980727 2889071 2798328
55882B798328r1087r0734r0479r0056q6997q1023p5225p1206o7198o2603n9963
$$ 2798328 2707241 2616507 2526028 2435972 2348975 2267952 2192727 2121521 2054323 1991720 1931757
55871A931757o0439o1352o0347n8453n6897n4390m9738m4287l9660l5642l1999
$$ 1931757 1871318 1809966 1749619 1691166 1634269 1579879 1530141 1485854 1446194 1410552 1378553
55860A378553k9907k9868l0427l0344l0047k9942k9419k8411k7813k7594k6636
$$ 1378553 1348646 1318778 1288351 1258007 1227960 1198018 1168599 1140188 1112375 1084781 1058145
55849A058145k4994k4093k4238k4280k3966k4110k4190k2646k0008j8726j9252
$$ 1058145 1033151 1009058 984820 960540 936574 912464 888274 865628 845620 826894 807642
55838H07642j9257j7508j5548j4573j3659j2241j1502j1861j1711j0161q610q181
$$ 807642 788385 770877 755329 740756 727097 714856 703354 691493 679782 669621 661011 652830
55826F52830p847o591n278m933n100n273o166q193j0324j1590j2175j2125j0781
$$ 652830 644983 638392 633114 628181 623081 617808 611642 603449 593125 581535 569360 557235 546454
55813E46454q457o849o749o943o305n239m235k839j019K65P82J625L218M539N220
$$ 546454 537997 531148 524399 517456 511151 505912 501677 498838 497819 498084 498866 500491 503709 508248 513468
55798E13468O378Q269R079P469M586K151Q4k382m722n881o032o070o111n736n176
$$ 513468 519846 528115 537194 544663 549249 551400 551484 549102 544380 538499 532467 526397 520286 514550 509374
55783E09374n260o516q843j1387j2631j1523q710n704k768J051N894J0662J4649
$$ 509374 504114 497598 488755 477368 464737 453214 444504 438800 436032 437083 442977 453639 468288
55770D68288J7722J8617J5217P389k181j0677j7134k1275k2491k1074j8688j6512
$$ 468288 486010 504627 519844 527233 525052 514375 497241 475966 453475 432401 413713 397201
55758C97201j4240j1720r845q902p840o207n288o030p384p896p603p139o311m838
$$ 397201 382961 371241 361396 352494 344654 338447 333159 327129 319745 311849 304246 297107 290796 285958
55744B85958l426k800k581k021j031K19J559K196J142j134k927l670m384n207
$$ 285958 282532 279732 277151 275130 274099 274318 275877 278073 279215 278081 275154 271484 267100 261893
55730B61893m588k065K65N40m30j069j619k965m463m883m417l920l194j792m56
$$ 261893 257305 255240 255505 256045 255615 254546 252927 249962 245499 240616 236199 232279 229085 227293 226837
55715B26837M7O25K554N194O750O687N793M455K531M75r96k005k998l644l506
$$ 226837 226884 227509 230063 235257 242007 248694 254487 258942 261473 261948 260952 258947 255949 252305 248799
55700B48799l265l881m986n491n294n122n112m818m305l976l664k990k226j830
$$ 248799 245534 241653 236667 231176 225882 220760 215648 210830 206525 202549 198885 195895 193669 191839
55686A91839j539r58m25l10j07O80J471J624J778K805M186M787M636M331L429
$$ 191839 190300 189342 188917 188607 188500 189180 190651 192275 194053 196858 201044 205831 210467 214798 218227
55671B18227J121j755l277k897j847j129o11j80k27p11j022r87r09o04L94J561
$$ 218227 219348 217593 214316 211419 209572 208443 207832 207652 207425 206714 205692 204705 203796 203192 203586 205147
55655B05147J685P07L4O48J956K913L261L194K666J654M85n22j345k002k463k972
$$ 205147 206832 207539 207573 208221 210177 213090 216351 219545 222211 223865 224350 223828 222483 220481 218018 215046
55639B15046l919n246o388o997p252p380p194o327m744k989j861j661j754j322
$$ 215046 211127 205881 199493 192496 185244 177864 170670 164343 159599 156610 154749 153088 151334 150012
55625A50012m47R2J06J27J38n63j807k223j327o19j407k666k671j736j489k061
$$ 150012 149565 149657 149763 149890 150028 149465 147658 145435 144108 143489 142082 139416 136745 135009 133520 131459
55609A31459j989q92k28r83k156k288j304k38J20k52q64j107p66k90k30n45q61
$$ 131459 129470 128578 128350 127367 125211 122923 121619 121381 121501 121249 120385 119278 118512 118222 117992 117447 116586
55592A16586j153j498j589j141n54m08n39m48k38k77k26N13J654K240K004J448
$$ 116586 115433 113935 112346 111205 110651 110243 109704 109256 109018 108741 108515 109028 110682 112922 114926 116374
55576A16374Q51J60k11L21J410K051K017K059K508K774K459J991J829J751J312
$$ 116374 117225 117385 117174 117495 118905 120956 122973 125032 127540 130314 132773 134764 136593 138344 139656
55561A39656L74r35k215k795k455k004k342l036k846j679q62j207j902j755p54
$$ 139656 140030 139095 136880 134085 131630 129626 127284 124248 121402 119723 118861 117654 115752 113997 113243
55546A13243J69L09l17j160j559j246n63Q5P91J658K190J897J263J161J501J415
$$ 113243 113412 113721 113404 112244 110685 109439 108876 108961 109752 111410 113600 115497 116760 117921 119422 120837
55530A20837P76L43L61J27p03j447j458j056q79j051j400j891k445k796k786k468
$$ 120837 121613 121956 122317 122444 121741 120294 118836 117780 116901 115850 114450 112559 110114 107318 104532 102064
55514A02064j825r25k32j74m54m99m60q95j617j876j716j987k866l412l035k292
$$ 102064 100239 99314 99082 98908 98454 97955 97495 96600 94983 93107 91391 89404 86538 83126 80091 77799
55498G7799j838j514r79n00m35o02o09l25K82J241K256K817K831K552J957R17
$$ 77799 75961 74447 73468 72968 72533 71931 71322 70997 71279 72520 74776 77593 80424 82976 84933 85850
55482H5850n0j55M02N86J00k49j5J98l1k04N4K63L0j77O0L40K83L02P42J043N92
$$ 85850 85800 85645 86047 86633 86733 86484 86469 86667 86636 86432 86486 86749 86779 86602 86662 87002 87285 87587 88329 89372 89964
55461H9964k05m84m3P30J529K056J867R54Jm82q25j440k003j935j222k94M58O55
$$ 89964 89759 89275 89232 89962 91491 93547 95414 96368 96369 95887 95062 93622 91619 89684 88462 88168 88626 89281
55443H9281J09o63p71k46o5n33o45K38J200J197O22M14M81K64J00O33J392J288
$$ 89281 89390 88727 87956 87710 87645 87112 86467 86705 87905 89102 89724 90138 90619 90883 90983 91616 93008 94296
55425I4296K73p02j112j114o81K99J140Q98j43o37NR64J365J319J310J357J135
$$ 94296 94569 93867 92755 91641 90960 91259 92399 93297 93154 92517 92522 93486 94851 96170 97480 98837 99972
55408I9972M77m87j311j423p82j85l98j205j836k043k027j666p20L66Q77Q88J035
$$ 99972 100449 99962 98651 97228 96446 96261 95863 94658 92822 90779 88752 87086 86366 86732 87609 88497 89532
55391H9532J307J123N64M00P86J033Q85Q48R17K33j374k624k375j083J12R29J567
$$ 89532 90839 91962 92526 92926 93712 94745 95630 96478 97395 97628 96254 93630 91255 90172 90284 91213 92780
55374I2780J666P95m01p14K8Q40R95O89K67l05r54j245r89o39o71r90j228j289
$$ 92780 94446 95241 94840 94126 94154 94994 95989 96678 96945 96640 95686 94441 93452 92813 92142 91152 89924 88635
55356H8635j288j234j042p23l58n5l6m56r12o38M61J301P98o47j525j108j89K32
$$ 88635 87347 86113 85071 84348 83990 83935 83899 83443 82531 81893 82354 83655 84453 83806 82281 81173 80984 81216
55338H1216J59P4n5m50o36J30J625K693K602J717P11j87q99j170r23n02j23M75
$$ 81216 81375 81449 81394 80944 80308 80438 82063 84756 87358 89075 89786 89599 88700 87530 86607 86105 85982 86457
55320H6457J432K221K176J354M19k03n86q26p63l02K77M72J7q31j466j471r62
$$ 86457 87889 90110 92286 93640 94059 93856 93270 92444 91681 91379 91656 92128 92145 91314 89848 88377 87415
55303H7415l67pj9m70j134j375p56K68Q13P01N51O97P43L95K4k8J8m8R4O58J117
$$ 87415 87048 87041 87022 86552 85418 84043 83287 83555 84368 85069 85620 86317 87060 87455 87479 87451 87469 87421 87515 88173 89290
55282H9290Q43j4p48r38n62K23R47Q96n4r92r82j96M99O88N37J61l40n48j60L66
$$ 89290 90133 90119 89371 88433 87871 88094 89041 89937 89883 88891 87909 87713 88212 88900 89437 89598 89258 88710 88550 88916
55262H8916L28j85m51k21K9j26o31j179j358p45M35J066L36r90j423o95J25L59
$$ 88916 89244 89059 88608 88387 88416 88290 87659 86480 85122 84377 84812 85878 86214 85224 83801 83106 83231 83590
55244H3590L94M88J93m76m93P39K167K238Q01q48j522j073j09O40P34L23j2L9
$$ 83590 83984 84472 84665 84189 83696 84435 86602 88840 89641 88793 87271 86198 86089 86729 87463 87786 87774 87813
55226H7813J92J18o3j25k12m93o45j93P18J344J194N27j3r1J8k00q15j222q09
$$ 87813 88005 88123 88060 87935 87723 87230 86585 86392 87110 88454 89648 90175 90162 90071 90089 89889 89074 87852 87043
55207H7043J44O94L87k16l96j47R8K33M48P34Q67P74N64K68r9l74m41m75p04j003
$$ 87043 87187 87881 88268 88052 87656 87509 87607 87840 88288 89022 89889 90663 91227 91495 91396 91022 90581 90106 89402 88399
55187H8399j047p33k18L32P54Q27O12N97J070J461R32l50j235j044m24l03n65
$$ 88399 87352 86619 86401 86733 87487 88314 88926 89523 90593 92054 92986 92636 91401 90357 89933 89630 89065
55170H9065l78M24J095J084P41O64Q45Q55N37J14k48n19n40j09N72R06N46j68
$$ 89065 88687 89111 90206 91290 92031 92695 93540 94395 94932 95046 94798 94279 93739 93630 94202 95108 95654 95486
55152I5486n77l77J81N65M06j25l38K82J310J656Q81j53l68J47L65j94q53p97
$$ 95486 94909 94532 94713 95278 95684 95559 95221 95503 96813 98469 99350 99197 98829 98976 99341 99147 98294 97497
55134I7497q8N54O22J90l28m94j50L76M65j38r56j259q39j28L41L49%m58o98m67
$$ 97497 97409 97963 98585 98775 98447 97953 97803 98179 98644 98506 97550 96291 95452 95324 95665 96014 96014 95556 94858 94391
55114I4391J69P24O08l34j532k069j527m61J03k34q22p22K28J315J859J891J826
$$ 94391 94560 95284 95892 95558 94026 91957 90430 89969 90072 89838 89016 88294 88522 89837 91696 93587 95413
55097I5413J803J649J321J028Q52O52M10L53N24N45J36l74m26J2M85P19Q59J043
$$ 95413 97216 98865 100186 101214 102066 102718 103128 103481 104005 104550 104686 104312 103886 103898 104383 105102 105961 107004
55079A07004J180J200J149R35M29j15j78L00P24N33j88r34j282j005j59O98Q64
$$ 107004 108184 109384 110533 111468 111897 111782 111604 111904 112628 113161 112973 112039 110757 109752 109593 110291 111155
55062A11155L10k73m68o76j266j777j595r14l99j33L29J060J513J251L92o31j332
$$ 111155 111465 111192 110724 110048 108782 107005 105410 104496 104097 103964 104293 105353 106866 108117 108509 107878 106546
55045A06546j323o63J5J12k60o09p87r23q49l23L18M05j19o00n83k67N8L89P15
$$ 106546 105223 104560 104575 104687 104427 103818 103031 102108 101259 100936 101254 101659 101540 100940 100357 100090 100148 100537 101252
55026A01252Q48O97L52j64p57r23k02R74J514R61l1o59q49q71p87o18n43n44k74
$$ 101252 102100 102797 103149 102985 102228 101305 101103 102077 103591 104552 104521 103862 103013 102142 101355 100737 100194 99650 99376
55007I9376L26P56O41K67M6j12m58q04p88m15J13P95J567J932J488O77L55O27
$$ 99376 99702 100458 101099 101366 101412 101300 100842 100038 99250 98835 98948 99743 101310 103242 104730 105407 105762 106389
54989A06389P15Q9p88j075n09M48J193J392J065N10J36J37K70R6n05j119j188
$$ 106389 107104 107193 106405 105330 104821 105269 106462 107854 108919 109429 109565 109702 109972 110068 109563 108444 107256
54972A07256o07J33M33J60l08m89k01L72R28J310J570J709J491P40k15o59k25
$$ 107256 106649 106782 107215 107375 107067 106578 106377 106749 107677 108987 110557 112266 113757 114497 114282 113623 113398
54955A13398O67J263J161M76l45p42m80n6l14j318k053j664n84J09O9j99l03k63
$$ 113398 114065 115328 116489 116965 116620 115878 115398 115342 115028 113710 111657 109993 109409 109518 109587 109388 109085 108822
54937A08822m0M70R96J161J144J442J894J781R62K48M06J337K411L089L134K788
$$ 108822 108782 109252 110248 111409 112553 113995 115889 117670 118632 118880 119286 120623 123034 126123 129257 132045
54921A32045K784L582M599M824M190L508L069K327J137K19j81r20k583m313m889
$$ 132045 134829 138411 143010 147834 152024 155532 158601 160928 162065 162284 162103 161183 158600 154287 149398
54906A49398m335l618l220k939k669k571k562k364j979j644j445j290j086o19
$$ 149398 145063 141445 138225 135286 132617 130046 127484 125120 123141 121497 120052 118762 117676 117057
54892A17057L37J459J894J309M56J86L80M43M14Q45J770K597K902K841K826L153
$$ 117057 117394 118853 120747 122056 122512 122698 123078 123521 123935 124780 126550 129147 132049 134890 137716 140869
54876A40869L862M567M745M406M134M098L515J680r24l116m308m717m666m364
$$ 140869 144731 149298 154043 158449 162583 166681 170196 171876 170952 167836 163528 158811 154145 149781
54862A49781m098l972l645k929k352k480k984l124k885k875l166l102k257r89
$$ 149781 145683 141711 138066 135137 132785 130305 127321 124197 121312 118437 115271 112169 109912 108923
54848A08923P1N35L12l20p73p20m86n18p05p18o40o32m50L4K49k26p14l53M08
$$ 108923 108994 109529 109841 109521 108748 108028 107542 107024 106319 105601 104961 104329 103879 103913 104162 103936 103222 102869 103277
54829A03277M72qJ57J055J336M25m39q6Q93J270J028R69J210J115M36m20j111
$$ 103277 103749 103741 103898 104953 106289 106714 106275 106189 107082 108352 109380 110349 111559 112674 113110 112690 111579
54812A11579j565j666j336q35n10k65K42R71J417J234O72L54O53J257J382O97
$$ 111579 110014 108348 107012 106177 105667 105402 105644 106615 108032 109266 109938 110292 110945 112202 113584 114281
54796A14281j42k10M51Q67M41l33o97o40o59r45j180r84k33Q18J593J664J247
$$ 114281 114139 113929 114380 115247 115688 115355 114658 114018 113359 112414 111234 110250 110017 110835 112428 114092 115339
54779A15339R91J194J564J789J806J512Q03J26L06J453K638L055K995L177L695
$$ 115339 116330 117524 119088 120877 122683 124195 124998 125124 125430 126883 129521 132576 135571 138748 142443
54764A42443M132M372M649M970N021M552L518K023L43j219k696m283n657o032
$$ 142443 146575 150947 155596 160566 165587 170139 173657 175680 176023 174804 172108 167825 162168 156136
54750A56136n256m235l797l686l283k686k340k053j341m18R7K95P68J357J181
$$ 156136 150880 146645 142848 139162 135879 133193 130853 128800 127459 127041 127138 127433 128201 129558 130739
54735A30739J19p36n11L48R18J007J002J031J001J087J560K227K621K658K734
$$ 130739 130858 130122 129611 129959 130877 131884 132886 133917 134918 136005 137565 139792 142413 145071 147805
54720A47805L122L686M116M199L791K789J242o35k518l976m664m665m566m836
$$ 147805 150927 154613 158729 162928 166719 169508 170750 170115 167597 163621 158957 154292 149726 144890
54706A44890n174m809l507j948r76p73r48j135j214j181j157j378j796j845j031
$$ 144890 139716 134907 131400 129452 128476 127703 126755 125620 124406 123225 122068 120690 118894 117049 116018
54691A16018K47J049J088R82J147J096L17o82r62m84j42m86j036r93j81Q47J332
$$ 116018 116265 117314 118402 119384 120531 121627 121944 121262 120300 119816 119674 119188 118152 117159 116978 117825 119157
54674A19157Q60k99j345j691j515j313j164q11l02K1P8Kl44j111j779j478k29
$$ 119157 120017 119718 118373 116682 115167 113854 112690 111879 111577 111598 111676 111678 111334 110223 108444 106966 106737
54657A06737R09J191R70Q25P10M40L18N91Q35N43Jj35J99N22N72M16M3n54j002
$$ 106737 107646 108837 109807 110632 111342 111782 112100 112691 113526 114069 114070 113935 114134 114656 115228 115644 115687 115133 114131
54638A14131r20n60n38r32j150p28J63J017J398J054Q2r19j193n29N45J299J398
$$ 114131 113211 112651 112113 111181 110031 109303 109466 110483 111881 112935 113017 112098 110905 110376 110921 112220 113618
54621A13618J022O12M30K91j59q32j122o18M17J425K064K108J349K7j062j385
$$ 113618 114640 115252 115682 115973 115814 114982 113860 113242 113659 115084 117148 119256 120605 120632 119570 118185
54605A18185j233j021n31M21J062M37j044j826j150J52R89J271J390J282O66k50
$$ 118185 116952 115931 115400 115821 116883 117320 116276 114450 113300 113452 114441 115712 117102 118384 119050 118800
54589A18800q96j046r20p46n42l04j47k26m93n82m3J045J918J901J213O33N18
$$ 118800 117904 116858 115938 115192 114650 114346 114199 113973 113480 112898 112855 113900 115818 117719 118932 119565 120083
54572A20083O24P60R06P80M1q76j016k51L20j25r85j136m27M12R17J126J032N85
$$ 120083 120707 121467 122373 123153 123194 122318 121302 121051 121371 121246 120261 119125 118698 119110 120027 121153 122185 122770
54554A22770J33J58M98N55K25P6M62J028J242R93M83j8j40L68J200J598J185M05
$$ 122770 122903 123061 123559 124114 124339 124415 124877 125905 127147 128140 128623 128605 128465 128833 130033 131631 132816 133221
54536A33221j03k29k51l08l91o17j108j668j923j714j150l97L17O63N67N06R38
$$ 133221 133118 132889 132638 132330 131939 131322 130214 128546 126623 124909 123759 123362 123679 124342 124909 125415 126353
54519A26353J473J201L8q60m77P22J354P83l51j131j293j099p79m28m7M10Q56
$$ 126353 127826 129027 129065 128205 127728 128450 129804 130587 130236 129105 127812 126713 125934 125506 125459 125869 126725
54502A26725R56N05l1Q2P94J194P22r7n42p21j047j221o16N91J499J769J897K147
$$ 126725 127681 128186 128155 128237 129031 130225 130947 130850 130308 129587 128540 127319 126703 127294 128793 130562 132459 134606
54484A34606K032J231K30m01p77j134j122l62O71J097Q02M75N26O84P05P38P75
$$ 134606 136638 137869 138099 137698 136921 135787 134665 134303 134974 136071 136873 137348 137874 138558 139263 140001 140776
54467A40776M61k17o00k47L32L58r5l27j22O1PJ36O69J045N93m61j218j119m43
$$ 140776 141237 141020 140420 140173 140505 140863 140768 140441 140319 140380 140387 140523 141192 142237 142830 142369 141151 140032 139589
54448A39589J03j8q37j794k075j317k0R72J222P97j19j240k006j984j414r28o58
$$ 139589 139692 139674 138837 137043 134968 133651 133631 134603 135825 136622 136503 135263 133257 131273 129859 128931 128273
54431A28273k07M88Q65O18K05J44L11L84N12J015J694J970J548N82n87j421j327
$$ 128273 128066 128554 129419 130037 130242 130386 130697 131081 131593 132608 134302 136272 137820 138402 137815 136394 135067
54414A35067l83L95P5r71j585j357r24p56m86K79J140J453J235J081J329J686
$$ 135067 134684 135079 135154 134183 132598 131241 130317 129561 129075 129354 130494 131947 133182 134263 135592 137278
54398A37278J715J414J232J458J763J551Q51M14O46Q91L36o79j034l53O14J203
$$ 137278 138993 140407 141639 143097 144860 146411 147262 147676 148322 149213 149549 148870 147836 147483 148097 149300
54382A49300J565J959K132J861J495J430J501J405J282J416J656J716J786K276
$$ 149300 150865 152824 154956 156817 158312 159742 161243 162648 163930 165346 167002 168718 170504 172780
54368A72780L055L454L038J983P48l49j219j932k584l066l129k743k275k041j941
$$ 172780 175835 179289 182327 184310 185058 184709 183490 181558 178974 175908 172779 170036 167761 165720 163779
54353A63779j698j301r08n64l09l33o81r97r21o71p37j169j540j617j573j487
$$ 163779 162081 160780 159872 159308 158999 158666 157985 156988 156067 155396 154659 153490 151950 150333 148760 147273
54337A47273j116m06K07K91K1m7K93O19L66n22j501j856j287j60P67Q73J05j002
$$ 147273 146157 145751 145958 146249 146270 146223 146516 147135 147501 146979 145478 143622 142335 142175 142942 143815 143920 142918
54319A42918j729j683r64Q4J130J804J686O78o28j381j312r04o35m70j93J10K12
$$ 142918 141189 139506 138542 138626 139756 141560 143246 143924 143296 141915 140603 139699 139064 138594 138401 138511 138723
54302A38723Q0j69m42o06n00k18l9J6K50O63P59L57Q4M83J086J056M63J61M59
$$ 138723 138803 138634 138192 137586 137086 136868 136829 136845 137095 137758 138517 138874 138958 139441 140527 141583 142046 142207 142666
54283A42666P58N65J30r9m1J99N82Q80P47K06k75m40n22o92o87k52M80J254J883
$$ 142666 143424 143989 144119 144020 143979 144178 144760 145640 146387 146593 146318 145878 145356 144664 143977 143725 144205 145459 147342
54264A47342K012J261k1p58m07L34N32L11L97R13J369J569J655J432N80n09r50
$$ 147342 149354 150615 150594 149836 149429 149763 150295 150606 151003 151916 153285 154854 156509 157941 158521 158012 157062
54247A57062o22l45o10r23p83m57k84M2P87J395J140K26n31q82j195j508j394
$$ 157062 156440 156095 155485 154562 153779 153322 153038 153080 153867 155262 156402 156628 156097 155215 154020 152512 151118
54230A51118q63n22o06n49N3O66N53j69p42q54q93j141j225o35N08J469J644J114
$$ 151118 150255 149733 149127 148578 148631 149297 149850 149681 148939 148085 147192 146051 144826 144191 144699 146168 147812 148926
54212A48926M22m9l20m98n09l60l56p15j135j114o72l80n41q78j034r60o82r0
$$ 148926 149348 149299 148979 148481 147972 147612 147256 146541 145406 144292 143620 143240 142699 141821 140787 139827 139145 139055
54194A39055P12J336J580J572J257K92j108j864j204J95R86P51K41J76N91J191
$$ 139055 139767 141103 142683 144255 145512 145804 144696 142832 141628 141823 142809 143560 143801 143977 144568 145759
54178A45759J616J415M82m45m94J24L40k34q77j016r72j044q22l7O60N67Q2R0
$$ 145759 147375 148790 149272 148827 148333 148457 148797 148563 147686 146670 145698 144654 143832 143795 144455 145022 145104 145194
54160A45194O25Q69L69m44q87o28K55J334J996J991J692J503J247N57l66r60j103
$$ 145194 145819 146688 147057 146613 145726 145098 145353 146687 148683 150674 152366 153869 155116 155673 155307 154347 153244
54143A53244j123j142r63n94k90p2K35N26N33M47Q11J625K220K236K078K128K096
$$ 153244 152121 150979 150016 149422 149132 149060 149295 149821 150354 150801 151612 153237 155457 157693 159771 161899 163995
54126A63995J703J489K228L711M823M853M198L583L115K516J947J982K642L002
$$ 163995 165698 167187 169415 173126 177949 182802 187000 190583 193698 196214 198161 200143 202785 205787
54112B05787K189M82j106k178l250m548n331m865l636k861l052l657l964l743
$$ 205787 207976 208458 207352 205174 201924 197376 192045 187180 183544 180683 177631 173974 170010 166267
54098A66267l013j878p36q9N4J40L09J44n98j481j891j671r85L6J127J733J461
$$ 166267 163254 161376 160640 160551 160605 160745 161054 161198 160600 159119 157228 155557 154572 154608 155735 157468 158929
54081A58929O06k16p85j298j758j760j028J37J122J585J614J399R71L88l9oK79
$$ 158929 159535 159319 158534 157236 155478 153718 152690 152827 153949 155534 157148 158547 159518 159906 159867 159861 160140
54064A60140K37k67o03j75O77J021N38j84m60j82M26J222K088K736K870K456J786
$$ 160140 160377 160110 159507 159332 160009 161030 161568 161384 160924 160742 161168 162390 164478 167214 170084 172540 174326
54047A74326J370J664K612L511L637L016K310K013K161K681L488M251M658M877
$$ 174326 175696 177360 179972 183483 187120 190136 192446 194459 196620 199301 202789 207040 211698 216575
54033B16575N186N165M152K620K048K964M015L735K455J525J248P82j90q84o93
$$ 216575 221761 226926 231078 233698 235746 238710 242725 246460 248915 250440 251688 252470 252280 251396 250703
54018B50703j22j0n18j231j870k475l043l362l244k890k876l557m471m718m018
$$ 250703 250581 250571 250053 248822 246952 244477 241434 238072 234828 231938 229062 225505 221034 216316 212298
54003B12298k993k215j587r76q22j353j820j335k32M02K78O2L1j78m44R3J610
$$ 212298 209305 207090 205503 204527 203705 202352 200532 199197 198965 199367 199645 199707 199738 199560 199116 199209 200819
53986B00819K938L024K369K237K967L771L891L246K076N58j163k864m214m829
$$ 200819 203757 206781 209150 211387 214354 218125 222016 225262 227338 227896 226733 223869 219655 214826
53972B14826m607m035l849m143m268l777k962k231j446l45Q14J592J947K008J654
$$ 214826 210219 206184 202335 198192 193924 190147 187185 184954 183508 183163 183977 185569 187516 189524 191178
53957A91178Q56J84K41Q53J383J652J874J892J309L79rN10J340J851K109K442
$$ 191178 192034 192218 192459 193312 194695 196347 198221 200113 201422 201801 201792 202302 203642 205493 207602 210044
53941B10044K828L121L374L586L498L053K689K805L215L525L709L862L712L010
$$ 210044 212872 215993 219367 222953 226451 229504 232193 234998 238213 241738 245447 249309 253021 256031
53927B56031K210K088K682L180L022K563K396K552K763L114L839M711N240N443
$$ 256031 258241 260329 263011 266191 269213 271776 274172 276724 279487 282601 286440 291151 296391 301834
53913C01834N818O394O455N566M350L613L079J765m02k188k531j814j199j218
$$ 301834 307652 314046 320501 326067 330417 334030 337109 338874 338472 336284 333753 331939 330740 329522
53899C29522j632k200k906l515l699l640l906m567n038n040n054n479n880n669
$$ 329522 327890 325690 322784 319269 315570 311930 308024 303457 298419 293379 288325 282846 276966 271297
53885B71297n106m903n030m714l669k565k066k005j973k141k794l469l356k570
$$ 271297 266191 261288 256258 251544 247875 245310 243244 241239 239266 237125 234331 230862 227506 224936
53871B24936k146k575l055k731j966j718j988j931j300r03j304j996k280k226
$$ 224936 222790 220215 217160 214429 212463 210745 208757 206826 205526 204623 203319 201323 199043 196817
53857A96817k150j794q16K74N69K9n39p33r48j384j479o85P30K006K574K211J015
$$ 196817 194667 192873 192057 192331 192900 192929 192390 191657 190709 189325 187846 187161 187891 189897 192471 194682 195697
53840A95697m04j199j136q21p56o81j89M46O93N87N06M19L9m45n26k64k86p42
$$ 195697 195293 194094 192958 192137 191381 190700 190511 190957 191650 192237 192743 193162 193201 192756 192230 191966 191680 190938
53822A90938r26k32J043K103K503K247J486N11j79k15K71Q54J344J838K376K850
$$ 190938 190012 189780 190823 192926 195429 197676 199162 199673 199494 199279 199550 200404 201748 203586 205962 208812
53806B08812L207L533L838L988L949L951M216M599M706M413M040L862L669L109
$$ 208812 212019 215552 219390 223378 227327 231278 235494 240093 244799 249212 253252 257114 260783 263892
53792B63892K321J832J796J760J339P52L99K41q4p54j629k471l003l049k842l016
$$ 263892 266213 268045 269841 271601 272940 273692 274091 274332 274248 273494 271865 269394 266391 263342 260500 257484
53776B57484l904n045n736n730n119l914k352j229j184j780k021j699j465j602
$$ 257484 253580 248535 242799 237069 231950 228036 225684 224455 223271 221491 219470 217771 216306 214704
53762B14704j628j260q86q02p59o08o11p52n62j29l79j615k647k261r67j90k21
$$ 214704 213076 211816 210930 210128 209369 208761 208150 207398 206836 206707 206328 204713 202066 199805 198838 198648 198427
53745A98427j15N87J204J119O07J99rn3J72N89Q24P53O89Q04Q59O62L93J98n9
$$ 198427 198312 198899 200103 201222 201829 202028 202019 201966 202138 202727 203551 204304 204993 205797 206656 207318 207711 207909 207850
53726B07850l94n18k57K09Q19J790K945L428K666J307O14R74J636J851J689J627
$$ 207850 207456 206938 206681 206890 207709 209499 212444 215872 218538 219845 220459 221433 223069 224920 226609 228236
53710B28236J807K031K200K408K680K835K633K035J254O62N63J000J710K335K731
$$ 228236 230043 232074 234274 236682 239362 242197 244830 246865 248119 248781 249344 250344 252054 254389 257120
53695B57120L062L492L875L881L465K950K473J643J29j557k355j903j035q18j362
$$ 257120 260182 263674 267549 271430 274895 277845 280318 281961 282090 280533 278178 276275 275240 274422 273060
53680B73060j886j748j043k99R0l4o23j333j564q94L76J347J337N97K9J62N75
$$ 273060 271174 269426 268383 268084 268174 268140 267517 266184 264620 263726 264102 265449 266786 267383 267412 267574 268149
53663B68149M34n05j600j966j257J20J340J732J242M94K22N73J057J193J031Q98
$$ 268149 268583 268078 266478 264512 263255 263375 264715 266447 267689 268183 268405 268978 270035 271228 272259 273157
53647B73157R57J205J750K685L660M031L632L122L171L497L205K131J192J132
$$ 273157 274114 275319 277069 279754 283414 287445 291077 294199 297370 300867 304072 306203 307395 308527
53633C08527J398R10l03j007m54N81Q62K61k60m1N28P25M73L76R33J946K761L054
$$ 308527 309925 310835 310532 309525 309071 309652 310514 310775 310515 310474 311002 311727 312200 312576 313509 315455 318216 321270
53615C21270L126L361L550L245K643K556L210L717L178J959J253J587K344K726
$$ 321270 324396 327757 331307 334552 337195 339751 342961 346678 349856 351815 353068 354655 356999 359725
53601C59725K559K159J811J665J718J743J395N66m76j293j576j327r24q35j162
$$ 359725 362284 364443 366254 367919 369637 371380 372775 373341 372865 371572 369996 368669 367745 366910 365748
53586C65748j589j865k077k257k183j817j607j846k121j922j433j108q41l25L7
$$ 365748 364159 362294 360217 357960 355777 353960 352353 350507 348386 346464 345031 343923 343082 342757 342794
53571C42794m96j693k390j936q79K0N81P81M19l52q09m82J91M42K4p09j161p84
$$ 342794 342298 340605 338215 336279 335400 335420 336001 336782 337201 336849 336040 335558 335749 336191 336215 335506 334345 333561
53553C33561M09J503J505P00M34J305K342K469J897J468J371J331J438J934K567
$$ 333561 333970 335473 336978 337678 338112 339417 341759 344228 346125 347593 348964 350295 351733 353667 356234
53538C56234K919L164L762M696N520O028O293O437O828Q021R858J1123J0901R914
$$ 356234 359153 362317 366079 370775 376295 382323 388616 395053 401881 409902 419760 430883 441784 451698
53524D51698R671J0547J1621J2190J2448J2697J2960J3513J4895J6974J8770J9615
$$ 451698 461369 471916 483537 495727 508175 520872 533832 547345 562240 579214 597984 617599
53512F17599J9918K0444K1266K1897K2111K2289K2960K4143K5112K4958K3528
$$ 617599 637517 657961 679227 701124 723235 745524 768484 792627 817739 842697 866225
53501H66225K1698K0470K0027J9891J9663J9177J8296J7175J6478J6706J7425
$$ 866225 887923 908393 928420 948311 967974 987151 1005447 1022622 1039100 1055806 1073231
53490A073231J7801J7704J7628J7694J7550J7168J6938J6834J6403J5717J5512
$$ 1073231 1091032 1108736 1126364 1144058 1161608 1178776 1195714 1212548 1228951 1244668 1260180
53479A260180J6000J6343J5663J4024J2003R826P376M674J955m70k291l500m722
$$ 1260180 1276180 1292523 1308186 1322210 1334213 1344039 1351415 1356089 1358044 1357574 1355283 1351783 1347061
53466A347061o791r759j2755j4883j5880j5938j5488j5269j5834j6791j7240j7186
$$ 1347061 1340270 1330511 1317756 1302873 1286993 1271055 1255567 1240298 1224464 1207673 1190433 1173247
53454A173247j7668j9122k0513k0755k0193j9923k0169k0215j9600j8582j7531
$$ 1173247 1155579 1136457 1115944 1095189 1074996 1055073 1034904 1014689 995089 976507 958976
53443I58976j6539j5518j4224j2329r935p724o193n015l611k027o90L45J278J986
$$ 958976 942437 926919 912695 900366 890431 882707 876514 871499 867888 865861 865171 865516 866794 868780
53429H68780K310K719L861N554P006P989R030J0340J1444J2137J3038J4741J6970
$$ 868780 871090 873809 877670 883224 890230 898219 907249 917589 929033 941170 954208 968949 985919
53416I85919J9070K0835K2377K3639K4549K5489K6924K8737L0371L1612L2723
$$ 985919 1004989 1025824 1048201 1071840 1096389 1121878 1148802 1177539 1207910 1239522 1272245
53405A272245L3810L4634L5278L6497L8885M1969M4589M6190M7284M8601N0237
$$ 1272245 1306055 1340689 1375967 1412464 1451349 1493318 1537907 1584097 1631381 1679982 1730219
53394A730219N1800N2995N3663N3666N3144N2673N2679N2737N1958N0078M7746
$$ 1730219 1782019 1835014 1888677 1942343 1995487 2048160 2100839 2153576 2205534 2255612 2303358
53383B303358M5686M3976M2227M0006L7003L3138K8707K4160J9618J4973J0440
$$ 2303358 2349044 2393020 2435247 2475253 2512256 2545394 2574101 2598261 2617879 2632852 2643292
53372B643292O455K865j235o524j2722j9145k5520l1879l7996m3359m7518n0210
$$ 2643292 2649747 2652612 2651377 2644853 2632131 2612986 2587466 2555587 2517591 2474232 2426714 2376504
53360B376504n1525n2201n3218n4660n5435n4627n2742n0972m9679m8380m6911
$$ 2376504 2324979 2272778 2219560 2164900 2109465 2054838 2002096 1951124 1901445 1853065 1806154
53349A806154m5647m4584m3154m1268l9768l9315l9392l8892l7446l5655l4139
$$ 1806154 1760507 1715923 1672769 1631501 1591733 1552418 1513026 1474134 1436688 1401033 1366894
53338A366894l2804l1113k8803k6193k3791k1763j9880j7908j5856j3821j1902
$$ 1366894 1334090 1302977 1274174 1247981 1224190 1202427 1182547 1164639 1148783 1134962 1123060
53327A123060j0421r895j0413j1301j1755j1686j1579j1645j1543j0935r814q307
$$ 1123060 1112639 1102744 1092331 1081030 1069275 1057589 1046010 1034365 1022822 1011887 1002073 993766
53315I93766o496m609l035j902q24P00K702M681O089O842P306P838Q464R154J0267
$$ 993766 987270 982661 979626 977724 976900 977600 980302 984983 991072 997914 1005220 1013058 1021522 1030676 1040943
53300A040943J2263J4896J7199J8597J9607K0971K2598K3919K4936K6040K6955
$$ 1040943 1053206 1068102 1085301 1103898 1123505 1144476 1167074 1190993 1215929 1241969 1268924
53289A268924K6820K5551K4289K3913K3823K2754K0486J8011J6121J4511J2397
$$ 1268924 1295744 1321295 1345584 1369497 1393320 1416074 1436560 1454571 1470692 1485203 1497600
53278A497600R518O200K750p47m049o632q286r636j1620j4390j7135j9164k0754
$$ 1497600 1507118 1513318 1516068 1515321 1511272 1504640 1496354 1486718 1475098 1460708 1443573 1424409 1403655
53265A403655k2572k4581k6048k6576k6628k6840k7281k7596k7636k7638k7861
$$ 1403655 1381083 1356502 1330454 1303878 1277250 1250410 1223129 1195533 1167897 1140259 1112398
53254A112398k8257k8552k8569k8314k7778k6869k5712k4798k4489k4428k3895
$$ 1112398 1084141 1055589 1027020 998706 970928 944059 918347 893549 869060 844632 820737
53243H20737k2813k1860k1446k1145k0453j9534j8757j7995j6988j5915j5021
$$ 820737 797924 776064 754618 733473 713020 693486 674729 656734 639746 623831 608810
53232F08810j3984j2394j0569r106p937o637n524n429o296p014o933o640o926
$$ 608810 594826 582432 571863 562757 554820 548183 542659 537230 530934 523920 516987 510347 503421
53219E03421p758q752r811j0708j0772r780q678q535r071r036p916o554n922o005
$$ 503421 495663 486911 477100 466392 455620 445840 437162 428627 419556 410520 402604 396050 390128 384123
53205C84123o173o148o132o171n982n545n451o194p293p642o875n839n362n135
$$ 384123 377950 371802 365670 359499 353517 347972 342521 336327 329034 321392 314517 308678 303316 298181
53191B98181m405l356k862l105l289k911k401k293k521k883l486m224m506l967
$$ 298181 293776 290420 287558 284453 281164 278253 275852 273559 271038 268155 264669 260445 255939 251972
53177B51972l006k130j266k87L62K22l70p03o99q08j097j170q78n19l01j53j37
$$ 251972 248966 246836 245570 245283 245645 245867 245497 244794 244095 243287 242190 241020 240142 239623 239322 239169 239032
53160B39032m90j106j509j492j336j237r26k23M35M73P0lN01Q16J94r43j428q57
$$ 239032 238542 237436 235927 234435 233099 231862 230936 230713 231148 231621 231691 231688 232189 233005 233199 232256 230828 229971
53142B29971q0J36J44O06J185R44j27r63q92l72l9J41L07J73l41n16L04J614K292
$$ 229971 229891 230027 230171 230777 231962 232906 232779 231816 230924 230552 230513 230654 230961 231134 230793 230277 230581 232195 234487
53123B34487J993J397J207J566K309L178L750L693L162K578J968J005l02j378
$$ 234487 236480 237877 239084 240650 242959 246137 249887 253580 256742 259320 261288 262293 261991 260613
53109B60613j735j520j280j324j535j617j472j301j354j642j929j991j726j159
$$ 260613 258878 257358 256078 254754 253219 251602 250130 248829 247475 245833 243904 241913 240187 239028
53095B39028n39l67q38j426j432r80q30j137j171m94L20N87M27K23j46q41j421
$$ 239028 238489 238122 237284 235858 234426 233446 232616 231479 230308 229814 230134 230721 231148 231371 231225 230384 228963
53078B28963j412j081r06p68l87j34m93j079j161q63r24j423j745j664j485j148
$$ 228963 227551 226470 225564 224796 224409 224275 223782 222703 221542 220679 219755 218332 216587 214923 213438 212290
53062B12290k93P49J086O15K41N02Q82P85L10k80r92j584j411l34R12J685K050
$$ 212290 211997 212746 213832 214447 214688 215190 216072 216857 217167 216887 215895 214311 212900 212566 213478 215163 217213
53045B17213K164J782R82M82O36P62K25m27k85M77Q29L39m43r22j070j079r93
$$ 217213 219377 221159 222141 222623 223259 224021 224246 223819 223534 224011 224840 225179 224736 223814 222744 221665 220672
53028B20672q59q48j065j378j429q71J77R58P81Rk01O27J679J985J604J180R21
$$ 220672 219813 218965 217900 216522 215093 214222 214399 215357 216138 216147 215946 216573 218252 220237 221841 223021 223942
53011B23942N97J50k82o74r90r76n89k62l26n50o29o65p26m65J60M67Q0k04M12
$$ 223942 224539 224689 224407 223733 222743 221767 221178 220916 220590 220040 219411 218746 218020 217555 217715 218182 218262 218058 218470
52992B18470J259J060J4l71M52J320J193N87N04R28J126Q67N64N54Q12J186J503
$$ 218470 219729 220789 220803 220432 220884 222204 223397 223984 224488 225416 226542 227409 227973 228527 229339 230525 232028
52975B32028J581J400J133R14P84Q46J149J374J116N23J98L38M99L48Q8o2k49
$$ 232028 233609 235009 236142 237056 237840 238686 239835 241209 242325 242848 243046 243384 243883 244231 244319 244257 244008
52958B44008n65q04r32j302k032k643k688k273j697j083o80r23j665j998j410
$$ 244008 243443 242639 241707 240405 238373 235730 233042 230769 229072 227989 227309 226386 224721 222723 221313
52943B21313n87l80n25k29M37O88L33j08m15q19j129p99n7M9q23j632j369l57
$$ 221313 220726 220346 219821 219592 220029 220717 221050 220942 220527 219708 218579 217780 217723 217772 216949 215317 213948 213591
52925B13591M07N92N32M05K10K03O06J043R38M13J20K34K52j51o14o91m61k71
$$ 213591 213998 214590 215122 215527 215737 215940 216546 217589 218527 218940 219060 219294 219546 219395 218781 218090 217629 217358
52907B17358k41k80l19l17j81J00L42L79J87j33m07l80O1N96O55Q8o06q35m77
$$ 217358 217117 216837 216518 216201 216020 216120 216462 216841 217028 216895 216488 216108 216169 216765 217420 217508 216902 216067 215590
52888B15590K03Q96J284J081M54R7N01J260J518J018K77j78k46L1O29J276J533
$$ 215590 215793 216689 217973 219054 219508 219605 220106 221366 222884 223902 224179 224001 223755 223786 224415 225691 227224
52871B27224J375J282J525J729J463R15N73N89Q06J138J456J284J90j490k804
$$ 227224 228599 229881 231406 233135 234598 235513 236086 236675 237481 238619 240075 241359 241549 240059 237255
52856B37255l133k715k176j881j834j902j943j900j816j743j611j403j283j325
$$ 237255 234122 231407 229231 227350 225516 223614 221671 219771 217955 216212 214601 213198 211915 210590
52842B10590j234p69k78l50q82j024k37J043K003K277J944J255O70P02J218J287
$$ 210590 209356 208587 208309 207959 207077 206053 205816 206859 208862 211139 213083 214338 215008 215710 216928 218215
52826B18215K95j099j686j225n83m80p64r80r57o66o1O11Q28M88K08N99J458K028
$$ 218215 218510 217411 215725 214500 213917 213437 212673 211693 210736 210070 210009 210620 211448 211936 212144 212743 214201 216229
52808B16229J845J055N9q38j532k078k490k499j785n84K83L03o2jN51R42P77L73
$$ 216229 218074 219129 219188 218350 216818 214740 212250 209751 207966 207382 207665 207968 207906 207905 208456 209398 210175 210548
52790B10548J21n8m16q76j129j041p43l87KM21P83R50Q47N77L36J38j90o86j059
$$ 210548 210669 210611 210195 209319 208190 207149 206406 206019 206021 206442 207225 208175 209022 209599 209935 210073 209883 209197 208138
52771B08138j035p15l54N9N64Q08L97l43n53j7M58J40o43j011o28J57R22J412
$$ 208138 207103 206388 206034 206093 206657 207465 207862 207519 206966 206949 207407 207547 206904 205893 205265 205422 206344 207756
52753B07756J472J242J235J678K018J652R35P84J295J648J415J193J544K032J889
$$ 207756 209228 210470 211705 213383 215401 217053 217988 218772 220067 221715 223130 224323 225867 227899 229788
52738B29788J193P65J113J904K341J847N74n43n77L00Q37J16j382k522k848k680
$$ 229788 230981 231746 232859 234763 237104 238951 239525 238982 238405 238705 239542 239658 238276 235754 232906 230226
52722B30226k243j497o62k00j73k28k59m87p67m82N51J608J826J134P1q88j488
$$ 230226 227983 226486 225824 225624 225451 225223 224964 224477 223710 223228 223779 225387 227213 228347 228418 227530 226042
52705B26042j474q15k9K10j74n58l92J60M43Q4o11j021r20o51n29l54J99Q69J033
$$ 226042 224568 223753 223724 223934 223760 223202 222810 222970 223413 223497 222886 221865 220945 220294 219765 219411 219610 220479 221512
52686B21512O41L31M53N00n9q47j056n48M5K29Q9j39l64n05m25j55J22L58N55
$$ 221512 222153 222484 222937 223437 223378 222531 221475 220927 220972 221201 221290 221151 220787 220282 219857 219702 219824 220182 220737
52667B20737M70j80j080j361n62Q04J850K227K171J977J774J696J886K263K519
$$ 220737 221207 221027 219947 218586 218024 218828 220678 222905 225076 227053 228827 230523 232409 234672 237191
52652B37191K390J851J056J96o08j288j752j892j768j668j777j841j469o79O2
$$ 237191 239581 241432 242488 242684 242076 240788 239036 237144 235376 233708 231931 230090 228621 227942 228004
52637B28004M48N55N10L31K41O34J455K083K159K093K297K382J697L88q06j576
$$ 228004 228452 229007 229517 229848 230089 230723 232178 234261 236420 238513 240810 243192 244889 245277 244471 242895
52621B42895k163k511k115r17K78P16N25L25L90N14M84L05J62K52N53O38J07p66
$$ 242895 240732 238221 236106 235189 235467 236183 236708 237033 237423 237937 238421 238726 238888 239140 239693 240331 240438 239672
52603B39672j216r85o53o83o38J57J516K507K491J622M63m41p43m78j36j88n66
$$ 239672 238456 237471 236818 236135 235497 235654 237170 239677 242168 243790 244253 243812 243069 242591 242455 242267 241701
52586B41701q63q40m83K36J147J622J177K96N7P51J425J069k27j514k012j608
$$ 241701 240838 239998 239515 239751 240898 242520 243697 243993 244050 244801 246226 247295 247068 245554 243542 241934
52570B41934o75K29O63N58J68l13q58j294j319r12m51j70M8J96j2n03n81J27R23
$$ 241934 241259 241488 242151 242709 242877 242564 241706 240412 239093 238181 237730 237560 237608 237804 237792 237289 236708 236835 237758
52551B37758R09L27J65O17Q63M84J21L04N19J32m06j89O61J047M74l54o07l14
$$ 237758 238667 238994 239159 239776 240639 241123 241244 241548 242067 242199 241793 241604 242265 243312 243786 243432 242825 242511
52533B42511Q8N11J011J256Q18j57j004j257r63m80j97l46o99o37Q2Q29Q98N68
$$ 242511 242599 243110 244121 245377 246195 246038 245034 243777 242814 242334 242137 241791 241092 240455 240537 241366 242264 242832
52515B42832P30J500K048J917J639J708J799J598J561K087K570K247J418Q29K94
$$ 242832 243562 245062 247110 249027 250666 252374 254173 255771 257332 259419 261989 264236 265654 266483 266777
52500B66777q79k285k708k106j889k750l557l145k020j332j094o17K3K09R1M24
$$ 266777 265898 263613 260905 258799 256910 254160 250603 247458 245438 244106 243012 242395 242418 242627 242718 243142
52484B43142J230J755J786J838J964J475K53p24p33l81n74j066q57K32J258J406
$$ 243142 244372 246127 247913 249751 251715 253190 253443 252719 251986 251605 251031 249965 249108 249340 250598 252004
52468B52004J009J007J782K748L060K570J938J764J872J729J389J426J871J826
$$ 252004 253013 254020 255802 258550 261610 264180 266118 267882 269754 271483 272872 274298 276169 277995
52454B77995M91j773l837m892m816l824k340j094o41p33n82L8M35j7r48j461j307
$$ 277995 278486 276713 272876 267984 263168 259344 257004 255910 255269 254536 253954 253992 254427 254410 253462 252001 250694
52437B50694j092j321j699j598r39k03K73O21R30Q48N3r89j189L3J992L328L292
$$ 250694 249602 248281 246582 244984 244045 243842 244115 244736 245666 246514 246567 245578 244389 244422 246414 249742 253034
52420B53034K312J374J046J154J287J370J713K594L930N379O628P672Q767J0100
$$ 253034 255346 256720 257766 258920 260207 261577 263290 265884 269814 275193 281821 289493 298260 308360
52406C08360J1344J1645J0267P316L657R3l121n917q015r138r348q876p876o637
$$ 308360 319704 331349 341616 348932 352589 352682 349561 343644 335629 326491 317143 308267 300391 293754
52392B93754n665n139m540l317j776o90j54M00J077J257P62M23R33J764J954J531
$$ 293754 288089 282950 278410 275093 273317 272627 272473 272873 273950 275207 275969 276392 277325 279089 281043 282574
52376B82574J326J622J878J863K141L093M128M388L882L274K842K238J322N86
$$ 282574 283900 285522 287400 289263 291404 294497 298625 303013 306895 310169 313011 315249 316571 317157
52362C17157M37N29K31m58r75j025r02q75q06n83m37m66k46N67J523J884J632
$$ 317157 317594 318123 318354 317896 316921 315896 314994 314119 313313 312730 312293 311827 311581 312148 313671 315555 317187
52345C17187J436J693K169K638L184L741L920L611L278L408M075N184O670Q115
$$ 317187 318623 320316 322485 325123 328307 332048 335968 339579 342857 346265 350340 355524 362194 370309
52331C70309Q755Q367P762P990R232J0869J2258J3090J3301J3145J3143J3574
$$ 370309 379064 387431 395193 403183 412415 423284 435542 448632 461933 475078 488221 501795
52319E01795J4148J4539J4804J4944J4461J3030J1320J0429J0589J1060J1175
$$ 501795 515943 530482 545286 560230 574691 587721 599041 609470 620059 631119 642294
52308F42294J0923J0564J0290J0264J0403J0173R185P993P544P845P859O937N572
$$ 642294 653217 663781 674071 684335 694738 704911 714096 722089 729633 737478 745337 752274 757846
52295G57846M427L339J778k89k426m266n547o059n957n839o025o080n486m465
$$ 757846 762273 765612 767390 767101 764675 760409 754862 748803 742846 737007 730982 724902 719416 714951
52281G14951l639l044k128o46R78K274L308M444N767O965P696Q007Q301Q902R614
$$ 714951 711312 708268 706140 705494 706472 708746 712054 716498 722265 729230 736926 744933 753234 762136 771750
52266G71750R914R570Q918Q485Q498Q842R236R339Q984Q409Q059Q034Q014P752
$$ 771750 781664 791234 800152 808637 817135 825977 835213 844552 853536 861945 870004 878038 886052 893804
52252H93804P369O929O200N032L658K253N89j488l545n026n980o858p699q078
$$ 893804 901173 908102 914302 919334 922992 925245 925834 924346 920801 915775 909795 902937 895238 887160
52238H87160p834p363p096p049o999o793o392n858n367n011m633m046l349k815
$$ 887160 879326 871963 864867 857818 850819 844026 837634 831776 826409 821398 816765 812719 809370 806555
52224H06555k514k304k105j889j495p50K33J189K132L235M328M932M938M878N225
$$ 806555 804041 801737 799632 797743 796248 795498 795731 796920 799052 802287 806615 811547 816485 821363 826588
52209H26588N772N904N345M415L600L105K805K586K613L134M000M670M843M865
$$ 826588 832360 838264 843609 848024 851624 854729 857534 860120 862733 865867 869867 874537 879380 884245
52195H84245N184N624N637N127M544M164L774L112K181J048l04j730k997m193
$$ 884245 889429 895053 900690 905817 910361 914525 918299 921411 923592 924640 924336 922606 919609 915416
52181I15416n620p158q222q553q513q317p580o105m579l854l828l715l177k550
$$ 915416 909796 902638 894416 885863 877350 869033 861453 855348 850769 846915 843087 839372 836195 833645
52167H33645k033j337k50R87K060K862L344L457L323L087K553J401l2p56k36Q04
$$ 833645 831612 830275 830025 831012 833072 835934 839278 842735 846058 849145 851698 853099 853067 852311 852075 852879
52151H52879J144M03p33j403j282m82O87J690J877J025l14j258j386j013p16p75
$$ 852879 854023 854426 853693 852290 851008 850526 851213 852903 854780 855805 855491 854233 852847 851834 851118 850343
52135H50343j003r50j70J474L587N477O832Q071R822J2112J4367J6111J7391J8448
$$ 850343 849340 848390 848220 849694 853281 858758 865590 873661 883483 895595 909962 926073 943464 961912
52121I61912J9390K0268K1141K1785K1714K0827J9724J9033J8614J7818J6354
$$ 961912 981302 1001570 1022711 1044496 1066210 1087037 1106761 1125794 1144408 1162226 1178580
52110A178580J4511J2607J0773R139P737O224M222K091P51N17O27K59m55r42j326
$$ 1178580 1193091 1205698 1216471 1225610 1233347 1239571 1243793 1245884 1246635 1247152 1247779 1248038 1247583 1246641 1245315
52095A245315k376m472p175r829j2110j3844j4840j5130j5049j4833j4290j3115
$$ 1245315 1242939 1238467 1231292 1221463 1209353 1195509 1180669 1165539 1150490 1135657 1121367 1108252
52083A108252j1327r193o901m547k334m79J028K383L664M786N751O722P762Q717
$$ 1108252 1096925 1087732 1080831 1076284 1073950 1073471 1074499 1076882 1080546 1085332 1091083 1097805 1105567 1114284
52069A114284R381R705R736R562R414R590J0082J0414J0118R304Q486P911P373
$$ 1114284 1123665 1133370 1143106 1152668 1162082 1171672 1181754 1192168 1202286 1211590 1220076 1227987 1235360
52056A235360O660N865N052L971K326K20j965l981n849p664r500j1444j3515j5501
$$ 1235360 1242020 1247885 1252937 1256908 1259234 1259454 1257489 1253508 1247659 1239995 1230495 1219051 1205536 1190035
52042A190035j7026j7825j7912j7520j6897j6070j4800j2969j1032r834r721j0070
$$ 1190035 1173009 1155184 1137272 1119752 1102855 1086785 1071985 1059016 1047984 1038150 1028429 1018359
52030A018359r983r287q505q034p820p774q024q588r214r719j0128j0340r968
$$ 1018359 1008376 999089 990584 982550 974730 966956 958932 950344 941130 931411 921283 910943 900975
52017I00975q896p680p094p392q188q974r463r612r618r805j0309j0834j0973
$$ 900975 892079 884399 877305 869913 861725 852751 843288 833676 824058 814253 803944 793110 782137
52004G82137j0736j0594j0963j1786j2603j2912j2450j1277r637p782n992m769
$$ 782137 771401 760807 749844 738058 725455 712543 700093 688816 679179 671397 665405 660636
51992F60636m751o069p935r164r247q744q529q843r247r382r510j0195j1550j2936
$$ 660636 655885 649816 641881 632717 623470 614726 606197 597354 588107 578725 569215 559020 547470 534534
51978E34534j3500j2950j1734j0465r331q095o525m652k689q07R81K744M439N799
$$ 534534 521034 508084 496350 485885 476554 468459 461934 457282 454593 453786 454767 457511 461950 467749
51964D67749O508O582O450O547O877P063O793O006M750L157J652R33J438K892
$$ 467749 474257 480839 487289 493836 500713 507776 514569 520575 525325 528482 530134 531067 532505 535397
51950E35397M584O143P836J0054J2700J5162J6665J6491J4133R774M566J7l153
$$ 535397 539981 546124 553960 564014 576714 591876 608541 625032 639165 648939 653505 653522 650369
51937F50369n226o568p061o668o038n844o010o142o498p660r390j0770j1586j2621
$$ 650369 645143 638575 631514 624846 618808 612964 606954 600812 594314 586654 577264 566494 554908 542287
51923E42287j4212j5469j5528j4800j4141j3441j2018j0051q486p608o660n197
$$ 542287 528075 512606 497078 482278 468137 454696 442678 432627 424141 416533 409873 404676
51911D04676l828l210k960k131m58J429K845L715M390N105N732N920N452M366
$$ 404676 400848 397638 394678 392547 392089 393518 396363 400078 404468 409573 415305 421225 426677 431043
51897D31043K757O17j943m463o378p515q121q469q572q226p159n233k762n14R66
$$ 431043 433800 434417 432474 428011 421633 414118 405997 397528 388956 380730 373571 368338 365576 365062 366028
51882C66028J910K924M188N445O600P699Q389Q091O881N586M703L811K400P55
$$ 366028 367938 370862 375050 380495 387095 394794 403183 411274 418155 423741 428444 432255 434655 435410
51868D35410n40j493k520l614m352m571m574m568m386l796k718j140P96K596L644
$$ 435410 434870 433377 430857 427243 422891 418320 413746 409178 404792 400996 398278 397138 397934 400530 404174
51853D04174L842L640L315K483O58j885m162n416n753n780n818n684n136m277
$$ 404174 408016 411656 414971 417454 418112 416227 412065 406649 400896 395116 389298 383614 378478 374201
51839C74201l442k887k656k591k335j512j39J185J765J504R61P74J098J563J605
$$ 374201 370759 367872 365216 362625 360290 358778 358639 359824 361589 363093 364054 364828 365926 367489 369094
51824C69094R11k44j206j633j872k352k801k550j486k76M66P81J030J365J678
$$ 369094 370005 369761 368555 366922 365050 362698 359897 357347 355861 355585 356051 356832 357862 359227 360905
51809C60905J741J297M15k55k7Q58J380J035L79j4m06j164j775j444l59L96J88
$$ 360905 362646 363943 364358 364103 364076 364934 366314 367349 367728 367714 367308 366144 364369 362925 362566 362962 363150
51792C63150n46j041j020o69k53L7J25Q5L2k0o5r0k75r05j812k165j295L84J717
$$ 363150 362604 361563 360543 359874 359621 359658 359783 359868 359900 359880 359815 359725 359450 358545 356733 354568 353273 353657 355374
51773C55374K037J707J574K206L621N291O481O894O943P096P068O158M202J758
$$ 355374 357411 359118 360692 362898 366519 371810 378291 385185 392128 399224 406292 412450 416652 418410
51759D18410p22l256n781p746q575q321p626p126o941o586n549m079l143l203
$$ 418410 417688 414432 408651 400905 392330 384009 376383 369257 362316 355730 350181 346102 342959 339756
51745C39756l352k323k88J194J156M71O49K004L576M565N084N526N686M953L283
$$ 339756 336404 334081 333793 334987 336143 336614 337263 339267 342843 347408 352492 358018 363704 368657 371940
51730C71940J590R07J230J627J501J242J287J207L57r93j984k423k774l039k644
$$ 371940 373530 374437 375667 377294 378795 380037 381324 382531 382888 381895 379911 377488 374714 371675 369031
51715C69031j587o71l00J4M74L83n84j331n45J521L385M094L855L178K309J459
$$ 369031 367444 366773 366473 366487 366961 367344 366760 365429 364884 366405 369790 373884 377739 380917 383226 384685
51699C84685Q06J63p32j539j522n74M97R36Q41P92R04O15o03k407l612l322k004
$$ 384685 385491 385654 384922 383383 381861 381287 381784 382720 383561 384353 385257 385872 385269 382862 379250 375928 373924
51682C73924r81p89o10K22R45L82j131j900r60Q38K000J919J047K64M47K031M485
$$ 373924 372943 372154 371544 371766 372711 373093 371962 370062 369102 369940 371940 373859 374906 375170 375617 377648 382133
51665C82133O483P030O182M595K775J000n37j844l046l773l125o74K792O003Q398
$$ 382133 388616 395646 401828 406423 409198 410198 409661 407817 404771 400998 397873 397199 399991 405994 414392
51650D14392J0034J0633R553O707K876j103m838p980r997j0758j0872j0902j0634
$$ 414392 424426 435059 444612 451319 454195 453092 448254 440274 430277 419519 408647 397745 387111
51637C87111r650q337p559p469p297o453n131l644j856K42J881K187J225j14j155
$$ 387111 377461 369124 361565 354096 346799 340346 335215 331571 329715 329957 331838 334025 335250 335136 333981
51622C33981j807k118k093j979k144k492k550k208j929j955j902j378n41L03J146
$$ 333981 332174 330056 327963 325984 323840 321348 318798 316590 314661 312706 310804 309426 308885 309188 310334
51607C10334J985K501K567K675L283M051M376M394M875O169P922R750J1420J2296
$$ 310334 312319 314820 317387 320062 323345 327396 331772 336166 341041 347210 355132 364882 376302 388598
51593C88598J1407Q499M514O49k656n429p339p805o784m940k990j174N14K018
$$ 388598 400005 408504 413018 413667 411011 405582 398243 390438 383654 378714 375724 374550 375064 377082
51579C77082L317M627O225Q034R551J0282J0202R780R580R873J0495J0801R984
$$ 377082 380399 385026 391251 399285 408836 419118 429320 439100 448680 458553 469048 479849 489833
51566D89833P764M959L135L386N585Q887J2700J6891K1233K5127K7836K8791K7671
$$ 489833 497597 502556 505691 509077 514662 523549 536249 553140 574373 599500 627336 656127 683798
51553F83798K4584K0230J5680J1688Q234M737O99l833q399j2680j6822k0980k4690
$$ 683798 708382 728612 744292 755980 764214 768951 769650 765817 757418 744738 727916 706936 682246
51540F82246k7119k8020k7953k7290k5671k2878j9774j7567j6420j5487j4201
$$ 682246 655127 627107 599154 571864 546193 523315 503541 485974 469554 454067 439866
51529D39866j2665j0904q672o263m624m199m298m072l566l267l162k829k209j677
$$ 439866 427201 416297 407625 401362 396738 392539 388241 384169 380603 377336 374174 371345 369136 367459
51515C67459j469j495j595j632j480j245j281j660j837j319l95K00K84L27O53
$$ 367459 365990 364495 362900 361268 359788 358543 357262 355602 353765 352446 352051 352251 352535 352862 353515
51500C53515J045J245J342J459J462J170O64J79j20j77jK28J66m36j478k531l099
$$ 353515 354560 355805 357147 358606 360068 361238 361902 362081 361961 361784 361783 362011 362177 361741 360263 357732 354633
51483C54633k993k538k361k748l324l491l155k754k611k610k609k794l351l957
$$ 354633 351640 349102 346741 343993 340669 337178 334023 331269 328658 326048 323439 320645 317294 313337
51469C13337l956l102j865r26n20l87l23m75r03j033m4J998L795M068L094K450
$$ 313337 309381 306279 304414 303488 302968 302581 302258 301783 300880 299847 299803 301801 305596 309664 312758 315208
51453C15208L176M629N448N323N274O290Q167R904J0898J1454J2144J2891J2733
$$ 315208 318384 323013 328461 333784 339058 345348 353515 363419 374317 385771 397915 410806 423539
51440D23539J0564O161O41m164o897p393o410m924l785l669m841o807q540r294
$$ 423539 434103 440264 440905 436741 429844 422451 416041 411117 407332 403663 398822 392015 383475 374181
51426C74181r072q259p094n683m303l241k436j637q68l76j04L76J249K106K413
$$ 374181 365109 356850 349756 344073 339770 336529 334093 332456 331588 331212 331108 331484 332733 334839 337252
51411C37252K105J563J206J337K073L116L789L664L091K770K837K744K086J156
$$ 337252 339357 340920 342126 343463 345536 348652 352441 356105 359196 361966 364803 367547 369633 370789
51397C70789N42M93R39J847L148M494N501O247P164Q294R085R168R043R671J1510
$$ 370789 371331 371824 372763 374610 377758 382252 387753 394000 401164 409458 418543 427711 436754 446425 457935
51382D57935J4303J7627K1196K4657K7644L0295L3133L6115L8022L7302L3426
$$ 457935 472238 489865 511061 535718 563362 593657 626790 662905 700927 738229 771655
51371G71655K7189J9802J2114M633k187q027j2980j7589k2406k7338l1474l3855
$$ 771655 798844 818646 830760 835393 833206 825179 812199 794610 772204 744866 713392 679537
51359F79537l4470l4154l3336l1499k8207k4214k0790j8274j5943j3292j0684
$$ 679537 645067 610913 577577 546078 517871 493657 472867 454593 438650 425358 414674
51348D14674q737p671p358p472p426o811n952n526n517n210m347l540l238l061
$$ 414674 405937 398266 390908 383436 376010 369199 363247 357721 352204 346994 342647 339107 335869 332808
51334C32808k542j874j391j022p75j102k037k583j836k94P14O62R1m32o89m32
$$ 332808 330266 328392 327001 325979 325204 324102 322065 319482 317646 317352 318066 318728 318819 318387 317698 317266
51318C17266M58J403J688J606K164L490M435M057K705J270J49n71p11m33n30j548
$$ 317266 317724 319127 320815 322421 324585 328075 332510 336567 339272 340542 340691 340120 339409 338976 338446 336898
51302C36898k897l491l024k085j176l15M05N67J3o91p71p9P62J161J242J590K341
$$ 336898 334001 330510 327486 325401 324225 323910 324315 324882 324895 324204 323433 323354 324116 325277 326519 328109 330450
51285C30450K873K705K390K931M300N214M691L277K212J773J170m4j239j567r96
$$ 330450 333323 336028 338418 341349 345649 350863 355554 358831 361043 362816 363986 363942 362703 361136 360140
51270C60140j31O13J219J679J896J941K029K110J788Q40m11j439k092k546k844
$$ 360140 360009 360622 361841 363520 365416 367357 369386 371496 373284 374124 373713 372274 370182 367636 364792
51255C64792k778k236j422o35j23r4n99j287j604j438j321j722k426k842k724
$$ 364792 362014 359778 358356 357721 357598 357504 356905 355618 354014 352576 351255 349533 347107 344265 341541
51240C41541k336k055k092k428k711k440j551o78m53p28q26m57M7K89K18J2n0
$$ 341541 339205 337150 335058 332630 329919 327479 325928 325250 324797 324069 323243 322786 322833 323122 323340 323352 323302
51223C23302L27J104J773J953J973K344K821K704K071J878K592L439L397K397
$$ 323302 323629 324733 326506 328459 330432 332776 335597 338301 340372 342250 344842 348281 351678 354075
51209C54075J161L08O0L56Q39J052R52R55J174J165O98K78L71O17M55j0l28n37
$$ 354075 355236 355544 355604 355960 356799 357851 358803 359758 360932 362097 362795 363073 363444 364061 364516 364506 364178 363641
51191C63641q55r54l97L21K11p33j424j256r26j233j856j904j182k37M54Q07Q14
$$ 363641 362786 361832 361435 361756 361967 361234 359810 358554 357628 356395 354539 352635 351453 351216 351670 352477 353291
51174C53291M37k18r14j471j715j474q85m51m41m26K01J365K419L030L403L599
$$ 353291 353728 353510 352596 351125 349410 347936 347051 346600 346159 345733 345934 347299 349718 352748 356151 359750
51158C59750L223K100Q05O6j04k70o78r95r53q02r40j409j981k517k928k966k377
$$ 359750 362973 365073 365878 365944 365840 365570 364892 363897 362944 362142 361202 359793 357812 355295 352367 349401 347024
51141C47024j347m75k44o05j137j476j499j236p36n1P13J323J487J090M38R8M34
$$ 347024 345677 345202 344958 344353 343216 341740 340241 339005 338269 338218 338931 340254 341741 342831 343269 343367 343801
51124C43801J249J925J968J487J064J086J302J198P47M49N06N45L50M42J325K509
$$ 343801 345050 346975 348943 350430 351494 352580 353882 355080 355827 356276 356782 357327 357677 358119 359444 361953
51108C61953K964K465J763J356R73M43L09R74J839K024J539J108J046J006P85
$$ 361953 364917 367382 369145 370501 371474 371917 372226 373200 375039 377063 378602 379710 380756 381762 382547
51093C82547O94R34J115O82l84j450j746r86L56J357J462R04L07K6P1M42J125
$$ 382547 383241 384175 385290 385972 385588 384138 382392 381406 381762 383119 384581 385485 385792 385818 385889 386331 387456
51076C87456J817K131K066K032K317K850L619M887O745Q665R891J0292J0635J1891
$$ 387456 389273 391404 393470 395502 397819 400669 404288 409175 415920 424585 434476 444768 455403 467294
51062D67294J4325J7342K0026K1650K1703J9871J6369J2085P992M459J623N1K58
$$ 467294 481619 498961 518987 540637 562340 582211 598580 610665 618657 623116 624739 624790 625048
51049F25048J416J602r9k501m055m934o387q597j0465j1350j1682j1632j0490
$$ 625048 626464 628066 627967 625466 621411 616477 610090 601493 591028 579678 567996 556364 545874
51036E45874p947n018l023k357k862m620p501j0386j1834j1403r709p406m764
$$ 545874 537927 532909 529886 527529 524667 520047 512546 502160 490326 478923 469214 461808 457044
51023D57044k113J60K146M320O717Q688R668R825R700R498Q989P972O608N273
$$ 457044 454931 455091 457237 461557 468274 476962 486630 496455 506155 515653 524642 532614 539222 544495
51009E44495M193L226K119R19j3n00p98j223j797k467l306m117m198l051j195
$$ 544495 548688 551914 554033 554952 554939 554439 553641 552418 550621 548154 544848 540731 536533 533482 532287
50994E32287L49J351K490M087N478O022O111O545P345P950Q439R680J1948J4005
$$ 532287 532636 533987 536477 540564 546042 552064 558175 564720 572065 580015 588454 598134 610082 624087
50980F24087J4130J1951Q860O641O060O825Q462J0757J3541J6529J9612K3006
$$ 624087 638217 650168 659028 665669 671729 678554 687016 697773 711314 727843 747455 770461
50968G70461K6795L0549L3656L6004L8029M0134M2292M4262M5840M6852M7128
$$ 770461 797256 827805 861461 897465 935494 975628 1017920 1062182 1108022 1154874 1202002
50957A202002M6645M5449M3372M0117L5837L1341K7424K4116K0856J7329J3850
$$ 1202002 1248647 1294096 1337468 1377585 1413422 1444763 1472187 1496303 1517159 1534488 1548338
50946A548338J0985R136Q466Q884R896J0648J0356Q696N822K246j354m465p037
$$ 1548338 1559323 1568459 1576925 1585809 1595705 1606353 1616709 1625405 1631227 1633473 1632119 1627654 1620617
50933A620617r325j1421j3250j5088j7685k1541k6230l0819l4798l8215m1092
$$ 1620617 1611292 1599871 1586621 1571533 1553848 1532307 1506077 1475258 1440460 1402245 1361153
50922A361153m3221m4609m5660m6568m6907m6051m3886m0834l7390l3870l0538
$$ 1361153 1317932 1273323 1227663 1181095 1134188 1088137 1044251 1003417 966027 932157 901619
50911I01619k7580k5025k2775k0797j9100j7570j6011j4366j2770j1387j0225
$$ 901619 874039 849014 826239 805442 786342 768772 752761 738395 725625 714238 704013
50900G04013r156q063o964o025n326m628l559k174j086q35j235j600j502j038
$$ 704013 694857 686794 679830 673805 668479 663851 660292 658118 657032 656197 654962 653362 651860 650822
50886F50822m33K84J120J965K653L102L347L654M438N799P157P806P908Q452J0032
$$ 650822 650389 650673 651793 653758 656411 659513 662860 666514 670952 676751 683908 691714 699622 708074 718106
50871G18106J2062J3541J4214J4518J4714J4699J4616J5030J6260J7985J9749
$$ 718106 730168 743709 757923 772441 787155 801854 816470 831500 847760 865745 885494
50860H85494K1618K4040K7278L1202L5621M0514M5969N1981N8389O4929P1363
$$ 885494 907112 931152 958430 989632 1025253 1065767 1111736 1163717 1222106 1287035 1358398
50849A358398P7557Q3355Q8465R2689R6324J00013J03890J07043J08115J06448
$$ 1358398 1435955 1519310 1607775 1700464 1796788 1896801 2000691 2107734 2215849 2322297
50839B322297J02317R6157Q7977P7719O5769N2835L9567K6636J4933N217k364
$$ 2322297 2424614 2520771 2608748 2686467 2752236 2805071 2844638 2871274 2886207 2891424 2889060
50828B889060q040j1734j3054j1873q525l389L131J0049J5800J9234K0173J8650
$$ 2889060 2881020 2869286 2856232 2844359 2835834 2832445 2835576 2845625 2861425 2880659 2900832 2919482
50816B919482J4063N714o050j9912l4627m9464o3747p6763q8233r8290j06712
$$ 2919482 2933545 2939259 2933209 2913297 2878670 2829206 2765459 2688696 2600463 2502173 2395461
50805B395461j12729j15781j15924j13348j08116j00811r2699q4667p6391o7251
$$ 2395461 2282732 2166951 2051027 1937679 1829563 1728752 1636053 1551386 1474995 1407744
50795A407744n7680m8874m1323l4438k7694k1367j5987j1694q444o286n058m194
$$ 1407744 1350064 1301190 1259867 1225429 1197735 1176368 1160381 1148687 1140243 1133957 1128899 1124705
50783A124705l306k614k455k669k935l406m487o028p369q174q769r502j0308j1120
$$ 1124705 1121399 1118785 1116330 1113661 1110726 1107320 1102833 1096805 1089436 1081262 1072493 1062991 1052683 1041563
50769A041563j2147j3402j4408j4821j5034j5554j6102j6000j5262j4480j3558
$$ 1041563 1029416 1016014 1001606 986785 971751 956197 940095 924095 908833 894353 880795
50758H80795j1632q572n632l866k629n51K480N379P614R695J1935J3854J5256
$$ 880795 869163 860591 854959 851093 848464 847913 850393 855772 863386 873081 885016 898870 914126
50745I14126J6756J8680K0388K1447K2758K5497K9464L3408L6730L9820M2846
$$ 914126 930882 949562 969950 991397 1014155 1039652 1069116 1102524 1139254 1179074 1221920
50734A221920M5329M7122M8836N0776N2216N2315N1323N0245M9552M8779M7296
$$ 1221920 1267249 1314371 1363207 1413983 1466199 1518514 1569837 1620082 1669634 1718413 1765709
50723A765709M5016M2209L8941L4790K9129K1622J2630L069o074j4056k0310k4389
$$ 1765709 1810725 1852934 1891875 1926665 1955794 1977416 1990046 1993115 1987041 1972985 1952675 1928286
50711A928286k6115k5630k3186j9068j3752p947k210L291Q413J2535J4760J4630
$$ 1928286 1902171 1876541 1853355 1834287 1820535 1812588 1810378 1813669 1822082 1834617 1849377 1864007
50699A864007J2410Q498K777n176j5264k6468l7378m6958n4714o0281o3254o3558
$$ 1864007 1876417 1884915 1887692 1882516 1867252 1840784 1803406 1756448 1701734 1641453 1578199 1514641
50687A514641o1636n8104n3323m7610m1549l5679k9910k3739j7130j0814n478
$$ 1514641 1453005 1394901 1341578 1293968 1252419 1216740 1186830 1163091 1145961 1135147 1129669
50676A129669r58L528Q520J3841J8778K2503K4544K5088K4776K4051K2847K0992
$$ 1129669 1128711 1132239 1140759 1154600 1173378 1195881 1220425 1245513 1270289 1294340 1317187 1338179
50664A338179J8696J6408J4429J2916J2065J1918J2172J2560J3277J4657J6441
$$ 1338179 1356875 1373283 1387712 1400628 1412693 1424611 1436783 1449343 1462620 1477277 1493718
50653A493718J7929J8843J9628K0714K2016K3327K4848K6902K9533L2630L6148
$$ 1493718 1511647 1530490 1550118 1570832 1592848 1616175 1641023 1667925 1697458 1730088 1766236
50642A766236L9800M2888M4946M6346M7721M8908M9048M7731M5474M2984M0470
$$ 1766236 1806036 1848924 1893870 1940216 1987937 2036845 2085893 2133624 2179098 2222082 2262552
50631B262552L7939L5618L3749L2240L0715K8404K3796J5003J384j5164l0958
$$ 2262552 2300491 2336109 2369858 2402098 2432813 2461217 2485013 2500016 2501400 2486236 2455278
50620B455278m2722m8982m9904m6500m0211l2525k4493j6577r085k587K274N246
$$ 2455278 2412556 2363574 2313670 2267170 2226959 2194434 2169941 2153364 2144279 2141692 2143966 2149212
50608B149212O614O789N661K448l619j2300k2340l2578m2760n2863o2037o8889
$$ 2149212 2155826 2162615 2168276 2170724 2167105 2154805 2132465 2099887 2057127 2004264 1942227 1873338
50596A873338p2858p4680p5356p5054p3265o9664o4631n9131n4091m9612m4873
$$ 1873338 1800480 1725800 1650444 1575390 1502125 1432461 1367830 1308699 1254608 1204996 1160123
50585A160123l9258l3441k8766k5493k2434j8572j4296j0564p579m864k122O34
$$ 1160123 1120865 1087424 1058658 1033165 1010731 992159 977863 967299 959720 954856 952734 953368
50573I53368L436O146Q226R358J0090J1246J2903J4560J6045J7540J8915J9874
$$ 953368 956804 962950 971176 980534 990624 1001870 1014773 1029333 1045378 1062918 1081833 1101707
50561A101707K0700K1993K3635K4788K5120K5309K6087K7413K8805K9841L0082
$$ 1101707 1122407 1144400 1168035 1192823 1217943 1243252 1269339 1296752 1325557 1355398 1385480
50550A385480K9149K7257K5229K3615K2292K1169K0640K1020K2173K4143K7538
$$ 1385480 1414629 1441886 1467115 1490730 1513022 1534191 1554831 1575851 1598024 1622167 1649705
50539A649705L2584L8375M3833M9096N5088O1956O8789P5034Q1324Q8553R6694
$$ 1649705 1682289 1720664 1764497 1813593 1868681 1930637 1999426 2074460 2155784 2244337 2341031
50528B341031J04879J12228J18262J22689J25221J25700J24191J20889J15780
$$ 2341031 2445910 2558138 2676400 2799089 2924310 3050010 3174201 3295090 3410870
50519C410870J08408R8126Q4743O8840N1274L2490J2540q240k8946m8489o6176
$$ 3410870 3519278 3617404 3702147 3770987 3822261 3854751 3867291 3859051 3830105 3781616 3715440
50508C715440q1744r4918j04998j11011j12373j09401j02932r3365q0442o4151
$$ 3715440 3633696 3538778 3433780 3322769 3210396 3100995 2998063 2904698 2824256 2760105
50498B760105m5618k6738r064O765K0692L2732M2604M9449N1927M8968M0451K6988
$$ 2760105 2714487 2687749 2678685 2685450 2706142 2738874 2781478 2830927 2882854 2931822 2972273 2999261
50486B999261R202j2304l6235o0406q2523j01037j15207j24761j29742j30553
$$ 2999261 3008463 2996159 2959924 2899518 2816995 2715958 2600751 2475990 2346248 2215695
50476B215695j27868j22536j15467j07366r8480q8825p8798o9303o1111n4322
$$ 2215695 2087827 1965291 1849824 1742458 1643978 1555153 1476355 1407052 1345941 1291619
50466A291619m8467m2946l7276l1270k5263j9924j5549j1683p711l592K87L836
$$ 1291619 1243152 1200206 1162930 1131660 1106397 1086473 1070924 1059241 1051530 1047938 1048225 1052061
50454A052061P318J0742J3633J5614J6882J7847J8569J8806J8556J8230J8326
$$ 1052061 1059379 1070121 1083754 1099368 1116250 1134097 1152666 1171472 1190028 1208258 1226584
50443A226584J8930J9577J9402J7617J4059R383M640N70k666n180o963p873p941
$$ 1226584 1245514 1265091 1284493 1302110 1316169 1325552 1330192 1330762 1328096 1322916 1315953 1308080 1300139
50430A300139p496o922o181m760k247R55L803N738P397R880J3447J7451K1467
$$ 1300139 1292643 1285721 1279540 1274780 1272533 1273488 1277291 1283029 1290426 1300306 1313753 1331204 1352671
50417A352671K5826L0806L5977M0864M5756N1173N6760O1423O4534O6360O7240
$$ 1352671 1378497 1409303 1445280 1486144 1531900 1583073 1639833 1701256 1765790 1832150 1899390
50406A899390O6993O5332O2242N7737N1765M4678L7274K9839K1487J1029j636
$$ 1899390 1966383 2031715 2093957 2151694 2203459 2248137 2285411 2315250 2336737 2347766 2346130
50395B346130j5401k9053m1993n3898o4202p2164p7241p9261p8236p4298o7861
$$ 2346130 2330729 2301676 2259683 2205785 2141583 2069419 1992178 1912917 1834681 1760383 1692522
50384A692522n9847n1397m2964l3889k3339j1770q74Q077J5298K1491K6371K8800
$$ 1692522 1632675 1581278 1538314 1504425 1481086 1469316 1468442 1476519 1491817 1513308 1539679 1568479
50372A568479K8070K4413J8345J0217M40j0267k0885l0153l6835m0406m1422m0798
$$ 1568479 1596549 1620962 1639307 1649524 1649964 1639697 1618812 1588659 1551824 1511418 1469996 1429198
50360A429198l8968l6342l4239l4464l7707m2927m8384n2631n4490n3121m8741
$$ 1429198 1390230 1353888 1319649 1285185 1247478 1204551 1156167 1103536 1049046 995925 947184
50349I47184m2807l6849l1377k6205k1328j7005j3332j0228p606n169k361R21
$$ 947184 904377 867528 836151 809946 788618 771613 758281 748053 740447 735278 732917 733838
50337G33838L826N315N381N029N105N608O077O225O083N892O000O597P478Q206
$$ 733838 737664 742979 748360 753389 758494 764102 770179 776404 782487 788379 794379 800976 808454 816660
50323H16660Q540Q585Q565Q542Q397P871O771N173L340J383p21k618l520l123
$$ 816660 825200 833785 842350 850892 859289 867160 873931 879104 882444 883827 883106 880488 876968 873845
50309H73845k246j972k258k055q21P57J761K180K629L411M293N048N679O228O625
$$ 873845 871599 869627 867369 865314 864493 865250 867011 869191 871820 875231 879524 884572 890251 896479 903104
50294I03104O840O863O577N768M404K719R89p80k793m998o731p140o146m760m060
$$ 903104 909944 916807 923384 929152 933556 936275 937264 936484 933691 928693 921962 914822 908676 903916 899856
50279H99856l932l278j460R69L143M959O834Q832J0600J1962J3076J3978J4484
$$ 899856 895924 892646 891186 892155 895298 900257 907091 915923 926523 938485 951561 965539 980023
50266I80023J4576J4473J4205J3509J2284J0907R947R719J0106J0580J0400R234
$$ 980023 994599 1009072 1023277 1036786 1049070 1059977 1069924 1079643 1089749 1100329 1110729 1119963
50254A119963P571O101M627K196j426n138p855r803j1669j2941j2258r362n618
$$ 1119963 1127534 1133635 1138262 1140458 1139032 1133894 1126039 1116236 1104567 1091626 1079368 1070006 1064388
50241A064388k308N64L170M494K953j825q548j5412k1144k5224k7718k8945k8941
$$ 1064388 1062080 1062644 1065814 1070308 1073261 1071436 1062888 1047476 1026332 1001108 973390 944445 915504
50228I15504k7433k4705k2065k0715k0282j9313j7182j4734j2913j1701j0797
$$ 915504 888071 863366 841301 820586 800304 780991 763809 749075 736162 724461 713664
50217G13664j0408j0655j0840j0168q861p797p218o572n543m537l963l679l348
$$ 713664 703256 692601 681761 671593 662732 654935 647717 641145 635602 631065 627102 623423 620075
50204F20075k877k295j601r87p82r36r42n77l65q38j683k080j843j638j976k510
$$ 620075 617198 614903 613302 612315 611533 610597 609655 609078 608713 607875 606192 604112 602269 600631 598655 596145
50188E96145k595k185j763j622j617j559j452j272q96m43l33p65j272j140j73
$$ 596145 593550 591365 589602 587980 586363 584804 583352 582080 581184 580741 580408 579643 578371 577231 577058
50173E77058J121K067K339K056J638J590K173L238M457N624O646P457Q158R132
$$ 577058 578179 580246 582585 584641 586279 587869 590042 593280 597737 603361 610007 617464 625622 634754
50159F34754J0600J2325J4084J6289J9497K3390K6921K9652L2195L4981L7268
$$ 634754 645354 657679 671763 688052 707549 730939 757860 787512 819707 854688 891956
50148H91956L7911L6657L4182L1206K8172K5488K3455K2054K1212K1040K1289
$$ 891956 929867 966524 1000706 1031912 1060084 1085572 1109027 1131081 1152293 1173333 1194622
50137A194622K0877J8602J4281Q621K135n171j3065k0799k7653l3185l6936l8536
$$ 1194622 1215499 1234101 1248382 1257003 1259138 1253967 1240902 1220103 1192450 1159265 1122329 1083793
50125A083793l8253l6798l4448l1018k6847k3034k0275j8151j6113j4442j3620
$$ 1083793 1045540 1008742 974294 943276 916429 893395 873120 854969 838856 824414 810794
50114H10794j3329j2939j2542j2672j3064j2660j0982q809p247o582o341o066
$$ 810794 797465 784526 771984 759312 746248 733588 722606 713797 706550 699968 693627 687561
50102F87561n686n322n006m639m120l509k969k485j786p00N27J579K476L437M369
$$ 687561 681875 676553 671547 666908 662788 659279 656310 653825 652039 651339 651866 653445 655921 659358 663727
50087F63727M969N288N773O650P558Q031Q014P772P436O907O140N324M742M496
$$ 663727 668696 673984 679757 686407 693965 701996 710010 717782 725218 732125 738265 743589 748331 752827
50073G52827M340L894L026J965R73M7q64j575j965k362l154m021m156l419k703
$$ 752827 757167 761061 764087 766052 767025 767072 766208 764633 762668 760306 757152 753131 748975 745556 742853
50058G42853k774l241l162k402j654j268p83K21J507K718M073N953Q079R713J0591
$$ 742853 740079 736838 733676 731274 729620 728352 727569 727790 729297 732015 736088 742041 750120 759833 770424
50043G70424J1198J2007J2920J3711J4542J5696J6939J7720J7950J8245J9204
$$ 770424 781622 793629 806549 820260 834802 850498 867437 885157 903107 921352 940556
50032I40556K0724K2177K3067K3337K3080K2230K0571J7971J4611J0947P506M694
$$ 940556 961280 983457 1006524 1029861 1052941 1075171 1095742 1113713 1128324 1139271 1146777 1151471
50020A151471K757J686R81l05k928o774j1065j5304j9664k4347k8968l2859l5689
$$ 1151471 1154228 1155914 1156895 1156590 1153662 1146888 1135823 1120519 1100855 1076508 1047540 1014681 978992
50007I78992l7344l7428l5507l1850k7511k3447j9776j6042j2039q184n145l189
$$ 978992 941648 904220 868713 836863 809352 785905 766129 750087 738048 729864 724719 721530
49995G21530k007j231r66j533k691l596l834m009m837o093p083p862r084j0672
$$ 721530 719523 718292 717326 715793 713102 709506 705672 701663 696826 690733 683650 675788 666704 656032
49981F56032j1585j1189j0079r141q515p927p403p029o496n533m480l810l411
$$ 656032 644447 633258 623179 614038 605523 597596 590193 583164 576668 571135 566655 562845 559434
49968E59434k874k268j969j983k064k258k629k639j628J56J802L065M562O498
$$ 559434 556560 554292 552323 550340 548276 546018 543389 540750 539122 539278 541080 544145 548707 555205
49954E55205Q111Q825R100R559R979R786Q982P936O627M894L172K173J888J551
$$ 555205 563316 572141 581241 590800 600779 610565 619547 627483 634110 639004 642176 644349 646237 647788
49940F47788O48n67j655k615l822n652q139j0724j2394j2522j1539j0410r516
$$ 647788 648436 647869 646214 643599 639777 634125 625986 615262 602868 590346 578807 568397 558881
49927E58881q536p347o359n706m849l366j716o29q4N21J306J689J397J115J711
$$ 558881 550345 542998 536639 530933 526084 522718 521002 520373 520289 520810 522116 523805 525202 526317 528028
49912E28028L042L990L836L216L427M871O624P565P595P432P578P948Q364Q808
$$ 528028 531070 535060 538896 542112 545539 550410 557034 564599 572194 579626 587204 595152 603516 612324
49898F12324R089Q729P440N450L189R45j060k610l760m864o094p178p859q290
$$ 612324 621413 630142 637582 643032 646221 647166 646106 643496 639736 634872 628778 621600 613741 605451
49884F05451q661q742q293p700p631q100q342p762o589n420m510l729k978k347
$$ 605451 596790 588048 579755 572055 564424 556324 547982 540220 533631 528211 523701 519972 516994 514647
49870E14647j871j351m77Q20K116K723K453K037K512M103N999P284P865Q327R129
$$ 514647 512776 511425 510948 511768 513884 516607 519060 521097 523609 527712 533711 540995 548860 557187 566316
49855E66316J0144J0850J0661R292P010M578K807K047K069K283K089J174l30k041
$$ 566316 576460 587310 597971 607263 614273 618851 621658 623705 625774 628057 630146 631320 630990 628949
49841F28949l771n608p516r016r550r071q092p133o274n252l854k252j003o44
$$ 628949 625178 619570 612054 603038 593488 584417 576325 569192 562918 557666 553812 551560 550557 549913
49827E49913j089j528j090K93J927L226M282N453O697P616Q091Q451Q951R280
$$ 549913 548824 547296 546206 546499 548426 551652 555934 561387 568084 575700 583791 592242 601193 610473
49813F10473Q820P321N264L489K488K041J491M44q95k135l297m715o311p422p589
$$ 610473 619293 626614 631878 635367 637855 639896 641387 641831 640936 638801 635504 630789 624478 617056 609467
$$ [...]
##END NTUPLES=NMR SPECTRUM
##END=
