
##TITLE=AC1346_GUAAH12164_6647547_vDHIZcHlFm
##JCAMPDX= 6.0         $$ Bruker NMR JCAMP-DX V2.0
##DATA TYPE= NMR SPECTRUM
##DATA CLASS= NTUPLES
##ORIGIN= BRUKER
##OWNER= Administrator
$$ 1.72 TOPSPIN		Version 2.1
$$ 2012-08-09 17:31:03.156 -0500  Administrator@TOPSPIN
$$ Compression mode = diff/dup
##.OBSERVE FREQUENCY= 400.02188249412
##.OBSERVE NUCLEUS= ^1H
##.ACQUISITION MODE= SIMULTANEOUS (DQD)
##.ACQUISITION SCHEME= undefined
##.AVERAGES= 8
##.DIGITISER RES= 22
##SPECTROMETER/DATA SYSTEM= spect
##.PULSE SEQUENCE= zg30
##.SOLVENT NAME= COFFEE_meoh
##.SHIFT REFERENCE= INTERNAL, COFFEE_meoh, 1, 14.98509
##AUDIT TRAIL= $$ (NUMBER, WHEN, WHO, WHERE, PROCESS, VERSION, WHAT)
$$ ##TITLE= Audit trail, TOPSPIN		Version 2.1
$$ ##JCAMPDX= 5.01
$$ ##ORIGIN= Bruker BioSpin GmbH
$$ ##OWNER= Administrator
$$ $$ C:\Bruker\TOPSPIN/data/COFFEE/nmr/AC1346_GUAAH12164_6647547_vDHIZcHlFm/10/pdata/1/auditp.txt
$$ ##AUDIT TRAIL=  $$ (NUMBER, WHEN, WHO, WHERE, PROCESS, VERSION, WHAT)
(   1,<2012-08-09 17:30:56.437 -0500>,<Administrator>,<TOPSPIN>,<go>,<TOPSPIN 2.1>,
      <created by zg
	started at 2012-08-09 17:29:49.859 -0500,
	POWCHK enabled, PULCHK disabled,
       configuration hash MD5:
       6B 1B 68 BB D9 2E 58 E2 7F 35 AD 54 07 DF 0E 41
       data hash MD5: 64K
       31 4F C2 FD EC BF 89 1A 43 30 B1 65 F6 09 F7 9A>)
(   2,<2012-08-09 17:30:59.125 -0500>,<Administrator>,<TOPSPIN>,<proc1d>,<TOPSPIN 2.1>,
      <Start of raw data processing
       efp LB = 0 FT_mod = 6 PKNL = 1 PHC0 = 0 PHC1 = 0 SI = 32K 
       data hash MD5: 32K
       A6 A9 97 AB BF 65 40 2C C0 1E 61 95 BC D1 43 13>)
(   3,<2012-08-09 17:30:59.468 -0500>,<Administrator>,<TOPSPIN>,<proc1d>,<TOPSPIN 2.1>,
      <pk PHC0 = 174.3695 PHC1 = 0 
       data hash MD5: 32K
       0C 24 43 5E F7 F1 DE 07 85 34 D5 4B 21 0F A9 E4>)
(   4,<2012-08-09 17:30:59.546 -0500>,<Administrator>,<TOPSPIN>,<proc1d>,<TOPSPIN 2.1>,
      <abs ABSG = 1 
       data hash MD5: 32K
       75 A4 A8 70 43 D6 15 F5 6A 87 C5 F5 EF 9C DC 84>)
(   5,<2012-08-09 17:30:59.578 -0500>,<Administrator>,<TOPSPIN>,<proc1d>,<TOPSPIN 2.1>,
      <abs ABSG = 2 
       data hash MD5: 32K
       AE 71 E6 99 07 05 13 1B 5D 8F 07 3E 51 05 7E D3>)
(   6,<2012-08-09 17:30:59.593 -0500>,<Administrator>,<TOPSPIN>,<proc1d>,<TOPSPIN 2.1>,
      <abs ABSG = 3 
       data hash MD5: 32K
       99 A5 98 1D DC 3C CE 74 34 47 7C 9D 3D 25 4E 7B>)
(   7,<2012-08-09 17:30:59.625 -0500>,<Administrator>,<TOPSPIN>,<proc1d>,<TOPSPIN 2.1>,
      <abs ABSG = 4 
       data hash MD5: 32K
       03 91 CB AD F0 16 E8 2E CB 27 E7 E1 0C 21 18 85>)
(   8,<2012-08-09 17:30:59.656 -0500>,<Administrator>,<TOPSPIN>,<proc1d>,<TOPSPIN 2.1>,
      <abs ABSG = 5 
       data hash MD5: 32K
       31 CF 8C FF 7E 6C 91 A5 89 33 1C 5E 2E 40 01 EB>)
$$ ##END=
$$ 
$$ $$ hash MD5
$$ $$ 51 6B 73 F6 22 4A 7D A1 01 46 F6 79 55 CC 0A A5
##$RELAX= 
##$RELAX= 
##$RELAX= 
##$RELAX= 
##$RELAX= 
##$RELAX= 
##$RELAX= 
$$ Bruker specific parameters
$$ --------------------------
$$ [...]
##$TP= (0..7)
150 150 150 150 150 150 150 150
##$TP07= 0
##$TPNAME0= <>
##$TPNAME1= <>
##$TPNAME2= <>
##$TPNAME3= <>
##$TPNAME4= <>
##$TPNAME5= <>
##$TPNAME6= <>
##$TPNAME7= <>
##$TPOAL= (0..7)
0.5 0.5 0.5 0.5 0.5 0.5 0.5 0.5
##$TPOFFS= (0..7)
0 0 0 0 0 0 0 0
##$TUNHIN= 0
##$TUNHOUT= 0
##$TUNXOUT= 0
##$USERA1= <user>
##$USERA2= <user>
##$USERA3= <user>
##$USERA4= <user>
##$USERA5= <user>
##$V9= 5
##$VALIST= <valist>
##$VCLIST= <CCCCCCCCCCCCCCC>
##$VD= 0
##$VDLIST= <DDDDDDDDDDDDDDD>
##$VPLIST= <PPPPPPPPPPPPPPP>
##$VTLIST= <TTTTTTTTTTTTTTT>
##$WBST= 1024
##$WBSW= 4
##$XGAIN= (0..3)
0 0 0 0
##$XL= 0
##$YL= 0
##$YMAX_a= 465628
##$YMIN_a= -609448
##$ZGOPTNS= <>
##$ZL1= 120
##$ZL2= 120
##$ZL3= 120
##$ZL4= 120
##$ABSF1= 14.98509
##$ABSF2= -5.573092
##$ABSG= 5
##$ABSL= 3
##$ALPHA= 0
##$AQORDER= 0
##$ASSFAC= 0
##$ASSFACI= 0
##$ASSFACX= 0
##$ASSWID= 0
##$AUNMP= <proc_prof1d_extract_pilot.lims>
##$AXLEFT= 0
##$AXNAME= <>
##$AXNUC= <1H>
##$AXRIGHT= 0
##$AXTYPE= 0
##$AXUNIT= <>
##$AZFE= 0.1
##$AZFW= 0.1
##$BCFW= 0
##$BC_mod= 0
##$BYTORDP= 0
##$COROFFS= 0
##$CY= 15
##$DATMOD= 1
##$DC= 0
##$DFILT= <>
##$DTYPP= 0
##$F1P= 0
##$F2P= 0
##$FCOR= 0.5
##$FTSIZE= 32768
##$FT_mod= 6
##$GAMMA= 0
##$GB= 0
##$INTBC= 1
##$INTSCL= 1
##$ISEN= 128
##$LB= 0
##$LEV0= 0
##$LPBIN= 0
##$MAXI= 10000
##$MC2= 0
##$MEAN= 0
##$ME_mod= 0
##$MI= 0
##$NCOEF= 0
##$NC_proc= -8
##$NLEV= 6
##$NOISF1= 0
##$NOISF2= 0
##$NSP= 0
##$NTH_PI= 0
##$NZP= 0
##$OFFSET= 14.98509
##$PC= 1
##$PHC0= 174.3695
##$PHC1= 0
##$PH_mod= 1
##$PKNL= yes
##$PPARMOD= 0
##$PPDIAG= 0
##$PPIPTYP= 0
##$PPMPNUM= 2147483647
##$PPRESOL= 1
##$PSCAL= 4
##$PSIGN= 0
##$PYNMP= <proc.py>
##$REVERSE= no
##$SF= 400.02
##$SI= 32768
##$SIGF1= 0
##$SIGF2= 0
##$SINO= 400
##$SIOLD= 32768
##$SPECTYP= <>
##$SREGLST= <1H.CDCl3>
##$SSB= 0
##$STSI= 32768
##$STSR= 0
##$SW_p= 8223.68421052631
##$SYMM= 0
##$S_DEV= 0
##$TDeff= 65536
##$TDoff= 0
##$TI= <>
##$TILT= no
##$TM1= 0
##$TM2= 0
##$TOPLEV= 0
##$USERP1= <user>
##$USERP2= <user>
##$USERP3= <user>
##$USERP4= <user>
##$USERP5= <user>
##$WDW= 1
##$XDIM= 32768
##$YMAX_p= 463117129
##$YMIN_p= -734634
##$CURPLOT= <Network HP LaserJet P1505>
##$CURPRIN= <$Network HP LaserJet P1505>
##$DFORMAT= <normdp>
##$LAYOUT= <+/1D_H.xwp>
##$LFORMAT= <normlp>
##$PFORMAT= <normpl>
##$SURQMSG= 1
$$ End of Bruker specific parameters
$$ ---------------------------------
##NTUPLES= NMR SPECTRUM
##VAR_NAME=  FREQUENCY,     SPECTRUM/REAL,   SPECTRUM/IMAG
##SYMBOL=    X,             R,               I
##VAR_TYPE=  INDEPENDENT,   DEPENDENT,       DEPENDENT
##VAR_FORM=  AFFN,          ASDF,            ASDF
##VAR_DIM=   32768,         32768,           32768
##UNITS=     HZ,            ARBITRARY UNITS, ARBITRARY UNITS
##FACTOR=    0.250966925370066, 1,           1
##FIRST=     8223.43324360094, -120598,      6056
##LAST=      0,             97197,           123962
##MIN=       0,             -734634,         0
##MAX=       8223.43324360094, 463117129,    0
$$ Real data points
##PAGE= N=1
##DATA TABLE= (X++(R..R)), XYDATA
$$ [...]
19451a85322P3851a4548j4468A51406L467j3735D0710J08827b31214R9922p8528
19440b09820Q7949J4758K9505B2350e9884k75468F4240J99730A09136a22778B60231
19428D8344J35525H5723a01158E0446e8754j38361j14666C7242J28829b11640
19417b72030f3150j03520K511D1876a16141n2829k59037K4868H6193a19023j3846
19406a32869e4310B24652M1790b43412D8589a50084A06661b95105J34055I9181
19395d7412G6039e8878A32843O8592a82214G4686R8323b74394N7544a2105l18718
19384c30823A673b20237f5666o3869a610j24532m3039L2992j08830g8392j17696
19373a96088C664f1390D6235a28461B90442b9882q0145A00212B9897J29580c84698
$$ y = [-185322, -111471, -14548, -29016, 151406, 154873, 141138, 40710, 149537, -231214, -131292, -209820, -121871, -107113, -77608, 22350, -59884, -335352, 64240, 263970, 109136, -122778, 260231, 48344, 183869, 85723, -101158, 50446, -58754, -197115, -311781, 37242, 166071, -211640, -272030, -63150, -166670, -164159, 41876, -116141, -168970, -428007, -403139, 86193, -119023, -132869, -54310, 224652, 266442, -243412, 48589, -150084, 106661, -295105, -161050, 99181, -47412, 76039, -58878, 132843, 201435, -182214, 74686, 173009, -274394, -216850, -12105, -330823, 1673, -220237, -65666, -129535, -1610, -126142, -169181, -136189, -245019, -78392, -196088, 3664, -61390, 46235, -128461, 290442, -29882, -110027, 100212, 29897, 159477, -384698]
19361c9228l72996a15881k0875j5741k32196h1325j55459A57046a30682p6113
19351b06795B2995i1922m2852a6111l00018a54042A72378b73996G8207A2698b92023
19339b17703D0858a28569m3868N3954c8549k49860O6232f9946e403m93412a22489
19327c30536J36047B1558i5269H0725K97005I900h7617C52238A19068a87463A7153
19315G0914J04136c94530f8899l6526C1976P7272a02916p1209B9648b6460F4596
19303B73337c33406J65737l70081f7997k01471i4704B00766a34238F9112k3316
19293D5796h0737B07255a06665j32362R9926k88011c63k88218d5564J5809j15036
19282a44791k11545N8565E6562a17423L2648B8146b5670B18734f2245k29201a33989
$$ y = [-39228, -412224, -115881, -136756, -152497, -384693, -81325, -236784, 157046, -130682, -206795, 22995, -91922, -134774, -16111, -316129, -154042, 172378, -273996, 78207, 12698, -292023, -217703, 40858, -128569, -172437, -118483, -38549, -288409, -222177, -69946, -5403, -498815, -122489, -330536, -194489, 21558, -95269, 80725, 377730, 9900, -87617, 352238, 119068, -187463, 17153, 70914, 175050, -394530, -68899, -105425, 31976, 109248, -102916, -174125, 29648, -26460, 64596, 273337, -333406, -167669, -537750, -67997, -269468, -94704, 200766, -134238, 69112, 45796, -80737, 207255, -106665, -239027, -139101, -427112, -363, -288581, -45564, -29755, -144791, -356336, -297771, 56562, -117423, -84775, 28146, -25670, 218734, -62245, -291446, -133989]
19270a69247j73199a5419k14286A35423k7799a18939I8279O8884d5833A0416h3176
19258E5235b6909k21572E1161J02803j2407b3093j06605B2552J26977c9600q3564
19247a23164N2989B41541a05884L4843j53528c022A70863B2448a35487L5394H599
19235a96366c9417j08786a3863j47180P207P194H8665f2795H3530J19833a04582
19223a11321I0572c01359q996B07230A4145J45700D4502H180b6498j10244M5041
19212i1701B8210a20160A44710c89864N838J61211m2731A1120a20260K373r6268
19201b14155h9573A95018j8369i1131b7245B87454i3745A9877J20191a14238E6534
19189c7899k2634H7844A7809J21098a52632D8606g0547a2541l49185J16545B60740
$$ y = [-169247, -342446, -15419, -229705, 135423, 107624, -118939, 98279, 167163, -45833, 10416, -83176, 55235, -26909, -248481, 51161, 153964, 141557, -23093, -129698, 22552, 149529, -39600, -123164, -70175, 241541, -105884, -71041, -224569, -3022, 170863, 22448, -135487, -100093, 8599, -196366, -39417, -148203, -13863, -161043, -153836, -146642, 88665, -62795, 83530, 203363, -104582, -111321, 90572, -301359, -310355, 207230, 14145, 159845, 44502, 8180, -26498, -136742, -91701, 28210, -120160, 144710, -389864, -384026, -222815, -265546, 11120, -120260, -117887, -214155, -89573, 195018, 176649, -91131, -27245, 287454, -93745, 19877, 140068, -114238, 56534, -37899, -60533, 87844, 17809, 138907, -152632, 48606, -70547, -12541, -361726, -245181, 260740]
19177a4676o8683G3995J1456A3253i6689k3811E6619b99499A08867c37977i3463
19165b28051e6933j41293D8258a84948g0281l1428K8022L3288B2569e30385H3370
19153c73889F1334b12734j35777H5208D0052b45614B28664A5719L7960F440Q115
19142A4555L87773e2863A12767a5693A66346o783a9373A70304c55680R0827A49830
19130D5735b3584j11975r3798b0699k16397b713B60173a60811B70864a48308i054
19118D3427A9511g3677p6684L5539O441D21934C400g0895E5513J88008o9398F9408
19105a6121j72708l55777K66758H2490J35777a57005k36888P2883A48627J879
19095A50506a72032A52478D6904b9649A46264d69636A81798H3248d6296k65971
$$ y = [-14676, -83359, 73995, 85451, 13253, -96689, -120500, 56619, -299499, 108867, -337977, -93463, -228051, -56933, -198226, 48258, -184948, -70281, -101709, -73687, -40399, 22569, -530385, 83370, -373889, 61334, -212734, -348511, 85208, 40052, -245614, 228664, 15719, 53679, 6440, 14555, 402328, -52863, 112767, -15693, 166346, 159563, -19373, 170304, -355680, -264853, 149830, 45735, -23584, -135559, -229357, -20699, -237096, -2713, 260173, -160811, 270864, -148308, -9054, 43427, 19511, -73677, -150361, -114822, -108381, 421934, 3400, -70895, 55513, 243521, 174123, 69408, -16121, -188829, -544606, -277848, 82490, 218267, -157005, -393893, -321010, 148627, 150506, -172032, 152478, 46904, -29649, 146264, -469636, 181798, 83248, -46296, -312267]
19085c12267a3668l87354A14282l3826l3318f5101A01637L6734b59742H7667b62110
19073G5377d6182A76076b1633O009m8462j37357A07057b45485N7563L4337p244
19062a60829B04530C4117b7312A17367a73060k6556c516j14720A66892H0310a20064
19050a40736F358b08286P2677B41197c0242H4889B6229i6447a9098I5841N0318
19039A46159C1003d7815J1726f608j19880r9804k2142g7241a8378A27858a21186
19027E1380O3473a20702A25120e6611l6720K0828A66829D5194A4029d6093A21660
19015A06332a8527r8196A72299c3978j16683A37715K52217f649j40733j19082
19005b66464B4621J11806a92051B33532M7774c0721F3955P8049b22318d8478l1910
$$ y = [-312267, -13668, -401022, 114282, 80456, 47138, -65101, 101637, 138371, -259742, 87667, -262110, 75377, -46182, 176076, -21633, -15624, -64086, -201443, 107057, -245485, -187922, -153585, -160829, 204530, 34117, -27312, 117367, -173060, -199616, -3516, -118236, 166892, 80310, -120064, -140736, 6358, -208286, -135609, 241197, -30242, 84889, 26229, -96447, -19098, 95841, 146159, 31003, -47815, -36089, -6608, -126488, -226292, -248434, -77241, -18378, 127858, -121186, 51380, 114853, -120702, 125120, -56611, -93331, -72503, 166829, 45194, 14029, -46093, 121660, 106332, -18527, -116723, 172299, -33978, -150661, 137715, 389932, -6649, -147382, -266464, 24621, 136427, -192051, 233532, 281306, -30721, 63955, 142004, -222318, -48478, -80388]
18994h0388j8577j20866j42111J079C5409P6878c8906j05897A46397a112k98681
18983b99793a29215G4120e4129A13385a14860F96K09527D2611L0570J00338L10913
18972D84432L07793p4679f4261B07310B6148M0449J61606b48986f2314B22173
18961a1421m9996n8294d0697I650J14334i6839j08239A47515c65358A12395c95232
18949i0412B8750a08475E3307J71051l699a52254n6221h2215K1834j95508d0315
18937b47235a3408p3660m4060M4603A06916Q6417a61764A31163I296J35610E5649
18925A14075K994c09977a22108D10980H7685a75681j04105B02428K78037f8728
18914I8643J06689a15329j74810F5256K65816J39542J41803k54811D3317O2156
$$ y = [-80388, -98965, -219831, -361942, -360863, 35409, 112287, -38906, -144803, 146397, -1112, -299793, -129215, 74120, -54129, 113385, -114860, 696, 210223, 42611, 73181, 173519, 484432, 792225, 717546, -64261, 207310, 26148, 66597, 228203, -248986, -62314, 222173, -11421, -61417, -119711, -40697, 9650, 123984, -96839, -205078, 147515, -365358, 112395, -395232, -90412, 28750, -108475, 53307, 224358, 220659, -152254, -208475, -82215, -60381, -255889, -40315, -247235, -13408, -87068, -131128, -86525, 106916, 193333, -161764, 131163, 9296, 144906, 55649, 114075, 117069, -309977, -122108, 410980, 87685, -175681, -279786, 202428, 480465, -68728, 98643, 205332, -115329, -290139, 65256, 331072, 470614, 612417, 357606, 43317, 105473]
18904A05473d3419m4231A84831g9919j34229B6650a2979A32508i094k89973d2973
18892h36k12892f2619A30753c48261a30830p5740A90830E1539c45130J28563j07807
18881c24374A89431a69560d7576o6243J9969j63846C36206D9816a21862m0685
18871a62547M0326E5128a3297L614H655N2823g5301H2586J08788I2807a95287
18859a86758d2106A37257a98810L9516M2340l6124P4097D1729d3454j6788K3986
18848c6256A79319a48723e2525j37436A50696g2200c137j47662j64003a25979
18837b67534d0083A60326a19586p8495g9851A47327J21034B9983b26693A98527
18826B09168j8724h7803o5343f6944C9756b7065k33819h232p949A25336j2875
$$ y = [105473, -43419, -87650, 184831, -79919, -214148, 26650, -12979, 132508, -9094, -299067, -42973, -836, -213728, -62619, 130753, -348261, -130830, -206570, 190830, 51539, -345130, -216567, -324374, 189431, -169560, -47576, -113819, -93850, -257696, 336206, 49816, -121862, -162547, -122221, 55128, -13297, -9683, 8655, 61478, -75301, 82586, 191374, 92807, -195287, -186758, -42106, 137257, -198810, -159294, -116954, -153078, -78981, 41729, -43454, -60242, -36256, 179319, -148723, -52525, -189961, 150696, -72200, -3137, -150799, -314802, -125979, -267534, -40083, 160326, -119586, -198081, -79851, 147327, 268361, 29983, -226693, 198527, 209168, 190444, -87803, -153146, -66944, 39756, -27065, -260884, -8232, -16181, 125336, 112461]
18815A12461h160A35577B768c18703c5911A72986C8106i2910m9011d441B06522
18803a36374N8892K5994i779j3246B7851a51124p7861j54594J78372A79273D5496
18791E1167R9454n3512L2837e2500A19164b86490a08432A29991c67785c4506B5666
18779a8814o568l9851G4591a94999J363o8456N3786D8067K4349b36855J00412
18768a36443G0837c3440A01322b99684P9443B1039c624n4977A21727l1518a49901
18756a47838p1420d9496H2537a05326n1025K3428N9302J3621a9010C37569h6526
18744h904j15769j59841B30586f4821k3979m9246b555j72785A86236C6552N4732
18733I1284e1950G7178e02153A54485o9722h8095j00566P7737l1441k3049D4529
$$ y = [112461, -8160, 135577, 2768, -318703, -35911, 172986, 38106, -92910, -141921, -4441, 206522, -136374, -77482, -51488, -9779, -23025, 27851, -151124, -228985, -383579, -205207, 179273, 45496, 51167, 150621, 97109, 129946, -52500, 119164, -286490, -108432, 129991, -367785, -34506, 25666, -18814, -25382, -65233, 74591, -194999, -193636, -262092, -208306, 48067, 72416, -236855, -136443, 70837, -33440, 101322, -299684, -220241, 21039, -3624, -58601, 121727, 90209, -149901, -147838, -219258, -49496, 82537, -105326, -156351, -132923, -73621, -60000, -19010, 337569, -86526, -8904, -124673, -284514, 230586, -64821, -88800, -138046, -2555, -175340, 186236, 36552, 91284, -51950, 77178, -502153, 154485, 84763, -88095, -188661, -110924, -142365, -165414, 44529]
18721b39093j36262E9696b5912B59694I6409A5277a29121r6780B53029i2945K2941
18710g0004j13570c0519l07872c5097j67030h7618A28472a03697A2469a87936
18699B6215b6631C21743e1605j88974h7046j09804A938a02846B7463M3035c7321
18687b3686j64995h1343A47940b14762g5066A60724B6946a18529j00521A27664
18676c08021P1210A78904j7695a16555j78277g2713a2669r4213A9126K27120h0216
18664a11726j18686b0040P612I4046L8780c5495l39705B05070h4748A20826r111
18653A11715c02117f0625C45026i1728A16328b58672A30927h3791p611K8958j69990
18642b32434A26521b41811C6688d0748C0971j3860K0661b53111a431k62811N6216
$$ y = [-239093, -375355, 59696, -25912, 259694, 96409, 15277, -129121, -225901, 253029, -92945, -70004, -183574, -30519, -338391, -35097, -202127, -87618, 128472, -103697, 12469, -187936, 26215, -26631, 321743, -51605, -240579, -87046, -196850, 1938, -102846, 27463, 70498, -37321, -23686, -188681, -81343, 147940, -214762, -75066, 160724, 26946, -118529, -219050, 127664, -308021, -236811, 178904, 161209, -116555, -294832, -72713, -12669, -106882, 19126, 246246, -80216, -111726, -230412, -20040, -12428, 94046, 132826, -35495, -375200, 205070, -84748, 120826, 111715, -302117, -60625, 345026, -91728, 116328, -258672, 130927, -83791, -91402, -62444, -232434, 126521, -241811, 36688, -40748, 30971, 17111, 37772, -253111, -1431, -264242, -208026]
18631b08026l09314H223J74549c09328E7068J45368b22036f0365k21393d9857
18620E5003g3664E55d840A38668b5413A84860a18921M2193m6974r7488B08682
18608F8551b88293B41116f8159k4686k74860A98364a22044m5820N0134B51848
18597c43981L9419A72877a61974g6712A57745C367h2928I6019b671C3296j5513
18586A7783d34747a48644A0027e9406E43K10900A896a70872h3205A51607b05301
18574a02779l9468n8663D0189r195J55474p3553a21305e2472m8380C028Q7483
18563I0511a73902j04189i6896k38217i5816L0584C52238d20071a60222k2098
18553a82320e1290A54761i7275F3004q516a86977n9138i0745r1586G9457a31571
$$ y = [-208026, -517340, 8223, 182772, -309328, 57068, 202436, -222036, -60365, -281758, -49857, 55003, -73664, 555, -4840, 138668, -25413, 184860, -118921, -76728, -123702, -221190, 208682, 68551, -288293, 241116, -68159, -92845, -367705, 198364, -122044, -167864, -117730, 251848, -343981, -304562, 172877, -161974, -76712, 157745, 3367, -82928, 96019, -2671, 33296, 17783, -434747, -148644, 10027, -59406, 543, 211443, 1896, -170872, -83205, 151607, -205301, -102779, -142247, -200910, 40189, 30994, 186468, 112915, -121305, -52472, -100852, 3028, 90511, -173902, -278091, -96896, -335113, -95816, -65232, 352238, -420071, -160222, -182320, -51290, 154761, -97275, 63004, 54488, -186977, -246115, -90745, -182331, 79457, -131571]
18541H0448l9314b09512O6387j13330J23334A33377f4907a237A61537E3613b10733
18529i386j80381j12839a30706a1808G5460J04375e0218f849A53257d85282f5232
18517C07523g6960K4536k18935d667j77436B3762J95177a8355C7678b48338A105
18505b88687J10666B30381e8789o4951c6779j79111H0517b32756i589e16j4008
18494a4524D1780K66797C5264K5696a208n22q5736P906k69038G4053h5581A96391
18481b57344J07925M0384D5614P2600l1268B0078h4222a1841k4776i396j92140
18470b01536F8143c37584J36830N2479j857b8501n7279B6623a2650j11367A61283
18458B02010c8047l9158A22296c62765f870G5382e0250r9464j13219D11457a02526
$$ y = [80448, 41134, -209512, -143125, -256455, -133121, 133377, -64907, -1237, 161537, 53613, -210733, -9386, -189767, -302606, -130706, -11808, 75460, 179835, -50218, -6849, 153257, -485282, -65232, 307523, -76960, -52424, -271359, -4667, -182103, 23762, 218939, -18355, 37678, -248338, 1105, -288687, -178021, 230381, -58789, -123740, -36779, -215890, 80517, -232756, -9589, -516, -14524, 41780, 308577, 35264, 60960, -1208, -1730, -87466, -79560, -348598, 74053, -85581, 196391, -257344, -149419, -109035, 45614, 118214, 86946, 20078, -84222, -11841, -36617, -9396, -201536, 68143, -337584, -200754, -148275, -150132, -28501, -85780, 26623, -12650, -124017, 161283, 202010, -38047, -77205, 122296, -362765, -6870, 75382, -50250, -149714, -262933, 411457, -102526]
18446c04483P2778A71618a19919n7866e2236K3899H6677N0534c5478k53853b6976
18434A51265a18860a2067j3838j81642A01126J21035A1236K29788H9629B2763
18423a95623f9771B56475j24431a79304C6808a6742j66034F7010a72854P6519
18413i6335k7649H0158i7582j06062Q6642A99234b07500A1338i4823D95240a20228
18401b00392G0484e7085H0335H830a88289H1809h1943B4266L7573a29562B72062
18389b8522B40600A00044b53134c3767n3280m4889j91313a37845G8389d2354m14562
18378d56916A22983b76539g1143j33909J01433a5375A53139i544o4864A27949
18367A30079a74520j76359C06324H4497k8733b00009D5604L19023A20063e0432
$$ y = [-304483, -231705, 171618, -119919, -177785, -52236, -28337, 86677, 137211, -35478, -289331, -26976, 151265, -118860, -12067, -25905, -207547, 101126, 222161, 11236, 241024, 89629, 22763, -195623, -69771, 256475, 132044, -179304, 36808, -16742, -182776, 67010, -172854, -96335, -123984, 80158, -97582, -203644, -117002, 199234, -207500, 11338, -94823, 495240, -120228, -200392, 70484, -57085, 80335, 8830, -188289, 81809, -81943, 24266, 61839, -129562, 272062, -28522, 240600, 100044, -253134, -33767, -87047, -131936, -323249, -137845, 78389, -42354, -456916, 122983, -276539, -71143, -205052, -103619, -15375, 153139, -9544, -74408, 127949, 130079, -174520, -350879, 306324, 84497, 55764, -200009, 45604, 364627, 120063, -50432]
18356I6657a81575K5362B29452r0093a30664L0529j08814j64815a10659A79088
18345b5148D00794A92129a2248k40166i7786A44305f1999b9302B86d33644g3928
18333a28091k20029f5781p499p8765K5696B21416J34937A65701A2019J1127J08673
18322A31819a42401f0643B67320j04713p1096e7379E33129B28107e0784k07362
18312b58146j36001D93270h9761c4447j63659o4490E9025i7472D05832A21621
18301f1333B59013I0775k7445a5002r6183F3863f321k4758k34658H9215J22239
18290B11454E7593e92845a03862C03242D1635a46102A60987f1059C35235G8262
18279f0927A6038b89677H1333k9277f5317G2693A2161b2622k70505j0172B03115
$$ y = [96657, -181575, -156213, 229452, 139359, -130664, -100135, -208949, -373764, -110659, 179088, -25148, 400794, 192129, -12248, -252414, -97786, 144305, -61999, -29302, 286, -433644, -73928, -128091, -348120, -65781, -73280, -152045, -126349, 221416, 356353, 165701, 12019, 23146, 131819, -142401, -60643, 267320, 162607, 91511, -57379, 533129, 228107, -50784, -258146, -394147, 493270, -89761, -34447, -198106, -262596, 59025, -97472, 405832, 121621, -61333, 259013, 90775, 63330, -15002, -111185, 63863, -6321, -31079, -265737, 89215, 211454, 57593, -592845, -103862, 303242, 41635, -146102, 160987, -61059, 335235, 78262, -60927, 16038, -289677, 81333, 52056, -65317, 72693, 12161, -22622, -293127, -303299, 203115]
18267A43558O469b97138C2645i178A61293c6520k96118J61926o7980d2943j31361
18256a74304K6775f0289K0923k19030H046O7965J45997i8661q22k47631B6915
18244F8356a64748b2371E5126K25990a11723j406k992k1322N5924L1402j70433
18233b20550B60796b1084j61664j54133p5812a45A31751g5744l8763R771o2042
18222a66778O7918A12551b12781E7566a75484A15323a3016C39915a66788F1097
18211B72224A4560l13N2167c73543c6472B04919r5013c10558d5187D9439a53108
18199A80930m1695A3114e7136O51k48554D24964a94011g0753D0605c83481a04739
18187E1266a04670A07688b19907A23267n6339K17983H7750R8266p6417b08046
$$ y = [143558, 150027, -297138, 32645, -9178, 161293, -36520, -332638, -170712, -238692, -42943, -174304, -147529, -60289, -39366, -258396, 8046, 76011, 222008, -98661, -99483, -347114, 26915, 68356, -164748, -22371, 55126, 281116, -111723, -113129, -116121, -137443, -81519, -50117, -220550, 260796, -21084, -182748, -336881, -412693, -145, 131751, -75744, -114507, -104736, -166778, -98860, 112551, -212781, 57566, -175484, 115323, -13016, 339915, -166788, 61097, 272224, 14560, 14247, 66414, -373543, -36472, 204919, 109906, -310558, -45187, 49439, -153108, 180930, 139235, 13114, -57136, -56485, -305039, 424964, -194011, -70753, 40605, -383481, -104739, 51266, -104670, 107688, -219907, 123267, 66928, 284911, 87750, 186016, 109599, -208046]
18176E4902d1976j06533c926j80849K9573o8541R2957p9274A48362c9910j7999
18165e7909I7973i4716j2081e0561D1163a37923B71857L3750b72275B6440m47
18154B5993a51201B06240a02983d2520I333d17090h8865A18035J4D654M64451
18143D69105A77759a16297e5955m4850C01321a17810I675K3790M12702b55486
18132G9776B0511L39635o4830a99288B7174J32908K05743d3445E6613i9232j07502
18121b06734n5370B70944b88871A88448G510K36047E111O1820Q7882a25329j3015
18110a38344B4374M0374M7140J22705b06206B75735a9426l58548A71908i5849
18099a53794A21171b38164c3640H99J04293n785b32131J6004n2347b6840l6281
$$ y = [54902, -41976, -148509, -3926, -184775, -155202, -223743, -130786, -210060, 148362, -39910, -57909, 97973, -94716, -106797, -50561, 41163, -137923, 271857, 305607, -272275, 26440, 25993, -151201, 206240, -102983, -42520, 9333, -417090, -88865, 118035, 118049, 4654, 469105, 177759, -116297, -55955, -100805, 301321, -117810, 9675, 33465, 446167, -255486, 79776, 20511, 360146, 295316, -199288, 27174, 160082, 365825, -43445, 56613, -99232, -206734, -262104, 270944, -288871, 188448, 7510, 243557, 5111, 66931, 154813, -125329, -138344, 24374, 64748, 111888, 234593, -206206, 275735, -19426, -377974, 171908, -95849, -153794, 121171, -238164, -33640, 899, 105192, 99407, -232131, -216127, -268474, -26840, -63121]
18088f3121A60014b19320c0222A56078f8755k64404Q4763R6706E1003B1358J43461
18077A64819B5402a25858j1693F1964a14692F5127P5833b03652K2599Q7972B97723
18065d1394o5845A28724c7963C875J27346a54205r5674O1398j42320d51k02398
18054b02849l2724n8161e8207a0036n22759B6219g6844G5938G401m48L5906P2564
18042A15423b88616i4911B21543I6512g3248A83816n6644n9115K35364A17544
18031A09009K73638a26274A56602A4579M54052G3253b57784i2003E4724J7273
18021G1997d1856B33345a26430B28059c09980h7777E0795f5295B40844E8497b4844
18009c68323g9989A28646a68266C473M5767M9651d11926J95212B85018a54407
$$ y = [-63121, 160014, -219320, -30222, 156078, -68755, -333159, -248396, -151690, 51003, 21358, 164819, 25402, -125858, -137551, 61964, -114692, 65127, 140960, -203652, -181053, -93081, 297723, -41394, -107239, 128724, -37963, 3875, 131221, -154205, -249879, -188481, -330801, -451, -202849, -235573, -293734, -58207, -10036, -532795, 26219, -76844, 75938, 7401, 6953, 42859, 115423, -288616, -94911, 221543, 96512, -73248, 183816, 127172, 68057, 303421, 117544, 109009, 382647, -126274, 156602, 14579, 468631, 73253, -257784, -92003, 54724, 71997, -41856, 233345, -126430, 228059, -309980, -87777, 50795, -65295, 240844, 58497, -24844, -368323, -79989, 128646, -168266, 3473, 49240, 98891, -411926, -216714, 285018, -154407]
17998A89752a36594c4413A9523a77009p5239F6649j1903k983N9816a35419A84878
17986B5418J22771D715J63577E4937d1019I8153d01594A12408a09354a289l83222
17975c84511d4422k15279A75831M4545r7604g7277c7147A20963j4199C1883e8761
17963D7792c4540D1374a53126d498A52914E5796J30228C8461G255g3222k40685
17952c13907a46099A60051a79486C7577K98691c68123P1818H7979i904j03655
17942a13559J8051B48385L0039i5849F3078B192J00755N9578h1559d439r0725
17931i5164i761o3789j65737O2873A6316f1782m6895C7479a17156A33199m0245
17920I2954a55338I7146e0358e853C60688c73110e9754C47151A41615k5451J20482
$$ y = [189752, -136594, -34413, 19523, -177009, -252248, 66649, 54746, 51763, 111579, -135419, 184878, 25418, 148189, 4715, 168292, 54937, -41019, 98153, -401594, 112408, -109354, -1289, -384511, -44422, -259701, 175831, 220376, 122772, -77277, -37147, 120963, 106764, 31883, -58761, 47792, -34540, 41374, -153126, -4498, 152914, 55796, 186024, 38461, 7255, -73222, -313907, -146099, 160051, -179486, 37577, 336268, -368123, -296305, 87979, -9904, -113559, -95508, 248385, 278424, -95849, 63078, 2192, 102947, 162525, -81559, -4439, -95164, -9761, -73550, -239287, -176414, 16316, -61782, -108677, 37479, -117156, 133199, 92954, -155338, 97146, -50358, -5853, 360688, -373110, -59754, 347151, 141615, 116164, 236646]
17909B36646a21794B1727L2738K58386A02582a32195B48218q6559k7330b26539
17898A79082M8977a32890B3406a14121B9883N57255g8109B24237J20439n3234
17888B91442E9709J61414L6650p8522h7389a9005p7915A35491j5617c2270J1593
17877b0677G7406a9354j8050F3103k33K139a95307j1044B26647a96394e5826H1804
17864E4138a56805B75378L4937a84351f0400A43718K3468j9913E9183h1253B84990
17852D9238a68085M2958q187A53918b373l10527B38121H415e016k20214A60302
17840D42358H147K87288H8825e7078j85013a876j9175H181K9246b28317B00683
17828D5376a03116A88923E9832J53758a21631B00474g905A5993K19798g3654A78862
$$ y = [236646, -121794, 21727, 54465, 312851, 102582, -132195, 248218, 161659, 134329, -226539, 179082, 228059, -132890, 23406, -114121, 29883, 587138, -78109, 224237, 344676, 291442, 59709, 221123, 257773, 179251, -87389, -19005, -96920, 135491, 119874, -32270, -20677, 77406, -19354, -37404, 63103, 62870, 65009, -195307, -206351, 226647, -196394, -55826, 81804, 54138, -156805, 275378, 310315, -184351, -60400, 143718, 167186, 147273, 59183, -81253, 284990, 49238, -168085, -125127, -133314, 153918, -2373, -312900, 238121, 8415, -5016, -225230, 160302, 442358, 8147, 295435, 88825, -57078, -242091, -1876, -21051, 8181, 37427, -228317, 200683, 45376, -103116, 188923, 59832, 213590, -121631, 200474, -7905, 15993, 235791, -73654, 178862]
17816E2214a16209M6472q103C22021C167c1818J4572f691A63568I165J88735k0346
17804A77554F0128J5243c1848A87860A4312O4573A6289f7727A90827E385N5199
17793F0584b11979B81434a08533E8601L4904K22910q1571C0237f2386l6746D9368
17781C27225a56596d5405j71686G4828O173Q1017F3801E477e1655D77559k4499
17770D53060f6084A23857a74412E5060K9560a75451b2829B77802G7386K49422
17760C26808A734L19787L0067A8720K44016A16692a58180o4653R8189A44107a927
17748B46801N4294A43329B1595L2969a90930A27393f2066A41655a7565j65971
17738a83536j63077A91694L94939a0636G8559M6220A4948J82909a37929A65285
$$ y = [52214, -116209, -69737, -77840, 322021, 3167, -31818, -17246, -6691, 163568, 9165, 197900, 177554, 60128, 75371, -31848, 187860, 14312, 78885, 16289, -67727, 190827, 5385, 60584, -211979, 281434, -108533, 58601, 93505, 316415, 234844, 30237, -62386, -99132, 49368, 327225, -156596, -45405, -217091, 74828, 81001, 162018, 63801, 5477, -51655, 477559, 453060, -66084, 123857, -174412, 55060, 84620, -175451, -22829, 277802, 77386, 326808, 1734, 321521, 351588, 18720, 262736, 116692, -158180, -222833, -124644, 144107, -1927, 246801, 301095, 143329, 21595, 54564, -190930, 127393, -62066, 141655, -17565, -183536, -346613, 191694, 586633, -10636, 78559, 124779, 14948, 197857, -137929, 165285]
17727b44404G2070a59176B4983k262M8404d3689G3389e9620H5516b59683J15864
17716a43819D9441c5143r7365k59441D94856p6652d0816n4463A74084k4789L1320
17705A80615a33935B58473a41312A16102K54628A08015l2430C1853c1996A98120
17694b78317A8424K33488c2254A65899F1714j2054K23657B4837i878A75601N1245
17683B26846N3283q4983c22083h9333A54172l1929C2202n213O5560J60102o5273
17672A87378r0200K49468q7792G586k715J55981M1612A5099i9104F899g6503m5903
17660a22406d4027A00581J51458j19262j8302D8518J60139E2568b0052A0784N3781
17649F4565e1448l9136P396A17586K9358D9706B0867M1036J93150b10546A02634
$$ y = [-244404, 72070, -159176, 24983, 22721, 71125, -43689, 73389, -59620, 85516, -259683, -143819, 49441, -35143, -132508, -391949, 494856, 418204, -40816, -95279, 174084, 149295, 180615, -133935, 258473, -141312, 116102, 370730, 108015, 75585, 31853, -31996, 198120, -278317, 18424, 251912, -32254, 165899, 61714, 49660, 273317, 24837, -9878, 175601, 226846, 280129, 195146, -322083, -89333, 154172, 122243, 32202, 26989, 92549, 252651, 187378, 97178, 346646, 258854, 7586, 4871, 160852, 202464, 15099, -99104, 6899, -76503, -122406, -44027, 100581, 252039, 132777, 114475, 48518, 208657, 52568, -20052, 10784, 64565, -51448, -90584, -83188, 117586, 146944, 49706, 20867, 61903, 255053, -210546, 102634]
17637d0490D1232J91716j01324d5502B34781J02304a55634B7063a41965B9588
17626C18449a56245N4305A87910J04286f2362b4841B44400A12468J95812A3586
17615E9037M83522k0524k34384a62527G8838b19664H8963K1304L7726k0922J7497
17604A44568h1082A64448m991B803J64260l2836J67013d3695C26623A35514G359
17592a12748D09700G5369J19360e3261j4160I7962R2432J73876A14353J43511
17582B57864l5377n1387d9468B19594b66124A55244J01496J78401A09907K43593
17572C53500K41658B27569b15612C3265a9259r048E9898B4829d8887F19720k53277
17561C66443G3724b8833B48701a4067C67645j68687J47568A69762P4103c0258
$$ y = [-40490, 41232, 232948, 131624, -45502, 234781, 337085, -155634, 27063, -141965, 29588, 318449, -156245, -101940, 187910, 292196, -62362, -24841, 244400, 112468, 308280, 13586, 59037, 542559, 522035, 287651, -162527, 78838, -219664, 88963, 110267, 147993, 127071, 144568, -81082, 164448, 159457, 2803, 167063, 134227, 301240, -43695, 326623, 135514, 7359, -112748, 409700, 75369, 194729, -53261, -67421, 97962, 190394, 364270, 114353, 257864, 222487, 171100, -49468, 219594, -266124, 155244, 256740, 435141, 109907, 353500, 595158, 227569, -215612, 33265, -19259, -28307, 59898, 24829, -48887, 619720, 366443, 73724, -28833, 248701, -14067, 367645, 198958, 346526, 169762, 243865, -30258]
17550B51362h6109B31365N5652L1677B0390N28691B3019M22470j80962k6571K07404
17539D45360k01856p545N1978K00164J64899j62778j92835l9690j09030k1456
17529A27211N31071P6315J75676K61382J90945K14060m35302j41897l63931K01315
17519H36845r0657R551l50123j07003J09313k3668M44195J94457K37939j53301
17509A107548K52929l67493j76860M6481l42055p6234j43609p2513m6667K09429
17499C90956K36164N5501a601B81570J16142A52606L0059k052K531L12750k09013
17488B86881J73789H3411Q8454R9692K46298e2517B4888K78413j06885F7064N13470
17477E80534k50184n9287P2477J21047A74241J72526h8284a2936F1971L24136
$$ y = [251362, -86109, 231365, 287017, 318694, 20390, 549081, 23019, 445489, 264527, 237956, 445360, 243504, 235959, 287937, 488101, 653000, 490222, 297387, 257697, 148667, 127211, 658282, 734597, 910273, 1171655, 1362600, 1576660, 1141358, 999461, 635530, 836845, 746188, 755739, 405616, 298613, 407926, 384258, 828453, 1022910, 1260849, 1107548, 1360477, 992984, 816124, 862605, 520550, 444316, 300707, 228194, 181527, 390956, 627120, 682621, -1601, 281570, 397712, 152606, 182665, 180613, 183144, 495894, 286881, 460670, 83411, 171865, 271557, 517855, -52517, 24888, 303301, 196416, 67064, 580534, 330350, 271063, 343540, 464587, 174241, 346767, -88284, -12936, 61971, 386107]
17467C86107j09121G3419K07155H182J33661L46954A57311M8006p6142K57385
17457C86560j28719m2660k9513K83261d2957B05490N3697J91063P119j74365L4373
17446C17377K64979k31134m5898J42029j91292l2754L42536j70034A09235O56330
17436G65565C36031K11680A77676J26923k5115K21573A52059N63439C40948J8147
17426C59095L22238E6965J41195M6981J91756q2111j2167l8962J9033I0923l1474
17415E9449J36445M10120k79042L32351A49349Q4084j07499M35407m0076D3917
17404A10254D9300K02053p7764L97501k13026a02831B26636L29296G0774K64978
17394C35752A04900J99944J0773B6410J91521J41003p7295H0568K27721K07905
$$ y = [386107, 276986, 73419, 280574, 8182, 141843, 488797, 157311, 205317, 129175, 386560, 257841, 215181, 185668, 468929, -42957, 205490, 259187, 450250, 457369, 283004, 317377, 582356, 351222, 305324, 447353, 256061, 223307, 565843, 395809, 109235, 765565, 336031, 547711, 177676, 304599, 279484, 501057, 152059, 715498, 340948, 359095, 681333, 56965, 198160, 245141, 436897, 354786, 342619, 303657, 322690, 90923, 59449, 195894, 606014, 326972, 659323, 149349, 233433, 125934, 561341, 521265, 43917, 110254, 49300, 251353, 173589, 571090, 358064, -102831, 226636, 555932, 70774, 335752, 104900, 304844, 315617, 26410, 217931, 358934, 281639, 80568, 308289, 516194]
17384E16194F3747K99282n1811j36112a7788B21739J27683j08670J30849D2549
17373A83554L32715A15529K54704N9396J7243p8136K5283A41952n2859J87250
17363B76343Q3857K0030B3333K62508j27424n6514K85207a54868C18993n8069
17353B60924K7668Q7353o7531A3308O41967B57354J02385j50930J65379r5523
17343B78665q6214H3230J66924K93498B63138H1810K38204j33767P0682L04691
17333E61620k23863A68042m6511D1016J73566l421m7861o9240J6672J84156A4717
17321I1854b1440C72440J33217j31497j37576K02844p5084g4487C11358j16915
17311A94443D2051J38598J65611o2733n9540J98468N7182B25469K19410M1233
$$ y = [516194, 63747, 363029, 311218, 175106, -17788, 221739, 349422, 240752, 371601, 42549, 183554, 516269, 115529, 370233, 429629, 446872, 368736, 394019, 141952, 89093, 276343, 360200, 380230, 23333, 285841, 158417, 101903, 387110, -154868, 318993, 260924, 288592, 375945, 308414, 13308, 655275, 257354, 359739, 208809, 374188, 278665, 192451, 83230, 250154, 543652, 263138, 81810, 320014, 186247, 256929, 561620, 337757, 168042, 121531, 41016, 214582, 211161, 163300, 94060, 110732, 294888, 14717, 91854, -21440, 372440, 505657, 374160, 236584, 439428, 364344, -74487, 311358, 194443, 42051, 180649, 346260, 283527, 223987, 422455, 479637, 225469, 444879, 486112]
17301D86112A17180N4662J89762M1978J33603j21858Q5645I2980L65M29872B40748
17289D43828C4575K32556L7093A25132K25140K18454J32520l46772N5729J79847
17279E90050B04251D8565J56277r6739M55150k65267O4454Q4591m2451J87723
17269E92303k28305l4258j6123P9503j14111J54095m6784J01765j32794m1923
17259C13368N6983p1887Q8119j7819K62435H3448L42992K97577l3802l23460K99627
17248F66382j75426n4456K06638k51155J35463n0199A72307K83556J80188k95519
17238C40532i3800A93847L08407j08883k1106j06431K05953r6057N8202o9295
17228C64637K93062j91462j44113K99456j38880j58264A31680M77837J55159C46866
$$ y = [486112, 117180, 171842, 361604, 403582, 537185, 415327, 500972, 92980, 93345, 523217, 240748, 443828, 34575, 267131, 304224, 125132, 350272, 568726, 701246, 354474, 410203, 590050, 204251, 48565, 204842, 108103, 563253, 297986, 362440, 447031, 404580, 592303, 363998, 329740, 313617, 393120, 279009, 433104, 386320, 488085, 355291, 313368, 370351, 298464, 386583, 368764, 631199, 83448, 426440, 724017, 690215, 366755, 666382, 490956, 436500, 643138, 391983, 527446, 477247, 172307, 455863, 636051, 340532, -93800, 193847, 502254, 393371, 372265, 265834, 471787, 375730, 433932, 364637, 657699, 466237, 322124, 621580, 482700, 324436, 131680, 609517, 764676, 346866]
17217C77898Q5882O6496j20606n7247K16474k5377j56306A20681Q89460D06085
17206G87260l13809J19719J99382C24307L09360C02897N3360J01884J66556j84081
17196D40616P2788j99308L99456j31619p0091k5647n3599K07787O5564B88017
17185B81661M0903K713M570L955L57002J1036J350k25695q4880K470J57674j80500
17173C72259K41066r9105L6028J20723m437J44804k66256K62811l43671L61804
17163H26026D01873J74623N7153O1586p2243j46237K04164j28854J73299m0674
17153F84690J11517l83008O7804P6159J3226K67376o1902n2703o4112k19712j26799
17142C12536J56260J94314j12504K74810k09602J88342l85208J78631j33246M00779
$$ y = [377898, 463780, 530276, 409670, 352423, 568897, 543520, 387214, 120681, 1010141, 406085, 787260, 473451, 593170, 792552, 324307, 633667, 302897, 356257, 458141, 624697, 440616, 513404, 314096, 713552, 581933, 511842, 486195, 432596, 640383, 705947, 288017, 281661, 322564, 325277, 329847, 333802, 690804, 701840, 703190, 477495, 392615, 395085, 552759, 372259, 613325, 514220, 550248, 670971, 666534, 811338, 545082, 807893, 464222, 826026, 401873, 576496, 633649, 695235, 622992, 476755, 680919, 552065, 725364, 684690, 796207, 413199, 481003, 557162, 570388, 837764, 775862, 723159, 659047, 439335, 312536, 468796, 663110, 550606, 825416, 615814, 804156, 418948, 597579, 464333, 865112]
17132H65112k34703Q5431o7652l315J04159l06476M01535m05352M59824l72183
17122E26380L51585j83960L936m2526Q7829K5393j76051K43080l95413J94046
17112F34299K57514j27824P201j3463r5675A28048M96936K40201j31264k28733
17102E05188K44510Q6469j30481O8112k7836j08346N48606k41336j56114R1878
17092H80650n865j66934J73766m5312J02795j0985j50152K7371P2067j71333L14314
17081A020382k20232R4955k2093K06131l84272J03074P7248n7378j37600J74082
17071H54297K06676k9030j21279R3499j84115k272K77993l19803J39695J99568
17061A115229j64511m3035L09389k54527L15436j69625J203k97206M22011j10704
$$ y = [865112, 630409, 715840, 648188, 644873, 749032, 442556, 844091, 438739, 898563, 526380, 877965, 694005, 697941, 655415, 743244, 768637, 592586, 835666, 440253, 634299, 891813, 763989, 771190, 757727, 662052, 128048, 624984, 865185, 733921, 505188, 749698, 836167, 705686, 773798, 745962, 637616, 1186222, 944886, 788772, 880650, 874785, 707851, 881617, 836305, 939100, 928115, 777963, 805334, 877401, 706068, 1020382, 800150, 895105, 873012, 1079143, 694871, 797945, 875193, 817815, 680215, 854297, 1060973, 1031943, 910664, 1004163, 820048, 817776, 1095769, 775966, 915661, 1115229, 950718, 907683, 1217072, 962545, 1277981, 1108356, 1109559, 812353, 1234364, 1123660]
17051A123660j89864J42653J03896P1650m82448N08584j92070K38721k93004N16334
17041A548112l03647k09418M26087k66183k83102J87673J59054J33556n4562K9159
17031A366729k13500J81568k09844j02220K76028k23436P0238L08029n59919L97852
17021A291525P5550k37046k5156j8169N1142K12754k50020K10644j90782M27802
17011A548244P917l08446j00298R2369J42227j02465K48774l08734R011J32822
17001A361421K17444k52691K4773j55081N24830k10524l8610k4422k19368J73067
16991A400839M32217k11922k42688m860N09589r2775k10470j5545J83120q2608
16981A664897L3764j45540J69743j85346J92305J55267q2961j87173N06339n98894
$$ y = [1123660, 933796, 1076449, 1180345, 1251995, 769547, 1278131, 1086061, 1324782, 1031778, 1548112, 1244465, 1035047, 1461134, 1194951, 911849, 1099522, 1258576, 1392132, 1337570, 1366729, 1153229, 1334797, 1124953, 1022733, 1298761, 1075325, 1145563, 1453592, 893673, 1291525, 1367075, 1130029, 1104873, 1086704, 1137846, 1350600, 1100580, 1311224, 1120442, 1548244, 1556161, 1247715, 1147417, 1239786, 1382013, 1279548, 1528322, 1219588, 1228599, 1361421, 1578865, 1326174, 1350947, 1195866, 1720696, 1510172, 1471562, 1447140, 1227772, 1400839, 1833056, 1621134, 1378446, 1373586, 1883175, 1790400, 1579930, 1564385, 1747505, 1664897, 1698661, 1553121, 1722864, 1537518, 1729823, 1885090, 1802129, 1614956, 2121295, 1522401]
16971A522401N9334J15858p508K48329k3596k24952L43348l64450k244M38809
16961B105329l34290M09781m78518L53766L555O1251n5568j73851M60357n28848
16951A822964M51311j10195j78080K68066j47211q3561K87758k88174K63956n2249
16941B234585Q3748l47643J50464o9181K60911K43111j51134j57018L36979K8630
16931B613452k44574J80261J16039j27100K67545k24618J58408Q9296k66420p0366
16921B491923L50225j02420O5635J92600L5203J09202j67596n1300M93003l69016
16911C047459p6175O3683j116J36894J22600j39789O8025M81469m65473M49551
16901C687128k14045K74826j8391k22661N8924L14788O824m52375M79581r1539
$$ y = [1522401, 1581735, 1697593, 1690085, 1938414, 1914818, 1689866, 2033214, 1668764, 1666520, 2105329, 1771039, 2180820, 1702302, 2056068, 2059623, 2120874, 2065306, 1891455, 2351812, 1822964, 2274275, 2164080, 1986000, 2254066, 2106855, 2023294, 2311052, 2022878, 2286834, 2234585, 2318333, 1970690, 2121154, 2051973, 2312884, 2555995, 2404861, 2247843, 2584822, 2613452, 2368878, 2549139, 2665178, 2538078, 2805623, 2581005, 2739413, 2828709, 2562289, 2491923, 2842148, 2739728, 2805363, 2997963, 3033166, 3142368, 2974772, 2923472, 3416475, 3047459, 2971284, 3034967, 3033851, 3170745, 3293345, 3153556, 3221581, 3703050, 3237577, 3687128, 3473083, 3747909, 3729518, 3506857, 3565781, 3880569, 3887393, 3435018, 3914599, 3823060]
16891C823060K04615l5388l3065L08120m12659K49922j6301j2152l1499L24099
16881D368752N70006o08203J99520k66109L07715P069O5763K19014j19849M05888
16871E149566k87235K58111j58557K52416J6900K07436K6975P4329O1365k6644
16861E574662J28096k79495K95720K43295l37063M01269K25611j07420O6973J88085
16851F399733K57467l04837m2208N50105j07279N80678l19716J21748J83139K3003
16841G341833K20667J32626M9984o602L45274n87J01764P02969l8946j31106Q9927
16830H807803L21781j10448L7424N82874J16000M32817j34591o9231J12185K56664
16820A0353278M02306L57468O333L63605J97569J69466M34790K16806R4156K30332
$$ y = [3823060, 4027675, 3992287, 3959222, 4267342, 3854683, 4104605, 4088304, 4076152, 4044653, 4368752, 4938758, 4330555, 4530075, 4263966, 4571681, 4578750, 4644513, 4863527, 4743678, 5149566, 4862331, 5120442, 4961885, 5214301, 5231201, 5438637, 5465612, 5539941, 5601306, 5574662, 5702758, 5423263, 5718983, 5962278, 5625215, 6026484, 6252095, 6144675, 6211648, 6399733, 6657200, 6352363, 6310155, 6860260, 6752981, 7333659, 7013943, 7135691, 7318830, 7341833, 7562500, 7695126, 7745110, 7738508, 8083782, 8083195, 8184959, 8887928, 8848982, 8717876, 8807803, 9129584, 9019136, 9056560, 9639434, 9755434, 10188251, 10053660, 9984429, 10096614, 10353278, 10755584, 11113052, 11119385, 11482990, 11680559, 11850025, 12284815, 12501621, 12595777, 12826109]
16810A2826109M6660K14343O97359o6949O34302R5003K25814M37391K63035K79331
16800A5652398L93543N48958M41039J93442M35849N18831N48302L6152O77180
16791A9445694M19933O39460O03437O884J081092K96366N04701Q94044N77153
16782B4468764M38611P81325O29357L91892J026169P62153R38576O39548P06119
16773C0782514J022722R82711J049969J012584Q46710J095943P38875J430777
16765C8962805J028505J168761R33956J663341Q95235J792997J332519J569715
16757D9347834J416842J599913J831245J178661K025980J517744J995263J868924
16749F2782406J552430J919467K106310J829402K144110J753095K233297J603789
$$ y = [12826109, 12872769, 13087112, 13784471, 13717522, 14351824, 14446827, 14672641, 15110032, 15373067, 15652398, 16045941, 16594899, 17035938, 17229380, 17665229, 18184060, 18732362, 18768514, 19445694, 19865627, 20505087, 21108524, 21115408, 22196500, 22492866, 22997567, 23891611, 24468764, 24907375, 25688700, 26318057, 26709949, 27736118, 28498271, 29436847, 30076395, 30782514, 31805236, 32787947, 33837916, 34850500, 35697210, 36793153, 37532028, 38962805, 39991310, 41160071, 42094027, 43757368, 44652603, 46445600, 47778119, 49347834, 50764676, 52364589, 54195834, 55374495, 57400475, 58918219, 60913482, 62782406, 64334836, 66254303, 68360613, 70190015, 72334125, 74087220, 76320517, 77924306]
16741G7924306J967630K236757K083088J695924J873172J684887J769683J590887
16733I2826334J600967J318331J375492R92219J348049M35180O89169P46421K10387
16724A01542549p2630r0870j86433n13667o15977r37228r71485q53055j296074
16715I6005130j519402j402953j816277j692219j773086j779502j719308k085722
16707H2216661k322617j805879k192651j830294k057585j933120k142423k013661
16699F5918431j879334j672706j829925j903841j478109j949015j826650j441827
16691E1937024j819099j426338j296906j332351j595219j273881j579102j002046
16683D0612082j611098p61805j053033j298639j204160p40000r95974q16575r83484
$$ y = [77924306, 79891936, 82128693, 84211781, 85907705, 87780877, 89465764, 91235447, 92826334, 94427301, 95745632, 97121124, 98113343, 99461392, 99896572, 100585741, 101332162, 101542549, 101469919, 101379049, 101192616, 100678949, 100062972, 99125744, 98154259, 97301204, 96005130, 94485728, 93082775, 91266498, 89574279, 87801193, 86021691, 84302383, 82216661, 79894044, 78088165, 75895514, 74065220, 72007635, 70074515, 67932092, 65918431, 64039097, 62366391, 60536466, 58632625, 57154516, 55205501, 53378851, 51937024, 50117925, 48691587, 47394681, 46062330, 44467111, 43193230, 41614128, 40612082, 39000984, 38239179, 37186146, 35887507, 34683347, 33943347, 32947373, 32130798, 31147314]
16674C1147314j137060m50698r45832l00233j396540o08098n77602r26984n76994
16665B4227273m92734p21828m96575l12194q78988m95343l03706o62505k92790
16656A9570610l65056p34762n24971k96058l21789m38642p47977K95415r53438
16647A5483332j54692r00655K21775J67231p23555o10167N4550k44504q60982
16638A2432333K0327k08841j40667q9450l20759r7374k92480k72620q2048k63609
16628A0684812l26079J12178m94883k28993p3385m80432q4432q4205O0504P9772
16618I164857m51491k91464l14465k7302k12526J70426j83855l1163m5868j95524
16608G581625m89795M80554m16039K4150k03847j36998m0459k31689j26304J24490
$$ y = [31147314, 30010254, 29559556, 28613724, 28313491, 26916951, 26308853, 25731251, 24804267, 24227273, 23734539, 23012711, 22516136, 22203942, 21324954, 20829611, 20525905, 19863400, 19570610, 19205554, 18470792, 17945821, 17649763, 17327974, 16889332, 16141355, 16436770, 15483332, 15328640, 14427985, 14649760, 14816991, 14093436, 13483269, 13537819, 13293315, 12432333, 12452660, 12243819, 12103152, 12013702, 11692943, 11595569, 11303089, 11030469, 10948421, 10684812, 10358733, 10470911, 9976028, 9747035, 9673650, 9193218, 9108786, 9024581, 9085085, 9164857, 8713366, 8421902, 8107437, 8080135, 7867609, 8038035, 7854180, 7823017, 7777149, 7581625, 7091830, 7572384, 7156345, 7180495, 6976648, 6839650, 6799191, 6567502, 6441198, 6565688]
16598F565688j48804k70074k30048J19730n3926j45630l14392K21524L40448o26353
16588E458163N8748m8187k64936k63807M8384J38991k35835r6795l17675J98145
16578D675196k18481K09699k74368L46788n91747P3811K01741l10660L25815n14723
16568C923071K74907k81691K10684Q1257k64917N1484j29339j57290K42196J8650
16558C969012l25066M7036j78157k03129M55038j13110m78812J66791J96950r8485
16548C438068L0173k26350J4775J23788k51196J5431o8953k74070L48286k67277
16538B882675M6444K18566j50144o5317Q5938k13310J00364j53203J04605k2807
16528B833811k43440q9433K8381j46926L02458J1122k27687J90776k04564J78278
$$ y = [6565688, 6416884, 6146810, 5916762, 6036492, 5982566, 5836936, 5522544, 5744068, 6084516, 5458163, 5516911, 5468724, 5203788, 4939981, 4988365, 5127356, 4891521, 4794726, 4477051, 4675196, 4456715, 4666414, 4392046, 4738834, 4147087, 4220898, 4422639, 4111979, 4437794, 3923071, 4197978, 3916287, 4126971, 4208228, 3943311, 3994795, 3865456, 3708166, 3950362, 3969012, 3643946, 3690982, 3512825, 3309696, 3764734, 3651624, 3172812, 3339603, 3536553, 3438068, 3468241, 3241891, 3256666, 3380454, 3129258, 3144689, 3075736, 2801666, 3149952, 2882675, 2929119, 3147685, 2997541, 2932224, 3018162, 2804852, 2905216, 2752013, 2856618, 2833811, 2590371, 2500938, 2529319, 2382393, 2684851, 2695973, 2468286, 2659062, 2454498, 2632776]
16518B632776Q8718o57560J69554K73821j02137l20888L67131l74260J34470J74282
16508B385907L847R2222m26284M60939l37725j27280j26555M98555j63417q8763
16498B171446l30123K84018j71091O9612N9854m88295M8498M53044j45371n3663
16488A897929Q1770j1705l71882J07646k7012k0722K85577k46665Q663j45865
16478A557734j17658L06670j49560Q9729L2469k0160l2026k02741J13470J57142
16468A735069r9014j52712j1688j23844R7737k51707L04203j65020J11523J09233
16458A553780o7661Q6589j71757J04560J07007j44752l26830M02763m39421K47994
16448A352272l11157L50991J62812K8250J88414p45233L04974K07329l06631j81452
$$ y = [2632776, 2721494, 2063934, 2233488, 2507309, 2405172, 2084284, 2451415, 2077155, 2211625, 2385907, 2389754, 2481976, 2055692, 2516631, 2178906, 2051626, 1925071, 2423626, 2260209, 2171446, 1841323, 2125341, 1954250, 2023862, 2083716, 1595421, 1643919, 2096963, 1951592, 1897929, 1979699, 1967994, 1596112, 1703758, 1676746, 1656024, 1941601, 1694936, 1703599, 1557734, 1440076, 1746746, 1597186, 1686915, 1719384, 1699224, 1667198, 1464457, 1577927, 1735069, 1636055, 1483343, 1471655, 1347811, 1445548, 1193841, 1498044, 1333024, 1444547, 1553780, 1486119, 1572708, 1400951, 1505511, 1612518, 1467766, 1140936, 1543699, 1104278, 1352272, 1041115, 1392106, 1554918, 1583168, 1771582, 1026349, 1331323, 1538652, 1232021, 1050569]
16438A050569L37975J45929l77260J11138j98290J08201j6963L4412j61254N10767
16428A545224n72680K15776k45524L35121J18806l90624P6628n6122K7527m2170
16418A011962N8371j58017J30365N384m7101j21293J1546K32116l49261M94222
16408A268294j97551r1610j28006K55277j04755Q683m22499L69687j23148J76100
16398A010472L3758j11735Q0863j30689M00281n13048J15030K96494l31625N9120
16388I08921O828K97100n54114j60319L50280O7272j93673J83019j37897O3875
16378H31292P6510L4197j38319m8084p8055j7720K02372k01833J09932K14130
16368I84422J07438m31251J15192l7676r8268L53228k37860k85026L24845j68169
$$ y = [1050569, 1388544, 1534473, 1157213, 1268351, 1070061, 1178262, 1161299, 1195711, 1034457, 1545224, 972544, 1188320, 942796, 1277917, 1396723, 1006099, 1082727, 1026605, 1054132, 1011962, 1070333, 912316, 1042681, 1048065, 1000964, 879671, 891217, 1123333, 774072, 1268294, 1070743, 979133, 851127, 1106404, 1001649, 1010332, 587833, 957520, 834372, 1010472, 1044230, 932495, 1013358, 882669, 1282950, 769902, 884932, 1181426, 849801, 908921, 915749, 1212849, 658735, 498416, 848696, 915968, 722295, 905314, 767417, 831292, 907802, 941999, 803680, 755596, 677541, 659821, 862193, 660360, 770292, 984422, 1091860, 660609, 775801, 738125, 639857, 993085, 755225, 470199, 795044, 626875]
16358F26875n5813M68735k30667k11452j68743L19653L4636o8428K02606k86175
16348F31227K05474l20712L94710j15653r8701K04424j01894q5608k92135K52150
16338F73282j20927k27536J50431N8283L42004O772k69624J1895j72905J7441
16328D69116M17271j54147C07936J41031L84471k6462n3782j65261m266M28988
16318A012655l20189P9094k54123j02173j50819L14363Q8153M4905j03173r1954
16308E16739K4825l6542J5145J61360A70924L25832j18768O016Q2061r0812M9168
16297D24421O8838P4366k4960K73498k33716k54577A54790K05563k0263J72605
16287E12695Q6495j30888j51026L18637A21147O69198C51407J34173k19283K52366
$$ y = [626875, 571062, 1039797, 809130, 597678, 428935, 748588, 783224, 714796, 917402, 631227, 836701, 515989, 910699, 795046, 696345, 900769, 798875, 713267, 421132, 673282, 552355, 324819, 475250, 533533, 875537, 882309, 612685, 624580, 451675, 469116, 886387, 732240, 307936, 448967, 833438, 806976, 753194, 587933, 583667, 1012655, 692466, 771560, 517437, 415264, 264445, 578808, 666961, 711866, 608693, 516739, 541564, 505022, 520167, 681527, 170924, 496756, 377988, 384004, 466065, 375253, 424421, 493259, 567625, 542665, 816163, 582447, 327870, 154790, 360353, 340090, 512695, 599190, 468302, 317276, 635913, 121147, 790345, 351407, 485580, 266297, 518663]
16277E18663j7350k00161L66517j22599O3069k23923R7753k21465L88304B62870
16266F08251A85686J35092L4401M5557j71608L39224G0001L26678L39176B93208
16255F28933P3910B74275M23458A95313A9210L56919K16092j50666j45429N3576
16245C49702j33031J02703r6677K18845k0703J01656A26560M17996K9289k34766
16235C39079A66149K99003k7514K3195K3012k23687o2366J19571M26144j91871
16225E51636R8536k69960o5238J23761j83695a14746N6233B85010A16844K27821
16215C44665J13664P9854k13819L3679j45130q3299Q9974j3630K77901k20467
16205B63392m9774K61441K41261B66820K00261O0566B00979K64771J6759F0381
$$ y = [518663, 501313, 301152, 667669, 545070, 608139, 384216, 481969, 260504, 648808, 262870, 608251, 185686, 320778, 355179, 400736, 229128, 568352, 70001, 396679, 735855, 293208, 628933, 702843, 274275, 697733, 195313, 19210, 376129, 592221, 441555, 296126, 349702, 216671, 319374, 222697, 441542, 420839, 522495, 126560, 544556, 573845, 339079, 166149, 465152, 437638, 460833, 483845, 260158, 197792, 317363, 743507, 551636, 650172, 380212, 314974, 438735, 255040, -114746, -58513, 285010, 116844, 344665, 458329, 538183, 324364, 358043, 212913, 129614, 219588, 205958, 483859, 263392, 213618, 475059, 716320, 266820, 467081, 527647, 200979, 465750, 482509, 60381]
16194A29380C4171K28491J0102K36632a93238I870M14403B07820J52487k3055
16184C37252m8192J10201q8724m0356r8684M55796B33987K23678j67393q7682
16174B02590l9039L02822k6456I8152J29178H1771L72121C440K29683q6088P4600
16163B21635I7752b6361A22585J12501e1256A93905n1497K0148J56743e396B01814
16151A31260L67893B38731l3129K94994a05896D16815o7177G1575J20232K69268
16141D61075j60421J7774j51794J37016L4116A53345E7900M47153A97932a7752
16130F2113J89151a15909A06024k403E0282k4751L64545a1115E7875O2870J91533
16119C12278n7752e3472A15543L6223K96985A46188K15230m6480j19248F4950
$$ y = [129380, 34171, 262662, 272764, 509396, -193238, 9870, 424273, 207820, 360307, 337252, 289060, 399261, 310537, 270181, 171497, 627293, 233987, 457665, 290272, 202590, 163551, 466373, 439917, 98152, 227330, 81771, 453892, 3440, 233123, 147035, 221635, 97752, -26361, 122585, 235086, -51256, 193905, 142408, 162556, 319299, -5396, 201814, 131260, 499153, 238731, 205602, 500596, -105896, 416815, 349638, 71575, 191807, 461075, 300654, 318428, 166634, 303650, 337766, 153345, 57900, 505053, 197932, -17752, 62113, 251264, -115909, 106024, 103621, 50282, 25531, 390076, -11115, 57875, 120745, 312278, 254526, -53472, 115543, 151766, 448751, 146188, 361418, 314938, 195690, 64950]
16108e6289C49786A09523d9305D8268Q9713d8478C86958c2708A60366J60196m1322
16097B79240J5276j42668b26556C64111A64650k0014j2112H301h814C41744c9623
16085E15873A55854n9779L1066L9910B088c0708A71931o7713L6486a22271A73259
16073B4946C276Q284a03292A81747K81025f3360A50286K13318j70793p2564M45305
16062E65552j69867B9263j2053J88217l3019B4886A967b13474D09782j40006M1537
16051C11313j07343H2830b8507k0465B5070J68546K7820J56381K9192E3833J82211
16040B36044c0498l5462C10101j35127d0226B82521j06253G2555J6788q422N1416
16029A32337C1987a94204A53765b12027C57290A19646N8388A7640O1704J88644
$$ y = [-56289, 349786, 109523, -49305, 48268, 137981, -48478, 386958, -32708, 160366, 320562, 279240, 294516, 151848, -226556, 364111, 164650, 144636, 132524, 8301, -8814, 341744, -39623, 515873, 155854, 96075, 127141, 167051, 2088, -30708, 171931, 104218, 140704, -122271, 173259, 24946, 3276, 11560, -103292, 181747, 462772, -63360, 150286, 363604, 192811, 120247, 565552, 395685, 29263, 17210, 205427, 172408, 24886, 1967, -213474, 409782, 269776, 311313, 203970, 82830, -28507, -48972, 25070, 193616, 221436, 377817, 407009, 53833, 236044, -30498, -65960, 310101, 174974, -40226, 282521, 176268, 72555, 89343, 80921, 132337, 31987, -194204, 153765, -212027, 357290, 119646, 178034, 17640, 79344, 267988]
16019B67988J67937G3716D3K17170i930G8633P7629l4237a56555e9017B58505
16007c5396C33921n9319M8719c97039d2205A5080a39735j5792e7185g679D06960
15995H1616K07920A11053A792J38558J34187J09322q927M03937k5880M28824O27542
15984A809355j88832k43791m13409m33767i9070r059B91856E7595J7151P2826
15974A47572J43027a6409B49923b0391K192p0022D8967g9296o0354n1970F0163
15962A21493J8359J90046j41691a45153o9806B71104h7579b3120A02698J39846
15952B42544K6770A0311b0064k81094e2545f63j26941B25474f8478A08312C8033
15940a59776C97201b96967C17693c027j93196A28570A085K05788l295J26412r7064
$$ y = [267988, 435925, 73716, 43, 217213, -9930, 78633, 156262, 122025, -156555, -59017, 258505, -35396, 333921, 274602, 323321, -397039, -42205, 15080, -139735, -155527, -57185, -7679, 406960, 81616, 289536, 111053, 1792, 140350, 274537, 383859, 374932, 778869, 752989, 1181813, 1809355, 1620523, 1376732, 963323, 529556, -99070, -108129, 291856, 57595, 74746, 147572, 290599, -16409, 249923, -20391, -18199, -88221, 48967, -79296, -139650, -191620, 60163, 121493, 139852, 329898, 188207, -145153, -214959, 271104, -87579, -23120, 102698, 242544, 269314, 10311, -20064, -301158, -52545, -663, -127604, 225474, -68478, 108312, 38033, -159776, 397201, -296967, 317693, -3027, -196223, 128570, 1085, 206873, 203578, 329990, 232926]
15929B32926b6395D27199I2929b27076D6008K0069K0211J20195b55518B58698
15918b72577a15148j02427a1927k8148j06053H3641a08838D67869H7864a84231
15907A0322J41790o7803J53284a11737A34711m7487d98826B61074a74445a2784
15896c4131k09965B49199q7479b02170k1098B15628a57493A26877M8570L2487
15886B07934a10413C4790J01942A6724J56739G2291b86606A80611A6483J21368
15876A37851a38228A51128c0233k64531L4424A88896I3599D0554J17171G576a31586
15864b00646Q0254C9038L5237a66848H3973d4633o3903d3619p5992j50297R7950
15853a71958p9074b0610I6074J44238M6409l9916I3081E007K06803a66584A56347
$$ y = [232926, -26395, 427199, 92929, -227076, 46008, 66077, 86288, 206483, -255518, 258698, -272577, -115148, -217575, -11927, -40075, -146128, 83641, -108838, 467869, 87864, -184231, 10322, 152112, 84309, 237593, -111737, 134711, 87224, -498826, 261074, -174445, -12784, -34131, -244096, 249199, 161720, -202170, -223268, 215628, -157493, 126877, 175447, 207934, -110413, 34790, 136732, 16724, 173463, 72291, -286606, 180611, 16483, 137851, -138228, 151128, -30233, -294764, -260340, 188896, 93599, 40554, 157725, 7576, -131586, -200646, -120392, 39038, 74275, -166848, 83973, -44633, -108536, -43619, -119611, -269908, -171958, -251032, -20610, 96074, 240312, 286721, 246805, 93081, 5007, 211810, -166584, 156347]
15841B08929o0997o4823K56753H3895I931a03188A46331a66392G8538C0558b52933
15829c25248b3210j70484A15437P0552q3608h9523c624m15985a72018B87917j14798
15818A73119h9362L5703C4802j0561N6937K22661c05489J16765A34232B3389h252
15806G2940J05926a23101J6525B42045k1436D8728a96774c1977I1751h5675A22267
15794f3094H3297b59197f6988A67317F3597L0175j9715R5714a44466p272f2030
15782F0181g9150k86124A85190c48318G5845i920B58922G0951A2281a37795j0838
15771a48633A08136d0492j79086I1583C012c11584J51587L0008R833F8746c586
15759F900P4331g712E07887A25438b66135n1802C57330g3677F5608a27023A12032
$$ y = [208929, 147932, 83109, 339862, 83895, 9931, -103188, 146331, -166392, 78538, 30558, -252933, -325248, -23210, -193694, 115437, 185989, 102381, -89523, -3624, -419609, -172018, 287917, 173119, -89362, -53659, 34802, 24241, 81178, 303839, -305489, -188724, 134232, 23389, -8252, 72940, 178866, -123101, -106576, 242045, 220609, 48728, -196774, -31977, 91751, -85675, 122267, -63094, 83297, -259197, -66988, 167317, 63597, 93772, 74057, 169771, -144466, -151738, -62030, 60181, -79150, -365274, 185190, -348318, 75845, -9920, 258922, 70951, 12281, -137795, -148633, 108136, -40492, -219578, 91583, 3012, -311584, -159997, -129989, -120156, 68746, -3586, 6900, 81231, -7712, 507887, 125438, -266135, -317937, 357330, -73677, 65608, -127023, 112032]
15747e0914j40710B45237J41850b3245A65571n6461D5510a70247D9189a28663
15736a74070B31048k6966b62021g9510C2703c0743G051J2777a32123l0575G5676
15724b87423B26664b65990h4368b9724m44256J11661Q4716c5378D8616k2106a96265
15712a66770g7307F9160j6117e14411a07962M5019J3564F4590i9023B33656f579
15700e6594j7231b2837A65671k8207c4453k81494h3697O959B00493I3931c6206
15688a01939B96711n7608l8633a80729L6194C6795f8415j54906D35066F3048i9751
15676B91739b7383B20805a75760Q0988M6183j54742g1085o1967a8116j34685j26803
15665b79604E5468c48084j86148i3518m3641m1362O105K9306F4142a15401J0047
$$ y = [-50914, -191624, 245237, 387087, -23245, 165571, 109110, 45510, -170247, 49189, -128663, -174070, 231048, 204082, -262021, -79510, 32703, -30743, 7051, 19828, -132123, -162698, 75676, -287423, 226664, -265990, -84368, -29724, -473980, -362319, -277603, -35378, 48616, 26510, -196265, -166770, -77307, 69160, 53043, -514411, -107962, -62943, -49379, 64590, -99023, 233656, -6579, -56594, -73825, -22837, 165671, 137464, -34453, -315947, -83697, -76738, 200493, 93931, -36206, -101939, 296711, 239103, 200470, -180729, -144535, 36795, -68415, -223321, 435066, 63048, -99751, 291739, -27383, 220805, -175760, -94772, -48589, -203331, -71085, -133052, -18116, -152801, -279604, 55468, -348084, -534232, -93518, -137159, -178521, -172416, -143110, 64142, -115401, -105354]
15654a05354J5286k02335B7389J75668c4365C8758b5737j74005A49316A0196f730
15642a33887B18557A00261J30721G3180l6199b28365A64507f917k3529H9107b54243
15630b07409i0350c2383J4101h233l901k51727A8271J02668a13800C78668b24710
15618C4326K9277c16100Q7927M1140d2339A47738C4211a58259n0307f3124k24226
15607b87350a38843k15797B80550a24175j69544A59498A2870J58052a30947B00175
15596F9684b70251A42748J32277m5243b2253C9390a10088A62608G9313J23721
15586B03034a25862I572g8007p7533e5984k5955M010C81026a0173B12394i5468
15574B66003h4457j20713O9229H919J84625n7008K4779i1975A39506J61230a16460
$$ y = [-105354, -90068, -292403, 27389, 203057, -34365, 38758, -25737, -199742, 149316, 10196, -6730, -133887, 218557, 100261, 230982, 73180, 36981, -228365, 164507, -6917, -30446, 89107, -254243, -207409, -90350, -32383, -18282, -8233, -12134, -263861, 18271, 120939, -113800, 378668, -224710, 34326, 63603, -316100, -228173, -187033, -42339, 147738, 34211, -158259, -208566, -63124, -287350, -138843, -354640, 280550, -124175, -293719, 159498, 12870, 170922, -130947, 200175, 69684, -270251, 142748, 275025, 229782, -22253, 39390, -110088, 162608, 79313, 203034, -125862, 9572, -78007, -155540, -55984, -81939, -77929, 381026, -10173, 212394, -95468, 266003, -84457, -205170, -135941, 8919, 193544, 136536, 161315, -91975, 139506, 300736, -116460]
15562a95969B58152K29809A3105a25286I247a29980A66319b44734B3828e2781
15551G0411j5258J5075e2052A83170a55056p9140A42036a41817M308P053B36719
15539A13345b15066B15216h9602j42349A33910n6829a55045k03482D2414P016
15529D9430L31353H417J3477O9258b03711E346K16619k8167a87285i1831C64721
15517a52178D2057e0205B91094m6576a13602C9990Q5357K7561J39160I3667J19503
15506B13170Q5557K6592g4178A7088K80521A37416O6402D5046Q2702K93750q4010
15495C37488m8119a90925H5078L55303l4022B7329J51063o7672b1967E65782B19477
15483f3850O295C94988A90170O9028j20437P2027Q131K90220K12955J72647j07696
$$ y = [-195969, 258152, 487961, 13105, -125286, 9247, -129980, 166319, -244734, 23828, -52781, 70411, 55153, 70228, -52052, 183170, -155056, -234196, 142036, -141817, -137509, -130456, 236719, 113345, -215066, 215216, -89602, -231951, 133910, 77081, -155045, -358527, 42414, 49430, 380783, 8417, 21894, 91152, -203711, 5346, 221965, 193798, -187285, -91831, 364721, -152178, 42057, -50205, 291094, 244518, -113602, 39990, 125347, 152908, 292068, 93667, 213170, 298727, 325319, -74178, 17088, 297609, 137416, 203818, 45046, 127748, 421498, 337488, 289369, -190925, 85078, 440381, 406359, 27329, 178392, 110720, -21967, 565782, 219477, -63850, -57555, 394988, 190170, 259198, 138761, 210788, 218919, 509139, 722094, 894741, 787045]
15472G87045l69859o8574J1089j20330c06098M9749A27212c06552G2502b7643
15461A61759B5913P3027b8208B59507e5324A44575b62999R5094C6741a00017d4403
15449a65357E29764F0803P7451C3217J15783N59629N11114J80053N58364q35458
15439A122702l59837A93249K82287A28996n8792B9800a24522M3536B02889O5982
15429B68871j28544E1731n387g91B21633K93809a57433E4544b08383O8741N4833
15418h4809a0527G3928a61347D7248Q0858L560g8427K1866A10194M2234o3480
15407H8948J2807c6191F7681d5184p3038J7315a6469n5808A11722l3467m603b06024
15394a65835J6695A29424n6190P1366g570A0491M22959H0330K69277F0732J7827
$$ y = [787045, 417186, 348612, 359701, 239371, -306098, -256349, 127212, -306552, 72502, -27643, 161759, 25913, 98940, -28208, 259507, -55324, 144575, -262999, -167905, 36741, -100017, -44403, -165357, 529764, 60803, 138254, 33217, 149000, 708629, 1219743, 1399796, 1958160, 1122702, 762865, 193249, 475536, 128996, 70204, 29800, -124522, -80986, 202889, 268871, 140327, 51731, 46344, -791, 221633, 515442, -157433, 54544, -208383, -139642, -84809, -10527, 73928, -161347, 47248, 128106, 131666, -78427, -56561, 110194, 152428, 88948, 101755, -36191, 67681, -45184, -118222, -100907, -16469, -72277, 111722, 78255, 73652, -206024, -165835, -149140, 129424, 73234, 144600, -7570, 10491, 433450, 80330, 349607, 60732, 78559]
15383G8559l3942a81411A8179q774f2468A12992o600b0431A51444a6815B2733
15371D27224J24038B23242C1768k767f9789C08374F9542K03181J72893E6332J13873
15360A70205J65020k6271K04729p5398Q6189A33128J77118R2179j23301R0492
15350C69616E6431O64M21600E4059M52719A6120J40474N56943j06186k73336r781
15339C24234H1055L76773f2315D27272J606j96328j12828O192b69753D13604F3019
15327C94853J10594A28810K0379R9445r5789D8285L52141A18945J61116P138a8021
15315A1842L09209I5646a69434B0899a2004A78956p2024L91598K4687k36028e0502
15303B0244J55817N4081d8451F4472f3546B38829a3127C83985r6780D4763J17795
$$ y = [78559, 44617, -181411, 18179, 9405, -62468, 112992, 106392, -20431, 151444, -16815, 22733, 427224, 551262, 223242, 31768, 29001, -69789, 308374, 69542, 272723, 445616, 56332, 170205, 335225, 308954, 513683, 438285, 524474, 133128, 310246, 402425, 279124, 369616, 56431, 57095, 478695, 54059, 506778, 16120, 156594, 713537, 607351, 334015, 324234, 81055, 457828, -62315, 427272, 428878, 232550, 119722, 125914, -269753, 413604, 63019, 394853, 505447, 128810, 149189, 248634, 152845, 48285, 400426, 118945, 280061, 287199, -18021, 11842, 321051, 95646, -169434, 20899, -12004, 178956, 106932, 498530, 523217, 287189, -50502, 20244, 176061, 230142, -48451, 64472, -63546, 238829, -13127, 383985, 287205, 44763, 162558]
15292A62558c6408H7838a89427N2870j08032A47733a18066Q982c8524B28655b44210
15280A10878d5476l3828E0165a62122B30L59768A29931c5952C02108G1327a19286
15268I5403C0093J2568d66862g2317H3110O2542j078B3222b26470J3467e714o6575
15256g2289o1065O5389j87575a6122A12810K5148a63517E21991d1595B3058M59115
15245D82173J6796m1434M9250J7004J150797k82416N45248j14477F92670j79300
15235E13370h0290B11874m3110m2251K9875b02686B72996h7497c5248l4363A95242
15223G1536l480a59728A55857n4588N022b00457A46947a18084C2484K92091G5745
15211b8531E00965j96792A20548b27984f1011m0892A7548L36517j58847E4789
$$ y = [162558, -36408, 87838, -189427, -136557, -244589, 147733, -118066, -109084, -38524, 228655, -244210, 110878, -45476, -79304, 50165, -162122, 230, 359998, 129931, -35952, 302108, 71327, -119286, 95403, 30093, 42661, -466862, -72317, 83110, 145652, 144574, 23222, -226470, -213003, -5714, -72289, -133354, -67965, -255540, -16122, 112810, 137958, -163517, 521991, -41595, 23058, 482173, 498969, 457535, 506785, 523789, 1674586, 1392170, 1937418, 1822941, 692670, 513370, -80290, 211874, 168764, 126513, 156388, -202686, 272996, -87497, -35248, -69611, 195242, 71536, 68056, -159728, 155857, 101269, 106291, -200457, 146947, -118084, 32484, 324575, 75745, -28531, 500965, 304173, 120548, -227984, -61011, -101903, 17548, 354065, 195218, 54789]
15200a36179A26851K8997J68746R6899D6398a99080B4812O6963a70158d937q0116
15189h5053B17126N5069E6460a84556e5581A07262N1433n5202c491A72074J6565
15178A88639J36692l2415A44625l5496i6105K3451K779j19469P1827q4928A99132
15166A82356q0054J7427c5963p0985B32866B5469A353L78687I2375P8531Q3562
15155B54468F3370Q5755h2270A28742C3422j2343J45073I9f5592D5392J00818
15144A46210g6369C00164f4725n5812D61232A67145o0569b91543e4444H59J55015
15133A55874K01944j24632a38252D43694b11558h0547E9710L11291O9630B4350
15122D31194j05505O5254n1137D2557J04257M60190B40188a22303B27379d4094
$$ y = [-136179, 126851, 155848, 324594, 421493, 46398, -199080, 24812, 91775, -170158, -4937, -85053, 217126, 272195, 56460, -184556, -55581, 107262, 158695, 103493, -3491, 172074, 188639, 325331, 292916, 144625, 109129, -96105, -72654, -69875, -189344, -117517, -202445, 199132, 182356, 102302, 119729, -35963, -106948, 232866, 25469, 1353, 380040, 92375, 170906, 254468, 63370, 149125, -82270, 128742, 33422, 21079, 166152, 99, -65592, 45392, 146210, -76369, 300164, -64725, -120537, 461232, 167145, 106576, -291543, -54444, 859, 155874, 357818, 233186, -138252, 443694, -211558, -80547, 59710, 371001, 440631, 24350, 431194, 325689, 390943, 339806, 42557, 146814, 607004, 240188, -122303, 227379, -44094]
15111F3780J10326c2853B10886G5973g607H649N1515i8289F9391J03131J45650
15100C18172j25867k2534d6808n396I4195m847a13606n088I7756N4940f4254D13891
15087B43109l5288g5689C03186j38931J7202J01020q7818J42982D1344P6408K97751
15076D15503b748A61072l8719n6399P5659N0978d1114C76698q8254L7667J27677
15065D53788J28090b1798A84983m5526P3432K20780j55051K01730j42334J76780
15055E14794j42895J02369A89938M8943p2203L1503K76759j72435O06931A89695
15044B69869M3999K748m8944K73002B69978K20603N8259A50050L59259j40237
15034C69072N7776R2408n3375M39608p035l06403K18551j10178J03075C93462
$$ y = [63780, 174106, -32853, 210886, 75973, -7607, 8649, 60164, -98289, 69391, 172522, 318172, 192305, 169771, -46808, -52204, 94195, 89348, -113606, -118694, 97756, 152696, -64254, 413891, 243109, 207821, -75689, 303186, 164255, 181457, 282477, 194659, 337641, 41344, 117752, 415503, -2748, 161072, 122353, 65954, 141613, 192591, -41114, 376698, 288444, 326111, 453788, 581878, -21798, 184983, 139457, 212889, 433669, 278618, 480348, 338014, 514794, 371899, 474268, 189938, 238881, 166678, 198181, 474940, 302505, 909436, 189695, 269869, 313868, 316616, 267672, 540674, 269978, 490581, 548840, 150050, 509309, 369072, 426848, 519256, 465881, 905489, 898454, 592051, 810602, 700424, 803499, 393462]
15023E55236j91880Q1136M79001j7285J0261m16918k10952n9836M4339K43171
15013E16273G8572L36743r642K65562k32711K11706k53874n4558J14829j63298
15003B93329M7087K8382J17309K00319p9933N1403j49754k14734M10590B44343
14992B90241L38408M880j50912K01839j16715L3713p1730O2898k50444N27558
14982H69736K25871J49992l29991J79710D84855M93030C97688L39224l43211L23507
14972G17208J26321l22966J72269j47411O4772k87009K54783B29060N17518B75977
14961D62303n3853A79397K11386K74143B40773L46010P2634l07233j8058J51002
14951D85128j35257J06819J92449j13028k1913j89529L37074K70474l49459N9223
$$ y = [555236, 363356, 444492, 923493, 906208, 916469, 499551, 288599, 228763, 273102, 516273, 78572, 415315, 405673, 671235, 438524, 650230, 396356, 341798, 456627, 293329, 340416, 368798, 486107, 686426, 606493, 657896, 508142, 293408, 703998, 244343, 290241, 628649, 633529, 482617, 684456, 567741, 601454, 529724, 592622, 342178, 869736, 1095607, 1245599, 915608, 1095318, 484855, 977885, 397688, 736912, 393701, 717208, 843529, 520563, 692832, 545421, 610193, 323184, 577967, 229060, 746578, 275977, 462303, 408450, 179397, 390783, 664926, 240773, 586783, 659417, 352184, 334126, 485128, 349871, 456690, 649139, 536111, 514198, 324669, 661743, 932217, 582758, 641981]
14941F41981B21391L57159B87984K13523J3474n0810K16838J22353J04142J20527
14931A028031M09838k45529K77238j78782R7148M62862O74131n41865k99485P9784
14921A763371K77519j81995O98316L84925m7806l94827l43542l56630N2274n28152
14911A323453k71703D84155L03247l79039A02423K31746P4272M4155q0964L36122
14901G07754B72565r3832J99898j1261j59189O4511o8547K78137j43962R0735
14891D29055K06016B97355M50816l5613J11334K88919K202j26494j28906J66130
14881A025743K87439l21852P7762C96853k8250M09876j46095j10078m1537j12097
14871C68672r9855M80735p9179k38645N79290J3667j12841l80529j54024R0762
$$ y = [641981, 221391, 578550, 287984, 501507, 514981, 464171, 681009, 803362, 907504, 1028031, 1437869, 1192340, 1469578, 1290796, 1387944, 1850806, 2524937, 1983072, 1683587, 1763371, 2040890, 1858895, 2557211, 2942136, 2894330, 2499503, 2155961, 1799331, 1851605, 1323453, 1051750, 484155, 787402, 408363, 102423, 334169, 408441, 452596, 371632, 707754, 272565, 178733, 378631, 367370, 208181, 272692, 204145, 482282, 338320, 429055, 635071, 297355, 748171, 712558, 823892, 1112811, 1115013, 988519, 859613, 1025743, 1313182, 991330, 1069092, 396853, 368603, 778479, 632384, 522306, 480769, 368672, 268817, 749552, 670373, 431728, 1011018, 1024685, 911844, 531315, 377291, 468053]
14861D68053R7770r7075K7623k16722J64831K61508A64735J72784K27227J56361
14851G21107k45369m2180J5570J34019K33533K42441J12170J95616J15853m00602
14841A082158J35872k06185J7606l79381M53657k06865P3088j58463j75686k45290
14831C90511K19491k95409N3335J90680K59313k7086C91523M31410l8186J32374
14821I17121l71503M25208k65566L00278j06446n8159N9261k0463l74460K15904
14811G21175K48573q6828j95665j88084P13106J42671k65107l95723J32972l33694
14801D93396B29082J30711K43134p9099L2181J26822l31921J99492J34982j58899
14791E26485k21977K67419K01978m1485j21111k9005N6676P7560p0207o7863J15821
$$ y = [468053, 565823, 468748, 496371, 279649, 444480, 705988, 164735, 337519, 564746, 721107, 475738, 433558, 449128, 583147, 816680, 1059121, 1171291, 1366907, 1482760, 1082158, 1218030, 1011845, 1029451, 650070, 1103727, 896862, 969950, 811487, 635801, 390511, 610002, 314593, 367928, 558608, 817921, 790835, 391523, 822933, 784747, 917121, 545618, 970826, 705260, 1005538, 899092, 840933, 900194, 879731, 505271, 721175, 969748, 882920, 687255, 499171, 1212277, 1354948, 1089841, 694118, 827090, 493396, 229082, 359793, 602927, 523828, 556009, 682831, 350910, 550402, 685384, 526485, 304508, 571927, 773905, 732420, 611309, 582304, 638980, 716540, 646333, 578470, 694291]
14780F94291M3443R9887q5961K25695J64011j01788k17551J15598k92461B04843
14769F01096j52714K00011o5919o1249j10110R0140O850J32845J01829k57635
14759D85144j37337M41846j37133q7621j55191M8709J69061j67226p079K08899
14749F62072K5126j66191N99385m81045L60763j99860p3480L4485j18982P8947
14739G21220R2678k52645L66134M6487r896J59589p6354K3994K61138J5183N19763
14728A867291N47741q7001m68006l42283k64048k7078m35570R4161o7808j86985
14718F30414J57058j71352l3848L08725j11653K59945k50015L65057o6134l3018
14708A055179K38431L1248q8114J90672N69568J20946J72067k68427l13578j52689
$$ y = [694291, 737734, 837621, 751660, 977355, 1141366, 1039578, 822027, 937625, 645164, 204843, 601096, 448382, 648393, 582474, 521225, 411115, 501255, 508105, 640950, 742779, 485144, 347807, 789653, 652520, 564899, 409708, 458417, 627478, 460252, 453173, 662072, 687198, 521007, 1120392, 639347, 1000110, 800250, 726770, 761255, 642273, 721220, 813898, 561253, 927387, 973874, 963978, 1123567, 1047213, 1071207, 1332345, 1347528, 1867291, 2415032, 2328031, 1860025, 1517742, 1253694, 1226616, 791046, 885207, 817399, 630414, 787472, 616120, 582272, 890997, 779344, 1039289, 789274, 1154331, 1088197, 1055179, 1293610, 1324858, 1236744, 1427416, 1996984, 2117930, 2289997, 2021570, 1707992, 1555303]
14698A555303j67040k71502k08662L36256l49958L88135k68530K1086m26386J99225
14688H07927k278J07971j35233J27763Q8265P2763k07588l2866K56165o5906k627
14677A014356l51898L01788R9051k18804M12333o2046l42102j49337M51911j25537
14667A029715j65635k8209J54607o3468J59647K37250n38661K78395j87545M41002
14657A317098l29890j34266P1955M80697j33816J6334j664R5898l23953j57211
14647I01182K88666K67727o41088L33824k27483K25343o5418L0810J99788j75166
14637A138185k18077M39857k07800l1332j5124j08448J87718j06991K57325n7804
14627A277509k19388k3876M20861l0403k50288L25783k14210l3042m303K16049
$$ y = [1555303, 1388263, 1116761, 908099, 1244355, 894397, 1282532, 1014002, 1035088, 608702, 807927, 805649, 913620, 778387, 906150, 994415, 1067178, 859590, 826724, 1082889, 1016983, 1014356, 662458, 964246, 1063297, 844493, 1256826, 1194780, 852678, 703341, 1155252, 1029715, 864080, 835871, 990478, 927010, 1086657, 1323907, 785246, 1063641, 876096, 1317098, 987208, 852942, 924897, 1405594, 1271778, 1288112, 1286448, 1382346, 1058393, 901182, 1189848, 1457575, 816487, 1150311, 922828, 1148171, 1082753, 1113563, 1313351, 1138185, 920108, 1359965, 1152165, 1120833, 1105709, 997261, 1184979, 1077988, 1335313, 1277509, 1058121, 1034245, 1455106, 1424703, 1174415, 1500198, 1285988, 1252946, 1248643, 1464692]
14617A464692l42589j52608O82637j54496o1163O2519q5744K42238k70595J63555
14607A548446j19533Q0526q0909j20628P2226J15172P2571K10007m20764J98779
14597A555893j09510m942R7900j79169m1486K69941j36867J17879L77093m74826
14587A471906L5141L4292J04173J18822m40974O60206o7173j77324J8743J78295
14577A936107j26940Q3992M4084K98213l31300K46162J54176k07949k03733O17776
14567B510588l85802P7599J38957j72133o5446k6409n4445K20429O56328m46069
14557B453597P40495j12061k3693j51649K52388O83595M91070L03513J619706
14548F256961L520941R288776J9173855O835169B1468609I047824D463299j367326
$$ y = [1464692, 1122103, 969495, 1652132, 1497636, 1436473, 1498992, 1413248, 1655486, 1384891, 1548446, 1428913, 1509439, 1428530, 1307902, 1380128, 1495300, 1567871, 1777878, 1357114, 1555893, 1446383, 1441441, 1539341, 1360172, 1318686, 1588627, 1451760, 1569639, 1946732, 1471906, 1507047, 1541339, 1645512, 1764334, 1323360, 1983566, 1916393, 1739069, 1757812, 1936107, 1809167, 1893159, 1937243, 2235456, 1904156, 2150318, 2304494, 2096545, 1892812, 2510588, 2124786, 2202385, 2341342, 2169209, 2103763, 2077354, 2022909, 2243338, 2899666, 2453597, 3194092, 3082031, 3058338, 2906689, 3159077, 3842672, 4333742, 4637255, 6256961, 9777902, 19066678, 38240533, 45075702, 21468609, 9047824, 4463299, 3095973]
14540C095973p30931l5490P05645J535050L82936j893620o55573l01767j57136
14531A945087j66296K82235L6420P6485j55934L49593p8976J4858j2587j50203
14521B140682J6397J47707M89874k94469k17869l0831J91501n8907J24314p6917
14511B431482M44338k13130K06349k02368R2995Q3276J69684q4820J22715R4194
14501C144715q2820J3933J04427J29579l63183j32947M01434J9974J62581l8818
14491C358875J10704o7443j97076J04359k4135N23989l51956P9374l0687K9528
14481C535532K92467J48202J81311m01961J13422K49463k86917L55280O523J37525
14471D330847k58926K10580j69710Q3950L88624l23817j3384K57980L37747j79837
$$ y = [3095973, 2365042, 2329552, 3035197, 4570247, 4953183, 3059563, 2403990, 2102223, 1945087, 1778791, 2061026, 2097446, 2173931, 2017997, 2367590, 2288614, 2303472, 2290885, 2140682, 2157079, 2304786, 2794660, 2500191, 2282322, 2251491, 2442992, 2384085, 2508399, 2431482, 2875820, 2662690, 2869039, 2666671, 2759666, 2842942, 3012626, 2927806, 3050521, 3144715, 3061895, 3075828, 3180255, 3309834, 2946651, 2813704, 3215138, 3235112, 3397693, 3358875, 3469579, 3402136, 3205060, 3309419, 3285284, 3809273, 3457317, 3536691, 3506004, 3535532, 3827999, 3976201, 4157512, 3755551, 3868973, 4118436, 3831519, 4186799, 4193322, 4330847, 4071921, 4282501, 4112791, 4196741, 4585365, 4261548, 4248164, 4506144, 4843891, 4664054]
14461D664054k07554L28266J21439j85305M85584k49712j42294L03498j46950
14452D971026L72325p0478j26698K86807k67439M85320O4671O0001Q0020l26291
14442E529264M6070N10085j80886L2018K58613R0269J05702J92870k31753J50985
14432F503237L3948J10301L83947j41181J96115J79898k41148O55625O3621M27374
14422H171737k07557K99310K73878k48454J26833l31331J90577N96710j71310
14413H700393q9432J63522O24888j54576K52840K28043J74284M3017K51959l78808
14403I816130N05088k79314K25534K25291J24934L30976J15445K49232M2226J45813
14393A1501355J99864L32994r3084K26767K24006K07183Q10492M3225O6409M87148
$$ y = [4664054, 4456500, 4784766, 4906205, 4720900, 5206484, 4956772, 4814478, 5117976, 4971026, 5343351, 5272873, 5146175, 5432982, 5165543, 5650863, 5715534, 5775535, 5855555, 5529264, 5575334, 6085419, 5904533, 5936551, 6195164, 6285433, 6391135, 6584005, 6352252, 6503237, 6537185, 6647486, 7031433, 6890252, 7086367, 7266265, 7025117, 7680742, 7744363, 8171737, 7964180, 8263490, 8537368, 8288914, 8415747, 8084416, 8274993, 8871703, 8700393, 8610961, 8774483, 9399371, 9244795, 9497635, 9725678, 9899962, 9942979, 10194938, 9816130, 10321218, 10041904, 10267438, 10492729, 10617663, 10948639, 11064084, 11313316, 11355542, 11501355, 11701219, 12034213, 11941129, 12167896, 12391902, 12599085, 13409577, 13452802, 13519211, 14006359]
14383A4006359L36258j88573O19820J53060K1610M24424n1700j1629M87294N01940
14373A6298863N30963K56763J27842N74662Q28104o6190L23666N31892O7748P75880
14363B0250193M51295J01038L22233O25223M85203M58413M77770O56722M56860
14354B4284950N04112N82901N99074Q39169O97199P33407Q36051K07780R73068
14345C0257711J114835P36754N61101J028949R31211R28708J100763R83244J117020
14336C8760296J249434P67986J536423J024088J425855J678812J355468J346896
14328D9145258J546578J880651J559404J947998J879165K248427K171335K301288
14320F4680104K199134K046504K653411K531326K764371L046719K995686L177404
$$ y = [14006359, 14342617, 14154044, 14773864, 14926924, 14948534, 15372958, 15321258, 15309629, 15796923, 16298863, 16829826, 17086589, 17214431, 17789093, 18617197, 18551007, 18874673, 19406565, 19474313, 20250193, 20701488, 20802526, 21124759, 21749982, 22235185, 22693598, 23171368, 23828090, 24284950, 24789062, 25371963, 25971037, 26810206, 27507405, 28240812, 29076863, 29284643, 30257711, 31372546, 32109300, 32670401, 33699350, 34630561, 35559269, 36660032, 37643276, 38760296, 40009730, 40777716, 42314139, 43338227, 44764082, 46442894, 47798362, 49145258, 50691836, 52572487, 54131891, 56079889, 57959054, 60207481, 62378816, 64680104, 66879238, 68925742, 71579153, 74110479, 76874850, 79921569, 82917255, 86094659]
14312H6094659L439949M005799L410917M321880M407328M644276M803964N346333
14304A20475105N629608N667554N900600O548906O792309P329568P774485Q156592
14296A74274727Q575603R275902R620440J0401098J0776205J1592851J1798331
14289B46315157J2037501J3145260J3825416J4081954J4267016J4913694J4753624
14282C43339622J5439346J5041210J4383996J4280192J3711658J2615078J1172029
14275D39983131R660886P535129N064182Q73801l339142n359117l922844m866108
14267D45629918m812971p552545j0699594j2171881j3539734j4786165j5214220
14260C66852808j5725783j6009216j6056719j5191254j4906777j4649166j3433678
$$ y = [86094659, 89534608, 93540407, 96951324, 101273204, 105680532, 110324808, 115128772, 120475105, 126104713, 131772267, 137672867, 144221773, 151014082, 158343650, 166118135, 174274727, 182850330, 192126232, 201746672, 212147770, 222923975, 234516826, 246315157, 258352658, 271497918, 285323334, 299405288, 313672304, 328585998, 343339622, 358778968, 373820178, 388204174, 402484366, 416196024, 428811102, 439983131, 449644017, 457179146, 462243328, 463117129, 459777987, 454418870, 450496026, 445629918, 440816947, 433264402, 422564808, 410392927, 396853193, 382067028, 366852808, 351127025, 335117809, 319061090, 303869836, 288963059, 274313893, 260880215]
14253B60880215j3271398j2775278j1829207j1864217j0609130r955688p859986
14246A82715311q971128q656078p575460p442110p183340o552317o433128n841245
14238A24060505n131926n109192m993229m615376m607014m021738l779269l201403
14230H8601358l435605l744209k773356l335858k930374k081537k851009k496745
14222F4952665k280349k012566k036520j664189j851169k024637j692761j285114
14214E0105360j999592p80307j550026j491849j597571j039981j123677p50855
14206C9771502j198357r01595j465357r08835j041625o89221o50391q93471r38939
14197C1083711p88481n88926q12571o91033l97084q89724r13857m05266p15345
$$ y = [260880215, 247608817, 234833539, 223004332, 211140115, 200530985, 190575297, 182715311, 173744183, 165088105, 157512645, 150070535, 142887195, 136334878, 129901750, 124060505, 118928579, 113819387, 108826158, 104210782, 99603768, 95582030, 91802761, 88601358, 85165753, 81421544, 78648188, 75312330, 72381956, 70300419, 67449410, 64952665, 62672316, 60659750, 58623230, 56959041, 55107872, 53083235, 51390474, 50105360, 48105768, 47325461, 45775435, 44283586, 42686015, 41646034, 40522357, 39771502, 38573145, 37671550, 36206193, 35297358, 34255733, 33566512, 32916121, 32022650, 31083711, 30295230, 29706304, 28893733, 28202700, 27805616, 26915892, 26002035, 25596769, 24881424]
14188B4881424o06351m68197o77144l49213n94475l97023o05766k29038n83418
14179B0370799l20966l27662n46931n59402k80550k75446k51529m84227l75592
14170A6948494k05829k19553m37183l00840o9447n53554l31430k39804J05882
14161A4696736p09072j25159m6871n91187j35429k93622l39337K15308k19728
14152A2451639l10627j58424l90712j49005j62621O9414o31711K50742m99492
14143A0469203r7523n0811j46788M6821k60947R1404n15309l77415J96348j22861
14133I232122q2863k18497m64626J44061j69780k14325K79319o00377k5054o4439
14123G815541j83479J03212k89901r6227j36484N9814k18204N3996O5408k6288
$$ y = [24881424, 24275073, 23806876, 23129732, 22780519, 22186044, 21789021, 21183255, 20954217, 20370799, 20049833, 19722171, 19175240, 18615838, 18335288, 18059842, 17808313, 17324086, 16948494, 16742665, 16523112, 16085929, 15785089, 15715642, 15162088, 14830658, 14590854, 14696736, 13987664, 13862505, 13815634, 13224447, 13089018, 12795396, 12456059, 12671367, 12451639, 12141012, 11982588, 11591876, 11442871, 11280250, 11349664, 10717953, 10968695, 10469203, 10371680, 10320869, 10174081, 10220902, 9959955, 10051359, 9536050, 9158635, 9354983, 9232122, 9149259, 8930762, 8466136, 8610197, 8440417, 8226092, 8505411, 7905034, 7879980, 7815541, 7632062, 7735274, 7445373, 7349146, 7212662, 7272476, 7054272, 7108268, 7173676, 7147388]
14113G147388m04767K94507l07476j54610j19184r2130K66211l68310J92527l83330
14103F070826K5011l9006o2627j2496n14524j7178L03482o4331j92893J4961k15391
14092E295834K35035l58893P7105j45354j59949M33529k72443j01609j26074J04384
14082D981565m19911L17952k04977J03582l20691J63133j81902p1982K15513n97497
14072C984785N36741k16616r731j31841P1367j73119K10927J326J23985k11119
14062D186705k27482k25581P06691l80825l8295J12444j44619k26593k99156L60985
14052C824274l12589p8843Q9210k70787K09676J27792j76964j18617M48166n32816
14042C208502J07090j78005K56855j14627k47449Q463O1185q1572N6855K24990
$$ y = [7147388, 6742621, 7037128, 6729652, 6575042, 6455858, 6363728, 6629939, 6261629, 6454156, 6070826, 6095837, 6056831, 5994204, 5981708, 5467184, 5450006, 5753488, 5689157, 5496264, 5511225, 5295834, 5530869, 5171976, 5249081, 5103727, 4943778, 5377307, 5104864, 5003255, 4877181, 4981565, 4561654, 4879606, 4674629, 4778211, 4457520, 4620653, 4438751, 4366769, 4582282, 3984785, 4521526, 4304910, 4295179, 4163338, 4234705, 4061586, 4272513, 4273839, 4397824, 4186705, 3959223, 3733642, 4440333, 4059508, 4021213, 4133657, 3989038, 3762445, 3463289, 3824274, 3511685, 3432842, 3522052, 3251265, 3460941, 3588733, 3411769, 3293152, 3741318, 3208502, 3315592, 3137587, 3394442, 3279815, 3032366, 3040829, 3102014, 3020442, 3077297, 3302287]
14032C302287m41972K16962j8515o1424J77334k44307j39446k18316M27512l13687
14022B686428L23571l90853k6106M8299O6010l61652L85839j87610j31200K88907
14012B701633l16109l6440O9981K76375P3028j22843j95198l74889N60851n08465
14002B127924M14205l63160k14748K4413K14221k31225M7859k72165M43857M8684
13992B239865N8242j66923m6587R89898J517295O278768J8013582J7921260j7553832
13983B9251568j3896345o999421k028537k115531K8105m55614p12462m4967l8938
13974B987858j95445l9409n2636k5151m33523K37291k05525J54132j24895j60761
13964B141936j50147J88922o6026K37241o7286l33838R1403J42408j63935J21238
$$ y = [3302287, 2860315, 3077277, 3058762, 2997338, 3174672, 2930365, 2790919, 2572603, 3000115, 2686428, 3009999, 2619146, 2593040, 2641339, 2707349, 2345697, 2731536, 2543926, 2412726, 2701633, 2385524, 2349084, 2419065, 2695440, 2768468, 2645625, 2450427, 2075538, 2636389, 2127924, 2542129, 2178969, 1964221, 1988634, 2202855, 1971630, 2019489, 1747324, 2191181, 2239865, 2298107, 2131184, 2084597, 3074495, 4591790, 10870558, 28884140, 46805400, 29251568, 15355223, 8355802, 6327265, 4211734, 4239839, 3784225, 3071763, 3026796, 2987858, 2792413, 2753004, 2700368, 2675217, 2241694, 2478985, 2273460, 2427592, 2302697, 2141936, 1991789, 2180711, 2114685, 2351926, 2284640, 1950802, 2042205, 2184613, 2020678, 2141916]
13954B141916J4885k6600J62279l53460J95141l99609Q7059Q6899l15873J19218
13944A711855j63811L60719l07962J61120J93310j02468p1112K08533k44122p3515
13934A672547k5993L54915j83225j93106K36421k88765J2170k03011L12454J48017
13924A842424l58107j66585J23813K9129J14710j4906k9660l13000L51246k47996
13914A331068L58905n84302M72307l82276Q9780L24991j52583l1980l34636L47115
13904A438389p9237J597n6368j63539K47682O1205j72025n7595J43520R9267M7570
13893A510466M667k73550K55995l01363L94268j41500K72666m25649j76326J03412
13883A223086L30596m86381j12194J42011l6020N14872n63812J47186j81732R0333
$$ y = [2141916, 2156801, 2130201, 2292480, 1939020, 2134161, 1734552, 1821611, 1908510, 1592637, 1711855, 1548044, 1908763, 1600801, 1761921, 1955231, 1852763, 1781651, 1990184, 1746062, 1672547, 1646554, 2001469, 1818244, 1625138, 1861559, 1572794, 1584964, 1381953, 1694407, 1842424, 1484317, 1317732, 1441545, 1470674, 1585384, 1570478, 1540818, 1227818, 1579064, 1331068, 1689973, 1105671, 1577978, 1195702, 1285482, 1610473, 1457890, 1425910, 1091274, 1438389, 1359152, 1360749, 1304381, 1140842, 1388524, 1449729, 1277704, 1220109, 1363629, 1462896, 1510466, 1515133, 1241583, 1497578, 1196215, 1590483, 1448983, 1721649, 1296000, 1119674, 1223086, 1553682, 1067301, 955107, 1097118, 1061098, 1575970, 1012158, 1159344, 977612, 1067945]
13873A067945l19366K92731J93012k88916N093q4263P7217L59632k30767N0475
13863A122793M6466k52811J29814J23360l7401p0575J6768j20432q077n1639Q4806
13852I83072l9854K38035l40683J31658M47086j14636m29596K35860k6516o5322
13842A019104L3068k53295J92038P6499l41325J14437J1524J08586l40748N03869
13832A123757j23559r4478p9992M4005j19202R8497n5391j96347L46125j5081
13822I28334j44566M404J43956R8069M965K12486l21585P273J9753r125l7626
13811I06338o8586j03108J8745R6762k24090K70734M3587k03522N9697J43587
13801I40144R404j74135J86067m7257j10808k20101J81223J02314J43667l35244
$$ y = [1067945, 748579, 1041310, 1234322, 945406, 950499, 866236, 943453, 1303085, 1072318, 1122793, 1169259, 916448, 1046262, 1169622, 1132221, 1061646, 1078414, 957982, 949905, 898266, 983072, 943218, 1181253, 840570, 972228, 1419314, 1304678, 875082, 1110942, 1084426, 1019104, 1052172, 798877, 990915, 1067414, 726089, 840526, 852050, 960636, 619888, 1123757, 1000198, 905720, 825728, 869733, 750531, 849028, 793637, 597290, 943415, 928334, 783768, 788172, 932128, 1030197, 1035162, 1247648, 926063, 933336, 953089, 943964, 906338, 837752, 734644, 753389, 850151, 626061, 896795, 940382, 736860, 796557, 940144, 949548, 775413, 961480, 914223, 803415, 583314, 764537, 866851, 1010518, 675274]
13791F75274J71543l08528L70949k36154l7977j0506K09591k04940k1986K40440
13781H47706j24246K71257m2616m33111L30320j85430q9381J00017j18990O1295
13771F16821J32588k84756l5653M30646J7205M7382j66006j27810j7180k04016
13761D09221K22214B70868M94737k66149M82250l57568q3938K36771J42339C85941
13750E61763J38911P5474j36036O0862o5339J50925l22775J3077K49298k63167
13740D62993B04191K90284j66120m1164L91564l8145K1969J64278k28814J20005
13730G18048j75379J72864k4901O5855l13197J95866O1992Q9042N8576C85085
13719D76674J66530k48316J12113r5499J48803k32518L13035k7932l9246o4486
$$ y = [675274, 846817, 538289, 909238, 673084, 635107, 624601, 834192, 629252, 607266, 847706, 723460, 994717, 952101, 518990, 849310, 663880, 574499, 674516, 555526, 616821, 749409, 464653, 429000, 859646, 876851, 924233, 758227, 630417, 613237, 409221, 631435, 270868, 765605, 499456, 981706, 624138, 540200, 776971, 919310, 385941, 561763, 700674, 776148, 640112, 700974, 635635, 786560, 463785, 476862, 726160, 462993, 204191, 494475, 328355, 287191, 678755, 640610, 662579, 826857, 598043, 718048, 542669, 715533, 690632, 756487, 443290, 639156, 701148, 790190, 848766, 385085, 476674, 643204, 394888, 507001, 411502, 560305, 327787, 640822, 612890, 573644, 509158]
13709E09158j90101J65320p8370P1416L25216k84787J03582r3398L67673l78402
13699E17307A82701P11158C58379L20039k0607N7323C23547o3649O28564p9634
13689H08828j15115k2354J50725l09921j10836P6235J5089A92372K38722M1023
13679D72117J41787j76950L46144A67976N75806j15523k25770J54291J75273j06796
13669F25257J470k08911r0343M98382B61306K82398A12628L38535j99548L65693
13659F17308j61078A41473P4160L40280M1831o5473k17973J28999j73836L07121
13649E76582p0251B27565M03281m7370k78289J79083j34995I5534L72271j79067
13639B88738j28039L20055r379N4210J9207k36913L85922C10288J37957k7809
$$ y = [509158, 319057, 484377, 406007, 477423, 802639, 517852, 621434, 528036, 895709, 517307, 182701, 893859, 358379, 678418, 657811, 715134, 323547, 259898, 888462, 808828, 693713, 671359, 822084, 512163, 401327, 477562, 492651, 192372, 431094, 472117, 613904, 436954, 783098, 167976, 743782, 628259, 402489, 556780, 732053, 625257, 626727, 417816, 327473, 825855, 261306, 543704, 112628, 451163, 251615, 617308, 456230, 141473, 215633, 555913, 597744, 532271, 314298, 443297, 269461, 576582, 506331, 227565, 630846, 583476, 305187, 484270, 349275, 95534, 467805, 288738, 160699, 480754, 471375, 525585, 544792, 307879, 693801, 310288, 448245, 420436]
13629D20436l4861j34160j05699K25101j07192M09880l01241m7549J76877j86787
13619C14805k674A25745M58351j54570J05171j2978J59039A63783M44041A86056
13608D25417n2945O0598K1541j70887l0801K31267M4810A84574J70770n5414D9041
13596D75834K99528E8505L32201A74185J55369J55221b96100C98852h2436B33533
13585D22279j55097M115j29014L04350K05209A80134K08910m566J31776N9999
13575E76253e5187D21210J43209A57236J68861o7274M2906p0796m4776A7046M94320
13564E11366H0783K89129q3626J76497a07158B13564K07544I3319L03457J16405
13554E13181a50113C44416P7246F3754K90706J61783A49356N40433B77509j10005
$$ y = [420436, 385575, 251415, 145716, 370817, 263625, 673505, 372264, 324715, 501592, 314805, 312131, 125745, 584096, 429526, 534697, 521719, 680758, 163783, 607824, 186056, 425417, 372472, 433070, 454611, 283724, 252923, 484190, 529000, 184574, 355344, 299930, 49041, 475834, 775362, 58505, 390706, 174185, 329554, 484775, -296100, 398852, -82436, 233533, 422279, 267182, 271297, 142283, 446633, 651842, 180134, 389044, 384478, 516254, 576253, -55187, 421210, 564419, 157236, 326097, 258823, 301729, 230933, 186157, 17046, 511366, 80783, 369912, 286286, 462783, -107158, 213564, 421108, 93319, 396776, 513181, -150113, 344416, 421662, 63754, 354460, 516243, 149356, 689789, 277509, 167504]
13544A67504K39426K36677B27985r203a2606D12308P6145k07154m0773O2118J19073
13533D21717C3774R9459B4991L90776E4375L84113E7227K06519a6461D80205r3956
13522C86249K7068K4791J7530l4444A95233K02170I3661L10200A33655J92945
13512C26600D554K97901Q5889A24435L17674G1452J87601k5090r3691K73931A78091
13500H3834L41867n1306J19097A56174J02908L85900B66732K1370i3236C37256
13489D59885f249A10603J75790j6235J3761m6047K26331o4132F7210e6352F1490
13477D93469B06090B8636L71426A06880J4051K07812j61095J88774a03197A21281
13466A28045K55002R6134q8800r3138A18329B0394K2360M88256A89546H1475K0864
$$ y = [167504, 406930, 643607, 227985, 218782, -12606, 412308, 488453, 281299, 240526, 302644, 421717, 33774, 133233, 24991, 415767, 54375, 438488, 57227, 263746, -16461, 480205, 386249, 413317, 438108, 455638, 421194, 195233, 397403, 93661, 403861, 133655, 326600, 4554, 302455, 388344, 124435, 442109, 71452, 259053, 233963, 140272, 414203, 178091, 83834, 425701, 374395, 493492, 156174, 259082, 644982, 266732, 288102, -93236, 337256, 459885, -6249, 110603, 286393, 270158, 283919, 237872, 464203, 400071, 67210, -56352, 61490, 493469, 206090, 28636, 400062, 106880, 120931, 328743, 167648, 356422, -103197, 121281, 128045, 383047, 479181, 390381, 297243, 118329, 20394, 42754, 531010, 189546, 81475, 102339]
13455A02339Q0609J97457a11907A92492m8447I449J9963L96311A75590F5391k1786
13444D3605J61090A2704L74673N033j28342A08216L54197k6990j85548p680j8665
13433B23530J33601j52484K337J68184K517J49394a2846B7043K34778K43725j67961
13422C37585A67712M24114j34971o7214j03849d121E33070k44234c4894B05595
13411A74970p8766L59116j54979p6588L24777D9223J54912J18991M3988I9869
13400A70292K6786O6058J0483B969J45544J10393A25826B7137J12892j5317K22165
13389C46877m3716F8412D515K63524N7099q5599R1462a15007H1674K75025r601
13378C47098j22758J21361M0422j84704j340m1290l1859R9111G9588M1508c2627
$$ y = [102339, 182948, 380405, -111907, 192492, 144045, 9449, 29412, 425723, 175590, 65391, 43605, 204695, 12704, 387377, 392410, 264068, 108216, 462413, 435423, 249875, 242195, 223530, 357131, 204647, 206984, 375168, 377685, 527079, -12846, 27043, 261821, 505546, 337585, 167712, 591826, 456855, 389641, 285792, -4121, 533070, 288836, -34894, 205595, 174970, 96204, 455320, 300341, 223753, 548530, 49223, 204135, 323126, 367114, 99869, 170292, 197078, 263136, 273619, 2969, 148513, 258906, 125826, 27137, 140029, 124712, 346877, 303161, 68412, 4515, 268039, 325138, 239539, 331001, -115007, 81674, 356699, 347098, 224340, 345701, 386123, 201419, 200079, 158789, 126930, 226041, 79588, 121096, -32627]
13366A75350k3284a31610C44336A47041J10056J34635O7238A37157J54710K68555
13356E60422a35931B58448R0689j29444j3515b08943E9662A0180K98024o1560
13346B46644K3262a09267B93869A12919J72469K50231j18771E3853K95228p5080
13336B74001B6330c7100D25735p9825J85086A11001J47862j5218a21772A24252
13325E01821j65714K0768A26906J09421q1104l2355K03971L9414M113j33099R2353
13314C29620n99j24329K4522J73726j73985r7040L88754r6327G7036J41502J13911
13303C32449D0381O5840l5398R237J40759N51500a33279B80295j22993Q3765J9934
13292B61001l4295D6042L16718o8709E9148J1937c39398f590A85626O4696b7502
$$ y = [175350, 152066, -131610, 344336, 147041, 257097, 391732, 458970, 137157, 291867, 560422, -135931, 258448, 349137, 219693, 206178, -208943, 59662, 10180, 308204, 246644, 269906, -109267, 293869, 112919, 285388, 535619, 416848, 53853, 349081, 274001, 26330, -37100, 425735, 345910, 530996, 111001, 258863, 243645, -121772, 124252, 501821, 336107, 356875, 126906, 236327, 155223, 122868, 326839, 366253, 370366, 237267, 329620, 329021, 204692, 229214, 402940, 228955, 131915, 520669, 424342, 77036, 218538, 332449, 40381, 106221, 70823, 80060, 220819, 772319, -133279, 280295, 157302, 241067, 261001, 226706, 46042, 362760, 294051, 59148, 71085, -339398, -6590, 185626, 250322, -27502]
13280a21340N3991C2921O8612a11190B98846G7790J16809K6268a4004l5730A02561
13268E098J3135h492D33219J49645F2580e206A28399L1418Q2687D5961a51918
13256a04466B47341r2485K191l6330J30950G2499L11246a71057K5180C71069I4415
13244C62701b4760j91204B61357A4066N8183K34460K4182a3092C4785R5980J39403
13233B70168B2636J61944b36888D161L8268J92775f6433B4984J27836K7521P328
13222A87669H7000J09962K37650B16072J3608O8786A27714B4884e7469C05104
13211H9338J41353i8189A26022Q941a1487D5225a52881C1637a52164A32972F1111
13199B0666a0890D03865A18091J22037M4802J06302G1338f311B87295G7830K9419
$$ y = [-121340, -67349, 32921, 101533, -111190, 298846, 77790, 194599, 220867, -14004, -49734, 102561, 5098, 18233, -8492, 433219, 582864, 62580, -5206, 128399, 159817, 242504, 45961, -151918, -104466, 247341, 154856, 157047, 120717, 251667, 72499, 383745, -171057, -145877, 371069, 94415, 362701, -24760, -215964, 261357, 14066, 72249, 306709, 330891, -13092, 34785, 130765, 270168, 22636, 184580, -236888, 4161, 42429, 235204, -66433, 24984, 152820, 180341, 187669, 87000, 196962, 434612, 216072, 229680, 298466, 127714, 24884, -57469, 305104, 89338, 230691, -98189, 126022, 134963, -11487, 45225, -152881, 31637, -152164, 132972, 61111, 20666, -10890, 403865, 118091, 240128, 284930, 391232, 71338, -6311, 287295, 77830, 107249]
13188A07249J94127E4103B2843a55431G3822J9520P5048O7406h9524L0394A37804
13176H3172a01276C98664G1911k8953A2755J32899K8464k4037a00594n220e084
13164h4869J5023A84122M2537Q1161C1427J09163b65308C31257b9937j69726B48106
13152b50418g8871A21566M4156J0687m4877J357J34428G8487M5378h2633B82207
13140A70886D8692K9477K1071C1419a97673L0286A34180L8757o7753K11800I6405
13128a45238A93468f3579A40539i8294B58640e570p9556B23482K1926a20621J263
13117a19358b756G9023h8244F0639J09007a86154A67768J32629A22306J89407
13107C11713c649k9450A35549J33397j7248q2101D0328K01949d3344A39012J24406
$$ y = [107249, 301376, 54103, 22843, -155431, 73822, 93342, 168390, 235796, -89524, -59130, 137804, 83172, -101276, 398664, 71911, 42958, 12755, 145654, 174118, 150081, -100594, -105814, -5084, -84869, -69846, 184122, 226659, 307820, 31427, 140590, -265308, 331257, -29937, -199663, 248106, -250418, -78871, 121566, 165722, 176409, 131532, 132889, 267317, 78487, 123865, -82633, 282207, 170886, 48692, 78169, 99240, 31419, -197673, -167387, 134180, 172937, 105184, 316984, 96405, -145238, 193468, -63579, 140539, -98294, 258640, -5570, -85126, 223482, 245408, -120621, -119358, -2756, 79023, -88244, 60639, 169646, -186154, 167768, 300397, 122306, 311713, -3649, -33099, 135549, 268946, 251698, 169597, 40328, 242277, -43344, 139012, 263418]
13096B63418a52263b9491I5348O1264p0236Q9689G1904l2517J28136R7917A25756
13084A06275O9449c30581A09954J57434j28075F1688a06478B28689R8623L4188
13074C61500h5564C94641C8015M38140C0060J63451f2808C61046e312C40151j28483
13063B11668P6676A05056P9743P7793a73811A73491c07695B42148B9543a50639
13052A83289c9062j20940A61494D4740m867a90159A08912i9094G9788J34518H709
13040I5512b95319A02634K28727i4053j95447C70382C7850O6448e9004C628J92837
13029A96465d2937r1036n7448A14030a37420C38310b00403k5344P7916A10397
13018C61333p8393A30372f1481G6048K29101C6729K48481p489p010I9506J65169
$$ y = [263418, -152263, -29491, 95348, 156612, 86376, 176065, 71904, 39387, 167523, 265440, 125756, 106275, 175724, -330581, 109954, 267388, 139313, 61688, -106478, 228689, 327312, 361500, -85564, 394641, 38015, 476155, 30060, 193511, -62808, 361046, -5312, 340151, 211668, 288344, 105056, 184799, 262592, -173811, 173491, -307695, 242148, 29543, -150639, 183289, -39062, -160002, 161494, 44740, 39873, -190159, 108912, -99094, 79788, 214306, 8709, 95512, -295319, 102634, 331361, -94053, -289500, 370382, 37850, 104298, -59004, 3628, 196465, -42937, -133973, -191421, 114030, -137420, 338310, -200403, -225747, -147831, 110397, 361333, 282940, 130372, -61481, 76048, 305149, 36729, 285210, 277721, 270711, 99506, 264675]
13007B64675b44082A99167I6551D2343a31810B98793b50491G9124b2004B04169
12996b44679C20107j19677Q0904b9984l0340B80335i5544G2796g6393C9948J46925
12985A86873l9344e046C11057h2781A99660a31813B07012i262A58471c5671j41763
12974a77434M099a8767j384B71864H5701d5211q3894D4864N2160d9347E2249b65310
12961A55212f5392I8995a04776c2689E7775j8727a09571A98973p5330R8568B4983
12949A49531l1066f3889H6547B7297J1732a81266D9311g2922A24192l4655a43972
12937e2144A80932R6571b86776G6162a79370C2999K56453F1571p559e6844F3691
12925B12457i6814A56605J3989j7380p5326R6964l2520F0422a4251B7439J55355
$$ y = [264675, -244082, 199167, 96551, 42343, -131810, 298793, -250491, 79124, -22004, 204169, -244679, 320107, 200430, 281334, -29984, -60324, 280335, -95544, 72796, -76393, 39948, 186873, 147529, -5046, 311057, -82781, 199660, -131813, 207012, -9262, 158471, -35671, -177434, -173335, -18767, -20151, 271864, 85701, -45211, -129105, 44864, 97024, -49347, 52249, -265310, 155212, -65392, 98995, -104776, -32689, 57775, 39048, -109571, 198973, 123643, 222211, 24983, 149531, 118465, -63889, 86547, 27297, 39029, -181266, 49311, -72922, 124192, 89537, -143972, -52144, 180932, 277503, -286776, 76162, -179370, 32999, 289452, 61571, 54012, -56844, 63691, 212457, -96814, 156605, 170594, 153214, 77888, 174852, 142332, 60422, -14251, 27439, 182794]
12914A82794D7399N2703L6098b43778c5296j22675I9061f6313L0944q9253I0671
12902a91097b3986A86810D1630c3285k6812D2038d7763B80751b26224a082C4772
12890A66957J25392f0278K3027a3794G272L3973N5323J00321a22381A41808F8770
12878e7471n0365A63883i4910a8404j95648A46183a9293j40956A49635a22804
12867G1921g303B3398b54750H5741R5141b58483L9480B72318o3311b0084j51426
12856a71510f0276r6955n7981A63610a49940A12058m5833b53907J07567M5559
12846a00781G0652A5490N7730a79438C29883i5473F7298e5624j56116c0196q5466
12835a15662I0898N9216F2603a62156J1588C49282c24276D2729a22533e0747B4910
$$ y = [182794, 47399, 100102, 136200, -243778, -35296, -157971, 99061, -66313, -35369, -124622, 90671, -191097, -23986, 186810, 41630, -33285, -60097, 42038, -47763, 280751, -226224, -1082, 34772, 166957, 292349, -60278, -37251, -13794, 7272, 41245, 96568, 196889, -122381, 141808, 68770, -57471, -107836, 163883, -94910, -18404, -214052, 146183, -19293, -160249, 149635, -122804, 71921, -7303, 23398, -254750, 85741, 180882, -258483, -219003, 272318, 209007, -20084, -171510, -60276, -157231, -215212, 163610, -149940, 112058, 66225, -253907, -146340, -100781, 70652, 15490, 73220, -179438, 329883, -95473, 67298, -55624, -211740, -30196, -115662, 90898, 150114, 62603, -162156, -150568, 349282, -324276, 42729, -122533, -50747, 24910]
12823b39821D35703a49609B21559I2118b76952K0951B92358A1846h2520F0926
12812E07242A79762F7764b12352M6160A43911a04223A67131a2954A32713D0900
12801D41574j89836g9692B5228R2538A594d3364F1971b50616P3372E6716k5258
12790C1458Q3608g360B13647D1565M4151c5167k24801R3054c8443I1769b6116
12778a83808k00809C8401g4680B16771a9374n7075J7395B16767D0793J20450N5129
12767B16372b280B06972a42317j02067H7811P6101J7191g6666A43919i8155l6199
12756a34354A0055a63575A66304L9335f0369B93853e3339D1872J65400a57073
12745G7355c15681b3214j22513a8981E4427b0473B17614m0261o121i8531D0806
$$ y = [-239821, 435703, -149609, 221559, 92118, -276952, -256001, 292358, 11846, -82520, 60926, 507242, 179762, 67764, -212352, -166192, 143911, -104223, 167131, -12954, 132713, 40900, 441574, 251738, -79692, 25228, 117766, 1594, -43364, 61971, -250616, -177244, 56716, 31458, 115066, -7360, 213647, 41565, 85716, -35167, -259968, -166914, -38443, 91769, -26116, -183808, -384617, 38401, -74680, 216771, -19374, -76449, -59054, 216767, 40793, 161243, 216372, -2280, 206972, -142317, -244384, 87811, 163912, 181103, -76666, 143919, -98155, -134354, 10055, -163575, 166304, 205639, -60369, 293853, -53339, 41872, 207272, -157073, 77355, -315681, -23214, -145727, -18981, 54427, -20473, 217614, 177353, 171232, -98531, 40806]
12733A35738K08229a87005E4371R1250J17593a42542F6367a6487H0015A7654K25256
12722B42910D862b64040J5949g6813r5812B87245a62713b8678B1997d7788B25133
12710g3274A37689K12347j42604M4807o2576h404A51034N8257j00q0562n0739
12699G7890l4271K0807J16345a46744j9292G4999Q7122k5428m7145d5355B05414
12687b18520B11030p656l7158J78621b25144A7317J34734c29455A88307E4636
12676I2857l8175O9155K88157A59480c0253E0871e9720j8656A84765D0523a85855
12664B05651C7686h5742G4954k4181c9363A81932a00282j49412J4680B15864B8431
12652A14948N173c1760k45440A87041J30715A37137a36789B03675q4352A6883
$$ y = [135738, 343967, -187005, 54371, 145621, 263214, -142542, 66367, -16487, 80015, 17654, 242910, 4862, -264040, -248091, -76813, -172625, 287245, -162713, -28678, 21997, -47788, 225133, -73274, 137689, 350036, 207432, 252239, 189663, -8404, 151034, 209291, 209191, 128629, 77890, 43619, 64426, 180771, -146744, -166036, 74999, 162121, 136693, 89548, -45355, 205414, -218520, 211030, 203374, 166216, 344837, -225144, 17317, 152051, -329455, 188307, 54636, 92857, 54682, 123837, 411994, 159480, -30253, 50871, -59720, -78376, 184765, 40523, -185855, 205651, 37686, -85742, 74954, 50773, -39363, 181932, -100282, -249694, -235014, 215864, 28431, 114948, 120121, -31760, -277200, 187041, 317756, 137137, -136789, 203675, 119323, 16883]
12641B24465i822k74321b6072B11087a86273B4960L11322j00318p1231a2533A84638
12629F8503b80022a17538C10629G606N7721O741b00869B24935n1307a32653A01909
12617B63423a43307C26088d09850j1274H0028a06043N759a8089G6505J56250A03568
12605a32848g965m6126J4193A02380E118K78161k1731a09015j20566B2063r768
12594A2295b23379a08335A0757a37286M5328C2667f8073A74194d6038F3296a00702
12582A81293b63701G2107e9918l07273B02682a51755C3378N6240O099J41751a951
12570A69102A3619a7636B03329F4485J7905i0392E1408K20545a1537A28021A8285
12558A89229f0445B38322J7939a80228B14663H7342N4257l9714c1445A50672a16426
$$ y = [224465, -9822, -284143, -26072, 211087, -186273, 24960, 336282, 235964, 164733, -12533, 184638, 68503, -280022, -117538, 310629, 7606, 65327, 72068, -200869, 224935, 173628, -132653, 101909, 263423, -143307, 326088, -409850, -421124, 80028, -106043, -100284, -18089, 76505, 232755, 103568, -132848, -7965, -54091, -39898, 102380, 5118, 283279, 261548, -109015, -229581, 22063, 12295, -223379, -108335, 10757, -137286, -91958, 32667, -68073, 174194, -46038, 63296, -100702, 181293, -263701, 72107, -59918, -367191, 202682, -151755, 33378, 89618, 95717, 237468, -1951, 169102, 13619, -17636, 203329, 64485, 82390, -90392, 51408, 271953, -11537, 128021, 18285, 189229, -60445, 238322, 256261, -180228, 214663, 87342, 141599, 101885, -31445, 150672, -116426]
12546b53714j14863E9005g1521n2426o4811A4116b72086P5460A43370a86710p9051
12535b65761A45098C7480K91685B0475b94809R3634A18751i4436A44260m5698
12525I8562N0595K0112B1431J13957l0413b18363f7196a8997j90246b1517j33877
12514a55394H03K18624c4786a1537F2560a25056A15821a09354j16841A45788Q2265
12503B28053a81856j01061F6583K12388a65804l8992C51476r9200J03921R230
12493C65427j38664b35533c5768k03746A64311O680e16969A31288f3979l33240
12483c97219a67994j49461M5807a25855A65336e2899k48301b8147k70720J19655
12473a79212a2439I9534e8610m4195G671L34132a14032B2997a78558d7022j07469
$$ y = [-253714, -368577, 59005, -71521, -123947, -188758, 14116, -272086, -196626, 143370, -186710, -265761, 145098, 37480, 329165, 20475, -294809, -201175, 118751, -94436, 144260, 98562, 149157, 169269, 21431, 135388, 104975, -218363, -67196, -18997, -209243, -21517, -155394, 803, 219427, -34786, -11537, 62560, -125056, 115821, -109354, -226195, 145788, 228053, -181856, -282917, 66583, 278971, -165804, -204796, 351476, 252276, 356197, 365427, 226763, -235533, -35768, -239514, 164311, 170991, -516969, 131288, -63979, -397219, -167994, -317455, -271648, -125855, 165336, -52899, -301200, -28147, -298867, -179212, -12439, 99534, -58610, -102805, 7671, 341803, -114032, 22997, -178558, -47022, -154491]
12462a54491m1617K4044O0924I3953b33592p4040B2582K20305c51378d3333k7158
12451g0491A79599a34906q4240c23j29359j21801a25101l5197k9781O9886B06020
12439i6064L1948A37263b59541D394O4954b25233O4030p5522a14903l981B59863
12427A25551a35991A09856h0678n9856q8931A24873a22088B80178m7946c46925
12416d0213J618I2706g8933H1743c04800I5578c5144B2349L4640P679r45a23902
12403C74421b3420C6532c6313A54773R0465E7132c57352B39068f1799L0789k16770
12392b47780A82082J79205j43991d02631E4114f0927A44342E4554J36560b15377
12381B39517c64428F0790J6058M9584J41557p0379C9867J32148h2352K7027B14816
$$ y = [-154491, -196108, -172064, -111140, 93953, -233592, -307632, 22582, 242887, -351378, -43333, -70491, 179599, -134906, -219146, -323, -129682, -251483, -125101, -160298, -190079, -120193, 206020, -96064, -64116, 137263, -259541, 4394, 69348, -225233, -161203, -236725, -114903, -118884, 259863, 125551, -135991, 109856, -80678, -140534, -229465, 124873, -122088, 280178, 232232, -346925, -40213, -38595, 92706, -78933, 81743, -304800, 95578, -35144, 22349, 56989, 64668, 63723, -123902, 374421, -23420, 36532, -36313, 154773, 245238, 57132, -357352, 239068, -61799, -31010, -247780, 182082, 361287, 217296, -402631, 54114, -60927, 144342, 54554, 191114, -215377, 239517, -364428, 60790, 76848, 126432, 267989, 197610, 39867, 172015, -82352, -55325, 214816]
12369B03306E8591f6501B91943B9826g583A18327b2325H623a03862j52540B43483
12357a06907k01682c9901C37189b65387f3602A22899l3842a65638M2742B37957
12346B33725D6248K17072b36154A59253N6443k790c8072I1293a19709a5590D16346
12334a17980B35047J44887b00804I0503J0165L76592k29007C3352K60265o8606
12324B25011C6557L55632j70670F6040g5617C39292D7941M7687P7238B3525O2574
12313H6099J33733B2724b7724C06562l3728j20214E3600b02614B20662a45540
12302B31277m2585J19350E8397K46634a3765o680j12919Q023M7674A37092J0720
12291A47812G2140O1630L8017C986J75123E0762a17704I9601R3748N3859L08522
$$ y = [203306, 58591, -66501, 291943, 29826, -7583, 118327, -22325, 8623, -103862, -256402, 243483, -106907, -308589, -39901, 337189, -265387, -63602, 122899, 89057, -165638, -122896, 237957, 233725, 46248, 263320, -236154, 159253, 215696, 212906, -38072, 91293, -119709, -15590, 416346, -117980, 235047, 379934, -200804, 90503, 100668, 477260, 248253, 33352, 293617, 225011, 36557, 392189, 221519, 66040, -75617, 339292, 47941, 95628, 172866, 23525, 86099, 219832, 22724, -27724, 306562, 272834, 152620, 53600, -202614, 220662, -145540, 231277, 188692, 308042, 58397, 305031, -13765, -20445, -133364, -125341, -77667, 137092, 147812, 72140, 133770, 171787, 3986, 179109, 50762, -117704, 99601, 193349, 247208, 555730]
12280E55730i1148A95252n1304J79503G6655A2724a9085A98944q2682a08344A55787
12268B23701m3414o7442l9181K29351b45890B45352M8938m2186r9616L5543A8444
12256a57800C08J78382J08505A09059K06983k100K590j36016K07913a11469j02926
12245b14395A34753J55971e5187I0678J14370A02219K2268C4575J01133R9145
12235B34853A10604N8243K4511A3829K02920A4073J2924b4458m6157J8284l0313
12224h2644A01012a88372B96789A04322J49557L16161j07827Q684p8279j27134
12214B65484l9209F3766M08403A17769a19849H9737J4679J65187C0414A1421R0157
12203A01578J16891H7148a7196F6183K79182a64282A51110M2058K63477A89669
$$ y = [555730, -91148, 195252, 143948, 323451, 76655, 12724, -19085, 198944, 116262, -108344, 155787, 223701, 180287, 112845, 73664, 303015, -245890, 245352, 294290, 252104, 152488, 188031, 18444, -157800, 308, 178690, 287195, 109059, 316042, 313942, 316532, 180516, 388429, -111469, -214395, 134753, 290724, -55187, 90678, 205048, 102219, 124487, 34575, 135708, 234853, 110604, 168847, 193358, 13829, 216749, 14073, 26997, -24458, -70615, -52331, -82644, 101012, -188372, 296789, 104322, 253879, 570040, 462213, 470897, 392618, 265484, 226275, 63766, 472169, 117769, -119849, 89737, 104416, 269603, 30414, 11421, 101578, 218469, 87148, -17196, 66183, 345365, -164282, 151110, 193168, 456645, 189669]
12192A73317h0356A0845J95084J03878a23597A65766G0555c8655j50348C0310
12181a49998B44838b8862B45985F7369a87207B25974h6118A97805q3245A2875
12170B67500P8347j12719A03161K00031J31251F8130L19548j41365M9805j11482
12160A84636k1324N3800A6637b9329D32594a68019C1781a22595j12119A18084
12149g797D26N1594f7185C25462A38083b716A65261E9117b36177e3620B14519
12137A78910J23381n9849r9422K71942e150k01816A5865J07201b9128A4841K06164
12126B21005q3145J8926J41599A40903j9269R3075A5119J29614J5239d5206C83369
12114D0037M5423e2767b0288B13453n1449k389C2006J04194j0184J51510F0959
$$ y = [173317, -80356, 10845, 205929, 309807, -123597, 165766, 70555, -38655, -189003, 30310, -149998, 244838, -28862, 245985, 67369, -187207, 225974, -86118, 197805, 114560, 12875, 267500, 345847, 233128, 103161, 303192, 434443, 68130, 387678, 246313, 296118, 184636, 163312, 217112, 16637, -29329, 432594, -168019, 31781, -122595, -234714, 118084, -7797, 426, 52020, -67185, 325462, 138083, -2716, 165261, 59117, -236177, -53620, 214519, 178910, 302291, 242442, 143020, 414962, -5150, -206966, 15865, 123066, -29128, 14841, 221005, 137860, 156786, 298385, 140903, 121634, 214709, 15119, 144733, 159972, -45206, 383369, 40037, 85460, -52767, -20288, 213453, 162004, 159615, 32006, 136200, 126016, 277526, 60959]
12102B04148K5028H6283K79697d266A66991D3368a36291M1591M4863B94933a92093
12090A15639a25854A83563c2554A73696M9822K60955B06621J67393A11986J60663
12080B72649n588e6682C5899J22794K2740D0909b13761O7352A35467N5632K2613
12069B13712a8411B47482A11417d3878B68987o1811A6043D749J0450R8997A2364
12057a07015A85426m1527l1251a06374G4871e9788D01344F4270J1559a04702F3932
12045a3986F696a495B45845d1422E4548a08784A17627a14814k2305G750K5261
12034C3011K81712A2139a90295A12479M3128b05805J00452D07317A35923N7043
12024A92966A520a7290j39281H3114J02749n8972m0266O6758M6812f6443D1549
$$ y = [204148, 229176, 86283, 365980, -4266, 166991, 43368, -136291, -94700, -49837, 294933, -192093, 115639, -125854, 183563, -32554, 173696, 223518, 484473, 206621, 374014, 111986, 272649, 267061, -56682, 35899, 158693, 181433, 40909, -213761, -146409, 135467, 191099, 213712, -18411, 247482, 111417, -43878, 268987, 207176, 16043, 4749, 15199, 114196, 12364, -107015, 185426, 143899, 112648, -106374, 74871, -59788, 401344, 64270, 75829, -104702, 63932, -13986, 6696, -1495, 245845, -41422, 54548, -108784, 117627, -114814, -137119, 7750, 33011, 314723, 12139, -190295, 112479, 155607, -205805, -105353, 407317, 135923, 192966, 1520, -17290, -156571, 83114, 185863, 126891, 86625, 153383, 200195, -66443, 41549]
12012A50037h2797k9574L4903B33768P7758j20929J6355a40306j33154A89087
12001B7066K38936j19402e640j8943A12103n5140A7072L176a10715J7503H7754
11989h6757h532o7509F4751K4648J91641c2667A28957a06886b4246a1613j14652
11978a26265e7289B29424m176b9461j11127A05775e0233p3514K2612a0493n4251
11967f4744m7555j57278a14290G8929L35655E3588F062J9413N4447Q816a0235
11955b1605j04604j50349B53381i7846a337j13097d3854p9643A2823M12015A49843
11943D8806b2285A10312a90412B32924j08946J56119b26447B30181m7636l2077
11933A50468G0832h0723m6477m720C41048D3353c69642D3360K20570D8330p930
$$ y = [150037, -82797, -112371, -77468, 233768, 311526, 190597, 206952, -140306, -273460, 189087, 27066, 266002, 146600, -5640, -24583, 112103, 56963, 17072, 20248, -110715, -93212, 87754, -86757, -8532, -76041, 64751, 89399, 281040, -32667, 128957, -106886, -24246, -11613, -126265, -57289, 229424, 225248, -29461, -140588, 105775, -50233, -123747, -101135, -10493, -64744, -112299, -269577, -114290, 78929, 414584, 53588, 6062, 25475, 79922, 88738, -10235, -21605, -126209, -276558, 253381, -97846, -1337, -114434, -43854, -123497, 12823, 424838, 149843, 48806, -22285, 110312, -190412, 232924, 123978, 280097, -226447, 230181, 182545, 150468, 70832, -80723, -127200, -131920, 341048, 43353, -369642, 43360, 263930, 48330, 40400]
11922D0400i1836A46253b84747h4284q532A22163I699J63762a70473m727f9820
11910C746g2393C31902a68591E214d2818J2010B16623n7772k8087C1857J46269
11899A78126d1487E6295J66728l9211i1970n6283r1177A56188J1012a88053A70191
11887B62494j00563b04349A28596a9090N332k55301h5882A8445R50b73755A25173
11875c00538A13615c4454o411B18319a10320A2870L2247e5725l87783J89498B5686
11863a77470j19978H8427l9743d21391A03601i3550l53382E2388g4951K1115o7705
11852a21541k20469a38962B97601c55903a10974j2084A14065a0997l29392I5750
11841A61635a50233M1449B77576c01006B09806G3801a63511a5604A97698C0658
$$ y = [40400, -91836, 146253, -284747, -84284, -92816, 122163, 9699, 173461, -170473, -175200, -69820, 3746, -72393, 331902, -168591, 5214, -42818, -30808, 216623, 158851, 130764, 31857, 178126, -41487, 56295, 223023, 183812, -91970, -148253, -239430, 156188, 167200, -188053, 170191, 262494, 161931, -204349, 128596, -19090, -13758, -269059, -85882, 18445, 19395, -273755, 125173, -300538, 113615, -34454, -40865, 218319, -110320, 12870, 45117, -55725, -443508, -254010, 25686, -177470, -297448, 88427, 48684, -421391, 103601, -93550, -446932, 52388, -74951, -53836, -121541, -342010, -138962, 297601, -355903, -110974, -123058, 114065, -10997, -340389, 95750, 161635, -150233, -108784, 277576, -301006, 209806, 73801, -163511, -15604, 197698, 30658]
11830B93115b63518L6529C4443R4577a08538B4204L78102f8256k54875A30333
11819a41400n1624H3037h8335p8004l0413G9291c11301A98657M2446i3400A21464
11807g2790C49467m6240e2668B63128r8243F4763c52428i0169B75401a86465k4524
11796b10989D8950a53119e0562B4151a72218k3319P2401A21403b01060A09766
11785B38794p876p9691a46068I2549f0244p8898L0600C01936D4243h7242A82746
11773B19256c37879D4832A4456J73645F6050a09754c5853k32636F6272a26794
11762a19295j37519J09983d8872C91264d954j73616A25883D3239a15981K9345
11752h6636F7090f391p1258A63930f0052B56723h1979A16053a00533j403D1230
$$ y = [293115, -263518, -226989, 34443, 129020, -108538, 24204, 402306, -68256, -323131, 130333, -141400, -193024, 83037, -88335, -166339, -196752, 79291, -311301, 198657, 241103, -93400, 121464, -72790, 349467, 303227, -52668, 263128, 164885, 64763, -352428, -90169, 275401, -186465, -210989, 48950, -153119, -50562, 24151, -172218, -195537, -123136, 121403, -201060, 109766, 238794, 230918, 151227, -146068, 92549, -60244, -139142, -108542, 301936, 44243, -87242, 182746, 219256, -337879, 44832, 14456, 188101, 66050, -109754, -35853, -268489, 66272, -126794, -119295, -256814, -146831, -48872, 391264, -4954, -178570, 125883, 43239, -115981, -86636, 67090, -6391, -77649, 163930, -60052, 256723, -81979, 116053, -100533, -101936, 41230]
11740i3568B7635d7037j96052G4143k8171Q952a7325k51217E9819g6088B88290
11728B56247g7085b1459m1908B52958a23814a5000E0965a83572k31993A94919
11717C11936A20378m1920J9860a83023A78899P6134f9594I0391J78273c65613
11706a89640N2825A34539J5908g3086A94642d7573o8378A18465J74283b23893
11695A0334b09359C00244a13330N0044C7530L4633J44176G7831C4483a57629l6950
11684a94579A03509m8464a37693D4064O0174K47482d9124a7376F3006K2326J70097
11673B55429L5391i5179B60976a07290o061C16727F8169a11670B22411E5488J27160
11662A82648A779a22661e0069j895A76956k4218J69635a40980j04066F121a59651
$$ y = [-93568, 27635, -47037, -243089, 74143, 45972, 54924, -17325, -268542, 59819, -76088, 288290, 256247, -77085, -21459, -63367, 252958, -123814, -15000, 50965, -183572, -415565, 194919, 311936, 120378, 78458, 98318, -183023, 178899, 255033, -69594, 90391, 268664, -365613, -189640, -136815, 134539, 150447, -73086, 194642, -47573, -115951, 118465, 292748, -223893, 10334, -209359, 300244, -113330, -63286, 37530, 72163, 216339, 77831, 34483, -157629, -194579, 103509, 55045, -137693, 44064, 104238, 351720, -49124, -17376, 63006, 85332, 255429, 290820, -95179, 260976, -107290, -113351, 316727, 68169, -111670, 222411, 55488, 182648, 1779, -122661, -50069, -51964, 176956, 152738, 322373, -140980, -245046, 6121, -159651]
11650H588K0312J60086A7353J62256p9267d6079A95666E8956a9546j4074A15594
11638a35420A0641c4030k6492A84760g2740A40158n7039e7253B1256a13439k0104
11627a33543n9509a5460p897A21044N8388C4943K3011R0207a0537m4398B96323
11615a22538K2718j8245C80572A01575J0650c0636H5930J71085E1618e6629A19519
11603a02524j18971i5390B26212A7588J16406a00792o180A40420K4266J75767
11593C40453G6864J25532b9193C96872h711m28070A92592H9751a1968C32788H3583
11581A35846k3089B5532c3753G2019K3818i1396K0524l0432f215n0478A07465
11569C01587m0375A05412c9203F9675L00906C3798c2545I469N4623e7689k16069
$$ y = [8588, 28900, 188986, 17353, 179609, 100342, -46079, 195666, 58956, -19546, -33620, 115594, -135420, 10641, -34030, -60522, 184760, -72740, 140158, 83119, -57253, 21256, -113439, -133543, -193052, -15460, -23357, 121044, 179432, 34943, 57954, 148161, -10537, -54935, 296323, -122538, -99820, -118065, 380572, 101575, 112225, -30636, 85930, 257015, 51618, -56629, 119519, -102524, -221495, -95390, 226212, 17588, 133994, -100792, -106972, 140420, 164686, 340453, 76864, 202396, -29193, 396872, -8711, -436781, 192592, 89751, -11968, 332788, 83583, 135846, 112757, 25532, -33753, 72019, 95837, -91396, -70872, -101304, -6215, -56693, 107465, 301587, 261212, 105412, -39203, 69675, 370581, 33798, -32545, 9469, 64092, -57689, -273758]
11558b73758d1777c526p3929A19030c87673H8235c54636g3041j17453B16422a28234
11546c56017J55539A71280p4737c54188I7399J15184E000K28058B1479J97794
11536B19273J01191j41248g9678E25K58911f2042B42872h5304O946k02781B57513
11524a7169m1016B68913a43841A10177d6918l9370L0223q4138K296j40551E635
11512B19836i2472A40806b0726A06660R7414a33487C61778G809J93547l0423f916
11500I6670K27310k0278a79260A77794F1495K0123Q6886P5235D7099K40199A20729
11488C08428J638F5851I858K42339F7898J63679a8609E7725J55488L8286A13405
11476E7638J28083J35895f400j7123C14170M417j49595C4300c6729B01162q5141
$$ y = [-273758, -41777, -3526, -77455, 119030, -387673, 88235, -354636, -73041, -190494, 216422, -128234, -356017, -200478, 171280, 96543, -354188, 97399, 212583, 5000, 233058, 21479, 219273, 320464, 179216, -79678, 525, 259436, -62042, 242872, -85304, -78358, -281139, 257513, -17169, -58185, 268913, -143841, 110177, -46918, -86288, -56065, -140203, -137907, -278458, 5635, 219836, -92472, 140806, -20726, 106660, 204074, -133487, 361778, 7809, 201356, 170933, -6916, 96670, 323980, 303702, -179260, 177794, 61495, 81618, 168504, 243739, 47099, 287298, 120729, 308428, 310066, 65851, 9858, 252197, 67898, 231577, -18609, 57725, 213213, 251499, 113405, 57638, 185721, 321616, -6400, -23523, 314170, 318587, 168992, 34300, -36729, 201162, 116021]
11465A16021a38878B05237J09329d2266C2123a78285C396J78667k2358c3141C70596
11453g2695B09604a52791A62633b54019A43623m8863J0432K27696n5745f0327
11442A3957c19909A68602l9070b41648r7675A4885a23817B07238k6728j2108i8271
11430A27349c58483J52313b6620B48030m0486a13121j3478A75031a1480n7175
11420f8655j85268A61157e5324k58354B7574c9103A46176e3183l0404j36974B48443
11408a76652A7806P5578h7093j39695f0096A18974K8997J22486g5134q8022B06769
11396c6733A44093b82365D265a18595A65328c99398a51361K902j33877E1869a34319
11384c62720a20830B56791a95075E9772R2722l238c62616A22264b1619m6201B24525
$$ y = [116021, -138878, 205237, 314566, -42266, 32123, -178285, 3396, 182063, 159705, -33141, 370596, -72695, 209604, -152791, 162633, -254019, 143623, 94760, 105192, 332888, 277143, -60327, 13957, -319909, 168602, 129532, -241648, -339323, 14885, -123817, 207238, 180510, 168402, -98271, 127349, -358483, -206170, -26620, 248030, 207544, -113121, -126599, 175031, -11480, -68655, -253923, 161157, -55324, -313678, 27574, -39103, 146176, -53183, -83587, -220561, 248443, -176652, 17806, 93384, -87093, -226788, -60096, 118974, 147971, 270457, -75134, -163156, 206769, -36733, 144093, -282365, 4265, -118595, 165328, -399398, -151361, -148459, -282336, 51869, -134319, -362720, -120830, 256791, -195075, 59772, 152494, 149256, -362616, 122264, -21619, -67820, 224525]
11372i931r44q391c864A78550a01638F3581d8444k0730A83875b64832h8198K2745
11360f5453j33134K876B06573G9209Q2227M375b69744A23682R666h5086j44941
11349b30027d4973J9064B01696c3743A68954A0936M06630r2756I0751a16419B58224
11337C9178b20289g1644F5869c50741f6819j84140J7485D6302L9302J40946d5286
11325h5584a2878o6289j87997f4005H6591K3103l8224K68859b1636C07022A30717
11313c74204B32233F9357q897b81591A95642k0251K3125m9528K5108a0349j20966
11302a31315C9320j960a66245A90631c11531a17177e6432j17890B8486a30549
11291a53160l03628a60441k173Q311d5470A38876a32086K6945G5907a50580b1974
$$ y = [-9931, -10875, -19266, -3864, 178550, -101638, 63581, -48444, -69174, 183875, -264832, -88198, -65453, -198587, -195711, 206573, 79209, 161436, 165811, -269744, 123682, 133348, -85086, -230027, -44973, -25909, 201696, -33743, 168954, 10936, 417566, 324810, 90751, -116419, 258224, 39178, -220289, -71644, 65869, -350741, -66819, -250959, -233474, 46302, 85604, 226550, -45286, -85584, -12878, -79167, -267164, -64005, 86591, 109694, 71470, 340329, -21636, 307022, 130717, -374204, 232233, 69357, 60460, -281591, 195642, 175391, 198516, 148988, 174096, -10349, -131315, 39320, 37360, -166245, 190631, -311531, -117177, -56432, -174322, 28486, -130549, -153160, -456788, -160441, -162614, -154303, -45470, 138876, -132086, -105141, 75907, -150580, -21974]
11279a39969G427g8228l2887d2047l8796p626j13483J9866A20418K3821b4358
11267A55677b32192f2772A88802m3418C9849d24286G3010J50250b8171p2446A94168
11255a73645O5923A60013b75184A01027J18505a10633F1509a38558m6284P7715
11245a07127j90776a38091j2384m5000A79892e8056J7595A22285m0994e03335
11234a36488C6955f8542A00291b08142G6601e1406A60959f0342j2526n7232j82793
11223c12893R1530M7312A81255E6660a10894l00447a90539O4748o0050j60473
11213c46314b0195j45196A93004B1519b4195j71263Q5240A00602L7869e7882p146
11202f5028k7829o9274J9802A67449A5943Q9619Q6247F8879a46404A41099b6896
$$ y = [-139969, 7427, -78228, -111115, -42047, -80843, -88469, -201952, -182086, 120418, 144239, -24358, 155677, -232192, -62772, 188802, 145384, 39849, -424286, 73010, 223260, -28171, -100617, 194168, -173645, -107722, 160013, -275184, 101027, 219532, -110633, 61509, -138558, -184842, -107127, -297903, -138091, -150475, -195475, 179892, -58056, -40461, 122285, 81291, -503335, -136488, 36955, -68542, 100291, -208142, 76601, -51406, 160959, -60342, -72868, -130100, -312893, -221363, -174051, 181255, 56660, -110894, -411341, -190539, -125791, -185841, -346314, -20195, -165391, 193004, 21519, -24195, -195458, -110218, 100602, 138471, -57882, -65028, -92857, -162131, -142329, 167449, 15943, 105562, 191809, 68879, -146404, 141099, -26896]
11190c8176K79j25576j09821J25642e5110c845j63381A64712k0596b70495F2849
11178C04786e6629A83498n1140a45455K7113L7627k02943F823b99341J46756A17987
11166f1250n1013k06110m9210d9465E7863h2940n0708j05025A87898n1481I75
11154i1808j37577R3149k98124C652a25031A95847a88103B70463E7426B4506b26396
11142b16401A37612n0496A0548L36470P8658b47709f7608i729A40119a31701I9549
11130b71447e8030j32234D0892f8298A01884a20685m3383A3225K36526n0028i3709
11118e254k92461E409O4729J38158c28113A52401L8883l7054F9974i211j72581
11107a81792f2115H5234i2984B55261E0914K18893J98473a08600i624B43699J0892
$$ y = [-38176, -37897, -163473, -273294, -147652, -55110, -3845, -167226, 164712, 144116, -270495, 62849, 304786, -56629, 183498, 132358, -145455, -118342, -80715, -283658, 6823, -299341, -152585, 117987, -61250, -112263, -318373, -367583, -49465, 57863, -82940, -133648, -238673, 187898, 136417, 975, -91808, -229385, -136236, -434360, 3652, -125031, 195847, -188103, 270463, 57426, 24506, -226396, -216401, 137612, 87116, 10548, 347018, 425676, -247709, -67608, -9729, 140119, -131701, 99549, -271447, -58030, -190264, 40892, -68298, 101884, -120685, -164068, 13225, 249751, 199723, -93709, -5254, -297715, 5409, 70138, 208296, -328113, 152401, 191284, 154230, 69974, -9211, -181792, -62115, 85234, -92984, 255261, 50914, 269807, 468280, -108600, -9624, 243699, 254591]
11096B54591a60108A04184k0806j9656b9866A67498K20258e7195B54644b8075
11085a91867A91404J29818b25220A32014a01112C11472O7907A64766J6069J81413
11075C62248A58546a06516C03031A43757L48175j50872I5959B5282a04833p038
11065a11871F7704b24590C13158Q2140A17687L9160K63220o6103n4880J50002
11055D49086L0916R1906B54734J43731J58879j33066K03354k26904J87848n7693
11045E30883J35248j01965J12241B94333J63855j08589R3454j17074J88401m7754
11035D66626Q1699K32372k33184K0281Q122R4157k95684P3080Q3135p9929j0871
11024D39804J12565J76260k5771r5257n8932J88398k19697j03145K07939J85259
$$ y = [254591, -160108, 104184, 83378, 63722, -29866, 167498, 387756, -57195, 254644, -28075, -191867, 191404, 321222, -225220, 132014, -101112, 311472, 379379, 164766, 180835, 362248, 158546, -106516, 303031, 143757, 491932, 341060, 95959, 25282, -104833, -111871, 67704, -224590, 313158, 395298, 117687, 156847, 420067, 353964, 299084, 449086, 480002, 571908, 254734, 398465, 557344, 424278, 627632, 400728, 588576, 530883, 666131, 564166, 676407, 294333, 458188, 349599, 443053, 325979, 514380, 466626, 548325, 780697, 547513, 567794, 575916, 670073, 374389, 447469, 530604, 450675, 439804, 552369, 728629, 702858, 607601, 548669, 737067, 517370, 414225, 622164, 807423]
11014H07423l41876M92081m56782M7915J3797q9638n7885J19710j71557J46046
11004E09234Q7463A01101M4908J22451M32035K9681k40091r5581k3729l1318J61215
10993E00672L0219K62008j42765k05537K94714B80852p3617J49748L71481j81582
10983E46882K54075k29311J30937k85253L53363q1314L7418j36802L73624j1054
10973I52565M6154M99009P0547P9887K64040K8133l59060L30917M46712n71217
10963A787687L59384n85650J41653l83459O2349J0078m01265L72232p2265J17888
10953A408632o6049k4154J23735l08557K9181j12823m29606K93202k13635k88104
10943D11822K22484B95042A42956P2635k4278K0423D7308G046L57450j53039b11931
$$ y = [807423, 465547, 957628, 500846, 548761, 562558, 472920, 415035, 534745, 363188, 509234, 596697, 101101, 146009, 268460, 700495, 730176, 490085, 394504, 370775, 339457, 500672, 530891, 792899, 650134, 444597, 739311, 280852, 207235, 356983, 728464, 546882, 800957, 571646, 702583, 417330, 770693, 689379, 726797, 589995, 963619, 952565, 998719, 1497728, 1568275, 1648162, 1912202, 1940335, 1581275, 1912192, 2358904, 1787687, 2147071, 1561421, 1703074, 1319615, 1381964, 1392042, 990777, 1363009, 1290744, 1408632, 1342583, 1318429, 1442164, 1133607, 1162788, 1049965, 620359, 913561, 699926, 411822, 634306, 295042, 142956, 215591, 191313, 211736, 47308, 7046, 364496, 211457, -211931]
10931d0775D94717c1409B51467C9481a70515d6633A44688C4134e6492A2111L14865
10920C26976I1754d1886j73814A8506J85468k3268q7281P1946d6160j09210C24057
10908I3711b27374O6033C26376a8470m1937j63121J9339E5596I742O6159R6766
10897A72667i9435q7416f9203K251o3884J1035k19996J12037a00033a8579A17352
10885A47105c40665B28951a40568A2869P0958l9256a55025P2035A53869N375a3424
10873B54166i4180B56190b9118j16412k10854E169O7651O4018c0472I8565C0536
10861C256b36926A1221c29212A20199f520D10166f1297A01525J0095K20471b2298
10849A40226h2809k4318D4867G293K13339B3906K82758p3152d9548n2583j80379
$$ y = [-40775, 494717, -31409, 251467, 39481, -170515, -46633, 144688, 34134, -56492, 12111, 326976, 91754, -41886, -215700, 18506, 203974, 180706, 93425, 165371, -46160, -155370, 324057, 93711, -227374, -161341, 326376, -18470, -60407, -223528, -204189, 55596, 9742, 75901, 172667, -99435, -186851, -69203, -66952, -130836, -119801, -339797, -227760, -100033, -18579, 117352, 147105, -340665, 228951, -140568, 12869, 83827, 44571, -155025, -82990, 153869, 159244, -13424, 254166, -94180, 256190, -29118, -145530, -356384, 5169, 72820, 136838, -30472, 98565, 30536, 3256, -236926, 11221, -329212, 120199, -6520, 410166, -61297, 101525, 111620, 332091, -22298, 140226, -82809, -107127, 44867, 7293, 220632, 23906, 306664, 233512, -49548, -102131, -282510]
10838b82510A97556G3366K86249A20552a28719H714J49476p6218a03252C7755
10827i3217n8842e4561b4130j25504K5348M0558a7749H5729L5286a46037K0298
10816a25739o4994d9952m6625L0360B09098Q9222c42257d1054j53265G7358a04121
10804c70579I6185f341A46892a34874d9366k48485A3481b77432F4199a04456b4747
10792A92417a86414A05617a01095j51872I4010b45723b1240I5880J27476g7748
10781G4951M5500b50121e0845D584c20046a19445C22512d5318j40077i0246P349
10770h2897E9840L4794b67692j94359J12158l2416E7725b14239H8928f3541j31468
10759a95009B26754f727j1629k985p5603M3129n328k56674B00613b02574A21329
$$ y = [-282510, 197556, 73366, 359615, 120552, -128719, 8714, 158190, 81972, -103252, 37755, -93217, -152059, -54561, -24130, -149634, -124286, -83728, -17749, 85729, 121015, -146037, -125739, -190733, -49952, -96577, -66217, 209098, 298320, -342257, -41054, -194319, 77358, -104121, -370579, 96185, -6341, 146892, -134874, -49366, -297851, 13481, -277432, 64199, -104456, -24747, 192417, -186414, 105617, -101095, -252967, 94010, -245723, -21240, 95880, 223356, -77748, 74951, 120451, -250121, -50845, 4584, -320046, -119445, 322512, -45318, -185395, -90246, -82897, 59840, 94634, -267692, -462051, -349893, -382309, 57725, -214239, 88928, -63541, -195009, 226754, -6727, -18356, -21341, -96944, -53815, -59143, -315817, 200613, -202574, 121329]
10747A58359J2560a34680A52335b54164B66995b7443q0963A56045C2242b2680
10736f2452k278B64052a17449m8644j8561M1866E6728a54379e6974A86181l9118
10725A47063b2049B14165a42723G503K3843K6241J23966o1637a04904j37984J2399
10714b30489c7157k65768A87458K07266b95951D8579a33235B63195b20199A28144
10703a31101k28905L644C2808b78140d5971n8441j7939K7974A02514h6129p2324
10692a58453r1912f6721A03445b3198l53305A10357a62001l8545i9823H1318b58443
10680B1919a47146A97458E4276O5982a73242A12799a42419r6615e2915m3935j24411
10669b21261A71244b32956j34972a02595k09119A3725K52392o0926B9301K80874
$$ y = [158359, 170919, -134680, 152335, -254164, 266995, -27443, -108406, 156045, 32242, -22680, -62452, -64730, 264052, -117449, -166093, -184654, -142788, 56728, -154379, -56974, 186181, 147063, -22049, 214165, -142723, 7503, 31346, 57587, 181553, 119916, -104904, -242888, -230489, -37157, -302925, 187458, 394724, -295951, 48579, -133235, 263195, -220199, 128144, -131101, -360006, -356362, 32808, -278140, -45971, -104412, -122351, -94377, 102514, -86129, -158453, -250365, -66721, 103445, -23198, -376503, 110357, -162001, -200546, -99823, 81318, -258443, 21919, -147146, 197458, 54276, 120258, -173242, 112799, -142419, -239034, -52915, -96850, -221261, 171244, -232956, -367928, -102595, -311714, 13725, 266117, 205191, 29301, 310175]
10659C10175a59886A27745L9302B7875h6523h832k7330a4782q959C2318J04393
10648A36711F3648b57632d6050a0524B5419J8056a88177g5191K1862N424A9497
10636c0322J351k64318n04H4339h2863p4259M4935d7301k27276A60958a23857
10624A23914a93931f7431b1103l7638A59768d6358J8583k16384b8272C79399b0896
10612b52885g9096k6275j18000M8130o1210e049A03841b335o9877j56013C993
10600B02680a78628o9932A86175d60017e9413o4562C3057J3436b05573A2512J73022
10589A85534F3805c16808a06789d6072l3634l7267a9750m45896A03131b99437
10578a27403M6105c9247D2244c40300M1026H5168a35586f7540j78464g4654j77878
$$ y = [310175, -159886, 127745, 167047, 27875, -86523, -8832, -36162, -14782, -23741, 32318, 136711, 63648, -257632, -46050, -10524, 25419, 43475, -188177, -75191, -53329, -47905, 19497, -30322, -28971, -293289, -293793, 84339, -82863, -157122, -112187, -47301, -274577, 160958, -123857, 123914, -193931, -67431, -21103, -58741, 159768, -46358, -27775, -244159, -28272, 379399, -20896, -252885, -79096, -105371, -223371, -175241, -236451, -5049, 103841, -2335, -72212, -228225, 3993, 202680, -178628, -248560, 186175, -460017, -59413, -123975, 33057, 46493, -205573, 12512, 185534, 63805, -316808, -106789, -46072, -79706, -116973, -19750, -465646, 103131, -299437, -127403, -81298, -39247, 42244, -340300, -299274, 85168, -135586, -67540, -246004, -74654, -252532]
10567b52532G3520a95458D53725f694p9581B65331G1003b13481p5936J33868n702
10556a61251R594j52025A18995J07778l9009g5577k27449C51599A37450a91527
10545a18505f128B41375N4256e1200A7111e2601j36017E7124g6938k3007M8908
10534e1037p6134A47810e8711p4853E3935P2034b7247k85575a7647A26132J1666
10523A37798n0697f2247j68737C1356b8082B5371L9058B153L4058j6875J13860
10512A33196d470A90310a15373K7224a2726k6455j20165A68496a0745E297g6771
10500a4957D7339M963J92958A10625e5376B26392c76519a87959A26726a52355
10489f6293k54235A62487b68085F8596h3379k15450a13242b9046m4909C0488a8256
$$ y = [-252532, 73520, -195458, 453725, -6694, -86275, 265331, 71003, -213481, -289417, -155549, -161251, -151657, -303682, 118995, 226773, 187764, -75577, -303026, 351599, 137450, -191527, -118505, -6128, 241375, 295631, -51200, 17111, -52601, -188618, 57124, -76938, -99945, -51037, -127171, 147810, -58711, -133564, 53935, 125969, -27247, -312822, -17647, 126132, 137798, 87101, -62247, -230984, 31356, -28082, 25371, 64429, 2153, 36211, 19336, 133196, -4470, 190310, -115373, -88149, -12726, -39181, -159346, 168496, -10745, 5297, -76771, -14957, 47339, 52302, 245260, 110625, -55376, 226392, -376519, -187959, 126726, -152355, -66293, -320528, 162487, -268085, 68596, -83379, -298829, -113242, -29046, -73955, 30488, -18256]
10477A94532j8072J7255J12251I1181Q1845G6733L04900F3651K68602I9749b27405
10465e2465m0725A69276B1930a47815D8838b99611a38110j8888B1810L4706a62580
10453c17256M0732L206b7058j9800G7916h4267k35051A995b21354g315m6170J2397
10441d1088B32427d8684A97095h8627A83255b01283o9606M2237b6393j07216L2409
10430a01200b2861B4830J52388b1839l48642A5547K08110n7936A2256R1299B0353
10418a26585F2566a47628L3771B27807p2136i5846A52802J32691b03193e6897
10407a4817j67577e0152E9269d26448a8946n9660O294B09310a87561Q5720A22396
10395c8324o1815C31491a66608B2433f0012k1457C6805K7009a36903C01891K4054
$$ y = [194532, 176460, 193715, 305966, 91181, 173026, 76733, 381633, 63651, 332253, 99749, -227405, -52465, -93190, 169276, 21930, -147815, 48838, -299611, -138110, -156998, 21810, 56516, -162580, -317256, -276524, -273318, -27058, -46858, 77916, -84267, -319318, 1995, -221354, -7315, -53485, -41088, 232427, -48684, 197095, -88627, 183255, -201283, -270889, -228652, -26393, -133609, -101200, -22861, 24830, 177218, -21839, -370481, 15547, 223657, 165721, 12256, 103555, 20353, -126585, 62566, -147628, -113857, 227807, 155671, -95846, 152802, 285493, -203193, -56897, -14817, -182394, -50152, 59269, -426448, -18946, -78606, -72312, 209310, -187561, -101841, 122396, -38324, -100139, 331491, -166608, 22433, -60012, -81469, 36805, 63814, -136903, 301891, 325945]
10384C25945A17803k2732K74653b5349P476C3558J38415b285l3324H5252K9617
10373A14869a82483B66245k1580d2281k6431A06238j5024J35421K12749j86450
10363B52934J19418o0217q9445p4404J83073H4945J19633K2314a99499D42222
10352B1724L53292A01083K8701a17204A51226O8863L57806B45452j18304C2180
10341A30625a03078E56466o5957B13131H9042j8745L77604j33164J59035I2629
10330E1416J17052N1205a42306A7263A65K523L42656D0414d2905F4043J19531
10319A83574r1369l7391a81085b6029j88287r797A83238J81807I9910a89867C9902
10307A42184c3466H9729K63335h0787J1107j83675j36267A38670e2368n7831k88199
$$ y = [325945, 117803, 95071, 369724, -25349, -17873, 33558, 171973, -2285, -35609, 85252, 114869, -182483, 266245, 244665, -42281, -68712, 106238, 91214, 226635, 439384, 252934, 372352, 312135, 222690, 148286, 331359, 84945, 204578, 226892, -199499, 442222, 21724, 375016, 101083, 129784, -117204, 151226, 220089, 577895, 245452, 127148, 32180, 130625, -103078, 556466, 490509, 213131, 89042, 70297, 447901, 314737, 473772, 92629, 51416, 168468, 219673, -142306, 17263, 165, 2688, 345344, 40414, -42905, 64043, 183574, 92205, 54814, -181085, -26029, -214316, -224113, 183238, 365045, 99910, -189867, 39902, 142184, -33466, 89729, 353064, -80787, -69680, -253355, -389622, 138670, -52368, -110199, -398398]
10296c98398a85152C5148J13884g5996B39287A17852C9009b75927f530k85111
10286b91641J39425b2144E8445q284a9360A24527a46123J9208J9658j43952m8176
10275b99385h6453C2199J05492d4525j00650C5131d4398j10033B5022c65094f9114
10263b70674Q6688M7775j27179A94841G5361J93603a11156L441B69615a97513
10252A19688j3225D3457L62713j37299j16551k9091J91919A44511B3690d309k11466
10241b15775K6968o1335e2894A48308A4225b15983A13805a3834k23900n4072a4774
10229G353a27039D0754c3800r5496b2193l02332H0613Q3148h4798k64580e1620
10217A45447D2199N2147g2982B29639a03510l0802j02458K3082J1529O0911p6377
$$ y = [-398398, -185152, 35148, 149032, -75996, 239287, 117852, 39009, -275927, -6530, -291641, -152216, -22144, 58445, 50161, -19360, 124527, -146123, -126915, -107257, -251209, -299385, -86453, 32199, 137691, -44525, -145175, 35131, -44398, -154431, 25022, -365094, -69114, -270674, -183986, -136211, -263390, 194841, 75361, 268964, -111156, -107715, 269615, -197513, 119688, 106463, 43457, 406170, 268871, 152320, 123229, 315148, 144511, 23690, -4309, -215775, -188807, -250142, -52894, 148308, 14225, -215983, 113805, -13834, -237734, -291806, -14774, 7353, -127039, 40754, -33800, -129296, -22193, -324525, 80613, 163761, -84798, -349378, -51620, 145447, 42199, 94346, -72982, 229639, -103510, -134312, -236770, -213688, -202159, -141248, -217625]
10206b17625c7235d692l32925H7073b50057M3049B8785c86453a41207A54273h411
10194c89061i3728G2763J33739g0971H096O0202b51373A20350c9231j56069j59401
10183c54701O8871G3230R3186a82574f4243p7218r9574F1948c01631a42416O6339
10172g6077l7802r5303R1908B54792a9158j53045A33455a06437G7879M5087n061
10161A17905b89187e1567j80260A16863h451B18512D6952c3688k90756a27437
10150b61648B0503J31857a25297k33746m9462P7719C38102D7608a33454B45437
10139c76936G342g2597A64945a38704m1597p9449J24183O3808p3104I9755J5530
10128A15285a09973B93235e8173C52471K4067D9558j6064c04658P4699O4193a2736
$$ y = [-217625, -37235, -4692, -337617, 87073, -250057, -207008, 28785, -386453, -141207, 154273, -8411, -389061, -93728, 72763, 206502, -70971, 8096, 68298, -251373, 120350, -39231, -195300, -354701, -285830, 73230, 166416, -182574, -64243, -141461, -241035, 61948, -301631, -142416, -76077, -113879, -209182, -117274, 254792, -19158, -172203, 133455, -106437, 77879, 122966, 117905, -289187, -51567, -231827, 116863, -8451, 218512, 46952, -33688, -324444, -127437, -261648, 20503, 152360, -125297, -359043, -408505, -330786, 338102, 47608, -133454, 245437, -376936, 7342, -72597, 164945, -138704, -180301, -259750, -135567, -71759, -144863, 99755, 115285, -109973, 293235, -58173, 352471, 376538, 49558, 33494, -304658, -229959, -165766, -12736]
10116c45201a31758A08331A8626c15660a09921k7301k01046K7966a43760A6042
10105A60043b12136J0675B3683K8750d9692k39269a0109A33041o1015a76135I8929
10093C1649a52126n4053c893l17662J03542i361j80493D3500e9408p3214M9923
10082h2699k29648a41183F4836K22302a07384d428I6803b78667l324b8439C9552
10070C22806a8589H0048A8278J06184l9217b05206E5910a79194O9698q6373l7300
10059b33169j16389J65784j53017D7426c48934A972K88694b38231b0199l05243
10049c25442a38542J406I1214d7185j4661a0546l00767A83128J78953F8561a13793
10037a50081D2836b33366G9074D519b17964a08709b6513A98125b53242B24878
$$ y = [-345201, -131758, 108331, 18626, -315660, -109921, -137222, -338268, -310302, -143760, 16042, 160043, -212136, -201461, 23683, 52433, -49692, -288961, -10109, 133041, 72026, -176135, 98929, 31649, -152126, -206179, -3893, -321555, -218013, -9361, -189854, 43500, -59408, -132622, -82699, -312347, -141183, 64836, 287138, -107384, -4428, 96803, -278667, -281991, -28439, 39552, 322806, -18589, 80048, 18278, 124462, 85245, -205206, 55910, -179194, -109496, -195869, -233169, -349558, -183774, -336791, 47426, -348934, 1972, 290666, -238231, -20199, -325442, -138542, -137136, 91214, -47185, -61846, -10546, -311313, 183128, 362081, 68561, -113793, -150081, 42836, -233366, 79074, 4519, -217964, -108709, -26513, 198125, -253242, 224878]
10026b10017E4419J94620b72810B47496a69753b0206a952D4410a42936K7616J1770
10015a03550k3518C5243b58836J15753d1100m5090l3489j9094j97036J46172E3291
10003c4936j51550D8791e8926k4492j50197h6020C2262a68376o3144D2342K7404
9992F9746c652l09063J26303B941K33698c8016C2834N2271a25206k25762P6350
9981b74618r151g6026k56091A24018d46724A46377b83028b6200j49488g71D4544
9969a05834J3344J6592A21148a97385b1042j11938c2072q9750l5099O0666A2451
9957c37985h1959I0644l3274A047d82649A23704b11431L1884e9180A18847d02341
9945I6665f14694D52366a40563j10390H0655a79850f2975F0209F79e205k62887
$$ y = [-210017, 54419, 249039, -272810, 247496, -169753, -20206, -1952, 44410, -142936, -115320, -103550, -127068, 35243, -258836, -143083, -41100, -86190, -119679, -138773, -335809, -189637, 53291, -34936, -186486, 48791, -58926, -83418, -233615, -86020, 32262, -168376, -231520, 42342, 69746, -3652, -312715, -186412, 2941, 236639, -38016, 32834, 85105, -125206, -350968, -274618, -283769, -76026, -332117, 124018, -446724, 146377, -283028, -26200, -175688, -771, 44544, -105834, -92490, -75898, 121148, -197385, -21042, -132980, -32072, -121822, -156921, -96255, 12451, -337985, -81959, 90644, 57370, 1047, -482649, 123704, -211431, -179547, -59180, 118847, -402341, 96665, -614694, 452366, -140563, -250953, 80655, -179850, -62975, 60209, 679, -5205, -268092]
9934b68092Q5758A10120J6035a02086H7357J35139a73579j33218D4445A6177a19993
9922b7498h837A32486m6296K6708b82697B9234c1084k03641J8853A03328b65560
9910a45109e5416m9947o7421h607j95758D6099i4821K1057A12611J61657b93619
9898a17852C97788a11733A16045c3088l03462J42942a4719j02864l34B2986a37682
9886b22175a10876B61208b44105K0314N6301K9509r5559g8581b7430H7500a13547
9874b4372a2117j32813A16467J25196m7661b47870h5865l52614i8894P771L7048
9863e4075p4115A10280c5457l9682q13G4117b2841H4926O4970h2156a1679j43580
9851a55259B12381a78233J1803g1948m058B7356d1421k38325a04939J3104F1261
$$ y = [-268092, -182334, 110120, 126155, -102086, 87357, 222496, -173579, -306797, 44445, 16177, -119993, -27498, -8837, 132486, 86190, 112898, -282697, 29234, -31084, -234725, -215872, 103328, -265560, -145109, -55416, -105363, -172784, -8607, -204365, 46099, -94821, -73764, 112611, 274268, -293619, -117852, 397788, -111733, 116045, -33088, -336550, -193608, -14719, -117583, -117917, 22986, -137682, -222175, -110876, 261208, -244105, -223791, -167490, -137981, -233540, -78581, -27430, 87500, -113547, -24372, -12117, -144930, 116467, 241663, 194002, -247870, -85865, -438479, -98894, -91123, -54075, -128190, 110280, -35457, -75139, -75952, 74117, -22841, 84926, 149896, -82156, -11679, -155259, 212381, -178233, -166430, -71948, -76006, 27356, -41421, -279746, -104939, -91835, 61261]
9839B73465b24709h0526H7633L3160J29994a62919k271A6826J0254J05593d45904
9827B0355J75717d181A31469C8635K7411i7540a4314j58655A38665D9754a36848
9815a09460C7792N999L523j3050a58339B8876M3246J8510C7570M8965h8312K256
9803h6056j04816Q1647L5696k04968C21952i8419j59159Q8103J3125c9371l3608
9792g2979j07964A5175d83497e0703H9212l0172a84747P6561n6894Q0827M2026
9781d2227j20778k64402g9721P645I1012a57017A38986E0531e6632j6282k11490
9770b84404b1063F4324j7190J48985c74857A31108b692C2738c25055h7856A97701
9758b85146A95052p8219b99896O5424a07030q4882A3852K995K58254A2414b83184
$$ y = [273465, -224709, -80526, 87633, 120793, 250787, -162919, -165190, 16826, 27080, 132673, -445904, 20355, 196072, -4181, 131469, 38635, 66046, -97540, -14314, -172969, 138665, 49754, -136848, -109460, 37792, 43791, 47314, 34264, -158339, 28876, 72122, 90632, 37570, 86535, -88312, -86056, -190872, -109225, -73529, -278497, 321952, -98419, -257578, -169475, -156350, -39371, -72979, -180943, 15175, -483497, -50703, 89212, 59040, -184747, -108186, -165080, -84253, -42227, -163005, -427407, -79721, -72076, 91012, -157017, 138986, 50531, -56632, -72914, -284404, -21063, 64324, 47134, 196119, -374857, 131108, -2692, 32738, -325055, -87856, 197701, -285146, 195052, 116833, -299896, -234472, -107030, -191912, 13852, 16847, 275101, 12414, -283184]
9746h3037j6956J2850H6697f9685A55393d62018J06650e2863j2702B89696b51336
9734a41641O5470o0720L165a5347H8008b84595G7467h1507k91682a72645J5718
9723a56927j60006N4162B00772J22535c32145L6095e0668I6951c22778A4127a79251
9711E0511d84013B48008C0765d1485C2639a86151P9552n9837e6884I9251b97976
9699B27762D6920M5625i5654H7186P1183J6793G2891M3689b87903N9573L5831
9688a92499P5571L2712o8034l9850M3561G1096a0729B10436c35670A36446b55298
9676b67329J31809D2885a99328A53928b24849F1020h1347B4465e1033j31816i0833
9664c1558j82097R2773e859l25392O7563B59798c77772E043b10795N3271A48385
$$ y = [-83037, -99993, -87143, 86697, -69685, 155393, -462018, -355368, -52863, -65565, 289696, -251336, -141641, -76171, -136891, -133726, -15347, 88008, -284595, 77467, -81507, -373189, -172645, -156927, -316933, -262771, 200772, 323307, -332145, -296050, -50668, 96951, -322778, 14127, -179251, 50511, -484013, 248008, 30765, -41485, 32639, -186151, -106599, -166436, -56884, 99251, -297976, 227762, 46920, 92545, -95654, 87186, 158369, 175162, 72891, 116580, -287903, -228330, -192499, -116928, -84216, -152250, -192100, -148539, 71096, -10729, 210436, -335670, 136446, -255298, -267329, -135520, 42885, -199328, 153928, -224849, 61020, -81347, 24465, -51033, -182849, -90833, -31558, -213655, -120882, -5859, -331251, -263688, 259798, -377772, 5043, -210795, -157524, 148385]
9652B81531h5563A06102i8166A11846L6382b22183A76516e0180E4005f6902I7632
9640a5042A66884M963d23076A1459a18041a0098k71001A77424a19132q5814A83294
9628f6525k35161B50955a77379I9234b23857j44321F2276c97442H8584a85320
9617g474j5408B60828B2489g9446A38012o5903i8616j08706J00372E9887g818
9605a14236C6811a96139L258j40968A48672d01676F756d67287h7247K1282H7645
9593E4383O1331b10620A20755e8608j20866H4759a34186j11475I7128Q9476a98920
9581E853b55560B03031a94058j89005B08463b10970j80115a84281A03317c31998
9570c79360A6586K84848C537i1668A01998a60176m4861j04167B3670C388a19601
$$ y = [281531, -85563, 106102, -98166, 111846, 148228, -222183, 176516, -50180, 54005, -66902, 97632, -15042, 166884, 171847, -423076, 11459, -118041, -10098, -281099, 177424, -119132, -204946, 183294, -66525, -301686, 250955, -177379, 99234, -223857, -368178, 62276, -397442, 88584, -185320, -7474, -22882, 260828, 22489, -79446, 138012, 72109, -98616, -207322, -106950, 59887, -7818, -114236, 36811, -196139, -192881, -333849, 148672, -401676, 6756, -467287, -87247, -65965, 87645, 54383, 115714, -210620, 120755, -58608, -179474, 84759, -134186, -245661, 97128, 186604, -198920, 5853, -255560, 203031, -194058, -383063, 208463, -210970, -391085, -184281, 103317, -331998, -379360, 16586, 301434, 3537, -91668, 101998, -160176, -205037, -309204, 23670, 3388, -119601]
9558b19182c1746o6j50911A19185N890a02141k0019I9347a2653k1313d494p4970
9546g9464k32881d1560I6168L8905b32514O4628B96029q3963J0743I3923J07158
9535B01081a02959B34339J13752D3036c35692A12412h5009k40034G393e6830A26348
9523e7746B23548H8579K13772f3131K9515d939j30992J1421a0996I3169A4957
9511g1023B20546a01887A89935a66832P5072C18540a08224m0994f4684F5745K61178
9500C26923a95243o6496h8519L5008F384d22509a76439n98C7488a1495r9507L2468
9488g8534p2524A37406E2668f7953B52805a64688c0986J600l58632B02859a17628
9476B28309q4603c16665H2611C8488b59899H1689k5521g7231B53829c77148A24786
$$ y = [-219182, -31746, -31812, -182723, 119185, 125075, -102141, -122160, 99347, -12653, -33966, -4494, -79464, -312345, -41560, 96168, 135073, -232514, -167886, 296029, 212066, 222809, 93923, 201081, -102959, 234339, 348091, 43036, -335692, 112412, -85009, -325043, 7393, -56830, 126348, -57746, 223548, 88579, 302351, -63131, -33616, -4939, -135931, -124510, -10996, 93169, 14957, -71023, 220546, -101887, 189935, -166832, -91760, 318540, -108224, -149218, -64684, 65745, 326923, -195243, -261739, -88519, -53511, 6384, -422509, -176439, -177037, 37488, -11495, -111002, -78534, -151058, 137406, 52668, -67953, 252805, -164688, -30986, -29386, -388018, 202859, -117628, 228309, 143706, -316665, 82611, 38488, -259899, 81689, 56168, -77231, 253829, -377148, 124786]
9464a986o7019o0895p5646B9144b52120c6142B72817b57324j8041A21221m9892
9453G1329b23438J6351N3386j08945h8537C25380c70015i3681m16165H2068i3747
9441A48671a51725e9286q0371f5707A99048c25435K3068P5154G8890b62019c7397
9429a9798r2732j91141J12289A68607K22234a57802j09166J6616J18922A51606
9418A83412c18679e0692b1739j68361E9272a79395m7693i2616l0058C32493a45576
9406b42112K6205f330l139p1652C71496a50994k2878a5126k6455J576l0798j4331
9394h5134H766J35750K4735c51791a64950O7885k0016A03220c86409a28566C857
9382a40371c2230A54391M2196A5433R7321b33941C8863R3577D620b2926P139j56102
$$ y = [-1986, -69005, -129900, -205546, 29144, -252120, -36142, 272817, -257324, -275365, 121221, 71329, -223438, -207087, -153701, -262646, -88537, 325380, -370015, -93681, -509846, 82068, -93747, 148671, -151725, -59286, -139657, -65707, 199048, -325435, -302367, -227213, 78890, -262019, -37397, -19798, -112530, -303671, -191382, 168607, 390841, -157802, -266968, -250352, -131430, 151606, 183412, -318679, -50692, -21739, -190100, 59272, -179395, -227088, -92616, -122674, 332493, -145576, -242112, -215907, -6330, -9469, -81121, 371496, -150994, -173872, -15126, -41581, -40005, -70803, -85134, 8766, 144516, 169251, -351791, -164950, -97065, -117081, 103220, -386409, -128566, 3857, -140371, -32230, 154391, 196587, 15433, 112754, -233941, 38863, 132440, 4620, -22926, -15787, -171889]
9370a71889C1290f9130E8779c0058j07298A69253J9130J25284e64j4913A05653
9358A88628A4295h9146q5932K8093l2020Q7668p3980g6675d785j73385k8713P0465
9346a36418j57898b7876j7708E6641b34367A87652b79840f404j47j00493d1905
9334a51153d9387j56798D4748J33176g0455C01562A18563d48960H353b82235F834
9322a86151C48257c7653D5616d0730l3086B09764f087l46089B05871B3648a97746
9310a03955j29401f9684J292j11879p762A3694O9115i1960j66686k584e2713k98089
9298c50802e8637A47495K4566O2978c33234f2605l72216g3549A4319M01202E4872
9286a26311A07443b0393j1330h148l4499k84762H9053g7717k02621A55149m6274
$$ y = [-171889, 31290, -69130, 58779, -30058, -137356, 169253, 188383, 313667, -564, -15477, 105653, 188628, 14295, -89146, -175078, -146985, -179005, -91337, -165317, -76675, -4785, -178170, -206883, -136418, -294316, -27876, -45584, 56641, -234367, 187652, -279840, -6404, -6551, -107044, -41905, -151153, -49387, -206185, 44748, 177924, -70455, 301562, 118563, -448960, 8353, -282235, 6834, -186151, 348257, -37653, 45616, -40730, -73816, 209764, -6087, -352176, 205871, 23648, -197746, -103955, -233356, -69684, -68392, -180271, -188033, 13694, 82809, -91960, -258646, -261230, -52713, -350802, -58637, 147495, 172061, 235039, -333234, -62605, -434821, -73549, 14319, 415521, 54872, -126311, 107443, -20393, -31723, -8148, -42647, -327409, 89053, -77717, -280338, 155149, 108875]
9275A08875i9988A20669L5289a27726O0474l5150Q092l16575b9286A4938e737
9263A68159g4042D3510K39105A5183J50659b26144o4554D1330L0364B8671b35670
9251A19868b61435A82906G1528f4676E2290J79158A02123e8674n3048C9845k37
9240C9608c74173d2870j73446a1927k78211A1311a79809A94384b31746A26209
9229H0743l2390A0609b88076d724A56475P8433A5910a08903n6293C6059b71j31962
9217a32233j11462A64369E4981h014l13819i8258C6832c89350J71817A000K76860
9206B77860c46668B46916b82112d8958n6591b5975J377C0262b96379R2830K9690
9195a73859k4707A04082A0888J07064E525O1316a70241j91302d7391j39508j749
$$ y = [108875, -99988, 120669, 155958, -127726, -67252, -102402, -94310, -410885, -29286, 14938, -5737, 168159, -74042, 43510, 282615, 15183, 165842, -226144, -290698, 41330, 71694, 28671, -235670, 119868, -261435, 182906, 71528, -64676, 52290, 231448, 102123, -58674, -111722, 39845, 39608, -374173, -42870, -216316, -11927, -290138, 11311, -179809, 194384, -231746, 126209, 80743, 48353, 10609, -288076, -4724, 156475, 234908, 15910, -108903, -165196, 36059, -271, -132233, -243695, 164369, 54981, -8014, -321833, -98258, 36832, -389350, -217533, 1000, 277860, -346668, 246916, -282112, -48958, -105549, -25975, -24598, 30262, -296379, -203549, -173859, -198566, 104082, 10888, 117952, 5525, 66841, -170241, -361543, -47391, -186899, -188648]
9184a88648P3064A7499J42060a48480j50069h8766L206c9304k60587A25315g0258
9172i7302A0936g5959B07903k8778c30385D8852a43878A60508c72233I9090i9339
9160a71851D0488A9675d4758k83190a2353o701B94736A4102Q932J15771b63454
9148c91737e8708l47541E2301H425c86212A73765B203J20042g8807n2181A04649
9136A10989b97764i0687d037m00822a00450F1639a48772B16069h0984C5618b69306
9124E5417L32681b49234A13943b29332c2744A25660E8236h4510A07961j8199d90226
9112b06905I164h3834r6288R060c1117k42446k3345M7583f4067b3074n2929A152
9099h2291D02609d86470b41449g1514j20321M3838L9924I6139F124K08199h1777
$$ y = [-188648, -115584, 17499, 159559, -148480, -298549, -88766, -85560, -39304, -299891, 125315, -70258, -97302, 10936, -75959, 207903, 179125, -330385, 48852, -143878, 160508, -372233, 99090, -99339, -171851, 40488, 19675, -44758, -327948, -12353, -19054, 294736, 14102, 23034, 138805, -263454, -391737, -58708, -406249, 52301, 8425, -386212, 173765, 2203, 122245, -78807, -130988, 104649, 110989, -297764, -90687, -4037, -404859, -100450, 61639, -148772, 216069, -80984, 35618, -269306, 55417, 388098, -249234, 113943, -229332, -32744, 125660, 58236, -84510, 107961, 89762, -490226, -206905, 9164, -83834, -180122, -171062, -31117, -273563, -296908, -249325, -64067, -23074, -76003, 1152, -82291, 402609, -486470, -241449, -71514, -191835, -147997, -108073, 96139, 6124, 214323, -81777]
9087e2175o6208j26455D5116b02750B71206a20483A20560a85612B0875b8941A51994
9075i5444i439E7329J60640e0372J8878C1882b32199e0632k2737B37265j01584
9064A35681c91877c1869A29678b35090J03419r8551R4428A07119K5811K9258b99589
9052A48754c16023D5004d00714A17608g5880q965m7875d8106j34738A44140c7051
9040b54350a06684A01983e8932j61812A57048B9888b89436H0294a96916d7766
9029G2452J3909a05373p225b7842q0176k9949l2704A04342b56951B30381D2564
9017A69517h4368j63575E4963e6131A87810D8613b66834B5737O741h5137G7164
9005a09257F9637L0133L9505f0109A8305c27669A83557c74701C8099j1725a54520
$$ y = [-52175, -118383, -244838, 45116, -202750, 271206, -120483, 120560, -185612, 20875, -28941, 151994, -95444, -9439, 57329, 217969, -50372, -31494, 31882, -232199, -50632, -73369, 237265, 135681, -391877, -31869, 129678, -235090, -131671, -230222, -135794, 107119, 132930, 162188, -299589, 148754, -316023, 45004, -400714, 117608, -75880, -84845, -132720, -48106, -182844, 144140, -37051, -254350, -106684, 101983, -58932, -220744, 157048, 29888, -289436, 80294, -196916, -47766, 72452, 86361, -105373, -112598, -27842, -108018, -137967, -170671, 104342, -256951, 230381, 42564, 169517, -84368, -247943, 54963, -56131, 187810, 48613, -266834, 25737, 32478, -85137, 77164, -109257, 69637, 99770, 139275, -60109, 18305, -327669, 183557, -374701, 38099, 26374, -154520]
8993c40070b5583j60507R2144k1446I9593d932k40408j8609R8223B0812a29309
8981c8545j68884R9151C63179b0165A4987a97088A97314a05264m40I2535c61643
8969g9234I1479K6705A4175a84106l3476h4215k68809a54355P4975A64435b21339
8957A92357B914P1391B617K98794b9490A92488a38354D33994D738a37765j85047
8946c22812c1410C4145b49453C9559f9653G5135J91771j30384n3694c17954J20477
8935a97477H6660N8318L93946B14784L23254D8407f5117G0594b83412C4481a22703
8923a42076A88858L84988R1385J608776O559327O220065E712065B071332E37457
8913D76677a05391B82449o3961a16265B3748K6005a8340D2453M30621k08482a32667
$$ y = [-340070, -25583, -186090, -93946, -115392, 99593, -4932, -245340, -263949, -165726, 20812, -129309, -38545, -207429, -108278, 363179, -20165, 14987, -197088, 197314, -105264, -105704, 92535, -361643, -79234, 91479, 118184, 14175, -184106, -217582, -84215, -353024, -154355, -79380, 164435, -221339, 192357, 2914, 74305, 2617, 301411, -29490, 192488, -138354, 433994, 4738, -137765, -322812, -31410, 34145, -249453, 39559, -69653, 75135, 266906, 136522, 82828, -317954, -197477, 86660, 144978, 538924, 214784, 538038, 48407, -65117, 70594, -283412, 34481, -122703, -142076, 188858, 573846, 665231, 2274007, 8833334, 15053399, 5712065, 2071332, 537457, 476677, -105391, 282449, 218488, -116265, 23748, 49753, -18340, 42453, 473074, 264592, -132667]
8901B30846a54436P5547D2218A6517a52144G4999E534a71991k09177A36339Q3591
8890B19930c2738j95203p315K1499B38584i4018j20862c4997A9450b52461c0665
8878f0092k9755A12955b40385F9043c28135L6840B11545F4146a19722j79024f6422
8866C97749a49089B06902a02067G8828l1103d647G3240a20254N3217p5549A61511
8854E0180c52230A81581c82387a13700A1452a56510L7492j33454m1137h3955a5145
$$ y = [230846, -154436, -78889, 42218, 16517, -152144, 74999, 5534, -171991, -381168, 136339, 219930, -32738, -227941, -235256, -213757, 238584, -94018, -214880, -34997, 19450, -252461, -30665, -60092, -89847, 112955, -240385, 69043, -328135, -291295, 211545, 64146, -119722, -298746, -66422, 397749, -149089, 206902, -102067, 78828, 47725, -4647, 73240, -120254, -67037, -142586, 161511, 50180, -352230, 181581, -382387, -113700, 11452, -156510, -119018, -252472, -293609, -83955, -15145]
$$ [...]
##END NTUPLES=NMR SPECTRUM
##END=
