
##TITLE=AC1346_GUAAH12164_6647547_vDHIZcHlFm
##JCAMPDX= 6.0         $$ Bruker NMR JCAMP-DX V2.0
##DATA TYPE= NMR SPECTRUM
##DATA CLASS= NTUPLES
##ORIGIN= BRUKER
##OWNER= Administrator
$$ 1.72 TOPSPIN		Version 2.1
$$ 2012-08-09 17:44:08.656 -0500  Administrator@TOPSPIN
$$ Compression mode = diff/dup
##.OBSERVE FREQUENCY= 400.02188249412
##.OBSERVE NUCLEUS= ^1H
##.ACQUISITION MODE= SIMULTANEOUS (DQD)
##.ACQUISITION SCHEME= undefined
##.AVERAGES= 64
##.DIGITISER RES= 22
##SPECTROMETER/DATA SYSTEM= spect
##.PULSE SEQUENCE= noesygpps1d.comp
##.SOLVENT NAME= COFFEE_meoh
##.SHIFT REFERENCE= INTERNAL, COFFEE_meoh, 1, 14.96296
##AUDIT TRAIL= $$ (NUMBER, WHEN, WHO, WHERE, PROCESS, VERSION, WHAT)
$$ ##TITLE= Audit trail, TOPSPIN		Version 2.1
$$ ##JCAMPDX= 5.01
$$ ##ORIGIN= Bruker BioSpin GmbH
$$ ##OWNER= Administrator
$$ $$ C:\Bruker\TOPSPIN/data/COFFEE/nmr/AC1346_GUAAH12164_6647547_vDHIZcHlFm/12/pdata/1/auditp.txt
$$ ##AUDIT TRAIL=  $$ (NUMBER, WHEN, WHO, WHERE, PROCESS, VERSION, WHAT)
(   1,<2012-08-09 17:44:03.984 -0500>,<Administrator>,<TOPSPIN>,<go>,<TOPSPIN 2.1>,
      <created by zg
	started at 2012-08-09 17:32:33.796 -0500,
	POWCHK enabled, PULCHK disabled,
       configuration hash MD5:
       6B 1B 68 BB D9 2E 58 E2 7F 35 AD 54 07 DF 0E 41
       data hash MD5: 64K
       24 EA F8 EC A5 C4 F4 20 38 3D BF 1F 2B B8 37 8E>)
(   2,<2012-08-09 17:44:06.781 -0500>,<Administrator>,<TOPSPIN>,<proc1d>,<TOPSPIN 2.1>,
      <Start of raw data processing
       efp LB = 0.3 FT_mod = 6 PKNL = 1 PHC0 = 0 PHC1 = 0 SI = 128K 
       data hash MD5: 128K
       2E 6D 39 5F DA 9B C6 12 74 A3 02 19 52 C2 94 A9>)
(   3,<2012-08-09 17:44:07.875 -0500>,<Administrator>,<TOPSPIN>,<proc1d>,<TOPSPIN 2.1>,
      <pk PHC0 = -3.361816 PHC1 = 0 
       data hash MD5: 128K
       BB F0 4E 68 A5 08 77 C2 2B 59 97 6C 8D 63 78 80>)
(   4,<2012-08-09 17:44:08.125 -0500>,<Administrator>,<TOPSPIN>,<proc1d>,<TOPSPIN 2.1>,
      <abs ABSG = 1 
       data hash MD5: 128K
       C9 29 AC E8 09 39 08 2B 19 F2 91 AF 35 20 72 44>)
(   5,<2012-08-09 17:44:08.203 -0500>,<Administrator>,<TOPSPIN>,<proc1d>,<TOPSPIN 2.1>,
      <abs ABSG = 2 
       data hash MD5: 128K
       4E 84 C7 EA 0B 70 06 E9 04 5A F4 05 80 93 9C F6>)
(   6,<2012-08-09 17:44:08.437 -0500>,<Administrator>,<TOPSPIN>,<proc1d>,<TOPSPIN 2.1>,
      <abs ABSG = 3 
       data hash MD5: 128K
       DA 03 B2 40 52 68 BB A5 CC 2A A3 FD 2C F3 62 75>)
(   7,<2012-08-09 17:44:08.515 -0500>,<Administrator>,<TOPSPIN>,<proc1d>,<TOPSPIN 2.1>,
      <abs ABSG = 4 
       data hash MD5: 128K
       80 D4 98 E7 EB C0 9A 8B 48 34 B4 92 1F 31 6D 99>)
(   8,<2012-08-09 17:44:08.578 -0500>,<Administrator>,<TOPSPIN>,<proc1d>,<TOPSPIN 2.1>,
      <abs ABSG = 5 
       data hash MD5: 128K
       DE AE 29 E2 8E 11 1B 8D 15 E4 FF A5 1D 05 21 A6>)
$$ ##END=
$$ 
$$ $$ hash MD5
$$ $$ A1 CE 34 AC 7B 30 37 74 8C E4 5E 68 0F 2F BA A8
##$RELAX= 
##$RELAX= 
##$RELAX= 
##$RELAX= 
##$RELAX= 
##$RELAX= 
##$RELAX= 
##$RELAX= 
$$ Bruker specific parameters
$$ [...]
##$TP07= 0
##$TPNAME0= <>
##$TPNAME1= <>
##$TPNAME2= <>
##$TPNAME3= <>
##$TPNAME4= <>
##$TPNAME5= <>
##$TPNAME6= <>
##$TPNAME7= <>
##$TPOAL= (0..7)
0.5 0.5 0.5 0.5 0.5 0.5 0.5 0.5
##$TPOFFS= (0..7)
0 0 0 0 0 0 0 0
##$TUNHIN= 0
##$TUNHOUT= 0
##$TUNXOUT= 0
##$USERA1= <user>
##$USERA2= <user>
##$USERA3= <user>
##$USERA4= <user>
##$USERA5= <user>
##$V9= 5
##$VALIST= <valist>
##$VCLIST= <CCCCCCCCCCCCCCC>
##$VD= 0
##$VDLIST= <DDDDDDDDDDDDDDD>
##$VPLIST= <PPPPPPPPPPPPPPP>
##$VTLIST= <TTTTTTTTTTTTTTT>
##$WBST= 1024
##$WBSW= 4
##$XGAIN= (0..3)
0 0 0 0
##$XL= 0
##$YL= 0
##$YMAX_a= 17048281
##$YMIN_a= -10088244
##$ZGOPTNS= <>
##$ZL1= 120
##$ZL2= 120
##$ZL3= 120
##$ZL4= 120
##$ABSF1= 14.96296
##$ABSF2= -5.595222
##$ABSG= 5
##$ABSL= 3
##$ALPHA= 0
##$AQORDER= 0
##$ASSFAC= 0
##$ASSFACI= 0
##$ASSFACX= 0
##$ASSWID= 0
##$AUNMP= <proc_prof1d_extract.lims>
##$AXLEFT= 0
##$AXNAME= <>
##$AXNUC= <1H>
##$AXRIGHT= 0
##$AXTYPE= 0
##$AXUNIT= <>
##$AZFE= 0.1
##$AZFW= 0.1
##$BCFW= 0
##$BC_mod= 0
##$BYTORDP= 0
##$COROFFS= 0
##$CY= 15
##$DATMOD= 1
##$DC= 0
##$DFILT= <>
##$DTYPP= 0
##$F1P= 0
##$F2P= 0
##$FCOR= 0.5
##$FTSIZE= 131072
##$FT_mod= 6
##$GAMMA= 0
##$GB= 0
##$INTBC= 1
##$INTSCL= 1
##$ISEN= 128
##$LB= 0.3
##$LEV0= 0
##$LPBIN= 0
##$MAXI= 10000
##$MC2= 0
##$MEAN= 0
##$ME_mod= 0
##$MI= 0
##$NCOEF= 0
##$NC_proc= -2
##$NLEV= 6
##$NOISF1= 0
##$NOISF2= 0
##$NSP= 0
##$NTH_PI= 0
##$NZP= 0
##$OFFSET= 14.96296
##$PC= 1
##$PHC0= -3.361816
##$PHC1= 0
##$PH_mod= 1
##$PKNL= yes
##$PPARMOD= 0
##$PPDIAG= 0
##$PPIPTYP= 0
##$PPMPNUM= 2147483647
##$PPRESOL= 1
##$PSCAL= 4
##$PSIGN= 0
##$PYNMP= <proc.py>
##$REVERSE= no
##$SF= 400.020008851972
##$SI= 131072
##$SIGF1= 0
##$SIGF2= 0
##$SINO= 400
##$SIOLD= 131072
##$SPECTYP= <>
##$SREGLST= <1H.CDCl3>
##$SSB= 0
##$STSI= 131072
##$STSR= 0
##$SW_p= 8223.68421052631
##$SYMM= 0
##$S_DEV= 0
##$TDeff= 65536
##$TDoff= 0
##$TI= <>
##$TILT= no
##$TM1= 0
##$TM2= 0
##$TOPLEV= 0
##$USERP1= <user>
##$USERP2= <user>
##$USERP3= <user>
##$USERP4= <user>
##$USERP5= <user>
##$WDW= 1
##$XDIM= 131072
##$YMAX_p= 423442242
##$YMIN_p= -58965
##$CURPLOT= <Network HP LaserJet P1505>
##$CURPRIN= <$Network HP LaserJet P1505>
##$DFORMAT= <normdp>
##$LAYOUT= <+/1D_H.xwp>
##$LFORMAT= <normlp>
##$PFORMAT= <normpl>
##$SURQMSG= 1
$$ End of Bruker specific parameters
$$ ---------------------------------
##NTUPLES= NMR SPECTRUM
##VAR_NAME=  FREQUENCY,     SPECTRUM/REAL,   SPECTRUM/IMAG
##SYMBOL=    X,             R,               I
##VAR_TYPE=  INDEPENDENT,   DEPENDENT,       DEPENDENT
##VAR_FORM=  AFFN,          ASDF,            ASDF
##VAR_DIM=   131072,        131072,          131072
##UNITS=     HZ,            ARBITRARY UNITS, ARBITRARY UNITS
##FACTOR=    0.0627417313425164, 1,          1
##FIRST=     8223.62146879497, -1911,        -56419
##LAST=      0,             307,             -57277
##MIN=       0,             -58965,          0
##MAX=       8223.62146879497, 423442242,    0
$$ Real data points
##PAGE= N=1
##DATA TABLE= (X++(R..R)), XYDATA
$$ [...]
60894G43558m634k691LK346L529M066N149O917Q183Q223P786P674P372O192M878
60879H08551M685N276N025L346J431M20k2q86k410m039n197n735n951o412p481
60864G90601q801r587r541r231r314r670r501q225o134m161l000k532k112j293
60850F97499l3J631L728O091Q328J0191J1705J2912J3848J4775J5937J7007J7364
60837H30983J7129J7178J7758J7767J6198J3777J2353J2740J3919J4452J3954
60826I98208J2891J1573R887P888O041M661L511K255J073L75k6q51k325l777m600
60811A046784n082n858p080q567j0343j2315j3892j4598j4703j4657j4315j3497
60799I11877j2778j2696j2608j1430r234o975m875k405K12K050L173M817P449
$$ y = [743558, 738924, 736233, 736236, 738582, 742111, 746177, 751326, 758243, 766426, 774649, 782435, 790109, 797481, 803673, 808551, 813236, 818512, 823537, 826883, 828314, 828734, 828712, 827826, 825416, 821377, 816180, 810445, 804494, 798082, 790601, 781800, 772213, 762672, 753441, 744127, 734457, 724956, 716731, 710597, 706436, 703436, 700904, 698792, 697499, 697466, 699097, 702825, 708916, 717244, 727435, 739140, 752052, 765900, 780675, 796612, 813619, 830983, 848112, 865290, 883048, 900815, 917013, 930790, 943143, 955883, 969802, 984254, 998208, 1011099, 1022672, 1032559, 1040447, 1046488, 1051149, 1054660, 1056915, 1057988, 1058363, 1058337, 1057486, 1055161, 1051384, 1046784, 1041702, 1035844, 1028764, 1020197, 1009854, 997539, 983647, 969049, 954346, 939689, 925374, 911877, 899099, 886403, 873795, 862365, 853131, 846156, 841281, 838876, 839088, 841138, 844311, 849128, 856577]
60786H56577R981J1552J2703J4073J5097J4951J3854J2551J1229R768Q415P387
60774I98138O366N070L842L049K474J791J148P93N89M37N30R19J348J881K889
60759A031264M129M805M953N648P166Q146P576O534O691P891Q594Q239P695P608
60745A126939P586P111O163M852L283J934J395J530J561J082M44R9K7o9m47j240
60729A162250k341l360m013m363m528m408m119m341n604p413q689r170r779j1465
60715A078657j4054j6468j7824j8068j7740j7366j7120j6846j6178j4706j2308
60704H99979r470o929m871k826n40J597L337N127P191Q643Q496P209O134N641
60690I28718M865L231J081j248l768o086p568q454r721j1458j2618j2724j2591
$$ y = [856577, 866558, 878110, 890813, 904886, 919983, 934934, 948788, 961339, 972568, 982336, 990751, 998138, 1004504, 1009574, 1013416, 1016465, 1018939, 1020730, 1021878, 1022671, 1023260, 1023697, 1024227, 1025146, 1026494, 1028375, 1031264, 1035393, 1040198, 1045151, 1050799, 1057965, 1066111, 1073687, 1080221, 1086912, 1094803, 1103397, 1111636, 1119331, 1126939, 1134525, 1141636, 1147799, 1152651, 1155934, 1157868, 1159263, 1160793, 1162354, 1163436, 1163880, 1163979, 1164006, 1163937, 1163490, 1162250, 1159909, 1156549, 1152536, 1148173, 1143645, 1139237, 1135118, 1130777, 1125173, 1117760, 1109071, 1099901, 1090122, 1078657, 1064603, 1048135, 1030311, 1012243, 994503, 977137, 960017, 943171, 926993, 912287, 899979, 890509, 883580, 878709, 875883, 875343, 876940, 880277, 885404, 892595, 901238, 909734, 916943, 923077, 928718, 933583, 936814, 937895, 936647, 932879, 926793, 919225, 910771, 901050, 889592, 876974, 864250, 851659]
60677H51659j2771j2572j1353r704q425p353o025m643l522k388j099k70k98n69
60663G70667n17o98j787l142l537k891k192k012j998j661r46p7O50J124J677K646
60647G55306L479L137J728P37R70J377Q53J67P89K547L907M257M561N745P613
60632G97173R511J1230J2969J4910J6920J8520J9331J9704K0397K1387K1706K0809
60620A004567J9308J7814J5957J3298J0408Q067O125M065K036L53j372l548n582
60607A091496o565o553o228n859n556n944p311q577q430p291o905q081r908j1213
60593I87075j1689j1552j1031j0361r606q515p087n887n238m552l356k295k103
60580H93803k136j268K23J155J546K563M286N249M674L702L660M272M383L564
$$ y = [851659, 838888, 826316, 814963, 805259, 796834, 789481, 783456, 778813, 775291, 772903, 771804, 771534, 771236, 770667, 770150, 769452, 767665, 764523, 760986, 758095, 755903, 753891, 751893, 750232, 749286, 749209, 749859, 750983, 752660, 755306, 758785, 761922, 763650, 764387, 765357, 766734, 767587, 767754, 768543, 771090, 774997, 779254, 783815, 789560, 797173, 806684, 817914, 830883, 845793, 862713, 881233, 900564, 920268, 940665, 962052, 983758, 1004567, 1023875, 1041689, 1057646, 1070944, 1081352, 1089419, 1095544, 1099609, 1101645, 1101998, 1100626, 1097078, 1091496, 1084931, 1078378, 1072150, 1066291, 1060735, 1054791, 1047480, 1038903, 1030473, 1023182, 1016277, 1008196, 998288, 987075, 975386, 963834, 952803, 942442, 932836, 924321, 917234, 911347, 906109, 901557, 898201, 895906, 893803, 891667, 890399, 890622, 891777, 893323, 895886, 900172, 905421, 910095, 913797, 917457, 921729, 926112, 929676]
60566I29676K229Q36k80q54j121j906l703n855p178p225o573o075o042o148n875
60551H73906n073m066l236k617k018j305l57J025K918N136P593J0611J4652J9768
60537I16937K5466L0905L5217L7903L9024L8610L5959L0220K1790J2314L067n912
60525A221500j4589k1813k6151k7323k6158k3604k0379j6965j3282q783l468J628
60513A020613N417P681Q658Q475P488O435N638M808M147M666O744R450J2209J5981
60499A128410K1791K9150L7207M6417N7644P0469Q4022R8771J15833J35084J55585
60488A980383J77480K01775K28410K56072K83534L09211L29110L36803L26137
60479D428915K93537K38522J63910P5851j7721j09129j91252k57140l01784l24859
$$ y = [929676, 931905, 932741, 932461, 931607, 930486, 928580, 924877, 919022, 911844, 904619, 898046, 891971, 885929, 879781, 873906, 868833, 864767, 861531, 858914, 856896, 855591, 855234, 856259, 859177, 864313, 871906, 882517, 897169, 916937, 942403, 973308, 1008525, 1046428, 1085452, 1124062, 1160021, 1190241, 1212031, 1224345, 1227412, 1221500, 1206911, 1185098, 1158947, 1131624, 1105466, 1081862, 1061483, 1044518, 1031236, 1022453, 1018985, 1020613, 1026030, 1033711, 1042369, 1050844, 1058332, 1064767, 1070405, 1075213, 1079360, 1084026, 1090770, 1100220, 1112429, 1128410, 1150201, 1179351, 1216558, 1262975, 1320619, 1391088, 1475110, 1573881, 1689714, 1824798, 1980383, 2157863, 2359638, 2588048, 2844120, 3127654, 3436865, 3765975, 4102778, 4428915, 4722452, 4960974, 5124884, 5200735, 5183014, 5073885, 4882633, 4625493, 4323709, 3998850]
60469C998850l30250l22610l05376k81688k54971k27756k01173j76131j53711
60460A745184j34073j16313j00039q5910p4289o4572n6382n0072m5374m0861l5629
60449I41670l0549k6942k4798k3146k1421j9690j7993j6325j4925j4015j3348
60438G18518j2406j0897q970p187o171n912n561m454l063k285k037j429j83J108
60424F49071K102L035L871M077L518K728K155J921K326L672N372O203N727M727
60410G00505M001L609L395L420L557L445L045K669K341J871J518J788K574L287
60396G41025L868M693N542N689N148M789N026N343N303N072M701L925K928K380
60382H05432K404K362J974J744J972K151J778J032L62JJ2K85M23K08O0L45N09
$$ y = [3998850, 3668600, 3345990, 3040614, 2758926, 2503955, 2276199, 2075026, 1898895, 1745184, 1611111, 1494798, 1394759, 1308849, 1234560, 1169988, 1113606, 1063534, 1018160, 977299, 941670, 911121, 884179, 859381, 836235, 814814, 795124, 777131, 760806, 745881, 731866, 718518, 706112, 695215, 686245, 679058, 672887, 666975, 661414, 656960, 653897, 651612, 649575, 648146, 647963, 649071, 651173, 654208, 658079, 662156, 665674, 668402, 670557, 672478, 674804, 678476, 683848, 690051, 695778, 700505, 704506, 708115, 711510, 714930, 718487, 721932, 724977, 727646, 729987, 731858, 733376, 735164, 737738, 741025, 744893, 749586, 755128, 760817, 765965, 770754, 775780, 781123, 786426, 791498, 796199, 800124, 803052, 805432, 807836, 810198, 812172, 813916, 815888, 818039, 819817, 820849, 821211, 821212, 821224, 821509, 821932, 822140, 822200, 822545, 823054]
60365H23054j88j303j686j109l49K55J054K000K574K871L498M308M585M541N229
60350H49334O800Q208Q950R654J0624J1204J1069J0712J0286R240P612O296N576
60337I65565M706L382K226J370J73j098r87R15L132M632O330R097J1811J2944
60323A024198J2839J2747J2511J0926P819M271J027k016m895p237q774r459r165
60310A044792p865n981m187k965k462k342j728NK306M053N144O472Q244R545R890
60295A062921R880R784Q827O551L775J334r32l223m970n853o499p231p210n872
60281A061282m189l361l090k284p21J089L003N125P100Q512R624J0944J2536J4310
60267A119880J6367J8511K0241K1767K4151K7790L1770L5395L9223M3777M8431
$$ y = [823054, 822866, 821563, 819877, 818768, 818419, 818674, 819728, 821728, 824302, 827173, 830671, 834979, 839564, 844105, 849334, 856134, 864342, 873292, 882946, 893570, 904774, 915843, 926555, 936841, 946081, 953693, 959989, 965565, 970271, 973653, 975879, 977249, 977422, 976324, 975337, 976252, 979384, 984016, 990346, 999443, 1011254, 1024198, 1037037, 1049784, 1062295, 1073221, 1081040, 1085311, 1086338, 1084322, 1079427, 1072190, 1063416, 1053957, 1044792, 1036927, 1030946, 1026759, 1023794, 1021332, 1018990, 1017262, 1017267, 1019573, 1023626, 1028770, 1035242, 1043486, 1053031, 1062921, 1072801, 1082585, 1091412, 1097963, 1101738, 1103072, 1102140, 1098917, 1093947, 1088094, 1081595, 1074364, 1067154, 1061282, 1057093, 1053732, 1050642, 1048358, 1047637, 1048726, 1051729, 1056854, 1063954, 1072466, 1082090, 1093034, 1105570, 1119880, 1136247, 1154758, 1174999, 1196766, 1220917, 1248707, 1280477, 1315872, 1355095, 1398872, 1447303]
60256A447303N2678N7339O3304P0040P6666Q3597R1717J00698J09508J18002J26604
60245B397456J35038J42651J49443J55479J59735J60962J59236J55240J48499
60236C763739J37910J23805J07929R1315P3531N4245L4207J4414m628k2374l7930
60225D336163n0649o0425o7168p0513p0289o6796o0523n1889m1202k8587j4062
60214C754060J995J8787L5805N3289P1601R0458J09131J26940J43121J56709J67069
60203D728965J74139J77716J76984J71237J60583J45524J26358J03540P8058N0913
60193F094017K2671o006l3913n9934q3568j04469j21980j35508j44665j48723
60183E277922j46919j39760j29127j16375j01266q3363o3411m2472k0692K041
$$ y = [1447303, 1499981, 1557320, 1620624, 1690664, 1767330, 1850927, 1942644, 2043342, 2152850, 2270852, 2397456, 2532494, 2675145, 2824588, 2980067, 3139802, 3300764, 3460000, 3615240, 3763739, 3901649, 4025454, 4133383, 4224698, 4298229, 4352474, 4386681, 4401095, 4396467, 4374093, 4336163, 4285514, 4225089, 4157921, 4087408, 4017119, 3950323, 3889800, 3837911, 3796709, 3768122, 3754060, 3756055, 3774842, 3810647, 3863936, 3935537, 4025995, 4135126, 4262066, 4405187, 4561896, 4728965, 4903104, 5080820, 5257804, 5429041, 5589624, 5735148, 5861506, 5965046, 6043104, 6094017, 6116688, 6110682, 6076769, 6016835, 5933267, 5828798, 5706818, 5571310, 5426645, 5277922, 5131003, 4991243, 4862116, 4745741, 4644475, 4561112, 4497701, 4455229, 4434537, 4436578]
60173D436578K5034M7431O9104Q9757J07854J21531J30033J33390J31387J23931
60163E416030J11897R6463P8139N7279L5011J2617r349l0230m8282o1601o9586
60152E588388p2435o9884o1696m8881l3084j4987N478K7749N0611P3459R6543
60141E541261J20229J44954J71637K00993K32544K65077K97919L30954L63753
60132G669321L95521M25567M52930M75888M92622N02073N03623M96513M80371
60123A1894429M55650M22706L81232L31524K75512K15354J51703Q4503J4804n5525
60113A4171892j25200j93112k57028l14143l62714m01901m30350m46402m49635
60104A1191407m41064m22062l94138l59389l19714k75786k27976j77985j28212
$$ y = [4436578, 4461612, 4509043, 4578147, 4667904, 4775758, 4897289, 5027322, 5160712, 5292099, 5416030, 5527927, 5624390, 5702529, 5759808, 5794819, 5807436, 5798087, 5767857, 5719575, 5657974, 5588388, 5515953, 5446069, 5384373, 5335492, 5302408, 5287421, 5292899, 5320648, 5371259, 5444718, 5541261, 5661490, 5806444, 5978081, 6179074, 6411618, 6676695, 6974614, 7305568, 7669321, 8064842, 8490409, 8943339, 9419227, 9911849, 10413922, 10917545, 11414058, 11894429, 12350079, 12772785, 13154017, 13485541, 13761053, 13976407, 14128110, 14212613, 14227417, 14171892, 14046692, 13853580, 13596552, 13282409, 12919695, 12517794, 12087444, 11641042, 11191407, 10750343, 10328281, 9934143, 9574754, 9255040, 8979254, 8751278, 8573293, 8445081]
60095H445081p9654l1876J4936N9131R8835J32798J59941J79167J89824J91559
60085I359742J83856J66567J40720J08012O9920K8264j3995n4055r1110j25751
60075I772170j57847j86352k10917k32036k49500k62130k69244k71318k68972
60066G663854k62442k52058k38256k21030k00355j77032j52241j26414r9587p2441
60056E861998m5765j9134Q509L6981O4863R1204J15831J37985J56124J69327J77615
60045F755538J80679J77519J67587J51300J29291J02232P1443L8579M478l0602
60035G748044o5675r9004j29401j56392j79089j96162k07071k12249k11887k05768
60025F085346j94459j79491j62052j42451j21050r8700p6012n3100l0053o867
$$ y = [8445081, 8365427, 8333551, 8348487, 8407618, 8506453, 8639251, 8799192, 8978359, 9168183, 9359742, 9543598, 9710165, 9850885, 9958897, 10028817, 10057081, 10043086, 9989031, 9897921, 9772170, 9614323, 9427971, 9217054, 8985018, 8735518, 8473388, 8204144, 7932826, 7663854, 7401412, 7149354, 6911098, 6690068, 6489713, 6312681, 6160440, 6034026, 5934439, 5861998, 5816233, 5797099, 5805608, 5842589, 5907452, 5998656, 6114487, 6252472, 6408596, 6577923, 6755538, 6936217, 7113736, 7281323, 7432623, 7561914, 7664146, 7735589, 7774168, 7778646, 7748044, 7682369, 7583365, 7453964, 7297572, 7118483, 6922321, 6715250, 6503001, 6291114, 6085346, 5890887, 5711396, 5549344, 5406893, 5285843, 5187143, 5111131, 5058031, 5027978, 5021111]
60015E021111J7020M2123O7949R3655J19452J46126J73240J98946K21580K40210
60005F341412K53742K60842K60872K53726K38853K15839J85981J51812J14797
59996H277876P4881L2464j0612n2388r1776j27821j59163j84668k03604k15054
59986G340135k18342k14251k04678j90871j73041j51736j28205j03197p6719m9233
59976E829862k1792N168L1824N7450Q0396R9852J16322J29900J39601J44885J46493
59965F759961J45069J40266J31816J20337J06461R0254P2107N3193L4466J6181
59955G670111j115j6152k7833l5623l8872l6875k9878j8660k855J8973M7047P9736
59943G608004J15764J55707K00420K49300L01035L54905M10347M66032N20098
$$ y = [5021111, 5038131, 5080254, 5148203, 5241858, 5361310, 5507436, 5680676, 5879622, 6101202, 6341412, 6595154, 6855996, 7116868, 7370594, 7609447, 7825286, 8011267, 8163079, 8277876, 8352757, 8385221, 8374609, 8322221, 8230445, 8102624, 7943461, 7758793, 7555189, 7340135, 7121793, 6907542, 6702864, 6511993, 6338952, 6187216, 6059011, 5955814, 5879095, 5829862, 5808070, 5813238, 5845062, 5902512, 5982908, 6082760, 6199082, 6328982, 6468583, 6613468, 6759961, 6905030, 7045296, 7177112, 7297449, 7403910, 7494164, 7566271, 7619464, 7653930, 7670111, 7668996, 7652844, 7625011, 7589388, 7550516, 7513641, 7483763, 7465103, 7462248, 7481221, 7528268, 7608004, 7723768, 7879475, 8079895, 8329195, 8630230, 8985135, 9395482, 9861514, 10381612]
59934A0381612N70428O13895O46181O63109O61608O39043N92768N21317M25757
59925A5715718L09681J78790M0658r6286k24590l38555m33721n07043n57996n88217
59915A3498439n99564n93517n72573n40553n00701m54612m03762l50597k97134
59906I185426k43622j89716j36104q3919l3368J5964O3939J09918J53458J94026
59896I036002K30206K59901K81116K92260K91929K78749K51377K08912J52059
59887A1282511Q3880Q739o9480j47506k21452k86836l40207l80050m06168m19223
59877I104208m20870m13139l97416l74824l47383l17623k87103k56614k27739
59868F061497k02682j82371j66206j53779j45310j40121j36361j32775j29327
$$ y = [10381612, 10952040, 11565935, 12212116, 12875225, 13536833, 14175876, 14768644, 15289961, 15715718, 16025399, 16204189, 16244847, 16148561, 15923971, 15585416, 15151695, 14644652, 14086656, 13498439, 12898875, 12305358, 11732785, 11192232, 10691531, 10236919, 9833157, 9482560, 9185426, 8941804, 8752088, 8615984, 8532065, 8498697, 8514661, 8578600, 8688518, 8841976, 9036002, 9266208, 9526109, 9807225, 10099485, 10391414, 10670163, 10921540, 11130452, 11282511, 11366391, 11375130, 11305650, 11158144, 10936692, 10649856, 10309649, 9929599, 9523431, 9104208, 8683338, 8270199, 7872783, 7497959, 7150576, 6832953, 6545850, 6289236, 6061497, 5858815, 5676444, 5510238, 5356459, 5211149, 5071028, 4934667, 4801892, 4672565]
59859D672565j25678j20584j13324j04301r3766q1427o7752n4099m1078k8321
59849C842235j6399p268k184p90k837q967j8891l0403m1271n0761n8531o3599
59837C540334o5408o4544o1533n6201m8901m0924l2911k4289j4895n527L767J4090
59825C143058K5563L6677M6758N7118O8525P9572Q8797R6490J02745J05634J03293
59814C954230R6365Q6569P4309N9550M3876K9543J7329O767k305r877j6317k1195
59802D318844k2639j9357j2364l193Q507K3962M2944O4212Q7595J13959J43764
59791D746234J77213K15254K58894L07796L60509M15402M70194N20967N62283
59782H034746N87311N87307N53014M79005L67280K26984P2319p9326k11024l12015
$$ y = [4672565, 4546887, 4426303, 4312979, 4208678, 4114912, 4033485, 3965733, 3911634, 3870556, 3842235, 3825836, 3818568, 3816384, 3815594, 3812757, 3803790, 3784899, 3754496, 3713225, 3662464, 3603933, 3540334, 3474926, 3410382, 3348849, 3292648, 3243747, 3202823, 3169912, 3145623, 3130728, 3125201, 3128968, 3143058, 3168621, 3205298, 3252056, 3309174, 3377699, 3457271, 3546068, 3642558, 3745303, 3850937, 3954230, 4050595, 4137164, 4211473, 4271023, 4314899, 4344442, 4361771, 4368538, 4366233, 4356356, 4340039, 4318844, 4296205, 4276848, 4264484, 4261291, 4269798, 4293760, 4336704, 4400916, 4488511, 4602470, 4746234, 4923447, 5138701, 5397595, 5705391, 6065900, 6481302, 6951496, 7472463, 8034746, 8622057, 9209364, 9762378, 10241383, 10608663, 10835647, 10907966, 10828640, 10617616, 10305601]
59772A0305601l80344m19325m33048m26035m04373l73877l37841k98483k59238
59763F973037k23167j90135j58176j27147r8758p3560n0229k7668n874J5190L5820
59752F069333N5875P5319R5096J16114J37938J59909J82674K07149K32992K59905
59742G592304K89453L23476L61478M01719M44202M90237N39537N90009O40123
59733A1672538O89257P35747P76476Q08313Q28258Q32737Q19029P87478P40978
59724A8690811O82950O17938N53303M97396M55670M30389M23721M38305M74335
59715B3264818N28385N95705O71751P51131Q27234Q93735R44993R74754R76429
59706C0428935R45515Q80670P82665O54412N02597L37392J69690R425j33991k52204
$$ y = [10305601, 9925257, 9505932, 9072884, 8646849, 8242476, 7868599, 7530758, 7232275, 6973037, 6749870, 6559735, 6401559, 6274412, 6175654, 6102094, 6051865, 6024197, 6018323, 6033513, 6069333, 6125208, 6200527, 6295623, 6411737, 6549675, 6709584, 6892258, 7099407, 7332399, 7592304, 7881757, 8205233, 8566711, 8968430, 9412632, 9902869, 10442406, 11032415, 11672538, 12361795, 13097542, 13874018, 14682331, 15510589, 16343326, 17162355, 17949833, 18690811, 19373761, 19991699, 20545002, 21042398, 21498068, 21928457, 22352178, 22790483, 23264818, 23793203, 24388908, 25060659, 25811790, 26639024, 27532759, 28477752, 29452506, 30428935, 31374450, 32255120, 33037785, 33692197, 34194794, 34532186, 34701876, 34711301, 34577310, 34325106]
59696C4325106l40177l96622m21709m15762l80500l19711k37592j37348k1769
59687C1653916J06303K44960L93629N51699P17206Q86864J056188J219017J367413
59678C8197195J491873J580777J620101J595551J496079J315943J055543P23459
59670D9076521L38349p3062m81583q60129j185576j440724j616976j714923j741842
59661D0300055j709199j631818j527025j412929j307181j225840j180359j173635
59653B9132069j199113j243797j292169j329460j345283j336521j306240j259225
59645A8820261j199150j129358j053875r76276q98542q21900p47984o78453o14184
59636A0700539n55300n01521m52200m06695l64821l26441k90819k57237k25967
$$ y = [34325106, 33984929, 33588307, 33166598, 32750836, 32370336, 32050625, 31813033, 31675685, 31653916, 31760219, 32005179, 32398808, 32950507, 33667713, 34554577, 35610765, 36829782, 38197195, 39689068, 41269845, 42889946, 44485497, 45981576, 47297519, 48353062, 49076521, 49414870, 49341808, 48860225, 48000096, 46814520, 45373796, 43756820, 42041897, 40300055, 38590856, 36959038, 35432013, 34019084, 32711903, 31486063, 30305704, 29132069, 27932956, 26689159, 25396990, 24067530, 22722247, 21385726, 20079486, 18820261, 17621111, 16491753, 15437878, 14461602, 13563060, 12741160, 11993176, 11314723, 10700539, 10145239, 9643718, 9191518, 8784823, 8420002, 8093561, 7802742, 7545505, 7319538]
59627G319538j97683j72108j48368j26404j06851q9728p4624o2039n3231m8635
59617F239867m7686n0129n6180o5366p6439q8515j01100j13119j23145j30595
59607E387593j35549j37642j36498j32916j28093j21926j13657j03856r3929q3861
59597D199666p2497o0067m8373l8105k8119j7831q428r53N041J0197J4307J7271
59585C972109J9611K1322K1580K0328J8883J8456J9221K1217K4815K9878L5758
59574D223178M2505N0809O0555P0884Q1793R4104J07574J20947J34246J49167
59564E135762J66612J85618K05419K26697K49902K74043K98206L22784L48152
59555G413195L73402L97255M18948M37529M51571M60426M64480M63652M57103
$$ y = [7319538, 7121855, 6949747, 6801379, 6674975, 6568124, 6478396, 6403772, 6341733, 6288502, 6239867, 6192181, 6142052, 6085872, 6020506, 5944067, 5855552, 5754452, 5641333, 5518188, 5387593, 5252044, 5114402, 4977904, 4844988, 4716895, 4594969, 4481312, 4377456, 4283527, 4199666, 4127169, 4067102, 4018729, 3980624, 3952505, 3934674, 3926246, 3925293, 3930334, 3940531, 3954838, 3972109, 3991720, 4013042, 4034622, 4054950, 4073833, 4092289, 4111510, 4132727, 4157542, 4187420, 4223178, 4265683, 4316492, 4377047, 4447931, 4529724, 4623828, 4731402, 4852349, 4986595, 5135762, 5302374, 5487992, 5693411, 5920108, 6170010, 6444053, 6742259, 7065043, 7413195, 7786597, 8183852, 8602800, 9040329, 9491900, 9952326, 10416806, 10880458, 11337561]
59546A1337561M45161M29877M12874L94235L74406L55493L39444L26393L15750
59537A4731194L07266K99659K89881K75624K57581K37437K14325J84705J45246
59528A6942918R4606L2991l8450j17682k01986k88185l72432m50511n18800n74670
59518A4507799o15941o41132o50641o46788o32241o09245n80473n49036n16821
59509I065481m83852m49995m16207l83499l51795l20687k90340k60950k32284
59500E875872k04581j78946j56039j35076j14781r4707p5096n6257l8447k1590
59490D800352m794J2963L1452M9635O7533Q6385J06662J27535J48831J71916J97802
59479E796272K25652K53960K82118L09938L36661L61027L81391L95381M00537
$$ y = [11337561, 11782722, 12212599, 12625473, 13019708, 13394114, 13749607, 14089051, 14415444, 14731194, 15038460, 15338119, 15628000, 15903624, 16161205, 16398642, 16612967, 16797672, 16942918, 17037524, 17070515, 17032065, 16914383, 16712397, 16424212, 16051780, 15601269, 15082469, 14507799, 13891858, 13250726, 12600085, 11953297, 11321056, 10711811, 10131338, 9582302, 9065481, 8581629, 8131634, 7715427, 7331928, 6980133, 6659446, 6369106, 6108156, 5875872, 5671291, 5492345, 5336306, 5201230, 5086449, 4991742, 4916646, 4860389, 4821942, 4800352, 4795558, 4808521, 4839973, 4889608, 4957141, 5043526, 5150188, 5277723, 5426554, 5598470, 5796272, 6021924, 6275884, 6558002, 6867940, 7204601, 7565628, 7947019, 8342400, 8742937]
59470H742937L95657L80236L52600L10466K53945J86257J10896L0086n3172j33793
59460A0576115k07037k70814l24346l66195l95194m12177m19134m17522m08506
59451G355190l93769l74846l52503l27849l02862k78818k55290k31799k09246
59442D628208j88555j69123j50042j31747j15174j00189q6174p3267o1730n0959
59432C501248m0340l0256k1192j2723m510K690Q183J2631J7082K1492K5313K8636
59420C508254L1725L4398L6912M0465M5683N1662N7610O4259P2154P9702Q4715
59409D107539Q7335R0083R5517J05115J19673J39219J62781J89425K19336K52957
59399E568980K89586L27789L66792M06946M49395M95900N47753O03742O59828
$$ y = [8742937, 9138594, 9518830, 9871430, 10181896, 10435841, 10622098, 10732994, 10763080, 10709908, 10576115, 10369078, 10098264, 9773918, 9407723, 9012529, 8600352, 8181218, 7763696, 7355190, 6961421, 6586575, 6234072, 5906223, 5603361, 5324543, 5069253, 4837454, 4628208, 4439653, 4270530, 4120488, 3988741, 3873567, 3773378, 3687204, 3613937, 3552207, 3501248, 3460908, 3430652, 3409460, 3396737, 3392227, 3394917, 3403100, 3415731, 3432813, 3454305, 3479618, 3508254, 3539979, 3574377, 3611289, 3651754, 3697437, 3749099, 3806709, 3870968, 3943122, 4022824, 4107539, 4194874, 4284957, 4380474, 4485589, 4605262, 4744481, 4907262, 5096687, 5316023, 5568980, 5858566, 6186355, 6553147, 6960093, 7409488, 7905388, 8453141, 9056883, 9716711]
59390I716711P11581P55948P90099Q10151Q12716P96998P64328P16728O57249
59381A6532509N90623N21694M53353L86911L23607K64429K08917J55334J01587
59372A9538964M5284j6040q3441j55813k31294l08360l84325m53836n10488n49681
59362A6890970n69340n69128n50470n16691m71841m19791l65118l13564k70157
59353A2844870k37484k16773k09463k16159k34863k61806k93571l27330l59915
59344A0487506l88189m10018m23984m28951m25011m13992l97822l77230l52959
59335F869350l26930l00789k74398k47422k21263j97648j76214j55380j34984
59326D834322j16195r9336q3629o8743n4982m2164k9854j8392q179J696J2694
$$ y = [9716711, 10428292, 11184240, 11974339, 12784490, 13597206, 14394204, 15158532, 15875260, 16532509, 17123132, 17644826, 18098179, 18485090, 18808697, 19073126, 19282043, 19437377, 19538964, 19584248, 19568208, 19484767, 19328954, 19097660, 18789300, 18404975, 17951139, 17440651, 16890970, 16321630, 15752502, 15202032, 14685341, 14213500, 13793709, 13428591, 13115027, 12844870, 12607386, 12390613, 12181150, 11964991, 11730128, 11468322, 11174751, 10847421, 10487506, 10099317, 9689299, 9265315, 8836364, 8411353, 7997361, 7599539, 7222309, 6869350, 6542420, 6241631, 5967233, 5719811, 5498548, 5300900, 5124686, 4969306, 4834322, 4718127, 4618791, 4535162, 4466419, 4411437, 4369273, 4339419, 4321027, 4312848, 4314544, 4327238]
59315D327238K4868L7064M8759O0375P2031Q3316R4123J04478J13770J21199J26725
59304E213946J30483J31781J29725J24474J16737J06601R4056Q0274O7083N5403
59294F250563M5207L6714L0712K7998K9251L4942M4627N7021P1414Q8137J06883
59283F823469J25728J42780J57618J69920J77913J79565J74265J61987J42103
59274H255348J14750Q2388M8258J3958j9888n1510p8464r9728j15864j27575j35348
59263G886325j39609j39846j34418j22689j06423q7667o6506m2626j7845N147
59253G033843K5617M4280O0922P4791Q6681R8284J09912J21097J32968J47726
59243G936121J66088J87563K13022K44465K82015L23273L65887M08611M49233
$$ y = [4327238, 4352106, 4389170, 4437929, 4498304, 4570335, 4653651, 4747774, 4852252, 4966022, 5087221, 5213946, 5344429, 5476210, 5605935, 5730409, 5847146, 5953747, 6047803, 6128077, 6195160, 6250563, 6295770, 6332484, 6363196, 6391194, 6420445, 6455387, 6500014, 6557035, 6628449, 6716586, 6823469, 6949197, 7091977, 7249595, 7419515, 7597428, 7776993, 7951258, 8113245, 8255348, 8370098, 8452486, 8500744, 8514702, 8494814, 8443304, 8364840, 8265112, 8149248, 8021673, 7886325, 7746716, 7606870, 7472452, 7349763, 7243340, 7155673, 7089167, 7046541, 7028696, 7033843, 7059460, 7103740, 7164662, 7239453, 7326134, 7424418, 7534330, 7655427, 7788395, 7936121, 8102209, 8289772, 8502794, 8747259, 9029274, 9352547, 9718434, 10127045, 10576278]
59234A0576278M83406N06284N14088N03827M73005M20427L46633K53544J44543
59225A4222035K4670j00272k24712l42918m48645n36620o04170o50550o75734
59216A0663084o81089o70207o47293o15154n75947n32794m88850m45469m02971
59207E603310l62433l25079k90704k58581k29225k03560j81069j60639j42416
59198C449604j27021j13802j01816r1631q4041p7920p1596o5489o1026n7808n4331
59187B543123n0681m7882m5201m0968l5665l1281k7895k3736j8615j4254j1107
59176B195838p594k970J706N855J0210J4950J9341K3511K8359L3456L7382M0401
59164B400445M4392M9825N5217N9959O5211P1518P7948Q4187R1168R8966J06251
$$ y = [10576278, 11059684, 11565968, 12080056, 12583883, 13056888, 13477315, 13823948, 14077492, 14222035, 14246705, 14146433, 13921721, 13578803, 13130158, 12593538, 11989368, 11338818, 10663084, 9981995, 9311788, 8664495, 8049341, 7473394, 6940600, 6451750, 6006281, 5603310, 5240877, 4915798, 4625094, 4366513, 4137288, 3933728, 3752659, 3592020, 3449604, 3322583, 3208781, 3106965, 3015334, 2931293, 2853373, 2781777, 2716288, 2655262, 2597454, 2543123, 2492442, 2444560, 2399359, 2358391, 2322726, 2291445, 2263550, 2239814, 2221199, 2206945, 2195838, 2188244, 2185274, 2186980, 2192835, 2203045, 2217995, 2237336, 2260847, 2289206, 2322662, 2360044, 2400445, 2444837, 2494662, 2549879, 2609838, 2675049, 2746567, 2824515, 2908702, 2999870, 3098836, 3205087]
59153C205087J12472J18515J24610J29616J32913J35007J35642J33421J27831
59144D355114J19755J09548R6621Q1318O5241M9237L3083J7378L678p563j7002
59133D906408k3990k6511k4033j8165r875J662J6904L4872N5013P8020J04043
59122E094348J32142J62068J94403K28200K60676K89972L16149L38676L54906
59113G371540L61799L57162L38739L04437K54548J92099J20574M3402l4006j04587
59103I205707j63338k08981k41446k60214k66093k62195k51718k36536k18848
59094G096338k02008j88360j77977j70496j66516j66201j68425j72197j77326
59085E506832j82983j87511j90390j92452j93585j92279j88194j82884j77155
$$ y = [3205087, 3317559, 3436074, 3560684, 3690300, 3823213, 3958220, 4093862, 4227283, 4355114, 4474869, 4584417, 4681038, 4762356, 4827597, 4876834, 4909917, 4927295, 4930973, 4923410, 4906408, 4882418, 4855907, 4831874, 4813709, 4803834, 4805496, 4822400, 4857272, 4912285, 4990305, 5094348, 5226490, 5388558, 5582961, 5811161, 6071837, 6361809, 6677958, 7016634, 7371540, 7733339, 8090501, 8429240, 8733677, 8988225, 9180324, 9300898, 9344300, 9310294, 9205707, 9042369, 8833388, 8591942, 8331728, 8065635, 7803440, 7551722, 7315186, 7096338, 6894330, 6705970, 6527993, 6357497, 6190981, 6024780, 5856355, 5684158, 5506832, 5323849, 5136338, 4945948, 4753496, 4559911, 4367632, 4179438, 3996554, 3819399]
59076C819399j69839j60190j49383j38609j27792j17038j07219r8161q8369p7561
59066B585238o7407n8929n1414m4642l9742l6779l4146l1583l1226l4202l8617
59055B116551m2474m6131n0219n3446n4509n4115n3307n1561m8328m4623m1376
59044A576462l7829l3216k8508k4904k2105j9375j6769j4140j0687o610l467j701
59032A357151J68K912N315O698Q282J0501J1460R977P804O864O349M722K635J573
59018A442411J278P95O20J697L503N074O674Q786J0693J1724J2642J4212J5686
59005A535795J6219J6324J6591J6417J5386J4404J4013J3343J2062J1593J2806
58994A694953J4313J4661J4474J4815J5266J5321J5808J7156J8035J7566J7107
$$ y = [3819399, 3649560, 3489370, 3339987, 3201378, 3073586, 2956548, 2849329, 2751168, 2662799, 2585238, 2517831, 2458902, 2407488, 2362846, 2323104, 2286325, 2252179, 2220596, 2189370, 2155168, 2116551, 2074077, 2027946, 1977727, 1924281, 1869772, 1815657, 1762350, 1710789, 1662461, 1617838, 1576462, 1538633, 1505417, 1476909, 1452005, 1429900, 1410525, 1393756, 1379616, 1368929, 1362319, 1358852, 1357151, 1357319, 1360231, 1365546, 1372244, 1380526, 1391027, 1402487, 1412464, 1420268, 1427132, 1433481, 1438203, 1440838, 1442411, 1443689, 1444484, 1445104, 1446801, 1450304, 1455378, 1462052, 1470838, 1481531, 1493255, 1505897, 1520109, 1535795, 1552014, 1568338, 1584929, 1601346, 1616732, 1631136, 1645149, 1658492, 1670554, 1682147, 1694953, 1709266, 1723927, 1738401, 1753216, 1768482, 1783803, 1799611, 1816767, 1834802, 1852368, 1869475]
58983A869475J7994J9348K0021K0852K2950K5486K7343K9282L2370L5848L8728
58972B159697M1917M6467N1187N4336N6355N8676O1035O2128O1916O1260O0241
58961B775215N8770N7783N8048N8866N9547O0903O3775O7516P1666P7466Q5861
58950C495416R5577J05107J15017J26387J38548J50517J63135J77593J93281K09236
58940D969814K26441K46517K69358K94117L21282L51785L85324M21500M61396
58931G947534N06205N55594O09046O67231P30286P96470Q64204R33424J002826
58922A4612820J067631J122183J162618J184736J181596J146217J075196R67469
58914B3520466Q22124O40980M31866K06231k5349k52911m64948o50868q05263
$$ y = [1869475, 1887469, 1906817, 1926838, 1947690, 1970640, 1996126, 2023469, 2052751, 2085121, 2120969, 2159697, 2201614, 2248081, 2299268, 2353604, 2409959, 2468635, 2529670, 2591798, 2653714, 2714974, 2775215, 2833985, 2891768, 2949816, 3008682, 3068229, 3129132, 3192907, 3260423, 3332089, 3409555, 3495416, 3590993, 3696100, 3811117, 3937504, 4076052, 4226569, 4389704, 4567297, 4760578, 4969814, 5196255, 5442772, 5712130, 6006247, 6327529, 6679314, 7064638, 7486138, 7947534, 8453739, 9009333, 9618379, 10285610, 11015896, 11812366, 12676570, 13609994, 14612820, 15680451, 16802634, 17965252, 19149988, 20331584, 21477801, 22552997, 23520466, 24342590, 24983570, 25415436, 25621667, 25596318, 25343407, 24878459, 24227591, 23422328]
58905B3422328r26998j015373j070310j095180j095704j076273j039986r91313
58897A5111191r35534q75797q13342p50061o88308o28913n71897n18484m70043
58888H858812m26122l86039l51299l23611l01644k82587k65784k51831k39220
58879F030675k25359k10293j96156j83282j69997j55895j42287j29621j17218
58870D500567j05387r5096q5850p6398o7075n9046n1805m4054l6265k9736k3872
58859C825983j7255j0578n479j117M906J2700K0277K7219L4990M3793N2276O0339
58847D048054O9403P9753R0319J01041J12886J25668J38379J51465J66279J82553
58837E265800J98954K15710K34225K54630K76303L00206L27915L59058L92511
$$ y = [23422328, 22495330, 21479957, 20409647, 19314467, 18218763, 17142490, 16102504, 15111191, 14175657, 13299860, 12486518, 11736457, 11048149, 10419236, 9847339, 9328855, 8858812, 8432690, 8046651, 7695352, 7371741, 7070097, 6787510, 6521726, 6269895, 6030675, 5805316, 5595023, 5398867, 5215585, 5045588, 4889693, 4747406, 4617785, 4500567, 4395180, 4300084, 4214234, 4137836, 4070761, 4011715, 3959910, 3915856, 3879591, 3849855, 3825983, 3808728, 3798150, 3792671, 3791554, 3796460, 3809160, 3829437, 3856656, 3891646, 3935439, 3987715, 4048054, 4117457, 4197210, 4287529, 4388570, 4501456, 4627124, 4765503, 4916968, 5083247, 5265800, 5464754, 5680464, 5914689, 6169319, 6445622, 6745828, 7073743, 7432801, 7825312]
58828G825312M29443M72175N20673N73270O30113O92523P59416Q27759Q96087
58819A3626771R63898J027651J080884J118301J136336J129718J091431J016969
58811B2191959R05928P59455N79848L73490J51028p6260k98151n04084o84109
58802B3399104q32477r48025j030847j081277j102137j098784j076186j038232
58794A5191139r89727r35871q79404q21011p62471p06532o53688o02446n52976
58785H287013n07372m66073m27308l90523l57102l27348k99926k74718k53000
58776D983643k34347k16632j99533j84876j72999j62101j51629j42860j35516
58767C383150j27318j17720j08628j00623r1972q2371p4023o7641o0907n2484
$$ y = [7825312, 8254755, 8726930, 9247603, 9820873, 10450986, 11143509, 11902925, 12730684, 13626771, 14590669, 15618320, 16699204, 17817505, 18953841, 20083559, 21174990, 22191959, 23097887, 23857342, 24437190, 24810680, 24961708, 24885448, 24587297, 24083213, 23399104, 22566627, 21618602, 20587755, 19506478, 18404341, 17305557, 16229371, 15191139, 14201412, 13265541, 12386137, 11565126, 10802655, 10096123, 9442435, 8839989, 8287013, 7779641, 7313568, 6886260, 6495737, 6138635, 5811287, 5511361, 5236643, 4983643, 4749296, 4532664, 4333131, 4148255, 3975256, 3813155, 3661526, 3518666, 3383150, 3255832, 3138112, 3029484, 2928861, 2836889, 2754518, 2680495, 2612854, 2551947, 2499463]
58757B499463m4460l9024l5524l2437k9682k7367k4654k1441j8988j7749j6602
58746B191535j5152j4577j5368j6410j7086j7998j9040j9100j8309j8179j9050
58735B001266j9821k0465k2152k4559k5976k6526k8243l1435l4006l5077l6115
58724A696891l7720l8386l7468l6371l5778l4556l2368l0514k9231k7017k3534
58713A333948k0411j8234j5613j2122r302p681n675k479N64K396L468L764K254
58700A254877r66m543q278j2977j7787k0745k2065k3615k5000k3965k0952j9161
58688A054823j9355j8733j5907j2950j1206r285o619n046n098m486k049L20J357
58675I45766K395M029M423K778J083O90M40k43J39J988L448L980N504Q382J0074
$$ y = [2499463, 2455003, 2415979, 2380455, 2348018, 2318336, 2290969, 2266315, 2244874, 2225886, 2208137, 2191535, 2176383, 2161806, 2146438, 2130028, 2112942, 2094944, 2075904, 2056804, 2038495, 2020316, 2001266, 1981445, 1960980, 1938828, 1914269, 1888293, 1861767, 1833524, 1802089, 1768083, 1733006, 1696891, 1659171, 1620785, 1583317, 1546946, 1511168, 1476612, 1444244, 1413730, 1384499, 1357482, 1333948, 1313537, 1295303, 1279690, 1267568, 1258266, 1250585, 1244910, 1242431, 1242995, 1245391, 1248859, 1252623, 1254877, 1253911, 1249368, 1241090, 1228113, 1210326, 1189581, 1167516, 1143901, 1118901, 1094936, 1073984, 1054823, 1035468, 1016735, 1000828, 987878, 976672, 967387, 960768, 955722, 950624, 946138, 944089, 944409, 945766, 948161, 952190, 956613, 959391, 960474, 961164, 961604, 961361, 961500, 963488, 966936, 970916, 976420, 984802, 994876]
58660I94876R485Q800R251Q984P187O242P473Q712Q456Q685J0926J3299J4247
58647A116623J5588J9086K3309K6673L0315L5285M0060M3562M7546N3342N9405
58636A510794O4626P0843P9447Q8785R7654J08165J22263J38664J55973J75617
58626B612831J98743K23433K47978K73761L01713L28809L51076L67047L75132
58617E280523L70641L49136L10489K56910J89783J11662K8774n1800j25664j89730
58607F530724k40385k75943k98368l09838l10291l00706k85516k68708k50399
58598C990570k30123k10224j92788j76336j59049j42409j28298j15351j01662
58589B534330q8453p7615o8216n8971n1532m7893m6876m6438m6932m8843n0080
$$ y = [994876, 1004361, 1013161, 1022412, 1031396, 1038583, 1044825, 1052298, 1061010, 1069466, 1078151, 1089077, 1102376, 1116623, 1132211, 1151297, 1174606, 1201279, 1231594, 1266879, 1306939, 1350501, 1398047, 1451389, 1510794, 1575420, 1646263, 1725710, 1814495, 1912149, 2020314, 2142577, 2281241, 2437214, 2612831, 2811574, 3035007, 3282985, 3556746, 3858459, 4187268, 4538344, 4905391, 5280523, 5651164, 6000300, 6310789, 6567699, 6757482, 6869144, 6897918, 6846118, 6720454, 6530724, 6290339, 6014396, 5716028, 5406190, 5095899, 4795193, 4509677, 4240969, 3990570, 3760447, 3550223, 3357435, 3181099, 3022050, 2879641, 2751343, 2635992, 2534330, 2445877, 2368262, 2300046, 2241075, 2189543, 2141650, 2094774, 2048336, 2001404, 1952561, 1902481]
58578A902481m8973m7491m7953m9006m8247m6284m4700m2566l8550l4184l1405
58567A423122k9119k5635k2198k0692k0089j8568j6862j6284j5759j4073j2522
58556A211321j2121j0852p074k911p29Q97M036P057P474O361N905N053J785k552
58542A213650n368p202j0021j3139j4757j5604j7305j9054j9428j9492k0600k1370
58530A030310k0262j8832j8924j9186j7881j6500j6832j7218j5540j3257j2514
58519H43364j2111j0265q461q391q089n461k754k865m106l351j586j461k009q34
58505G71620R08P50j60O30K027J697Q18J633K672J575J80J528M054M283L100L856
58489H01171O214P362P566R067J1156J1750J2094J4606J7721J8150J6504J5559
$$ y = [1902481, 1853508, 1806017, 1758064, 1709058, 1660811, 1614527, 1569827, 1527261, 1488711, 1454527, 1423122, 1394003, 1368368, 1346170, 1325478, 1305389, 1286821, 1269959, 1253675, 1237916, 1223843, 1211321, 1199200, 1188348, 1181274, 1178363, 1177634, 1178531, 1182567, 1189624, 1197098, 1203459, 1209364, 1214417, 1216202, 1213650, 1208282, 1201080, 1191059, 1177920, 1163163, 1147559, 1130254, 1111200, 1091772, 1072280, 1051680, 1030310, 1010048, 991216, 972292, 953106, 935225, 918725, 901893, 884675, 869135, 855878, 843364, 831253, 820988, 812527, 804136, 796047, 790586, 787832, 784967, 780861, 777510, 775924, 774463, 772454, 771620, 772528, 773278, 773118, 773748, 775775, 777472, 778290, 779923, 782595, 784170, 784350, 785878, 789932, 794215, 797315, 801171, 807385, 814747, 822313, 831380, 842536, 854286, 866380, 880986, 898707, 916857, 933361, 948920]
58477I48920J4758J1844P883N216K367l340j0031j3892j5630j8483k1727k2254
58465H85631k0944k1106k2002k0215j6284j3907j3461j2293j0428j0051j0338
58454G14602q669n992n268n722m434k317k470l903l065n15K28n87L54K905L892
58439F79039L291L818N178M814L563M423O583O799N706O619R054R833R519J1283
58425G69522J4348J5139J4010J4178J4984J3061R268P501P362N067Q92j309j452
58412H82571k910n481n824m409m888o972p113n711o341q334p647m677l711m885
58398H03668m370k209k086l559k493P48J591j47N5K920M478L927M510O233N790
58383H19056L876M535O997O448L127K210M409N324M456N912R431R855O639M938
$$ y = [948920, 963678, 975522, 983405, 988621, 990988, 987648, 977617, 963725, 948095, 929612, 907885, 885631, 864687, 843581, 821579, 801364, 785080, 771173, 757712, 745419, 734991, 724940, 714602, 705933, 699941, 694673, 688951, 684517, 682200, 679730, 675827, 672762, 672247, 672475, 671888, 672242, 675147, 679039, 682330, 686148, 691326, 696140, 699703, 704126, 710709, 717508, 723214, 729833, 738887, 748720, 758239, 769522, 783870, 799009, 813019, 827197, 842181, 855242, 864510, 872011, 879373, 884440, 885332, 884023, 882571, 879661, 874180, 868356, 863947, 859059, 852087, 844974, 839263, 832922, 824588, 816941, 812264, 808553, 803668, 799298, 797089, 795003, 791444, 788951, 789699, 791290, 791143, 791198, 794118, 798596, 802523, 807033, 813266, 819056, 822932, 827467, 834464, 840912, 844039, 846249, 850658, 855982, 860438, 866350, 875781, 885636, 892275, 897213]
58369H97213O169O250M299M024N375M002L11k31K811L735J219L97K725L433J171
58354I42903N99K972L616J252N75L079M429L377M049P045P562M833M049O536P521
58339A004397N966O800J0811J2324R788Q649J0736J0889P311N250O950P815N905
58326A113591N398P433P447M822N067R229J1365R621R292J1860J1991Q700Q138
58313A223954J1672J2646Q922P091J0050J2111J0712J1146J5148J6721J4057J3635
58301A367865J7678J9694J7304J7027K1233K3054J9781J8320K1671K3027J9392
58290A586046J7897K2149K5465K4198K4502K9134L1164K7766K6623L1255L3795
58279A879994K9929K7069K9800L1325K7565K5593K9593L2532L0334L0030L5329
$$ y = [897213, 903382, 909632, 913931, 917955, 923330, 927332, 927643, 927412, 930223, 933958, 935177, 935574, 938299, 941732, 942903, 943502, 946474, 950090, 951342, 951917, 954996, 959425, 962802, 966851, 973896, 981458, 986291, 990340, 996876, 1004397, 1010363, 1017163, 1027974, 1040298, 1050086, 1058735, 1069471, 1080360, 1087671, 1092921, 1099871, 1107686, 1113591, 1118989, 1126422, 1133869, 1138691, 1143758, 1152987, 1164352, 1173973, 1183265, 1195125, 1207116, 1215816, 1223954, 1235626, 1248272, 1257194, 1264285, 1274335, 1286446, 1297158, 1308304, 1323452, 1340173, 1354230, 1367865, 1385543, 1405237, 1422541, 1439568, 1460801, 1483855, 1503636, 1521956, 1543627, 1566654, 1586046, 1603943, 1626092, 1651557, 1675755, 1700257, 1729391, 1760555, 1788321, 1814944, 1846199, 1879994, 1909923, 1936992, 1966792, 1998117, 2025682, 2051275, 2080868, 2113400, 2143734, 2173764, 2209093]
58268B209093L8655L6246L6208M2616M7029M5014M5348N3017N9208N8258N8233
58257B728925O4287O8197O5244O4483P1106P5962P3946P4660Q3029Q8001Q3324
58246C541164Q0366Q7118R3888R3648R6379J08542J18852J19899J23049J36016
58236D598921J47195J48857J53535J69784J84654J88739J94992K13222K30368
58227F230267K36723K46505K70566K94642L07602L24300L56249L87785M07157
58218I061796M32010M76439N23249N58110N99469O63214P31298P89201Q59335
58209A4694121R60900J073810J181918J312734J491669J699160J920318K192514
58201B6527144K553041K989751L502461M161702N044575O173311P589481R417185
$$ y = [2209093, 2247748, 2283994, 2320202, 2362818, 2409847, 2454861, 2500209, 2553226, 2612434, 2670692, 2728925, 2793212, 2861409, 2926653, 2991136, 3062242, 3138204, 3212150, 3286810, 3369839, 3457840, 3541164, 3621530, 3708648, 3802536, 3896184, 3992563, 4101105, 4219957, 4339856, 4462905, 4598921, 4746116, 4894973, 5048508, 5218292, 5402946, 5591685, 5786677, 5999899, 6230267, 6466990, 6713495, 6984061, 7278703, 7586305, 7910605, 8266854, 8654639, 9061796, 9493806, 9970245, 10493494, 11051604, 11651073, 12314287, 13045585, 13834786, 14694121, 15655021, 16728831, 17910749, 19223483, 20715152, 22414312, 24334630, 26527144, 29080185, 32069936, 35572397, 39734099, 44778674, 50951985, 58541466, 67958651]
58193F7958651J1763160J4633535J8055179K2175169K7069477L2496931L7926304
58186B32078406M2554030M4938248M2847800L4341288J9653038J889754j4597803
58179D03704761k6745553l3877574l6888179l6971648l5111924l2125457k8640220
58172A73344206k5014817k1443937j8115534j5184153j2675208j0532918q729345
58165F1648294p253659o044186n016098m133356l390890k750198k151551j572512
58157B9335844j020925m79805R4541P22845J388613K069768K738573L299320L538745
58148D1687519L189226K114271M81719j265181k668009l519127l886293l930035
58140C2204090l761281l453173l085134k716276k356394k003878j683648j419291
$$ y = [67958651, 79721811, 94355346, 112410525, 134585694, 161655171, 194152102, 232078406, 274632436, 319570684, 362418484, 396759772, 416412810, 418302564, 403704761, 376959208, 343081634, 306193455, 269221807, 234109883, 201984426, 173344206, 148329389, 126885452, 108769918, 93585765, 80910557, 70377639, 61648294, 54394635, 48350449, 43334351, 39200995, 35810105, 33059907, 30908356, 29335844, 28314919, 27835114, 27929655, 28652500, 30041113, 32110881, 34849454, 38148774, 41687519, 44876745, 46991016, 47472735, 46207554, 43539545, 40020418, 36134125, 32204090, 28442809, 24989636, 21904502, 19188226, 16831832, 14827954, 13144306, 11725015]
58132A1725015j199557j004257q38214p11427o10254n17277m39166l87735l52137
58123E664991l15627k82634k64442k53839k37646k19850k09640k00166j80998
58114C500149j58882j45240j35065j18079r9230q8691q2693p3059o5005o7005
58104B467200p3038p2678o9283p1126p4128p0267o3947o3386o4495n9434n2571
58093A732847n2123n4205n0712m4952m4252m4911l9731l2815l1902l3302k9293
58082A274649k3325k3132k5626k3296j9086k0292k3790k1852j6923j6492j8539
58071A042296j6144j1403j1035j2876j0370n955o623j0299r702n890n277p002
58059I29720n764l507n854j0323j0260p282p867j0827j0017o465o048p774n961
$$ y = [11725015, 10525458, 9521201, 8682987, 7971560, 7361306, 6844029, 6404863, 6017128, 5664991, 5349364, 5066730, 4802288, 4548449, 4310803, 4090953, 3881313, 3681147, 3500149, 3341267, 3196027, 3060962, 2942883, 2843653, 2754962, 2672269, 2599210, 2534205, 2467200, 2394162, 2321484, 2252201, 2181075, 2106947, 2036680, 1972733, 1909347, 1844852, 1785418, 1732847, 1680724, 1626519, 1575807, 1530855, 1486603, 1441692, 1401961, 1369146, 1337244, 1303942, 1274649, 1251324, 1228192, 1202566, 1179270, 1160184, 1139892, 1116102, 1094250, 1077327, 1060835, 1042296, 1026152, 1014749, 1003714, 990838, 980468, 974513, 967890, 957591, 947889, 941999, 936722, 929720, 923956, 920449, 914595, 904272, 894012, 886730, 878863, 868036, 858019, 851554, 845506, 837732, 831771]
58046H31771j593k47j107R68M809N164L217M214O928O158L415M387P843P695M329
58031H87951L313M475K763j434l061k344l955p442q257p144q786j2166j2053r102
58017H22758q791j1091j0815p702o613q040p673n327n138p028o807m736n199p861
58003G19937p880n064m198n950n923l312k251l716m063k302j340j320Q64M889
57989F78371P046P323R320J2849J3786J1688J0376J0641R373O244M241L328O10
57976G85196l133m157l108m346p805r019p663q276j1661j3245j1355r721j0129
57963F81578r660p106n384n649n188k996j526j347L9K704L496K048J769L544M309
57948F60631L204L246N351O470N254M065L856K540j52j607j537k849n852p051
$$ y = [831771, 830178, 829931, 828824, 829792, 834601, 839765, 842982, 847196, 854124, 860282, 863697, 868084, 875927, 883622, 887951, 891264, 895739, 898502, 897068, 894007, 891663, 887708, 880266, 872009, 864865, 856079, 843913, 831860, 822758, 813967, 802876, 792061, 784359, 777746, 769706, 762033, 756706, 751568, 744540, 737733, 732997, 727798, 719937, 712057, 706993, 702795, 696845, 690922, 687610, 685359, 681643, 677580, 675278, 673938, 672618, 673482, 678371, 685417, 692740, 702060, 714909, 728695, 740383, 750759, 761400, 770773, 777017, 781258, 784586, 785196, 782063, 777906, 774798, 770452, 762647, 753628, 745965, 737689, 726028, 712783, 701428, 691707, 681578, 671918, 664812, 659428, 653779, 648591, 645595, 644069, 642722, 642761, 645465, 648961, 651009, 652778, 656322, 660631, 663835, 667081, 672432, 678902, 684156, 688221, 692077, 694617, 694465, 692858, 691321, 688472, 682620, 675569]
57934F75569n293l789m348m749l539k542k875l059k616l041m078l535j646j009
57920F29450j542m75K103K983J872K125M487N827N248N735Q127R263P956P235
57906F90394Q587R344P978O779O972O222L417J061N38m23l161n538o212p042q985
57891G09931r968r156q969j0538j1352r819p997p486o695m545k879k745k155J51
57877F15778K342L109L997O038P711Q217R146J0907J1354R932R258J0532J1233
57864G19554R639P780P497P307N622L593K348P08j995m045m492n065o863q354
57850G33234q489q594r318r171p880p609q870q999o730m635m745n396m739l756
57836F34303l471k624p30qj735l850m535m967o235o993o510o644q233q986p569
$$ y = [675569, 670276, 666487, 662139, 657390, 653851, 651309, 648434, 645375, 642759, 639718, 635640, 632105, 630459, 629450, 627908, 627433, 629536, 632519, 634391, 636516, 641003, 646830, 652078, 657813, 665940, 675203, 683159, 690394, 698981, 708325, 716303, 723082, 730054, 736276, 739693, 740754, 741292, 740869, 737708, 732170, 725958, 718916, 709931, 699963, 690807, 681838, 671300, 659948, 650129, 642132, 634646, 627951, 623406, 620527, 617782, 615627, 615778, 618120, 621229, 625226, 631264, 638975, 647192, 656338, 667245, 678599, 688531, 697789, 708321, 719554, 729193, 736973, 744470, 751777, 757399, 760992, 763340, 764048, 762053, 758008, 753516, 748451, 741588, 733234, 724745, 716151, 706833, 697662, 689782, 682173, 673303, 664304, 657574, 652939, 648194, 642798, 638059, 634303, 630832, 628208, 627478, 627470, 625735, 621885, 617350, 612383, 606148, 599155, 592645, 586001, 577768, 568782, 561213]
57821E61213o321p191q345p686o439o227n751l633j517j213j458o19J16o48j343
57806E02938q8J867K467K405L377M894N716O497Q199R891J0641J1629J3887J5931
57792F00251J6098J5118J4163J2499R428O283M142J872j291l623l796l438m278
57779F63428n187m596l448l223l310k866k892l908m085k271l60k1K67K144M094
57764F33766M322M228N636P103O550N315N921P721Q396Q038Q169Q275O805M356
57750G24601K686J733N97MQ82J990J831J453K441L862M188M470O335Q617R344
57735G75034R413J0868J2988J3738J3699J4928J7070J8295J9046K1123K3978K5617
57723I75797K6473K8702L2103L4353L5020L5890L7566L9075M0694M3930M8740
$$ y = [561213, 554892, 547701, 539356, 531670, 525231, 519004, 513253, 509620, 508103, 506890, 505432, 504813, 504929, 504281, 502938, 502850, 504717, 507184, 509589, 512966, 517860, 523576, 530073, 538272, 548163, 558804, 570433, 584320, 600251, 616349, 631467, 645630, 658129, 667557, 673840, 677982, 679854, 678563, 674940, 671144, 667706, 663428, 658241, 653645, 650197, 646974, 643664, 640798, 637906, 633998, 629913, 627642, 627282, 627261, 627528, 629672, 633766, 638088, 642316, 647952, 655055, 661605, 666920, 672841, 680562, 688958, 696996, 705165, 713440, 720245, 724601, 727287, 729020, 729617, 729621, 730503, 732493, 734324, 735777, 738218, 742080, 746268, 750738, 757073, 765690, 775034, 784447, 795315, 808303, 822041, 835740, 850668, 867738, 886033, 905079, 926202, 950180, 975797, 1002270, 1030972, 1063075, 1097428, 1132448, 1168338, 1205904, 1244979, 1285673, 1329603, 1378343]
57712A378343N3799N9327O6723P5585Q4223R3033J04263J18424J33940J50545
57702B318205J70040J93118K18177K43892K70574K98245L25304L49430L67984
57693D754969L77348L73733L54893L19994K68527K01417J22986L9871m1809j17014
57683F654915j80895k29873k63412k82818k88867k82420k66179k43344k15017
57674D402090j81127j43171j03580o3117k1669J8333N1204P0352O9921M6195J290
57663D146721n4526j07227j46841j70353j78837j75004j62854j46223j26756j04945
57653B773155q2598o1968m3026k4200n406J2227K9064M6508O4250Q0968R7638
57642B886612J17043J39751J63557J87177K11546K36946K61579K83678L02454
$$ y = [1378343, 1432142, 1491469, 1558192, 1633777, 1718000, 1811033, 1915296, 2033720, 2167660, 2318205, 2488245, 2681363, 2899540, 3143432, 3414006, 3712251, 4037555, 4386985, 4754969, 5132317, 5506050, 5860943, 6180937, 6449464, 6650881, 6773867, 6813738, 6771929, 6654915, 6474020, 6244147, 5980735, 5697917, 5409050, 5126630, 4860451, 4617107, 4402090, 4220963, 4077792, 3974212, 3911095, 3889426, 3907759, 3958963, 4029315, 4099236, 4145431, 4146721, 4092195, 3984968, 3838127, 3667774, 3488937, 3313933, 3151079, 3004856, 2878100, 2773155, 2690557, 2628589, 2585563, 2561363, 2555957, 2568184, 2597248, 2643756, 2708006, 2788974, 2886612, 3003655, 3143406, 3306963, 3494140, 3705686, 3942632, 4204211, 4487889, 4790343]
57633D790343L16083L20908L13457K91692K54313K01214J35197O1387j5288r0398
57623F578908j58618k14868k57370k87352l05796l12794l10037l00917k87569
57614D143587k70294k50252k30056k10946j91897j72411j53998j37983j23959
57605B401791j11252r9980q9981q0577p2035o5366o0157n4610m8246m2575l8483
57594A638529l4984l1245k7852k5252k2830k0203j7779j5484j2630r567p626o997
57582A406080o374n104l903l055j841k03R48J566K717M585O163P341R196J1860
57568A429976J4073J5413J6883J8785K0211K1164K3005K6059K8980L1268L4260
57557A680077L8785M3938M9135N5235O2674P0499P8359Q7483R8659J11063J24177
$$ y = [4790343, 5106426, 5427334, 5740791, 6032483, 6286796, 6488010, 6623207, 6684594, 6669306, 6578908, 6420290, 6205422, 5948052, 5660700, 5354904, 5042110, 4732073, 4431156, 4143587, 3873293, 3623041, 3392985, 3182039, 2990142, 2817731, 2663733, 2525750, 2401791, 2290539, 2190559, 2100578, 2020001, 1947966, 1882600, 1822443, 1767833, 1719587, 1677012, 1638529, 1603545, 1572300, 1544448, 1519196, 1496366, 1476163, 1458384, 1442900, 1430270, 1420703, 1413077, 1406080, 1399706, 1394602, 1390699, 1387644, 1385803, 1385600, 1386548, 1388114, 1390831, 1395416, 1401579, 1408920, 1418116, 1429976, 1444049, 1459462, 1476345, 1495130, 1515341, 1536505, 1559510, 1585569, 1614549, 1645817, 1680077, 1718862, 1762800, 1811935, 1867170, 1929844, 2000343, 2078702, 2166185, 2264844, 2375907, 2500084]
57546B500084J38946J55949J74112J92372K10938K29730K47034K60631K68765
57537D378561K69265K59316K37187K02922J57141J01071L8417k4911q3980j36291
57527E398698j79817k12123k32512k42951k45605k41301k31293k18209k03807
57518C391080j87683j69565j51081j33874j17880j02771q9292p7693o6665n5351
57508B239225m4799l5969k7995j9871j2174n629L92O381J1428J5089J8857K4075
57496B169010K9832L4809L9739M6150N3948O2100P0653Q0307R0974J02454J15567
57485B895543J31002J47964J65411J83658K03175K22641K39647K52326K58930
57476D700297K56884K43859K19096J82580J34245P5722J1835n1387j09709j60665
$$ y = [2500084, 2639030, 2794979, 2969091, 3161463, 3372401, 3602131, 3849165, 4109796, 4378561, 4647826, 4907142, 5144329, 5347251, 5504392, 5605463, 5643880, 5618969, 5534989, 5398698, 5218881, 5006758, 4774246, 4531295, 4285690, 4044389, 3813096, 3594887, 3391080, 3203397, 3033832, 2882751, 2748877, 2630997, 2528226, 2438934, 2361241, 2294576, 2239225, 2194426, 2158457, 2130462, 2110591, 2098417, 2092788, 2093180, 2099561, 2110989, 2126078, 2144935, 2169010, 2198842, 2233651, 2273390, 2319540, 2373488, 2435588, 2506241, 2586548, 2677522, 2779976, 2895543, 3026545, 3174509, 3339920, 3523578, 3726753, 3949394, 4189041, 4441367, 4700297, 4957181, 5201040, 5420136, 5602716, 5736961, 5812683, 5824518, 5773131, 5663422, 5502757]
57466E502757k01940k31642k49650k57235k55907k47642k35213k20722k04487
57457C398319j86531j68237j51220j35566j20520j06182r3179q1573p1336o2936
57447B221039n6280n0110m3732l8190l4341l1027k6842k2480j9509j7764j5857
57436A864907j3520j1564j0111q693p582p289p101n830l690j975j167p35l87j66
57422A785097K82J296K430L230M142N534O582O481O010O437P524Q094Q050Q300
57408A859489R113R916J0412J0701J0700J0535J0921J2068J2980J2836J2293J2263
57396A994227J2384J2000J1564J1707J1904J1576J1450J2206J2907J2570J2201
57385B126696J3236J4921J5408J4724J4431J4850J4966J4682J4881J5385J5030
$$ y = [5502757, 5300817, 5069175, 4819525, 4562290, 4306383, 4058741, 3823528, 3602806, 3398319, 3211788, 3043551, 2892331, 2756765, 2636245, 2530063, 2436884, 2355311, 2283975, 2221039, 2164759, 2114649, 2070917, 2032727, 1998386, 1967359, 1940517, 1918037, 1898528, 1880764, 1864907, 1851387, 1839823, 1829712, 1821019, 1813437, 1806148, 1799047, 1793217, 1789527, 1787552, 1786385, 1785650, 1785263, 1785097, 1785379, 1786675, 1789105, 1792335, 1796477, 1802011, 1808593, 1815074, 1821084, 1827521, 1835045, 1843139, 1851189, 1859489, 1868602, 1878518, 1888930, 1899631, 1910331, 1920866, 1931787, 1943855, 1956835, 1969671, 1981964, 1994227, 2006611, 2018611, 2030175, 2041882, 2053786, 2065362, 2076812, 2089018, 2101925, 2114495, 2126696, 2139932, 2154853, 2170261, 2184985, 2199416, 2214266, 2229232, 2243914, 2258795, 2274180, 2289210]
57374B289210J3924J3591J4697J6247J7260J7669J7536J6924J6529J7056J8037
57363B468680J8563J8808J9430J9986J9616J8890J9151K0328K1205K1526K2027
57352B688210K2600K2416K1772K1863K2668K2938K2373K1976K2144K2104K1483
57341B932547K0808K0361K0066K0415K1917K3697K4311K3888K3796K4389K4879
57330C181074K5207K6025K6934K6883K6384K7137K9234L0824L0923L0445L0130
57319C491200K9587K8975K9414L0995L2279L2552L2816L3777L4722L5123L5679
57308C847119L6885L8126L8909L9633M0487M1147M1988M3974M6842M9098N0379
57297D314587N2036N4678N7097N8503N9949O2392O5015O6642O7411O7817O7384
$$ y = [2289210, 2303134, 2316725, 2331422, 2347669, 2364929, 2382598, 2400134, 2417058, 2433587, 2450643, 2468680, 2487243, 2506051, 2525481, 2545467, 2565083, 2583973, 2603124, 2623452, 2644657, 2666183, 2688210, 2710810, 2733226, 2754998, 2776861, 2799529, 2822467, 2844840, 2866816, 2888960, 2911064, 2932547, 2953355, 2973716, 2993782, 3014197, 3036114, 3059811, 3084122, 3108010, 3131806, 3156195, 3181074, 3206281, 3232306, 3259240, 3286123, 3312507, 3339644, 3368878, 3399702, 3430625, 3461070, 3491200, 3520787, 3549762, 3579176, 3610171, 3642450, 3675002, 3707818, 3741595, 3776317, 3811440, 3847119, 3884004, 3922130, 3961039, 4000672, 4041159, 4082306, 4124294, 4168268, 4215110, 4264208, 4314587, 4366623, 4421301, 4478398, 4536901, 4596850, 4659242, 4724257, 4790899, 4858310, 4926127, 4993511]
57286D993511O5505O2478N8730N3945M7828M0724L2837K3950J4496N717j806q487
57274E389428j4126j7508j8360j8096j7783j6773j4402j1509r099o677l227J104
57262E242972N362R054J2176J4789J7263K0116K3007K4916K5754K6628K7996K8943
57250E478976K8945K8950K9777L0755L0954L0661L0592L0613L0237K9539K8770
57239E808769K7841K6879K6423K6545K6630K6481K6649K7339K8103K8894L0183
57228F110736L1718L2576L2790L3357L4310L4465L3688L3472L4567L5829L6324
57217F483832L6773L7815L8574L8203L7385L7062L7042L6899L6865L6846L5956
57206F893252L4045L2258L1187K9946K7977K6098K4756K3057K0599J8513J7487
$$ y = [4993511, 5059016, 5121494, 5180224, 5234169, 5281997, 5322721, 5355558, 5379508, 5394004, 5399721, 5397915, 5389428, 5375302, 5357794, 5339434, 5321338, 5303555, 5286782, 5272380, 5260871, 5251772, 5245095, 5241868, 5242972, 5248334, 5257388, 5269564, 5284353, 5301616, 5321732, 5344739, 5369655, 5395409, 5422037, 5450033, 5478976, 5507921, 5536871, 5566648, 5597403, 5628357, 5659018, 5689610, 5720223, 5750460, 5779999, 5808769, 5836610, 5863489, 5889912, 5916457, 5943087, 5969568, 5996217, 6023556, 6051659, 6080553, 6110736, 6142454, 6175030, 6207820, 6241177, 6275487, 6309952, 6343640, 6377112, 6411679, 6447508, 6483832, 6520605, 6558420, 6596994, 6635197, 6672582, 6709644, 6746686, 6783585, 6820450, 6857296, 6893252, 6927297, 6959555, 6990742, 7020688, 7048665, 7074763, 7099519, 7122576, 7143175, 7161688, 7179175]
57195G179175J6591J5229J4426J4804J5244J5001J5220J6752J8335J8751J8896
57184G358424J9871K0726K0170J8883J8115J7502J6279J5268J5498J6197J6157
57173G553090J5822J6137J6575J6318J6005J6419J6737J6134J5618J6209J6746
57162G731810J5782J4239J3827J4082J3388J1720J0034Q074N231K419O83r99m127
57149G836163p982j0931j3362j6713k0666k3826k6310k9046l1445l2215l1674
57138G591993l0812k9032k5318k0521j5999j1136m832J590N823P772Q694Q321
57126G486543N740J896j594m978q801j1373j0902q520n990k109N010J3945K2155
57113G481022L0373M0545N1360O0686P0889Q6742J09282J36789J70280K12361
$$ y = [7179175, 7195766, 7210995, 7225421, 7240225, 7255469, 7270470, 7285690, 7302442, 7320777, 7339528, 7358424, 7378295, 7399021, 7419191, 7438074, 7456189, 7473691, 7489970, 7505238, 7520736, 7536933, 7553090, 7568912, 7585049, 7601624, 7617942, 7633947, 7650366, 7667103, 7683237, 7698855, 7715064, 7731810, 7747592, 7761831, 7775658, 7789740, 7803128, 7814848, 7824882, 7832956, 7838187, 7840606, 7841289, 7840290, 7836163, 7828181, 7817250, 7803888, 7787175, 7766509, 7742683, 7716373, 7687327, 7655882, 7623667, 7591993, 7561181, 7532149, 7506831, 7486310, 7470311, 7459175, 7454343, 7455933, 7461756, 7469528, 7478222, 7486543, 7492283, 7494179, 7492585, 7487607, 7478806, 7467433, 7456531, 7448011, 7442021, 7439912, 7444922, 7458867, 7481022, 7511395, 7551940, 7603300, 7663986, 7734875, 7821617, 7930899, 8067688, 8237968, 8450329]
57103H450329K61973L16408L78056M53667N48242O65863Q15133J006512J245016
57094A4141199J532144J872616K269634K713701L184718L663836M133454M568434
57086C8079736M941087N234373N436276N526114N491282N356849N156668M847213
57078H0069598M282062L326183K008576N39684q28895j952839k826590l521200
57070H1096579m115516m655186n132953n497424n693863n703153n543920n250021
57062C9504543m857804m406905l935626l470673l026924k615928k247612j924879
57054A3018192j644224j402662j199064j029295q85987p63990o61600n76266n03523
57045D351581m40671l87532l42884l03672k68242k37129k10159j85807j63849
$$ y = [8450329, 8712302, 9028710, 9406766, 9860433, 10408675, 11074538, 11889671, 12896183, 14141199, 15673343, 17545959, 19815593, 22529294, 25714012, 29377848, 33511302, 38079736, 43020823, 48255196, 53691472, 59217586, 64708868, 70065717, 75222385, 80069598, 84351660, 87677843, 89686419, 90226103, 89397208, 87444369, 84617779, 81096579, 76981063, 72325877, 67192924, 61695500, 56001637, 50298484, 44754564, 39504543, 34646739, 30239834, 26304208, 22833535, 19806611, 17190683, 14943071, 13018192, 11373968, 9971306, 8772242, 7742947, 6856960, 6092970, 5431370, 4855104, 4351581, 3910910, 3523378, 3180494, 2876822, 2608580, 2371451, 2161292, 1975485, 1811636]
57036A811636j45638j31139j18366j06333r6006q7765q0363p3152o7035o2393
57026H43446n8147n3730n0026m7475m5013m1724l8104l4872l1883k8939k6428
57015C87105k4461k2521k0445j8661j7064j4846j1794q542n218j093M182J0315
57003B56957J7627K7039L8498N1182O5730Q4271J07529J33883J61736J89008K07479
56992A340939K01357J57907Q1379o581q1876j32382j59039j67913j64449j52941
56982I16401j37011j19312j01988q7487p7559p1429o6266n9898n2269m4320l6628
56971F2234k9485I493h453j2980q009l561l52J776L812O608J0301C700J9096K3882
56957D6678K8909L3511L6021L4437K7781J6940M302p356j5994k0998k3045k3171
$$ y = [1811636, 1665998, 1534859, 1416493, 1310160, 1214154, 1126389, 1046026, 972874, 905839, 843446, 785299, 731569, 681543, 634068, 589055, 547331, 509227, 474355, 442472, 413533, 387105, 362644, 340123, 319678, 301017, 283953, 269107, 257313, 248771, 243553, 242460, 246642, 256957, 274584, 301623, 340121, 391303, 457033, 541304, 648833, 782716, 944452, 1133460, 1340939, 1542296, 1700203, 1781582, 1775001, 1693125, 1560743, 1401704, 1233791, 1069342, 916401, 779390, 660078, 558090, 470603, 393044, 321615, 255349, 195451, 143182, 98862, 62234, 32749, 9493, -8453, -21433, -29442, -33003, -33355, -31579, -27767, -21159, -10858, 3700, 22796, 46678, 75587, 109098, 145119, 179556, 207337, 224277, 228579, 221223, 205229, 184231, 161186, 138015]
56945A38015k1952j9595j6493j3143r652n810j715K175N644R041J2920J7598K3014
56932A20047K8779L4337L9192M2506M2253L5810K2455N077j1601k4429l2811l7113
56920B64502l7761l5882l3178l0505k7544k4195k1078j8426j5730G171d039j0430
56908a4469r507p701n801m646l809k745k066k360k776k182r03P2R55K707N143
56893e0088P067Q175R530J2016B112J9175K3206K7705L2529L6667L8084L4626
56881B14104K5921J4151K504o719j2398j4261j3270j1472j0144q549n478j316
56869A73073K612O130J0154J5034K0438K6710L4731M4308N4103O3368P2177P9221
56857F02059Q0563P1840N1936K4444m117k7788m3806n2625n5823n4490m9559m2509
$$ y = [138015, 116063, 96468, 79975, 66832, 57180, 51370, 49655, 51830, 57474, 66515, 79435, 97033, 120047, 148826, 183163, 222355, 264861, 307114, 342924, 365379, 370456, 358855, 334426, 301615, 264502, 226741, 190859, 157681, 127176, 99632, 75437, 54359, 35933, 20203, 7171, -4039, -14469, -23976, -31677, -37478, -42124, -45933, -48678, -50744, -53104, -55880, -58062, -58965, -58893, -57938, -55231, -50088, -43021, -34846, -25316, -13300, 2112, 21287, 44493, 72198, 104727, 141394, 179478, 214104, 240025, 254176, 256680, 249961, 237563, 223302, 210032, 198560, 188416, 179867, 174389, 173073, 175685, 181815, 191969, 207003, 227441, 254151, 288882, 333190, 387293, 450661, 522838, 602059, 682622, 754462, 806398, 830842, 826725, 798937, 755131, 702506, 646683, 592193, 542634, 500125]
56845E00125l4714k6614j8146r485n38R598K1659L5204M9491O4814Q1769R9645
56833G72808J16303J28717J32282J20943R1121M6424k953m6381p8011r6911j04731
56822A079611j04231r8453q9618p8797o6781n4521m2430l0158j7462m701P899
56811E00358K0747L4319M8665O3581P8403R0861R6606R0712P0581L8259M08l4695
56799A098805o1278p7901q5785q6450q1551p3578o4951n6434m7503l8078k8863
56788C96433k0261j2101m255L402J1492K0499K9839L8399M5482M9951M9086M0149
56776F48115K3494K957j6936l3216m4455n0335n1850n0618m7585m3026l7604l2308
56764B66633k7455k2970j9391j7225j5527j2853r603p669p535p578o674n693n567
$$ y = [500125, 465411, 438797, 420651, 411166, 410628, 420226, 441885, 477089, 526580, 591394, 673163, 772808, 889111, 1017828, 1150110, 1271053, 1362174, 1408598, 1405645, 1359264, 1281253, 1184342, 1079611, 975380, 876927, 787309, 708512, 641731, 587210, 544780, 514622, 497160, 492459, 500358, 521105, 555424, 604089, 667670, 746073, 836934, 933540, 1024252, 1094833, 1133092, 1133500, 1098805, 1037527, 959626, 873841, 787391, 705840, 632262, 567311, 510877, 463374, 425296, 396433, 376172, 364071, 359816, 363218, 374710, 395209, 425048, 463447, 508929, 558880, 607966, 648115, 671609, 674566, 657630, 624414, 579959, 529624, 477774, 427156, 379571, 336545, 298941, 266633, 239178, 216208, 196817, 179592, 164065, 151212, 141609, 133940, 126405, 118827, 112153, 106460, 100893]
56751A00893n654n101m394m356m642m372l530k785k515k738l372l952l695k430
56737D7357r48l2L08L98L09R7m6j28l15m90m39m35q82j477j558j198r40o71J22
56718C9032J026R93P9n28l08mj64l77l07k33k87k40l06r11j496r55N44J568J532
56699C8658J329J521J494R98Q91J695K733L405L983M549M552M050L933M322M149
56684H2262L053K136K046J906J077M36P19J048L70q47j602j907k139j924j005
56669H5629k38l85p79m47J49j35j202j831j407n23j8j56n96p31l00J27j35o48
56651G6374l17P69J186K62r61j493j795k550l305l354l021k967l037k738k256
56636E0797k080k168k190k056j732j069k12M93J152K124L043L163K766K925L727
$$ y = [100893, 95239, 90138, 85744, 81388, 76746, 72374, 68844, 66059, 63544, 60806, 57434, 53482, 49787, 47357, 46409, 46377, 46685, 47083, 47392, 47489, 47443, 47315, 47000, 46510, 46071, 45636, 44754, 43277, 41719, 40521, 39581, 38910, 39032, 40058, 41051, 41130, 40602, 40294, 40290, 40126, 39749, 39442, 39209, 38922, 38682, 38376, 37465, 35969, 35014, 35558, 37126, 38658, 39987, 41508, 43002, 44000, 44891, 46586, 49319, 52724, 56707, 61256, 65808, 69858, 73791, 78113, 82262, 85315, 87451, 89497, 91403, 92480, 92916, 93635, 94683, 95053, 94206, 92604, 90697, 88558, 86634, 85629, 85391, 85006, 84227, 83780, 83929, 83794, 82592, 80761, 79354, 78831, 78813, 78657, 78061, 77330, 77030, 77157, 77022, 76374, 76057, 76826, 78012, 78274, 77313, 75820, 74025, 71475, 68170, 64816, 61795, 58828, 55791, 53053, 50797, 48717, 46549, 44359, 42303, 40571, 39502, 39290, 39783, 40935, 43059, 46102, 49265, 52031, 54956, 58683]
56621E8683M063L564L125L202L127K690K662L081K760J337Q9j75l75j294k140
56606H4399k148k002k396k703k322j883j888j590n50J67l02j116j250j098j206
56591F2112q96L21J369J296R60J471K221K174J860K347L262L580L428L408L183
56576I2096K301J560J841K530K674K751L657M829N132M803M784M881M276L222
56562A41337K595K382K102K086K814L563L220J951Q18L05L38R57J752J534j42
56547A67612j910k278j525p79l96m04j327l062m121l513k281j793j733j325j154
56532A40011j979l014l252l302m065m718m025k639k096k410k606k685l147l495
56518I6578l079k541k546k231p76O04M41m54m02K86K59j37L88J462J671J130R81
$$ y = [58683, 62746, 66310, 69435, 72637, 75764, 78454, 81116, 84197, 86957, 88294, 88383, 88208, 87833, 86539, 84399, 82251, 80249, 77853, 75150, 72828, 70945, 69057, 67467, 66917, 67084, 66782, 65666, 64416, 63318, 62112, 61216, 61537, 62906, 64202, 65162, 66633, 68854, 71028, 72888, 75235, 78497, 82077, 85505, 88913, 92096, 94397, 95957, 97798, 100328, 103002, 105753, 109410, 114239, 119371, 124174, 128958, 133839, 138115, 141337, 143932, 146314, 148416, 150502, 153316, 156879, 160099, 162050, 162868, 163173, 163511, 164468, 166220, 167754, 167612, 165702, 163424, 161899, 161120, 160724, 160320, 158993, 155931, 151810, 148297, 146016, 144223, 142490, 141165, 140011, 138032, 135018, 131766, 128464, 124399, 119681, 115656, 113017, 110921, 108511, 105905, 103220, 100073, 96578, 93499, 90958, 88412, 86181, 85405, 86009, 86450, 85996, 85594, 85880, 86139, 86002, 86390, 87852, 89523, 90653, 91634]
56501I1634J072N40O4R14K414K838K309K267K610K062R47Q12J539J513O24M69
56485A14628J496K378K399K164J877J109K90L49R08Q77N83J122K009J770O56L07
56469A34922Q83R97L74R0J95l52j311j266k69R0n45q15k10K58K85Q57K205L233
56451A39621L421L328L105K370J621J776K310J952R95P68R55ok014l301l399l544
56435A49958l992l555k192j422j687j684q14l2J32J93J14o55j369o39Q17P95q00
56418A33168j573m40Q91R26K97j67q08j661j758r50l85n01l90K19M35J37M03J429
56400A29272K022J724J496J834K151K385L153M044L850K801K415K896K894K089
56386A65026J687K005J983J413J278J528Q56q37k160k703l436m388m355l239k222
$$ y = [91634, 92706, 93246, 93310, 94224, 96638, 99476, 101785, 104052, 106662, 108724, 109671, 110483, 112022, 113535, 114159, 114628, 116124, 118502, 120901, 123065, 124942, 126051, 126341, 126690, 127598, 128475, 129058, 130180, 132189, 133959, 134615, 134922, 135805, 136802, 137176, 137266, 137461, 137109, 135798, 134532, 134263, 134353, 133808, 132993, 132783, 133041, 133326, 134183, 136388, 139621, 143042, 146370, 149475, 151845, 153466, 155242, 157552, 159504, 160499, 161267, 162222, 162216, 160202, 156901, 153502, 149958, 145966, 142411, 140219, 138797, 137110, 135426, 134612, 134580, 134712, 134905, 135019, 134364, 132995, 132356, 133173, 133968, 133168, 131595, 131155, 132046, 132972, 133269, 133102, 132294, 130633, 128875, 127925, 127540, 127039, 126649, 126868, 127303, 127440, 127843, 129272, 131294, 133018, 134514, 136348, 138499, 140884, 144037, 148081, 151931, 154732, 157147, 160043, 162937, 165026, 166713, 168718, 170701, 172114, 173392, 174920, 175776, 174939, 172779, 170076, 166640, 162252, 157897, 154658, 152436]
56371A52436j434K3J666K003J517K218M107N101M794M951N758N203L018J717K440
56356A95518L136K344J528K047K771K563K464L634N370O756Q118R515R972R412
56342B65148R224R924J0445J0477J1090J2205J2105J0392Q800Q193P385N936N253
56329C86577N843O152N287M236L462K050K31k48O96P96q95k591l056l331m085
56314D01124m392m210m931o222n716l110j137j023n93J478L195L060K792L919
56300C84234M964M472L834M632N880O268O606P854R136R725J0594J2205J3282
56287D83686J3382J4077J6011J7608J8222J9508K2148K4371K5442K7299L0848
56276G12602L4119L6047L8625M3116M7628N0894N5017O1883P0086P8032Q6959
$$ y = [152436, 151002, 151025, 152691, 154694, 156211, 158429, 162536, 167637, 172431, 177382, 183140, 188343, 191361, 193078, 195518, 198654, 200998, 202526, 204573, 207344, 209907, 212371, 216005, 221375, 228131, 236249, 245764, 255736, 265148, 274372, 284296, 294741, 305218, 316308, 328513, 340618, 351010, 359810, 368003, 375388, 381324, 386577, 392420, 398572, 403859, 408095, 411557, 413607, 413838, 413590, 414286, 415082, 414187, 411596, 408540, 405209, 401124, 396732, 392522, 387591, 381369, 375653, 372543, 371406, 370383, 369790, 371268, 374463, 377523, 380315, 384234, 389198, 393670, 397504, 402136, 408016, 414284, 420890, 428744, 437880, 447605, 458199, 470404, 483686, 497068, 511145, 527156, 544764, 562986, 582494, 604642, 629013, 654455, 681754, 712602, 746721, 782768, 821393, 864509, 912137, 963031, 1018048, 1079931, 1150017, 1228049, 1315008]
56265A315008R8179J10368J22250J35100J49944J65070J78795J91986K05507K17988
56255B890195K28162K36415K41976K41929K35078K23304K07045J83540J52139
56246D839783J17134Q2280M6578Q812k7767n9143q5408j08162j26366j38644j46656
56235D402441j52381j54886j53308j50126j47984j46134j43220j40608j39513
56226C074281j38128j35032j32228j31275j29797j25609j20911j18350j16236
56217A926715j11749j05759j00330r4547q7044p9697p4492o9619o2877n5954n1145
56206A033502m6880m0988l5354l2575l0860k7038k2076j8868j6950j4062j0674
56195G37177q418o370l222o75m20l34J921M328M118L059M217O227N860L825K900
$$ y = [1315008, 1413187, 1523555, 1645805, 1780905, 1930849, 2095919, 2274714, 2466700, 2672207, 2890195, 3118357, 3354772, 3596748, 3838677, 4073755, 4297059, 4504104, 4687644, 4839783, 4956917, 5039197, 5085775, 5094587, 5066820, 5007677, 4922269, 4814107, 4687741, 4549097, 4402441, 4250060, 4095174, 3941866, 3791740, 3643756, 3497622, 3354402, 3213794, 3074281, 2936153, 2801121, 2668893, 2537618, 2407821, 2282212, 2161301, 2042951, 1926715, 1814966, 1709207, 1608877, 1514330, 1427286, 1347589, 1273097, 1203478, 1140601, 1084647, 1033502, 986622, 945634, 910280, 877705, 846845, 819807, 797731, 778863, 761913, 747851, 737177, 728759, 722389, 719167, 718492, 718072, 717738, 719659, 723987, 728105, 731164, 735381, 741608, 747468, 751293, 754193]
56180G54193K606Q36j441k064k163l928o067o307n972p285q546p114m714m531
56166F97503n374m076j459n35q69n0J285J197J162L721P301Q660Q567R874J2028
56151G38935J2708J2857J4899J7972J9985K2141K6384L0994L3954L7989M6603
56140A015421N7962O8522P9966R6133J15565J33442J48624J62390J72325J74242
56130B224592J68493J58451J44737J26985J09068R6047Q7599Q0116P2818O5845
56120C334751N5483L8435J8528K402r209j9544k8428l4388m1428n5584p6357r8535
56108C086126j20183j41457j58235j65326j64279j60367j53753j41417j25496
56099A755613j11341r9065q5244p1135o0987n3891m5620l6914l1683k8769k3872
$$ y = [754193, 756799, 757635, 756194, 754130, 751967, 748039, 741972, 735665, 729693, 722408, 713862, 706748, 702034, 697503, 692129, 688053, 686594, 686059, 685190, 685140, 686425, 687622, 688784, 692505, 699806, 708466, 717033, 726907, 738935, 751643, 764500, 779399, 797371, 817356, 839497, 865881, 896875, 930829, 968818, 1015421, 1073383, 1141905, 1221871, 1318004, 1433569, 1567011, 1715635, 1878025, 2050350, 2224592, 2393085, 2551536, 2696273, 2823258, 2932326, 3028373, 3115972, 3196088, 3268906, 3334751, 3390234, 3428669, 3447197, 3449599, 3440390, 3420846, 3392418, 3358030, 3316602, 3261018, 3184661, 3086126, 2965943, 2824486, 2666251, 2500925, 2336646, 2176279, 2022526, 1881109, 1755613, 1644272, 1545207, 1459963, 1388828, 1327841, 1273950, 1228330, 1191416, 1159733, 1130964, 1107092]
56088A107092j7801j4519j2984r373n249m665n476k666K003L069J826L831Q143
56075A053231R134P202P401R273Q365O095P475J0714R981O876Q004J2639J4251
56062A170641J2936J4591J8859J9826J7879J8841K2070K1564J8212J8651K2500
56051A376570K3212K1121K2872K8184L0159K8595K9976L4322L5272L3103L4271
56040A697657L8048L7371L2893L2145L4818L3317K8073K7342L1417L2199K9014
56029B054294K9493L4032L5129L2883L5152M1503M3377M1086M3809N1740N5451
56018B497949N4125N6632O3392O5516O3299O6687P5720P9852P8333Q1273Q8861
56007C271639R0426Q6234Q8458R8048J02832J01387J05627J16658J22130J21106
$$ y = [1107092, 1089291, 1074772, 1061788, 1052415, 1047166, 1042501, 1037025, 1034359, 1036362, 1039431, 1041257, 1045088, 1053231, 1062365, 1069567, 1076968, 1086241, 1094606, 1100701, 1108176, 1118890, 1128871, 1135747, 1143751, 1156390, 1170641, 1183577, 1198168, 1217027, 1236853, 1254732, 1273573, 1295643, 1317207, 1335419, 1354070, 1376570, 1399782, 1420903, 1443775, 1471959, 1502118, 1530713, 1560689, 1595011, 1630283, 1663386, 1697657, 1735705, 1773076, 1805969, 1838114, 1872932, 1906249, 1934322, 1961664, 1993081, 2025280, 2054294, 2083787, 2117819, 2152948, 2185831, 2220983, 2262486, 2305863, 2346949, 2390758, 2442498, 2497949, 2552074, 2608706, 2672098, 2737614, 2800913, 2867600, 2943320, 3023172, 3101505, 3182778, 3271639, 3362065, 3448299, 3536757, 3634805, 3737637, 3839024, 3944651, 4061309, 4183439, 4304545]
55997D304545J26711J39984J46820J45525J50766J65089J73983J75035J83483
55988E711941K02421K16841K24124K40097K67418K89440L03312L26446L61872
55979H143912L91657M13373M46987M96045N40334N77205O29554P01668P70440
55970A3111175Q32766R15651J025844J138881J253128J401697J594221J804709
55962B3078072K036368K336463K726786L189709L748805M488876N470712O712661
55954E3788452Q285453J0320938J2887246J5975840J9658649K4094140K9265165
55947A74275883L4815658M0135921M4243213M5352380M1084439L0029304J3505444
55940D23442242m567544j9953002l0391545l5940816l7753897l6993917l4599036
$$ y = [4304545, 4431256, 4571240, 4718060, 4863585, 5014351, 5179440, 5353423, 5528458, 5711941, 5914362, 6131203, 6355327, 6595424, 6862842, 7152282, 7455594, 7782040, 8143912, 8535569, 8948942, 9395929, 9891974, 10432308, 11009513, 11639067, 12340735, 13111175, 13943941, 14859592, 15885436, 17024317, 18277445, 19679142, 21273363, 23078072, 25114440, 27450903, 30177689, 33367398, 37116203, 41605079, 47075791, 53788452, 62073905, 72394843, 85282089, 101257929, 120916578, 145010718, 174275883, 209091541, 249227462, 293470675, 338823055, 379907494, 409936798, 423442242, 418874698, 398921696, 368530151, 332589335, 294835438, 257841521, 223242485]
55933B23242485l1344265k7759951k4113137k0582284j7359919j4560068j2164301
55926G5358560j0125801q440757p084312n972733n038275m272896l665153l161486
55918B7597147k722457k356416k066642j819282j591027j397581j248209j118124
55910A3277409r90123q80107p98083p24342o46215n80113n35930m95476m46418
55901G180602m03619l77269l52241l18062k88597k73323k58211k33287k11518
55892D464475k02566j94010j76014j59680j54064j48596j34802j23000j21379
55883C050364j19881j10284j01797j01835j00964r1607q2755q1944q0729p1817
55873B106751o3164o1718n9980n1595m3969m2962m1137l3302k7842l0621l3090
$$ y = [223242485, 191898220, 164138269, 140025132, 119442848, 102082929, 87522861, 75358560, 65232759, 56792002, 49707690, 43734957, 38696682, 34423786, 30758633, 27597147, 24874690, 22518274, 20451632, 18632350, 17041323, 15643742, 14395533, 13277409, 12287286, 11407179, 10609096, 9884754, 9238539, 8658426, 8122496, 7627020, 7180602, 6776983, 6399714, 6047473, 5729411, 5440814, 5167491, 4909280, 4675993, 4464475, 4261909, 4067899, 3891885, 3732205, 3578141, 3429545, 3294743, 3171743, 3050364, 2930483, 2820199, 2718402, 2616567, 2515603, 2423996, 2341241, 2259297, 2178568, 2106751, 2043587, 1981869, 1921889, 1870294, 1826325, 1783363, 1742226, 1708924, 1681082, 1650461, 1617371]
55862A617371k8190k2919k3346k2356j4242o792o734p123j319M078K157j608j513
55849A487464l773j4517k7447l5084m0889m9120n4103n1073m6692m7478m8152
55838A069136m2488l5472l3603l3018k8240k3278k3172k3465j8765j3197j2067
55827G82371j1539o715j785k064l785j660J022o39l503k995k096m687p136n459
55813G29330l710o433r810r009p331r265j1446r403o604p819r934q205n515o611
55799F18235r033q378p008r003j1905j1698j0829j3156j6068j5425j3379j3682
55787D78671j4284j1943r218r544j0268p846m882m969n549l045o2n20k596l298
55773C90647m807r368j3213j2666j1064j2501j4086j1714q159p777q318n834k789
$$ y = [1617371, 1589181, 1566262, 1542916, 1520560, 1506318, 1499526, 1492792, 1485669, 1484350, 1488428, 1490585, 1488977, 1487464, 1483691, 1469174, 1441727, 1406643, 1365754, 1316634, 1262531, 1211458, 1164766, 1117288, 1069136, 1026648, 991176, 957573, 924555, 896315, 873037, 849865, 826400, 807635, 794438, 782371, 770832, 764117, 762332, 760268, 756483, 754823, 755845, 755206, 751703, 748708, 746612, 741925, 734789, 729330, 725620, 719187, 709377, 700368, 693037, 683772, 672326, 662923, 656319, 648500, 638566, 630361, 624846, 618235, 609202, 600824, 593816, 584813, 572908, 561210, 550381, 537225, 521157, 505732, 492353, 478671, 464387, 452444, 443226, 433682, 423414, 415568, 410686, 405717, 400168, 397123, 397061, 396541, 393945, 390647, 385840, 376472, 363259, 350593, 339529, 327028, 312942, 301228, 293069, 285292, 276974, 271140, 268351]
55760B68351l350n136l708r62j160k726j854l43j927m436l478o02j46j257m97
55745B36769P64q84l736l880k473l047m459l475j550j981l140j540J116R59o25
55730B08818L39K742K414l20j861k116l508n179m569k849k802l309j777L28K99
55715A86650p7K230N193N029L350M400P507Q876Q804J0395J2910J3002J1077R987
55701B89333Q978N216q1l278m741p526j1038j2021j0650r759r218o844l719k848
55687B21804l568k746l84J215K377M729O682N729L679M101O119O380N354N777
55673B67248O575M530P37q53k82q69k703k904j572j476k472k050q21j652l928
55658B57508m404l201l401n165n864n502o394p998p680o189o711q869r304p919
$$ y = [268351, 265001, 259865, 256157, 255195, 254035, 251309, 249455, 249112, 247185, 242749, 239271, 238669, 238523, 237266, 236769, 237533, 236649, 232913, 229033, 226560, 223513, 219054, 215579, 214029, 212048, 208908, 207368, 208484, 209443, 208818, 209157, 211899, 214313, 213993, 212132, 210016, 206508, 201329, 196760, 193911, 191109, 187800, 186023, 186351, 186650, 186573, 188803, 193996, 199025, 202375, 206775, 214282, 223158, 231962, 242357, 255267, 268269, 279346, 289333, 298311, 303527, 303446, 300168, 295427, 287901, 276863, 264842, 254192, 244433, 235215, 228371, 224652, 221804, 218236, 215490, 215106, 216321, 218698, 223427, 230109, 235838, 239517, 243618, 249737, 256117, 261471, 267248, 273823, 278353, 279090, 278237, 277955, 277086, 274383, 271479, 269907, 268431, 265959, 263909, 263088, 261436, 257508, 253104, 249903, 246502, 241337, 235473, 229971, 223577, 215579, 207899, 201710, 194999, 186130, 176826, 168907]
55644A68907p831r257r205p317o422p027o698n207m986o050n634l383j998k326
55630H5566k455j918k206l019k536j393j769k865k005J17L09j287j428K77R21
55615F4309j36m99K29j59j577j333P09J562L24p88r86j737k722j872J22K43j421
55598E4268j613K39J109j5o54J58L94m31j69J399J656M9o87M87J229L53k64L41
55580E7849N10l99o95O7Q8j007j320m27j38p78n88M60L36q93q10Q30J606J162
55562E5853J857L856M311K545J397J945J597q77k915k657j766j780j636o76l36
55547F0718r48n08J581L106K968K995M272N199M849M738N653O101N415M969N023
55532A16131L815J163o38q81j662l761n009m403l952m750m948l462k070j946j675
$$ y = [168907, 161076, 151819, 142614, 135297, 128875, 121848, 115150, 109943, 104957, 98907, 93273, 89890, 87892, 85566, 83111, 81193, 78987, 75968, 73432, 72039, 70270, 67405, 65400, 65517, 65826, 64539, 63111, 63388, 64309, 64173, 63674, 63903, 63744, 62167, 60834, 61543, 63105, 63429, 62641, 61655, 59918, 57196, 55324, 55446, 55689, 54268, 52655, 52894, 54003, 53988, 53334, 53492, 53886, 53455, 53286, 54685, 56341, 56390, 55703, 56190, 57419, 57772, 57508, 57849, 58359, 57960, 57265, 57332, 57420, 56413, 55093, 54666, 54528, 53750, 53162, 53622, 53958, 53065, 52255, 53085, 54691, 55853, 57710, 61566, 65877, 68422, 69819, 71764, 73361, 72484, 69569, 66912, 65146, 63366, 61730, 61054, 60718, 59770, 59262, 60843, 63949, 66917, 69912, 74184, 79383, 84232, 88970, 94623, 100724, 106139, 111108, 116131, 119946, 121109, 120471, 119590, 117928, 114167, 109158, 104755, 100803, 96053, 91105, 87643, 85573, 83627, 81952]
55517H1952m82Q3m47m5J869K700R48j236j909k315l797n044m827m452n162n880
55501E1956n714n787o583o348m291k518k644l181k375r69j32O63J729J804N25
55486A6135k90L52R50M68K03Q99R93l57j385r34o60j931l236k921j861j301o17
55469D507O57J074j98j546j611A419g22k460j318J38O74R15a383c60m82j408r39
55452c189p50j732j994l11J332J004O7N33J631J655g11B81R73J54m65J88J075
55435B206P87j24n25o74F41b61r3R3q21j186m0R98M84m45m00j38n78p62N5N19
55415b575l49r48K11J715c51B33N52J442K040K251K360J726K63m02O58J826J454
55398A4403M14J74K43l42q50m20Nn81j196o99K4k94j122j549k065l016b8j787
$$ y = [81952, 81470, 81553, 81106, 81061, 82930, 85630, 86578, 85342, 83433, 81118, 77321, 72277, 67450, 62998, 57836, 51956, 46242, 40455, 33872, 27524, 23233, 20715, 18071, 14890, 12515, 11546, 11414, 12077, 13806, 15610, 16135, 15845, 16197, 17147, 17615, 17818, 18717, 19710, 19353, 17968, 17034, 16374, 14443, 11207, 8286, 6425, 5124, 4507, 5164, 6238, 6040, 4494, 2883, 1419, -722, -3182, -4500, -4362, -3688, -2773, -1383, -360, -842, -2250, -3189, -3939, -5671, -7665, -7976, -6644, -5640, -5573, -5040, -3409, -1754, -711, 281, 1254, 1408, 943, 1131, 2206, 2993, 2869, 2344, 1670, 641, -261, -354, -261, -1082, -2268, -2308, -1310, -826, -1271, -1671, -1809, -2387, -3149, -3094, -2575, -2924, -3872, -3661, -1946, -351, 233, 785, 2227, 4267, 6518, 8878, 10604, 10867, 10465, 11123, 12949, 14403, 14817, 14991, 15234, 14892, 14042, 13622, 13627, 13046, 11850, 11151, 11175, 10881, 9759, 8210, 6145, 3129, -28, -1815]
55380a815m37m73r21n93k34n88m62R16J895J141J66O40E70N60n43o0J142J063
55362B732J41J10O76L20p18j109j017b61j743j109k12j75k70O06J489h29n86r97
55344b412m25p4J60J020I4J503O53M14L73k67p23j73K15p07a44l86A074J917M25
55325C416r13A171c24j356m48M56L25j41J59N30j54r54l53Q78d59J12J30F61Q88
55306A549K03K00R03J086N72K33O7m78r08m34K71J25l39j0O22N24K78R44J748
55287G156J277Ko21o60r70j066k10N29j75j291r87K40O49L56N91R14J33r46p18
55268D203Q8l49j418j039M40P49k93o59J07L57l00k96Q33J717J776J910K237J806
55250A1869Q18N66R74O85l00n70L3K32j51k0N41K88o25p35m5q7j024j381q12n24
$$ y = [-1815, -2252, -2725, -3646, -4239, -4473, -5061, -5523, -4607, -2712, -1571, -1405, -765, 570, 1130, 587, 527, 1669, 2732, 2873, 2983, 3659, 3979, 3261, 2152, 1135, -261, -2004, -3113, -3325, -3500, -3770, -3164, -1675, -829, -1415, -2412, -2837, -2911, -2751, -1731, 94, 1597, 2250, 2664, 3037, 2770, 2047, 1874, 2089, 1382, -144, -530, 1074, 2991, 3416, 2503, 1171, -324, -1680, -2128, -1672, -1347, -1488, -1329, -799, -953, -1907, -2260, -1382, -459, -347, -217, 661, 1549, 1752, 1952, 2855, 3941, 4513, 4746, 4813, 4335, 3427, 2993, 3264, 3389, 3050, 3040, 3662, 4186, 4464, 5408, 7156, 8433, 8435, 7814, 7154, 6184, 5118, 4908, 5437, 5262, 3971, 2984, 3224, 3873, 4229, 4820, 5734, 5867, 4921, 4203, 4291, 3942, 2524, 1485, 1925, 2674, 2381, 1722, 1829, 2186, 1886, 1590, 2423, 4140, 5916, 7826, 10063, 11869, 12687, 13253, 14227, 14912, 14612, 14042, 14075, 14307, 14156, 14136, 14677, 14965, 14340, 13605, 13560, 13473, 12449, 11068, 10256, 9732]
55230I732o82j05J118J440O79L97R50R21j3l70L14O07q5m58J15M78M9j14L68K33
55210A5574j008j855j282l98m05p08k75O70J409J811J829J247N13N13J093J229
55194A9957Q61Q85J147M46j149j987j399o18n52n78k41j90o17o13Q3M34J8j73
55176A5714L64O51J02k72L84J231J092J84m80n14k24k4l07j127j798j634j062
55159A2280r89j236r18j14K79K64P08J628K073J778J349Q74j6q50q42n77j269
55142A4422k430k395j087j43j94k21J75K36N8P23J895J791K22o93K07J447J528
55125A5541J000P65M23l83p86k24L65J57k23n3J74r9l50o4L18L56M05O25M95K
55105A8444m0M92N84q3l66M51J430J517R99N48J67o3M94J813K616J985O28k46
$$ y = [9732, 9050, 8945, 10063, 11503, 12182, 12579, 13529, 14450, 14437, 14067, 14381, 14988, 14903, 14445, 14560, 15038, 15087, 14973, 15341, 15574, 14566, 12711, 11429, 11031, 10626, 9918, 9643, 10313, 11722, 13533, 15362, 16609, 17122, 17635, 18728, 19957, 20818, 21703, 22850, 23296, 22147, 20160, 18761, 18143, 17591, 17013, 16772, 16582, 15965, 15352, 15435, 15869, 15887, 15714, 16078, 16729, 16831, 16559, 16943, 18174, 19266, 19450, 18970, 18456, 18232, 18208, 17901, 16774, 14976, 13342, 12280, 11291, 10055, 9137, 9023, 9302, 9566, 10274, 11902, 13975, 15753, 17102, 17976, 17960, 17110, 16268, 15691, 14422, 11992, 9597, 8510, 8367, 8173, 7952, 8127, 8363, 8421, 9144, 11039, 12830, 13052, 12359, 12566, 14013, 15541, 16541, 17306, 17729, 17346, 16560, 16336, 16701, 16858, 16635, 16582, 16756, 16657, 16307, 16243, 16561, 16917, 17322, 17947, 18442, 18444, 18404, 18896, 19480, 19397, 19031, 19482, 20912, 22429, 23428, 23976, 24143, 24080, 24574, 26387, 29003, 30988, 31616, 31370]
55087C1370l78j35L02Q17J191J525K066K502K315J772J427R18l72j674j574l10
55071D1762M67L25L95J006J100M41K12P82R88L20j64J31M02L02O67J557J641N60
55053E2894j93J70L96m00j023m73R6o06j652j432k09O27P56P66O94K45k64l78
55035E0014k92k62k8M31N35K52M01J121J310M47l77k11K45k9p67j204j377j541
55017D8668j345o76l40q79j601j616j056m88r9p9p21j500j240J60J323J378J095
55000D0984J290J513J160O45N59P50J006J509K010J739Q35N12J155J624J166N70
54984E9027O64J082J344J730K289K376J926J787K128K069J560J836L277M544M738
54969I2377M588M630M255L636M518P632J1190J3404J4704J6055J6932J6685J6065
$$ y = [31370, 30992, 30857, 31159, 31976, 33167, 34692, 36758, 39260, 41575, 43347, 44774, 45692, 45320, 43646, 42072, 41762, 42229, 42554, 42949, 43955, 45055, 45496, 45708, 46490, 47478, 47798, 47634, 47765, 48167, 48469, 49136, 50693, 52334, 52894, 52701, 52871, 53267, 52867, 51844, 51371, 51467, 50861, 49209, 47777, 47568, 48195, 48951, 49717, 50411, 50656, 50392, 50014, 49722, 49460, 49432, 49863, 50398, 50650, 51051, 52172, 53482, 53929, 53552, 53341, 53586, 53557, 52790, 51586, 50209, 48668, 47323, 46647, 46307, 45428, 43827, 42211, 41155, 40667, 40568, 40489, 39768, 38268, 37028, 37188, 38511, 39889, 40984, 42274, 43787, 44947, 45592, 46151, 46901, 47907, 49416, 51426, 53165, 54000, 54512, 55667, 57291, 58457, 59027, 59691, 60773, 62117, 63847, 66136, 68512, 70438, 72225, 74353, 76422, 77982, 79818, 83095, 87639, 92377, 96965, 101595, 105850, 109486, 114004, 121636, 132826, 146230, 160934, 176989, 193921, 210606, 226671]
54956B26671J5602J4036J0189N035J51m428r047j2658j4160j4374j4760j5181
54944A87076j4717j3595j2622j1653j0261q961q164p052n049l269k825k862k029
54931H4017p59k54k50L20J294J844K243L278M644N649O771Q820J1254J2986J4150
54916A56007J5388J6204J5664J4071J2278J0005O459K000k347o373j0209j3186
54904B15961j4702j5444j6214j6374j5020j2843j1213j0173q983p775o973n988
54892G4259m216k504j866j647p63J45j10r03p65N2K36J7O45J685J315o55k358
54875F2567k637k235k027j894j671j544j296o44k68j028k256k412j383n28n09
54860D0235o29l87j46p6J11L39K16m4M1J96j80p82q79o18o09o13p5N17L44j42
$$ y = [226671, 242273, 256309, 266498, 271533, 271684, 267256, 258209, 245551, 231391, 217017, 202257, 187076, 172359, 158764, 146142, 134489, 124228, 115267, 107103, 100051, 95002, 91733, 88908, 86046, 84017, 83258, 83004, 82754, 83074, 84368, 86212, 88455, 91733, 96377, 102026, 108797, 117617, 128871, 141857, 156007, 171395, 187599, 203263, 217334, 229612, 239617, 246076, 248076, 245729, 239356, 229147, 215961, 201259, 185815, 169601, 153227, 138207, 125364, 114151, 103978, 94995, 87220, 80247, 74259, 70043, 67539, 65673, 64026, 63263, 63408, 63298, 62395, 61630, 61682, 61918, 61935, 62580, 64265, 65580, 64925, 62567, 59930, 57695, 55668, 53774, 52103, 50559, 49263, 48619, 48351, 47323, 45067, 42655, 41272, 40744, 40235, 39606, 39219, 39073, 38997, 39108, 39447, 39663, 39619, 39660, 39856, 39676, 38894, 38015, 37397, 36788, 36175, 36100, 36617, 36961, 36819]
54840C6819P8P08O68J67L82J260J488P24O8J93N79P70R77J231J278J331J744K121
54822E2586J965J863K620L643L768L280L401M106M387M472N668P881R429R655
54808A18724R942J1536J4023J6339J7830J7938J6370J3878J1533Q969M936k69
54796B61749m601o926q209r578j0802j1428j1838j2287j2133j0878r109p706o861
54783A39393o353n939n169l678j968j052j084j175o72K21J178K219L279M177N008
54768A28385N864O415O599P294R238J1636J3206J4110J5363J6581J6136J3540
54756B64367R977O324K335j874n262p318q657r673r945r435q967q951q808q193
54742A95920p669p681p814p626p273p016o887o991p286p086n833m205l437l553
$$ y = [36819, 36897, 37605, 38273, 38440, 38822, 40082, 41570, 42294, 42362, 42555, 43134, 43904, 44881, 46112, 47390, 48721, 50465, 52586, 54551, 56414, 59034, 62677, 66445, 69725, 73126, 77232, 81619, 86091, 91759, 99640, 109069, 118724, 128666, 140202, 154225, 170564, 188394, 206332, 222702, 236580, 248113, 257082, 262018, 261749, 257148, 250222, 242013, 232435, 221633, 210205, 198367, 186080, 173947, 163069, 153960, 146254, 139393, 133040, 127101, 121932, 118254, 116286, 115234, 114150, 112975, 112303, 112524, 113702, 115921, 119200, 123377, 128385, 134249, 140664, 147263, 154557, 163795, 175431, 188637, 202747, 218110, 234691, 250827, 264367, 274344, 280668, 283003, 281129, 275867, 268549, 259892, 250219, 240274, 230839, 221872, 212921, 204113, 195920, 188251, 180570, 172756, 165130, 157857, 150841, 143954, 136963, 129677, 122591, 116758, 112553, 109116, 105563]
54728A05563l580l277l277l551l310k569k230k417k212j293l05N15J564K411J944
54713H3976M01m57J47R41P65J51q8k40o15m89O52J912K173J617J074O16j73j129
54695I1234j595j206p0J317K109J719O03k24n76j026j492j133N7R03Q36P53J401
54678I3610K120K016J375J033J126J276J415J673J926K064K268K634K955L103
54664A20594L145L039K870L247M625O239O776O115N333M933M317L231K355K063
54650A78882J859J545J704K490L038K827K548K920L577L851L845M036M435M738
54636B22295M703M065K651Q36q10k420m590p146r158j0293j1034j1422j0779r088
54622A57810p437o581o089n402m632l866k761j391m88l11j62M74J227J714K131
$$ y = [105563, 101983, 98706, 95429, 91878, 88568, 85999, 83769, 81352, 79140, 77847, 77542, 78057, 79621, 82032, 83976, 84377, 83920, 84067, 85008, 85773, 85924, 85836, 85596, 84981, 84492, 85144, 87056, 89229, 90846, 91920, 92536, 92363, 91234, 89639, 88433, 88363, 89680, 91789, 93508, 94111, 93887, 93311, 92285, 90793, 89660, 89717, 90620, 91456, 92209, 93610, 95730, 97746, 99121, 100154, 101280, 102556, 103971, 105644, 107570, 109634, 111902, 114536, 117491, 120594, 123739, 126778, 129648, 132895, 137520, 143759, 150535, 156650, 161983, 166916, 171233, 174464, 176819, 178882, 180741, 182286, 183990, 186480, 189518, 192345, 194893, 197813, 201390, 205241, 209086, 213122, 217557, 222295, 226998, 231063, 233714, 234550, 233740, 231320, 226730, 219584, 210426, 200133, 189099, 177677, 166898, 157810, 150373, 143792, 137703, 132301, 127669, 123803, 121042, 119651, 119163, 118852, 118690, 119164, 120391, 122105, 124236]
54607A24236K553K541K002J548J606J929K226K391J922K69j965l330l377l073
54593A31478l105l055k746k909l808m424l870k611j576j032r68j599k676l210
54579I3889k619j487p19o21j110j971k543k174j277r41j256j191l85K65K30J18
54563G6208L22K31m81j132j228j174j155o33L16N34m76j603j830j591j547j326
54547F3435n17K08J97O4O77J684K124J786J160O76O73J409K471K975K900L249
54531H5171M362N213N015M365M018L609K535J094j26j091j867k241k420l108m229
54516A00300m689l980k939k352k065j982k470l125k744j306m29q75j340p95k26
54501F8983o67j183n62N10P55N84J218K454L040K608J800J148J029J871L194L435
$$ y = [124236, 126789, 129330, 131332, 132880, 134486, 136415, 138641, 141032, 142954, 143223, 141258, 137928, 134551, 131478, 128373, 125318, 122572, 119663, 115855, 111431, 107561, 104950, 103374, 102342, 101374, 99775, 97099, 93889, 91270, 89783, 89064, 88443, 87333, 85362, 82819, 80645, 79368, 78427, 77171, 75980, 75595, 75860, 76090, 76208, 76530, 76761, 76280, 75148, 73920, 72746, 71591, 70958, 71274, 71808, 71332, 69729, 67899, 66308, 64761, 63435, 62918, 63126, 63323, 63387, 64064, 65748, 67872, 69658, 70818, 71494, 72167, 73576, 76047, 79022, 81922, 85171, 89533, 94746, 99761, 104126, 108144, 111753, 114288, 115382, 115256, 114165, 112298, 110057, 107637, 104529, 100300, 95611, 91631, 88692, 86340, 84275, 82293, 79823, 76698, 73954, 72648, 72219, 71344, 70004, 69209, 68983, 68316, 67133, 66571, 67081, 67836, 68420, 69638, 72092, 75132, 77740, 79540, 80688, 81717, 83588, 86782, 90217]
54485I0217J999M12J96Q21J178J643K890L968L616K550K386K943K723J466K64
54470A19272m20r93j298q11nJ36k47l35l23j032k104k356j769j496j915k230k008
54453A00066j649j320p96l97p59j679k321k472k557k575k226j773j623j396o64
54438G5859j53q14k034k303j471p62p38p46m24j47O5O79J512J751J347J176J576
54421G4373J952J943J911K053K103J998J947J784J189N50N80J145J505J532J685
54406I8250J945J871J666J954K534K582K094J886K092J953J335J153J865K623
54392A25803K491J675J042J033J465J904J946J473Q02K82j43o51j139j462j770
54377A34751k185k567l003l939n262n934n305m066l207k731k231j874j813j521
$$ y = [90217, 92216, 92628, 92824, 93645, 94823, 96466, 99356, 103324, 106940, 109490, 111876, 114819, 117542, 119008, 119272, 118852, 117859, 116561, 115750, 115745, 115881, 115634, 115299, 114976, 113944, 111840, 109484, 107715, 106219, 104304, 102074, 100066, 98417, 97097, 96301, 95904, 95145, 93466, 91145, 88673, 86116, 83541, 81315, 79542, 77919, 76523, 75859, 75706, 74892, 72858, 70555, 69084, 68322, 67584, 66838, 66414, 66267, 66332, 67011, 68523, 70274, 71621, 72797, 74373, 76325, 78268, 80179, 82232, 84335, 86333, 88280, 90064, 91253, 91803, 92383, 93528, 95033, 96565, 98250, 100195, 102066, 103732, 105686, 108220, 110802, 112896, 114782, 116874, 118827, 120162, 121315, 123180, 125803, 128294, 129969, 131011, 132044, 133509, 135413, 137359, 138832, 139634, 139916, 139773, 139122, 137983, 136521, 134751, 132566, 129999, 126996, 123057, 117795, 111861, 106556, 102490, 99283, 96552, 94321, 92447, 90634, 89113]
54363H9113q30o85j615k370j656l42j82j006j149k09N71O14O58J015J013N04K83
54346H3727O14Q44Q48J400K656L596L498K887K558K646K965L352L388K742J873
54331A19594J594J815J604N49q45k054k914l302l297l453l988m121l290k479k954
54316I2459m156m491l829l438l594l252k205j613j913k033j271m18k39l44k48
54301E9415l20q95j518j695j485r63j06N80M49n3K11J140J358M08m28j67N00O19
54283E7050M58P06J206J391J187P55J58k51P9R07J251Q28N00Q76J453J707J913
54266G2174K262K219J491P75O96Q52N90J8m35p87j163j315j082q66j110j700k269
54249G0350k572k381j565n50r4l51p57r28j019j080q58l45J42N38R45J060N65
$$ y = [89113, 88283, 87598, 85983, 83613, 81957, 81615, 81433, 80427, 79278, 79069, 79640, 80254, 80912, 81927, 82940, 83444, 83727, 84341, 85185, 86033, 87433, 90089, 93685, 97183, 100070, 102628, 105274, 108239, 111591, 114979, 117721, 119594, 121188, 123003, 124607, 125156, 124311, 122257, 119343, 116041, 112744, 109291, 105303, 101182, 97892, 95413, 92459, 88303, 83812, 79983, 76545, 72951, 69699, 67494, 65881, 63968, 61935, 60664, 60246, 60007, 59663, 59415, 59095, 58200, 56682, 54987, 53502, 52539, 52433, 53013, 53462, 53409, 53620, 54760, 56118, 56526, 56098, 55931, 56431, 57050, 57508, 58214, 59420, 60811, 61998, 62753, 62911, 62660, 62739, 63646, 64897, 65725, 66225, 67101, 68554, 70261, 72174, 74436, 76655, 78146, 78921, 79617, 80469, 81059, 81077, 80642, 79855, 78692, 77377, 76295, 75429, 74319, 72619, 70350, 67778, 65397, 63832, 63282, 63188, 62837, 62080, 61152, 60133, 59053, 58195, 57850, 57992, 58530, 59475, 60535, 61100]
54232F1100j3J36O60M06p39j599j494r56m27L98J392J573O17m13n56j92o7n2K67
54213F0041O40O31M65O37J116J445J254M14q23j687j579r88r76j677k144j805
54197E4964j095n20j1N13Q36R46R75O24l84j361j312n78m49j091j321o79j45l36
54179D9576n14n1N32O91P40R43Q57L03k16n39j099j691j354o5R12R11O63N65r6
54160E1068j395j954j044P4K06O1O98J444J080q3q22q60o22l6R89J656J277N48
54142E2285M93Q30O37L1j75R0K80L51N18M44k09q98r23n30k85LN95Q32Q7q39p23
54121E2894J73M88j95j024j350j248p87O2P74O19l03j241j798k011j761j010l54
54104D1928l97p88p70l68j79k16ON24R40J223J523J483P20k59o06m61o70j266
$$ y = [61100, 61087, 61223, 61883, 62289, 61550, 59951, 58457, 57501, 57074, 57472, 58864, 60437, 61054, 60641, 60085, 59893, 59826, 59774, 60041, 60681, 61312, 61777, 62414, 63530, 64975, 66229, 66643, 65820, 64133, 62554, 61566, 60590, 58913, 56769, 54964, 53869, 53349, 53338, 53851, 54687, 55633, 56608, 57232, 56848, 55487, 54175, 53597, 53148, 52057, 50736, 50057, 49912, 49576, 49062, 49011, 49543, 50234, 50974, 51917, 52774, 53077, 52861, 52322, 51223, 49532, 48178, 48113, 49025, 49936, 50599, 51164, 51068, 49673, 47719, 46675, 46749, 46955, 47016, 47714, 49158, 50238, 50155, 49333, 48473, 47851, 47815, 48804, 50460, 51737, 52285, 52778, 53608, 54245, 54276, 54101, 54191, 54471, 54822, 55340, 55784, 55575, 54677, 53754, 53224, 52939, 52942, 53537, 54369, 54456, 53617, 52894, 53067, 53555, 53360, 52336, 50986, 49738, 48951, 49013, 49787, 50406, 50103, 48862, 47064, 45053, 43292, 42282, 41928, 41531, 40743, 39973, 39605, 39426, 39210, 39216, 39740, 40680, 41903, 43426, 44909, 45629, 45370, 44764, 44303, 43633, 42367]
54086D2367j346n48L91Q04R47J289J648J483O65l84j095j198q92o03m79l16j9
54069D2714K35M22P49J095Q93O2n55j47J002J919K032J510Q40M62M85N24K20q1
54051E4381K17P89O51j93m54N23J708J963J602J454J383R25N37J001K016K586
54035G1089K501K417K728L251L816M353M604M437M268M548N113N467N341M562
54021A28495L041J378P83J665K926L371L124K943K872K446J712J085O31K33J9
54006A56724l7l70j071j559j606j905k769l253k571j509j282j715j839j611j670
53991A31957j830j248O8J071J058K87o49j265j231o35j2L90Q69J395J325O12K30
53974A32392O24P52j68j127q72l3r5j032j653j703j910k277k081j391j018j041
$$ y = [42367, 41021, 40473, 40864, 41668, 42615, 43904, 45552, 47035, 47700, 47316, 46221, 45023, 44131, 43528, 43049, 42733, 42714, 42949, 43371, 44120, 45215, 46108, 46170, 45615, 45468, 46470, 48389, 50421, 51931, 52771, 53233, 53718, 54242, 54462, 54381, 54598, 55387, 56038, 55845, 55391, 55914, 57622, 59585, 61187, 62641, 64024, 64949, 65486, 66487, 68503, 71089, 73590, 76007, 78735, 81986, 85802, 90155, 94759, 99196, 103464, 108012, 113125, 118592, 123933, 128495, 131536, 132914, 133697, 135362, 138288, 141659, 144783, 147726, 150598, 153044, 154756, 155841, 156472, 156705, 156724, 156687, 156317, 155246, 153687, 152081, 150176, 147407, 144154, 141583, 140074, 138792, 137077, 135238, 133627, 131957, 130127, 128879, 128947, 130018, 131076, 131363, 130714, 129449, 128218, 127583, 127571, 127961, 128830, 130225, 131550, 132162, 132392, 133016, 133768, 133600, 132473, 131601, 131568, 131473, 130441, 128788, 127085, 125175, 122898, 120817, 119426, 118408, 117367]
53958A17367q11l42l26q13j151j196j282j219n64L49R12J532K899M301M310L086
53942A27052K349K899L801M284M854N975P096P621P746P701P173N921M270K620
53928B01362J097q4o77r05j146j260q99l04M6L43R97J567J345P80J082K361L452
53911B09157L661L445L332L280L276L485L735L788M018M764N260M448K757J566
53897B59972J068J78j320k278k138j767j889k164k328k864l861m496m336m034
53883B27743m172m497m832n551o556o923o270n431n116m887m162l313k956l001
53869A60076l058l090l077k772k311k331k993l601l619l353l155k767j993j330
53855A20626j306j788k334k731k824k541k253k471k893k591j393k78q2o35j405
$$ y = [117367, 116556, 116214, 115888, 115075, 113924, 112728, 111446, 110227, 109663, 110012, 110924, 112456, 115355, 119656, 123966, 127052, 129401, 132300, 136101, 140385, 145239, 151214, 158310, 165931, 173677, 181378, 188551, 194472, 198742, 201362, 202459, 202375, 201698, 200793, 199647, 198387, 197488, 197184, 197230, 197573, 198570, 200137, 201482, 202262, 203344, 205705, 209157, 212818, 216263, 219595, 222875, 226151, 229636, 233371, 237159, 241177, 245941, 251201, 255649, 258406, 259972, 261040, 261218, 259898, 257620, 255482, 253715, 251826, 249662, 247334, 244470, 240609, 236113, 231777, 227743, 223571, 219074, 214242, 208691, 202135, 195212, 188942, 183511, 178395, 173508, 169346, 166033, 163077, 160076, 157018, 153928, 150851, 148079, 145768, 143437, 140444, 136843, 133224, 129871, 126716, 123949, 121956, 120626, 119320, 117532, 115198, 112467, 109643, 107102, 104849, 102378, 99485, 96894, 95501, 95223, 95141, 94506, 93101]
53840I3101k187k719k557j775j094r20r58r82j127j224p90n7R8l62k84Q64J931
53823G8958J611K32q41r43m62K9K31J01l8L54J316K126K122J422O48L20O20J315
53805H9121J763J586J356J865K790K896J856Q56J058K246L430M041M109L855L595
53790A26423L574L605L328K855K600K512K190J748J705K025K110J838J647J589
53776A59749J234O54L43J49n86j670k112j787j721k335k791k579k359k596k690
53761A38903k219j845k100k386k041j455j233j169q97o47n98l48J90K73m53j138
53745A20837r77m14k23k78j43j22o49j253j211o94l84m01m33n05p94j050r47o40
53727A09719m76n70j005j820k456j984l93J162J880K176K457K217J115o9n61o63
$$ y = [93101, 90914, 88195, 85638, 83863, 82769, 81849, 80891, 79909, 78782, 77558, 76768, 76711, 76809, 76447, 76163, 77027, 78958, 80569, 80801, 79960, 79017, 78555, 78584, 78815, 78916, 78878, 79232, 80548, 82674, 84796, 86218, 86866, 87186, 87806, 89121, 90884, 92470, 93826, 95691, 98481, 101377, 103233, 104089, 105147, 107393, 110823, 114864, 118973, 122828, 126423, 129997, 133602, 136930, 139785, 142385, 144897, 147087, 148835, 150540, 152565, 154675, 156513, 158160, 159749, 160983, 161637, 161980, 162129, 161543, 159873, 157761, 155974, 154253, 151918, 149127, 146548, 144189, 141593, 138903, 136684, 134839, 132739, 130353, 128312, 126857, 125624, 124455, 123558, 122911, 122313, 121965, 122155, 122428, 121975, 120837, 119860, 119446, 119223, 118945, 118802, 118680, 118031, 116778, 115567, 114873, 114489, 114088, 113655, 113150, 112356, 111306, 110359, 109719, 109243, 108673, 107668, 105848, 103392, 101408, 101015, 102177, 104057, 106233, 108690, 110907, 112022, 111953, 111392, 110729]
53711A10729p52k01J411K927K945J970J762K775L722L588K837K370K353K413K268
53696A43117J889J424J117R99P94L31k03n67p59p59m79j62k32n35m27J34L51j15
53678A45918m64L5R61J484J485J288R81O86Q33J465J884J582R25M00j41q21j159
53661A57342q51m04l25l77l12m33p27l31J191K820L353K937K459K150J797J657
53645A71946K038K508K510K213J974J541O93k3j33j38n98j091j100j117j734k388
53629A77101k279j809j751j721r76j17l05j154j067L36J694J934J378P14J29k16
53613A71891l6N00Q33Q90J086J451J591J543J763K265K539K404K214K177K178
53598A95289K197K330K455K469K618L040L355L323L387L874M234L944L527L614
$$ y = [110729, 109977, 109776, 111187, 114114, 117059, 119029, 120791, 123566, 127288, 130876, 133713, 136083, 138436, 140849, 143117, 145006, 146430, 147547, 148546, 149340, 149671, 149468, 148901, 148142, 147383, 146904, 146742, 146510, 145975, 145548, 145682, 146033, 145918, 145454, 145489, 146450, 147934, 149419, 150707, 151688, 152374, 153207, 154672, 156556, 158138, 159063, 159463, 159322, 158501, 157342, 156491, 156087, 155762, 155385, 155073, 154640, 153913, 153582, 154773, 157593, 160946, 163883, 166342, 168492, 170289, 171946, 173984, 176492, 179002, 181215, 183189, 184730, 185423, 185400, 185267, 185129, 184531, 183440, 182340, 181223, 179489, 177101, 174822, 173013, 171262, 169541, 168565, 168448, 168143, 166989, 165922, 166258, 167952, 169886, 171264, 171978, 172107, 171891, 171855, 172355, 173188, 174078, 175164, 176615, 178206, 179749, 181512, 183777, 186316, 188720, 190934, 193111, 195289, 197486, 199816, 202271, 204740, 207358, 210398, 213753, 217076, 220463, 224337, 228571, 232515, 236042, 239656]
53584B39656L668K909J920J894K641K884K400K220K629K629J777J063J315J883
53570B71488J741R50L41L30O69R90J189J489K211L250L837L326K098J163R90J274
53554B97336J695K199K684K959L024K908K485J927J916K784L838M217M040L954
53540C37966M055M059M073M224M034L188K504K972M207N000N094N096N033M416
53526C95921L628L688M581N227N283N611O574P265O876N835N055M950N532O658
53512D72684P829Q512Q866R489J0411J1135J1530J1860J1944J1497J1190J2152
53500E99099J4258J6079J6783J6946J7221J7459J7548J7956J8880J9819K0524
53489G92572K1401K2497K3038K2625K2027K2116K2627K2624K1729K0404J9394
$$ y = [239656, 243324, 246233, 248153, 250047, 252688, 255572, 257972, 260192, 262821, 265450, 267227, 268290, 269605, 271488, 273229, 274179, 274520, 274850, 275519, 276509, 277698, 279187, 281398, 284648, 288485, 291811, 293909, 295072, 296062, 297336, 299031, 301230, 303914, 306873, 309897, 312805, 315290, 317217, 319133, 321917, 325755, 329972, 334012, 337966, 342021, 346080, 350153, 354377, 358411, 361599, 364103, 367075, 371282, 376282, 381376, 386472, 391505, 395921, 399549, 403237, 407818, 413045, 418328, 423939, 430513, 437778, 444654, 450489, 455544, 460494, 466026, 472684, 480513, 489025, 497891, 507380, 517791, 528926, 540456, 552316, 564260, 575757, 586947, 599099, 613357, 629436, 646219, 663165, 680386, 697845, 715393, 733349, 752229, 772048, 792572, 813973, 836470, 859508, 882133, 904160, 926276, 948903, 971527, 993256, 1013660, 1033054]
53478A033054J9147J9439J9488J8886J8302J8620J9508J9736J8944J8086J7902
53467A241112J7987J7714J7185J6799J6517J5998J5011J3505J1721J0213R303
53456A403065Q540P345N924M805L771K196J59j853m097p097j0184j1939j2280
53443A388355j2654j3874j5211j5962j6550j7422j8253j8795j9389k0013k0051
53432A200181j9554j9505k0235k0795k0584k0315k0532k0479j9514j8382j7840
53421I82446j7091j4968j1994r791q894q367p338n877m463l462l020k867k318
53408H81996j044M97J754K863M183N572O696P641Q664R689J0639J1885J3790J6106
53394I80931J8261K0033K1493K2660K3636K4851K6660K8902L1054L2683L3665
$$ y = [1033054, 1052201, 1071640, 1091128, 1110014, 1128316, 1146936, 1166444, 1186180, 1205124, 1223210, 1241112, 1259099, 1276813, 1293998, 1310797, 1327314, 1343312, 1358323, 1371828, 1383549, 1393762, 1403065, 1411605, 1418950, 1424874, 1429679, 1433450, 1435646, 1435805, 1433952, 1429855, 1422758, 1412574, 1400635, 1388355, 1375701, 1361827, 1346616, 1330654, 1314104, 1296682, 1278429, 1259634, 1240245, 1220232, 1200181, 1180627, 1161122, 1140887, 1120092, 1099508, 1079193, 1058661, 1038182, 1018668, 1000286, 982446, 965355, 950387, 938393, 928602, 919708, 911341, 904003, 898126, 893663, 890201, 887181, 884314, 881996, 880952, 881449, 883203, 886066, 890249, 895821, 902517, 910158, 918822, 928511, 939150, 951035, 964825, 980931, 999192, 1019225, 1040718, 1063378, 1087014, 1111865, 1138525, 1167427, 1198481, 1231164, 1264829]
53383A264829L4267L5104L6569L8278L9528M0214M0813M1531M2211M2995M4142
53372A700481M5188M5283M4539M3948M3779M3225M1908M0604L9842L8943L7152
53361B164892L4766L2365K9791K6655K3117J9482J5607J1382P050K615k351p778
53349B357593j2729j6580j9764k2878k5900k8759l1660l4269l5685l5935l6355
53338B057079l7697l9003l9280l9092l9278l9331l8413l7093l6443l6164l5242
53327A640043l4007l3847l5020l6192l6202l5092l3344l1212k8948k6812k4820
53316A284547k3008k1706k0892j9755j7765j5598j4123j2983j1365r666r010r428
53304A099248r888j0074j0637j1530j1517r835p243m970l454k524j895j087N18
$$ y = [1264829, 1299096, 1334200, 1370769, 1409047, 1448575, 1488789, 1529602, 1571133, 1613344, 1656339, 1700481, 1745669, 1790952, 1835491, 1879439, 1923218, 1966443, 2008351, 2048955, 2088797, 2127740, 2164892, 2199658, 2232023, 2261814, 2288469, 2311586, 2331068, 2346675, 2358057, 2365107, 2367722, 2365371, 2357593, 2344864, 2328284, 2308520, 2285642, 2259742, 2230983, 2199323, 2165054, 2129369, 2093434, 2057079, 2019382, 1980379, 1941099, 1902007, 1862729, 1823398, 1784985, 1747892, 1711449, 1675285, 1640043, 1606036, 1572189, 1537169, 1500977, 1464775, 1429683, 1396339, 1365127, 1336179, 1309367, 1284547, 1261539, 1239833, 1218941, 1199186, 1181421, 1165823, 1151700, 1138717, 1127352, 1117686, 1108676, 1099248, 1089360, 1079286, 1068649, 1057119, 1045602, 1035767, 1028524, 1023554, 1020100, 1017576, 1015681, 1014594, 1015112]
53291A015112K923N320O965P853Q388Q874R489J0281J1061J1690J2553J4251J6721
53278A141481J9173K1015K2370K3556K4607K5392K5845K5835K5159K3864K2376
53267A400673K1156K0329J9620J8556J6853J4716J2670J0959R423P959O687N396
53255A564997L487Q02j993m329o434q587j0329j1240j1944j3331j5186j6542j7254
53242A452117j8081j9254k0060k0101j9953k0148k0315j9930j9238j8927j9139
53231A236971j9420j9376j9015j8507j8011j7688j7674j7880j7976j7683j7083
53220A036658j6533j6146j5564j4437j3065j2102j1658j1117j0010q607p472o862
53208H93085o759p079p528p693p556p596q119q882r605j0390j1301j1997j2200
$$ y = [1015112, 1018035, 1023355, 1030320, 1038173, 1046561, 1055435, 1064924, 1075205, 1086266, 1097956, 1110509, 1124760, 1141481, 1160654, 1181669, 1204039, 1227595, 1252202, 1277594, 1303439, 1329274, 1354433, 1378297, 1400673, 1421829, 1442158, 1461778, 1480334, 1497187, 1511903, 1524573, 1535532, 1544955, 1552914, 1559601, 1564997, 1568484, 1569286, 1567293, 1562964, 1556530, 1547943, 1537614, 1526374, 1514430, 1501099, 1485913, 1469371, 1452117, 1434036, 1414782, 1394722, 1374621, 1354668, 1334520, 1314205, 1294275, 1275037, 1256110, 1236971, 1217551, 1198175, 1179160, 1160653, 1142642, 1124954, 1107280, 1089400, 1071424, 1053741, 1036658, 1020125, 1003979, 988415, 973978, 960913, 948811, 937153, 926036, 916026, 907419, 899947, 893085, 886326, 879247, 871719, 864026, 856470, 848874, 840755, 831873, 822268, 811878, 800577, 788580, 776380]
53195G76380j2118j2048j1863j1290j0386r516r072r305j0053j0647j0634j0570
53183F48878j1283j2452j2965j2774j3046j4014j4212j2744j0945j0557j1270
53172E12616j1554j1058j0607j0411r882r122r013r736j0310r893q639p232o311
53159C88848o283o897p177o464n307m614m266l519k418j693j448j087n08k80n55
53144C36332q29r37j342k195k973l294l398l612l984m500n159n754o127o500o989
53129B78739p111o440n511n183n291m931l930l102k981l299l741m287m724m639
53115B13569m094l588l273k961k786l087l631l784l447k982k407j546q62j045
53101A74076j772k027j720j760k398k778k428j962j796j399m58K81Q1p02j358
$$ y = [776380, 764262, 752214, 740351, 729061, 718675, 709159, 700087, 690782, 680729, 670082, 659448, 648878, 637595, 625143, 612178, 599404, 586358, 572344, 558132, 545388, 534443, 523886, 512616, 501062, 490004, 479397, 468986, 459104, 449982, 440969, 431233, 420923, 411030, 402391, 395159, 388848, 382565, 375668, 368491, 362027, 356720, 352106, 347840, 344321, 341903, 340210, 338762, 337675, 337167, 336887, 336332, 335503, 334566, 333224, 331029, 328056, 324762, 321364, 317752, 313768, 309268, 304109, 298355, 292228, 285728, 278739, 271628, 265188, 259677, 254494, 249203, 244272, 240342, 237240, 234259, 230960, 227219, 222932, 218208, 213569, 209475, 205887, 202614, 199653, 196867, 193780, 190149, 186365, 182918, 179936, 177529, 175983, 175121, 174076, 172304, 170277, 168557, 166797, 164399, 161621, 159193, 157231, 155435, 154036, 153578, 153859, 153940, 153238, 151880]
53086A51880j847k381k714k542k155j948j723j126l68J5j21m66p33q75j005j253
53070A30638j529j530j257j251j761k060j394l19J3l28j92N73P50j48q76l85N44
53053A19488N99j41o24m91k00n2p3m18j074j503j319r52r50j043o38J99R39J384
53035A13131J516J053m8j017j067m74m1J57N96J117J074N63L81O52O22R7M5J111
53017A19468K411K616J660O08J20j9j7M41J551K825L559L622L429L409L679M111
53001A53473M439M437M227M205M397M172L024J461M55J09m34j583k589k658k065
52986A75070j643j707k086k706l427l724l279k573k247k154j783j341j439j982
52972A42979k178j714j052n64k06k8j77k93J56Q11O59l99j145o51M69J017P50
$$ y = [151880, 150033, 147652, 144938, 142396, 140241, 138293, 136570, 135444, 135076, 135091, 134970, 134504, 133771, 132896, 131891, 130638, 129109, 127579, 126322, 125071, 123310, 121250, 119856, 119537, 119550, 119222, 119030, 119603, 120353, 120205, 119329, 118944, 119488, 120087, 119946, 119322, 118831, 118631, 118579, 118506, 118088, 117014, 115511, 114192, 113240, 112290, 111247, 110609, 110808, 111747, 113131, 114647, 115700, 115652, 114635, 113568, 113094, 113053, 113210, 113806, 114923, 115997, 116560, 116941, 117593, 118215, 118312, 118357, 119468, 121879, 124495, 126155, 126763, 126883, 126864, 126847, 127288, 128839, 131664, 135223, 138845, 142274, 145683, 149362, 153473, 157912, 162349, 166576, 170781, 175178, 179350, 182374, 183835, 184290, 184399, 183965, 182382, 179793, 177135, 175070, 173427, 171720, 169634, 166928, 163501, 159777, 156498, 153925, 151678, 149524, 147741, 146400, 144961, 142979, 140801, 139087, 138035, 137471, 137265, 137237, 137060, 136767, 136923, 137734, 138393, 137994, 136849, 136198, 136667, 137684, 138434]
52955A38434L61L54O37R36J134J271J426J577J479Q80n6q07r73n25L38J217J591
52938A49274J308Q86R11J218J191O90J20k63m02n2Q77J682J495N35j62k26k67
52921A58815n83o46j20N51R57J201J282R27M43P68K037L014K583J174L4k74l7
52904A72126L16M41J17l78l58L30R45R49Q27J259J962K095J474P95P72J484K407
52887A87563K828K469J824J597J789J895J938K487L503M129L970L682L761L653
52873B27088K777J611R53P48M71J15j6j04n45j204j639j828k018k152k041j884
52857B20332j985k228k305k217k107j846j275o41l06l10n47j036j604j725j156
52842A99044l33K08M69O50O76M87K73Mo88j685k061j336m07m40j277j819j579
$$ y = [138434, 138795, 139149, 139786, 140722, 141856, 143127, 144553, 146130, 147609, 148489, 148433, 147626, 146653, 146128, 146466, 147683, 149274, 150582, 151468, 152379, 153597, 154788, 155478, 155598, 155335, 154933, 154881, 155758, 157440, 158935, 159470, 159308, 159082, 158815, 158232, 157586, 157466, 158017, 158974, 160175, 161457, 162384, 162827, 163595, 165632, 168646, 171229, 172403, 172437, 172163, 172126, 172442, 172883, 173000, 172622, 172264, 172594, 173539, 174488, 175315, 176574, 178536, 180631, 182105, 182900, 183672, 185156, 187563, 190391, 192860, 194684, 196281, 198070, 199965, 201903, 204390, 207893, 212022, 215992, 219674, 223435, 227088, 229865, 231476, 232429, 233177, 233648, 233763, 233747, 233643, 233098, 231894, 230255, 228427, 226409, 224257, 222216, 220332, 218347, 216119, 213814, 211597, 209490, 207644, 206369, 205728, 205422, 205112, 204565, 203529, 201925, 200200, 199044, 198711, 198919, 199388, 200038, 200714, 201201, 201474, 201478, 200790, 199105, 197044, 195708, 195301, 194861, 193584, 191765, 190186]
52825A90186r87l66L42R47R12J86n79q75r52j409k374l325l612l152k507k161
52809A70274j906j343q02r94j798k200j672p32J2N06N58l40j900k838k526j938
52793A50361k079k467k211j625j556j850j806j516j429j147j20R03P17k90n54
52778A33331J67L87o81j876j883r71k11N2P7j35p24j418j766j727j614j667j871
52761A17470k036j903j417r39q66j153j416j477j414j305j287j635k258k412j609
52746I4343n52k95p03o86R1P68P80O76J009J365J242J091J664K640K861J900P02
52729A08896M56J264K168K361J950J492J050J92j128k226k470k044j592j454j645
52714A07270k197l006l592l517k913k171j387n68j00l35q97j060p92p85j406k224
$$ y = [190186, 189199, 188833, 189175, 190122, 191034, 191220, 190641, 189766, 188814, 187405, 185031, 181706, 178094, 174942, 172435, 170274, 168368, 167025, 166223, 165229, 163431, 161231, 159559, 158827, 158839, 159345, 159903, 159563, 157663, 154825, 152299, 150361, 148282, 145815, 143604, 141979, 140423, 138573, 136767, 135251, 133822, 132675, 132555, 133458, 134175, 133885, 133331, 133498, 133885, 133204, 131328, 129445, 128474, 128263, 128315, 128392, 128257, 127533, 126115, 124349, 122622, 121008, 119341, 117470, 115434, 113531, 112114, 111175, 110309, 109156, 107740, 106263, 104849, 103544, 102257, 100622, 98364, 95952, 94343, 93791, 93496, 92793, 92107, 92198, 92966, 93746, 94422, 95431, 96796, 98038, 99129, 100793, 103433, 106294, 108194, 108896, 109352, 110616, 112784, 115145, 117095, 118587, 119637, 119829, 118701, 116475, 114005, 111961, 110369, 108915, 107270, 105073, 102067, 98475, 94958, 92045, 89874, 88487, 87919, 87819, 87484, 86587, 85527, 84735, 83950, 82544, 80320]
52698H0320k655k556k083j457r84q67q83n79P8N85N08n3o59r71r96r77j043r60
52680F3768m61J50K18l08o57l06L27O88R18J257J271M77o54j242j208j108j014
52663F2116n65N8K14j09k31Q3K89Lm64p35p92o33j92J99k2p86j273r18p4N89Q14
52642E7571P18N27N28R81J804K626L169L336L011K155J061J38n40j166j773k193
52626G1953k276j884r55O4L09m58j331j326o02P8N17R20J006L95l88m41J34M36
52608F6151K79L25P28Q19L14k24l89l77j91N32J588K040J438L91m18q65q72k10
52590G1059P72J172P73L74M96O62M81L69N92N94M4l44K4M84J74l67P9J473K451
52571H1362K208J434J129J290J214O73K47N33J367K016K102J926J832J628J106
$$ y = [80320, 77665, 75109, 73026, 71569, 70585, 69718, 68835, 68256, 68334, 68919, 69427, 69374, 68715, 67744, 66748, 65771, 64728, 63768, 63307, 63457, 63675, 63367, 62710, 62404, 62731, 63419, 64337, 65594, 66865, 67342, 66688, 65446, 64238, 63130, 62116, 61551, 61609, 61823, 61714, 61483, 61566, 61855, 61858, 61394, 60659, 59867, 59234, 59042, 59241, 59219, 58433, 57160, 56242, 56168, 56757, 57571, 58289, 58816, 59344, 60325, 62129, 64755, 67924, 71260, 74271, 76426, 77487, 77625, 77085, 75919, 74146, 71953, 69677, 67793, 66838, 66902, 67211, 66753, 65422, 64096, 63494, 63572, 64089, 65009, 66015, 66410, 66022, 65581, 65715, 66151, 66430, 66755, 67483, 68302, 68616, 68392, 68003, 67626, 67435, 67967, 69555, 71595, 73033, 73424, 73006, 72141, 71269, 71059, 71831, 73003, 73776, 74150, 74646, 75308, 75789, 76158, 76750, 77344, 77388, 77044, 77068, 77552, 77726, 77359, 77438, 78911, 81362, 83570, 85004, 86133, 87423, 88637, 89310, 89557, 90090, 91457, 93473, 95575, 97501, 99333, 100961, 102067]
52556A02067O64P77J100R39N22Q21K020L069L069K340J675J323J145J144J303
52541A23978J403J350J323J338J168Q89R27J327J564J341R86P45M07j30n46o97
52525A37373q59j046p88k0N64M48n3m92r27j366j318n51L53P85Q60Q86P30K98
52507A34877j0J7p7n69q88n54j33l49q11n93L02J006J101R14O91L44l7k18l28
52488A34685o28q63m58N43J374J417P85Qm01j64N58J179J296J106R66Q15M99L73
52470A43090R13J830K201J579N47NK43P49Q75N65M59J058J916K030J138M4n00
52453A58742n36k64N63J965L104L145K409J939K109K418K432K272K224K390K696
52438A87608K862K512J728J135J037Q39j05j433k284k486k539k607k485k339k630
$$ y = [102067, 102731, 103508, 104608, 105547, 106069, 106890, 108910, 111979, 115048, 117388, 119063, 120386, 121531, 122675, 123978, 125381, 126731, 128054, 129392, 130560, 131449, 132376, 133703, 135267, 136608, 137594, 138339, 138746, 138616, 138070, 137373, 136514, 135468, 134680, 134660, 135224, 135672, 135619, 135127, 134200, 132834, 131516, 130965, 131318, 132103, 132963, 133849, 134579, 134877, 134867, 134884, 134807, 134238, 133350, 132796, 132663, 132314, 131503, 130910, 131212, 132218, 133319, 134233, 134924, 135268, 135231, 135013, 134685, 134057, 133194, 132736, 133279, 134653, 136070, 136855, 136863, 136462, 136298, 136856, 138035, 139331, 140437, 141403, 142218, 142717, 143090, 144003, 145833, 148034, 149613, 150160, 150165, 150408, 151157, 152032, 152597, 153056, 154114, 156030, 158060, 159198, 159242, 158742, 158206, 157942, 158505, 160470, 163574, 166719, 169128, 171067, 173176, 175594, 178026, 180298, 182522, 184912, 187608, 190470, 192982, 194710, 195845, 196882, 197721, 197616, 196183, 193899, 191413, 188874, 186267, 183782, 181443, 178813]
52423A78813l182l271k712k153j983j855j542j499k063k664k521j798j384j669
52409A48517k096j971j257m17K13N50M61k33j259j839j453n75j70n60j135j236
52393A35540q46l74j35k45n83o80q4R88J745J739J246O36o1o62o38R5P85Q03N55
52374A39824P69J372J742J735J700J683J396R50R19J491K073J942J016l1k85O40
52358A58936K126L062L022K669K708K958K898K688K894L426L525K940K382K599
52344A98833L389L888L567K733K039J761J712J824K359L270L763L178K082J629
52330B36027J915J913J240P88J175J716J667J466J786K285K359K425L156M030
52316B63948M029L363L216L798M103L652L232L533M157M399M250M133M313M890
$$ y = [178813, 175631, 172360, 169648, 167495, 165512, 163657, 162115, 160616, 158553, 155889, 153368, 151570, 150186, 148517, 146421, 144450, 143193, 142776, 142989, 143539, 144000, 143767, 142508, 140669, 139216, 138641, 138471, 137911, 136776, 135540, 134694, 134320, 134185, 133940, 133357, 132677, 132593, 133581, 135326, 137065, 138311, 138947, 138886, 138224, 137586, 137681, 138466, 139269, 139824, 140593, 141965, 143707, 145442, 147142, 148825, 150221, 151171, 152090, 153581, 155654, 157596, 158612, 158581, 158296, 158936, 161062, 164124, 167146, 169815, 172523, 175481, 178379, 181067, 183961, 187387, 190912, 193852, 196234, 198833, 202222, 206110, 209677, 212410, 214449, 216210, 217922, 219746, 222105, 225375, 229138, 232316, 234398, 236027, 237942, 239855, 241095, 241883, 243058, 244774, 246441, 247907, 249693, 251978, 254337, 256762, 259918, 263948, 267977, 271340, 274556, 278354, 282457, 286109, 289341, 292874, 297031, 301430, 305680, 309813, 314126, 319016]
52302C19016N879O998P817Q219Q404Q494Q547Q857R546J0064R810R210R347J0435
52288D40643J1494J1755J1628J1924J2822J3892J4629J4686J4068J3330J3146
52277E84017J3502J3726J3392J2757J2209J1822J1539J1357J1117J0610R975R551
52265G25574R269Q730P920P236O729N904M560L238K570K594K892K995K576J677
52251G94464Q40O09Q13Q66O88P05R08P03l4n75l37L59R28J334J787K200K515L035
52233H11808L924M713M967N170O291Q413J0368J0969J0318R620R769J0404J0603
52220I17337J0273J0216J0753J1008J0107Q505P295O611N764M687M020L730K930
52207A013236J458L99L72L69p33k419l412l692m394n832o941o876o169n857o107
$$ y = [319016, 324895, 331893, 339710, 347929, 356333, 364827, 373374, 382231, 391777, 401841, 411651, 420861, 430208, 440643, 452137, 463892, 475520, 487444, 500266, 514158, 528787, 543473, 557541, 570871, 584017, 597519, 611245, 624637, 637394, 649603, 661425, 672964, 684321, 695438, 706048, 716023, 725574, 734843, 743573, 751493, 758729, 765458, 771362, 775922, 779160, 781730, 784324, 787216, 790211, 792787, 794464, 795304, 795913, 796726, 797592, 798280, 798985, 799893, 800596, 800562, 799987, 799650, 800009, 800937, 802271, 804058, 806258, 808773, 811808, 815732, 820445, 825412, 830582, 836873, 845286, 855654, 866623, 876941, 886561, 896330, 906734, 917337, 927610, 937826, 948579, 959587, 969694, 978199, 985494, 992105, 997869, 1002556, 1006576, 1010306, 1013236, 1014694, 1015093, 1015465, 1015834, 1015101, 1012682, 1009270, 1005578, 1001184, 995352, 988411, 981535, 975366, 969509, 963402]
52192I63402o329o233o186o537p043p142o641n915n371m931m207l137k197j879
52178H89654k204k793l313l652l820l782l446k837k246k057k265k350j862r88
52164H52039l45l26q89j834k932l853m372m627m859m958m618l921l366l266l503
52149H04370l902m485n168n576n362m574l692l316l699m422m734m456m268m743
52135G41973n388n242m256l371l265l617l804l702l546l408l202k943k814l023
52121F90392l611m246m348l659k594j832j678k063k793l480l543k791j677o49
52107F51428L71J371J761J310R70J712K992L555L520M187N817P132P336P230P731
52092G08423Q609R374J0287J1608J2753J3198J3491J4421J5721J6449J6373J6178
$$ y = [963402, 957073, 950840, 944654, 938117, 931074, 923932, 917291, 911376, 906005, 901074, 896867, 893730, 891533, 889654, 887450, 884657, 881344, 877692, 873872, 870090, 866644, 863807, 861561, 859504, 857239, 854889, 853027, 852039, 851694, 851368, 850479, 848645, 845713, 841860, 837488, 832861, 828002, 823044, 818426, 814505, 811139, 807873, 804370, 800468, 795983, 790815, 785239, 779877, 775303, 771611, 768295, 764596, 760174, 755440, 750984, 746716, 741973, 736585, 731343, 727087, 723716, 720451, 716834, 713030, 709328, 705782, 702374, 699172, 696229, 693415, 690392, 686781, 682535, 678187, 674528, 671934, 670102, 668424, 666361, 663568, 660088, 656545, 653754, 652077, 651428, 651799, 653170, 654931, 656241, 657211, 658923, 661915, 665470, 668990, 673177, 678994, 686126, 693462, 700692, 708423, 717032, 726406, 736693, 748301, 761054, 774252, 787743, 802164, 817885, 834334, 850707, 866885]
52080H66885J6541J7464J8374J8465J7341J5571J4187J3442J2717J1783J1263
52069A034033J1331J0977R387P315O129O031O065N481M231K504O29q18j597k308
52055A099390l618n273o480p032p232p144o664o210o356o849o758n811m828m674
52041A014461n280n902n866n000l673k587k195k273k227j717q11K47J154J644
52027I79975J805K105K752L337L428L166K909K605K112J788K099K796L156L005
52013A017038K858L016L044K333Q27r11k145k558k582l008m112n449o727q334
51999I93290j0494j2476j3418j3631j4234j5662j7306j8612j9657k0534k1037
51988H16229k1197k1446k1873k1960k1396k0676k0416k0503k0388j9944j9568
$$ y = [866885, 883426, 900890, 919264, 937729, 955070, 970641, 984828, 998270, 1010987, 1022770, 1034033, 1045364, 1056341, 1065728, 1073043, 1079172, 1085203, 1091268, 1096749, 1100980, 1103484, 1104113, 1103295, 1101698, 1099390, 1095772, 1090499, 1084019, 1076987, 1069755, 1062611, 1055947, 1049737, 1043381, 1036532, 1029774, 1023963, 1019135, 1014461, 1009181, 1003279, 997413, 992413, 988740, 986153, 983958, 981685, 979458, 977741, 976930, 977177, 978331, 979975, 981780, 983885, 986637, 989974, 993402, 996568, 999477, 1002082, 1004194, 1005982, 1008081, 1010877, 1014033, 1017038, 1019896, 1022912, 1025956, 1028289, 1029116, 1028205, 1026060, 1023502, 1020920, 1017912, 1013800, 1008351, 1001624, 993290, 982796, 970320, 956902, 943271, 929037, 913375, 896069, 877457, 857800, 837266, 816229, 795032, 773586, 751713, 729753, 708357, 687681, 667265, 646762, 626374, 606430, 586862]
51977E86862j9543j9675j9481j8573j6918j4977j3486j2876j2852j2722j2098
51966D13661j1161j0227r272q107o903o213o334o863p159p027o674o201n519m740
51952C11261m058l335k426j897k595m215n143m299k566j632j946k617k910k935
51938B68687k932k849k724k790k933k662j837r60n21m86o41j034j689k248k270
51923B40111j785j242r63q14m76J42P94J170J167R64Q92J296K215L061K880J376
51907B50788n10j507j531j644k464l368l553l231l153l471l729l684l522l360
51893B12061l128k851k665k554k400k163j837j399r97r18j168j372j349j351j378
51878A84531r51M4P90N60k05n41k97l7Q2L07M36l7q42r60k8J061J279N88k17l40
$$ y = [586862, 567319, 547644, 528163, 509590, 492672, 477695, 464209, 451333, 438481, 425759, 413661, 402500, 392273, 383001, 374894, 367991, 361778, 355444, 348581, 341422, 334395, 327721, 321520, 316001, 311261, 307203, 303868, 301442, 299545, 296950, 292735, 287592, 283293, 280727, 279095, 277149, 274532, 271622, 268687, 265755, 262906, 260182, 257392, 254459, 251797, 249960, 249000, 248479, 247993, 247352, 246318, 244629, 242381, 240111, 238326, 237084, 236121, 235307, 234831, 234973, 235767, 236937, 238104, 239068, 239960, 241256, 243471, 246532, 249412, 250788, 250278, 248771, 247240, 245596, 243132, 239764, 236211, 232980, 229827, 226356, 222627, 218943, 215421, 212061, 208933, 206082, 203417, 200863, 198463, 196300, 194463, 193064, 192067, 191149, 189981, 188609, 187260, 185909, 184531, 183580, 183624, 184414, 184974, 184769, 184228, 183931, 183894, 183976, 184283, 184719, 184682, 183840, 182880, 182852, 183913, 185192, 185780, 185563, 185223]
51858A85223N05J853K617K037O31l46m30k93m45m91j5N69P04O07Q12J187J200
51841A95925R20R39J323J347O24j24J09J308K489K977L096L451L971M144L869
51826B26368L496L097K332J215M13M45R34J088O14k13j090j927k675l216l416
51811B27465l174k607k177k259k487k151j316q56j092j186m56N15Q75Q73J305
51796B11272K049K304J979J789K035K289K262K137J945J517J067R98J113P62j07
51781B35411q60j232j563j865j612p60j30l35j006j500j745j955k011j632q22
51766B16383Q9O55N09j73n04K01J362J767J228P92J094J554J566J508J902K374
51750B32307K282J846J811K299K654K300J343M18K24R34J917K337K156K096K511
$$ y = [185223, 185728, 187581, 190198, 192235, 192866, 192520, 192090, 191797, 191352, 190861, 190846, 191415, 192119, 192726, 193538, 194725, 195925, 196845, 197784, 199107, 200454, 201078, 200954, 201063, 202371, 204860, 207837, 210933, 214384, 218355, 222499, 226368, 229864, 232961, 235293, 236508, 236921, 237366, 238300, 239388, 240002, 239789, 238699, 236772, 234097, 230881, 227465, 224291, 221684, 219507, 217248, 214761, 212610, 211294, 210438, 209346, 208160, 207704, 208219, 209094, 209967, 211272, 213321, 215625, 217604, 219393, 221428, 223717, 225979, 228116, 230061, 231578, 232645, 233643, 234756, 235518, 235411, 234551, 233319, 231756, 229891, 228279, 227519, 227389, 227054, 226048, 224548, 222803, 220848, 218837, 217205, 216383, 216472, 217127, 217636, 217463, 216959, 217160, 218522, 220289, 221517, 222309, 223403, 224957, 226523, 228031, 229933, 232307, 234589, 236435, 238246, 240545, 243199, 245499, 246842, 247260, 247484, 248418, 250335, 252672, 254828, 256924, 259435]
51735B59435K937K990K982L218L404L258L154L516M132M682N402O571P712Q125
51721C21518P833P340O663N438L802K355J247k8j769l463m269l844k688j853k113
51706C36169l152l777l227k044j355j598k346l086l573l681l440l208l304l546
51692B94832l611l634l944m360m385m012l662l370k743j838j336j523j745j291
51678B53378l82K02N9o97j904l316m316m303l428k466j877j357n16M52J040J159
51662B31728J125J086Q32K83j35J45J254K813M252N106N194M770M440M683N427
51647B73003O269O988P669Q248Q362P723O495N156M002K924J627qj784l409m743
51632C28522n751o396o763p220q046q846q882q125p479p541p698o991n508m151
$$ y = [259435, 262372, 265362, 268344, 271562, 274966, 278224, 281378, 284894, 289026, 293708, 299110, 305681, 313393, 321518, 329351, 336691, 343354, 348792, 352594, 354949, 356196, 356168, 354399, 350936, 346667, 342823, 340135, 338282, 336169, 333017, 329240, 326013, 323969, 322614, 321016, 318670, 315584, 312011, 308330, 304890, 301682, 298378, 294832, 291221, 287587, 283643, 279283, 274898, 270886, 267224, 263854, 261111, 259273, 257937, 256414, 254669, 253378, 252996, 253198, 253257, 252560, 250656, 247340, 243024, 238721, 235293, 232827, 230950, 229593, 229077, 229529, 230569, 231728, 232853, 233939, 234771, 235054, 234919, 235064, 236318, 239131, 243383, 248489, 253683, 258453, 262893, 267576, 273003, 279272, 286260, 293929, 302177, 310539, 318262, 324757, 329913, 333915, 336839, 338466, 338458, 336674, 333265, 328522, 322771, 316375, 309612, 302392, 294346, 285500, 276618, 268493, 261014, 253473, 245775, 238784, 233276, 229125]
51618B29125l383k933k701l018l844m487m358l561k515j515q52p85j169j538j771
51603A90695k126k568k662k311j936j668j018J55J087J078M41j16n24r65j003
51588A76559o9J359K069J729J262J406J765J673J383J598K228K466K082J879K516
51573B01905L440L615L044K862L858N517O873P703Q419R169R729J0101J0546J1005
51559B97786J1011J0382R494Q782Q187P267N603L203O52j239k283l242m837o720
51545C44046p908q021p426o413n015l619k841k618k173j062L95J833L277M710
51531C07165N975P261Q877J0424J1050J0790J0604J0834J0685R762Q920Q802Q574
51518D29723P082M528K088L86p23j445j992k725l538l707l065k679l381m335m182
$$ y = [229125, 225742, 222809, 220108, 217090, 213246, 208759, 204401, 200840, 198325, 196810, 195958, 195173, 194004, 192466, 190695, 188569, 186001, 183339, 181028, 179092, 177424, 176406, 176561, 177648, 178726, 179167, 179051, 178527, 177562, 176559, 176490, 177849, 179918, 181647, 182909, 184315, 186080, 187753, 189136, 190734, 192962, 195428, 197510, 199389, 201905, 205345, 208960, 212004, 214866, 218724, 224241, 231114, 238817, 247236, 256405, 266134, 276235, 286781, 297786, 308797, 319179, 328673, 337455, 345642, 352909, 358512, 361715, 362367, 361128, 358845, 355603, 350766, 344046, 336138, 328117, 320691, 314278, 309263, 305644, 302803, 300185, 298012, 296950, 297345, 299178, 302455, 307165, 313140, 320401, 329278, 339702, 350752, 361542, 372146, 382980, 393665, 403427, 412347, 421149, 429723, 436805, 441333, 443421, 443807, 443084, 441639, 439647, 436922, 433384, 429677, 426612, 423933, 420552, 416217, 412035]
51503D12035l013j922j149rJ508K540K787K823K797K091N43j041k023k712l599
51488D11656m685n820o891p478p104o141n685o109o581o374n814n496n296m833
51474C27349m248l790l183k130j067o26n72o8J050J964J978J390R63R71J178J507
51458C22666K255L432M322M167L217K571K867L625M175M661N537O590P211P512
51444C84808Q229R429J0146R671Q518P744P695P894P754P015N747M307L138K295
51430D84390J324r4j578k403k438k305k585l125l314k844j912p84M79J674K243
51415D66728J827Q85K69J31k16j225k531l641m666n909p159q012q496q943r407
51400D09635r708r819r757r381q752q340q305q054p105o089n928o309n949m384
$$ y = [412035, 409022, 407100, 405951, 405942, 407450, 409990, 412777, 415600, 418397, 420488, 421031, 419990, 417967, 415255, 411656, 406971, 401151, 394260, 386782, 379678, 373537, 367852, 361743, 355162, 348788, 342974, 337478, 332182, 327349, 323101, 319311, 316128, 313998, 312931, 312305, 311733, 311665, 312715, 314679, 316657, 318047, 319010, 319981, 321159, 322666, 324921, 328353, 332675, 336842, 340059, 342630, 345497, 349122, 353297, 357958, 363495, 370085, 377296, 384808, 393037, 402466, 412612, 422283, 430801, 438545, 446240, 454134, 461888, 468903, 474650, 478957, 482095, 484390, 485714, 485620, 484042, 481639, 479201, 476896, 474311, 471186, 467872, 465028, 463116, 462332, 462811, 464485, 466728, 468555, 469440, 469709, 469840, 469624, 468399, 465868, 462227, 457561, 451652, 444493, 436481, 427985, 419042, 409635, 399927, 390108, 380351, 370970, 362218, 353878, 345573, 337519, 330414, 324325, 318397, 312088, 306139, 301755]
51386C01755k582j559j298j221r96m72M17J473K407L380M748O126O619O225O085
51371C31107O766P199O114L867J789K04j827m819p971j0228j1485j2259j2665
51358B95792j2321j1133r713q866q805r061r060q609p837o866n771m731l974l593
51344A85452l517l590l562l189k576k206k331k511k143j318p16o88q86q75o68
51329A54676n36o20q24r21p11l28j98m50n38P2J029J546J568J738K142J970P88
51312A60403n64q90l9J102J669J538J216J408K438L846M763M895M894N521O747
51297A98947P877Q388Q353Q273Q698R757J0937J1451J0931R627P887N873L780
51284C10779J876J41j719l699n358o491p459q551r442r685r373q996q875r095
$$ y = [301755, 299173, 297614, 296316, 295095, 294099, 293627, 294044, 295517, 297924, 301304, 306052, 312178, 318797, 325022, 331107, 337873, 345072, 351186, 355053, 356842, 357046, 355219, 350400, 342429, 332201, 320716, 308457, 295792, 283471, 272338, 262625, 253759, 244954, 235893, 226833, 218224, 210387, 203521, 197750, 193019, 189045, 185452, 181935, 178345, 174783, 171594, 169018, 166812, 164481, 161970, 159827, 158509, 157793, 157105, 156219, 155344, 154676, 154140, 153520, 152696, 151775, 151064, 150736, 150538, 150088, 149550, 149622, 150651, 152197, 153765, 155503, 157645, 159615, 160403, 159839, 158949, 158910, 160012, 161681, 163219, 164435, 165843, 168281, 172127, 176890, 181785, 186679, 192200, 198947, 206824, 215212, 223565, 231838, 240536, 250293, 261230, 272681, 283612, 293239, 301126, 306999, 310779, 312655, 312796, 311077, 307378, 302020, 295529, 288070, 279519, 270077, 260392, 251019, 242023, 233148, 224053]
51270B24053r569r828r176p499n709m878n065n446n391m948m388l788l179k726
51256A42463k577k666k755k608k196j742j472j247p12J44P95P65J66m50o28k74
51240A25006L82R45J173J245J484J861K067K055K007J792J149N35R24K307L199
51225A48131K436P71k13k18k45p76j218j170j096j376j694j793k010k410k215
51210A34904q88P61J392Q49J14k82q16j778k465k158j252o31m02N3Q34J265R83
51193A30483N32M62N34K72j91m17m43n26m63P4O51L58q67k029k376k217k091j874
51175A19872j263n91m90r38j230q49K8Q22J025N24l08q78r21o93n30m76m56m97
51157A12151n45l71O6M44N47O32J056J753K443L053L506L406K441J017j8k94k09
$$ y = [224053, 214484, 204656, 195480, 187981, 182272, 177394, 172329, 166883, 161492, 156544, 152156, 148368, 145189, 142463, 139886, 137220, 134465, 131857, 129661, 127919, 126447, 125200, 124488, 124632, 125427, 126192, 126358, 125908, 125280, 125006, 125388, 126333, 127506, 128751, 130235, 132096, 134163, 136218, 138225, 140017, 141166, 141701, 142625, 144932, 148131, 150567, 151338, 151125, 150907, 150662, 149886, 148668, 147498, 146402, 145026, 143332, 141539, 139529, 137119, 134904, 134016, 134777, 136169, 137018, 137132, 136850, 136034, 134256, 131791, 129633, 128381, 127750, 127348, 127401, 128235, 129500, 130483, 131015, 131477, 132011, 132283, 132092, 131675, 131232, 130706, 130243, 130317, 130968, 131326, 130459, 128430, 126054, 123837, 121746, 119872, 118609, 118018, 117528, 116590, 115360, 114511, 114539, 115361, 116386, 116910, 116602, 115724, 114803, 114110, 113580, 113104, 112648, 112151, 111606, 111235, 111301, 111745, 112292, 112924, 113980, 115733, 118176, 121229, 124735, 128141, 130582, 131599, 131581, 131287, 131078]
51140A31078l42q97j655k143j911j037l61o97j795k477k012r51l98p13j249j214
51124A11226m91L57P14M55M8J12P89J515J570R07L00M44J100J484J465J784K852
51107A26631L933M131L690L549L822L720K964K313K274K202J305r2j073j440j754
51092A56175k238k403j865r88m98p46j402j761j391o50l61q83j658j918j533r56
51076A34924n93n39p13r15q46l54L94J130J622J527N81p90j555j200m06j08k57
51059A31902j30M22O95J48r28j820k021j448m60K76K91j89m92j99N74J431K002
51042A30054K148K083K148K281J994J180N03N37R11R46P27Q81J513K209K842L557
51026A56514M013L654K832K680L524M339M225L559L081K592J470j9q70o79j14
$$ y = [131078, 130736, 129839, 128184, 126041, 124130, 123093, 122732, 122035, 120240, 117763, 115751, 114800, 114402, 113689, 112440, 111226, 110735, 111092, 111806, 112261, 112309, 112421, 113210, 114725, 116295, 117202, 117502, 117946, 119046, 120530, 121995, 123779, 126631, 130564, 134695, 138385, 141934, 145756, 149476, 152440, 154753, 157027, 159229, 160534, 160442, 159369, 157929, 156175, 153937, 151534, 149669, 148681, 148183, 147437, 146035, 144274, 142883, 142233, 141872, 140989, 139331, 137413, 135880, 134924, 134331, 133792, 133079, 132164, 131318, 130964, 131358, 132488, 134110, 135637, 136218, 135428, 133873, 132673, 132267, 132159, 131902, 131772, 132194, 132889, 133037, 132109, 130289, 128268, 126820, 126360, 126636, 126927, 126738, 126246, 126047, 126621, 128052, 130054, 132202, 134285, 136433, 138714, 140708, 141888, 142391, 142928, 143839, 144785, 145512, 146393, 147906, 150115, 152957, 156514, 160527, 164181, 167013, 169693, 173217, 177556, 181781, 185340, 188421, 191013, 192483, 192464, 191594, 190915, 190801]
51011A90801O1j75l58k21P6J53j90o33n28L10J204J391J148J546K961M360M598
50994B06504L871L342L499L741L683L976N303P202Q629R327R839J0371J0581J0508
50980C00376J0802J1760J2956J4185J5920J8334K0724K2610K4734K8065L2267
50969E12733L6085L8950M1308M3645M6103M8805N1617N3552N3516N1753M9659
50958A027726M7926M5827M2549L8332L3825K9221K4556K0210J6395J2663Q606
50947A347836M618J435p41k052k359j509n0J080J528J603J382L96j713m729q332
50932A338393j2607j7604k2744k7147l0592l3838l7714m2080m5951m8567n0084
50921I69465n1032n1429n0733m8624m5489m2094l8917l5924l2841k9583k6383
$$ y = [190801, 190862, 190687, 190329, 190108, 190184, 190337, 190147, 189514, 188986, 189296, 190500, 191891, 193039, 194585, 197546, 201906, 206504, 210375, 213717, 217216, 220957, 224640, 228616, 233919, 241121, 249750, 259077, 268916, 279287, 289868, 300376, 311178, 322938, 335894, 350079, 365999, 384333, 405057, 427667, 452401, 480466, 512733, 548818, 587768, 629076, 672721, 718824, 767629, 819246, 872798, 926314, 978067, 1027726, 1075652, 1121479, 1164028, 1202360, 1236185, 1265406, 1289962, 1310172, 1326567, 1339230, 1347836, 1352454, 1353889, 1353148, 1351096, 1348737, 1347228, 1347178, 1348258, 1349786, 1351389, 1352771, 1353167, 1351454, 1346725, 1338393, 1325786, 1308182, 1285438, 1258291, 1227699, 1193861, 1156147, 1114067, 1068116, 1019549, 969465, 918433, 867004, 816271, 767647, 722158, 680064, 641147, 605223, 572382, 542799, 516416]
50910E16416k3490k0831j8175j5620j3602j2233j1006r497q026p142o692n939
50898C64163m589l135k112j494r51k99M18J047J392J428J391J484J610J716K145
50883C64214L162M246M594M265M161M715N392N712O087P130Q717J0213J1299J2101
50869D56008J2804J3538J4477J5684J7010J8387K0054K2330K5362K9185L3713
50858F78552L8555M3209M7646N2368N7724O3696P0366P7981Q6206R3910J00326
50847A410539J05915J11490J16803J20593J21827J20270J16086J09393J00276
50838B433192Q8805P5178O0156M5087L1153J8688P608j813r053j3892j6308j6061
50826B702740j3046p961k085L603Q608J2320J3930J2928R151K299p858k0647l4489
$$ y = [516416, 492926, 472095, 453920, 438300, 424698, 412465, 401459, 391962, 383936, 376794, 370102, 364163, 359574, 356439, 354327, 352833, 351882, 351583, 352001, 353048, 354440, 355868, 357259, 358743, 360353, 362069, 364214, 367376, 371622, 376216, 380481, 384642, 389357, 394749, 400461, 406548, 413678, 422395, 432608, 443907, 456008, 468812, 482350, 496827, 512511, 529521, 547908, 567962, 590292, 615654, 644839, 678552, 717107, 760316, 807962, 860330, 918054, 981750, 1052116, 1130097, 1216303, 1310213, 1410539, 1516454, 1627944, 1744747, 1865340, 1987167, 2107437, 2223523, 2332916, 2433192, 2521997, 2597175, 2657331, 2702418, 2733571, 2752259, 2759867, 2758054, 2749001, 2735109, 2718801, 2702740, 2689694, 2681733, 2679648, 2683251, 2691859, 2704179, 2718109, 2731037, 2740188, 2742487, 2734629, 2713982, 2679493]
50813B679493m8086o1191p4052q6519r7948j07522j14501j18481j19766j19069
50803A732358j16713j12466j06363r9094r1309q3069p4510o6479n9779n4012m8056
50792H20508m1637l5666l0852k6778k2730j8853j5876j3998j2633j1141r311p219
50780E73814n112l525l003l414l949m024l846l825l805l360k643k307k523k675
50766E25803k192j270n44l71p17j308j610r42Q70L133M987O354P764R426J1008
50751E60391J2360J3825J5575J7192J8345J9477K1275K3623K5735K7325K9081
50740G84204L1757L5248L9011M3030M7776N3308N8997O4264O9156P3891P8282
50729A378924Q1917Q4552Q5890Q5140Q1513P5176O7161N8153M7823L5641K1986
$$ y = [2679493, 2631407, 2570216, 2496164, 2409645, 2311697, 2204175, 2089674, 1971193, 1851427, 1732358, 1615645, 1503179, 1396816, 1297722, 1206413, 1123344, 1048834, 982355, 922576, 868564, 820508, 778871, 743205, 712353, 685575, 662845, 643992, 628116, 614118, 601485, 590344, 581033, 573814, 568702, 565177, 562174, 558760, 554811, 550787, 546941, 543116, 539311, 535951, 533308, 531001, 528478, 525803, 523611, 522341, 521797, 521426, 520709, 519401, 517791, 516849, 517719, 520852, 525839, 532193, 539957, 549383, 560391, 572751, 586576, 602151, 619343, 637688, 657165, 678440, 702063, 727798, 755123, 784204, 815961, 851209, 890220, 933250, 981026, 1034334, 1093331, 1157595, 1226751, 1300642, 1378924, 1460841, 1545393, 1631283, 1716423, 1797936, 1873112, 1940273, 1998426, 2046249, 2081890, 2103876]
50718B103876Q098m828j6100k5286l2022l6142l7695l6752l3482k8473k2789j7476
50706A820929j2969r116n708k964j539k141n178j0673j8334k7633l7811m7964
50694A638899n7185o4670o9848p2581p3219p2370p0478o7647o3856n9253n4190
50683I13602m9068m4133l9378l4660k9985k5625k1893j8790j5968j3024r834o645
50671F04599l870j701P3J738L199M192M932O039P551Q553Q385P749P908R040J0212
50656F78599J0900J1614J2808J4125J5145J6139J7498J9067K0613K2488K5156
50645H64152K8419L1737L5024L8469M1799M4486M6555M8556N0712N2615N3839
50634A336363N4291N3894N2440M9926M6574M2461L7501L1951K6494K1583J7114
$$ y = [2103876, 2111974, 2107146, 2091046, 2065760, 2033738, 1997596, 1959901, 1923149, 1889667, 1861194, 1838405, 1820929, 1807960, 1798844, 1793136, 1790172, 1788633, 1786492, 1781314, 1770641, 1752307, 1724674, 1686863, 1638899, 1581714, 1517044, 1447196, 1374615, 1301396, 1229026, 1158548, 1090901, 1027045, 967792, 913602, 864534, 820401, 781023, 746363, 716378, 690753, 668860, 650070, 634102, 621078, 611244, 604599, 600729, 599028, 599101, 600839, 604038, 608230, 613162, 619201, 626752, 635305, 643690, 651439, 659347, 668387, 678599, 689499, 701113, 713921, 728046, 743191, 759330, 776828, 795895, 816508, 838996, 864152, 892571, 924308, 959332, 997801, 1039600, 1084086, 1130641, 1179197, 1229909, 1282524, 1336363, 1390654, 1444548, 1496988, 1546914, 1593488, 1635949, 1673450, 1705401, 1731895, 1753478, 1770592]
50623A770592J2936R361O822N323M514M113M082M503N599P666J0642J3707J5589
50610A875449J5453J3549J1014Q999P815O736M778J680k001n843j0332j6337k3916
50597A887044l2023l9514m6097n2057n7358o1466o3997o5189o5537o5261o4235
50586A274310o2284n9371n5657n1525m7395m3400l9413l5456l1835k8636k5388
50575G93950k1629j7564j3810j0609p732n052k648m37J747L655M885N755P284
50562G37795R955J3062J5648J7596J9344K1003K2312K3236K4019K4835K5718K6670
50550I81193K7519K7914K7831K7733K7866K7683K6563K4744K2959K1389J9766
50539A263160J8429J8340J9833K2023K3831K5141K6654K9012L2436L6928M2417
$$ y = [1770592, 1783528, 1792889, 1799711, 1805034, 1809548, 1813661, 1817743, 1822246, 1827845, 1835511, 1846153, 1859860, 1875449, 1890902, 1904451, 1915465, 1924464, 1932279, 1939015, 1943793, 1945473, 1943472, 1937629, 1927297, 1910960, 1887044, 1855021, 1815507, 1769410, 1717353, 1659995, 1598529, 1534532, 1469343, 1403806, 1338545, 1274310, 1212026, 1152655, 1096998, 1045473, 998078, 954678, 915265, 879809, 847974, 819338, 793950, 772321, 754757, 740947, 730338, 722606, 717554, 714906, 714469, 716216, 719871, 724756, 730511, 737795, 747750, 760812, 776460, 794056, 813400, 834403, 856715, 879951, 903970, 928805, 954523, 981193, 1008712, 1036626, 1064457, 1092190, 1120056, 1147739, 1174302, 1199046, 1222005, 1243394, 1263160, 1281589, 1299929, 1319762, 1341785, 1365616, 1390757, 1417411, 1446423, 1478859, 1515787, 1558204]
50528A558204M8769N5774O3073P0089P6304Q1607Q6137Q9740R2019R2857R2515
50517B407088R0914Q7360Q1248P2800O2703N1350L8740K4965J0362m725j9936
50506B902869l4664m8091n9594o8911p5901q0269q1650p9887p5184o8020n8938
50495B171760m8384l6801k4714j2724j302R190J8354K5780L1224L4511L5264L2953
50483B235111K7346J8588O809p877k4650m1645n6892o9553p9851q7886r3137r5185
50471A731178r4383r1458q6945q1316p5297o9519o3950n8071n1636m4956l8526
50460I75121l2692k7663k3454j9756j6115j2394q869n752k898n3K875N866Q906
50447H43122J1912J4812J7677K0548K3047K4626K5402K6258K7808K9675L1217
$$ y = [1558204, 1606973, 1662747, 1725820, 1795909, 1872213, 1953820, 2039957, 2129697, 2221716, 2314573, 2407088, 2498002, 2585362, 2666610, 2739410, 2802113, 2853463, 2892203, 2917168, 2927530, 2922805, 2902869, 2868205, 2820114, 2760520, 2691609, 2615708, 2535439, 2453789, 2373902, 2298718, 2230698, 2171760, 2123376, 2086575, 2061861, 2049137, 2047835, 2057025, 2075379, 2101159, 2132383, 2166894, 2202158, 2235111, 2262457, 2281045, 2287854, 2279977, 2255327, 2213682, 2156790, 2087237, 2007386, 1919500, 1826363, 1731178, 1636795, 1545337, 1458392, 1377076, 1301779, 1232260, 1168310, 1110239, 1058603, 1013647, 975121, 942429, 914766, 891312, 871556, 855441, 843047, 834178, 828426, 825528, 825475, 828350, 834216, 843122, 855034, 869846, 887523, 908071, 931118, 955744, 981146, 1007404, 1035212, 1064887, 1096104]
50436A096104L2484L3887L5256L5922L5652L4806L3585L1846K9604K7138K4431
50425A450715K1144J7329J3509R928O381L017O76j86l19p48j364j047R02M027
50411A523964P401J0593J3779J7235K0871K4263K7021K9012L0137L0033K8370
50400A762679K5425K1925J8156J3591P544Lq375j6861k5158l3487m2169n0838
50388A672435n8232o3150o5559o6181o5218o2292n7671n2478m7358m1778l5175
50377A057343k7912k0539j3002n306J882Q084J3680J8782K2267K3149K2237K0958
50365A121623J8899J4203O491k120r348j4887j9729k4366k8333l0935l1800l1151
50353I68547k9869k8751k7637k5802k3301k1143j9920j9052j7765j6046j4226
$$ y = [1096104, 1128588, 1162475, 1197731, 1233653, 1269305, 1304111, 1337696, 1369542, 1399146, 1426284, 1450715, 1471859, 1489188, 1502697, 1512625, 1519006, 1522023, 1522699, 1522513, 1522194, 1521446, 1520082, 1519035, 1519937, 1523964, 1531365, 1541958, 1555737, 1572972, 1593843, 1618106, 1645127, 1674139, 1704276, 1734309, 1762679, 1788104, 1810029, 1828185, 1841776, 1849320, 1849323, 1840948, 1824087, 1798929, 1765442, 1723273, 1672435, 1614203, 1551053, 1485494, 1419313, 1354095, 1291803, 1234132, 1181654, 1134296, 1092518, 1057343, 1029431, 1008892, 995890, 990584, 992466, 1000550, 1014230, 1033012, 1055279, 1078428, 1100665, 1121623, 1140522, 1154725, 1161216, 1159096, 1149748, 1134861, 1115132, 1090766, 1062433, 1031498, 999698, 968547, 938678, 909927, 882290, 856488, 833187, 812044, 792124, 773072, 755307, 739261, 725035]
50342G25035j2313j0331q719p721o825n375l429j600k67O68J524K721M547O728
50328F84643Q513R578J0472J1791J3340J4552J5416J6395J7621J8756J9606K0332
50316H61015K1014K1446K1498K1424K1606K2116K2572K2371K1039J8484J5018
50305A089603J1248P879N392L650J979j22k443m491o199p864r475j0659j1337
50292A067161j1866j2446j2923j3303j3915j4868j5755j6217j6391j6541j6627
50281I06309j6565j6533j6670j6812j6787j6744j6872j7020j6938j6641j6321
50270G22406j6086j5904j5585j4775j3287j1557j0338r830r471q770p861p006
50258E81936o138n183m387l866l285k357j312m86J94R72J847K828M085N475O306
$$ y = [725035, 712722, 702391, 693672, 685951, 679126, 673751, 670322, 668722, 668455, 669123, 670647, 673368, 677915, 684643, 693156, 702734, 713206, 724997, 738337, 752889, 768305, 784700, 802321, 821077, 840683, 861015, 882029, 903475, 924973, 946397, 968003, 990119, 1012691, 1035062, 1056101, 1074585, 1089603, 1100851, 1108730, 1114122, 1117772, 1119751, 1119629, 1117186, 1112695, 1106496, 1098632, 1089157, 1078498, 1067161, 1055295, 1042849, 1029926, 1016623, 1002708, 987840, 972085, 955868, 939477, 922936, 906309, 889744, 873211, 856541, 839729, 822942, 806198, 789326, 772306, 755368, 738727, 722406, 706320, 690416, 674831, 660056, 646769, 635212, 624874, 615044, 605573, 596803, 588942, 581936, 575798, 570615, 566228, 562362, 559077, 556720, 555408, 554922, 555116, 556088, 557935, 560763, 564848, 570323, 576629]
50243E76629O158N550N251N268N119M736M452M274L871L226K680K299J743Q29
50229F32085k12j082j711k249k940l895m799n083m685m282m367m489l952k927
50215E85412k230k208k468k588k418j837q25K60J052J726K602L369L468L080K992
50200E89387L443L963M355M918N476N209L834K166J036L93r6l47l78q45k278m236
50184F16000n936p263q473r311r327q769q329q074p519o751o518o974p188o369
50170E09199n012m125l847l420k430j387j002j361k041k718l361l914m152l977
50156D66452l643l497l556l463k958k230j687j531j654j891k181k498k796l034
50142D29833l125k919k375j797j618j836j940j518q02k63Q3O67J614K530L055
$$ y = [576629, 582787, 588337, 593588, 598856, 603975, 608711, 613163, 617437, 621308, 624534, 627214, 629513, 631256, 632085, 631873, 630791, 629080, 626831, 623891, 619996, 615197, 610114, 605429, 601147, 596780, 592291, 588339, 585412, 583182, 580974, 578506, 575918, 573500, 571663, 570838, 571098, 572150, 573876, 576478, 579847, 583315, 586395, 589387, 592830, 596793, 601148, 606066, 611542, 616751, 620585, 622751, 623787, 624180, 624084, 623737, 623359, 622514, 620236, 616000, 610064, 602801, 594328, 585017, 575690, 566921, 558592, 550518, 542999, 536248, 529730, 522756, 515568, 509199, 504187, 500062, 496215, 492795, 490365, 488978, 487976, 486615, 484574, 481856, 478495, 474581, 470429, 466452, 462809, 459312, 455756, 452293, 449335, 447105, 445418, 443887, 442233, 440342, 438161, 435663, 432867, 429833, 426708, 423789, 421414, 419617, 417999, 416163, 414223, 412705, 411903, 411640, 411723, 412390, 414004, 416534, 419589]
50127D19589L352L787M475N351O397P449Q045P929P556P625Q143Q379P926P269
50113E13272P126P522P807P445O487N414M637M128L491K497J441P40K60n10j612
50098E70145k418k519k309k312k409k141j530j060r75j016q33k46P98K208L642
50083E57025M776N600O267O747O931O963P102P353P587P987Q854J0003J0845J1122
50069F65162J1173J1231J1015J0218R125Q277P813P469P106O822O589O164N499
50056G73663M982M954N174N005M201L214K643K541K566K509K408K209J817J473
50042H19359J598K100K346K007J464J020L38q40j884k005j493j457k399l811n198
50027H11145o639q183r388r930j0106j0339j0582j0563j0308j0047r817r459q795
$$ y = [419589, 422941, 426728, 431203, 436554, 442951, 450400, 458445, 466374, 473930, 481555, 489698, 498077, 506003, 513272, 520398, 527920, 535727, 543172, 549659, 555073, 559710, 563838, 567329, 569826, 571267, 572007, 572267, 571757, 570145, 567727, 565208, 562899, 560587, 558178, 556037, 554507, 553447, 552472, 551456, 550623, 550377, 551175, 553383, 557025, 561801, 567401, 573668, 580415, 587346, 594309, 601411, 608764, 616351, 624338, 633192, 643195, 654040, 665162, 676335, 687566, 698581, 708799, 717924, 726201, 734014, 741483, 748589, 755411, 762000, 768164, 773663, 778645, 783599, 788773, 793778, 797979, 801193, 803836, 806377, 808943, 811452, 813860, 816069, 817886, 819359, 820957, 823057, 825403, 827410, 828874, 829894, 830232, 829392, 827508, 825503, 824010, 822553, 820154, 816343, 811145, 804506, 796323, 786935, 777005, 766899, 756560, 745978, 735415, 725107, 715060, 705243, 695784, 686989]
50014F86989p643o070m673m177m436m399l418k090j274p68K42J736K803L002K904
49999F58728L060L259L146K925K893K753J976O87m38j069j601k542l862n026n515
49984F59374n346n164n654o733p437o915n401l875k905k240j368K1K124M922P819
49969F21222R946J1116J1963J2826J3166J2535J1414J0409R111O886M397L109
49957G38100L255L454K723J776J743K515L151L210K785J683n50l883p837j2009
49943G40116j6097j9514k1720k2887k3645k4227k4325k3708k2412k0480j8074
49932E03027j5841j4459j3782j2973j1646j0218r063p968o705n533m762m260l819
49919C81998l556l589l572l058k069r75n8M98M00m49j535k108k004j782j914k234
$$ y = [686989, 679346, 673276, 668603, 664426, 659990, 655591, 652173, 650083, 648809, 648041, 648283, 650019, 652822, 655824, 658728, 661788, 665047, 668193, 671118, 674011, 676764, 678740, 679427, 678989, 677920, 676319, 673777, 669915, 664889, 659374, 654028, 648864, 643210, 636477, 629040, 622125, 616724, 612849, 609944, 607704, 606336, 606357, 608481, 613403, 621222, 631168, 642284, 654247, 667073, 680239, 692774, 704188, 714597, 723708, 730594, 734991, 738100, 741355, 744809, 747532, 749308, 751051, 753566, 756717, 759927, 762712, 764395, 763845, 759962, 752125, 740116, 724019, 704505, 682785, 659898, 636253, 612026, 587701, 563993, 541581, 521101, 503027, 487186, 472727, 458945, 445972, 434326, 424108, 415045, 407077, 400372, 394839, 390077, 385817, 381998, 378442, 374853, 371281, 368223, 366154, 365179, 365121, 365619, 366019, 365570, 364035, 361927, 359923, 358141, 356227, 353993]
49903C53993k306k065j762j478j066o39o36j185j691j505q82o91j185j553r82
49888C34367K95J424J983K147K101J827J427J091Q11N42N50J095J816K019J696
49873C55191J712K678M104M985M928M415M126M312M733N102N496O255P437Q614
49859D24088R481J0387J1863J3826J5818J7828K0202K2731K4551K5132K4786K3963
49847F44656K2807K1586K0801K0328J9201J6856J4162J2545J2399J3065J3952
49836H32358J4924J5750J5889J4993J3076J0101N966R90m015q448j2378j6136
49824H83070j9699k2591k4317k4817k4546k4100k3747k3348k2738k1957k1029
49813F30181j9867j8585j7579j6948j6116j4537j2575j1111j0360r636q391o944
$$ y = [353993, 351687, 349622, 347860, 346382, 345316, 344677, 344041, 342856, 341165, 339660, 338778, 338087, 336902, 335349, 334367, 334662, 336086, 338069, 340216, 342317, 344144, 345571, 346662, 347473, 348015, 348565, 349660, 351476, 353495, 355191, 356903, 359581, 363685, 368670, 373598, 378013, 382139, 386451, 391184, 396286, 401782, 408037, 415474, 424088, 433569, 443956, 455819, 469645, 485463, 503291, 523493, 546224, 570775, 595907, 620693, 644656, 667463, 689049, 709850, 730178, 749379, 766235, 780397, 792942, 805341, 818406, 832358, 847282, 863032, 878921, 893914, 906990, 917091, 923057, 924047, 920032, 911584, 899206, 883070, 863371, 840780, 816463, 791646, 767100, 743000, 719253, 695905, 673167, 651210, 630181, 610314, 591729, 574150, 557202, 541086, 526549, 513974, 502863, 492503, 482867, 474476, 467532]
49801D67532n912n367m907m321l747l324l010k883l245m276n621o532o520n758
49787D02109m853m314m345m913n693o053n560m553l817l533l133k356j893k363
49773C44730l242l480k960k474k353k074j251k61N00J133J713J824J243N26L17
49758C33891N20P31J083J889K744K889K435K337K958L560L543L446M078N251O091
49743C77446O290O305O501O785P145P886R078J0328J1330J2342J3770J5542J7222
49730E07970J8530J9517K0275K0762K0843K0403J9431J8042J6336J4225J1630
49719G07964Q932O936O137O218O532O897P599Q699R692R887Q922O846L841Q5m243
49704H00944q805j3077j6550j8978k0372k0867k0690k0198j9585j8615j6898j4575
$$ y = [467532, 461620, 456253, 451346, 447025, 443278, 439954, 436944, 434061, 430816, 426540, 420919, 414387, 407867, 402109, 397256, 392942, 388597, 383684, 377991, 371938, 366378, 361825, 358008, 354475, 351342, 348986, 347093, 344730, 341488, 338008, 335048, 332574, 330221, 328147, 326896, 326635, 327135, 328268, 329981, 331805, 333048, 333574, 333891, 334411, 335142, 336225, 338114, 340858, 343747, 346182, 348519, 351477, 355037, 358580, 362026, 366104, 371355, 377446, 383736, 390041, 396542, 403327, 410472, 418358, 427436, 437764, 449094, 461436, 475206, 490748, 507970, 526500, 546017, 566292, 587054, 607897, 628300, 647731, 665773, 682109, 696334, 707964, 716896, 723832, 729969, 736187, 742719, 749616, 757215, 765914, 775606, 785493, 794415, 801261, 805102, 805187, 800944, 792139, 779062, 762512, 743534, 723162, 702295, 681605, 661407, 641822, 623207, 606309, 591734]
49692E91734j2305j0505q962p406n963m838l936l191k772k550j901n75O52R55
49678E28437O51O44R59Q13J0q09j311j776k029j232O98K443K850K445K523L250
49662E38566L583K798J337J12l76j70L24O04M64J46r1l74r05j490j775j762j715
49645E39276j609j196n50q7Ko1j16l22p09q57l40O13J324J450J334J459J776J857
49627E43244J580J345J544K052K479K657K691K687K763L068L535L810L738L659
49613E80852L858L977L587L084L271M145M935N426O298P946R730J0875J1287J1149
49599F70420J0490R749R881J1110J2297J2428J2206J3114J5269J7332J8420J9031
49587H31747K0004K1499K3267K5165K7033K8608K9925L1289L2732L3971L5099
$$ y = [591734, 579429, 568924, 559962, 552556, 546593, 541755, 537819, 534628, 531856, 529306, 527405, 526830, 527482, 528437, 529088, 529732, 530691, 531504, 531514, 530705, 529394, 527618, 525589, 524357, 525055, 527498, 530348, 532793, 535316, 538566, 542149, 544947, 546284, 546396, 546020, 545850, 546174, 546778, 547242, 547388, 547297, 546923, 546018, 544528, 542753, 540991, 539276, 537667, 536471, 535921, 535834, 535836, 535775, 535659, 535337, 534628, 533771, 533431, 534044, 535368, 536818, 538152, 539611, 541387, 543244, 544824, 546169, 547713, 549765, 552244, 554901, 557592, 560279, 563042, 566110, 569645, 573455, 577193, 580852, 584710, 588687, 592274, 595358, 598629, 602774, 607709, 613135, 619433, 627379, 637109, 647984, 659271, 670420, 680910, 690659, 700540, 711650, 723947, 736375, 748581, 761695, 776964, 794296, 812716, 831747, 851751, 873250, 896517, 921682, 948715, 977323, 1007248, 1038537, 1071269, 1105240, 1140339]
$$ [...]
##END NTUPLES=NMR SPECTRUM
##END=
