
##TITLE=AC1346_GUAAH12164_6647547_vDHIZcHlFm
##JCAMPDX= 6.0         $$ Bruker NMR JCAMP-DX V2.0
##DATA TYPE= NMR SPECTRUM
##DATA CLASS= NTUPLES
##ORIGIN= BRUKER
##OWNER= Administrator
$$ 1.72 TOPSPIN		Version 2.1
$$ 2012-08-10 14:42:45.328 -0500  Administrator@TOPSPIN
$$ Compression mode = diff/dup
##.OBSERVE FREQUENCY= 400.02188249412
##.OBSERVE NUCLEUS= ^1H
##.ACQUISITION MODE= SIMULTANEOUS (DQD)
##.ACQUISITION SCHEME= undefined
##.AVERAGES= 8
##.DIGITISER RES= 22
##SPECTROMETER/DATA SYSTEM= spect
##.PULSE SEQUENCE= zg30
##.SOLVENT NAME= COFFEE_meoh
##.SHIFT REFERENCE= INTERNAL, COFFEE_meoh, 1, 14.98509
##AUDIT TRAIL= $$ (NUMBER, WHEN, WHO, WHERE, PROCESS, VERSION, WHAT)
$$ ##TITLE= Audit trail, TOPSPIN		Version 2.1
$$ ##JCAMPDX= 5.01
$$ ##ORIGIN= Bruker BioSpin GmbH
$$ ##OWNER= Administrator
$$ $$ C:\Bruker\TOPSPIN/data/COFFEE/nmr/AC1346_GUAAH12164_6647547_vDHIZcHlFm/20/pdata/1/auditp.txt
$$ ##AUDIT TRAIL=  $$ (NUMBER, WHEN, WHO, WHERE, PROCESS, VERSION, WHAT)
(   1,<2012-08-10 14:42:28.250 -0500>,<Administrator>,<TOPSPIN>,<go>,<TOPSPIN 2.1>,
      <created by zg
	started at 2012-08-10 14:41:20.953 -0500,
	POWCHK enabled, PULCHK disabled,
       configuration hash MD5:
       6B 1B 68 BB D9 2E 58 E2 7F 35 AD 54 07 DF 0E 41
       data hash MD5: 64K
       22 98 F4 8B DA ED 8E 3E B0 C4 BB CE 65 0A 01 DB>)
(   2,<2012-08-10 14:42:34.843 -0500>,<Administrator>,<TOPSPIN>,<proc1d>,<TOPSPIN 2.1>,
      <Start of raw data processing
       efp LB = 0 FT_mod = 6 PKNL = 1 PHC0 = 0 PHC1 = 0 SI = 32K 
       data hash MD5: 32K
       A2 D2 50 21 5C 4E F6 1C B9 B1 5B 96 68 F4 AD 20>)
(   3,<2012-08-10 14:42:35.781 -0500>,<Administrator>,<TOPSPIN>,<proc1d>,<TOPSPIN 2.1>,
      <pk PHC0 = 183.3618 PHC1 = 0 
       data hash MD5: 32K
       AA D4 88 C4 3A FE 50 73 36 95 D6 DF DA AF 99 A7>)
(   4,<2012-08-10 14:42:36.453 -0500>,<Administrator>,<TOPSPIN>,<proc1d>,<TOPSPIN 2.1>,
      <abs ABSG = 1 
       data hash MD5: 32K
       4D 8D 0E 29 0B E4 C6 82 BB 1C 4A 91 D9 24 86 15>)
(   5,<2012-08-10 14:42:36.625 -0500>,<Administrator>,<TOPSPIN>,<proc1d>,<TOPSPIN 2.1>,
      <abs ABSG = 2 
       data hash MD5: 32K
       27 36 7C DC 8B A5 1D B2 8F 83 86 7A 90 04 FB 22>)
(   6,<2012-08-10 14:42:36.687 -0500>,<Administrator>,<TOPSPIN>,<proc1d>,<TOPSPIN 2.1>,
      <abs ABSG = 3 
       data hash MD5: 32K
       B4 20 13 07 C5 66 09 C4 E6 F3 6F 3F 76 A0 DB 2D>)
(   7,<2012-08-10 14:42:36.718 -0500>,<Administrator>,<TOPSPIN>,<proc1d>,<TOPSPIN 2.1>,
      <abs ABSG = 4 
       data hash MD5: 32K
       CD FF 34 B7 4D 70 E4 8B AB E8 3F DB 31 7A B7 08>)
(   8,<2012-08-10 14:42:36.781 -0500>,<Administrator>,<TOPSPIN>,<proc1d>,<TOPSPIN 2.1>,
      <abs ABSG = 5 
       data hash MD5: 32K
       E6 A7 EC 43 3A D3 5C 20 05 50 1F 62 36 6B 47 69>)
$$ ##END=
$$ 
$$ $$ hash MD5
$$ $$ 3D 21 1B C5 F5 F9 FC 07 A7 8C 85 CB CD D6 2E EE
##$RELAX= 
##$RELAX= 
##$RELAX= 
##$RELAX= 
##$RELAX= 
##$RELAX= 
##$RELAX= 
$$ Bruker specific parameters
$$ --------------------------
$$ [...]
150 150 150 150 150 150 150 150
##$TP07= 0
##$TPNAME0= <>
##$TPNAME1= <>
##$TPNAME2= <>
##$TPNAME3= <>
##$TPNAME4= <>
##$TPNAME5= <>
##$TPNAME6= <>
##$TPNAME7= <>
##$TPOAL= (0..7)
0.5 0.5 0.5 0.5 0.5 0.5 0.5 0.5
##$TPOFFS= (0..7)
0 0 0 0 0 0 0 0
##$TUNHIN= 0
##$TUNHOUT= 0
##$TUNXOUT= 0
##$USERA1= <user>
##$USERA2= <user>
##$USERA3= <user>
##$USERA4= <user>
##$USERA5= <user>
##$V9= 5
##$VALIST= <valist>
##$VCLIST= <CCCCCCCCCCCCCCC>
##$VD= 0
##$VDLIST= <DDDDDDDDDDDDDDD>
##$VPLIST= <PPPPPPPPPPPPPPP>
##$VTLIST= <TTTTTTTTTTTTTTT>
##$WBST= 1024
##$WBSW= 4
##$XGAIN= (0..3)
0 0 0 0
##$XL= 0
##$YL= 0
##$YMAX_a= 452848
##$YMIN_a= -594077
##$ZGOPTNS= <>
##$ZL1= 120
##$ZL2= 120
##$ZL3= 120
##$ZL4= 120
##$ABSF1= 14.98509
##$ABSF2= -5.573092
##$ABSG= 5
##$ABSL= 3
##$ALPHA= 0
##$AQORDER= 0
##$ASSFAC= 0
##$ASSFACI= 0
##$ASSFACX= 0
##$ASSWID= 0
##$AUNMP= <proc_prof1d_extract_pilot.lims>
##$AXLEFT= 0
##$AXNAME= <>
##$AXNUC= <1H>
##$AXRIGHT= 0
##$AXTYPE= 0
##$AXUNIT= <>
##$AZFE= 0.1
##$AZFW= 0.1
##$BCFW= 0
##$BC_mod= 0
##$BYTORDP= 0
##$COROFFS= 0
##$CY= 15
##$DATMOD= 1
##$DC= 0
##$DFILT= <>
##$DTYPP= 0
##$F1P= 0
##$F2P= 0
##$FCOR= 0.5
##$FTSIZE= 32768
##$FT_mod= 6
##$GAMMA= 0
##$GB= 0
##$INTBC= 1
##$INTSCL= 1
##$ISEN= 128
##$LB= 0
##$LEV0= 0
##$LPBIN= 0
##$MAXI= 10000
##$MC2= 0
##$MEAN= 0
##$ME_mod= 0
##$MI= 0
##$NCOEF= 0
##$NC_proc= -8
##$NLEV= 6
##$NOISF1= 0
##$NOISF2= 0
##$NSP= 0
##$NTH_PI= 0
##$NZP= 0
##$OFFSET= 14.98509
##$PC= 1
##$PHC0= 183.3618
##$PHC1= 0
##$PH_mod= 1
##$PKNL= yes
##$PPARMOD= 0
##$PPDIAG= 0
##$PPIPTYP= 0
##$PPMPNUM= 2147483647
##$PPRESOL= 1
##$PSCAL= 4
##$PSIGN= 0
##$PYNMP= <proc.py>
##$REVERSE= no
##$SF= 400.02
##$SI= 32768
##$SIGF1= 0
##$SIGF2= 0
##$SINO= 400
##$SIOLD= 32768
##$SPECTYP= <>
##$SREGLST= <1H.CDCl3>
##$SSB= 0
##$STSI= 32768
##$STSR= 0
##$SW_p= 8223.68421052631
##$SYMM= 0
##$S_DEV= 0
##$TDeff= 65536
##$TDoff= 0
##$TI= <>
##$TILT= no
##$TM1= 0
##$TM2= 0
##$TOPLEV= 0
##$USERP1= <user>
##$USERP2= <user>
##$USERP3= <user>
##$USERP4= <user>
##$USERP5= <user>
##$WDW= 1
##$XDIM= 32768
##$YMAX_p= 454181540
##$YMIN_p= -677347
##$CURPLOT= <Network HP LaserJet P1505>
##$CURPRIN= <$Network HP LaserJet P1505>
##$DFORMAT= <normdp>
##$LAYOUT= <+/1D_H.xwp>
##$LFORMAT= <normlp>
##$PFORMAT= <normpl>
##$SURQMSG= 1
$$ End of Bruker specific parameters
$$ ---------------------------------
##NTUPLES= NMR SPECTRUM
##VAR_NAME=  FREQUENCY,     SPECTRUM/REAL,   SPECTRUM/IMAG
##SYMBOL=    X,             R,               I
##VAR_TYPE=  INDEPENDENT,   DEPENDENT,       DEPENDENT
##VAR_FORM=  AFFN,          ASDF,            ASDF
##VAR_DIM=   32768,         32768,           32768
##UNITS=     HZ,            ARBITRARY UNITS, ARBITRARY UNITS
##FACTOR=    0.250966925370066, 1,           1
##FIRST=     8223.43324360094, 29522,        -212181
##LAST=      0,             75408,           -37340
##MIN=       0,             -677347,         0
##MAX=       8223.43324360094, 454181540,    0
$$ Real data points
##PAGE= N=1
##DATA TABLE= (X++(R..R)), XYDATA
$$ [...]
19485d14930a43167c0992j43076C0050J27155b52941G8057N8360c86633J26715
19475b59918g1160j68477L035g0006A6727b3943E1326B5239c3971A41912k2150
19464A19762a66959e9970j79505a5928C1845a37908A4836R0670d35988a56285
19453G22b94186A59487c02851H7640j7336b16585j49147J67099K5353c121D6840
19441c13044a46314J8099F3015R0731a23691I8777a28471N1705a0956k08311A80933
19429h5952j86473g4620j53113q4643e9137l29608H6474a08819J7192L4207k5104
19418h2524B11741q5167a81974k34190a05854Q909j56859f4640j46438i5958J0958
19407h5000A76992m754c2968G2016a39732k4833A2822b46494M9265j84490Q0029
$$ plain form
19485 -414930 -143167 -30992 -174068 30050 157205 -252941 78057 136417 -386633 -259918
19475 -259918 -71160 -239637 -236602 -70006 16727 -23943 51326 25239 -33971 141912 119762
19464 119762 -166959 -59970 -239475 -15928 31845 -137908 14836 105506 -435988 -156285
19453 722 -294186 159487 -302851 87640 70304 -216585 -365732 -198633 -173280 -3121 46840
19441 -313044 -146314 -128215 63015 153746 -123691 98777 -128471 -76766 -10956 -219267 180933
19429 -85952 -272425 -74620 -227733 -312376 -59137 -388745 86474 -108819 -91627 -57420 -82524
19418 -82524 211741 126574 -181974 -416164 -105854 -96945 -253804 -64640 -211078 -95958 -85000
19407 -85000 176992 172238 -32968 72016 -139732 -164565 12822 -246494 -197229 -381719 -301690
19396c01690a42893A76221b24757P2871A97748F6615c34299f9795A01834b7185
19385b38865B02854a70143o4332L8265h5296J2315A40107n4031a00632J4458K6508
19374e9666A56580F3700j0627b89451o881A61637a12512q1295B15735C2421j899
19363C0522d7910A78937G3157a74027b7016o427A67199R1749D7862g1833k17637
19352b89470i5558I4098a01185C3333h6803N542A33275n7401b65402B6638b80707
19340B10002a058l60528a63815B76574a6913F673b57948A83739J6134E2028a55376
19328A91343F2948K1899K18509a59719a7734l4877a7992l13986A22112a30444
19317c3534m38353K21543I6321g9403j011r9100K722M0393j39587j54102b6643
$$ plain form
19396 -301690 -142893 176221 -224757 -151886 197748 66615 -334299 -69795 101834 -27185
19385 -238865 202854 -170143 -234475 -196210 -85296 -72981 140107 86076 -100632 -86174 -59666
19374 -59666 156580 63700 53073 -289451 -296332 161637 -112512 -193807 215735 32421 30522
19363 30522 -47910 178937 73157 -174027 -27016 -33443 167199 258948 47862 -71833 -289470
19352 -289470 -95558 94098 -101185 33333 -86803 -81261 133275 75874 -265402 26638 -280707
19340 210002 -1058 -361586 -163815 276574 -16913 6673 -257948 183739 199873 52028 -155376
19328 191343 62948 84847 303356 -159719 -17734 -52611 -17992 -331978 122112 -130444
19317 -33534 -471887 -250344 96321 -79403 -80414 -179514 -176792 -136399 -275986 -430088 -26643
19305a09555d329j31344j90143a50724o6333b7224k17565d4677l06841a06249
19294a03349a7597j255l29840d3133k78973a46225j88979A82087b25638a05565
19283b78977i7432k67331b8603A26303b53718n6235R8609J03602J0696n2526l1252
19272a80824m4486r8975J07358f5103c1249j14545N292j52457d6915p9654k8695
19261a55264I7160M0108P4312H7435i6212l32282a61883d7857a2920A07638C7948
19249a53513k0560a588A95540A5291g8635C08263Q7118A07886b92797C6938c82185
19237g6826e268F8512g2497n9202B5706J2434b52928j56107C23508a04301j09412
19226b13713C6123J89558i0331j817I8488j5163d21119A44029a23830N0525k92666
$$ plain form
19305 -109555 -4329 -135673 -325816 -150724 -217057 -27224 -244789 -44677 -351518 -106249
19294 -103349 -17597 -18852 -348692 -43133 -322106 -146225 -335204 182087 -225638 -105565
19283 -278977 -97432 -364763 -28603 126303 -253718 -309953 -211344 -107742 -97046 -149572 -180824
19272 -180824 -225310 -324285 -216927 -65103 -31249 -145794 -140502 -292959 -46915 -126569 -155264
19261 -155264 97160 137268 211580 87435 -96212 -428494 -161883 -47857 -12920 107638 37948
19249 -153513 -174073 -1588 195540 15291 -78635 308263 395381 107886 -292797 36938 -382185
19237 -76826 -5268 68512 -72497 -131699 25706 38140 -252928 -409035 323508 -104301 -213713
19226 -213713 36123 225681 -90331 -92148 98488 83325 -421119 144029 -123830 -73305 -365971
19215c65971B0539a17111A02961c74702a75245e8904A02785h8931K1033k47281
19205c15179J25916b2986p4052k16560a31325I0202a97702A40143B8727L08488
19195C37215I0626p448J31673b1424C0136c90048B45900I5585b73240H34g2062
19183c3742D3017c7538j48882c4067A48406a90255j6350A68789M8172A01373R3069
19172A94442d14158J86332A59019G1477a82954E4918a59394d5503p2113B0778
19161A9491i4709j07027f4191I1620b43359R5393B70671F5059B6118h7127C4984
19149G8554b51735O164n99C33546c02288F4628B4611a4278f752r9999G8486f7139
19136h4941B89819j44431f9603p4425J1225B9581b87703j67379e4771A78595q2444
$$ plain form
19215 -365971 20539 -117111 102961 -374702 -175245 -58904 102785 -88931 -67898 -315179
19205 -315179 -189263 -22986 -97038 -313598 -131325 90202 -197702 140143 28727 337215
19195 337215 90626 83178 214851 -21424 30136 -390048 245900 95585 -273240 834 -72062
19183 -33742 43017 -37538 -186420 -34067 148406 -190255 -206605 168789 216961 101373 194442
19172 194442 -414158 -227826 159019 71477 -182954 54918 -159394 -45503 -117616 20778
19161 19491 -94709 -201736 -64191 91620 -243359 -147966 270671 65059 26118 -87127 34984
19149 78554 -251735 -245571 -246170 333546 -302288 64628 24611 -14278 -6752 -106751 78486 -67139
19136 -84941 289819 145388 -69603 -144028 -132803 29581 -287703 -455082 -54771 178595 96151
19125I6151q909a86718P358h2919B07141A5302Q9093c7060A28363f6230k38333
19114c04563g474j43718O3254j11068k88341a62565d5009g564j92197g5175a3475
19102E3065j3502r688g9524E0001a9604G7091b66903G0268a49567M6524A62551
19090g4377A31611c13386J43783p7758a07603d8504k77670i1272j22901K1510
19080a92663j63548d5531m0678A10718d87416I3002a05896c2249E5774c5628A80677
19068a87890j99734e698j85445B570M03642a3666C9915e4852r547M425m2233b8701
19055b28247E4945c57927A47598a2253n7257H079b43891P2811j82831a20098I6483
19043a32994l4534Q334C23699a52297j18566B9734b81276B39721a49546L5259
$$ plain form
19125 96151 87242 -186718 -179360 -82919 207141 15302 104395 -37060 128363 -66230 -304563
19114 -304563 -7474 -151192 -87938 -199006 -487347 -162565 -45009 -7564 -199761 -75175 -13475
19102 53065 39563 29875 -79524 50001 -19604 77091 -266903 70268 -149567 -103043 162551
19090 -74377 131611 -313386 -169603 -247361 -107603 -48504 -326174 -91272 -214173 -192663
19080 -192663 -356211 -45531 -86209 110718 -487416 93002 -105896 -32249 55774 -35628 180677
19068 -187890 -387624 -5698 -191143 2570 406212 -13666 39915 -54852 -64399 -59974 -102207 -28701
19055 -228247 54945 -357927 147598 -12253 -69510 8079 -243891 -171080 -353911 -120098 96483
19043 -132994 -167528 -159194 323699 -152297 -270863 29734 -281276 239721 -149546 -114287
19033a14287B25388E0331a38945c1670A40968J0580P9306J1640J90356a22402
19022e3288A70092h2583A15361B5219J01912i8091J267n9063o3915A5385J72620
19011A88005b27600B20614G4472d2390D0450j5349b88963i441k38985h5759A8499
18999C14195l5900F669a59850B18472g6678k8686p9277P6761H9147c02650L1145
18988b71505B47245b91979j34398a35588d730E413a38599A21615B7801f297p0378
18977g6675A18628B6843J32545f5753E39359J33636k94114H7048h8448d3024q2756
18966a25780c8474j16634E959K33635a34593o4144e9353a1251j43603m0798l97069
18955e92721b3474l5044A4333a41631r4631C5430b50045A03196b17513D5608F646
$$ plain form
19033 -114287 225388 50331 -138945 -31670 140968 151548 230854 242494 432850 -122402
19022 -53288 170092 -82583 115361 25219 127131 -98091 -96824 -155887 -219802 15385 188005
19011 188005 -227600 220614 74472 -42390 40450 25101 -288963 -9441 -248426 -85759 18499
18999 314195 278295 6669 -159850 218472 -76678 -105364 -184641 -107880 89147 -302650 -271505
18988 -271505 247245 -291979 -426377 -135588 -4730 5413 -138599 121615 27801 -6297 -76675
18977 -76675 118628 26843 159388 -65753 539359 672995 378881 87048 -88448 -43024 -125780
18966 -125780 -38474 -155108 5959 239594 -134593 -198737 -59353 -11251 -154854 -195652 -592721
18955 -592721 -23474 -58518 14333 -141631 -236262 35430 -250045 103196 -217513 45608 6646
18943A93887a29494n9483B68239B1104J71233p9597b17129K2001M8677A92896
18932b65121A21238a97872j0648j13625A20508L02525f0843C0814r293J30942
18922A52463d7787k24149E1824a52604L9970M0052I1082a52196H6461c70607f7775
18910B92136N11134l11293J50229A15523c6057l4344o7681A88739F5420a10166
18899c93044C28426E6237H193J75576a6832n1505i209C8522b18216a03063k42295
18888c45358j62404Q5349a28215l10353B2587K5218E318d474k43323m4341g0059
18876A25634a37681C18392G7634C0444b0800l49957a1986q5967a1734C7040L7107
18865G4147A017h7591I2787a1702A09449i9616A81806a51287N1019a4584O783
$$ plain form
18943 193887 -129494 -188977 268239 21104 192337 112740 -217129 -195128 -146451 192896
18932 -265121 121238 -197872 -208520 -322145 120508 423033 -60843 30814 21521 152463
18922 152463 -47787 -271936 51824 -152604 -112634 -72582 91082 -152196 86461 -370607 -67775
18910 292136 803270 491977 642206 115523 -36057 -70401 -138082 188739 65420 -110166
18899 -393044 328426 56237 8193 183769 -16832 -68337 -9209 38522 -218216 -103063 -345358
18888 -345358 -507762 -422413 -128215 -438568 22587 47805 5318 -4474 -247797 -292138 -70059
18876 125634 -137681 318392 77634 30444 -20800 -370757 -11986 -97953 -11734 37040 74147
18865 74147 1017 -87591 92787 -11702 109449 -99616 181806 -151287 -100268 -14584 -7801
18854g801A24910J01366I4379N2047b49987j4258J00766A36947l2713a38718A02639
18842B0597h5159q5982Q0270p0417C1269a59242J7646o2987A12731b95314d8842
18830A56510i9819L2003I3354b39951d734j83823a5686j9895B8475b2556E8967
18818A01115N174d2970A84285h3453d1308C7350a52876k3551D8541e7375G1520
18806b87442A69035C1091L5935a77351E2731M1631b74870C0177j0309j597R9946
18795A18217E3143a14216b8723C12779E755M9366J20887d03694a96943F8881a14221
18783b52075F3000P894c29097e3036n3214A43523b20724C84936b41173j96950
18773d38123H5114b3833q2038B17818b16190K7790A70551h6937A71016a11041
$$ plain form
18854 -7801 124910 226276 94379 146426 -249987 -264245 -163479 136947 104234 -138718 102639
18842 20597 -85159 -171141 -90871 -161288 31269 -159242 -141596 -204583 112731 -295314 -48842
18830 156510 -99819 -67816 93354 -239951 -4734 -188557 -15686 -35581 28475 -22556 58967
18818 101115 106289 -42970 184285 -83453 -41308 37350 -152876 -176427 48541 -57375 71520
18806 -287442 169035 31091 67026 -177351 52731 94362 -274870 30177 19868 18271 118217
18795 118217 53143 -114216 -28723 312779 5755 55121 176008 -403694 -196943 68881 -114221
18783 -252075 63000 70894 -329097 -53036 -106250 143523 -220724 384936 -241173 -438123
18773 -438123 85114 -23833 -105871 217818 -216190 -188400 170551 -86937 171016 -111041
18762B68543A23099D5734b06779K1104h6512B14450F5502a46690G0143b01655
18751e0428j62694n7330i8951P543j11649C36642e5586D2856i7399m3066G8094
18739A75903C1572a81933O2372l76845A18873J47196b38181b0569B07261O3584
18729B70845A5930a65036A1943J71203a63713M3936e8210n6080j11532b2129C0344
18717a21177A84768a96427A281a37867k22982F4387a87778j46769J2566A82594
18706b18729K3997A76610b72491F6606r482E547c90618A3467L07764b74867A34769
18694A00715m6654b79118A93650b75445b0985k39516a26981d3735j79832C43089
18683a36867A50515C9282d2779A0208K97443F6891g6698c7378B10133a70775E2343
$$ plain form
18762 268543 123099 45734 -206779 -185675 -86512 214450 65502 -146690 70143 -201655
18751 -50428 -213122 -270452 -98951 -91408 -203057 336642 -55586 42856 -97399 -140465 78094
18739 175903 31572 -181933 -119561 -496406 118873 266069 -238181 -20569 207261 270845
18729 270845 15930 -165036 11943 183146 -163713 -119777 -58210 -114290 -225822 -22129 30344
18717 -121177 184768 -196427 1281 -137867 -360849 64387 -187778 -334547 -321981 182594
18706 -218729 -194732 176610 -272491 66606 57124 5547 -390618 13467 321231 -274867 134769
18694 100715 54061 -279118 193650 -275445 -20985 -260501 -126981 -43735 -223567 343089
18683 -136867 150515 39282 -42779 10208 307651 66891 -76698 -37378 210133 -170775 52343
18671a02293k27348a57221k0200E6749A2809e982A58657c16869O9554O4230b7831
18659c16369A15587K19422a21451e3811a4718B14174a26725B1768g5948I3316
18648f0402A19023k7407M93393a18093j05016n2639J16416o2940B9108b8620A52160
18636c21183D1762n472a95060o6600a8426j5781a0664E9766F84a11308B83113
18624A56041a53336P3329j77139D85326c513q6161b8797q9491c1757A28501C9676
18612g2246J9072b5200j93862L2062N7382M1802k78824a01014o719b1887o4380
18601h6267A38871j3100a76832e8354j62731q4175d7149A50052b42444L9490B616
18589B26177e2748k25203k3647R0218B65600D0411r717a73822g1294k4398a2478
$$ plain form
18671 -102293 -329641 -157221 -177421 56749 12809 -5982 158657 -316869 -247315 -183085 -27831
18659 -316369 115587 335009 -121451 -53811 -14718 214174 -126725 21768 -75948 93316
18648 -60402 119023 91616 585009 -118093 -223109 -275748 -159332 -222272 29108 -28620 152160
18636 -321183 41762 36290 -195060 -261660 -18426 -34207 -10664 59766 684 -111308 283113
18624 156041 -153336 -80007 -257146 485326 -3513 -89674 -28797 -118288 -31757 128501 39676
18612 -72246 -53174 -25200 -219062 -187000 -129618 -87816 -366640 -101014 -107733 -21887 -86267
18601 -86267 138871 125771 -176832 -58354 -221085 -305260 -47149 150052 -242444 -202954 2616
18589 226177 -52748 -277951 -301598 -211380 265600 40411 30694 -173822 -71294 -95692 -12478
18577a15929a770k44803B34386a03317a280E3070b39253B0070b83316e2199k62386
18566c14585a6110D9991O9696c25394a28872b7482B9534b25273D1964a5371A55948
18554c27403D3637a69116A02962D0680a19498N3694A6327E477a82283m1237M7023
18543a76497A5890e58n1780B17215B5989a75627B63178a11015B48393f472j88449
18532a94921Q9942j59487h0182j36788k07960a21614L437C14113A18571m3027
18522G5544e9655G4929h0966B49419A1603R8593b01897h2409L6451l8178I6958
18510a22134J4471E3256G152L81922d8147m9047k93340A41364b5071H7646b0130
18498A40016a22113J0971k36673h5245c145H1218L06503c79066a51136A46663
$$ plain form
18577 -115929 -1770 -246573 234386 -103317 -1280 53070 -239253 20070 -283316 -52199 -314585
18566 -314585 -16110 49991 119687 -325394 -128872 -27482 29534 -225273 41964 -15371 155948
18554 -327403 43637 -169116 102962 40680 -119498 -65804 16327 5477 -182283 -223520 -176497
18543 -176497 15890 -558 -52338 217215 25989 -175627 263178 -111015 248393 -6472 -194921
18532 -194921 -104979 -264466 -80182 -216970 -424930 -121614 -118177 314113 118571 75544
18522 75544 -59655 74929 -80966 249419 11603 110196 -201897 -82409 -45958 -84136 96958
18510 -122134 -107663 53256 7152 389074 -48147 -97194 -390534 141364 -25071 87646 -20130
18498 140016 -122113 -111142 -347815 -85245 -3145 81218 387721 -379066 -151136 146663
18487i324j59636k51632K07012A66557p3440a879B9957K7179J08759n9841b76520
18475b20083m8946j51754a548o93G9175J8542c10028C302L3073J3852p762h1810
18462b0371f125A03326a6317j27401B81518e0764C840E27K52559C2867a82072
18450b07997B1392c03069J39947m1862k24572C48500a83961N4096j37532e4873
18439D270d06321J99425B10699b07279B32631b9876C86597j58711a23153M6414
18429g6739k11505c7587G3129g0864l529B4893a63797G2297R4760G4886a86361
18417A1290a58318N1475A71355o9046k4324a85522k01797d2230j46076f7192l63102
18406d30294f2845q0947A9902J9635A2854a24168j4155A19501a76344A75273a46939
$$ plain form
18487 -9324 -168960 -420592 -213580 166557 93117 -1879 29957 57136 165895 106054 -276520
18475 -220083 -269029 -420783 -1548 -2241 79175 97717 -310028 3302 36375 50227 42465 -81810
18462 -20371 -6125 103326 -16317 -143718 281518 -50764 3840 527 253086 32867 -182072
18450 -207997 21392 -303069 -163122 -204984 -429556 348500 -183961 -129865 -267397 -54873
18439 4270 -406321 -206896 210699 -207279 232631 -29876 386597 227886 -123153 -76739
18429 -76739 -288244 -37587 73129 -70864 -74393 24893 -163797 72297 167057 74886 -186361
18417 11290 -158318 -106843 171355 102309 77985 -185522 -387319 -42230 -188306 -67192 -430294
18406 -430294 -62845 -143792 19902 39537 12854 -124168 -138323 119501 -176344 175273 -146939
18394i6624m6068F4276a02277B41746r6603b52401f6248E525J62523c25148a36727
18382c54468i9539L9473o7768A56221o3966K81042d657B02274b15306f3153k86122
18371c49275f3487k82493G9740a22659A09555M5524a43310K5023G6376b4906A4060
18359H3107b3777B3024K761a88729b8155A69865F2222a03994B26430p0904f591
18347f3904A26789j5786K3990e0780A6303J70473C5281M27493k03824l4436N1627
18336B76141a58837P371j30724C5923A4376J14276g1831j10323j7664R604D0473
18324A85108b82223J21081K9532q2055H0680a69408j04753f6984c2996I0222k9786
18313F0436J3894Q3544o5070a18302A20923A9254b09406F4873J52361a25311A247
$$ plain form
18394 -96624 -142692 64276 -102277 241746 145143 -252401 -66248 5525 168048 -325148 -136727
18382 -354468 -99539 -60066 -127834 156221 92255 373297 -4657 202274 -215306 -63153 -349275
18371 -349275 -63487 -345980 79740 -122659 109555 155079 -143310 -118287 76376 -24906 14060
18359 83107 -23777 23024 25785 -188729 -28155 169865 62222 -103994 226430 155526 -6591
18347 -63904 126789 111003 134993 -50780 16303 186776 35281 462774 258950 224514 276141
18336 276141 -158837 -151466 -282190 35923 14376 128652 -71831 -182154 -199818 -190214 40473
18324 185108 -282223 -161142 -131610 -213665 80680 -169408 -274161 -66984 -32996 90222 60436
18313 60436 74330 157874 92804 -118302 120923 19254 -209406 64873 217234 -125311 1247
18301c5749j35274p6426F9354g3545A48545a46865d4403j16334m22348b23877
18290D1413J09287b77547A76761i6392K0771n1790B81560A496J42802f8508K0579
18279d7929j67848B10911b9921p8992j7617p7094R1893A98801o4318b58606n2404
18268c11010H920d26107a17871C496c16332a21192B38363e9809A92032q6816d9501
18256a77620B4188d3077B25657b062l00158I561J36821b61059A84254a73721c2073
18244b55707A45756b15967I4939K5856D1983J18305c15827F1545f3212A02996
18233g2902F4906B6214O2468c614B5670A1147g2010j39455c5565o5478A59358
18221F4750A6020i3512k61533A32163Q0477c91465A76072J51528b8035k0530m9293
$$ plain form
18301 -35749 -171023 -247449 69354 -73545 148545 -146865 -44403 -160737 -583085 -223877
18290 41413 150700 -277547 176761 -96392 -75621 -127411 281560 1496 144298 -68508 -47929
18279 -47929 -215777 210911 -29921 -108913 -126530 -203624 -111731 198801 134483 -258606 -311010
18268 -311010 8920 -426107 -117871 3496 -316332 -121192 238363 -59809 192032 105216 -49501
18256 -177620 24188 -43077 225657 -2062 -302220 9561 146382 -261059 184254 -173721 -32073
18244 -255707 145756 -215967 94939 120795 41983 160288 -315827 61545 -63212 102996
18233 -72902 64906 26214 88682 -3614 25670 11147 -72010 -211465 -35565 -101043 159358
18221 64750 16020 -93512 -355045 132163 212640 -391465 176072 327600 -28035 -48565 -97858
18210i7858A44486J10327g0800A2119Q9774j7913b3839k37125B19766B7258f6364
18198C7616L23853b58373o6424A36606E4455c5182E8735N0600o374J67341o4880
18187B05422E686J20427m4620b14196a3099j19200A63676O8639I5314a69634l5488
18176b05122A01238K1196a68885K4862c6377j44285g3192D3809J91552a90305
18165b09560B54794b86640B92016E6346K53030P7013A61612L1262o8914B34K79206
18154B79440j31882M0264C2961A6478c38500b1915k48662a31618d2413A4291b93339
18142C02516G7353R3225a48138M17J5325F0227J18892C3961c80969a76656n8703
18131b35359A68939b86971R2963d9570B83448a5986q3278E9528j4376J50111E7657
$$ plain form
18210 -97858 144486 254813 -70800 12119 101893 83980 -23839 -260964 219766 27258 -66364
18198 37616 361469 -258373 -324797 136606 54455 -35182 58735 109335 102961 270302 205422
18187 205422 5686 126113 81493 -214196 -13099 -132299 163676 232315 95314 -169634 -205122
18176 -205122 101238 122434 -168885 -144023 -36377 -180662 -73192 43809 235361 -190305
18165 -209560 254794 -286640 292016 56346 309376 386389 161612 192874 123960 234 279440
18154 279440 147558 187822 32961 16478 -338500 -21915 -270577 -131618 -42413 14291 -293339
18142 302516 77353 170578 -148138 -147721 -132396 60227 179119 33961 -380969 -176656 -235359
18131 -235359 168939 -286971 -194008 -49570 283448 -15986 -99264 59528 45152 195263 57657
18119B55506c25160a4576A16602e105k49j47326k10149C24439b91990F8141f3467
18107a12257A3752N0790B4313b89031J41730l486n0315B87283b09655A14128a06284
18095a47348j38843d7581e31A45600n8795j3379a32167j01680G2965e7217j42473
18084a99690L3702k99310b03989g2298p6312H420b15411i6115K5962D9163a69944
18072A83112a98169n9291a1205A33906A596a44391j6375k45909J77446B11032
18061c66326A6526b64809A65790c18994C0379a27301A94512R0805a76315G5328
18050A81491a40673p4123g1472I1314k6263a08806B68041B2670J64933J7488h0227
18038C2895i7707n5182A04682m0367d70748A14647L3231G1143b58284g9881r6938
$$ plain form
18119 255506 -325160 -14576 116602 -5105 -5354 -152680 -362829 324439 -291990 68141 -63467
18107 -112257 13752 64542 24313 -289031 -147301 -150787 -201102 287283 -209655 114128 -106284
18095 -147348 -286191 -47581 -531 145600 86805 73426 -132167 -233847 72965 -57217 -199690
18084 -199690 -165988 -465298 -203989 -72298 -148610 8420 -215411 -96115 -70153 49163 -169944
18072 183112 -198169 -257460 -11205 133906 1596 -144391 -160766 -406675 -229229 211032
18061 -366326 16526 -264809 165790 -318994 30379 -127301 194512 285317 -176315 75328
18050 181491 -140673 -214796 -71472 91314 65051 -108806 268041 22670 187603 205091 -80227
18038 32895 -97707 -152889 104682 64315 -470748 114647 147878 71143 -258284 -79881 -176819
18027a76819h3186r1215B58387G608J8174K29199I9427J19284g1776q4091q6895
18016b42762B9744J54977E7981J9996h7536m3722I0095j7185b59671B6276h8051
18004d3969B36587a93238q3177h4002A31473E593K47834B3926J51161h5766D89485
17992a34263N3224I7423b17865G5067J33028g7728A11011b09548A17330D6877
17981d3276B001J17507e4909A7377L17509d3480I5250a41662A24435i5498j24143
17970b19641j2350A26514K67353A73434a07694j53571A82161f614F5749a46247
17959a61475H9771a660B65011j26645J75873A8469N12730h7761B00514C949a22341
17947A38287b39894A58351d1246c430m5835A81924G26J22884m165c4408l00441
$$ plain form
18027 -176819 -83186 -174401 258387 7608 25782 254981 99427 218711 -71776 -155867 -242762
18016 -242762 29744 184721 57981 77977 -87536 -131258 90095 72910 -259671 26276 -88051
18004 -43969 236587 -193238 -276415 -84002 131473 5593 253427 23926 175087 -85766 489485
17992 -134263 -81039 97423 -217865 75067 208095 -77728 111011 -209548 117330 46877
17981 -43276 2001 119508 -54909 17377 334886 -43480 95250 -141662 124435 -95498 -219641
17970 -219641 -231991 126514 393867 173434 -107694 -261265 182161 -6614 65749 -146247
17959 -161475 89771 -1660 265011 138366 314239 18469 531199 -87761 200514 3949 -122341
17947 138287 -239894 158351 -41246 -3430 -49265 181924 726 123610 119445 -34408 -334849
17936c34849a8918A70256a20833c7900E4197J1075h4990m5294A68052B7335M7128
17925G4463e7827B5103b0301A00471a37932A78127M7791R6591d0126H080M1362
17914D9442f8523l03968A16057a75109G8396h9786K1395p7500l4328A6803J87901
17903B04704p0241Q6669c1377j65289m2354C72104A17542b88909g1467G4984J5157
17892I0141c13558D9880L9040N9241n0567a71511A47063R4353R059A8042a74173
17880h1173A6828R4175k3718d47745A19087l6746J30720b41827Q1902E07280E8512
17868a81185A11167N3410a68758k88823A67925a8260k2923A46806l5103m6657
17858F5046L53630a03170C47026E988J44908b93429A30840K97090j6031j53200
$$ plain form
17936 -334849 -18918 170256 -120833 -37900 54197 65272 -84990 -130284 168052 27335 74463
17925 74463 -57827 25103 -20301 100471 -137932 178127 225918 322509 -40126 8080 49442
17914 49442 -68523 -372491 116057 -175109 78396 -89786 -68391 -145891 -180219 16803 204704
17903 204704 134463 221132 -31377 -196666 -239020 372104 117542 -288909 -71467 74984 90141
17892 90141 -313558 49880 88920 148161 97594 -171511 147063 241416 250475 18042 -174173
17880 -81173 16828 111003 87285 -447745 119087 82341 213061 -241827 -159925 507280 58512
17868 -181185 111167 164577 -168758 -457581 167925 -18260 -41183 146806 111703 65046
17858 65046 418676 -103170 347026 5988 150896 -293429 130840 427930 411899 258699
17848B58699H3913J5470e9102b2172C8363a83196Q8264A48317a5111A45038K6682
17837A71720a62236k2141A31388b93076R9197C9757O9147A3905J56904l5174a9188
17825A24443a96130A80463a10583I662a75691l39842a61857P8173A264L05846
17815C07110o9007a42501C28118A16551a19051d7625I8001J1349a58836D21050
17804a68252D70436k15571C3578J26227E6368L8306d3840k5943l67948E6662b61450
17792B79917b21029F2264l0386c98754a93948I5791J7225a23783A44178M17579
17782E61757D7991a47639F6540M9761n7754o927j7240g0287G3247N522k5329K4594
17770G8034a2256A2232O1596J39756i2398A92208p5160J61031F4227b16556D31227
$$ plain form
17848 258699 83913 99383 -59102 -22172 38363 -183196 -94932 148317 -15111 145038 171720
17837 171720 -162236 -184377 131388 -293076 -193879 39757 108904 13905 170809 135635 -19188
17825 124443 -196130 180463 -110583 9662 -175691 -515533 -161857 -83684 1264 307110
17815 307110 238103 -142501 328118 116551 -119051 -47625 98001 109350 -158836 421050
17804 -168252 470436 254865 33578 159805 56368 94674 -43840 -69783 -437731 56662 -261450
17792 279917 -221029 62264 31878 -398754 -193948 95791 113016 -123783 144178 561757
17782 561757 47991 -147639 66540 116301 58547 51620 34380 -70287 73247 78769 53440 78034
17770 78034 -12256 12232 73828 213584 -92398 192208 117048 278079 64227 -216556 431227
17758b6779H2008a42243C53475j02459a06211l7012B5610J70014n028C1885K62008
17747B93893j32917J4957n4791j0534n5051K46649N0097a16911D02414k00253
17737B02161I6309k5893J29207E8925K2416l728a22214j04792C627f7187C01239
17725a29197A99360c9135B12865b8893D0782M669P6823L01516R8594b3550B30243
17713F3809J43749g739E3140M5906J52869b03637E8165J0929a5009B49881b4085
17701G1456f8011g195k59584B32757a3591C06061b80496C96404E0195J93243b04809
17689a35880B78623d9127A08657R8711a09252p3070G2824b3586A10705a2927B24374
17677e1456N993A59418q884J74446A4607J7075L691h0459E5838a7397G7154h7812
$$ plain form
17758 -26779 82008 -142243 353475 251016 -106211 -143223 25610 195624 190596 31885 293893
17747 293893 160976 175933 121142 110608 55557 302206 352303 -116911 402414 202161
17737 202161 96309 70416 199623 58925 81341 77613 -122214 -227006 3627 -67187 301239
17725 -129197 199360 -39135 212865 -28893 40782 45451 122274 423790 522384 -23550 230243
17713 63809 207558 -7739 53140 99046 251915 -203637 58165 69094 -15009 249881 -24085
17701 71456 -68011 -7195 -266779 232757 -13591 306061 -280496 396404 50195 243438 -204809
17689 -135880 278623 -49127 108657 207368 -109252 -182322 72824 -23586 110705 -12927 224374
17677 -51456 -45463 159418 150534 324980 14607 31682 35373 -80459 55838 -17397 77154 -87812
17664b32357h1414A04335k6341a53505b894B7486K0902A4529J82812C4534P9024
17653A13558L21501a05977C8777J68358n4999k2264a30948A08226a88299A95829
17642b51398B05262a3516A32540D1492J82603J02256C6409J89023k0192J5010
17632B20250e0246g457A976K04984b33804C3566a59449C15907n3779A341c3023
17620a78965B32685O32o298b6958C16235k4215A43648e7612a4886A37502L62766
17609E00268A83609g2129D71507a90073A2365J60610K96111j93565j8011m9679
17599B07831e6281A075J0700a46077A74486h406j49925e5950A87833L1850a19745
17587i7115C724O7661K6564J31008k2643h8129B81842j27697l6774L03593A6329
$$ plain form
17664 -232357 -81414 104335 77994 -153505 -2894 27486 48388 14529 197341 34534 113558
17653 113558 435059 -105977 38777 207135 152136 129872 -130948 108226 -188299 195829
17642 -251398 205262 -13516 132540 41492 224095 326351 36409 225432 205240 220250
17632 220250 -50246 -7457 1976 206960 -233804 33566 -159449 315907 262128 1341 -33023
17620 -178965 232685 233317 227019 -26958 316235 292020 143648 -57612 -14886 137502 500268
17609 500268 183609 -72129 471507 -190073 12365 172975 469086 275521 257510 207831
17599 207831 -56281 1075 11775 -146077 174486 -8406 -158331 -55950 187833 219683 -119745
17587 -97115 3724 71385 97949 228957 206314 -88129 281842 154145 117371 420964 16329
17575b35400B07798g7354L3343A96539m5070J44677J5458H2071k0004J62168a14001
17563D21755C810f5669c2484H1494b34294K3081C21747H3877P6039M4508J17454
17552C21878F5088J27479K73736A60655J59432j09199C6946L33920H6913L46048
17542D32961d5913C48236r9263M9978b1425A97422J58533j29431o2551m6470K42665
17531C60168F5525K1452N49997k88522L01702L58933N10671o0251l90910m04365
17521F64232k47894N28526k99291B15466K91721B02240K35055j62602R9121K92260
17511F66074K94364K36172J16057l82349K2677m14464J08633j99623O4967k25746
17501B86762J92698A66665J48250J33335l5943J74225B63877L45508j85630j26145
$$ plain form
17575 -235400 207798 -77354 -44011 196539 151469 296146 311604 82071 62067 224235 -114001
17563 421755 3810 -65669 -32484 81494 -234294 -211213 321747 83877 159916 204424 321878
17552 321878 65088 192567 466303 160655 320087 210888 36946 370866 86913 432961
17542 432961 -45913 348236 248973 298951 -21425 197422 355955 226524 163973 117503 360168
17531 360168 65525 86977 636974 348452 650154 1009087 1519758 1459507 1068597 664232
17521 664232 416338 944864 645573 215466 507187 202240 437295 274693 373814 666074
17511 666074 960438 1196610 1312667 930318 952995 538531 647164 447541 512508 286762
17501 286762 479460 166665 314915 448250 412307 586532 263877 609385 423755 297610
17491B97610l9235J87858I9810K18825n0140M00790a52681E95617A80648A7409
17480B27248D411N59045j68536j04177j17227J43199b3419E27265k37095J78004
17470D68174A97659L4714L46793k77841J29745j29235o0039F8667d1932B09924
17459G0299J58586j8225m0729K48355E6522M02527C5201K00678A10355K36011
17449C46366O6741j42262L1381L8463N99866B1831L56450J12433j24519N9507
17439D25702J0292F3548J62220L09835K02098q7820a02805D16934A25354N9978
17429A85332l3877L70379E0833N0809J31637K53307j08595p8237l3591j21866
17419A44297K09779N2924A75966J93197j31830M9543J61851j96606q6704R018
$$ plain form
17491 297610 258375 446233 99810 318635 268495 669285 -152681 595617 180648 17409
17480 227248 4411 563456 394920 290743 173516 316715 -23419 527265 290170 468174
17470 468174 197659 232373 579166 301325 431070 301835 241796 68667 -41932 209924
17459 70299 228885 210660 169931 418286 56522 459049 35201 235879 110355 346366
17449 346366 413107 270845 302226 340689 940555 21831 378281 490714 366195 425702
17439 425702 435994 63548 225768 535603 737701 649881 -102805 416934 125354 185332
17429 185332 151455 521834 50833 101642 233279 486586 377991 299754 266163 144297
17419 144297 354076 407000 175966 369163 237333 286876 448727 252121 165417 174435
17409A74435L60672j39032A90319J07724A25389K13787H1574a77455B78056d771
17398a35890B26974G418L31505P1422E6631L80994m5218H7010a04625C31431H5970
17386D26244m451J77642k96220l801r8401L19838A39078E7785J30400J57262A07017
17374B60043a46353A61847B2785K2325J8891J28535L20159B22261J2890i1305
17363B13343J31826P3544P352d9119C38776A17636J2928N0387K62845G4770J05433
17352A80203J69004K7656j83082J63478B9558L78277A64178J82567m9405n0127
17342B47213L10177I1948K09802R6600j91691J10633l7913n0737O3818K1677I7132
17330A84923J24659K22382l310A28164E7250O5737J29254K33058k07664a14843
$$ plain form
17409 174435 535107 396075 190319 298043 125389 339176 81574 -177455 278056 -4771
17398 -135890 226974 7418 338923 410345 56631 437625 392407 87010 -104625 331431 85970
17386 426244 421793 599435 303215 299414 201013 520851 139078 57785 188185 345447 107017
17374 260043 -146353 161847 22785 45110 64001 192536 512695 222261 235151 -91305
17363 213343 345169 418713 426065 -49119 338776 117636 130564 180951 443796 74770 180203
17352 180203 349207 376863 193781 357259 29558 407835 164178 346745 297340 247213
17342 247213 557390 91948 301750 398350 206659 317292 279379 228642 292460 314137 97132
17330 184923 309582 531964 528654 128164 57250 122987 252241 485299 277635 -114843
17319B03333J38674K05765B37770J68869A64722O5387J7834F5701J91382j2394
17309B44689o2778L51139j68268j615J21554p6385A56253K18077A61646J2913
17299A74559j4465k5467K44400j51762N9647K26744J28500B95583K63214A55353
17288A53377K09992n869J8829J35388A98280R6460p8920Q7721K93454g3232A86819
17276a3142C71730j54138o0641O2451L18391o5556A41779L33298l3438O6924j72983
17265C35580L05473l13673j10822K16869B12187j03298M80767a0095D73054k17074
17255B55980o3953K33791L03703B10968J34291M0833j79085K93977A4689L73205
17245C87894m0673p929A3140O48675j86464N0983M8098A99226L17566k10781J68224
$$ plain form
17319 203333 342007 547772 237770 406639 164722 230109 247943 65701 257083 244689
17309 244689 181911 533050 364782 363167 484721 408336 156253 374330 161646 174559
17299 174559 160094 134627 379027 227265 286912 513656 642156 295583 558797 155353
17288 153377 363369 357500 376329 511717 198280 294740 215820 303541 596995 -73232 186819
17276 -13142 371730 217592 156951 219402 537793 472237 141779 475077 441639 508563 335580
17265 335580 641053 327380 216558 433427 212187 108889 589656 -10095 473054 255980
17255 255980 192027 425818 729521 210968 345259 386092 207007 500984 14689 387894
17245 387894 347221 339292 13140 661815 475351 526334 574432 199226 516792 306011 474235
17234D74235K3410A22958N00111I64K27519j2192L45946j17678J92599j96293
17224D40865A44576Q4991O3008o1401j9220J68578k9455j00980J10372m664J34673
17213D90478j56516J74467j9263o8530J56702j52188J82838k11653K10210m7087
17203E59458j47503A59833L58758m7604I7486O0168K45497J19171j90102M2343
17193C74563A83002M77823N9057l04388J74899q2099B24763J70335J50483Q7178
17183F32759k7780j6181A42674k5895J32154J76432j92736K22561P1712j56121
17173C70781M02129C60814J23635O5716K5737O7220r58j58598l0136r4782K53586
17162F12234j08678J71242K7454r9844j34659j05757J85754K69140B13431N11840
$$ plain form
17234 474235 497645 122958 623069 964 228483 216291 562237 444559 637158 440865
17224 440865 144576 229567 292575 231174 211954 380532 351077 250097 360469 355805 490478
17213 490478 333962 508429 489166 420636 577338 425150 607988 396335 606545 559458
17203 559458 411955 159833 518591 470987 97486 157654 403151 522322 332220 374563
17193 374563 183002 660825 719882 415494 590393 508294 224763 395098 545581 632759
17183 632759 604979 588798 142674 116779 248933 425365 232629 455190 526902 370781
17173 370781 772910 360814 484449 550165 575902 643122 642164 483566 453430 358648 612234
17162 612234 503556 674798 702252 602408 467749 361992 547746 816886 213431 725271
17152G25271J23205j314m14099J30289J1988k42808J90066K59103o2826r0520
17142F28355k62723L53724B77416L27361j04733J17713J82533j36334k57274K83698
17132F90380C41286J88696J89478B86228O17858l78347J10226r3462k49113K84535
17122E77925j95161m3377K20374K10998j45942J73839J93397j79985k44217o9636
17112D98215L6068L11944k46428n9009N48357D63961J19317Q7556L17746m41346
17102E47234p005j48614K99529j75072M8248k61293M28719j44970O7269Q6259
17092G40304K10066k70252L68576m17464n4232J25704L2454L25853j74283J96553
17082A083279k95903J45893j86810j72148r1715J53596K70077K16963l97774k0009
$$ plain form
17152 725271 848476 847162 433063 563352 575340 332532 522598 781701 718875 628355
17142 628355 365632 719356 277416 604777 500044 617757 800290 663956 406682 690380
17132 690380 341286 529982 719460 286228 904086 525739 635965 542503 293390 577925
17122 577925 382764 339387 559761 770759 624817 798656 992053 812068 567851 498215
17112 498215 534283 846227 599799 540790 1089147 463961 583278 670834 988580 547234
17102 547234 540229 391615 691144 516072 564320 303027 731746 586776 654045 740304
17092 740304 950370 680118 1048694 631230 576998 702702 735156 1061009 886726 1083279
17082 1083279 787376 933269 746459 574311 482596 636192 906269 1123232 725458 705449
17072G05449L2212r1494L21298J55686m10280J65277l17494K79131j15368L24100
17062A048517l2020k52537L72145m89955K61403m6372j4316J86421k44314M9859
17052H38831j43430M36932j97892K45643l5089j10428k9410P8458p0494j28635
17042H84486N1827k8738j03298K29003k60626P386L96217l38942K46356j26704
17032I56967R7721j04432k9576M2674M8366k38342K62597j82085K93811n42013
17022F05688K41526J81464P4528q7172J91216j4317r4744N623j09688J10941L13659
17011A418724j97510j90451R8861k27018K60166K7110J8955R2957j93904J21866
17001A229756K08079r0399m4430k17154K57007M5830K3838j68001J93211n7066
$$ plain form
17072 705449 737661 646167 967465 1123151 712871 878148 560654 839785 724417 1048517
17062 1048517 1016497 763960 1136105 646150 907553 861181 846865 1033286 788972 838831
17052 838831 695401 1132333 934441 1180084 1144995 1034567 1005157 1083615 1013121 884486
17042 884486 936313 907575 804277 1033280 772654 780040 1176257 837315 1083671 956967
17032 956967 1054688 950256 920680 963354 1011720 773378 1035975 853890 1147701 605688
17022 605688 847214 1028678 1103206 1016034 1207250 1192933 1098189 1103812 994124 1105065 1418724
17011 1418724 1221214 1030763 1129624 902606 1162772 1189882 1208837 1301794 1107890 1229756
17001 1229756 1437835 1347436 1303006 1085852 1342859 1388689 1412527 1244526 1437737 1380671
16991A380671o865L04661n82908N40428l54549K76070q4248j50721k6550R7835
16981A393824N3258j92648L70346j51756k85885L42856J40164m32320J47729K24415
16971A609983m38582J89551M9865M90464m40579J33314K2046J43154k3262j31507
16961A604447J88950K9117m1082K133j70615M01928j69013M63795p49737j3828
16951A546095j40102K86752M37467l68721J91595l44764P0032L75810P593q5979
16941A975778J20818j6129k57522K34812p1772N6464L74834j52511O9079l2249
16931B301602m2920K03575k78049J40361k97509J15632K05585R2642n9156Q2422
16921B464185p0777j67447K1143J83282L0148P781K26170j90502K91670k41130
$$ plain form
16991 1380671 1373806 1678467 1095559 1635987 1281438 1557508 1473260 1322539 1295989 1393824
16981 1393824 1447082 1254434 1624780 1473024 1187139 1529995 1670159 1237839 1385568 1609983
16971 1609983 1171401 1360952 1410817 1901281 1460702 1594016 1616062 1759216 1735954 1604447
16961 1604447 1793397 1822514 1781432 1783565 1612950 2014878 1845865 2309660 1559923 1546095
16951 1546095 1405993 1692745 2130212 1761491 1953086 1608322 1678354 2054164 2061757 1975778
16941 1975778 2096596 2080467 1822945 2057757 1985985 2042449 2417283 2264772 2333851 2301602
16931 2301602 2258682 2462257 2184208 2324569 2027060 2142692 2348277 2440919 2381763 2464185
16921 2464185 2393408 2225961 2247104 2430386 2460534 2468315 2694485 2503983 2795653 2554523
16911B554523r7992O09087l68653q2592N20941j17271j37490k21492N25734j30922
16901C053873k01358m5359K04555J44107j03242k7450J25192M9338k83093M3360
16891B959923N09891m98944K15597L79035K0786L431k89779L92966p973J00930
16881C785863j44333j73612J54447k71859M01305N76011j67592L17351j96146
16872D281435j08266L39094m7319l90950M78486Q085l0684j0670o8584K76040
16862D726667k53994J53427L64451p2736J04132k25070M46061O0682j68238K33015
16852E368397J96258j97106J04671J43401M47357k84887J17953M41117m26829
16843E910332M40039j85972M01343j83644K66312m9569K70099P3404J26141K92929
$$ plain form
16911 2554523 2456531 3065618 2696965 2614373 3135314 3018043 2880553 2659061 3184795 3053873
16901 3053873 2852515 2807156 3011711 3155818 3052576 3025126 3150318 3199656 2916563 2959923
16891 2959923 3469814 2970870 3186467 3565502 3586288 3589719 3299940 3692906 3684933 3785863
16881 3785863 3641530 3467918 3622365 3350506 3751811 4327822 4160230 4477581 4281435
16872 4281435 4173169 4512263 4464944 4073994 4552480 4560565 4529881 4519211 4450627 4726667
16862 4726667 4472673 4626100 4990551 4917815 5021947 4796877 5242938 5303620 5135382 5368397
16852 5368397 5564655 5367549 5472220 5615621 6062978 5778091 5896044 6337161 5910332
16843 5910332 6350371 6164399 6565742 6382098 6648410 6598841 6868940 6942344 7068485 7361414
16833G361414k52349K15577L85865j27713N42801n3552N02045m53597L3742L15664
16823H469897J50286L20607j26883K30566K93693O7466J22041J30331L18273J75247
16813A0151524k1732J02869O17732l0687M02166L99091p6086L43804L95129P2388
16803A2356198L24262M31088L81500K71795l3915R29991r7041j78148N91497M54882
16793A5432109L66029K57762L02590N11766K68952L70947P58109N62103J72004
16784A9002371N71354O00081M96161L71350N70243N10522P76317P31254O51542
16775B4281195M34958N90575O12433Q77207O70194J107879P17290P72437J198243
16766C1262411R05218R68100P20527J116037Q56681J439775R98004J287296J013775
$$ plain form
16833 7361414 7109065 7324642 7710507 7582794 8125595 8072043 8574088 8120491 8154233 8469897
16823 8469897 8620183 8940790 8813907 9044473 9338166 9405632 9527673 9658004 9976277 10151524
16813 10151524 10129792 10232661 10850393 10819706 11221872 11620963 11544877 11888681 12283810 12356198
16803 12356198 12680460 13111548 13493048 13764843 13730928 14660919 14563878 14385730 14977227 15432109
16793 15432109 15798138 16055900 16358490 16870256 17139208 17510155 18268264 18830367 19002371
16784 19002371 19573725 20173806 20669967 21041317 21611560 22122082 22898399 23629653 24281195
16775 24281195 24716153 25306728 25919161 26796368 27466562 28574441 29291731 30064168 31262411
16766 31262411 32167629 33135729 33856256 34972293 35828974 37268749 38266753 39554049 40567824
16757D0567824J304528J779412J337560J480462J272124J466369J553095J416607
16749E2177981K035662J538404J844767K062711J496974K064319J760775J961048
16741F6942641K144344J812830K266964J769426K257656J630592K188659K152486
16733H3165598J645691J488206K293708J516857J495123J778698P29457J212560
16725I5325898J112938N82156P73143O25642P5818M6541k65562m73697l01151
16716I7501726j062707q87992j164459q27622j385610j618578j421899j857031
16708H7275828j761337k335262j653606j955155k016353k037999k263293j847426
16700G1405397j999135k074977k181178j643241k216072j688403j848844j644253
$$ plain form
16757 40567824 41872352 43651764 44989324 46469786 47741910 49208279 50761374 52177981
16749 52177981 54213643 55752047 57596814 59659525 61156499 63220818 64981593 66942641
16741 66942641 69086985 70899815 73166779 74936205 77193861 78824453 81013112 83165598
16733 83165598 84811289 86299495 88593203 90110060 91605183 93383881 94113338 95325898
16725 95325898 96438836 97020992 97794135 98419777 98495595 98542136 98276574 97802877 97501726
16716 97501726 96439019 95551027 94386568 93558946 92173336 90554758 89132859 87275828
16708 87275828 85514491 83179229 81525623 79570468 77554115 75516116 73252823 71405397
16700 71405397 69406262 67331285 65150107 63506866 61290794 59602391 57753547 56109294
16692E6109294k063546j904102j336981j654587j136872j825624j626282j488255
16684D3073045q95961j515810j300956j135161j365999j089842j383033j062420
16676C3323863j035394m81471j064728q53258q57636r21516p76570o66151q96093
16667B5771046m46998j063669n48003p28153p25766l24814n69165r40472l37998
16658B0086008n96432l42042k41543n41977o16629o02903n77906k143o06820m77017
16648A5480596R1348p17490l11834k25977l31741m43622q5606m67156n06071M7947
16638A2530394k67754l80048l59987p0008q3311k81278j95962l61626j14134k51049
16628A0165237o06913P0506j03785k42746k01738k64527K00809m28191j85159
$$ plain form
16692 56109294 54045748 52141646 50804665 49150078 48013206 46187582 44561300 43073045
16684 43073045 42177084 40661274 39360318 38225157 36859158 35769316 34386283 33323863
16676 33323863 32288469 31806998 30742270 29889012 29031376 28109860 27333290 26667139 25771046
16667 25771046 25324048 24260379 23712376 22984223 22258457 21933643 21364478 20424006 20086008
16658 20086008 19489576 19147534 18905991 18364014 17747385 17144482 16566576 16564433 15957613 15480596
16648 15480596 15571944 14854454 14542620 14316643 13984902 13541280 13455674 12988518 12482447 12530394
16638 12530394 12262640 11882592 11522605 11452597 11369286 11088008 10892046 10530420 10416286 10165237
16628 10165237 9558324 9628830 9525045 9282299 9080561 8816034 9016843 8588652 8403493
16619H403493k97221R9554j28729j30789k91814J50908n40908J03901p0398m64604
16609F833393K7238K3154k68695L57372l65257j28411l04927J77353j55944l71589
16599E823687L38675k71762J6358l53981J32037l24399J69037q8794O5317k9224
16589E476951n94426J04470j4678j57730K8666J14808l11075N3178m34177J53049
16579D419036j92255L94966m56166J82098l82477K43291j89753q6188J4543J45184
16569D092279j25310j06837k7100k87644O7708J68135l30972J50208q3770k09050
16559C307647L41804n27231M50434m92533K59346J45942l50782K17582k46123
16550C106086J62645J75753l84874J96013m05105L9828K06644j37504m19854Q9593
$$ plain form
16619 8403493 8106272 8205826 8077097 7946308 7654494 7805402 7264494 7368395 7297997 6833393
16609 6833393 6860631 6883785 6615090 6972462 6607205 6478794 6173867 6351220 6195276 5823687
16599 5823687 6162362 5890600 5906958 5552977 5685014 5360615 5529652 5440858 5506175 5476951
16589 5476951 4882525 4986995 4972317 4814587 4843253 4958061 4646986 4700164 4265987 4419036
16579 4419036 4226781 4621747 4165581 4347679 3965202 4208493 4018740 3932552 3947095 4092279
16569 4092279 3966969 3860132 3833032 3545388 3613096 3781231 3450259 3600467 3516697 3307647
16559 3307647 3649451 3122220 3572654 3080121 3339467 3485409 3134627 3352209 3106086
16550 3106086 3268731 3444484 3059610 3255623 2850518 2890346 3096990 2959486 2539632 2629225
16540B629225M51139l16671k2157j38004k23431K15489j30178K06786j30443k65164
16530B276591K67821j66100j17544k1585K99026l15474Q2670J22369L8228l5800
16520B430202q9885k09582K0766k01102L95122m72980K52065J02960J74871j88461
16510B213976k70964K12962j65868k49742L21226k25990O6381j8598M4291j81751
16500A745923M9891j89684J18854j35388L37461k59239J8795N8276J8196P2244
16490A835329l83383K65331Q9241j47742P7673j4360J01559j99417q8736P3081
16480A608576N3692k20408r9753K70598o1233K39020k88887o9493q7128J30683
16470A475667m1061j84796K1087K11936J13975P945k75054M09987n50854J09198
$$ plain form
16540 2629225 3080364 2763693 2741536 2603532 2380101 2595590 2465412 2672198 2541755 2276591
16530 2276591 2544412 2378312 2260768 2239183 2538209 2222735 2305405 2427774 2466002 2430202
16520 2430202 2340317 2130735 2151501 1950399 2345521 1872541 2124606 2227566 2402437 2213976
16510 2213976 1943012 2155974 1990106 1740364 2061590 1835600 1901981 1883383 1927674 1745923
16500 1745923 1795814 1606130 1724984 1589596 1927057 1667818 1686613 1744889 1763085 1835329
16490 1835329 1451946 1717277 1806518 1658776 1736449 1722089 1823648 1624231 1535495 1608576
16480 1608576 1662268 1441860 1342107 1612705 1551472 1790492 1501605 1432112 1344984 1475667
16470 1475667 1434606 1249810 1270897 1482833 1596808 1604753 1329699 1739686 1188832 1298030
16460A298030j86133J78164k55678Q4813J80456J29053k58104L49353l27361M77793
16450A670386o02423K35582r7012J34469j06005k34869K40450j64255l14071L48679
16440A110931k20736M58400l66074J91336L74780m97129j78923J32050k2182J96373
16430A178826R1915n3355m15104K03231J13427m00093N60708l31134K54538l03238
16420H99721j94510L63450p7503D88667N32388m30092L46594J7988K31619l78521
16410H08643M71482m52306l5121l954r0815J50561J35921l88383N0594K86961
16400I33583r1595O0393j63553J82196j00250j37334K14621R2502R1179j18671
16390I63071k54895L63448D27893K29418K79471j87384K19156m45203Q450J33719
$$ plain form
16460 1298030 1111897 1290061 1034383 1119196 1299652 1428705 1170601 1519954 1192593 1670386
16450 1670386 1067963 1303545 1206533 1341002 1234997 1000128 1240578 1076323 762252 1110931
16440 1110931 890195 1348595 982521 1173857 1548637 1051508 872585 1004635 982453 1178826
16430 1178826 1270741 1217386 802282 1005513 1118940 718847 1279555 948421 1202959 899721
16420 899721 705211 1068661 991158 488667 1021055 590963 937557 955545 1187164 808643
16410 808643 1280125 827819 792698 788744 697929 848490 984411 596028 646622 933583
16400 933583 841988 902381 738828 921024 820774 683440 898061 990563 1081742 963071
16390 963071 708176 1071624 427893 657311 936782 749398 968554 523351 531801 665520
16380F65520L09629j62681P2292j65056j24961q9694K28022p0823J65571j64431
16370F63388J42923k63624L824K29929l5493Q7272j19858B33378P92936m97839
16360E28475L67401l1103k02697k06847J72711k48273O0291L15396J85006j50737
16350G89623n5619k11460K51170B66150j00520M38032J29393r1464k6138K47692
16340H63145k76165J43404L2053l71571L25979j7705k73334Q4115L27886k15256
16330F22551j19156k7749K79448N5976l70106J35740P8238j09809B32321L04412
16320E36733J0392J79339J24269D11804L28882l16137J57149o6907N0502l692
16310E61601j97077J04644l9567k02771J41230J7954n6640J58176J07269j31486
$$ plain form
16380 665520 975149 812468 884760 719704 594743 505049 733071 662248 827819 663388
16370 663388 806311 542687 546511 776440 740947 828219 708361 233378 1026314 528475
16360 528475 895876 864773 662076 455229 627940 379667 439958 755354 940360 789623
16350 789623 734004 522544 773714 266150 165630 603662 733055 641591 615453 863145
16340 863145 586980 730384 762437 390866 716845 699140 425806 509921 837807 622551
16330 622551 503395 475646 755094 811070 440964 576704 654942 545133 232321 536733
16320 536733 547125 726464 850733 411804 740686 424549 581698 514791 565293 561601
16310 561601 364524 469168 429601 226830 368060 386014 329374 487550 594819 463333
16300D63333k2360Q389o7366e0365C87350o9346n2607P065K76074j10958k65j932
16288D35381j78307J14239Q5254B26163J12126J61414j18679O2112A75856L38937
16278E14793A86898K94349j72913n7509F5220M79878K74239l12979J77171l10867
16268C72662R9564j90922A38700F5826K00367K37154G6095M67642k69146K54663
16258E29254j62527K66887Q7667C20807J27388k153j18405O0144m1753N381K40248
16247E91657k13164o2447a50B99676L24363k14173j9715o1137a97314C03848j31565
16236A72283K09027K41615A26679L3937J62068o5895L43112k73886l2790l830
16226B89395K40881B40109m0999J46262A69167J21916m5442K8192J64447j79523
$$ plain form
16300 463333 440973 449362 381996 -50365 387350 318004 265397 272462 548536 437578 437313 435381
16288 435381 257074 371313 456567 226163 338289 499703 381024 443136 175856 514793
16278 514793 186898 481247 308334 250825 65220 545098 819337 506358 683529 372662
16268 372662 472226 281304 138700 65826 266193 503347 76095 543737 274591 529254
16258 529254 366727 633614 721281 320807 448195 446042 327637 387781 346028 351409 591657
16247 591657 378493 316046 -150 299676 624039 409866 390151 329014 -197314 303848 172283
16236 172283 381310 622925 126679 160616 322684 256789 599901 326015 293225 289395
16226 289395 530276 240109 199110 345372 169167 291083 245641 273833 438280 258757
16216B58757a5675B30417A8860J015N71711E7229K71572j28073N0757R4793A11753
16204A62738R8386N3019n8842Q9183k6485j02380g36B14619J40207K15052G7985
16192B46344O8755k652J67602c7155B68414J53139A87267p2379J30661N5211b996
16180C37138j46757j8476n1051B2020J84689J56687G4191K01669A30286J72120
16170C02406k3045b28974J9174E25095A91339N6088A23541J41600b3251A16711
16159A85469M7676q3248p0847G968L25364A8828b5519G4564J42260L0683l7704
16148B09803K06082q2869k1448j19861n3555a84480C47627A67045J50455j00685
16138B16815n769M2315j687p5959f3421E08477j47693A14252E3220K91365A3922
$$ plain form
16216 258757 -15675 230417 18860 19875 591586 57229 328801 200728 251485 346278 111753
16204 162738 261124 314143 255301 344484 317999 215619 -736 214619 354826 569878 77985
16192 246344 315099 312447 480049 -37155 268414 421553 187267 114888 245549 300760 -2996
16180 337138 190381 171905 120854 22020 206709 363396 74191 275860 130286 302406
16170 302406 279361 -228974 -209800 525095 191339 247427 123541 265141 -23251 116711
16159 185469 233145 149897 79050 7968 333332 18828 -25519 74564 216824 247507 209803
16148 209803 415885 333016 311568 191707 138152 -184480 347627 167045 317500 216815
16138 216815 211046 253361 251674 175715 -63421 508477 360784 114252 53220 344585 13922
16126G2481k5665J45530J44562a90908G4973j232L320J09191J10720q3928O2556
16115B75600k8908p8660p7792J4441n0873J28890a31370d4195A13511k3193K84591
16104C74909e21062C77409A29119I528b21215I6867J9210a6108A58237J20273
16094B78510K91206A34641a48977f8675D80171B03132E5553n042J17006L1502
16084A99019J01404L3384j21623b8193D93974A08911A4889Q8560m9760j6686J34904
16073A71907l0237K64098b51605a25471a6278B57156a25380A58849m2686J56104
16063B72267O094a2535n2323C06777a10457A64964G1360P8882C8854K20025a46547
16051B63180D1927P381L4108b31210A6204b34801A60138a05828K2566H2156J17088
$$ plain form
16126 72481 46816 192346 336908 -190908 74973 73741 77061 186252 296972 213044 275600
16115 275600 246692 168032 90240 104681 53808 182698 -131370 -44195 113511 90318 374909
16104 374909 -521062 377409 129119 9528 -221215 96867 116077 -16108 158237 278510
16094 278510 569716 134641 -148977 -68675 480171 203132 55553 50511 167517 199019
16084 199019 300423 333807 212184 -28193 493974 108911 14889 103449 53689 37003 171907
16073 171907 141670 405768 -251605 -125471 -16278 257156 -125380 158849 116163 272267
16063 272267 278361 -12535 -64858 306777 -110457 164964 71360 150242 38854 258879 -146547
16051 263180 41927 49308 83416 -231210 16204 -234801 160138 -105828 -83262 82156 199244
16040A99244E1086f9321j46770h0177C14717m8819A29708a94961B37996a02012
16029a00217E2271b32551d5628H1691b04031B18930l2981K0547A02094R9538r2678
16018A08954M1791j5428P6844h1359B96691A2538a35823G5174j2214d811r2290
16007i7101b1358A54926f8063A72140a680C74702D0540b95652a05698C46988M8708
15996C95696D5667a046k78009B61267O1879b01563H1622J93167K59657M96213
15986A030659M15276r3660R0863l17079l42376j99028k31508a0272A96038k7384
15976A68654R8417d3934A40467g3500j1834A203K42308A4248J55407L72037B08616
15964A55083B073a98159a5691j38704B46193m7052a1184k611k29018f2824F0929
$$ plain form
16040 199244 51086 -69321 -216091 -80177 314717 265898 129708 -194961 237996 -102012
16029 -100217 52271 -232551 -45628 81691 -204031 218930 185949 206496 102094 201632 108954
16018 108954 150745 135317 212161 -81359 296691 12538 -135823 75174 62960 -4811 -97101
16007 -97101 -21358 154926 -68063 172140 -1680 374702 40540 -295652 -105698 346988 395696
15996 395696 45667 -1046 -279055 261267 323146 -201563 81622 274789 534446 1030659
15986 1030659 1445935 1352275 1443138 1126059 783683 584655 353147 -10272 196038 168654
15976 168654 267071 -43934 140467 -73500 -85334 1203 243511 14248 169655 541692 208616
15964 155083 2073 -198159 -15691 -154395 246193 199141 -11184 -13795 -242813 -62824 60929
15952a22533d8265A44949a29243o7609d4132B62431g0084A8856J14248N7680F8473
15940C38165a74827P5928A13924i9261M3037A15942a74140d3749P661A50939f6025
15928c8148C6761a98168j7050b6697D5806k1981K0512Q768c4202H2240b26270
15916H3935g1819A13911g7641A29251a30383a8697B40040C0322d1228l31495G8746
15904B03731e5314J541A48169a0093A1074K6206A1256a6199B30628B6544a09665
15892I3742k3315R0865L00914a01631G2866K80293O0396j86764A11547R7574e4914
15880c5668A65455a35383k1259e0395a010k5906m3225A29950c44157C86170I2587
15868H3861f0979q9503B94912A32688N6548a98666f7779c187k22610J01528m6672
$$ plain form
15952 -122533 -48265 144949 -129243 -196852 -44132 262431 -70084 18856 133104 190784 68473
15940 338165 -174827 -98899 113924 -99261 -56224 115942 -174140 -43749 -36088 150939 -66025
15928 -38148 36761 -198168 -215218 -26697 45806 23825 44337 53105 -34202 82240 -226270
15916 83935 -71819 113911 -77641 129251 -130383 -18697 240040 30322 -41228 -372723 78746
15904 203731 -55314 -53773 148169 -10093 11074 37280 11256 -16199 230628 26544 -109665
15892 93742 70427 161292 462206 -101631 72866 353159 413555 226791 111547 209121 -54914
15880 -35668 165455 -135383 -156642 -50395 -1010 -26916 -70141 129950 -344157 386170 92587
15868 83861 -60979 -150482 294912 132688 189236 -198666 -67779 -3187 -225797 -124269 -170941
15857a70941A17738J07065a87904C52374E5912A0822a5470F3393a080B18899a95003
15845c10612a00155c3683j3435A41590E4332h1636C08524a53628I4033C562g9531
15833E3424a36976G4961J43713I373f4450j39367i8043J7382k48212o8864a23805
15821F1990a62793K2224j07394L5056P1456A91027q5722J23613E6342e2312G738
15809c60918I3740a53398e6946C04312D0122J29549a01792A02636k7353k6649
15799D8634d04033A36303a29578A63646F158g4183f123B5974h0943A5844e1591
15787B08204p1311i1037B5249A0683K1466J59649a07770F074a13781A38451a12436
15775C7648K00795D4436g4928A61830b8733l76534a81786A07792f7092k2151B26627
$$ plain form
15857 -170941 117738 224803 -187904 352374 55912 10822 -15470 63393 -1080 218899 -195003
15845 -310612 -100155 -33683 -47118 141590 54332 -81636 308524 -153628 94033 3562 -79531
15833 53424 -136976 74961 218674 9373 -64450 -203817 -98043 -80661 -328873 -397737 -123805
15821 61990 -162793 -140569 -247963 -212907 -141451 191027 105305 228918 56342 -52312 7738
15809 -360918 93740 -153398 -56946 304312 40122 169671 -101792 102636 75283 48634
15799 48634 -404033 136303 -129578 163646 6158 -74183 -6123 25974 -80943 15844 -51591
15787 208204 136893 -91037 25249 10683 32149 191798 -107770 6074 -113781 138451 -112436
15775 37648 238443 44436 -74928 161830 -28733 -405267 -181786 107792 -67092 -89243 226627
15763G9671a29732e448B21819q4739d1058g250A27241N5971A0200b61511I9574
15751B50439b32776M4351m8697I5041f8766A80972O9531a3388k9482n6291L9623
15740e9538a254k95501g2915K8889I4876g7721a439j67488e1761H8676a39290
15728h5794A43940a35603B3673J4476P3490J01108b9763l1085o1866k3544f9862
15716B42898a69044A09657Q420a3255B03716g461j71559b3414F1566J036k5505
15705C7097J27139F3222c11609I4330b45154J22064d5448j14322a1441o451m57845
15694d75737i0517A29171i7350j11360B7619J03466J19974r9206b33788o6820
15684c00608A39469K7489M6993c48629b840C7883K25647a60422n8626L549C04387
$$ plain form
15763 79671 -129732 -5448 221819 137080 -41058 -7250 127241 183212 10200 -261511 99574
15751 250439 -232776 -188425 -237122 95041 -68766 180972 250503 -13388 -42870 -99161 -59538
15740 -59538 -1254 -296755 -72915 -44026 94876 -77721 -1439 -168927 -51761 88676 -139290
15728 -85794 143940 -135603 23673 38149 111639 212747 -29763 -60848 -122714 -146258 -69862
15716 242898 -169044 109657 118077 -13255 203716 -7461 -179020 -23414 61566 62602 37097
15705 37097 164236 63222 -311609 94330 -245154 -123090 -45448 -159770 -11441 -17892 -475737
15694 -475737 -90517 129171 -97350 -208710 27619 131085 251059 151853 -233788 -300608
15684 -300608 139469 166958 213951 -348629 -2840 37883 263530 -160422 -219048 -215499 304387
15672a07631J727G4927P8980P1512N1037a23829q3503j75420A353J31459c8585
15660B61428c56270D0375L5608d02773J42645K7368g0974A6630J2111a90852P2303
15649a18549b447H113b19301i7918B27251E7025a08285L6903J7981Q069B90825
15637H5530f4759B32206a9422k95550J44641K8787O5516r8488C10839p1477c0765
15625A15947a25062B15846I6628J05444b2469B90273a6455k52005h766l39245
15615c48011C15424m8509a66144M3023L6135q5754C976a57116M0165A74787P1860
15604B46647A03554b71686a19977C1546O9529e8612k15835A00620a08893A47440
15593d9200B21403K4851a3478C82122A66776a17672B17003k6487r4238e0459j759
$$ plain form
15672 -107631 -105904 74927 153907 225419 276456 -123829 -207332 -382752 1353 132812 -38585
15660 261428 -356270 40375 75983 -402773 -260128 -232760 -70974 16630 28741 -190852 -118549
15649 -118549 -2447 8113 -219301 -97918 227251 57025 -108285 -71382 -53401 -45332 290825
15637 85530 -64759 232206 -19422 -314972 -170331 -141544 -76028 -174516 310839 239362 -30765
15625 115947 -125062 215846 96628 202072 -22469 290273 -16455 -268460 -8766 -348011
15615 -348011 315424 266915 -166144 -123121 -86986 -172740 3976 -157116 -116951 174787 246647
15604 246647 103554 -271686 -119977 31546 101075 -58612 -274447 100620 -108893 147440
15593 -49200 221403 246254 -13478 382122 166776 -117672 217003 190516 96278 -50459 -52218
15582e2218l1994k9757C4010R1245m9664Q3025a01043B28011F5150d2892j64081
15571b06973A46781a39295C2183g0177A40172q957a92685P3514A08986l3899C51
15559B69933F874d9325l4423j10474a2797A62103f6991k5956B00841a38247C1024
15547D575a42543F6626b81371i0840j37452G9650f4392A9527c41472A05733o42
15536A05091P6948h2540A22809K4272b62241D937J7233R173d0022A77830f1989
15524H0676a73314M0005l5521G4974J53672P648i3809B8820P1892d1152C63890
15512a42858B71138G9230J15436l5678a16264R892j28070A05235E0050J42224
15502A92274J9765j5545F5490J61348l681c0106D25023A53918R5334l4779O1556
$$ plain form
15582 -52218 -84212 -113969 34010 125255 75591 158616 -101043 228011 65150 -42892 -206973
15571 -206973 146781 -139295 32183 -70177 140172 131215 -192685 -119171 108986 75087 351
15559 269933 6874 -49325 -83748 -194222 -12797 162103 -66991 -92947 200841 -138247 31024
15547 4575 -142543 66626 -281371 -90840 -228292 79650 -64392 19527 -341472 105733 105091
15536 105091 182039 -82540 122809 147081 -262241 4937 22170 31343 -40022 177830 -61989
15524 80676 -173314 -133309 -168830 74974 228646 236294 -93809 28820 100712 -41152 363890
15512 -142858 271138 79230 194666 158988 -116264 -106372 -234442 105235 50050 192274
15502 192274 212039 196494 65490 226838 223157 -30106 425023 153918 249252 214473 276029
15491B76029m077E2717J43186b48612a08504B4662K82037q6141B8045p287M00583
15480D21341n4378b2653A27781n2902L24225K45411o5652J62420j71156j78547
15470C91580j33428q9470P9386Q5572a13468b8653A68398D4939h9701A45012a72637
15458E2079Q0132c12181H0010f8564K6957k7280n1318l185l007B08357e9108A90936
15445B99767r769J09001J81724Q17668O6921l63474j0876B77851j24963K05124
15435C58012d8854a8070A85676h7059B95155b84098I3257b87338J22072A15737
15424A66659e4282J30o7421H6534a00160G0648a9991k31234J05134j31300A92251
15412A63841E9452P84j3905j5916J78787a18461j46573K8768Q7616D1117b5426
$$ plain form
15491 276029 271952 52717 195903 -248612 -108504 24662 306699 220558 28045 20758 421341
15480 421341 366963 -22653 127781 74879 399104 644515 578863 741283 570127 391580
15470 391580 258152 168682 248068 333640 -113468 -28653 168398 44939 -89701 145012 -172637
15458 52079 132211 -312181 80010 -68564 -41607 -68887 -120205 -123390 -126397 208357 -59108 190936
15445 299767 289998 398999 580723 1398391 1465312 1101838 1090962 277851 152888 358012
15435 358012 -48854 -18070 185676 -87059 295155 -284098 93257 -287338 -165266 115737
15424 166659 -54282 -54152 -121573 86534 -100160 70648 -19991 -251225 -146091 -277391 192251
15412 163841 59452 60236 46331 30415 209202 -118461 -265034 -236266 -148650 41117 -25426
15400A85751K21110A2822b603A34943A0128e2688j81813Q0566K3092A72149d1462
15388I2921K38454d3197r0097B559R5099c96B00271D1625a18935N4543I3134K330
15376I5464L4846a6762H8012L37084L22136A14031L29382G1898J24344q0833j4220
15365A01189j1893L29908l8271B319K63947J10064j5639q8388j20838c144l8875
15354d2019D1314K62376R713h8312A92026J21538G9183J74768I4253J86765K9950
15343C10968O2868K05578n9644I7750K58357H982K46463j1246b4204j29577G8793
15331B25128O5765A04449k2344K35815J87491D3732a05608A44935L16623A64514
15320i2722I9289R5336a46131B78638d7242G5267k0208L42853j93457n2575F7358
$$ plain form
15400 185751 406861 12822 -2603 134943 10128 -52688 -234501 -153935 -130843 172149 -41462
15388 92921 331375 -43197 -133294 2559 97658 -396 200271 41625 -118935 -64392 93134 95464
15376 95464 130310 -16762 88012 425096 747232 114031 443413 71898 196242 115409 101189
15365 101189 89296 419204 380933 2319 266266 376330 360691 272303 151465 -3144 -42019
15354 -42019 41314 303690 313403 -88312 192026 313564 79183 253951 94253 281018 310968
15343 310968 373836 579414 519770 97750 356107 8982 255445 244199 -24204 -153781 78793
15331 225128 290893 104449 82105 317920 505411 43732 -105608 144935 461558 164514
15320 -92722 99289 194625 -146131 278638 -47242 75267 55059 397912 204455 151880 67358
15308C04771K83440B19402A00366B9313M6960E972i7571B16838J20429d9762B48071
15296a7998K07j22456Q707c6683A17280n111o594P5072m8304c32A0704a32031
15283A65725b52161b0614A33630K04879K03686a10432A20635a38449A83345J11736
15273B95081a33412A581K12526J13074c45835J72173F1182K50304A42335c08348
15262f8730j75385c8604A10146e2766D36812n4451A38971o4191J16095p4168b42910
15250B91549r6394l839A1614Q1114K57163j19514P2802q52M17121J011201n85634
15239A145015N82562k10010B54031R0242i5188k2964F4400J24644i4462j7268
15229a11730B87908j15588b11341j15272a09505M3G1500L8355O298R5625m711
$$ plain form
15308 304771 588211 219402 100366 29313 76273 5972 -97571 216838 337267 -49762 248071
15296 -17998 -17791 -140247 -131540 -36683 117280 112169 105575 180647 132343 -332 10704 -132031
15283 165725 -252161 -20614 133630 338509 542195 -110432 120635 -138449 183345 295081
15273 295081 -133412 1581 214107 327181 -345835 -173662 61182 311486 142335 -308348
15262 -68730 -244115 -38604 110146 -52766 436812 382361 138971 74780 190875 116707 -242910
15250 291549 195155 191316 11614 92728 349891 230377 303179 302327 719448 1730649 1145015
15239 1145015 1727577 1517567 254031 344273 -95188 -118152 64400 189044 -94462 -111730
15229 -111730 287908 172320 -211341 -326613 -109505 -109462 71500 109855 116153 211778 207067
15218B07067c3535l2054A22173J36626b24394B42580A8242c2400B46363F6606
15207H0789L3095L3698A5867i9066D8677i0136l931A18460l1526C108g6337E500
15194A42561b6963G6675K10461G7957C3466K51113a1657k16398C05600k4566a04389
15182C0850h3119A87607M38262A32218N5717a3040H7995N745c9764E86940l7908
15171E49032D5588L4033J96524m1836B8216L53067A55543a52294b6589A98359
15160B6567K08592a2927j52709B77033a34012C8431Q5718J41341a2931A86455
15149c55659B34798e9551a6958A48755C05a7032E1923J66561C5526J83501J40026
15138C59053A10129J92018a00935p2639A04647M843O8283q7713J51606B8187J36076
$$ plain form
15218 207067 -33535 -65589 122173 258799 -224394 242580 18242 -32400 246363 66606
15207 80789 113884 147582 15867 -99066 48677 -90136 -94067 118460 86934 3108 -76337 5500
15194 142561 -26963 76675 287136 77957 33466 284579 -11657 -228055 305600 281034 -104389
15182 30850 -83119 187607 625869 132218 187935 -13040 87995 93740 -39764 586940 549032
15171 549032 45588 79621 276145 234309 28216 381283 155543 -152294 -26589 198359
15160 26567 235159 -12927 -165636 277033 -134012 38431 124149 265490 -12931 186455
15149 -355659 234798 -59551 -16958 148755 305 -17032 51923 218484 35526 219027 359053
15138 359053 110129 302147 -100935 -173574 104647 109490 177773 90060 241666 28187 164263
15127A64263a55683B71416G6559A3516J43424K77666K7114L3118j86014J88108
15117D96932k28859p6591N1730A03566b6913C34066m8466a71009B41264a7837
15106f6781i868B38038A8620J08305A3697O039a6869A31605g1283A55087D1240
15094E47432k43663H2715m0423A0632N6295b3406D4096K5580J58383r4351K60807
15083C94515j67869N8745D40K45939p8347J73892a8680D16791b20762B17603I6293
15071B60541I7065K74376A46330J26774k1043p351d8096E2512J19381J55377A11511
15059I2068K99757n6085J22175G816K12541r8769J18978M2788K44350p5164j53105
15048B99435J24002m4296k4294D6825L30117J36051H3161K86423m4271N76278
$$ plain form
15127 164263 -155683 271416 76559 13516 156940 434606 461720 494838 308824 496932
15117 496932 268073 191482 243212 103566 -26913 334066 285600 -171009 241264 -17837
15106 -66781 -9868 238038 18620 126925 13697 19736 -16869 131605 -71283 155087 41240
15094 547432 303769 82715 42292 10632 66927 -23406 44096 69676 228059 133708 394515
15083 394515 226646 285391 440 246379 168032 341924 -18680 416791 -220762 217603 96293
15071 260541 97065 371441 146330 273104 252061 244710 -48096 52512 171893 327270 111511
15059 92068 391825 335740 457915 7816 220357 121588 240566 283354 527704 452540 299435
15048 299435 423437 379141 354847 46825 376942 512993 83161 369584 325313 901591
15038I01591C49222J14386M8042I6971K53063Q4186J94816K44153q0961M3247
15028H35475o4026J4247k96696J17001B53512J46406K31586J43669l9120B88740
15017A38985K83446j68478Q6324K2978L88400l50160K23300j70994j66126J23340
15007D11015L25292k19967J3674p5577A75461a4287B39775J24341J44105B39053
14996F49728p1014k52614H8961M99289A75895J38515j9763J78869r6988m9843
14986C26685R1186K08829B47915L56805R5864M2732J33808k64987L58027A92164
14975F17187r5025l3505J3929L49301p98C11687K15856B50557j4138p1050L99826
14964E65195J14531C27051o3714q4967H908J70988N0517L5634g365k3658B90014
$$ plain form
15038 901591 349222 463608 511650 96971 350034 434220 629036 873189 792228 835475
15028 835475 771449 785696 489000 606001 253512 399918 631504 775173 736053 288740
15017 138985 422431 253953 340277 363255 751655 401495 624795 453801 287675 411015
15007 411015 736307 516340 530014 454437 175461 -14287 239775 364116 508221 239053
14996 649728 578714 326100 88961 588250 175895 314410 294647 473516 376528 326685
14986 326685 417871 626700 247915 604720 700584 743316 877124 612137 970164 192164
14975 617187 522162 488657 502586 851887 851089 311687 527543 250557 236419 165369 565195
14964 565195 679726 327051 263337 178370 8908 179896 230413 266047 -7365 -31023 290014
14952B76404K30787j25873O0882A48659o8926L94072K21694k52525M66604k26852
14942F82726o1608k60305R506K22266j01436J07389k58773O07615k91725K24331
14932H79986l4642k66778N42281M19863k81507L83126P1704L06448j08939Q0032
14922A991574n67004R2676K80661J60436O00153L12236m21853o13842k81651J03439
14912A656825m13024m47391l9584l05865o2613k2111N1037j78603L5697p4076
14902B00292L39207n7076j34379J24165A13932j9937d2381A68917M27742j6211
14892E80448j33909l2511N9973j72514L93855j03048K42484K02634j93288J35747
14882I79871m4086j867K05587E18735L31455l29932N762J83296B87381L3471J05604
$$ plain form
14952 276404 507191 381318 442200 148659 79733 473805 695499 442974 909578 682726
14942 682726 621118 360813 370319 592585 491149 598538 339765 947380 655655 879986
14932 879986 845344 578566 1120847 1540710 1259203 1642329 1714033 2020481 1911542 1991574
14922 1991574 1424570 1517246 1797907 1958343 2558496 2870732 2448879 1835037 1553386 1656825
14912 1656825 1243801 796410 756826 450961 388348 366237 417274 238671 274368 200292
14902 200292 539499 482423 348044 472209 113932 93995 -42381 168917 596659 580448
14892 580448 446539 414028 474001 301487 695342 592294 834778 1037412 844124 979871
14882 979871 935785 933918 1139505 518735 850190 520258 526020 709316 287381 320852 426456
14871D26456j47314J7506K94360K318K38474J03547k55460L5372H6592P16112
14861H02704k12025A71742J31282J96140J58207k80551K56575j07279n6761m6461
14851D22894J58679L6236k38592N12740k63873J74133O08794l54411L09875j87516
14841A178959O2632k83029l11919R5985K17315m07595J55751p6159K35662D31262
14830E13522k49788K6313M36325k11069J32903o4538q3448J46599j61822J36498
14820F21495K12689j75936J24110M102r929l16861K67225j76797Q4255K628K23907
14809H60888n3060M0023K03353l8376l36458M1815r3736K24580n8172A97380L58221
14798E55601j24881K36629k75714j7061J21201J7781N691j98963J33912n923j93092
$$ plain form
14871 426456 279142 296648 591008 593326 831800 935347 679887 715259 86592 802704
14861 802704 590679 171742 303024 499164 657371 376820 633395 526116 469355 422894
14851 422894 581573 617809 379217 891957 628084 802217 1411011 1056600 1366475 1178959
14841 1178959 1241591 958562 646643 742628 959943 552348 708099 631940 867602 431262
14830 513522 263734 290047 726372 515303 648206 583668 500220 646819 484997 621495
14820 621495 834184 658248 782358 786460 776531 459670 726895 550098 634353 636981 860888
14809 860888 807828 847851 1051204 1012828 676370 718185 624449 849029 790857 197380 555601
14798 555601 430720 667349 391635 374574 495775 513556 519247 320284 454196 448273 255181
14787B55181L27868K92024l82137J73320q994L0681k24808M14075j78163l3570
14777F65477J34349K5073P1810q0493r1801J24471j64481J11535C78667J90456
14767E69123J01644k45835L06834B60695K76121j05056j47570L73028J97083j67767
14757F86534k0629k02301K2572J57524j59381R1826o6530m7966M0384j45028L03071
14746F60076L3104k24135Q7370J77396r9594k94336L5191L9915L49491J61151
14736I25629j80420K33068j05842k20126K03654M78291J00916L51810K35981j97258
14726A825703o0251n24138l0683l78950k33288M32535K3409j56839J25683l14863
14716G08318o993J66549r5450k37501J11048M43612k9836p3024J00428j7036q7195
$$ plain form
14787 255181 583049 875073 492936 666256 657262 687943 463135 877210 699047 665477
14777 665477 799826 824899 896709 816216 724415 848886 684405 795940 378667 569123
14767 569123 670767 424932 731766 260695 536816 431760 284190 657218 854301 686534
14757 686534 665905 463604 486176 643700 484319 576145 509615 461649 502033 357005 660076
14746 660076 693180 469045 556415 733811 634217 339881 375072 414987 764478 925629
14736 925629 745209 978277 872435 652309 855963 1334254 1435170 1786980 2022961 1825703
14726 1825703 1765452 1241314 1210631 831681 598393 1030928 1054337 897498 1023181 708318
14716 708318 701325 867874 772424 534923 645971 1089583 1059747 986723 1087151 1070115 982920
14705I82920L39220J10M15851J54541L6962k39398k84672k91812J4751l68868
14695G59605J66666j93901M416n0845j05845L23884K2272k79904J53654k64577
14685E35425K43898L7583o1934L55220k62188J47890m5671J59407m94629J51918
14675G66919q2475K7048R8077o7104J47791m4587p9144L69639j53251D16717M62356
14664H79073j36666J69162m2921l5311K88084l82801k10917P15210k98743M36371
14654A380541l95204L25234K12401p49468L73920k42202L680J48222q7158P0701
14644A040667J35639j30231r4596j91356J58267K65400J7491J22474j36698P4771
14634A261828P3443j32831j80816K08156k64781K23302k63661K73121O0582j87288
$$ plain form
14705 982920 1322140 1322250 1738101 1892642 1929604 1690206 1405534 1113722 1128473 759605
14695 759605 926271 732370 736786 685941 580096 903980 926252 646348 800002 535425
14685 535425 779323 816906 754972 1110192 848004 995894 950223 1109630 615001 766919
14675 766919 684444 711492 809569 742465 890256 845669 766525 1136164 982913 416717 879073
14664 879073 742407 911569 868648 833337 1121421 738620 527703 1242913 944170 1380541
14654 1380541 985337 1310571 1522972 773504 1147424 905222 908902 1057124 969966 1040667
14644 1040667 1176306 1046075 951479 760123 918390 1183790 1201281 1323755 1187057 1261828
14634 1261828 1335271 1202440 1021624 1229780 964999 1188301 924640 1197761 1258343 1071055
14624A071055J12186j60921O6050p1353q2697J52228L74892m65475P0335K81880
14614A348180J31135p8351j43105J81507j53736K08314k81324j08483k6862Q1500
14604A158775M0684r5785n2336P9089K10475K64454k96945M617K76841l82568
14594A207301J3957K31990N0460j95928K74076m36691L39181l30895J89808K26105
14584A569364n1231j66241K28226J52933l8952j83437L18443J11043j28943l04772
14574A506433J13116J88096k6983r2053m3784K50395j64784L14367q1901o6398
14564A896504K81079M9385m19913L10934K04690k79275K42305K63633j17762K74021
14554B705601K7108L55559J43427M23424P28020J275728K878914N356730J6536700
$$ plain form
14624 1071055 1183241 1022320 1088370 1017017 934320 1086548 1461440 995965 1066300 1348180
14614 1348180 1479315 1400964 1257859 1439366 1285630 1493944 1212620 1104137 1077275 1158775
14604 1158775 1199459 1103674 1051338 1130427 1340902 1605356 1308411 1313028 1589869 1207301
14594 1207301 1221258 1453248 1503708 1307780 1581856 1145165 1484346 1153451 1343259 1569364
14584 1569364 1518133 1351892 1580118 1733051 1694099 1510662 1829105 1940148 1811205 1506433
14574 1506433 1619549 1807645 1780662 1688609 1644825 1895220 1730436 2044803 1962902 1896504
14564 1896504 2177583 2226968 1807055 2117989 2322679 2043404 2285709 2549342 2431580 2705601
14554 2705601 2732709 3088268 3231695 3655119 4383139 5658867 8537781 13894511 30431211
14545C0431211J9035702B2342236H662570C710510q81017n95134k63492Q01778
14537B772645K381509j654772j585924k5279K3523j77298l95602O79619o8922
14528A949499j24133J50156j28582J79083j32165J49168l3768j60289K9715J90161
14518B068845J28722k47961L37983j12612l57343M46919J30061k95707O52889
14509B751796p55991L42400O7230l5243M01337m10876j52743N56306l29478J75597
14499B610335P9136l063M69798p70538L36056K12360R3375k29617m1035J46247
14489B903054J23801l204l1758P402L94778l67458P6555J96510k27249J36844
14479C209275j92319K59763r9784L5216L49126j21533l3772N0867m8966J33026
$$ plain form
14545 30431211 49466913 22342236 8662570 3710510 2829493 2234359 1970867 2772645
14537 2772645 5154154 3499382 1913458 1888179 1911702 1734404 1338802 2018421 1949499
14528 1949499 1825366 1975522 1846940 2026023 1893858 2043026 2009258 1848969 1878684 2068845
14518 2068845 2197567 1949606 2287589 2174977 1817634 2264553 2394614 2098907 2751796
14509 2751796 1995805 2338205 2405435 2370192 2771529 2360653 2207910 2764216 2434738 2610335
14499 2610335 2689471 2686408 3156206 2385668 2721724 2934084 3027459 2797842 2756807 2903054
14489 2903054 3026855 3023651 2991893 2999295 3394073 3026615 3103170 3299680 3072431 3209275
14479 3209275 3016956 3276719 3176935 3212151 3561277 3439744 3405972 3456839 3407873 3540899
14469C540899K48466k52742J28862q4002J92386J3312J2431J20593K03565k60162
14459C863608K99903l1575q3895L27897l57200Q03734l81554O1047l86761J43196
14449D258400J13565N03264m19596L59204j6656K86846K01697l34822q2895M41914
14439E310921N4759Q0957l04835K88643R1045L04166K88052m38611J29249n2846
14429E751500M04486j38475L8929K63613K17383O056M85568J90038J31181k48473
14419G101806K51347j68630J86268q8314O6455O4097o5532J73910M24464j4131
14409G931740m8899L27362K03520J10222K51462k95713K16775J25892J85977n9765
14399H948573j41427M12809Q9277L07861J05195j3338L14508J32569J60875K74815
$$ plain form
14469 3540899 3789365 3536623 3665485 3581483 3773869 3787181 3799612 3920205 4123770 3863608
14459 3863608 4163511 4131936 4048041 4375938 4018738 4822472 4440918 4501965 4115204 4258400
14449 4258400 4371965 4875229 4455633 4814837 4798181 5085027 5286724 4951902 4869007 5310921
14439 5310921 5365680 5446637 5141802 5430445 5521490 5825656 6113708 5675097 5804346 5751500
14429 5751500 6155986 6017511 6056440 6320053 6537436 6543492 7029060 7219098 7350279 7101806
14419 7101806 7353153 7184523 7370791 7282477 7348932 7413029 7347497 7521407 7945871 7931740
14409 7931740 7882841 8210203 8413723 8523945 8775407 8479694 8696469 8822361 9008338 8948573
14399 8948573 8807146 9219955 9309232 9617093 9722288 9708950 10023458 10156027 10316902 10591717
14389A0591717K9638L91922K28074K12528N43647O8629J93626K90513j92679M12929
14379A2770544k10067N93300J53839J37278M72496n7431O38837K37782J92858
14370A4929436O51431j66548Q70033k60371Q52602l92921O06525R4871M71945
14361A7657003L41810N28093K9671R08342Q5024K94992Q06861O34212M16915L40806
14351B2043729O12540O12216K20031Q32981L47211J001341K91928J123392K65726
14342B7351095R86050P58466O41558O82626J355822O53580Q78252J138184Q26902
14333C5272535J199938R75341J233253J311049R38906J262415J662022Q82528
14325D4737987K044352J580107J685351J610819K009770J508145K290143J969002
$$ plain form
14389 10591717 10621355 11013277 11241351 11453879 11997526 12066155 12259781 12550294 12357615 12770544
14379 12770544 12560477 13153777 13307616 13444894 13917390 13859959 14498796 14736578 14929436
14370 14929436 15580867 15414319 16284352 16023981 16876583 16483662 17090187 17185058 17657003
14361 17657003 17998813 18526906 18556577 19464919 19549943 19844935 20651796 21286008 21702923 22043729
14351 22043729 22656269 23268485 23488516 24321497 24668708 25670049 25961977 27085369 27351095
14342 27351095 28337145 29095611 29737169 30419795 31775617 32429197 33307449 34445633 35272535
14333 35272535 36472473 37447814 38681067 39992116 40931022 42193437 43855459 44737987
14325 44737987 46782339 48362446 50047797 51658616 53668386 55176531 57466674 59435676
14317E9435676J947453K317422K487558K421754K845622K593671L106398L082430
14309H0237984L665233L153080M453432L681398M066760M616803N104046N032241
14301A14010977N500909O182626N744718O755545O906470P651367P981243Q401525
14293A69135380R012796R515081J0064114J0600989J1502811J1830491J2599974
14286B44261636J3261241J3690979J4685971J4445188J5208553J5678193J5586060
14279C46817821J5811436J5597854J5280497J4282561J3212829J2272495R513325
14272D42788818M794767L035071K374185J188699l995026j598077n893810q767755
14264D33926872j0349982j1898689j3182729j4148980j5314565j5908389j6622860
$$ plain form
14317 59435676 61383129 63700551 66188109 68609863 71455485 74049156 77155554 80237984
14309 80237984 83903217 87056297 91509729 95191127 99257887 103874690 108978736 114010977
14301 114010977 119511886 125694512 131439230 138194775 145101245 152752612 160733855 169135380
14293 169135380 178148176 187663257 197727371 208328360 219831171 231661662 244261636
14286 244261636 257522877 271213856 285899827 300345015 315553568 331231761 346817821
14279 346817821 362629257 378227111 393507608 407790169 421002998 433275493 442788818
14272 442788818 447583585 450618656 452992841 454181540 450186514 448588437 442694627 433926872
14264 433926872 423576890 411678201 398495472 384346492 369031927 353123538 336500678
14257C36500678j6825324j6385159j5609213j5062028j4590572j3818933j3277396
14250B30932053j2542764j1980191j0390753r143700r789894r580086q200385
14243A59304280p554868p793024p259449o516022o507013n358668n231112n389580
14235A07694544m848761m665963m431154l871300l203189l884062l369674l096786
14227G6323655k948092k863768k882461k605094k364004k337207k134631j975481
14219E6212917j805953j916420j839205k156902j080622j814746o57870j717149
14211D3224050j587866j262135j375597r32227l75940j187688j180490j291410
14203C4030697j498352n29483m30819p28332r95332p92904j153290o67447p43833
$$ plain form
14257 336500678 319675354 303290195 287680982 272618954 258028382 244209449 230932053
14250 230932053 218389289 206409098 196018345 186874645 177084751 167504665 159304280
14243 159304280 151749412 143956388 136696939 130180917 123673904 118315236 113084124 107694544
14235 107694544 102845783 98179820 93748666 89877366 86674177 82790115 79420441 76323655
14227 76323655 73375563 70511795 67629334 65024240 62660236 60323029 58188398 56212917
14219 56212917 54406964 52490544 50651339 48494437 47413815 45599069 44941199 43224050
14211 43224050 41636184 40374049 38998452 38066225 37690285 36502597 35322107 34030697
14203 34030697 32532345 32002862 31572043 30843711 29848379 29055475 27902185 27234738 26490905
14194B6490905k31776o26232j055219n48915k61460q78770m86301o31387m68294
14185B1302551n51955k72409m52480n96085o16014k70868l27479l08626m54774
14176A7451861j08785p86203l42008l06270j58297M75384j294700j27619l17972
14167A4485391j84656m21128K23300p05087k93410k31176l42150K02070n05081
14158A2228073j22984m21054k31705n8951j08000n58300K54976m27581r7155j04966
14148A0352353o04155L86913k3738l57768k20251j28962N3003k69129l20731O1106
14138H928641l07990k19965K39591j55871l79531k07681J81000l9252k86855M1139
14128G793226l45103J01976R7740j86350l62117k22544M8861n03041K15228n5408
$$ plain form
14194 26490905 26259129 25632897 24577678 24028763 23767303 22888533 22402232 21770845 21302551
14185 21302551 20750596 20478187 20025707 19429622 18813608 18542740 18215261 17906635 17451861
14176 17451861 17343076 16556873 16214865 15908595 15750298 16225682 14930982 14803363 14485391
14167 14485391 14300735 13879607 14102907 13397820 13104410 12873234 12531084 12733154 12228073
14158 12228073 12105089 11684035 11452330 11393379 11285379 10727079 10982055 10554474 10457319 10352353
14148 10352353 9748198 10135111 10111373 9753605 9533354 9404392 9457395 9188266 8867535 8928641
14138 8928641 8620651 8400686 8640277 8484406 8104875 7897194 8078194 8038942 7752087 7793226
14128 7793226 7448123 7550099 7647839 7461489 7099372 6876828 6925689 6422648 6637876 6582468
14118F582468R4209k04278Q0547k50710j36812J1246K1288j3275j77114j79184
14108E828385k28646M04698m18819m335j72562m4829k12423j6586R7187j18962
14098E113108p2768J07611m59551L67449m8217P4070j64072j22698Q800J350p3273
14087D731809j15223k48547Q7643j88272Q0576j09304J19898M6058j79938j50101
14077D074599q040L81360m16897l68556L1673J46134N5185J24287l98360n8272
14067C563113j33203J23834K0073L3892R3204L6094j28105J89251r4775K9638
14057C733016j28581l18336K51035k44284j60581J18047j80747K23819j60314
14048C133074l02069J77884j99551K80343j43388m35602O53120k00758J56974
$$ plain form
14118 6582468 6676677 6472399 6552946 6302236 6165424 6176670 6197958 6184683 6007569 5828385
14108 5828385 5599739 6004437 5585618 5581283 5408721 5363892 5151469 5134883 5232070 5113108
14098 5113108 5040340 5147951 4688400 5055849 5007632 5081702 4917630 4794932 4803732 4805082 4731809
14087 4731809 4616586 4368039 4455682 4267410 4347986 4238682 4358580 4404638 4224700 4074599
14077 4074599 4066559 4447919 4031022 3662466 3694139 3840273 3895458 4019745 3621385 3563113
14067 3563113 3429910 3553744 3573817 3607709 3700913 3737007 3608902 3798153 3703378 3733016
14057 3733016 3604435 3286099 3537134 3292850 3132269 3250316 3069569 3293388 3133074
14048 3133074 2831005 3008889 2809338 3089681 2946293 2510691 3163811 2963053 3120027
14039C120027r2565k5816k03553M6061k26857N4399k76967Q3478K91133j83669
14029B585671q153k0037J07766M1805J50098m83731O0628j1760j0536j08477L80317
14018B683591m72486k30456M18897j69244J84916m08712j3298P2149j13467J07149
14008B059039J38813k64270O4872k63643M94106l52379K17023J98863l99526K2331
13998A915229M2028q8261p6149j92283M13003j52815o9257K11089j88794O11135
13988B424925J483799L855609J2686999L0262917k0054516A4471211o631049k445818
13980E394344r48947n97450o77450j08672l56444r0226n9796k24256L45929n27623
13970B149409m3076n0428R4766k16557M6999j67641K46114J09433j15811k25059
$$ plain form
14039 3120027 3027462 3001646 2798093 2844154 2617297 2671696 2394729 2478207 2769340 2585671
14029 2585671 2577518 2557481 2665247 2707052 2857150 2373419 2434047 2422287 2411751 2303274 2683591
14018 2683591 2211105 1980649 2399546 2230302 2415218 2006506 1993208 2065357 1951890 2059039
14008 2059039 2197852 1933582 1998454 1734811 2228917 1876538 2093561 2292424 1892898 1915229
13998 1915229 1957257 1868996 1792847 1600564 2013567 1860752 1791495 2002584 1813790 2424925
13988 2424925 3908724 7764333 20451332 50714249 30659733 14471211 7840162 5394344
13980 5394344 4445397 3847947 3170497 3061825 2705381 2615155 2555359 2331103 2677032 2149409
13970 2149409 2106333 2055905 2150671 1934114 1981113 1813472 2059586 2169019 2053208 1828149
13960A828149P6165l07053J40794O7347j21223j64348J17970K78149q9469j62495
13950A663986j7544M0900L4374P912l99398L75294Q636j4518k76799L69796k46693
13939A545946P2791n6033o5164m5297K35656k7585K567j74192J83556j00669k29317
13928A342259J93756l61190k6918J83594O0281j40264J83571j37549o6109K08822
13918A440253r702k3743k61519j2627K57596q6902j21581k0146L62108k99747
13908A223990o1451L05569k45272k51302L38312j30275o138K37426m86982K18815
13898A142692j38921O0829o9276K40392J44757l08583L950k5865l78685M90742
13888A162032j0553J51659j94861j12036J92769q1842J16696k44491m5932N0395
$$ plain form
13960 1828149 1904314 1597261 1738055 1805402 1684179 1519831 1637801 1915950 1826481 1663986
13950 1663986 1646442 1687342 1721716 1729628 1330230 1705524 1714160 1699642 1422843 1792639 1545946
13939 1545946 1618737 1562704 1497540 1452243 1687899 1660314 1662881 1488689 1672245 1571576 1342259
13928 1342259 1536015 1174825 1147907 1331501 1391782 1251518 1435089 1297540 1231431 1440253
13918 1440253 1430551 1406808 1145289 1132662 1390258 1303356 1181775 1161629 1523737 1223990
13908 1223990 1162539 1468108 1222836 971534 1309846 1179571 1173433 1410859 923877 1142692
13898 1142692 1003771 1064600 995324 1235716 1380473 1071890 1075840 1049975 671290 1162032
13888 1162032 1151479 1303138 1108277 996241 1189010 1107168 1223864 979373 933441 983836
13878I83836P5992n5321J82892j64079J7195k1543m6608J02204l38465L92071
13868A128174k33567K00450k07877M9621M6638j31821j01871L35415k0858j58892
13858I05412o6973O7544P6585k5902L5868o8417q8550L23257m90134J95699o9459
13847G94930k33750K76769J52262K6287q8670j50275L5450K45745m99024N5603
13837F15327j0903K24890J08493q6536k03920K25088j07870M13143D84670L36054
13827H20724l27791O78325l25380J04091l1607l54674K70818j66597k2972K57728
13817I02665l5580M2456m10437K74784K64608l47335J17096m01789M76412k7357
13807H55523L19854C62606L44140J8292K49108l45763N1876r946m1636J57118
$$ plain form
13878 983836 1059828 1004507 1187399 1023320 1040515 1018972 972364 1074568 736103 1128174
13868 1128174 894607 1095057 887180 936801 983439 851618 749747 1085162 1064304 905412
13858 905412 838439 905983 982568 956666 992534 924117 835567 1158824 668690 864389 794930
13847 794930 561180 837949 990211 1016498 927828 777553 813003 1058748 559724 615327
13837 615327 604424 829314 937807 851271 647351 872439 764569 1177712 484670 820724
13827 820724 492933 1171258 845878 949969 918362 563688 834506 667909 644937 902665
13817 902665 867085 909541 499104 773888 1038496 691161 808257 406468 882880 855523
13807 855523 1175377 362606 706746 725038 974146 628383 680259 670313 628677 785795
13797G85795k19950n7361P0756J12068k64319M63092D35870J08645r1175K22781
13787F76121J3993K4563j30800j07777J78295J42598j88974k58365M11454k47144
13777E13964L04042l09444m2621N7115m6957K03782E7663O78571k41595j98706
13767B95933K99466K59418k4470l49193K67790k05755o1981K82255l03443L24131
13757G84151j14987j55908J14960r2270K61021p5238J31519m23909J00385j20807
13747D08917J69574O7818j53419j63258N55470l77218O2428A97610O49693j57203
13737F90100R2166B95563J36489k9147K69302j98834J55884n9442J3676l70n8549
13726E24572P9052B75248M0977L96184k77380J60285J6636C04196G0322N17479
$$ plain form
13797 785795 565845 508484 579240 691308 426989 890081 435870 544515 453340 676121
13787 676121 690114 714677 583877 476100 654395 796993 608019 349654 761108 513964
13777 513964 818006 508562 465941 523056 476099 679881 57663 736234 494639 295933
13767 295933 595399 854817 830347 481154 748944 543189 481208 763463 460020 784151
13757 784151 669164 513256 628216 535946 796967 721729 853248 429339 529724 408917
13747 408917 578491 646309 492890 329632 885102 507884 570312 197610 847303 690100
13737 690100 782266 295563 432052 402905 672207 473373 629257 569815 583491 583121 524572
13726 524572 603624 275248 316225 712409 435029 595314 611950 304196 70322 587801
13716E87801K3563o3564J12974k03968R9434Q2914J4494j62664Q191j00259J36124
13705E35040j20243k1027o7174K0348J45105k44466j05042M78902k50563L06536
13695F77416r6948B07302J65811R1182r5776j20013J92110K53184j14269B13771
13684E38246J23083l21772K10492q9688Q2911k21640k4901L00976o4330P7933
13674F11310B51766L97901k13812J33621j39615o6900K24099B42104H9103K95096
13664C84199M0530Q2650j48977L29385B08210L04972k14573l5850l8013K50732
13654D75478A29721P6663N46191l58726j13139K09463A38561L80439J43843A24298
13643B09690J45361J37332k42255N4424m9024N4145o010J94010B41422m6780P3003
$$ plain form
13716 587801 611364 547800 660774 456806 556240 639154 653648 490984 499175 398916 535040
13705 535040 414797 393770 326596 346944 492049 247583 142541 621443 370880 677416
13695 677416 580468 207302 373113 464295 368519 248506 440616 693800 579531 213771
13684 538246 661329 339557 550049 460361 543272 321632 296731 597707 533377 611310
13674 611310 251766 649667 435855 569476 429861 362961 587060 242104 89103 384199
13664 384199 424729 507379 358402 687787 208210 513182 298609 262759 224746 475478
13654 475478 129721 206384 752575 393849 280710 490173 138561 519000 662843 124298
13643 209690 355051 492383 250128 304552 255528 309673 303663 497673 241422 194642 267645
13632B67645J84450J21040l1461h325A64880J21477j18551n6521M87884j97860
13622D01309m1295o0155J17226j83511P7872k9134K01490N7045A60768J9167J17842
13611B97777Q0607j25328L2190j36676N41846B66804r2698Q2358J27531a21900
13600E95456h0818E40701j19672R7898l7952k25386J42123G2925L32292M0861
13590D46078L9092q9646A18460K57898A64353P1392F5523P3861J22348I0221L45369
13579D35590q5491h5797E66158A4481P7206e7986H1879J54593H3052L08282k0734
13568C70600A36555J05406j02680K01702k4988A38294L0240g9929C17167K18795
13558E35962H9454J55386n0917L3113P0563j22063g6039D39339G6978O21323B44159
$$ plain form
13632 267645 452095 573135 541674 -8325 164880 286357 167806 111285 599169 401309
13622 401309 360014 299859 417085 233574 311446 282312 483802 540847 160768 179935 297777
13611 297777 378384 253056 285246 148570 690416 266804 174106 256464 383995 -121900
13600 595456 -80818 540701 421029 518927 480975 255589 397712 72925 405217 446078
13590 446078 485170 395524 118460 376358 164353 235745 65523 139384 261732 90221 435590
13579 435590 350099 -85797 566158 14481 91687 -57986 81879 236472 83052 391334 370600
13568 370600 136555 241961 139281 340983 315995 138294 168534 -79929 317167 535962
13558 535962 89454 244840 193923 227036 297599 175536 -76039 439339 76978 698301 244159
13546E9837J98037J50780k3276M4136j23893j11123J88404M1660j7776A40671
13535A74763n451k3213B26J79567a30846C22800G0814p458L33040A3437M7444
13524F0881K18350Q6200J17211B9007Q9061k7752p524P9941J28998o6209F4009
13512E52144j52038c1974B76421b8121C49123j73944K20058j44591m7314J8977
13502B22309q0364e9879C04981a49230A99706K59289B3784a07881B54676p8753
13492A75923G0996L63573j09647j4871f090o5344C24276L4015j08508J18093e5536
13480A95462f8685J3716B64296K2449a23934B98331b2559A02318P5814b9923C69754
13468A80231L24164a44966A78194k9562J95388E3005O7064K83855B0194L17717
$$ plain form
13546 59837 257874 408654 385378 429514 305621 194498 382902 424562 406786 140671
13535 174763 169312 146099 226 179793 -130846 322800 70814 63356 396396 13437 60881
13524 60881 279231 365431 482642 29007 118068 90316 82792 162733 291731 225522 64009
13512 552144 400106 -31974 276421 -28121 349123 175179 395237 250646 203332 222309
13502 222309 141945 -59879 304981 -149230 199706 458995 23784 -107881 254676 175923
13492 175923 70996 434569 324922 310051 -6090 -71434 324276 358291 249783 367876 -55536
13480 195462 -68685 -54969 264296 286745 -123934 298331 -22559 102318 178132 -29923 369754
13468 180231 504395 -144966 178194 148632 344020 53005 120069 403924 20194 337911
13458C37911H3026P0941K04371F527L40895j23348L28914d8066A25287J58370
13448B83657N6403r1684K00410A52598K34413m3173G8889O3727n6431J23057k2437
13437A86805C7956M83601A91751D7250d3227G7677L18855j0254h3307l8417N7952
13426f3772j48926J4643B5694J98823B5794a3076A98477Q4649p5711J39711A10013
13414C9260J57994J02749o1831g843A5197K39173c5220G9479o050i0748A23349
13402c255C8255Q8845n8551k38J10664n5546E856J76580O41I0267J2739J26606
13390B29612I7235K70825A58909k799o6718J15326L4409P2828o7851K99173F8268
13378F2781K45896j47911b2155B47040K60376A79156L27282A69508J65464A29297
$$ plain form
13458 337911 83026 153967 358338 6527 347422 224074 552988 -48066 125287 283657
13448 283657 340060 248376 448786 152598 387011 343838 78889 142616 86185 209242 186805
13437 186805 37956 521557 191751 47250 -43227 77677 396532 386278 -83307 -121724 -63772
13426 -63772 -212698 -198055 25694 224517 25794 -13076 198477 283126 207415 347126 110013
13414 39260 197254 300003 238172 -7843 15197 254370 -35220 79479 73429 -90748 123349
13402 -3255 38255 127100 68549 68311 178975 123429 5856 182436 183077 90267 103006 229612
13390 229612 97235 368060 158909 156110 89392 204718 239127 311955 244104 543277 68268
13378 62781 308677 160766 -22155 247040 507416 179156 506438 169508 334972 129297
13367D38713H8119J36528k4503R0433c7812B53515a6182B02572L5702A04816O8978
13356A73794o9884E1207J31481A6019J39202c41A92100j2486K29609a03376j11376
13345b14752Q8657l979B88116r5496O1215n5539K66835A3270J52555K68361j22159
13334C12027D4217J68514n4875l6395k2351h533A64782J80577A09646P5879f3752
13322D83992a06345k2372A25341D6057K87227j17854n787M6511O0270A48702F5534
13310A54696P4295j09691A3492L54901a9498A58699R78H402L11386M5943c9344
13298A61668J10008P0915j26884K3899b2427j62220A71924J69360A22620l7172
13288H5448J18515C4739J22708K00642p844E5889J5783J74958p1061a05096B61335
$$ plain form
13367 438713 88119 224647 200144 290577 -37812 253515 -16182 202572 238274 104816 173794
13356 173794 103910 51207 182688 16019 155221 -341 192100 179614 409223 -103376 -214752
13345 -214752 -126095 -130074 288116 192620 253835 198296 465131 13270 165825 434186 312027
13334 312027 44217 212731 157856 121461 99110 -8533 164782 345359 109646 185525 -63752
13322 483992 -106345 -128717 125341 46057 333284 215430 209643 256154 316424 148702 65534
13310 154696 228991 119300 13492 368393 -19498 158699 159677 8402 319788 365731 -39344
13298 161668 271676 342591 215707 239606 -22427 -184647 171924 341284 122620 85448
13288 85448 203963 34739 157447 358089 350245 55889 71672 246630 175569 -105096 261335
13276C03126H7497a07504B8568O9726L0079a19672a6905C3164J10769O911f7672
13264g8159j30500B27073D5761Q2041D997K32024C5693K31618n9976a55475H8680
13252H7248J55662B6923O4847l4198J34383m3248L9258b17857A23590c0259B62246
13240C60563A58593R2740b9090C56882G261N0334J53696a73147B4722a92088B64212
13228B81787g5747o0936j0908C62521j78144n0816l0145j1841L7281F3730J9906
13217H3636K17153a05588G1147f6204b5861A31328C3840J65056d959E28003a7321
13205d2681k26424B78307b8584B77864C0447J2477J80550G4045J33828p7365J2442
13194A42950K92910a92279A74409a47450B7662J05590l5176A7372J33402E2214
$$ plain form
13276 303126 87497 -107504 28568 98294 128373 -119672 -16905 33164 143933 150844 -67672
13264 -78159 -208659 227073 45761 127802 4997 237021 35693 267311 207335 -155475 88680
13252 87248 242910 26923 91770 57572 191955 148707 187965 -217857 123590 -30259 262246
13240 360563 158593 251333 -29090 356882 7261 57595 211291 -173147 24722 -192088 264212
13228 281787 -75747 -136683 -147591 362521 184377 133561 103416 91575 128856 63730 83636
13217 83636 300789 -105588 71147 -66204 -25861 131328 33840 198896 -4959 528003 -17321
13205 -42681 -269105 278307 -28584 277864 30447 42924 223474 74045 207873 130508 142950
13194 142950 435860 -192279 174409 -147450 27662 133252 98076 17372 150774 52214
13183E1986b3367B60138A14414a45373j00563d7900a378A85581G5640K61843A58413
13171G1346a30015A75295a9012I6767b21057A91623b6367A74190J17778A36709
13160B17238G1002P8603J74116B3875L84723C7452b3550k63108C1462a20068p3691
13149a93759g1639B5309J77231g9405A70910i5659I5064b40968H8417a13148A55065
13137A08659e865B60541A10505M643K1438J83436g7614q8513A03224N9211F7208
13125f5117A4601J82761M1902c25134B53907A08409b69814D2825c079o0627A30873
13113C58674a76012j04890F6693J91077b9406j24250F803J05396J52817h6432
13102a7487B1187J13118j9515B5036Q5713J8013J37368I4567h1647j56457M2568
$$ plain form
13183 51986 -23367 260138 114414 -145373 -245936 -47900 -1378 185581 75640 337483 158413
13171 71346 -130015 175295 -19012 96767 -221057 191623 -26367 174190 291968 136709
13160 217238 71002 149605 323721 23875 408598 37452 -23550 -286658 31462 -120068 -193759
13149 -193759 -71639 25309 202540 -79405 170910 -95659 95064 -240968 88417 -113148 155065
13137 108659 -5865 260541 110505 115148 136586 320022 -77614 -166127 103224 162435 67208
13125 -65117 14601 197362 239264 -325134 253907 108409 -269814 42825 -3079 -63706 130873
13113 358674 -176012 -280902 66693 257770 -29406 -153656 6803 112199 265016 -86432
13102 -17487 21187 134305 114790 25036 110749 128762 266130 94567 -81647 -238104 -195536
13091a95536B5754g467F3977j976K08567K5300b8915H5654a80145A05737D0446
13079A91925a372m921j92233A39199g4259A4964J69125g585C35764g0195B1745
13067A7286b579E7665K60531j34514a6434C2466M07870c72154a592F715L69141
13056C75856N710A70713b9341G5693J4171d6207q9612K4003D8578K39796H1744
13044B38305g5874B29075d4648B78745D1874M8919o476d0275C2124a49209E05559
13032c95322A60731c30380A05354k1131d2633C4283g2472q4120B07654h664A67446
13020A46121l3957B6880K73668F0012g287j60909f0185m894A60802J521e3157
13008b76062C66291A20902f7008K9804D68997B3803K04315L1802A2018J15120
$$ plain form
13091 -195536 25754 -7467 63977 62001 270568 295868 -28915 85654 -180145 105737 40446
13079 191925 -1372 -6293 -198526 139199 -74259 14964 184089 -7585 335764 -70195 21745
13067 17286 -2579 57665 318196 183682 -16434 32466 440336 -372154 -1592 6715 375856
13056 375856 381566 170713 -29341 75693 89864 -46207 -135819 -111816 48578 288374 81744
13044 238305 -75874 229075 -44648 278745 41874 90793 84317 -40275 32124 -149209 505559
13032 -395322 160731 -330380 105354 84223 -42633 34283 -72472 -156592 207654 -8664 167446
13020 146121 112164 26880 300548 60012 -7287 -168196 -60185 -65079 160802 162323 -53157
13008 -276062 366291 120902 -67008 -37204 468997 23803 228118 259920 12018 127138
12998A27138N8758K2058l3712J16036l6905q8623b4729A45632J20149A4187N0865
12987F5052M1097L5697J39240a52727A38512N3059J01512F5865K67h0420I2044
12975a66246A72936K5828a45480e4762C96921M2787B0155J31359a02225A02758
12964a31833G427a72567D0187J79627F9410J54393F3367P6527a22135B30267d2707
12952A05822a28608o522o334N8750M333i354o4459k83770D3791h3290A74880c32365
12939a5815F7119A9239K85864A0757a14978B99553I7475l1239a13379C6990j394
12928C5596b38721C8093i8659p1332A78377h1930A53784a61276j6976L9467A92239
12916a02974A86769L4772H973L03155b00192C95543b9423B9031M3846Q5173d7576
$$ plain form
12998 127138 185896 207954 174242 290278 253373 164750 -24729 145632 265781 14187 65052
12987 65052 106149 141846 281086 -152727 138512 191571 293083 65865 66132 -80420 92044
12975 -166246 172936 198764 -145480 -54762 396921 439708 20155 151514 -102225 102758
12964 -131833 7427 -172567 40187 219814 69410 223803 63367 139894 -122135 230267 -42707
12952 105822 -128608 -135130 -141464 -82714 -78381 -9354 -73813 -357583 43791 -83290 174880 -332365
12939 -15815 67119 19239 305103 10757 -114978 299553 97475 66236 -113379 36990 35596
12928 35596 -238721 38093 -98659 -169991 178377 -81930 153784 -161276 -178252 -138785 192239
12916 -102974 186769 221541 8973 312128 -200192 395543 -29423 29031 72877 158050 -47576
12904B72892j19562a48068c829B4473i2992A89035a38470M1840A12544a32044
12893i5853J051G3677k4268J54263J36147A25454J37666D5412E459J19284n6361
12882F8382a13818j05068A05661N19645b0458r1219A48461J49582j1715C1394
12871I1J12099K0643i997o5138j10343B5660b65178B70907I8243B1905f6795A98963
12858D7799N1406L02766b75687c3340C40354A33326E2227L3491b39704H5552a38024
12846F7976a71470A0926e3653A17371J1274c2145j9500H3311M6011g6532C7380
12834i1666l399j7521B34982d3517A51120d10223D7824k3691c47851A44050a33134
12822i2641L0849D82834A72841a11333M2633K8378e759k66861A9207e3070j30876
$$ plain form
12904 272892 153330 -148068 -3829 24473 -92992 189035 -138470 -96630 112544 -132044
12893 -95853 -94802 73677 49409 203672 339819 125454 263120 45412 5459 124743 68382
12882 68382 -113818 -218886 105661 625306 -20458 -111677 148461 298043 286328 31394
12871 91 112190 132833 -9997 -75135 -185478 25660 -265178 270907 98243 21905 -66795 198963
12858 47799 99205 401971 -275687 -33340 340354 133326 52227 85718 -239704 85552 -138024
12846 67976 -171470 10926 -53653 117371 128645 -32145 -51645 83311 129322 -76532 37380
12834 -91666 -95065 -112586 234982 -43517 151120 -410223 47824 24133 -347851 144050 -133134
12822 -92641 -61792 482834 172841 -111333 -68700 -40322 -5759 -272620 19207 -53070 -183946
12811a83946J0353a3766K758k12030h0970F4439c4764C5532A653d7401A6527h7910
12798B24283a6859j1254A18258b4839A61287d05855a14811A02384d71290g349
12787A05425c39723g92q7634p9826B10060b02418H4021a45552B26927b44267F6987
12775b8948k9107k99912a29222p6383e1525D9353b29005J4173A49103a10091j1874
12764a21965j30248n2332J32217I1060a4399A9067J5914a6946j27823k2433J5812
12753a51390D0489a71002K1682j05007j98388a14561J5096B4131K78501a8965
12742e8932l1231C68896M6245a6806j86334k0412A19675K25K09423h7548j2350
12731i9898C8218J3254a56116K3556A55345C7325K15535G3911a07826G6235J12610
$$ plain form
12811 -183946 -173593 -13766 -11008 -223038 -80970 64439 -34764 35532 1653 -47401 16527 -87910
12798 224283 -16859 -28113 118258 -24839 161287 -405855 -114811 102384 -471290 -7349
12787 105425 -339723 -792 -88426 -168252 210060 -202418 84021 -145552 226927 -244267 66987
12775 -28948 -58055 -357967 -129222 -205605 -51525 49353 -229005 -214832 149103 -110091 -121965
12764 -121965 -252213 -304545 -172328 91060 -14399 19067 34981 -16946 -144769 -167202 -151390
12753 -151390 40489 -171002 -149320 -254327 -452715 -114561 -99465 24131 302632 -18965
12742 -58932 -90163 368896 415141 -16806 -203140 -223552 119675 119900 329323 -87548 -99898
12731 -99898 38218 51472 -156116 -132560 155345 37325 252860 73911 -107826 76235 188845
12720A88845a30242o1462B83476h8256j44216C82070j42037A0346J75170G166
12709B83112j09487E8573P9824n103b48515C03807E8435M6669q895P5989K4693
12698A96891G6080a60708A47304A7292h1498B23718c0686J5185k32432e0844p7696
12687a28540h709B58268c00910A28873b23920e4106A19995J98722l3318a45466
12676b6223A30646J83153c5079l9547A30067b3153a682I9408c42511g4673A77043
12664A07631J10801m6700a75271N1297j6942B63189G7070M84101A53302A586a20594
12652A41978A453J45649J11328A08695a34072k10669B34297k1024a14870B35069
12641D6739L06319a83034G9902g5095B92046J66664g2009L175b9257L683B50660
$$ plain form
12720 188845 -130242 -191704 283476 -88256 -232472 382070 240033 10346 185516 7166
12709 283112 173625 58573 138397 133294 -248515 303807 58435 105104 96209 172198 196891
12698 196891 76080 -160708 147304 17292 -81498 223718 -30686 -15501 -247933 -50844 -128540
12687 -128540 -8709 258268 -300910 128873 -223920 -54106 119995 318717 285399 -145466
12676 -26223 130646 313799 -35079 -74626 130067 -23153 -1682 99408 -342511 -74673 177043
12664 107631 218432 171732 -175271 -123974 -140916 263189 77070 561171 153302 1586 -120594
12652 141978 1453 147102 258430 108695 -134072 -344741 234297 213273 -114870 235069
12641 46739 353058 -183034 79902 -75095 292046 458710 -72009 -68834 -29257 -25574 250660
12629B00136J43117A15542l6965J77136a54650A92854e4108p2924B96452c8547
12618A0571J80798D8134A8660J59011a35641E691b16455A83171B5788L96717A110
12606E16962A85654A0530a2751D9762K9609b16273C77395a33690b9395H2016b39403
12594a98013a7644m46820a0432C7633b6784A01203C7063L1560b01171A57924c0715
12582A2482J57492d131A42815i4806A23700D9177K02650b10073B58646b97673
12571b0911E7028J191a97225B73464L4653b33016B17895b03695l6549F0875a45794
12559c2799F6174k1820J20864b1596j07229L5448L9695q4953N165d0943k25954
12548b66897b5292C12043c44610n2868A10389c75884H5864e7943B73757J6586
$$ plain form
12629 200136 343253 115542 78577 255713 -154650 192854 -54108 -127032 296452 -38547
12618 10571 191369 48134 18660 177671 -135641 5691 -216455 183171 25788 422505 1110
12606 516962 185654 10530 -12751 49762 79371 -216273 377395 -133690 -29395 82016 -239403
12594 -198013 -17644 -464464 -10432 37633 -26784 101203 37063 68623 -201171 157924 -30715
12582 12482 169974 -4131 142815 -94806 123700 49177 251827 -210073 258646 -297673
12571 -20911 57028 58219 -197225 273464 308117 -233016 217895 -203695 -240244 60875 -145794
12559 -32799 66174 44354 165218 -21596 -128825 -93377 -53682 -138635 -133470 -40943 -266897
12548 -266897 -25292 312043 -344610 -397478 110389 -375884 85864 -57943 273757 290343
12538B90343A37448b99945J02053C9860e6214A01553a17655a3583k04685i0624
12527b2398A81831c6623j72813A4857J21262I372K09336J79057H3511K6227a84102
12515b80296a11139E7737K54617e3063k18439B70244E5236c88368A24860l6228
12505H8632h1899l83533A7905a76833B62932p8880a19143c0985j26867A28642
12494B41781O8774c9487A89621c0278k07044K4490A15285J79893i7861B15623
12483A00656J954a4259B14035a87366a5662c284k69582e9257A09924n3674P9654
12472A35904i7475b7721l9909j54162H0565L2610l4614c47417J56875k58680a14443
12460A24684J23825F0008a5820k91778e7723A60114a37374B58606e1743A05592
$$ plain form
12538 290343 137448 -299945 -197892 39860 -56214 101553 -117655 -13583 -218268 -90624
12527 -22398 181831 -36623 -209436 14857 136119 9372 218708 397765 83511 109738 -184102
12515 -280296 -111139 57737 312354 -53063 -271502 270244 55236 -388368 124860 88632
12505 88632 -81899 -465432 17905 -176833 262932 184052 -119143 -30985 -157852 128642
12494 241781 310555 -39487 189621 -30278 -237322 -212832 115285 295178 -97861 215623
12483 100656 102610 -14259 214035 -187366 -15662 -3284 -272866 -59257 109924 56250 135904
12472 135904 -97475 -27721 -67630 -221792 80565 113175 78561 -347417 -190542 -449222 -114443
12460 124684 248509 60008 -15820 -307598 -57723 160114 -137374 258606 -51743 105592
12449D9612O6520A1808c9165k62089d1581k6059K0245C6723d94884b25218A8640
12437i2394j15326k5780A87680G3047K75653F995R3441a09248b1252A50208N2054
12426B02262G390a35547A96842m4845L7124l1932a72101B7528a87275F9720c4861
12414b51180H7646C6557K3128b16438a01681d5225A10671b8232C3681K66332A25988
12402A78118D4701b94699i0462F5498a48182j67057f2276j34613C20771b44235
12391H1271J943a30613L8799C1378b199A22618b56055b3477B07078C9795M6277
12380H6072B1227J81243a88491G2733K4369R0236i8658F9910J40262c3981D43205
12368E4418e87A91867D102f4469C0628h0477c6904p5733A42789A3585e21638A26952
$$ plain form
12449 49612 116132 11808 -39165 -301254 -41581 -67640 -47395 36723 -494884 -225218 18640
12437 -92394 -207720 -233500 187680 73047 348700 6995 100436 -109248 -21252 150208 202262
12426 202262 7390 -135547 196842 151997 189121 157189 -172101 27528 -187275 69720 -34861
12414 -251180 87646 36557 59685 -216438 -101681 -45225 110671 -28232 33681 300013 125988
12402 178118 44701 -294699 -90462 65498 -148182 -315239 -62276 -196889 320771 -244235
12391 81271 83214 -130613 -91814 31378 -2199 122618 -256055 -23477 207078 39795 86072
12380 86072 21227 202470 -188491 72733 97102 187338 -98658 69910 210172 -33981 443205
12368 54418 -587 191867 4102 -64469 30628 -80477 -36904 -112637 142789 13585 -521638 126952
12355B21670q110m5817a18956A99664G1137b28180g0363j21158A43838f0301j15386
12344a75687F5187d98673a8381q2496A65253J11064L1923b04155f096j27907E6722
12332a18692A61981a15655r6882a03663C70815A28793H576K08686J95070j67275
12322B45057A6489J52565J46664d0840G7349P9770P4111n5234A4935K47414m0687
12311B21662I2872E774J44172a83974h1781A09484J71873J05933A18006e1205
12300b3843B7829d5212A58817A3618g3312K377E66989E3373J9810K40886C9379
12288g8183K0924F671K40475B3209J92790K3173l6549g7096B62643A15388l4754
12277H0634a25103F6263Q6568E3629Q5912J70884A52630G0807L6051L256C5841
$$ plain form
12355 221670 213560 167743 -118956 199664 71137 -228180 -70363 -191521 143838 -60301 -175687
12344 -175687 65187 -498673 -18381 -100877 165253 276317 308240 -204155 -6096 -134003 56722
12332 -118692 161981 -115655 -212537 -103663 370815 128793 8576 217262 412332 245057
12322 245057 16489 169054 315718 -40840 77349 157119 231230 175996 14935 262349 221662
12311 221662 92872 5774 149946 -183974 -81781 109484 281357 387290 118006 -51205
12300 -23843 27829 -45212 158817 13618 -73312 -70935 566989 53373 73183 314069 39379
12288 -78183 -57259 6671 247146 23209 215999 239172 202623 -77096 262643 115388 80634
12277 80634 -125103 66263 152831 53629 139541 310425 152630 70807 106858 110114 35841
12265A19895K6359R3608A16286K12325M2482A44111a62185B4975K89254A50603
12254g4778b7072j18107B29426J76760b9011C33823k1052D3959K17722a76734
12243a57103B08932N1082d609m3062k56257A0503M20842C5738R2974b31471A28588
12231B43255b0501A81121a04142A05693J65344K54230F4404j5342j9620J61726
12221A91168F9971e6816A99860F421K32998I8601h4049B64033G8037J17666A2745
12209B85926o3437q6701J79877A06433C4204J14302A5802a58876A5863J35146
12199A51009j2921q907b0516C30490M0798D9406e4367n5060A55694b50908A74884
12187C62700A44493k8767L9143n5719L65615A68267J8535d4345I7361c5558A35143
$$ plain form
12265 119895 146254 239862 116286 328611 371093 144111 -162185 24975 314229 150603
12254 -74778 -27072 -145179 229426 406186 -29011 333823 312771 43959 261681 -176734
12243 -157103 208932 260014 -4609 -47671 -303928 10503 431345 35738 128712 -231471 128588
12231 243255 -20501 181121 -104142 105693 271037 525267 64404 49062 29442 191168
12221 191168 69971 -56816 199860 6421 239419 98601 -84049 264033 78037 195703 12745
12209 285926 222489 135788 315665 106433 34204 148506 15802 -158876 15863 151009
12199 151009 138088 129181 -20516 330490 371288 49406 -54367 -109427 155694 -250908 174884
12187 362700 144493 115726 154869 99150 464765 168267 186802 -44345 97361 -35558 135143
12175a35577A13877C8097M5575b752E41018I3051c0813B00094K15233F9463p817
12164F1646M4632M38595F5222M59847k59637N2129b15717J1700d1261C19629D6182
12152a43414C02416n1244P8871a91613A44781b4838A81626D7178K8420K42671
12142C18269a07190e0062A80672L60218A09574K25191B303M01746j60315I2956
12131b11614B66135i0933i980j14793A18500g2003j23445c8019A44620J44866
12121B89486j15105l6535J86685a53043B72809j3339F4780a03039C61018I8304
12110E10512B09132K18561j15752K889a60264i789j25294C52986q1141J86132
12100D57977C2771O2882J58536d06073A91016L2254J3082B739J42632h3990A67803
$$ plain form
12175 -135577 113877 38097 83672 -2752 541018 93051 -30813 200094 415327 69463 61646
12164 61646 106278 544873 65222 525069 265432 317561 -215717 -204017 -41261 319629 46182
12152 -143414 302416 251172 330043 -191613 144781 -24838 181626 47178 75598 318269
12142 318269 -107190 -50062 180672 540890 109574 334765 2303 404049 243734 92956
12131 -211614 266135 -90933 -9980 -124773 118500 -72003 -195448 -38019 144620 289486
12121 289486 174381 137846 324531 -153043 272809 259470 64780 -103039 361018 98304
12110 510512 209132 427693 311941 314830 -160264 -9789 -135083 352986 271845 457977
12100 457977 32771 95653 254189 -406073 191016 223270 236352 2739 145371 -83990 167803
12088B20147e7765m1749B77454K17555A60058J12408r7772B5361J07062m7639
12078H4784Q8078e1763C7456e7392B7038a15722B85216E9710K57336F9085g1554
12066H6944J97596A32685f6229A91615l8369K07219d1078j15575H8954h4488G7535
12054A84481a91186C48352b55485E4569h2766g946C8243b9851A73087a94589B99626
12042c20952d1942A3776Q926J06206F0507b05564m394N723k1239Q7912A11598
12030c22817l0631F9982a73864M6093a7795C6678J7284a74801K4664E606K06394
12019B12000b8690A00254D296K65217a25620F5308J65334o3143q3504e0374C31295
12007A62898c41948A77920m0297c88172h478B64576q6063j3006C2473J19572a98190
$$ plain form
12088 220147 -57765 -99514 277454 495009 160058 272466 174694 25361 132423 84784
12078 84784 172862 -51763 37456 -57392 27038 -115722 285216 59710 317046 69085 -71554
12066 86944 284540 132685 -66229 191615 153246 360465 -41078 -156653 88954 -84488 77535
12054 184481 -191186 348352 -255485 54569 -82766 -7946 38243 -29851 173087 -194589 299626
12042 -320952 -41942 13776 22702 128908 60507 -205564 -209958 -204235 -225474 -137562 111598
12030 -322817 -353448 69982 -173864 -127771 -17795 36678 53962 -174801 -150137 5606 212000
12019 212000 -28690 100254 4296 269513 -125620 65308 230642 167499 83995 -50374 331295
12007 162898 -341948 177920 137623 -388172 -8478 264576 178513 165507 32473 152045 -198190
11995i1389L5411A7938O0008J72507m8022c25988a16969a5255I6923L85026b3039
11983a30261a3993j27448B63M5484J26890a38139O4869c0746D9518L52062b48733
11971c54761A26050m0394l7897A0980K7603a54714B9567a61669P6281E123K14797
11960B19920k9477Q08b37988R4443j96844h8739l9354j13261B35754c03806F8938
11948c02967a04089C7448b94844A32624b07717r5130J34002e3330j81165J5647
11938b18848A20202b64308R0912G6399Q2500A4254a05473H921f2477A08759K747
11927A11506N1431a5476f42j44274m7260A39675e4859j0981H9648c31886b7183
11915C4749a25755N631m3190a9803C5849k644a8530l751A22032M4979D2725P7633
$$ plain form
11995 -91389 -55978 17938 77946 250453 202431 -325988 -116969 -15255 96923 481949 -23039
11983 -130261 -13993 -141441 263 45747 172637 -138139 -73270 -30746 49518 401580 -248733
11971 -354761 126050 85656 47759 10980 38583 -154714 29567 -161669 -85388 5123 219920
11960 219920 190443 191251 -237988 -143545 -340389 -88739 -128093 -241354 235754 -303806 68938
11948 -302967 -104089 37448 -294844 132624 -207717 -302847 -168845 -53330 -234495 -218848
11938 -218848 120202 -264308 -173396 76399 158899 14254 -105473 8921 -62477 108759 111506
11927 111506 162937 -15476 -642 -144916 -192176 139675 -54859 -65840 89648 -331886 -27183
11915 34749 -125755 -120124 -163314 -19803 35849 33205 -18530 -22281 122032 167011 42725 120358
11903A20358L1117a54466C5892f7041j01362L5641a5193r2702F1652K96274A2492
11891b71030I5560b65792Q6464H7288C2800b15133f8172I0057A5556J1614J43924
11880A71094m1710i949p7206j10944C8274g8148j05367E233a47524d3604a566
11868a55486l5705C39275a28211e1373k82798a16123I7560a37476j1470B92595
11857d4077b1066f585k23131d8005D0477b40347B17798I0987d1376D0508c8343
11845g0515B08202d398B7563K76824C1960a59372c1493j49689n5455N8921a2464
11833e6297j27618A56131a11899j7179I891f6518n5063L9562A18866c65335J67889
11822a97446Q1407k15561a263H2718b42376e4303A57782L6889D360J26859E5330
$$ plain form
11903 120358 151475 -154466 35892 -67041 -168403 -132762 -15193 -107895 61652 357926 12492
11891 -271030 95560 -265792 -179328 87288 32800 -215133 -68172 90057 15556 27170 171094
11880 171094 129384 -9949 -87155 -198099 38274 -78148 -183515 5233 -147524 -43604 -1566
11868 -155486 -191191 339275 -128211 -51373 -334171 -116123 97560 -137476 -148946 292595
11857 -44077 -21066 -6585 -229716 -48005 40477 -240347 217798 90987 -41376 40508 -38343
11845 -70515 208202 -4398 27563 304387 31960 -159372 -31493 -181182 -236637 -177716 -12464
11833 -56297 -183915 156131 -111899 -129078 9891 -66518 -121581 -82019 118866 -365335 -197446
11822 -197446 -116039 -331600 -1263 82718 -242376 -54303 157782 194671 4360 131219 55330
11810i8099j92868a2303k05272J5865L9713j00841P0152i6032G8869K06965g9655
11798B4362R1727b26595G9103f1503k12532G7077a06381G9916a71145B5199J9970
11787D5169a16654c8974A66940J66704h8122j79433a15815A94800a32548j84389
11777c16937F0462c03644J51744d6365A72159a15809k56113C12565a0737C36066
11766d94978B80641a10539l0389A91480g5926j23778A67066a81619j09481J10907
11756a80193L7274j27537M9349i5766j7839q8567A08373J60765Q1308g0522k41129
11745c11651a37991C48912a35623L1455L1034j1906G9076a44323I8712b2257B19707
11733A04222a02955l7107n577F645e7765j15253A09179a46835G4389J40432d5013
$$ plain form
11810 -98099 -290967 -12303 -217575 -201710 -161997 -262838 -192686 -96032 78869 285834 -79655
11798 24362 116089 -226595 79103 -61503 -274035 77077 -106381 79916 -171145 25199 45169
11787 45169 -116654 -38974 166940 333644 -88122 -267555 -115815 194800 -132548 -316937
11777 -316937 60462 -303644 -151900 -46365 172159 -115809 -371922 312565 -10737 336066
11766 -494978 280641 -110539 -140928 191480 -75926 -199704 167066 -181619 -291100 -180193
11756 -180193 -142919 -270456 -221107 -95766 -113605 -202172 108373 269138 350446 -70522 -311651
11745 -311651 -137991 348912 -135623 -104168 -73134 -85040 79076 -144323 98712 -22257 219707
11733 104222 -102955 -140062 -145639 6645 -57765 -173018 109179 -146835 74389 214821 -45013
11721F9013C4493b11716P9819f008E5883J95506B1620J85685D9704b13809I6966
11709F3609c56672e3832K1659k37146P0643F6965a29655l5043j23664F6696r887
11698E6809N5615E4004a67469B91966D5619j5441a73548a5467k45853L9191O3086
11687a59043A53057M0477n2397h2744E4665g8110B54562E2077a4987q549k46829
11676b70365b1727B06633e3965o8153B16010A04698i1784A54447e3343A40255
11665c67970f6958b1080m6945f785o3561p6618A04760J48637c2230A2487a35612
11653C08029a92154e8181I60O6201a01932M848q0353I0628f1819C53514j75917
11642A77597H5114R6519H214L74272I8718a75009l4691E0165J78256h6013A95244
$$ plain form
11721 69013 34493 -211716 -131897 -6008 55883 251389 21620 207305 49704 -213809 96966
11709 63609 -356672 -53832 -32173 -269319 -198676 66965 -129655 -164698 -288362 66696 56809
11698 56809 112424 54004 -167469 291966 45619 30178 -173548 -15467 -261320 -222129 -159043
11687 -159043 153057 193534 141137 -82744 54665 -78110 254562 52077 -14987 -23536 -270365
11676 -270365 -21727 206633 -53965 -122118 216010 104698 -91784 154447 -53343 140255
11665 -367970 -66958 -21080 -68025 -6785 -70346 -146964 104760 253397 -32230 12487 -135612
11653 308029 -192154 -58181 960 67161 -101932 -97084 -177437 90628 -61819 353514 177597
11642 177597 85114 181633 8214 382486 98718 -175009 -209700 50165 228421 -86013 195244
11630g8420C00477A10788D8088c562j41742k01984h3114E7873J95168M4285d8010
11618D3271M9175J96028m0356a2713N872B16414a93462e1473Q609A68065b71329
11606a61672k6417C55246c2385k30480a08731M5468n8221c9109D06164I0223r268
11595H0955A4869R634c41494a29326a1973j11883B82761e39239e4031b806A42047
11583d9692B75436A11028i0474K1775c1278p4743A3561a18609c5656k19236A59810
11571D3490c60221A74959H717K21135M8569A13364l2910K10720l1911a82857E1709
11559G7557M0758g1353F7535a24606A45071a8349B35141a95003f2227a8490G1566
11547B5269K38350r0010M231C4745d637A7171b42820b190l70068E8564J23713
$$ plain form
11630 -78420 300477 110788 48088 -3562 -145304 -347288 -83114 57873 253041 297326 -48010
11618 43271 92446 288474 248118 -12713 -6841 216414 -193462 -51473 -42864 168065 -271329
11606 -161672 -188089 355246 -32385 -262865 -108731 -63263 -121484 -39109 406164 90223 80955
11595 80955 14869 24503 -341494 -129326 -11973 -123856 282761 -539239 -54031 -2806 142047
11583 -49692 275436 111028 -90474 -68699 -31278 -106021 13561 -118609 -35656 -254892 159810
11571 43490 -360221 174959 8717 229852 278421 113364 80454 291174 259263 -182857 51709
11559 77557 118315 -71353 67535 -124606 145071 -18349 235141 -195003 -62227 -18490 71566
11547 25269 263619 173609 177840 34745 -4637 17171 -242820 -2190 -372258 58564 182277
11536A82277o0117L7614O0663J09948a4206m6394j09819F9364M6263J19343m4941
11525A90029b5936A23420k8897a64694I2177d3819A96129Q528a10172G0531b23739
11513b65691D15949C5667K00558G0208i2331c383p0984K633J3460A65986a40991
11501a59005a8125C36511H1180C9153e6043A21155P3177J19387b42356B83110
11490c224A05914D8554K4419b02563A33759O7799b10031a3962j42046I8804K26741
11479C25545d18609B05372I0255J07784E1058Q7953c7196A06949m5767e6702A7540
11467A72400d1638A18993K77502j03010D5365O6317e8071A30410F4031K40313
11457C04344H2985J25971G0360f1085r4439o5516G9625L43838j86574r8881o5898
$$ plain form
11536 182277 122160 159774 220437 330385 -14206 -60600 -170419 69364 115627 234970 190029
11525 190029 -25936 123420 94523 -164694 92177 -43819 196129 204657 -110172 70531 -223739
11513 -265691 415949 35667 236225 70208 -92331 -3383 -74367 -71734 -58274 165986 -140991
11501 -159005 -18125 336511 81180 39153 -56043 121155 194332 313719 -242356 283110
11490 -3224 105914 48554 72973 -202563 133759 201558 -210031 -13962 -156008 98804 325545
11479 325545 -418609 205372 90255 198039 51058 139011 -37196 106949 61182 -56702 17540
11467 172400 -41638 118993 396495 293485 45365 111682 -58071 130410 64031 304344
11457 304344 82985 208956 70360 -61085 -155524 -221040 79625 423463 236889 138008 72110
11446G2110K03922H729a87210I2469R7569F3537a49432e6195k3820j4043d3524
11434A91025b27118l2894A24080K2496M7476M3128q4409o8651q924e27037a05971
11422a63813o2492A35808K47762a08813D1852a33901A82567P2074i6156a7420
11411B64161i5047H8505L16642C4076J3504c2871C684R082J21336a23295B00048
11399d37711E3699d5357A19810b91884A27163b30069B24706a49591G9778a86937
11388d5275n3185F1277a07492A15837e912k91017a06441c7077k6258A24983f4491
11376I9520J27286i5940i193E1081P8770J53010d3910j2582C8517h9599k12343
11365c01942c7881l4566O775a6358E1529b2410n0824C0106a03779a0194o700f71
$$ plain form
11446 72110 276032 8729 -187210 92469 190038 63537 -149432 -56195 -80015 -94058 -43524
11434 191025 -227118 -260012 124080 146576 194052 237180 152771 84120 75196 -527037 -105971
11422 -163813 -226305 135808 383570 -108813 41852 -133901 182567 254641 -96156 -17420
11411 264161 -95047 88505 405147 34076 47580 -32871 3684 12766 134102 -123295 200048
11399 -437711 53699 -45357 119810 -291884 127163 -230069 224706 -149591 79778 -186937
11388 -45275 -98460 61277 -107492 115837 -5912 -296929 -106441 -37077 -63335 124983 -64491
11376 99520 226806 -95940 -9193 51081 129851 282861 -43910 -56492 38517 -89599 -301942
11365 -301942 -37881 -72447 -65672 -16358 51529 -22410 -73234 30106 -103779 -10194 -16894 -671
11352f8751k24719A90053b9651H4323m0797J84265a64739H0468K78148A08395
11341a61263D4117a39914B4737b23863Q8771k86856J41377h0498l9405A97484
11330b8372p1343a4231j47927j9800J5238O4053G5321b82040h2799r5401J1502
11319a66698G6542Q8956j4666n4359I559K2024b33076C41729j60935c42475E4655
11307d5237j49671A68906a71982B79449b4375r5331p6131I5844a75458j1133j78516
11296c65107a35479L9639r7673M7796k6127Q2425j99712A40354J78919b8947j24110
11285a53057e0800C61712b64738d9039m6054p7506C871a60050A77346i8472B93464
11273c4485o1119C29104c69914A43237a1363E3753a4794A17441i0670B42305n490
$$ plain form
11352 -68751 -293470 190053 -29651 84323 43526 227791 -164739 80468 358616 108395
11341 -161263 44117 -139914 24737 -223863 -135092 -421948 -280571 -80498 -119903 197484
11330 -28372 -99715 -14231 -162158 -181958 -166720 -102667 75321 -282040 -82799 -178200 -166698
11319 -166698 76542 165498 150832 96473 9559 31583 -233076 341729 180794 -342475 54655
11307 -45237 -194908 168906 -171982 279449 -24375 -119706 -195837 95844 -175458 -186591 -365107
11296 -365107 -135479 -95840 -193513 -145717 -171844 -89419 -289131 140354 319273 -28947 -153057
11285 -153057 -50800 361712 -264738 -49039 -95093 -172599 3871 -160050 177346 -98472 293464
11273 -34485 -95604 329104 -369914 143237 -11363 53753 -14794 117441 -90670 242305 236815
11262B36815b53038H6294J32811g8094o3635o765C0810Q1333c69572A01462a92507
11250c11701c363o41417b73678N3271d5872m8939j31877K1210b7512k45145f1875
11238a6975A36242J36324C6743b14927O3409c6811j71700A11662K39144i8469
11227B27450b47067F3516M2687a48843f5641A85136a12909k72099a51829E3322
11216c32232C4819c60378M6787J46629G1838c26374N9667a29696e9317A60058
11205a18831N5276K9770h532B40926E3746h8280k90934D3015h4158D84682c08551
11193c39965A87749c24484D8272c0351A0179J80493a62930N2606A36970k1089
11183A15881b26224h7114B81305a8186l63553O5790L4756C3665N18300H9829a22905
$$ plain form
11262 236815 -253038 86294 219105 -78094 -141729 -148494 30810 112143 -369572 101462 -192507
11250 -311701 -3363 -644780 -273678 -220407 -45872 -94811 -226688 -205478 -27512 -272657 -61875
11238 -16975 136242 272566 36743 -214927 -151518 -36811 -208511 111662 350806 -98469
11227 227450 -247067 63516 106203 -148843 -65641 185136 -112909 -385008 -151829 53322
11216 -332232 34819 -360378 -313591 -166962 71838 -326374 -266707 -129696 -59317 160058
11205 -118831 -63555 -33785 -8532 240926 53746 -88280 -379214 43015 -84158 484682 -308551
11193 -339965 187749 -324484 48272 -30351 10179 190672 -162930 -110324 136970 115881
11183 115881 -226224 -87114 281305 -18186 -381739 -315949 -281193 33665 551965 89829 -122905
11171a81536a40k89331H0156a5748A81354E0198g9358A1737P9974c36711c2518
11159a68828c6443j19350B7745f8093B20973H7125b20750G9946b2147l7103k9064
11148h8314A23755a35842J2539c2836j31748k554B97216q5489b17110N9921d2373
11136I5384L9439R5812b08504A70771m6766n4709b6786k17924e9155E9145h9685
11124b87127L087M5995c9402A39070E9708A2244J51226K21393A60199B16O4796
11113F5012K90247A00057J25514E7080f6527A22348b40581E7859b31323f9553
11102A64881G4391J20744G4965J38736O3077G3953O8920D0096J7737J63476p0913
11091A50396a26995B68167Q2041j18492a32351B27152H7726h6986A82275A8195
$$ plain form
11171 -181536 -140 -289471 80156 -15748 181354 50198 -79358 11737 91711 -336711 -32518
11159 -168828 -36443 -155793 27745 -68093 220973 87125 -220750 79946 -22147 -59250 -88314
11148 -88314 123755 -135842 -123303 -32836 -164584 -167138 297216 211727 -217110 -157189 -42373
11136 95384 134823 230635 -208504 170771 124005 69296 -26786 -244710 -59155 59145 -89685
11124 -287127 -284040 -238045 -39402 139070 59708 12244 163470 384863 160199 216 65012
11113 65012 355259 100057 225571 57080 -66527 122348 -240581 57859 -231323 -69553
11102 164881 74391 195135 74965 213701 276778 73953 142873 40096 57833 221309 150396
11091 150396 -126995 268167 350208 231716 -132351 227152 87726 -86986 182275 18195
11080a6126G2088g7192B65143K5179C214J14195c0572B22014Q3501c8772C55680
11068B45080N7943K34848A06593C7080a1595B38711J51547E8822L3970J42500
11058B35292a59810E8211K92345p4173j17163L00383j74394N7698M05087l51143
11048C96851J42141J95161k61401j6945j99478L04832K71849k21794j46267Q3180
11038E48129J20576p8296m3384J07767j06272j70600O9995J64775k19625j60231
11028B32834M60748A41710M41238k1327J76383l03370J95967k73619P2403R1974
11018E21359J21776j13419B64039P2444m8913m728J91578M666A61054N26503j37655
11007E49902k43355R8971f7679D98315j64841l8368M4954P1924K79421m4883k0240
$$ plain form
11080 -16126 72088 -77192 265143 290322 3214 117409 -30572 222014 305515 -38772 355680
11068 245080 303023 537871 106593 37080 -11595 238711 390258 58822 92792 235292
11058 235292 -159810 58211 350556 276383 159220 459603 285209 342907 747994 396851
11048 396851 538992 734153 472752 455807 256329 561161 833010 611216 464949 548129
11038 548129 668705 590409 547025 654792 548520 377920 447915 612690 393065 232834
11028 232834 693582 141710 582948 561621 738004 434634 630601 356982 429385 521359
11018 521359 643135 529716 264039 336483 287570 282842 474420 479086 161054 687557 549902
11007 549902 306547 405518 -67679 498315 333474 295106 340060 411984 691405 646522 626282
10996F26282o4651j69700K24464k51358J41582K18612j31455k75074L23464k52949
10986C89217j12710m3109K95624j72793J56364J08003m723K12972l83537L19047
10976G64355K84834j52139J98269j56222J95798L76095L2814J79976K906M11839
10966B138525j58724j80546K45324l26532j46455k21489m365j80619M7352N1487
10956A263958j13409J25396j1204M7081P0719j84893j46045k1434o8719k14065
10946G47385l7889j57504B52265J12128j72834J40091J77413A19955R2915r3030
10936A19840J87148p7265G8999h8686d1312A98030a76651A57133c13087A65427
10925A52402A4581P7419N4786k5881B5266a74202c9308m0950l8911l6739l54853
$$ plain form
10996 626282 561631 391931 616395 365037 506619 725231 593776 318702 642166 389217
10986 389217 276507 233398 529022 356229 512593 620596 615873 828845 445308 764355
10976 764355 1049189 897050 1095319 939097 1134895 1510990 1543804 1723780 1726686 2138525
10966 2138525 1979801 1799255 2044579 1718047 1571592 1350103 1345738 1165119 1212471 1263958
10956 1263958 1150549 1275945 1264741 1311822 1382541 1197648 1051603 1030169 961450 747385
10946 747385 709496 551992 252265 364393 191559 331650 509063 119955 212870 119840
10936 119840 306988 229723 78999 -88686 -41312 198030 -176651 157133 -313087 165427
10925 152402 14581 92000 146786 120905 25266 -174202 -39308 -80258 -119169 -155908 -510761
10914e10761F3160F015J42201a46970A74002E8818a36963B70756H6383e1696l4164
10903h5860j07917l4815B11738D5393b49807c9776I9923l1595P1323d887p2592
10892g7479l17492A24052j7988d5030m8920k8678H2839b98759C7199o137N2563
10881H3625J95103n0415I442J21970e2669m7054J3480G4237g785A43225a88650
10869a35308F6152P74a26525J1111F836i4899H6087L938R6691a15718A38856B9203
10856b3047A32661E700b46404O5857A62890C4525r859h0547c9958C6426L81435
10845D17861i9584a2523j0571j42452k2523c5224A17334b93308B0391c35913g5291
10833A05248h6638H0002K10247c75297J79038A79994c04776B9980f4959b2887
$$ plain form
10914 -510761 63160 6015 148216 -146970 174002 58818 -136963 270756 86383 -51696 -85860
10903 -85860 -193777 -228592 211738 45393 -249807 -39776 99923 68328 139651 -4887 -77479
10892 -77479 -394971 124052 106064 -45030 -93950 -122628 82839 -298759 37199 31062 83625
10881 83625 278728 228313 9442 131412 -52669 -99723 -86243 74237 -7785 143225 -188650
10869 -135308 66152 66926 -126525 -115414 6836 -94899 86087 90025 186716 -115718 138856 29203
10856 -23047 132661 5700 -246404 -180547 162890 34525 24666 -80547 -39958 36426 417861
10845 417861 -99584 -12523 -23094 -165546 -188069 -35224 117334 -293308 20391 -335913 -75291
10833 105248 -86638 80002 290249 -375297 -196259 179994 -304776 29980 -64959 -22887
10822D2047d11783a582E5876d6654D05958j36586G7280J27792a07200n6706f0612
10810b4628j66152A0708b87065B9593P6298e2834k7209B2753a5801j438p6409
10799i3648C83066e7104m166j78551h4162J3154p0167q148i562A06067J04539
10788B10606c30785B06147b68825B46806e7080j57154a670k06446A5467a37923
10777a94918c532k44115B24662l4097b4992A1946e5924q9798N0745K3699k1476
10766i2754A10392b19916O2486j72750d442B63614b64075A57539b08849j15020
10756c23869J55387b626A8702b31772h1432L5078J0967j59276K7882A27147E107
10744d6925J1283k42221k3367i5666B42599a15498C3920b45828D9809b09161C8726
$$ plain form
10822 42047 -411783 -1582 55876 -46654 405958 269372 77280 205072 -107200 -163906 -60612
10810 -24628 -190780 10708 -287065 29593 105891 -52834 -80043 22753 -15801 -17239 -93648
10799 -93648 383066 -57104 -61270 -239821 -84162 -71008 -141175 -149323 -9562 106067 210606
10788 210606 -330785 206147 -268825 246806 -57080 -214234 -1670 -208116 15467 -137923
10777 -194918 -3532 -247647 224662 190565 -24992 11946 -55924 -145722 -94977 -71278 -92754
10766 -92754 110392 -219916 -157430 -330180 -4442 263614 -264075 157539 -208849 -323869
10756 -323869 -168482 -2626 18702 -231772 -81432 -46354 -35387 -194663 -166781 127147 5107
10744 -46925 -35642 -277863 -301230 -95666 242599 -115498 33920 -245828 49809 -209161 38726
10732A01824a76207j13390K0074A71737c26861a803m78142a8981k45521J18940
10722a45562j39733I3426J1368c5620m5505a7318A74826a35315l7261e5138E0390
10710B27475J09135b02631A06364N9252e2515E6651k6602K08529a19375l4347
10700a53722K891A99662a53024k2173I8819b1229B21980A9906e7470q5214H6498
10688h8693B02801D0055J87835A12429E0535g4707A75997a74245g1636D3785a13011
10676c23946J20518j3748f3840D3074b85042J32192k42668i3551q2822A17869
10665b728p8435j05401K7338P2445c895B4869a40208H4890a49607l941q3670e1014
10652d5366J3658B4136b65592p1975a12729j40028B6914a54444m6662g208m84936
$$ plain form
10732 101824 -176207 -289597 -269523 171737 -326861 -1803 -479945 -18981 -264502 -145562
10722 -145562 -285295 93426 104794 -35620 -81125 -17318 174826 -135315 -172576 -55138 50390
10710 227475 336610 -202631 106364 165616 -52515 56651 30049 238578 -119375 -153722
10700 -153722 -150831 199662 -153024 -175197 98819 -21229 221980 19906 -57470 -142684 86498
10688 -88693 202801 40055 227890 112429 50535 -74707 175997 -174245 -71636 43785 -113011
10676 -323946 -203428 -217176 -63840 43074 -285042 -152850 -395518 -93551 -176373 117869
10665 -2728 -81163 -186564 -159226 -86781 -3895 24869 -140208 84890 -149607 -153548 -237218 -51014
10652 -45366 -31708 24136 -265592 -337567 -112729 -252757 26914 -154444 -201106 -7208 -492144
10641d92144B40315j14233a92909I8434g4118D9465D866R163J17783P8925D0861
10629e8827d009E06219b04279K3719e139l5423k23928K3768a1974k50401I6249
10617b3150j25660o5455J05130d7660A06815m4435j4009f1176b3022E5386k0564
10606C4822a0551m1546q9879j1521C9810g96H1888j544j987c0899k24445A60289
10593c35726h198j39816D980a87800L5730k23763d3556A71895n2129b39916b1853
10581B70260A8437b15006D4852J83885a69958g0280m8201A70739a10335c2475
10570f1824k85653J02214G6010c17391E3115N2224A170a58386J5533A9919e30127
10558b83779I5643D2864c55039L3894J35858j3156k4965D7105B0217e6372j01955
$$ plain form
10641 -492144 240315 126082 -192909 98434 -74118 49465 4866 14029 131812 210737 40861
10629 -58827 -4009 506219 -204279 -180560 -5139 -40562 -264490 -240722 -11974 -262375 96249
10617 -23150 -148810 -214265 -109135 -47660 106815 62380 48371 -61176 -23022 55386 34822
10606 34822 -10551 -52097 -141976 -153497 39810 -796 81888 80344 78357 -30899 -255344 160289
10593 -335726 -8198 -148014 4980 -187800 -152070 -375833 -43556 171895 119766 -239916 -21853
10581 270260 18437 -215006 44852 228737 -169958 -70280 -118481 170739 -110335 -32475
10570 -61824 -347477 -245263 76010 -317391 53115 105339 1170 -158386 -142853 19919 -530127
10558 -283779 95643 42864 -355039 -321145 -185287 -198443 -223408 47105 20217 -56372 -158327
10547a58327d2153j10219E8160c7818k31271F5764d1290j71047G7058d7086A31993
10535g0595r0853C23512b02894h296n9310A94648G0822a2552j2019I7087A6832
10523A47660n9720L2205b29733q6488A58958d9169A69140G2174g3547l13708i0410
10511c5879F4692f7606h541l00043N1468B41770G012g8254j14629b9424A0060
10499a88874D2763a53887j24477J26063A57238d15915K04400J4055D7647b4077
10488c03896F6856b32911Q330I6458m1588a6868A31899K1043b69762b6639B13370
10476B92625a512B47500J18191j34668K16258k00093j021L557G2395Q7306b03844
10464A36416A0194c004j49698e628o1150B14903c68512B51077a44063B6953j0678
$$ plain form
10547 -158327 -42153 -152372 58160 -37818 -269089 65764 -41290 -212337 77058 -47086 131993
10535 -70595 -161448 323512 -202894 -8296 -67606 194648 70822 -12552 -24571 97087 16832
10523 147660 87940 120145 -229733 -316221 158958 -49169 169140 72174 -73547 -387255 -90410
10511 -35879 64692 -67606 -8541 -308584 -257116 241770 7012 -78254 -192883 -29424 10060
10499 -188874 42763 -153887 -278364 -152301 157238 -415915 -211515 -197460 47647 -24077
10488 -303896 66856 -232911 -224581 96458 54870 -16868 131899 152942 -269762 -26639 213370
10476 292625 -1512 247500 365691 231023 447281 247188 246167 249724 72395 159701 -203844
10464 136416 10194 -3004 -152702 -5628 -66778 214903 -368512 251077 -144063 26953 16275
10453A6275J43963a35227O4390m6076L533b4203k50330h7484r9326Q302c4656
10441C3472a68602j84201F2662K71563b43387A62328m8679b71480A16823H397
10430a1987k3199B84754b80491b5417k3516j75405J204c8410F8073J54587D5391
10418c623B3307d1418q6616B6610M19950k05764f2400r6332j09016B78810g4107
10406a43088b4640A86731B5170j0050b47186L15A86124a32347j55568A41046g3587
10394A21177e5073m01768d0786C87317c2995J0140H2171K09794I576K40911l7908
10383B12579Q3903m2l3633m3375b1685h520A32348d5035j41480B24730M1527l0756
10371B35501J92733f4101a9693j1631k00363H7092K88448m5470J94204l2813n1885
$$ plain form
10453 16275 160238 -135227 -70837 -116913 -113380 -24203 -274533 -87484 -186810 -178508 -34656
10441 33472 -168602 -352803 62662 334225 -243387 162328 113649 -271480 116823 8397
10430 -11987 -35186 284754 -280491 -25417 -48933 -224338 -223134 -38410 68073 222660 45391
10418 -3623 23307 -41418 -128034 26610 446560 240796 -62400 -158732 -267748 278810 -74107
10406 -143088 -24640 186731 25170 15120 -247186 -246871 186124 -132347 -287915 141046 -73587
10394 121177 -55073 -456841 -40786 387317 -32995 -22855 82171 291965 9576 250487 212579
10383 212579 296482 296440 262807 219432 -21685 -8520 132348 -45035 -186515 224730 266257 235501
10371 235501 428234 -64101 -19693 -31324 -231687 87092 375540 330070 524274 491461 439576
10360D39576j64383J31639c6105D72476g9777j44442B18217C8400b0311A45092
10349a28273N3795E97230A0695J11839P1040B3813K21585J05718A62168K71328
10339D33496j15403o9517J0961f691A4650J99357J70893H6906c5533C9005H925
10327B4254d3115k1459A10020a99163f6933B03358J70617a77199C50710j24699
10317B26011n8876J35934A07876R219c70790k1600g0527A98870G5238a99010D9339
10305F7095b2389r1977J4410c7869C39810a38181A6365J71231g4697j78403A94485
10293C0163j0107N87775E3007P5082c20380h0453A39238i6842b4344j31950J5788
10282a40506L5812H2141g414A61408a80072n231A66067e0744j98649c0068q2547
$$ plain form
10360 439576 275193 406832 -36105 472476 -79777 -224219 218217 38400 -20311 145092
10349 -128273 -74478 597230 10695 122534 193574 23813 245398 351116 162168 433496
10339 433496 318093 248576 259537 -6691 14650 214007 384900 86906 -35533 39005 8925
10327 24254 -43115 -64574 110020 -199163 -66933 203358 373975 -177199 350710 226011
10317 226011 167135 303069 107876 117095 -370790 -392390 -70527 198870 75238 -199010 49339
10305 67095 -22389 -114366 -99956 -37869 339810 -138181 16365 187596 -74697 -253100 194485
10293 30163 20056 607831 53007 128089 -320380 -80453 139238 -96842 -24344 -156294 -140506
10282 -140506 -104694 82141 -7414 161408 -180072 -185303 166067 -50744 -249393 -30068 -112615
10271a12615K7978L8472r0170D3197P3633a28571d8405A41379J45664a87435C5051
10259A03844b07337J3092A25531b34963H3760J938c01266B21998h717B36561o2142
10248A74419p627J6568m8778Q6644H9257e0553j52223A2915P8901R4853E616c57908
10235D3366b63130H8072h0758m4568A4478K7836c83799A09405f9615k19243B91368
10223a8997k67794J25621d691k31799i0865C6553D585b80156J28284A3983R6532
10212A10515D3163C900a88381p4285A24932h655l84468C7022a03751b2533j4809
10201c7342D69097A5904K33158h1174B43548a90920B18113a80907A5400a19769
10190a14565E8406e0929C2418J18222E3062f8751K5239O369j80334P4070D4000
$$ plain form
10271 -112615 -84637 -46165 -136335 43197 116830 -128571 -48405 141379 287043 -187435 35051
10259 103844 -207337 -194245 125531 -234963 83760 85698 -301266 221998 -8717 236561 174419
10248 174419 166792 183360 134582 221226 89257 -50553 -202776 12915 91816 186669 5616 -357908
10235 43366 -263130 88072 -80758 -125326 14478 42314 -383799 109405 -69615 -288858 291368
10223 -18997 -286791 -161170 -4691 -236490 -90865 36553 4585 -280156 -151872 13983 110515
10212 110515 43163 3900 -188381 -262666 124932 -8655 -393123 37022 -103751 -22533 -37342
10201 -37342 469097 15904 249062 -81174 243548 -190920 218113 -180907 15400 -119769
10190 -114565 58406 -50929 32418 150640 53062 -68751 -43512 -37143 -217477 -143407 44000
10178a2383q3491A87325E7326a3673C9469b76325B93718b7084j74047A88336g3727
10166d48794a45740A88455d8982B5031N8155a77118J672A45096J46898B3721f7198
10154c21m2443j85360a03452k18397d3865q2512p4319A0953a14995b8213H781
10142B87852a85247e7259l04353R0181c1292k77765a33914j66701a30401m6475
10132a76876B8833c10260A62658l4429c3839j01338j6565D2512a40832c7152n3273
10121i0425b4654G8997c4948k89625K5a10962K3908j81234f5712r8075j0445f9704
10108g6091k00482a6557j69174j4525j05400I1864D3035J32428a17963N6139B69425
10096a13049B94246B2055c65820a22800K9306B7438L6356c744j06950A41548C0081
$$ plain form
10178 -12383 -95874 187325 57326 -13673 39469 -276325 293718 -27084 -201131 188336 -73727
10166 -448794 -145740 188455 -48982 25031 83186 -177118 -175446 145096 291994 23721 -67198
10154 -321 -42764 -228124 -103452 -321849 -43865 -126377 -200696 10953 -114995 -28213 8781
10142 287852 -185247 -57259 -361612 -271431 -31292 -309057 -133914 -300615 -130401 -176876
10132 -176876 28833 -310260 162658 128229 -33839 -135177 -151742 42512 -140832 -37152 -90425
10121 -90425 -24654 78997 -34948 -324573 -324548 -110962 -87054 -268288 -65712 -163787 -174232 -69704
10108 -76091 -276573 -16557 -185731 -200256 -305656 91864 43035 175463 -117963 -61824 269425
10096 -113049 294246 22055 -365820 -122800 -93494 27438 63794 -3744 -110694 141548 30081
10084A01962J59698m4332a69673f3861j41292Q4157j49005k6264J17097d7729
10073a73442H4359c62285J5992A04725a44497J735H6433b073E98L8879J70409
10062B09886e37126b45964J05608O3233a9419l6143B00468d56341J92955B45617
10051A91937D4228c62920m1584C30736p1834c5961c868H2762a08577l19975a03767
10039C45830a73903O3308G8421J92249a90118l19985h7338A37051Q754g4768k7098
10028a01866A57888a64472P0823r1043H7260c92299J40234a25040A42653b04584
10017a40948J558j4323B66410F8176e0917A68565n9435L3541b61093J24224e0423
10005e4033j08601K2392j47502A79842K2518a19404p627j84524A89807f7514j83194
$$ plain form
10084 101962 261660 217328 -169673 -63861 -205153 -120996 -270001 -296265 -179168 -47729
10073 -173442 84359 -362285 -346293 104725 -144497 -142762 86433 -2073 598 39477 209886
10062 209886 -537126 -245964 -140356 -77123 -19419 -55562 200468 -456341 -263386 245617
10051 191937 44228 -362920 -404504 330736 258902 -35961 -3868 82762 -108577 -428552 -103767
10039 345830 -173903 -110595 78421 270670 -190118 -510103 -87338 137051 145805 -74768 -101866
10028 -101866 157888 -164472 -93649 -184692 87260 -392299 -252065 -125040 142653 -204584
10017 -140948 -139390 -153713 266410 68176 -50917 168565 109130 142671 -261093 -136869 -50423
10005 -54033 -162634 -140242 -287744 179842 202360 -119404 -127031 -311555 189807 -67514 -250708
9994b50708M8901j19579A07225a95595e193l08807B60351a09109B69811a58424
9983b39938J02725I8606e3177j39715P0366j29139j56454a2692E6491I876b15542
9971F0066a71592j7232q402C88646A24739a11305B3584J90155d23395a61617g5794
9959b05051h6295B46376e4837C26963a63500P1404a9210B473b9034l45311d7051
9947i7348D9721a46668l6445p0833k6156C43685a91684Q6543H961i5986B77535
9935g0956K7977l08361B81618b74948A39207e1649d618j70885A79851a76022f2286
9923H5439a29443B45399a00946N681M5244o4894n5077A12768b9768l25723A31917
9911g5831k14876h4298B22498d5186C0087a01795j16948f3058E9291b35493A14683
$$ plain form
9994 -250708 -201807 -321386 107225 -195595 -5193 -314000 260351 -109109 269811 -158424
9983 -239938 -137213 98606 -53177 -192892 -122526 -251665 -408119 -12692 56491 9876 -215542
9971 60066 -171592 -188824 -197226 388646 124739 -111305 23584 213739 -423395 -161617 -75794
9959 -205051 -86295 246376 -54837 326963 -163500 -92096 -19210 2473 -29034 -374345 -47051
9947 -97348 49721 -146668 -183113 -253946 -280102 343685 -191684 -105141 8961 -95986 277535
9935 -70956 -42979 -351340 281618 -274948 139207 -51649 -4618 -175503 179851 -176022 -62286
9923 85439 -129443 245399 -100946 -95265 -50021 -114915 -169992 112768 -29768 -355491 131917
9911 -75831 -290707 -84298 222498 -45186 30087 -101795 -218743 -63058 59291 -235493 114683
9899a60621A48253D410a17968K7034D1642b50152C7703h2086q071b6625l50716
9888c77341B8862K34195A23693a4277k88792k6946J18621A39036o4161a85692
9877C7485a14779C85094a08033H6511A0503b03730k9660A10285c48904f5575F4607
9865g4074j70953J12991C3134L65272b29191O868M9875l0405k82158D30922e6400
9853c51184E5216P8324R4371d46729B2258d73663a57157J6295D9397a77271A04845
9841A44468D1151b03774A44596b87998a5868j40594C19970B8065f0385k2032B21278
9829A35129J1987l4521e0011A26K38714b56094n885b8317D4012a83954k3352d2735
9816a87017A6193c79313A82786a77122d9949k06883M6163i7481j14584A97115
$$ plain form
9899 -160621 148253 4410 -117968 -90934 41642 -250152 37703 -82086 -90157 -26625 -377341
9888 -377341 28862 263057 123693 -14277 -303069 -330015 -211394 139036 74875 -185692
9877 37485 -114779 385094 -108033 86511 10503 -203730 -233390 110285 -348904 -65575 64607
9865 -74074 -245027 -132036 33134 398406 -229191 -222323 -172448 -202853 -485011 430922 -56400
9853 -351184 55216 133540 227911 -446729 22258 -473663 -157157 -140862 49397 -177271 104845
9841 144468 41151 -203774 144596 -287998 -15868 -156462 319970 28065 -60385 -82417 221278
9829 135129 147116 112595 -50011 126 238840 -256094 -261979 -28317 44012 -183954 -207306 -42735
9816 -187017 16193 -379313 182786 -177122 -49949 -256832 -210669 -97481 -212065 197115
9805A31772b39628A9959R223d35550a95005d0151o6028M5320F9727b01123m5291
9794b46414f0062m768q6597e3165k01113G4932a04763A18455j0949h284o5502
9783g3786A32293O5022E0241P3018D0970b44536B31692b66334f9141k2477E8322
9771a65472B35078a07584B17552D1710c66007h1207P303n5905p8223j11154a19134
9759a30598l55384a81451O5733d7019n5958I7327J48363O5851B7851a42392k58812
9748d01204d373j02107C1341K871b59749A2911b39083a00994A5214h8047A4650
9736b01006L9796f783B53513c1297k2467b5329k20036C1691e1488F8508f9814
9724a6308n9268F3034Q6138a44688k71635c0494l54530C60236c0743j42630Q4907
$$ plain form
9805 131772 -239628 19959 29182 -435550 -195005 -40151 -106179 -60859 69727 -201123 -246414
9794 -246414 -60062 -64830 -151427 -53165 -254278 74932 -104763 118455 107506 -8284 -73786
9783 -73786 132293 197315 50241 123259 40970 -244536 231692 -266334 -69141 -91618 58322
9771 -165472 235078 -107584 217552 41710 -366007 -81207 -73904 -129809 -208032 -319186 -119134
9759 -130598 -485982 -181451 -115718 -47019 -102977 97327 245690 311541 27851 -142392 -401204
9748 -401204 -4373 -106480 31341 34212 -259749 12911 -239083 -100994 15214 -88047 14650
9736 -201006 -161210 -6783 253513 -31297 -53764 -25329 -245365 31691 -51488 68508 -69814
9724 -16308 -75576 63034 149172 -144688 -416323 -30494 -385024 360236 -30743 -173373 -88466
9713h8466A13050c23329G2076b86609e4651j99444j45587B2581a56753B84750
9702H9919B0401b44180Q0021q5214O5728A72293i8327j50035B02918g8035A63637
9690I2473e3112J6508m5115l27127A44954c67077a29615D12599a64061O795C2801
9678B091e2344D2993b19071A5102c61n3953n7409q7198e3401n3164B896a42342
9665c09014g4397j69832Q5858f7062j07399c0938k35421C11319j12792b22803
9654b70509A8447a05110j04551j4545j9099L868A6967K12090r5859I176a5878
9642D51310c6207B04902f2848F018b49861I4596K0878c33526B23646a48943p6654
9631b25597R1154K8947j53298a3934i77I443M6176b79765g8130F1253c74715a8272
$$ plain form
9713 -88466 113050 -323329 72076 -286609 -54651 -254095 -399682 22581 -156753 284750
9702 89919 20401 -244180 -164159 -249373 -183645 172293 -98327 -248362 202918 -78035 163637
9690 92473 -53112 -36604 -81719 -408846 144954 -367077 -129615 412599 -164061 -157266 32801
9678 2091 -52344 42993 -219071 15102 -361 -54314 -111723 -198921 -53401 -106565 2896 -142342
9665 -309014 -74397 -244229 -158371 -67062 -174461 -30938 -266359 311319 198527 -222803
9654 -270509 18447 -105110 -209661 -224206 -243305 -239437 16967 229057 133198 9176 -15878
9642 451310 -36207 204902 -62848 6018 -249861 94596 115474 -333526 223646 -148943 -225597
9631 -225597 -134443 -105496 -258794 -13934 -977 9443 55619 -279765 -78130 61253 -374715 -18272
9618i5504j6464l25177A93932f7208B8961d21885A578r9O271b34344e5361m8117
9606a03478k66329D356a97299Q121C28026I2894a06204r6788J9519O6702A58653
9594d1821l36522E0321b11346m2955m1264O0057m39760c5792B7340g7218k6226
9583a03444K916M4758q8599j02072E05160b43700c9531j00126m2448l4172d1920
9571a66494d1600I0909L711b01373A0475e4059A4373c77916J35855a1447k8718
9560d0165A3096a79002k6013I9072b29780j6916l8175C18908a3625p1421B3414
9548A68343D7266K14388M8547D3816n720d9542m7629o4054k105j2358B49802H0200
9535a770j20710j96575a22146A26668d7965j38864B67259c17603g3804J6245F5853
$$ plain form
9618 -95504 -111968 -437145 193932 -67208 28961 -421885 1578 1479 7750 -234344 -55361 -103478
9606 -103478 -369807 4356 -197299 -189178 328026 92894 -106204 -202992 -183473 -116771 158653
9594 -41821 -378343 50321 -211346 -254301 -295565 -235508 -675268 -35792 27340 -77218 -103444
9583 -103444 -100528 -55770 -144369 -246441 505160 -243700 -39531 -139657 -182105 -216277 -41920
9571 -166494 -41600 90909 94620 -201373 10475 -54059 14373 -377916 -242061 -11447 -40165
9560 -40165 13096 -179002 -205015 99072 -229780 -246696 -284871 318908 -13625 -85046 23414
9548 168343 47266 261654 310201 43816 38096 -49542 -97171 -161225 -163330 -175688 249802 80200
9535 -1770 -122480 -319055 -122146 126668 -47965 -186829 267259 -317603 -73804 -57559 65853
9523b78676A00046C9984N7195h0517F4807c71887a81043A84570a05756A02627
9512b15490A35772c34294o0125A91841a38932A0883J04393c32735J31992b8668
9501A4883M792a45242l962C0796a43192B9773a16135m7640c7570k81265A82591
9489B98862G7775i0500a9222j41500P2307K986A67291a09909D7111d6879j70456
9478b17335M7352f6918n3020j82577I6090a258n9602n554A25561E1869c26235
9466h2789j02916C40582A12671c14624J44527Q114j1830B03520A5598a70969Q2791
9455h8178a8707j58834L0336D6420d9813R181B24454a61297C0870P3127a44737
9443A42792A3052a7292B7603i7665j15588l08849f3494n0297q4218m2391j7814
$$ plain form
9523 -278676 100046 39984 97179 -80517 64807 -371887 -181043 184570 -105756 102627
9512 -215490 135772 -334294 -394419 191841 -138932 10883 115276 -332735 -200743 -28668
9501 14883 19675 -145242 -149204 30796 -143192 29773 -116135 -163775 -37570 -318835 182591
9489 298862 77775 -90500 -19222 -160722 -88415 -85429 167291 -109909 47111 -46879 -217335
9478 -217335 -169983 -66918 -119938 -302515 96090 -1258 -60860 -66414 125561 51869 -326235
9466 -82789 -185705 340582 112671 -314624 -170097 -161983 -173813 203520 15598 -170969 -88178
9455 -88178 -18707 -177541 -147205 46420 -49813 -40632 224454 -161297 30870 103997 -144737
9443 142792 13052 -17292 27603 -97665 -213253 -522102 -63494 -113791 -198009 -240400 -258214
9432b58214f1050C6618A7511b17904O1304J7815l8081C47992f293E1154Q7886
9421A39040a25370a7661B6887J76815b20999i8560A3867g9064k71758b302A23238
9409d9112j34705r7067A14847a14979j98147A9825N2783P6386d48393B6593f9923
9397a74199a7893m1369j35919o1586n0166g2855c540A37522b62857a0481A64594
9385e365A38726a57220j7588h2180k9306e202o3892L1830j37000N624e0033H120
9372A64102N0672i2679J0261C8550d4804A11890O519b50614J02708k11757d7269
9360e30678b5708j00081n8857e0369r5302A32107d7242j32716j36993f6070A8270
9348A8229a53027P2072a9439k9256l870b4857n5647G8733e9595C124K91280A14659
$$ plain form
9432 -258214 -61050 36618 17511 -217904 -156600 -138785 -176866 347992 -6293 51154 139040
9421 139040 -125370 -17661 26887 203702 -220999 -98560 13867 -79064 -350822 -2302 123238
9409 -49112 -183817 -280884 114847 -114979 -313126 19825 72608 148994 -448393 26593 -69923
9397 -174199 -17893 -59262 -195181 -256767 -306933 -72855 -3540 137522 -262857 -10481 164594
9385 -5365 138726 -157220 -174808 -82180 -111486 -5202 -69094 -37264 -174264 -168640 -50033 8120
9372 164102 214774 -92679 -82418 38550 -44804 111890 118409 -250614 -147906 -359663 -47269
9360 -530678 -25708 -125789 -184646 -50369 -145671 132107 -47242 -179958 -316951 -66070 18270
9348 18229 -153027 -80955 -19439 -48695 -52565 -24857 -80504 78733 -59595 3124 294404 114659
9335D39383h2837F1066O2756J64019h7582I559a16621n3696a9677H2054b35373
9323G6872j8963b92074G7393e63525K43443c7155j1553H0505h4435D1187b4399
9311A4890J80567D0452c0843J3113j63280D0196b13494A49613g9040k37650A17252
9299B14589a96931B03689c06497C117a6280B06171a90227B90322A31861D8584
9288a47368P0056A09653b93095B7998J52505k1809g6370b3901l19847R9626g2757
9276B22985a84605G1253a20047g196k18594D5969a71839d2808j12608K8278J9569
9265a07569j56634a5695B6174O088a41556P173I1117a0279A88942K36105B1666
9253a87622D6175A3081a39249k19351B51436a08193K2929A86561h3815B20701
$$ plain form
9335 439383 -82837 61066 123822 287841 -87582 9559 -116621 -170317 -19677 82054 -235373
9323 76872 57909 -292074 77393 -563525 -320082 -37155 -48708 80505 -84435 41187 -24399
9311 14890 195457 40452 -30843 -17730 -181010 40196 -213494 149613 -79040 -316690 117252
9299 214589 -196931 203689 -306497 3117 -16280 206171 -190227 290322 131861 48584
9288 -147368 -77312 109653 -293095 27998 180503 158694 -76370 -23901 -343748 -244122 -72757
9276 222985 -184605 71253 -120047 -7196 -225790 45969 -171839 -42808 -155416 -127138 -107569
9265 -107569 -264203 -15695 26174 32262 -141556 -134383 91117 -10279 188942 425047 21666
9253 -187622 46175 13081 -139249 -358600 251436 -108193 -85264 186561 -83815 220701
9242H8747a06275j60705K8216A12593E1022a68165l4557g7859n8425k76508f1042
9230c05595i4990b0730r7449d6825n4156A28042a58561k01657J15183n8604B11121
9218d00810B04135c9341L092n2877j10540j51237F5540A1612a27518r8926e3109
9206C259d38221P2109I1439A7078b09917D2056P38B618a89597l8817j04403D43556
9193a9192q0967B39541b25524k12518C668a33181H0116b42846a20851B01807a41370
9181a13525E5246L9116J12891c26274L0130F6086b61045A45321b94860R1357O1577
9170a41926A02885l4114a34874l7183r4805K0626A18990J37812F7117c62949J76202
9159a86747k42219a75890D89516H4781j9576i2280b3464p5971k3618m466d4922
$$ plain form
9242 88747 -106275 -266980 -238764 112593 51022 -168165 -202722 -77859 -136284 -412792 -61042
9230 -305595 -94990 -20730 -118179 -46825 -100981 128042 -158561 -360218 -245035 -303639 211121
9218 -400810 204135 -39341 -36249 -89126 -199666 -350903 65540 11612 -127518 -226444 -53109
9206 3259 -438221 -366112 91439 17078 -209917 42056 42794 2618 -189597 -228414 -332817 443556
9193 -19192 -100159 239541 -225524 -438042 3668 -133181 80116 -242846 -120851 201807 -141370
9181 -113525 55246 94362 207253 -326274 -296144 66086 -261045 145321 -294860 -203503 -141926
9170 -141926 102885 68771 -134874 -172057 -266862 -246236 118990 256802 67117 -362949 -186747
9159 -186747 -428966 -175890 489516 84781 65205 -92280 -23464 -99435 -123053 -127519 -44922
9147A0558a69136j69130J40158a0377r2892R227F8828j9808a73663A03232k4066
9136G9166g4774F3475J09915Q4076F9750a03146J8908j20858b6301c018j42294
9125a45312R506N1844o07l9872L315B42167i4367p9567E389J80797k6401a52131
9112E9793R0968i2334j7936k89B08441a00214C530P115J11543a20583l2652l5920
9100a89155k8878B991b91784H2946h9464C17138H2824a8954C6238a68667K0958
9089a47709A22150b7710H4271J60239K0500e7655G9134F792h5749k7591E16d8795
9076e17676b28913A09383b61722A01697a11461a6398I0339c47633J62586k96169
9066d81216i8177j05810c8153C3905h8313K545A61212J15316j7442E3328c13211
$$ plain form
9147 10558 -169136 -338266 -198108 -10377 -103269 -94042 68828 49020 -173663 103232 79166
9136 79166 -74774 63475 173390 257466 69750 -103146 -84238 -205096 -26301 -3018 -145312
9125 -145312 -135806 -83962 -84569 -124441 -121126 242167 -94367 -173934 5389 186186 159785 -152131
9112 59793 150761 -92334 -110270 -110559 208441 -100214 3530 10645 122188 -120583 -153235 -189155
9100 -189155 -218033 2991 -291784 82946 -89464 317138 82824 -18954 36238 -168667 -147709
9089 -147709 122150 -27710 84271 244510 265010 -57655 79134 6792 -85749 -113340 516 -48795
9076 -517676 -228913 109383 -261722 101697 -111461 -16398 90339 -347633 -185047 -481216
9066 -481216 -98177 -203987 -38153 33905 -88313 -85768 161212 276528 259086 53328 -313211
9054A89300H5748d8808H7556h1434A4111K90867c9723F7247a39564A05476a70558
9042h1920d0622A82014H7672b80527F4844i0701F8689e2580o0479a2119r1557
9031a03676D4105b51324K4186O2141e7238I9878b2999j18589n0833F084J69183
9020A75267d07355e018k91836A2651K63445j28855A9073a32998M8196C5652J29980
9009A65632a56770a3038G7145a6897C08940b34514C38389G3154a81842j34368
8999c16210a31164A58146c22784a52967b5931l21855E3036a86305g3212A0653
8988a99368A06701P3942a46611j5461c3697A282K5701b8455j745k19215R4902
8977a54513j81603d6668r0446j22218b3583m42958h170A42179d1523q9897D2040
$$ plain form
9054 189300 85748 -48808 87556 -81434 14111 304978 -39723 67247 -139564 105476 -170558
9042 -81920 -40622 182014 87672 -280527 64844 -90701 68689 -52580 -113059 -12119 -103676
9031 -103676 44105 -251324 -227138 -164997 -57238 99878 -22999 -141588 -192421 6084 175267
9020 175267 -407355 -5018 -296854 12651 276096 147241 19073 -132998 -84802 35652 165632
9009 165632 -156770 -13038 77145 -16897 308940 -234514 338389 73154 -181842 -316210
8999 -316210 -131164 158146 -322784 -152967 -25931 -347786 53036 -186305 -73212 10653
8988 -199368 106701 180643 -146611 -162072 -33697 1282 26983 -28455 -30200 -249415 -154513
8977 -154513 -336116 -46668 -137114 -259332 -23583 -466541 -8170 142179 -41523 -131420 42040
8965D54562e9817C82131a1600j29885I5471d35849A206K35197a1747j53332k50461
8954d15540J06997O0796B4639R254A1147a05014L6645I6317b12929A6302b65315
8942a26686I6725a80211A55072c3765j02024M5826r6684D0130c28148a3826B6730
8930C64344a67490c0610G463c14767E3754O1133J31159m1694J32766L80364R64680
8919A682162M694434R394881D670113A560519B16177K36463a09473A5922Q3103
8910I9025J23395J00117p5689B5018J03274K75730j28798F8806a45690j59940
8900c05630l71717B5234O775b55786J09697L7773A2514a43944j4024j22768A33276
8888E04959B7951J47492Q6400a05775B8679L2576L3071a08222j0265B93562A09666
$$ plain form
8965 454562 -59817 382131 -11600 -141485 95471 -435849 1206 236403 -11747 -165079 -415540
8954 -415540 -308543 -247747 24639 33893 11147 -105014 -68369 96317 -212929 16302 -265315
8942 -126686 96725 -180211 155072 -33765 -135789 -89963 -186647 40130 -328148 -13826 26730
8930 364344 -167490 -30610 7463 -314767 53754 114887 246046 204352 337118 717482 1682162
8919 1682162 6376596 15771477 4670113 1560519 216177 452640 -109473 15922 99025
8910 99025 222420 322537 246848 25018 128292 404022 275224 68806 -145690 -305630
8900 -305630 -677347 25234 32009 -255786 -146089 -108316 12514 -143944 -157968 -280736 133276
8888 504959 27951 175443 261843 -105775 28679 61255 94326 -108222 -118487 293562 109666
8876B31458e6880o885F9508C0725a05174B66677d5020r2414d337l23128A21426
8864i5520j85053C7037c51817a06539j55918a15907j41527e244k18127c4738r5428
8853a30166A17159f343r9245q2477j35069c8899j83516O5037B0873d45182a4191
8841a55182D901h3384a7871j27354I5270N022Q7128a66055j25571J02032H0015
8829a64908f8213j49636j09252i6401A71893b06720i6054N2H4644Q4720c92358
$$ plain form
8876 231458 -56880 -63765 69508 30725 -105174 266677 -45020 -137434 -4337 -327465 121426
8864 -95520 -280573 37037 -351817 -106539 -262457 -115907 -257434 -5244 -223371 -34738 -130166
8853 -130166 117159 -6343 -105588 -188065 -323134 -38899 -222415 -157378 20873 -445182 -14191
8841 -155182 4901 -83384 -17871 -145225 95270 100292 187420 -166055 -291626 -189594 80015
8829 -164908 -68213 -217849 -327101 -96401 171893 -206720 -96054 -96002 84644 169364 -392358
$$ [...]
##END NTUPLES=NMR SPECTRUM
##END=
