
##TITLE=AC1346_GUAAH12164_6647547_vDHIZcHlFm
##JCAMPDX= 6.0         $$ Bruker NMR JCAMP-DX V2.0
##DATA TYPE= NMR SPECTRUM
##DATA CLASS= NTUPLES
##ORIGIN= BRUKER
##OWNER= Administrator
$$ 1.72 TOPSPIN		Version 2.1
$$ 2012-08-10 14:55:49.656 -0500  Administrator@TOPSPIN
$$ Compression mode = diff/dup
##.OBSERVE FREQUENCY= 400.02188249412
##.OBSERVE NUCLEUS= ^1H
##.ACQUISITION MODE= SIMULTANEOUS (DQD)
##.ACQUISITION SCHEME= undefined
##.AVERAGES= 64
##.DIGITISER RES= 22
##SPECTROMETER/DATA SYSTEM= spect
##.PULSE SEQUENCE= noesygpps1d.comp
##.SOLVENT NAME= COFFEE_meoh
##.SHIFT REFERENCE= INTERNAL, COFFEE_meoh, 1, 14.96291
##AUDIT TRAIL= $$ (NUMBER, WHEN, WHO, WHERE, PROCESS, VERSION, WHAT)
$$ ##TITLE= Audit trail, TOPSPIN		Version 2.1
$$ ##JCAMPDX= 5.01
$$ ##ORIGIN= Bruker BioSpin GmbH
$$ ##OWNER= Administrator
$$ $$ C:\Bruker\TOPSPIN/data/COFFEE/nmr/AC1346_GUAAH12164_6647547_vDHIZcHlFm/22/pdata/1/auditp.txt
$$ ##AUDIT TRAIL=  $$ (NUMBER, WHEN, WHO, WHERE, PROCESS, VERSION, WHAT)
(   1,<2012-08-10 14:55:43.937 -0500>,<Administrator>,<TOPSPIN>,<go>,<TOPSPIN 2.1>,
      <created by zg
	started at 2012-08-10 14:44:13.734 -0500,
	POWCHK enabled, PULCHK disabled,
       configuration hash MD5:
       6B 1B 68 BB D9 2E 58 E2 7F 35 AD 54 07 DF 0E 41
       data hash MD5: 64K
       D5 70 3A D9 80 7C 39 8B 61 82 9F 25 12 F6 8D 92>)
(   2,<2012-08-10 14:55:47.109 -0500>,<Administrator>,<TOPSPIN>,<proc1d>,<TOPSPIN 2.1>,
      <Start of raw data processing
       efp LB = 0.3 FT_mod = 6 PKNL = 1 PHC0 = 0 PHC1 = 0 SI = 128K 
       data hash MD5: 128K
       DC 0D B1 CB A3 D0 39 1D D6 13 9B 8F 3D 6D D5 B0>)
(   3,<2012-08-10 14:55:48.328 -0500>,<Administrator>,<TOPSPIN>,<proc1d>,<TOPSPIN 2.1>,
      <pk PHC0 = 5.614014 PHC1 = 0 
       data hash MD5: 128K
       63 B8 88 A9 95 8F 1B D1 38 2A B2 4C 94 FB B5 6A>)
(   4,<2012-08-10 14:55:48.953 -0500>,<Administrator>,<TOPSPIN>,<proc1d>,<TOPSPIN 2.1>,
      <abs ABSG = 1 
       data hash MD5: 128K
       AC 32 E6 BC A4 07 D4 9D 51 96 A6 43 15 F2 45 97>)
(   5,<2012-08-10 14:55:49.031 -0500>,<Administrator>,<TOPSPIN>,<proc1d>,<TOPSPIN 2.1>,
      <abs ABSG = 2 
       data hash MD5: 128K
       29 A5 81 77 3F 50 59 0A 11 6F 01 3E C1 EC D9 8F>)
(   6,<2012-08-10 14:55:49.406 -0500>,<Administrator>,<TOPSPIN>,<proc1d>,<TOPSPIN 2.1>,
      <abs ABSG = 3 
       data hash MD5: 128K
       B2 50 D7 58 1F 14 3C 39 42 91 B3 E7 98 8F D3 56>)
(   7,<2012-08-10 14:55:49.515 -0500>,<Administrator>,<TOPSPIN>,<proc1d>,<TOPSPIN 2.1>,
      <abs ABSG = 4 
       data hash MD5: 128K
       3C 30 25 91 49 E8 A3 03 28 1E CA 0B D1 E3 8B 15>)
(   8,<2012-08-10 14:55:49.562 -0500>,<Administrator>,<TOPSPIN>,<proc1d>,<TOPSPIN 2.1>,
      <abs ABSG = 5 
       data hash MD5: 128K
       1E 2B 57 A7 17 FB A6 67 86 6B 57 E4 4A A1 DF D6>)
$$ ##END=
$$ 
$$ $$ hash MD5
$$ $$ 80 68 00 BD 9A 3A F0 F0 9F 71 99 1E 16 D2 82 B0
##$RELAX= 
##$RELAX= 
##$RELAX= 
##$RELAX= 
##$RELAX= 
##$RELAX= 
##$RELAX= 
##$RELAX= 
$$ Bruker specific parameters
$$ [...]
150 150 150 150 150 150 150 150
##$TP07= 0
##$TPNAME0= <>
##$TPNAME1= <>
##$TPNAME2= <>
##$TPNAME3= <>
##$TPNAME4= <>
##$TPNAME5= <>
##$TPNAME6= <>
##$TPNAME7= <>
##$TPOAL= (0..7)
0.5 0.5 0.5 0.5 0.5 0.5 0.5 0.5
##$TPOFFS= (0..7)
0 0 0 0 0 0 0 0
##$TUNHIN= 0
##$TUNHOUT= 0
##$TUNXOUT= 0
##$USERA1= <user>
##$USERA2= <user>
##$USERA3= <user>
##$USERA4= <user>
##$USERA5= <user>
##$V9= 5
##$VALIST= <valist>
##$VCLIST= <CCCCCCCCCCCCCCC>
##$VD= 0
##$VDLIST= <DDDDDDDDDDDDDDD>
##$VPLIST= <PPPPPPPPPPPPPPP>
##$VTLIST= <TTTTTTTTTTTTTTT>
##$WBST= 1024
##$WBSW= 4
##$XGAIN= (0..3)
0 0 0 0
##$XL= 0
##$YL= 0
##$YMAX_a= 16367280
##$YMIN_a= -8390534
##$ZGOPTNS= <>
##$ZL1= 120
##$ZL2= 120
##$ZL3= 120
##$ZL4= 120
##$ABSF1= 14.96291
##$ABSF2= -5.595272
##$ABSG= 5
##$ABSL= 3
##$ALPHA= 0
##$AQORDER= 0
##$ASSFAC= 0
##$ASSFACI= 0
##$ASSFACX= 0
##$ASSWID= 0
##$AUNMP= <proc_prof1d_extract.lims>
##$AXLEFT= 0
##$AXNAME= <>
##$AXNUC= <1H>
##$AXRIGHT= 0
##$AXTYPE= 0
##$AXUNIT= <>
##$AZFE= 0.1
##$AZFW= 0.1
##$BCFW= 0
##$BC_mod= 0
##$BYTORDP= 0
##$COROFFS= 0
##$CY= 15
##$DATMOD= 1
##$DC= 0
##$DFILT= <>
##$DTYPP= 0
##$F1P= 0
##$F2P= 0
##$FCOR= 0.5
##$FTSIZE= 131072
##$FT_mod= 6
##$GAMMA= 0
##$GB= 0
##$INTBC= 1
##$INTSCL= 1
##$ISEN= 128
##$LB= 0.3
##$LEV0= 0
##$LPBIN= 0
##$MAXI= 10000
##$MC2= 0
##$MEAN= 0
##$ME_mod= 0
##$MI= 0
##$NCOEF= 0
##$NC_proc= -2
##$NLEV= 6
##$NOISF1= 0
##$NOISF2= 0
##$NSP= 0
##$NTH_PI= 0
##$NZP= 0
##$OFFSET= 14.96291
##$PC= 1
##$PHC0= 5.614014
##$PHC1= 0
##$PH_mod= 1
##$PKNL= yes
##$PPARMOD= 0
##$PPDIAG= 0
##$PPIPTYP= 0
##$PPMPNUM= 2147483647
##$PPRESOL= 1
##$PSCAL= 4
##$PSIGN= 0
##$PYNMP= <proc.py>
##$REVERSE= no
##$SF= 400.020008872069
##$SI= 131072
##$SIGF1= 0
##$SIGF2= 0
##$SINO= 400
##$SIOLD= 131072
##$SPECTYP= <>
##$SREGLST= <1H.CDCl3>
##$SSB= 0
##$STSI= 131072
##$STSR= 0
##$SW_p= 8223.68421052631
##$SYMM= 0
##$S_DEV= 0
##$TDeff= 65536
##$TDoff= 0
##$TI= <>
##$TILT= no
##$TM1= 0
##$TM2= 0
##$TOPLEV= 0
##$USERP1= <user>
##$USERP2= <user>
##$USERP3= <user>
##$USERP4= <user>
##$USERP5= <user>
##$WDW= 1
##$XDIM= 131072
##$YMAX_p= 427865484
##$YMIN_p= -10887
##$CURPLOT= <Network HP LaserJet P1505>
##$CURPRIN= <$Network HP LaserJet P1505>
##$DFORMAT= <normdp>
##$LAYOUT= <+/1D_H.xwp>
##$LFORMAT= <normlp>
##$PFORMAT= <normpl>
##$SURQMSG= 1
$$ End of Bruker specific parameters
$$ ---------------------------------
##NTUPLES= NMR SPECTRUM
##VAR_NAME=  FREQUENCY,     SPECTRUM/REAL,   SPECTRUM/IMAG
##SYMBOL=    X,             R,               I
##VAR_TYPE=  INDEPENDENT,   DEPENDENT,       DEPENDENT
##VAR_FORM=  AFFN,          ASDF,            ASDF
##VAR_DIM=   131072,        131072,          131072
##UNITS=     HZ,            ARBITRARY UNITS, ARBITRARY UNITS
##FACTOR=    0.0627417313425164, 1,          1
##FIRST=     8223.62146879497, 1121,         -53974
##LAST=      0,             2901,            -54046
##MIN=       0,             -10887,          0
##MAX=       8223.62146879497, 427865484,    0
$$ Real data points
##PAGE= N=1
##DATA TABLE= (X++(R..R)), XYDATA
$$ [...]
60929B235481j47759j33440j19506j07027r4997q3091p3193o6730o2685n9645
$$ 2235481 2087722 1954282 1834776 1727749 1632752 1549661 1476468 1409738 1347053 1287408
60919A287408n7580n6269n4148n0333m6033m2524l9338l5738l2181k9090k5780
$$ 1287408 1229828 1173559 1119411 1069078 1023045 980521 941183 905445 873264 844174 818394
60908H18394k2025j9115j7895j7184j5514j3211j1413j0177q936p763p012o451
$$ 818394 796369 777254 759359 742175 726661 713450 702037 691860 682924 675161 668149 661698
60896F61698n795n229m629l306j260M64J464K697M687O337O578N953N467N109
$$ 661698 655903 650674 646045 642739 641479 641943 643407 646104 650791 657128 663706 669659 675126 680235
60882F80235M631M529M997N079M219L659M740O659P371O244M478L225K601K254
$$ 680235 684866 689395 694392 699471 703690 707349 712089 718748 726119 732363 736841 740066 742667 744921
60868G44921J854J014m18k096l661n125o422p052o801o266o197o676p333p824
$$ 744921 746775 747789 747371 745275 741614 736489 730067 723015 716214 709948 703751 697075 689742 681918
60854F81918p850p273o452n810m955l062l03K163L798N231O880Q336R501J1084
$$ 681918 674068 666795 660343 654533 649578 646516 646213 648376 652174 657405 664285 672621 682122 693206
60840F93206J3211J4723J4675J3522J2185J0862R524Q589Q367Q650R379J0825
$$ 693206 706417 721140 735815 749337 761522 772384 781908 790497 798864 807514 816893 827718
60828H27718J2650J3805J3949J3779J3529J2414J0230Q126O935O044M840L932
$$ 827718 840368 854173 868122 881901 895430 907844 918074 926200 933135 939179 944019 947951
60816I47951L844L792K929J828J407J404R82K4j217k899m976o723p856r137j0935
$$ 947951 951795 955587 958516 960344 961751 963155 964137 964161 962944 960045 955069 948346 940490 931353 920418
60801I20418j2306j2593j2796j3984j5440j5791j5042j3960j2422r930p051m708
$$ 920418 908112 895519 882723 868739 853299 837508 822466 808506 796084 786154 779103 774395
60789G74395k642j71K129L165L389M423O731R141J0631J1318J1671J1953J2381
$$ 774395 771753 771582 773711 776876 780265 784688 791419 800560 811191 822509 834180 846133 858514
60776H58514J2827J2447J0674Q415P183P151P099O219M898L721K650J400j05j781
$$ 858514 871341 883788 894462 902877 910060 917211 924310 930529 935427 939148 941798 943198 943093 941312
60762I41312l318m139l872k789j412J7J372K458L458M935O901Q506R190R396R661
$$ 941312 937994 933855 929983 927194 925782 925799 927171 929629 933087 938022 944923 953429 962619 972015 981676
60747I81676R833R846J0251J1094J1248R934P976O482N137L119R41j21J08P23
$$ 981676 991509 1001355 1011606 1022700 1033948 1043882 1051858 1058340 1063477 1066596 1067537 1067416 1067524 1068247
60733A068247J182J463J184Pj377j923j744j758k123k190j870j826k333l047l815
$$ 1068247 1069429 1070892 1072076 1072083 1070706 1068783 1067039 1065281 1063158 1060968 1059098 1057272 1054939 1051892 1048077
60718A048077m774n783o638p724r514j1660j3436j4860j6390j7798j8303j7738
$$ 1048077 1043303 1037520 1030882 1023158 1013644 1001984 988548 973688 957298 939500 921197 903459
60706I03459j6730j5794j4991j4179j2976j0845p876n055l008j138J229L570N050
$$ 903459 886729 870935 855944 841765 828789 817944 810068 805013 802005 800867 802096 805666 810716
60693H10716N954P064Q235Q737Q491P779O360M114J933N85p29l194o276q414r381
$$ 810716 816670 823734 831969 840706 849197 856976 863336 867450 869383 869968 869239 866045 859769 851355 841974
60678H41974j0315j1571j2320j2283j2119j1938j0977r090p203n890m749l469
$$ 841974 831659 820088 807768 795485 783366 771428 760451 751361 744158 738268 733519 730050
60666G30050k412j943j976k424l120l460l064k609k926l509l239k301j956k406
$$ 730050 727638 725695 723719 721295 718175 714715 711651 709042 706116 702607 699368 697067 695111 692705
60652F92705k465j550m99n0K17R36K064L192L804L097P54j976l113k230p93j61
$$ 692705 690240 688690 688191 688141 688358 689294 691358 694550 698354 701451 702205 700229 697116 694886 694093 693932
60636F93932k83n50o00L7J904M729P536R848J1872J3490J4279J4703J5933J8063
$$ 693932 693649 693099 692499 692536 694440 699169 706705 716553 728425 741915 756194 770897 786830 804893
60622H04893J9760K0164J9971K0118K0489K0517K0057J9035J7135J4442J1734
$$ 804893 824653 844817 864788 884906 905395 925912 945969 965004 982139 996581 1008315
60611A008315R605P953O499N163L668J640o58k541l984n626p505q865r509j0245
$$ 1008315 1017920 1025873 1032372 1037535 1041203 1042843 1042185 1039644 1035660 1030034 1022529 1013664 1004155 993910
60597I93910j1685j3449j4952j6033j6503j6006j4746j3470j2380j0949r086p530
$$ 993910 982225 968776 953824 937791 921288 905282 890536 877066 864686 853737 844651 837121
60585H37121o658n908m810l763l248l148l214l456l621l144k005r14j97P02K227
$$ 837121 830463 824555 819745 815982 812734 809586 806372 802916 799295 796151 794146 793232 793035 793737 795964
60570G95964L907N021N446N508N575N936O527O634N569L711K095J030j8j226k134
$$ 795964 799871 804892 810338 815846 821421 827357 833884 840518 846087 849798 851893 852923 852905 851679 849545
60555H49545k675l333m111m458m348m306m224l433k170j548j666j141Q46L432
$$ 849545 846870 843537 839426 834968 830620 826314 822090 818657 816487 814939 813273 812132 812978 816410
60541H16410N734Q230J1714J5989K0589K5664L1089L5579L7712L7121L3878K7652
$$ 816410 822144 830374 842088 858077 878666 904330 935419 970998 1008710 1045831 1079709 1107361
60529A107361J8487P725k869j2417k0530k6313k8873k8423k6035k2506j8171j3396
$$ 1107361 1125848 1133573 1130704 1118287 1097757 1071444 1042571 1014148 988113 965607 947436 934040
60517I34040q559l716J025N094P869R331R907R894R343Q236O644N019M296N139
$$ 934040 925481 921765 922790 927884 935753 945084 954991 964885 974228 982464 989108 994127 998423 1003562
60503A003562P121R435J2380J7141K3915L1448L8901M7139N7517P0365Q5319J02176
$$ 1003562 1010683 1020118 1032498 1049639 1073554 1105002 1143903 1191042 1248559 1318924 1404243 1506419
60491A506419J20584J39774J59603J81273K06107K33982K63518K92720L17992
$$ 1506419 1627003 1766777 1926380 2107653 2313760 2547742 2811260 3103980 3421972
60482C421972L32783L28934L00516K46676J71295Q0869j6935j13373j98826k64798
$$ 3421972 3754755 4083689 4384205 4630881 4802176 4883045 4866110 4752737 4553911 4289113
60472D289113l06972l26459l27704l15312k93140k65198k35545k06819j79991
$$ 4289113 3982141 3655682 3327978 3012666 2719526 2454328 2218783 2011964 1831973
60463A831973j55663j34593j16714j00937q6591p4158o4093n5864m8694m2398
$$ 1831973 1676310 1541717 1425003 1324066 1237475 1163317 1099224 1043360 994666 952268
60453I52268l6994l2271k8296k5451k3577k1824j9812j8102j7100j6348j5426
$$ 952268 915274 883003 854707 829256 805679 783855 764043 745941 728841 712493 697067
60442F97067j4584j3966j3127j1895j0801j0044q955p225n734n354n592n280m019
$$ 697067 682483 668517 655390 643495 632694 622650 613695 606470 600736 595382 589790 584510 580491
60429E80491k272n84O07R46N34lj71P0P60J942L087L461L321L770N086O270O640
$$ 580491 578219 577635 578242 579188 579722 579719 579548 579618 580378 582320 585407 588868 592189 595959 601045 607315 613955
60412F13955O617O493N696M044K543K095K361K684L066L521L503K886K419K506
$$ 613955 620572 627065 632761 636805 639348 641443 643804 646488 649554 653075 656578 659464 661883 664389
60398F64389K556K308K571L690M597M470M117M470M874M315L296K985L302L385
$$ 664389 666945 669253 671824 675514 680111 684581 688698 693168 698042 702357 705653 708638 711940 715325
60384G15325L207L283L331K746J893J533J489J193J024J676K606K634J783J153
$$ 715325 718532 721815 725146 727892 729785 731318 732807 734000 735024 736700 739306 741940 743723 744876
60370G44876J159J268J250J311J111N2j384j921j215k78M5p0j07J39Q23K028L385
$$ 744876 746035 747303 748553 749864 750975 751027 749643 747722 746507 746229 746274 746204 746097 746236 747059 749087 752472
60353G52472M352M975N721O670P541Q361R400J0442J0903J0669J0180R671Q885
$$ 752472 756824 761799 767520 774190 781731 790092 799492 809934 820837 831506 841686 851357 860242
60340H60242P553N806M103K928K315J579P3j663k199j046P43K202L747O043Q666
$$ 860242 867795 873601 877704 880632 882947 884526 884599 882936 880737 879691 880434 882636 886383 892426 901092
60325I01092J0790J2399J3678J3989J2610R978P049M011O43k593n095p208r528
$$ 901092 911882 924281 937959 951948 964558 974536 981585 985596 986239 983646 978551 971343 961815
60312I61815j1446j1679j0084p815n802m132k759j745q43K99J575K820M371O463
$$ 961815 950369 938690 928606 920791 914989 910857 908098 906353 905510 905809 907384 910204 914575 921038
60298I21038Q444R521R882J0141J0111R191P596O008M324J881j143l680n117n800
$$ 921038 929482 939003 948885 959026 969137 978328 985924 991932 996256 998137 996994 993314 988197 982397
60284I82397o237o603o876o821o010m512l094k120r23R73K803L777M551O193Q377
$$ 982397 976160 969557 962681 955860 949850 945338 942244 940124 939201 940174 942977 946754 951305 957498 965875
60269I65875J0018J1167J2740J4788J6595J8255K0523K3252K5513K7325K9732
$$ 965875 975893 987060 999800 1014588 1031183 1049438 1069961 1093213 1118726 1146051 1175783
60258A175783L3132L6938M0977M5807N1424N7092O2700O9064P6469Q4184R1741
$$ 1175783 1208915 1245853 1286830 1332637 1384061 1441153 1503853 1572917 1649386 1733570 1825311
60247A825311R9578J08005J16603J24921J32895J40212J46109J50041J51845J51094
$$ 1825311 1924889 2032894 2149497 2274418 2407313 2547525 2693634 2843675 2995520 3146614
60237C146614J47215J40265J30796J18951J04559Q8077P0512N2425L3870J5245
$$ 3146614 3293829 3434094 3564890 3683841 3788400 3876477 3946989 3999414 4033284 4048529
60227D048529k767j9962l6254n0671o1778o9051p2788p2925o9185o2237n3287
$$ 4048529 4045762 4025800 3989546 3938875 3877097 3808046 3735258 3662333 3593148 3530911 3477624
60216C477624m2611k9850j5663j482J2608K7994M5154O2681P9326R5518J12042
$$ 3477624 3435013 3405163 3389500 3388018 3400626 3428620 3473774 3536455 3615781 3711299 3823341
60205C823341J28342J42971J54798J63094J67324J67435J63681J55728J42812
$$ 3823341 3951683 4094654 4249452 4412546 4579870 4747305 4910986 5066714 5209526
60196E209526J25130J04096Q0875N5695K8898J520k5708n2662p8428j00727j17773
$$ 5209526 5334656 5438752 5519627 5575322 5604220 5605740 5580032 5527370 5448942 5348215 5230442
60185E230442j29797j37860j41895j41006j35098j25145j12086r6354p8456n9253
$$ 5230442 5100645 4962785 4820890 4679884 4544786 4419641 4307555 4211201 4132745 4073492
60175D073492l9466j9312J344K2494M3684O4129Q3133J00125J14091J23452J27099
$$ 4073492 4034026 4014714 4016058 4038552 4082236 4146365 4229498 4329623 4443714 4567166 4694265
60164D694265J25276J18823J07954R2538P3308N1851K9516P208j3935l2679m8470
$$ 4694265 4819541 4938364 5046318 5138856 5212164 5264015 5293531 5300739 5286804 5254125 5205655
60153E205655o1038o9329p1965o8907o1492n0612l5953j7438L579K5168M6287
$$ 5205655 5144617 5075288 5003323 4934416 4872924 4822312 4786359 4768921 4772500 4797668 4843955
60142D843955O7076Q8285J10589J33955J57728J81926K08064K37660K70131L03248
$$ 4843955 4911031 4999316 5109905 5243860 5401588 5583514 5791578 6029238 6299369 6602617
60132F602617L35520L66728L96205M22214M43495M59926M70992M74898M70007
$$ 6602617 6938137 7304865 7701070 8123284 8566779 9026705 9497697 9972595 10442602
60123A0442602M56097M33508M02147L62205L15011K62174K04533J42693P8020
$$ 10442602 10898699 11332207 11734354 12096559 12411570 12673744 12878277 13020970 13098990
60114A3098990J2267n3455j18656j82644k43993l00513l49435l88108m14864m29127
$$ 13098990 13111257 13057802 12939146 12756502 12512509 12211996 11862561 11474453 11059589 10630462
60104A0630462m30920m20944m01020l73569l40311l01976k59315k13653j66415
$$ 10630462 10199542 9778598 9377578 9004009 8663698 8361722 8102407 7888754 7722339
60095G722339j18752p1693k5888J8610O1391J00552J33569J59246J77768J88778
$$ 7722339 7603587 7531894 7506006 7524616 7586007 7686559 7820128 7979374 8157142 8345920
60085H345920J90765J82753J65326J39670J06801O8383K7234j3816n2984q9218
$$ 8345920 8536685 8719438 8884764 9024434 9131235 9199618 9226852 9213036 9160052 9070834
60075I070834j21809j50787j76756j99758k19005k34109k45623k53775k57574
$$ 9070834 8949025 8798238 8621482 8421724 8202719 7968610 7722987 7469212 7211638
60066G211638k55883k48817k37546k23189k06428j87558j66528j43335j18647
$$ 7211638 6955755 6706938 6469392 6246203 6039775 5852217 5685689 5542354 5423707
60057E423707r3557o8622m3650j8519O537L1480N6477Q1148J04557J25955J44823
$$ 5423707 5330150 5261528 5217878 5199359 5205896 5237376 5293853 5375001 5479558 5605513 5750336
60046E750336J60129J70434J74854J73111J64810J49690J28658J03423P5055M3876
$$ 5750336 5910465 6080899 6255753 6428864 6593674 6743364 6872022 6975445 7050500 7094376
60036G094376J0798k2587n5360q7438j18081j45394j67694j84353j95133j99869
$$ 7094376 7105174 7082587 7027227 6939789 6821708 6676314 6508620 6324267 6129134 5929265
60026E929265j99109j93889j84624j71337j54944j36955j17732r6642p4124n1876
$$ 5929265 5730156 5536267 5351643 5180306 5025362 4888407 4770675 4674033 4599909 4548033
60016D548033l0565r033J3590L6724N9948Q4015J09208J34277J58109J81056K03358
$$ 4548033 4517468 4508435 4522025 4558749 4618697 4702712 4811920 4946197 5104306 5285362 5488720
60005E488720K23417K38813K48058K50319K44542K30217K08374J80842J49063
$$ 5488720 5712137 5950950 6199008 6449327 6693869 6924086 7132460 7313302 7462365
59996G462365J14186P7390L9326O3l9794p8624j14809j47223j74321j94143k05952
$$ 7462365 7576551 7653941 7693267 7693330 7653536 7574912 7460103 7312880 7138559 6944416 6738464
59985F738464k10754k09552k02312j89276j71862j51396j28193j02726p6400n0181
$$ 6738464 6527710 6318158 6115846 5926570 5754708 5603312 5475119 5372393 5295993 5245812
59975E245812k3719L223K9511N3766P5543R4587J10199J22214J31388J37836J40464
$$ 5245812 5222093 5225316 5254827 5308593 5384136 5478723 5588922 5711136 5842524 5980360 6120824
59964F120824J38798J34039J27211J17699J04752Q9011P1452N2315L2361J3687
$$ 6120824 6259622 6393661 6520872 6638571 6743323 6832334 6903786 6956101 6988462 7002149
59954G002149k196j5766k7489l5878l9135l7370l1473k0990n026J5926M0875P0160
$$ 7002149 6999953 6984187 6956698 6920820 6881685 6844315 6812842 6791852 6786826 6802752 6843627 6913787
59942F913787J04489J43076J84562K28942K76685L26728L77288M27960M78873
$$ 6913787 7018276 7161352 7345914 7574856 7851541 8178269 8555557 8983517 9462390
59933I462390N28024N71321O04946O25888O30358O13646N72029N04092M10827
$$ 9462390 9990414 10561735 11166681 11792569 12422927 13036573 13608602 14112694 14523521
59924A4523521K95968J66086K9101j07213k35018l46473m36192n03138n48592
$$ 14523521 14819489 14985575 15014676 14907463 14672445 14325972 13889780 13386642 12838050
59915A2838050n73111n77209n64063n38841n05319m64971m19193l70235l19730
$$ 12838050 12264939 11687730 11123667 10584826 10079507 9614536 9195343 8825108 8505378
59906H505378k68211k16549j66207j17715p0266k3327K2601O6995J09865J50836
$$ 8505378 8237167 8020618 7854411 7736696 7666430 7643103 7665704 7732699 7842564 7993400
59896G993400J88705K22176K50202K71393K83790K85285K73802K47593K06261
$$ 7993400 8182105 8404281 8654483 8925876 9209666 9494951 9768753 10016346 10222607
59887A0222607J51323Q5189J0314o9749j49419k22725k85714l36515l73998l97838
$$ 10222607 10373930 10459119 10469433 10399684 10250265 10027540 9741826 9405311 9031313 8633475
59877H633475m09202m09793m00535l82432l57981l30082l00027k68178k36114
$$ 8633475 8224273 7814480 7413945 7031513 6673532 6343450 6043423 5775245 5539131
59868E539131k06289j79899j56899j37852j23830j14508j08263j04336j03121
$$ 5539131 5332842 5152943 4996044 4858192 4734362 4619854 4511591 4407255 4304134
59859D304134j04046j04960j04088j01161r6207q8742p8655o6753n3933m0787
$$ 4304134 4200088 4095128 3991040 3889879 3793672 3704930 3626275 3559522 3505589 3464802
59849C464802k8160j7032p720l03M152L980j263j0401k1898l4405m6138n5291
$$ 3464802 3436642 3419610 3411890 3411587 3415739 3419719 3418456 3408055 3386157 3351752 3305614 3250323
59837C250323o1313o4713o5557o3327n8320n1810m4597l6504k7488j8143q880
$$ 3250323 3189010 3124297 3058740 2995413 2937093 2885283 2840686 2804182 2776694 2758551 2749671
59826B749671L64R508J8375K7417L7395M8334N9580P0588Q0561Q7848R1126R1096
$$ 2749671 2750035 2759543 2777918 2805335 2842730 2891064 2950644 3021232 3101793 3189641 3280767 3371863
59814C371863Q9569Q7081Q2745P6201O8019N8152M5814L1224J5997J511j1666
$$ 3371863 3461432 3548513 3631258 3707459 3775478 3833630 3879444 3910668 3926665 3928176 3916510
59803C916510k2496k9232l1135k9149k4390j7009o808O151K1871M0226O0224Q0714
$$ 3916510 3894014 3864782 3833647 3804498 3780108 3763099 3756291 3762442 3784313 3824539 3884763 3965477
59791C965477J02105J26258J54435J86552K22606K63360L09179L59371M13046
$$ 3965477 4067582 4193840 4348275 4534827 4757433 5020793 5329972 5689343 6102389
59782F102389M68980N23332N67766N90241N77830N20621M16347K73649J10577
$$ 6102389 6571369 7094701 7662467 8252708 8830538 9351159 9767506 10041155 10151732
59773A0151732n1454j94021l05175l80375m21585m34554m25691m00936l66267
$$ 10151732 10100278 9906257 9601082 9220707 8799122 8364568 7938877 7537941 7171674
59764G171674l27300k87838k49585k13330j79576j48332j19487r3400p0119m8412
$$ 7171674 6844374 6556536 6306951 6093621 5914045 5765713 5646226 5552826 5482707 5434295
59754E434295k6914n958J3188L0732M8391O7060Q6084J05036J24480J44744J65486
$$ 5434295 5407381 5401423 5414611 5445343 5493734 5560794 5646878 5751914 5876394 6021138 6186624
59743F186624J87002K10512K36669K65014K95249L27911L63531M02254M44327
$$ 6186624 6373626 6584138 6820807 7085821 7381070 7708981 8072512 8474766 8919093
59734H919093M89723N37277N85520O34053O82376P27359P63834P87848P97592
$$ 8919093 9408816 9946093 10531613 11165666 11848042 12575401 13339235 14127083 14924675
59725A4924675P91242P66532P23637O66804O02419N36994M77486M31159M03301
$$ 14924675 15715917 16482449 17206086 17872890 18475309 19012303 19489789 19920948 20324249
59716B0324249L95880M08994M42171M93426N58509O32238P09532P84557Q50167
$$ 20324249 20720129 21129123 21571294 22064720 22623229 23255467 23964999 24749556 25599723
59707B5599723Q99171R25249R22342Q85023Q10954P02517N65747M08746K41336
$$ 25599723 26498894 27424143 28346485 29231508 30042462 30744979 31310726 31719472 31960808
59698C1960808P4506q1247k16882l24746l99511m39970m48537m28429l82381l13898
$$ 31960808 32035314 31954067 31737185 31412439 31012928 30572958 30124421 29695992 29313611 28999713
59688B8999713k27477j26653j3312J10600K42655L81817N28607O82254Q39464
$$ 28999713 28772236 28645583 28632271 28742871 28985526 29367343 29895950 30578204 31417668
59679C1417668R96772J151526J298469J426692J521524J568009J551577J458154
$$ 31417668 32414440 33565966 34864435 36291127 37812651 39380660 40932237 42390391
59671D2390391J277889J010495O67430K70472j50986n64068r38393j250961j487372
$$ 42390391 43668280 44678775 45346205 45616677 45465691 44901623 43963230 42712269 41224897
59662D1224897j641162j713824j714050j654698j550068j416233j272295j139097
$$ 41224897 39583735 37869911 36155861 34501163 32951095 31534862 30262567 29123470
59654B9123470j035899r77117r68762j005024j068803j138410j195814j230326
$$ 29123470 28087571 27110454 26141692 25136668 24067865 22929455 21733641 20503315
59646B0503315j237603j217980j175515j116341j046478r70713q92668q15021
$$ 20503315 19265712 18047732 16872217 15755876 14709398 13738685 12846017 12030996
59638A2030996p39895o69293o04706n46150m92495m43057l98003l57134l19551
$$ 12030996 11291101 10621808 10017102 9470952 8978457 8535400 8137397 7780263 7460712
59629G460712k84916k53608k25170j98147j72129j48409j27717j08900r0859p4281
$$ 7460712 7175796 6922188 6697018 6498871 6326742 6178333 6050616 5941716 5850857 5776576
59619E776576o0354m9240m1034l6812l7228m1296m7834n6931o8733q1921r4747
$$ 5776576 5716222 5666982 5625948 5589136 5551908 5510612 5462778 5405847 5337114 5255193 5160446
59608E160446j06470j16582j23884j27676j28783j28007j24773j18614j10658
$$ 5160446 5053976 4937394 4813510 4685834 4557051 4429044 4304271 4185657 4074999
59599D074999j02140r2687q1747p0492o0439n1260m1754l2072k3167j4966o984
$$ 4074999 3972859 3880172 3798425 3727933 3667494 3616234 3574480 3542408 3519241 3504275 3497291
59588C497291R0N422R938J5088K0214K3174K3402K2499K1854K1489K1155K1075
$$ 3497291 3497381 3502803 3512741 3527829 3548043 3571217 3594619 3617118 3638972 3660461 3681616 3702691
59576C702691K1537K3003K6460L2386L9759M7367N5663O5818P7455Q9031J00245
$$ 3702691 3724228 3747231 3773691 3806077 3845836 3893203 3948866 4014684 4092139 4181170 4281415
59565D281415J12303J25793J40061J54884J71252J90001K10855K33155K56493
$$ 4281415 4393718 4519511 4659572 4814456 4985708 5175709 5386564 5619719 5876212
59556E876212K80352L04012L27100L49642L71386L91507M08811M21820M29169
$$ 5876212 6156564 6460576 6787676 7137318 7508704 7900211 8309022 8730842 9160011
59547I160011M30533M26703M18253M04903L86945L66311L45237L24800L05935
$$ 9160011 9590544 10017247 10435500 10840403 11227348 11593659 11938896 12263696 12569631
59538A2569631K90625K80060K72089K62556K49476K34625K20971K09722J99741
$$ 12569631 12860256 13140316 13412405 13674961 13924437 14159062 14380033 14589755 14789496
59529A4789496J88201J71215J44844J06529N5587p216p9959j59633k42528l24653
$$ 14789496 14977697 15148912 15293756 15400285 15455872 15448656 15368697 15209064 14966536 14641883
59519A4641883m01757m69685n25340n66971n93435o04198o00588n85978n63896
$$ 14641883 14240126 13770441 13245101 12678130 12084695 11480497 10879909 10293931 9730035
59510I730035n36715n06530m75772m45774m15931l85451l54945l25198k95638
$$ 9730035 9193320 8686790 8211018 7765244 7349313 6963862 6608917 6283719 5988081
59501E988081k65611k36130k08816j83867j60517j38672j18586r9741q1541o4378
$$ 5988081 5722470 5486340 5277524 5093657 4933140 4794468 4675882 4576141 4494600 4430222
59491D430222m8480l2617j5630J654J7806L3325M9819O7361Q4769J02125J20918
$$ 4430222 4381742 4349125 4333495 4335149 4352955 4386280 4436099 4503460 4588229 4690354 4811272
59480D811272J41736J63791J86739K11213K37319K64150K90847L16710L40222
$$ 4811272 4953008 5116799 5303538 5514751 5752070 6016220 6307067 6623777 6963999
59471F963999L59275L72322L78083L74399L58683L29535K86851K30966J63179
$$ 6963999 7323274 7695596 8073679 8448078 8806761 9136296 9423147 9654113 9817292
59462I817292Q6831O383p4314j51801k21973k81180l28164l63370l86882l98680
$$ 9817292 9904123 9910506 9836192 9684391 9462418 9181238 8853074 8489704 8102822 7704142
59452G704142m00341l94365l82047l63864l41628l18133k94641k70738k46681
$$ 7704142 7303801 6909436 6527389 6163525 5821897 5503764 5209123 4938385 4691704
59443D691704k23864k02798j82699j63416j45851j30059j14888r9973q6331p4406
$$ 4691704 4467840 4265042 4082343 3918927 3773076 3643017 3528129 3428156 3341825 3267419
59433C267419o3288n2428m2472l3739k5425j7080r395k884K997Q685J3691J7571
$$ 3267419 3204131 3151703 3109231 3075492 3050067 3032987 3023592 3020708 3023705 3032390 3046081 3063652
59421C063652K0669K3343K5550K7583L0165L3455L7062M1405M7830N6619O5718
$$ 3063652 3084321 3107664 3133214 3160797 3190962 3224417 3261479 3302884 3350714 3407333 3473051
59410C473051P2061P3878P1868O9075O9533P5847Q7684J03169J21578J43806J70521
$$ 3473051 3545112 3618990 3690858 3759933 3829466 3905313 3992997 4096166 4217744 4361550 4532071
59399D532071K00952K33289K65313K95188L23352L53496L90191M35118M86481
$$ 4532071 4733023 4966312 5231625 5526813 5850165 6203661 6593852 7028970 7515451
59390G515451N41509N97817O52381P00956P39111P62961P69264P56410P25626
$$ 7515451 8056960 8654777 9307158 10008114 10747225 11510186 12279450 13035860 13761486
59381A3761486O80125O23150N57957M88926M20661L55830K95376K40448J91897
$$ 13761486 14441611 15064761 15622718 16111644 16532305 16888135 17183511 17423959 17615856
59372A7615856J47786J03608N5725L020n5012j19551j90762k66143l41230m10792
$$ 17615856 17763642 17867250 17922975 17925995 17870983 17751432 17560670 17294527 16953297 16542505
59362A6542505m69139n11067n33642n36471n20382m87333m41637l89467l36439
$$ 16542505 16073366 15562299 15028657 14492186 13971804 13484471 13042834 12653367 12316928
59353A2316928k86712k44304k13330j96257j93261k03587k25913k57075k92297
$$ 12316928 12030216 11785912 11572582 11376325 11183064 10979477 10753564 10496489 10204192
59344A0204192l27373l59487l85906m03870m12460m12867m06267l92995l74199
$$ 10204192 9876819 9517332 9131426 8727556 8315096 7902229 7495962 7102967 6728768
59335F728768l52308l28922l03957k77658k51724k27492k04572j82335j61278
$$ 6728768 6376460 6047538 5743581 5465923 5214199 4986707 4782135 4599800 4438522
59326D438522j41979j24074j07296r2252p9183o7137n5316m4095l3943k4448j5217
$$ 4438522 4296543 4172469 4065173 3972921 3893738 3826601 3771285 3727190 3693247 3668799 3653582
59315C653582o545J609J0135J9497K9011L8023M6823N5849O5070P4741Q5404R6682
$$ 3653582 3647037 3648646 3658781 3678278 3707289 3745312 3792135 3847984 3913054 3987795 4073199 4169881
59303D169881J07313J16845J25917J34433J41016J44905J46694J46459J42926
$$ 4169881 4277194 4394039 4519956 4654389 4795405 4940310 5087004 5233463 5376389
59294E376389J35523J25723J15268J04510R3544Q3577P5888P0704O8161O9191
$$ 5376389 5511912 5637635 5752903 5857413 5950957 6034534 6110422 6181126 6249287 6318478
59284F318478P4344Q2789R3437J05845J19075J30901J39298J43679J43641J37754
$$ 6318478 6392822 6475611 6569048 6674893 6793968 6924869 7064167 7207846 7351487 7489241
59274G489241J24724J04824P9245M9179J6507j6061m6835p6263j05060j32070
$$ 7489241 7613965 7718789 7798034 7847213 7863720 7847659 7800824 7724561 7619501 7487431
59264G487431j54902j71623j80858j81576j74167j60835j43658j23076r9171p3329
$$ 7487431 7332529 7160906 6980048 6798472 6624305 6463470 6319812 6196736 6097565 6024236
59254F024236m7263k1369M583K9960N3838P6361R8118J18755J37454J54366J70315
$$ 6024236 5976973 5955604 5960187 5990147 6043985 6120346 6218464 6337219 6474673 6629039 6799354
59243F799354J85490J99669K13530K28700K46525K67615K92327L20831L52576
$$ 6799354 6984844 7184513 7398043 7626743 7873268 8140883 8433210 8754041 9106617
59234I106617L86119M19263M48893M70896M80683M73994M47633M00271L32736
$$ 9106617 9492736 9911999 10360892 10831788 11312471 11786465 12234098 12634369 12967105
59225A2967105K47090J45579L1278r0513k12750l28832m33524n22039n89992o34965
$$ 12967105 13214195 13359774 13391052 13300539 13087789 12758957 12325433 11803394 11213402 10578437
59215A0578437o57375o59569o45013o18172n83536n44101n01569m57919m15403
$$ 10578437 9921062 9261493 8616480 7998308 7414772 6870671 6369102 5911183 5495780
59206E495780l74991l36468l00241k67484k38359k11860j87778j66953j49219
$$ 5495780 5120789 4784321 4484080 4216596 3978237 3766377 3578599 3411646 3262427
59197C262427j33081j18026j05195r5070q6509p8787p2578o8013o3835n9543n6205
$$ 3262427 3129346 3011320 2906125 2811055 2724546 2645759 2573181 2505168 2441333 2381790 2325585
59186B325585n4048n1324m7078m2920m0414l8519l5421l1257k7271k3651k0003
$$ 2325585 2271537 2220213 2173135 2130215 2089801 2051282 2015861 1984604 1957333 1933682 1913679
59175A913679j6622j3665j0231n804j428J989N239R325J3729J7679K1746K6589
$$ 1913679 1897057 1883392 1873161 1867357 1865929 1867918 1873157 1882482 1896211 1913890 1935636 1962225
59163A962225L1438L5456L9286M3579M7410M9952N2542N7039O3140O9089P4243
$$ 1962225 1993663 2029119 2068405 2111984 2159394 2209346 2261888 2318927 2382067 2451156 2525399
59152B525399P9220Q4399Q9942R6466J04014J11137J16548J20855J25157J28909
$$ 2525399 2604619 2689018 2778960 2875426 2979440 3090577 3207125 3327980 3453137 3582046
59142C582046J30830J30886J29608J26232J19450J09421R7435Q4177O9872N5464
$$ 3582046 3712876 3843762 3973370 4099602 4219052 4328473 4425908 4510085 4579957 4635421
59132D635421M2037K9680J8368R427M616M264P732J4963K6303M1428N9858Q1835
$$ 4635421 4677458 4707138 4725506 4734933 4739549 4743813 4751545 4766508 4792811 4834239 4894097 4975932
59120D975932J07350J35074J63581J92865K23192K53212K80494L03119L19226
$$ 4975932 5083282 5218356 5381937 5574802 5797994 6051206 6331700 6634819 6954045
59111F954045L25668L18720K95863K56161K00076J30373N2485k7292j03443j70662
$$ 6954045 7279713 7598433 7894296 8150457 8350533 8480906 8533391 8506099 8402656 8231994
59101H231994k23704k59683k79554k85930k80524k65109k43171k18425j92608
$$ 8231994 8008290 7748607 7469053 7183123 6902599 6637490 6394319 6175894 5983286
59092E983286j66531j42151j21599j05112r2051q3079p9358q0361q4472r1090
$$ 5983286 5816755 5674604 5553005 5447893 5355842 5272763 5193405 5113044 5028572 4937482
59082D937482j00215j10731j21145j31242j41072j49039j53262j54209j53868
$$ 4937482 4837267 4726536 4605391 4474149 4333077 4184038 4030776 3876567 3722699
59073C722699j52671j49359j43574j36417j28557j19737j10136j00515r1027q1403
$$ 3722699 3570028 3420669 3277095 3140678 3012121 2892384 2782248 2681733 2590706 2509303
59063B509303p2086o3829n6499m9675m3932m0197l8371l7950l9217m2393m6365
$$ 2509303 2437217 2373388 2316889 2267214 2223282 2183085 2144714 2106764 2067547 2025154 1978789
59052A978789m9850n2896n5753n7267n6345n4019n2006m9988m6456m1526l6811
$$ 1978789 1928939 1876043 1820290 1763023 1706678 1652659 1600653 1550665 1504209 1462683 1425872
59041A425872l2924k9155k5232k1523j7945j4410j1714j0235q594n467j829O48
$$ 1425872 1392948 1363793 1338561 1317038 1299093 1284683 1272969 1262734 1254140 1248673 1246844 1247492
59029A247492K417M932P645Q740Q225P707P467O375M418K894K105J260N05P52
$$ 1247492 1249909 1254841 1262486 1271226 1279451 1287158 1294625 1301000 1305418 1308312 1310417 1311677 1312182 1312934
59015A312934J596J753J488K311M301O064P338R304J2100J4290J5090J5196J5169
$$ 1312934 1314530 1316283 1317771 1320082 1324383 1330447 1337785 1347089 1359189 1373479 1388569 1403765 1418934
59002A418934J4819J4258J3824J3038J1348R684R380R993J0073R699J0094J1171
$$ 1418934 1433753 1448011 1461835 1474873 1486221 1495905 1505285 1515278 1525351 1535050 1545144 1556315
58990A556315J1800J2179J3489J5381J6225J5850J5682J6193J6549J6732J7613
$$ 1556315 1568115 1580294 1593783 1609164 1625389 1641239 1656921 1673114 1689663 1706395 1724008
58979A724008J8904J9461J9773K1635K5171K8511L0770L3032L6088L9395M2633
$$ 1724008 1742912 1762373 1782146 1803781 1828952 1857463 1888233 1921265 1957353 1996748 2039381
58968B039381M6243N0036N3206N5792N8219N9601N8626N6030N3945N2923N1895
$$ 2039381 2085624 2135660 2188866 2244658 2302877 2362478 2421104 2477134 2531079 2584002 2635897
58957B635897N0883N1162N2832N4818N7352O1827O8094P4557Q1128Q9322R9259
$$ 2635897 2686780 2737942 2790774 2845592 2902944 2964771 3032865 3107422 3188550 3277872 3377131
58946C377131J09280J18913J29460J41328J53568J66444J81614J99207K17550
$$ 3377131 3486411 3605324 3734784 3876112 4029680 4196124 4377738 4576945 4794495
58937D794495K36381K57564K81978L08542L36985L68736M04315M42756M84391
$$ 4794495 5030876 5288440 5570418 5878960 6215945 6584681 6988996 7431752 7916143
58928G916143N31263N83695O39539O97806P60084Q26764Q94742R60208J020880
$$ 7916143 8447406 9031101 9670640 10368446 11128530 11955294 12850036 13810244 14831124
58919A4831124J073560J111985J128995J118933J076565R96336Q75165P15018
$$ 14831124 15904684 17016669 18145664 19264597 20341162 21337498 22212663 22927681
58911B2927681N21812L03865P2459j58637l76592n71869p37207q67135r60115
$$ 22927681 23449493 23753358 23825817 23667180 23290588 22718719 21981512 21114377 20154262
58902B0154262j019173j048626j051634j031893r95257r47674q92826q33162p71645
$$ 20154262 19135089 18086463 17034829 16002936 15007679 14060005 13167179 12334017 11562372
58893A1562372p10954o52136n95351n41008m89485m41047l96767l58175l25519
$$ 11562372 10851418 10199282 9603931 9062923 8573438 8132391 7735624 7377449 7051930
58884G051930k97805k74724k56670k42577k29953k17600k06210j95792j84895
$$ 7051930 6754125 6479401 6222731 5980154 5750201 5532601 5326391 5130599 4945704
58875D945704j72996j61240j49987j38092j25383j13447j02941r2664q2203p2950
$$ 4945704 4772708 4611468 4461481 4323389 4198006 4084559 3981618 3888954 3806751 3733801
58865C733801o5338n7709m9305m1781l6220l1042k4516j7210j0366l914K352P719
$$ 3733801 3668463 3610754 3561449 3519668 3483448 3452406 3427890 3410680 3400314 3396400 3398752 3406471
58853C406471J2199J7329K3918L0836L7233M4012N1844N9882O7699P6399Q6486
$$ 3406471 3418670 3435999 3459917 3490753 3527986 3571998 3623842 3683724 3751423 3827822 3914308
58842C914308R6726J06475J17074J29641J43462J57748J72885J88885K04866K21202
$$ 3914308 4011034 4117509 4234583 4364224 4507686 4665434 4838319 5027204 5232070 5453272
58832E453272K39832K61327K84242L08540L36814L70625M08465M49069M93946
$$ 5453272 5693104 5954431 6238673 6547213 6884027 7254652 7663117 8112186 8606132
58823H606132N44651O00116O58754P20720P85927Q51994R16008R75866J027773
$$ 8606132 9150783 9750899 10409653 11130373 11916300 12768294 13684302 14660168 15687941
58814A5687941J064769J079829J068391J026151R47498Q29024O72982M85509K73955
$$ 15687941 16752710 17832539 18900930 19927081 20874579 21703603 22376585 22862094 23136049
58805B3136049M8228j78078l91423n82404p44806q73444r65797j023992j052445
$$ 23136049 23184277 23006199 22614776 22032372 21287566 20414122 19448325 18424333 17371888
58796A7371888j054766j034703r97950r50372q95865q37712p79940p25012o72125
$$ 17371888 16317122 15282419 14284469 13334097 12438232 11600520 10820580 10095568 9423443
58787I423443o20078n70081n23795m80726m39923m02197l68388l37457l08542
$$ 9423443 8803365 8233284 7709489 7228763 6788840 6386643 6018255 5680798 5372256
58778E372256k82748k60641k40292k20298k02338j88070j75883j63711j52593
$$ 5372256 5089508 4828867 4588575 4368277 4165939 3977869 3801986 3638275 3485682
58769C485682j44204j36945j28115j18204j09508j01963r3808q5069p7086o9602
$$ 3485682 3341478 3204533 3076418 2958214 2848706 2746743 2652935 2567866 2490780 2421178
58759B421178o1603n4039m8567m4420l9499l3839k9194k6012k3383k1173j9682
$$ 2421178 2359575 2305536 2256969 2212549 2173050 2139211 2110017 2084005 2060622 2039449 2019767
58748B019767j8150j5971j4319j4290j4664j3882j2786j2832j3206j2483j1660
$$ 2019767 2001617 1985646 1971327 1957037 1942373 1928491 1915705 1902873 1889667 1877184 1865524
58737A865524j2523j4397j5520j6302j8194k0478k1462k1780k3359k5967k7919
$$ 1865524 1853001 1838604 1823084 1806782 1788588 1768110 1746648 1724868 1701509 1675542 1647623
58726A647623k9293l1392l3741l4805l4975l5794l6818l6259l4232l2392l0887
$$ 1647623 1618330 1586938 1553197 1518392 1483417 1447623 1410805 1374546 1340314 1307922 1277035
58715A277035k8559k5733k3935k3047k1465j8868j6394j4355j2078r582p322m789
$$ 1277035 1248476 1222743 1198808 1175761 1154296 1135428 1119034 1104679 1092601 1083019 1075697 1070908
58703A070908j433J814L842N171O412O284L517o36m293p899j2616j7236j9684
$$ 1070908 1069475 1071289 1075131 1080302 1086714 1092998 1096515 1095879 1091586 1083687 1071071 1053835 1034151
58690A034151k0398k1150k1679k0505j8140j6379j5229j3492j1514j0466r775
$$ 1034151 1013753 992603 970924 950419 932279 915900 900671 887179 875665 865199 855424
58679H55424q169o235n142m000j518R54J348N20O34J075k86k724l405j908k16
$$ 855424 847255 841020 835878 831878 830360 831314 832662 833182 833816 834891 834605 831881 828476 826568 826352
58664H26352J297M070P742J0001J0185R788R406Q285O824O399O791O646O280P230
$$ 826352 827649 831719 839461 849462 859647 869435 878841 887126 893950 900349 907140 913786 920066 927296
58650I27296R407J1520J3768J7148K0768K2886K4068K6201K9082L1152L2902L6159
$$ 927296 936703 948223 961991 979139 999907 1022793 1046861 1073062 1102144 1133296 1166198 1202357
58638A202357M0591M4334M7570N2134N8170O4568P2054Q2265R4263J05726J17174
$$ 1202357 1242948 1287282 1334852 1386986 1445156 1509724 1581778 1664043 1758306 1864032 1981206
58627A981206J31383J48901J67832J87799K10366K35654K62041K88858L15687
$$ 1981206 2112589 2261490 2429322 2617121 2827487 3063141 3325182 3614040 3929727
58618C929727L39267L54669L59242L51882L29300K87482K26913J52707P0019j6524
$$ 3929727 4268994 4623663 4982905 5334787 5664087 5951569 6178482 6331189 6401208 6384684
58608F384684r9598j70785k26297k67236k94153l05930l04257k94254k79330k59573
$$ 6384684 6285086 6114301 5888004 5620768 5326615 5020685 4716428 4422174 4142844 3883271
58598C883271k36117k12761j91822j72340j53771j37789j25136j14110j03500
$$ 3883271 3647154 3434393 3242571 3070231 2916460 2778671 2653535 2539425 2435925
58589B435925r3844q4848p4825o3733n3726m5977l9863l5678l4785l6501l8287
$$ 2435925 2342081 2257233 2182408 2118675 2064949 2018972 1979109 1943431 1908646 1872145 1833858
58578A833858l9538m1876m5262m7405m7549m7303m7133m5602m2693m0276l8551
$$ 1833858 1794320 1752444 1707182 1659777 1612228 1564925 1517792 1472190 1429497 1389221 1350670
58567A350670l5564l0980k6898k4355k2367k0825k0813k1602k1021j9159j8139
$$ 1350670 1315106 1284126 1257228 1232873 1210506 1189681 1168868 1147266 1126245 1107086 1088947
58556A088947j7940j6289j3022j0501r272p326m148j536J10K228M411M580L288
$$ 1088947 1071007 1054718 1041696 1031195 1021923 1014597 1010449 1008913 1009023 1011251 1015662 1020242 1023530
58543A023530L428N139N481L815K764L069K239n39k972m305o716j0624j3371j4042
$$ 1023530 1026958 1032097 1037578 1041393 1044157 1047226 1049465 1048926 1045954 1041649 1034933 1024309 1010938 996896
58529I96896j5131j7762j9766k0055k0497k1834k2051k0487j9282j9149j8021
$$ 996896 981765 964003 944237 924182 903685 881851 859800 839313 820031 800882 782861
58518G82861j5342j3394j2822j1331q367o497o603o215m323l137l458l033j285
$$ 782861 767519 754125 741303 729972 721605 715108 708505 702290 697967 694830 691372 688339 687054
58505F87054p46j946j867M17J635K01q45O22K232J857J190J714J580m44k118j632
$$ 687054 686308 684362 682495 682912 684547 684748 683903 684525 686757 688614 689804 691518 693098 692654 690536 688904
58489F88904m83O7J274L341L864K375K075M574P180P873Q545J0782J2901J3839
$$ 688904 688421 688488 689762 693103 696967 699342 701417 705991 713171 721044 729589 740371 753272 767111
58475G67111J5400J7997J8736J6410J3865J2672J0180M711j070n032r012j4272
$$ 767111 782511 800508 819244 835654 849519 862191 872371 877082 876012 870980 861968 847696
58463H47696j8222j9069j9156k0425k1018j9534j8053j7742j6130j2159r120r076
$$ 847696 829474 810405 791249 770824 749806 730272 712219 694477 678347 666188 657068 647992
58451F47992r111o804m632n125o196n377m246m666m823k978j099r77q23P71J722
$$ 647992 638881 632077 627445 622320 616124 610747 606501 601835 597012 594034 592935 591958 591135 591906 593628
58436E93628P89N56K578M082L112K262L646M936M230L977O071P956P699P918J0600
$$ 593628 594417 594973 597551 601633 604745 607007 610653 615589 619819 623796 629867 637823 645522 653440 664040
58421F64040J3032J3201J3937J7147J9221J7142J4098J3826J4316J2328R423Q103
$$ 664040 677072 690273 704210 721357 740578 757720 771818 785644 799960 812288 821711 829814
58409H29814O569K667j259k742m004p295r946r275p949r089j0484r055o679o220
$$ 829814 836383 839050 837791 835049 831045 823750 813804 804529 796580 787491 777007 767952 761273 755053
58395G55053o117m226k580l108l098k43K496K345K015M202N901M185K311L809
$$ 755053 748936 744710 742130 739022 735924 735681 738177 740522 742537 746739 752640 756825 759136 762945
58381G62945N679L924J006R59J807k70l622m750m950o629p392m496r62n61j034
$$ 762945 768624 772548 773554 774513 776320 776050 772428 767678 762728 756099 748707 744211 743249 742688 741654
58366G41654J116L581K871J379K808M997M348K888L883N007L104J089K760N400
$$ 741654 742770 746351 749222 750601 753409 758406 762754 765642 769525 774532 777636 778725 781485 786885
58352G86885M887L471M897O645M918K538L729N871M651K639M269P043O400M754
$$ 786885 791772 795243 800140 806785 811703 814241 817970 823841 828492 831131 835400 842443 848843 853597
58338H53597O730R926R448P339Q446J1016J0515Q594R331J0695Q792O216P191
$$ 853597 860327 870253 879701 887040 895486 906502 917017 925611 934942 945637 954429 960645 967836
58325I67836Q872O733L780M933P223N495K822M885Q889Q715O359P396R761Q170
$$ 967836 976708 983441 987221 992154 999377 1004872 1007694 1012579 1021468 1030183 1036542 1043938 1053699 1061869
58311A061869N157O393R432Q534O231Q429J2477J2034R435J1039J4574J3623J0481
$$ 1061869 1067026 1073419 1082851 1091385 1097616 1106045 1118522 1130556 1139991 1151030 1165604 1179227 1189708
58298A189708J1915J6108J6515J4614J6105J8691J6752J3726J6410K1341K0651
$$ 1189708 1201623 1217731 1234246 1248860 1264965 1283656 1300408 1314134 1330544 1351885 1372536
58287A372536J6915J7988K1662K0305J6350J7800K2463K2313J9631K2894L0282
$$ 1372536 1389451 1407439 1429101 1449406 1465756 1483556 1506019 1528332 1547963 1570857 1601139
58276A601139L3391L3501L7782M3239M1399L5346L4822L8075L6181L1476L3294
$$ 1601139 1634530 1668031 1705813 1749052 1790451 1825797 1860619 1898694 1934875 1966351 1999645
58265A999645L9038L8495L3681L5062M1329M2668M0858M5675N4422N6008N2500
$$ 1999645 2038683 2077178 2110859 2145921 2187250 2229918 2270776 2316451 2370873 2426881 2479381
58254B479381N5213O2260O2123N6737N8253O5366O6305O2823O7163P7504Q1255
$$ 2479381 2534594 2596854 2658977 2715714 2773967 2839333 2905638 2968461 3035624 3113128 3194383
58243C194383Q0353Q7629J00407J04448J02017J08323J22044J28167J28284J38001
$$ 3194383 3274736 3362365 3462772 3567220 3669237 3777560 3899604 4027771 4156055 4294056
58233D294056J55664J64773J66436J77267J96112K06221K09595K24211K48008
$$ 4294056 4449720 4614493 4780929 4958196 5154308 5360529 5570124 5794335 6042343
58224F042343K62203K69565K90831L23733L46289L60538L89954M33355M67040
$$ 6042343 6304546 6574111 6864942 7188675 7534964 7895502 8285456 8718811 9185851
58215I185851M93096N37157N97354O47275O90982P59802Q52804R40008J026866
$$ 9185851 9678947 10216104 10813458 11460733 12151715 12911517 13764321 14704329 15731195
58206A5731195J151197J313501J480919J664096J913688K238286K612650L070307
$$ 15731195 16882392 18195893 19676812 21340908 23254596 25492882 28105532 31175839
58198C1175839L687547M469138N365072O412570P732841R380321J1360640J3820736
$$ 31175839 34863386 39332524 44697596 51110166 58843007 68223328 79583968 93404704
58190I3404704J7030305K1166426K6385776L3053336M1178880M9002578N2541751
$$ 93404704 110435009 131601435 157987211 191040547 232219427 281222005 333763756
58183C33763756M7669577L3385991J3046160p737872k4381217l4990898l9916476
$$ 333763756 381433333 414819324 427865484 420127612 395746395 360755497 320839021
58176C20839021m0567827l8546045l5139665l1106622k6826076k2608612j8766670
$$ 320839021 280271194 241725149 206585484 175478862 148652786 126044174 107277504
58169A07277504j5461492j2674923j0358329q491676p003697n771534m726994
$$ 107277504 91816012 79141089 68782760 60291084 53287387 47515853 42788859
58162D2788859l867675l158563k521476j925055j386212q76963l24510K99829
$$ 42788859 38921184 35762621 33241145 31316090 29929878 29052915 28728405 29028234
58154B9028234R97277J830886K832546L757746M080905L384763J747157l01557
$$ 29028234 30025511 31856397 34688943 38446689 42527594 45912357 47659514 47357957
58146D7357957k158058l457204m124607m277922m106426l770930l358878k912299
$$ 47357957 45199899 41742695 37618088 33340166 29233740 25462810 22103932 19191633
58138A9191633k470641k069013j719202j420266j176202r85891q32047o98905
$$ 19191633 16720992 14651979 12932777 11512511 10336309 9350418 8518371 7819466
58130G819466n88022n03123m35256l76385l31290l02723k80433k57087k39201
$$ 7819466 7231444 6728321 6293065 5916680 5585390 5282667 5002234 4745147 4505946
58121D505946k30864k22686k08010j93962j85522j74678j56276j38693j27909
$$ 4505946 4275082 4052396 3844386 3650424 3464902 3290224 3133948 2995255 2867346
58112B867346j16425r8773q3089p6625p4147p0702p1476p8822q3617p9785p4238
$$ 2867346 2750921 2652148 2569059 2492434 2418287 2347585 2276109 2197287 2113670 2033885 1959647
58101A959647p2902p0160o1601n3930n2518n1676m6605m2646m3580m2958l6285
$$ 1959647 1886745 1816585 1754984 1701054 1648536 1596860 1550255 1507609 1464029 1421071 1384786
58090A384786k9926k9087k8539k3985k0895k3269k5084k1794j9222k2177k5129
$$ 1384786 1354860 1325773 1297234 1273249 1252354 1229085 1204001 1182207 1162985 1140808 1115679
58079A115679k3031k0689k2630k4079k0839j7926j9575k0646j6696j2858j3894
$$ 1115679 1092648 1071959 1049329 1025250 1004411 986485 966910 946264 929568 916710 902816
58068I02816j5061j1729q704j0876j3609j1529q313q702r149n525k157l989p178
$$ 902816 887755 876026 867322 856446 842837 831308 822995 814293 805144 799619 797462 793473 786295
58055G86295o487m969p393j0806j0375q414r115j0231q081n140m893m724j405
$$ 786295 779808 774839 767446 756640 746265 737851 728736 718505 710424 705284 700391 695667 694262
58042F94262J963J676N55K351M651M138L338N315P209N854M206N537O801M450
$$ 694262 696225 697901 698456 700807 705458 709596 712934 718249 725458 731312 735518 741055 747856 752306
58028G52306J272P72L83k981o192n657m370o279q846q203o588p560q801o839m222
$$ 752306 753578 754350 754733 751752 745560 739903 735533 729254 720408 712205 705617 698057 689256 682417 678195
58013F78195m872o619n475l123l277m579l932k973m547o478n383l126l143l941
$$ 678195 673323 666704 661229 658106 654829 650250 646318 643345 638798 632320 626937 623811 620668 616727
57999F16727k532o82j502l358l261k883n099p954q127p004p319p259l959M24K245
$$ 616727 614195 613513 612011 608653 605392 602509 597410 589456 581329 574325 567006 559747 555788 556212 558457
57984E58457K757N032P670P646O325O627P082M720J146j98j51j682m134n133n577
$$ 558457 561214 566246 573916 581562 587887 594514 601596 606316 607462 607264 607113 605431 601297 596164 590587
57969E90587p327q723p711o540q043j0211r873q533q925r109o009j773l61o55
$$ 590587 583260 574537 566826 560286 552243 542032 532159 523626 514701 505592 499583 497810 497449 496794
57955D96794P48K665J812l01K20K437K446Q44J553M453N683M478L651L849L112
$$ 496794 497542 500207 502019 501718 501938 504375 506821 507665 509218 513671 519354 523832 527483 531332 534444
57940E34444J600J293J495j99l089m427m453n475o927o244l922k804l145l011
$$ 534444 536044 537337 538832 538633 535544 531117 526664 521189 514262 508018 504096 501292 498147 495136
57926D95136k621l643n050m463k667k224k524r74J921L368L377M313O142O727
$$ 495136 492515 488872 483822 479359 476692 474468 471944 470970 472891 476259 479636 483949 490091 496818
57912D96818O237O725P938P946P280Q086R837J0163R157Q633Q012N345J654k53
$$ 496818 503055 509780 517718 525664 532944 541030 550867 561030 570187 578820 586832 592177 593831 593578
57898E93578o53k188m878o327o396p310r279j0249r821r572r782r481r220j0152
$$ 593578 592925 590737 585859 579532 573136 565826 556547 546298 536477 526905 517123 507642 498422 488270
57884D88270j0985r556o607m464k975n59J920K405J735K360L961M547M674O296
$$ 488270 477285 467729 461122 456658 453683 453124 455044 457449 459184 461544 465505 470052 474726 481022
57870D81022Q442Q626P616Q174R835R719P888P102P669P246N461M103L043N88
$$ 481022 489464 498090 505706 513880 523715 533434 541322 548424 556093 563339 568800 572903 575946 576534
57856E76534k368l253k713l858o667q011p269p102q275q581p478p141q077q122
$$ 576534 574166 570913 568200 564342 557675 549664 542395 535293 527018 518437 510959 503818 495741 487619
57842D87619o676n777o085n767m163k813k248j452r31k332m720n219l769l218
$$ 487619 480943 475166 469081 463314 459151 456338 454090 452638 451707 449375 444655 439436 435667 432449
57828D32449m315m860m375n090p390q666p847p056p483p543o414n654n925n634
$$ 432449 428134 423274 418899 413809 406419 397753 389906 382850 375367 367824 361410 355756 349831 344197
57814C44197m142l014k929k562j551j253j752j379l7M62N5Q60L113M421M047M245
$$ 344197 340055 337041 334112 331550 329999 328746 326994 325615 325578 326040 326095 326955 330068 334489 338536 342781
57798C42781O183Q180R332J1198J4434J7109J7857J7533J6476J3419Q589M609
$$ 342781 348964 357144 366476 377674 392108 409217 427074 444607 461083 474502 483091 487700
57786D87700K739J276r04k499k811l546n732p817q487q728r396r476q347p293
$$ 487700 490439 491715 490811 488312 485501 481955 476223 468406 459919 451191 441795 432319 423972 416679
57772D16679p155o813n372l646k191j93K462M307M619M506M734M691M211M181
$$ 416679 409524 402711 397339 393693 391502 391309 393771 398078 402697 407203 411937 416628 420839 425020
57758D25020M692M873M897N648O254M891K337J399K374K599J145K62J134K010
$$ 425020 429712 434585 439482 445130 451384 456275 458612 460011 462385 464984 466129 466391 467525 469535
57744D69535J894K439M443N983N921N941P231Q169P479O657P229Q232Q493Q837
$$ 469535 471429 473868 478311 484294 490215 496156 503387 511556 519035 525692 532921 541153 549646 558483
57730E58483J0047J0958J0602J0099J0710J2048J3661J6153J9422K2078K3874
$$ 558483 568530 579488 590090 600189 610899 622947 636608 652761 672183 694261 718135
57719G18135K6319K9738L2315L3218L3997L5666L7319L8864M2053M7257N2345
$$ 718135 744454 774192 806507 839725 873722 909388 946707 985571 1027624 1074881 1127226
57708A127226N6458O1865P0197P9895Q9390R9855J12675J27075J42456J60330
$$ 1127226 1183684 1245549 1315746 1395641 1485031 1584886 1697561 1824636 1967092 2127422
57698B127422J81656K04849K28635K54114K81623L08181L30411L47279L57216
$$ 2127422 2309078 2513927 2742562 2996676 3278299 3586480 3916891 4264170 4621386
57689D621386L55208L35847K97621K42039J71152Q9029L597p6380j45444k00826
$$ 4621386 4976594 5312441 5610062 5852101 6023253 6112282 6115879 6039499 5894055 5693229
57679E693229k39958k61573k67818k62513k47952k25140j95671j61143j21785
$$ 5693229 5453271 5191698 4923880 4661367 4413415 4188275 3992604 3831461 3709676
57670C709676p7497k9762J7575N7046P6630O4696K0059m3954j07890j57853j88847
$$ 3709676 3632179 3602417 3619992 3677038 3753668 3818364 3838423 3794469 3686579 3528726 3339879
57659C339879k01213j98141j84942j66599j45426j22470r9681p8849n9840m2002
$$ 3339879 3138666 2940525 2755583 2588984 2443558 2321088 2221407 2142558 2082718 2040716
57649B040716k5891j1874J372J5043K8524M1278N4567O9370Q4649R9745J16458
$$ 2040716 2014825 2002951 2004323 2019366 2047890 2089168 2143735 2213105 2297754 2397499 2513957
57638B513957J36364J58080J79606K01492K25086K49351K71812K90803L04157
$$ 2513957 2650321 2808401 2988007 3189499 3414585 3663936 3935748 4226551 4530708
57629D530708L07524K96837K71128K30731J75020J05106K7171n0312j21668j83989
$$ 4530708 4838232 5135069 5406197 5636928 5811948 5917054 5944225 5893913 5772245 5588256
57619E588256k34091k69283k90307l00178l00650k92539k78491k62083k44585
$$ 5588256 5354165 5084882 4794575 4494397 4193747 3901208 3622717 3360634 3116049
57610C116049k25341k04977j85508j67703j50904j35141j21120j08596r6955q6851
$$ 3116049 2890708 2685731 2500223 2332520 2181616 2046475 1925355 1816759 1719804 1632953
57600A632953p9018p2201o4569n6591n0226m5846m2208l8772l5770l2686k8898
$$ 1632953 1553935 1481734 1417165 1360574 1310348 1264502 1222294 1183522 1147752 1115066 1086168
57589A086168k5277k2982k1284j8729j5697j3665j2654j1565j0326r559q850p482
$$ 1086168 1060891 1037909 1016625 997896 982199 968534 955880 944315 933989 924430 915580 908098
57577I08098o085n472m808l048j101k23O00L102O525Q666R357J0255J1839J3255
$$ 908098 902013 896541 891733 888685 887584 887361 887961 891063 897588 906254 915611 925866 937705 950960
57563I50960J4577J6584J8760J9998K0864K2864K5997K9340L3245L8516M4177
$$ 950960 965537 982121 1000881 1020879 1041743 1064607 1090604 1119944 1153189 1191705 1235882
57552A235882M8713N2862N8533O5723P3158Q1252R1454J03281J15026J27050J41384
$$ 1235882 1284595 1337457 1395990 1461713 1534871 1616123 1707577 1810858 1925884 2052934 2194318
57541B194318J58339J76318J94607K13273K30464K42879K48858K48011K37940
$$ 2194318 2352657 2528975 2723582 2936855 3167319 3410198 3659056 3907067 4145007
57532D145007K14685J77001J27541O9866P285n5258j11651j58154j94173k19361
$$ 4145007 4359692 4536693 4664234 4734100 4741385 4686127 4574476 4416322 4222149 4002788
57522D002788k32822k35729k31690k23410k11229j95578j78411j61328j44573
$$ 4002788 3769966 3534237 3302547 3079137 2867908 2672330 2493919 2332591 2188018
57513B188018j28611j14571j02421r0805p9246o8584n8871m9110l9474l1466k5277
$$ 2188018 2059407 1944836 1842415 1751610 1672364 1603780 1544909 1495799 1456325 1424859 1399582
57502A399582j9221j2400n862m67M295Q794J2649J6247K0813K6411L1739L6408
$$ 1399582 1380361 1367961 1362099 1361632 1365927 1374721 1387370 1403617 1424430 1450841 1482580 1518988
57490A518988M1587M7984N5186O3244P2927Q4091R5771J08147J22405J38483J55153
$$ 1518988 1560575 1608559 1663745 1726989 1799916 1884007 1979778 2087925 2210330 2348813 2503966
57479B503966J72323J90747K09248K24809K35678K41600K40461K27769K00642
$$ 2503966 2676289 2867036 3076284 3301093 3536771 3778371 4018832 4246601 4447243
57470D447243J60014J08271M7626j7896q1626j37502j82743k16561k38464k49037
$$ 4447243 4607257 4715528 4763154 4745258 4663632 4526130 4343387 4126826 3888362 3639325
57460C639325k50468k44833k33347k17879k01178j84628j67637j50155j33907
$$ 3639325 3388857 3144024 2910677 2692798 2491620 2306992 2139355 1989200 1855293
57451A855293j20105j07960r6503q6060p6919o8395o0284n3509m8376m3889l9588
$$ 1855293 1735188 1627228 1530725 1444665 1367746 1299351 1239067 1185558 1137182 1093293 1053705
57440A053705l6213l3772l0914k7225k4074k2230k0553j8192j6060j4945j4050
$$ 1053705 1017492 983720 952806 925581 901507 879277 858724 840532 824472 809527 795477
57429G95477j2664j1492j1069j0497r063p517o593n803m758m119m195m121l386
$$ 795477 782813 771321 760252 749755 740692 733175 726582 720779 716021 711902 707707 703586 700200
57416G00200k641k190j352j68J82m26m61O98J582J167N91R77J573J516J561K493
$$ 700200 697559 695369 694017 693849 694031 693605 693144 693842 695424 696591 697182 698159 699732 701248 702809 705302
57400G05302L451L423K925K775K657K263K292L036L425K838K357K907L717L889
$$ 705302 708753 712176 715101 717876 720533 722796 725088 728124 731549 734387 736744 739651 743368 747257
57386G47257L932M377M512L935L695M423M906M139L187L323L809L377K604K949
$$ 747257 751189 755566 760078 764013 767708 772131 777037 781176 784363 787686 791495 794872 797476 800425
57372H00425M381N661O122N808M777L591L478M743N988O027N491N453N766N913
$$ 800425 804806 810467 816589 822397 827174 830765 834243 838986 844974 851001 856492 861945 867711 873624
57358H73624O215O900P274P044P150Q078Q715Q176P363P400P893Q148Q646R800
$$ 873624 879839 886739 894013 901057 908207 916285 925000 933176 940539 947939 955832 963980 972626 982426
57344I82426J0603J0108R090Q760Q944Q932Q961R454R988J0268J0933J2165J2885
$$ 982426 993029 1003137 1012227 1020987 1029931 1038863 1047824 1057278 1067266 1077534 1088467 1100632 1113517
57331A113517J2564J2381J3209J4077J3984J3686J4095J4597J4562J4881J6144
$$ 1113517 1126081 1138462 1151671 1165748 1179732 1193418 1207513 1222110 1236672 1251553 1267697
57320A267697J6985J6231J5158J5536J6788J7282J7116J7421J8057J8229J8410
$$ 1267697 1284682 1300913 1316071 1331607 1348395 1365677 1382793 1400214 1418271 1436500 1454910
57309A454910J9492K0875K1457K1583K2118K2617K2461K2689K4535K7067K8555
$$ 1454910 1474402 1495277 1516734 1538317 1560435 1583052 1605513 1628202 1652737 1679804 1708359
57298A708359K9334L0939L3223L4786L5723L7477M0116M2177M3099M3799M4744
$$ 1708359 1737693 1768632 1801855 1836641 1872364 1909841 1949957 1992134 2035233 2079032 2123776
57287B123776M5277M4951M3929M2165L9545L6583L3620K9669K3531J5543P002
$$ 2123776 2169053 2214004 2257933 2300098 2339643 2376226 2409846 2439515 2463046 2478589 2485591
57276B485591j559j0063j7674k3439k7520l0216l0692k8337k4648k1794j9883
$$ 2485591 2484032 2473969 2456295 2432856 2405336 2375120 2344428 2316091 2291443 2269649 2249766
57265B249766j7352j3596r435n440j602J703M053N957Q086J0034J1234J2330J4124
$$ 2249766 2232414 2218818 2209383 2203943 2202341 2204044 2208097 2214054 2222140 2232174 2243408 2255738 2269862
57252B269862J5928J6674J6830J7515J8453J8625J8264J8308J8492J7946J7119
$$ 2269862 2285790 2302464 2319294 2336809 2355262 2373887 2392151 2410459 2428951 2446897 2464016
57241B464016J7192J7989J8320J8010J7809J7729J7244J6678J6726J7078J7096
$$ 2464016 2481208 2499197 2517517 2535527 2553336 2571065 2588309 2604987 2621713 2638791 2655887
57230B655887J7252J8189J9128J9042J8662J9319K0521K0733K0016J9722K0094
$$ 2655887 2673139 2691328 2710456 2729498 2748160 2767479 2788000 2808733 2828749 2848471 2868565
57219B868565K0269K0289K0988K2182K2950K3385K4144K4689K3989K2619K2175
$$ 2868565 2888834 2909123 2930111 2952293 2975243 2998628 3022772 3047461 3071450 3094069 3116244
57208C116244K2844K3448K3528K3573K3629K3558K4152K6047K8128K8943K9058
$$ 3116244 3139088 3162536 3186064 3209637 3233266 3256824 3280976 3307023 3335151 3364094 3393152
57197C393152K9951L1339L1967L2267L3665L5738L6735L6661L7154L8409L8848
$$ 3393152 3423103 3454442 3486409 3518676 3552341 3588079 3624814 3661475 3698629 3737038 3775886
57186C775886L7961L6945L6431L5869L5356L5679L6446L6330L5434L5190L5835
$$ 3775886 3813847 3850792 3887223 3923092 3958448 3994127 4030573 4066903 4102337 4137527 4173362
57175D173362L6110L5569L5103L5055L4813L4385L4362L4348L3345L1585L0046
$$ 4173362 4209472 4245041 4280144 4315199 4350012 4384397 4418759 4453107 4486452 4518037 4548083
57164D548083K8549K6350K4226K3628K4085K3828K2671K1889K1550K0507J8868
$$ 4548083 4576632 4602982 4627208 4650836 4674921 4698749 4721420 4743309 4764859 4785366 4804234
57153D804234J7807J7191J5931J4534J4557J5668J6012J5466J5620J6590J6722
$$ 4804234 4822041 4839232 4855163 4869697 4884254 4899922 4915934 4931400 4947020 4963610 4980332
57142D980332J5708J5067J5239J4978J3908J3033J2509J1601J0951J2083J4568
$$ 4980332 4996040 5011107 5026346 5041324 5055232 5068265 5080774 5092375 5103326 5115409 5129977
57131E129977J6480J7673J9701K2508K4384K5244K6655K8455K8683K7268K6277
$$ 5129977 5146457 5164130 5183831 5206339 5230723 5255967 5282622 5311077 5339760 5367028 5393305
57120E393305K6046K4527K1027J7332J4493J1843R695R590J1345J3180J5336K0129
$$ 5393305 5419351 5443878 5464905 5482237 5496730 5508573 5518268 5527858 5539203 5552383 5567719 5587848
57108E587848K8111L7629M8448O1912P7334R2497J08388J29454J58755J97276
$$ 5587848 5615959 5653588 5702036 5763948 5841282 5933779 6042167 6171621 6330376 6527652
57098F527652K48250L17282M07282N17889O50434Q08653R94189J206635J447760
$$ 6527652 6775902 7093184 7500466 8018355 8668789 9477442 10471631 11678266 13126026
57089A3126026J719193K015512K326421K645558K967852L275455L533476L700590
$$ 13126026 14845219 16860731 19187152 21832710 24800562 28076017 31609493 35310083
57081C5310083L737821L616052L340775K976952K619696K308380J973394J490916
$$ 35310083 39047904 42663956 46004731 48981683 51601379 53909759 55883153 57374069
57073E7374069P95144p1270j004491j908247k714216l369359l834851m097791
$$ 57374069 58169213 58097943 57093452 55185205 52470989 49101630 45266779 41168988
57065D1168988m171218m081888l863263l554960l197643k824413k458384k115882
$$ 41168988 36997770 32915882 29052619 25497659 22300016 19475603 17017219 14901337
57057A4901337j807512j537291j304682j107939r44322q09084o97054o04660n29169
$$ 14901337 13093825 11556534 10251852 9143913 8199591 7390507 6693453 6088793 5559624
57048E559624m67257m15882l73296l38085l08366k82796k60960k41993k24276
$$ 5559624 5092367 4676485 4303189 3965104 3656738 3373942 3112982 2870989 2646713
57039B646713k07169j91416j77212j63561j49966j37032j24820j12466j00025
$$ 2646713 2439544 2248128 2070916 1907355 1757389 1620357 1495537 1383071 1283046
57030A283046q8853p9502p1073o3139n6507n1442m6983m2660l9125l6471l3684
$$ 1283046 1194193 1114691 1043618 980479 923972 872530 825547 782887 743762 707291 673607
57019F73607l0397k7391k4851k1862j8296j5418j3919j2912j1475r639p405m419
$$ 673607 643210 615819 590968 569106 550810 535392 521473 508561 497086 487447 480042 475623
57007D75623j047J849M710R177J5905K4182L4029M6760O3495Q5337J14718J52104
$$ 475623 474576 476425 481135 490312 506217 530399 564428 611188 674683 760020 874738 1026842
56995A026842J88599K05073J83697J22462L8175m4425j06598j42157j55030j52848
$$ 1026842 1215441 1420514 1604211 1726673 1764848 1720423 1613825 1471668 1316638 1163790
56985A163790j41934j25977j07060q6825o7220n0965m0828l7400l7952l8549l7177
$$ 1163790 1021856 895879 788819 701994 634774 583809 542981 505581 467629 429080 391903
56974C91903l4085k9929k5007j9847j5002j0365n877k462q21J44K054M614O298
$$ 391903 357818 327889 302882 283035 268033 257668 251791 249329 248508 248652 250706 255320 261618
56961B61618P135Q847J2292J6785K1890K7648L2602L3643K8752J8708N868p171
$$ 261618 268753 277600 289892 306677 328567 356215 388817 422460 451212 469920 475788 468617
56949D68617j7723k3853k5898k5824k4740k2317j8661j4959j1797q550m986j899
$$ 468617 450894 427041 401143 375319 350579 328262 309601 294642 282845 274295 269309 267410
56937B67410M20K896O261J0217J4543J9811K6386L3656M0212M3674M0691K9155
$$ 267410 267830 270726 276987 287204 301747 321558 347944 381600 421812 465486 506177 535332
56925E35332J1129p890k3109l3041l8202l9365l7634l4543l1013k7055k2832j8980
$$ 535332 546461 538571 515462 482421 444219 404854 367220 332677 301664 274609 251777 232797
56913B32797j5718j2843j0637r553r005p886o327n395n076m292k986k349k634
$$ 232797 217079 204236 193599 184046 175041 167155 160828 155433 150357 146065 143079 140730 138096
56900A38096k596j565k85Q00K255M059N077M916M864O153Q669J1968J6111K0866
$$ 138096 135500 133935 133650 134450 136705 140764 145841 150757 155621 161774 170443 182411 198522 219388
56886B19388K5461K9625L3432L5533L3267K5447J3916J721q974j6856k1101k2093
$$ 219388 244849 274474 307906 343439 376706 402153 416069 417790 408816 391960 370859 348766
56874C48766k1373j9925j7472j3787r487n010j42M962R612J3995J9440K6586L4618
$$ 348766 327393 307468 289996 276209 266722 261712 261570 266532 276144 290139 309579 336165 370783
56861C70783M3050N2971O5343P8432Q7364Q6022P0312M1560P154k3644m5344n7641
$$ 370783 413833 466804 532147 610579 697943 783965 854277 895837 902991 879347 834003 776362
56849G76362o2341o1062n5723m8617m0867l2166k2537j2891l538O153J6270K6262
$$ 776362 714021 652959 597236 548619 507752 475586 453049 440158 436620 442773 459043 485305
56837D85305L6717M9391O5092Q3285J03748J25432J42398J43813J21296P6359
$$ 485305 522022 571413 636505 719790 823538 948970 1091368 1235181 1356477 1432836
56827A432836K0033l3922p5436j00719j11560j12296j06473r6085q3028o9416
$$ 1432836 1452869 1418947 1343511 1242792 1131232 1018936 912463 816378 733350 663934
56817F63934n6143m2877k9942j8573q749J305J2656K4537L6633N0725O8441Q7984
$$ 663934 607791 564914 534972 516399 507650 508955 521611 546148 582781 633506 701947 789931
56805G89931J03647J07913R4694O3376K1038k0956n4019p5706q7056q9496q5170
$$ 789931 893578 1001491 1096185 1159561 1180599 1159643 1105624 1029918 942862 853366 768196
56794G68196p7355o8392n8516m7840l7790k9281k1386j3226n628O03O434J3230
$$ 768196 690841 622449 563933 516093 478303 449022 427636 414410 408782 409385 415819 429049
56782D29049K1085K9845L9852M9642N4427M9288L3772J2124j0245k9315m2848
$$ 429049 450134 479979 519831 569473 623900 673188 706960 719084 708839 679524 636676
56771F36676n0306n2629n1254m7432m2489l7634l2996k7933k2709j8541j5666
$$ 636676 586370 533741 482487 435055 392566 354932 321936 294003 271294 252753 237087
56760B37087j2953r955p654o487n453m032l141l229l294k808k745l484l708k689
$$ 237087 224134 214179 206525 200038 194585 190553 187412 184183 180889 178081 175336 171852 168144 165455
56746A65455j760j997k333j673r96j544k507k521j990k024k268j752q15m27m93
$$ 165455 163695 161698 159365 157692 156696 155152 152645 150124 148134 146110 143842 142090 141275 140848 140355
56731A40355l86k26k58k7N76O30j82o47p8K88n79j572j335n51n11q25n02l3l49
$$ 140355 139969 139743 139485 139458 140034 140664 140482 139835 139757 140045 139466 137894 136559 136008 135497 134672 134170 134137 133788
56712A33788q82n69J59K97R0J35j50j335k296j776n77k08l48K20J115J031K12
$$ 133788 132906 132337 132496 132793 132883 133018 132868 131533 129237 127461 126884 126676 126328 126548 127663 128694 128906
56695A28906M2O47R80Q96J206J942K375K516K958L469L311K675K365K407K177
$$ 128906 128948 129595 130575 131471 132677 134619 136994 139510 142468 145937 149248 151923 154288 156695 158872
56680A58872J660J271Q94J83o49j317k040k720k524j274k22k73o31l27J88K90
$$ 158872 160532 161803 162697 162880 162231 160914 158874 156154 153630 152356 152134 151861 151230 150903 151091 151381
56664A51381O51J889K981K751J775J207Q62J07n22l88l87j657l568m771n277n876
$$ 151381 152032 153921 156902 159653 161428 162635 163497 163604 163082 162694 162307 160650 157082 152311 147034 141158
56648A41158o424o447o428o810o760n572m230l887l995l518k800k418j650QJ233
$$ 141158 134734 128287 121859 115049 108289 102717 98487 94600 90605 87087 84287 81869 80219 80227 81460
56633H1460Q30j5L33J204J123O69J209K103J805P91O02Q84K37q02m87R39J521
$$ 81460 82290 82275 82608 83812 84935 85604 86813 88916 90721 91512 92114 92998 93235 92433 91946 92885 94406
56616I4406Q26J75j0n78j487j747j440j528j820j328l64j22m05jJ005J462J354
$$ 94406 95232 95407 95397 94819 93332 91585 90145 88617 86797 85469 85105 84983 84578 84577 85582 87044 88398
56599H8398J599K022J725J114J267J668Q88o94j215k67P15Q91P92P81P41J055
$$ 88398 89997 92019 93744 94858 96125 97793 98681 97987 96772 96505 97220 98111 98903 99684 100425 101480
56583A01480K033K694K090J189J452K245J981J077J220K265K607K275K839M368
$$ 101480 103513 106207 108297 109486 110938 113183 115164 116241 117461 119726 122333 124608 127447 131815
56569A31815N185M781M364M374L928K906K370K592K803K972L725M565M326L278
$$ 131815 137000 141781 146145 150519 154447 157353 159723 162315 165118 168090 171815 176380 180706 183984
56555A83984K779K965K814K268K092J933Q11p58j347j065j133j476j083l60n96
$$ 183984 186763 189728 192542 194810 196902 198835 199646 198888 197541 196476 195343 193867 192784 192424 191828
56540A91828j406j390r26j665l325l868k798j701j426j295j131j478j839j157
$$ 191828 190422 189032 188106 186441 183116 179248 176450 174749 173323 172028 170897 169419 167580 166423
56526A66423m3po92m24P10J065M72K40L24o42k441l381l246l337l638k891j388
$$ 166423 166380 166373 165681 165257 165967 167032 167504 167744 168068 167426 164985 161604 158358 155021 151383 148492 147104
56509A47104p24p78m0J150R45l77n87N27P77m56j344j200j499k600k826j650o41
$$ 147104 146380 145602 145562 146712 147657 147280 146693 147220 147997 147541 146197 144997 143498 140898 138072 136422 135781
56492A35781m19J64J160J035j26j91J359K435J982J497K007K501K430K763L572
$$ 135781 135362 135526 136686 137721 137595 137404 138763 141198 143180 144677 146684 149185 151615 154378 157950
56477A57950L415K108J286J413J094l0o32n58j160k223j851j29O03j86l73O87
$$ 157950 161365 163473 164759 166172 167266 167236 166604 166046 164886 162663 160812 160683 161286 161100 160727 161414
56461A61414J010j5l03R16J556O78K83J451K325J727J277K028K450J717J519K649
$$ 161414 162424 162409 162106 163022 164578 165256 165539 166990 169315 171042 172319 174347 176797 178514 180033 182682
56445A82682L059J561J59M68J004K61n47j76J18q95k069k250k390l205l422k370
$$ 182682 185741 187302 187461 187929 188933 189194 188647 188471 188589 187694 185625 183375 180985 177780 174358 171988
56429A71988j667k281k660j779j192j982k433j041Q20J425J380J683J683R50O27
$$ 171988 170321 168040 165380 163601 162409 160427 157994 156953 157773 159198 160578 162261 163944 164894 165521
56414A65521J049O43r52j635m95L23n27j106J85J660J613J382K475L543L046K179
$$ 165521 166570 167213 166261 164626 164131 164454 163927 162821 163006 164666 166279 167661 170136 173679 176725 178904
56398A78904K398K584J444J99K04L81l22m68J140K768K573J791K333L528L919
$$ 178904 181302 183886 185330 185529 185733 186114 185792 185324 186464 189232 191805 193596 195929 199457 203376
56383B03376L978M404M106K506J505K400L292K186L50k33l12j415k753k999k955
$$ 203376 207354 211758 215864 218370 219875 222275 225567 227753 228103 227870 227558 226143 223390 220391 217436
56368B17436l562l468j428R15J581J475K304L344L113K289K233K462K117J935
$$ 217436 213874 210406 208978 209893 211474 212949 215253 218597 221710 223999 226232 228694 230811 232746
56354B32746K419K227Q07J90J640L101K613J671K332L566L558L197M150N690O429
$$ 232746 235165 237392 238199 238389 240029 243130 245743 247414 249746 253312 256870 260067 264217 269907 276336
56339B76336P051Q463R552R511R950J1875J3219J2283J0878J0946J0936Q943O590
$$ 276336 283387 291850 301402 310913 320863 332738 345957 358240 369118 380064 391000 399943 406533
56326D06533O156O394N046L036K426K391J086o64j206j482l030m627m563m116
$$ 406533 412689 419083 424129 427165 429591 431982 433068 432404 431198 429716 426686 422059 417496 413380
56312D13380n137o356n684m087l487l044j246N26L82k80P61K402K404J682K431
$$ 413380 408243 401887 396203 392116 388629 385585 384339 384865 385247 384967 385728 388130 390534 392216 394647
56297C94647L994M458M437N386O177N299M443N909Q445R585J0088J1945J4173
$$ 394647 398641 403099 407536 412922 419099 424398 428841 434750 443195 452780 462868 474813 488986
56284D88986J4746J4758J6434J8929K0281K1486K4443K7824K9335L0092L2482
$$ 488986 503732 518490 534924 553853 574134 595620 620063 647887 677222 707314 739796
56273G39796L5654L7598L9609M4185N0460N6193O2282P0710Q0155Q8342R6782
$$ 739796 775450 813048 852657 896842 947302 1003495 1065777 1136487 1216642 1304984 1401766
56262A401766J08253J21594J33919J46016J60320J75390J87786J97848K08201
$$ 1401766 1510019 1631613 1765532 1911548 2071868 2247258 2435044 2632892 2841093
56253B841093K17955K23633K24497K21757K13855J97927J74921J48162J18056
$$ 2841093 3059048 3282681 3507178 3728935 3942790 4140717 4315638 4463800 4581856
56244D581856Q3220M5599R339k4296n5942q3669j04708j20202j33057j42465j45913
$$ 4581856 4665076 4710675 4720014 4695718 4639776 4556107 4451399 4331197 4198140 4055675 3909762
56233C909762j45026j43852j42690j39314j34858j32662j32340j30798j28085
$$ 3909762 3764736 3620884 3478194 3338880 3204022 3071360 2939020 2808222 2680137
56224B680137j26552j25392j21902j17101j14147j12252j08116j02276r7979r4692
$$ 2680137 2553585 2428193 2306291 2189190 2075043 1962791 1854675 1752399 1654420 1559728
56214A559728q9150q1937p6578p2794o7173n9960n4695n1451m6941m1108l7125
$$ 1559728 1470578 1388641 1312063 1239269 1172096 1112136 1057441 1005990 959049 917941 880816
56203H80816l4941l1315k6231k2971k1728j9425j5864j3825j3081j0528o352l815
$$ 880816 845875 814560 788329 765358 743630 724205 708341 694516 681435 670907 664555 660740
56191F60740l002r53K141L230K698L917O588P120N535N352O692O182L740K682
$$ 660740 657738 656785 658926 662156 664854 668771 675359 682479 688014 693366 700058 706240 709980 712662
56177G12662L068J801o78q53O73l54l840n181l532k954m613n173l770l434m591
$$ 712662 715730 717531 716853 716000 716673 716319 712479 707298 703766 700812 696199 691026 687256 683822 679231
56162F79231m170k019j313j887k01L495N132M468N454Q460R739R186J0827J4803
$$ 679231 675061 673042 671729 669842 669641 673136 678268 682736 688190 696650 706389 715575 726402 741205
56148G41205J6794J6416J8163K2909K6530K8282L2403L9964M7118N3079O1788
$$ 741205 757999 774415 792578 815487 842017 870299 902702 942666 989784 1042863 1104651
56137A104651P4087Q6154R7326J11290J27706J40607J46795J48078J44103J31647
$$ 1104651 1178738 1264892 1362218 1473508 1601214 1741821 1888616 2036694 2180797 2312444
56127B312444J12890R5990Q5133P7679P2029O9437O6815N7195L9877K1694O594
$$ 2312444 2425334 2521324 2606457 2684136 2756165 2825602 2892417 2949612 2989489 3011183 3017777
56116C017777p201j8709k3247k2422k5165l5908n0815o7677q9171j13546j32531
$$ 3017777 3010576 2991867 2968620 2946198 2921033 2885125 2834310 2766633 2677462 2563916 2431385
56105B431385j42277j46965j48646j43469j31104j17726j06083r2473p6802o5167
$$ 2431385 2289108 2142143 1993497 1850028 1718924 1601198 1495115 1402642 1325840 1260673
56095A260673n8963n2001m2133l5024l2579k8722k1056j5627j5281j4296r573
$$ 1260673 1201710 1149709 1107576 1072552 1039973 1011251 990195 974568 959287 944991 935418
56084I35418o273p138o983l167q25k411k653Q53K724O50K80M012O048L882L388
$$ 935418 929145 922007 915024 911857 911032 908621 905968 906821 909545 910195 910475 914487 920535 924417 927805
56069I27805O993Q491N309M127Q227J1238R546Q888J2251J3585J0157Q741J2641
$$ 927805 934798 943289 948598 952725 960952 972190 981736 990624 1002875 1016460 1026617 1035358 1047999
56056A047999J5154J2812J2212J6539J8563J4741J2807J7284K0863J8593J7085
$$ 1047999 1063153 1075965 1088177 1104716 1123279 1138020 1150827 1168111 1188974 1207567 1224652
56045A224652K0912K3525K0704J9400K3958K7270K5027K4870L1721L7925L7762
$$ 1224652 1245564 1269089 1289793 1309193 1333151 1360421 1385448 1410318 1442039 1479964 1517726
56034A517726L7602M1863M3498L8561L5270L8362L9596L4298L1367L5995L9009
$$ 1517726 1555328 1597191 1640689 1679250 1714520 1752882 1792478 1826776 1858143 1894138 1933147
56023A933147L4796L2810L9115M3990M0693L8755M5154N0409M7595M6605N4605
$$ 1933147 1967943 2000753 2039868 2083858 2124551 2163306 2208460 2258869 2306464 2353069 2407674
56012B407674O1092N8071N6121O3993P1481O9672O8657P7309Q5303Q3786Q3777
$$ 2407674 2468766 2526837 2582958 2646951 2718432 2788104 2856761 2934070 3019373 3103159 3186936
56001C186936R4752J05306J05017J04752J14797J24187J23090J23631J36360J48564
$$ 3186936 3281688 3386994 3492011 3596763 3711560 3835747 3958837 4082468 4218828 4367392
55991D367392J49058J50960J65980J80616J82965J87662K07808K28656K36989
$$ 4367392 4516450 4667410 4833390 5014006 5196971 5384633 5592441 5821097 6058086
55982F058086K48679K77745L07321L22640L42059L82030M23696M49916M81217
$$ 6058086 6306765 6584510 6891831 7214471 7556530 7938560 8362256 8812172 9293389
55973I293389N36615N95020O37211O87837P70804Q63506R44139J041183J182894
$$ 9293389 9830004 10425024 11062235 11750072 12520876 13384382 14328521 15369704 16552598
55964A6552598J344595J504645J702565J978209K310647K689821L184127L851795
$$ 16552598 17897193 19401838 21104403 23082612 25393259 28083080 31267207 35119002
55956C5119002M656082N568391O679144Q094521R820235J1894013J4529864J7966715
$$ 35119002 39775084 45343475 52022619 60117140 69937375 81831388 96361252 114327967
55948A14327967K2333664K7885610L4995341M3093363M9400655M9560239M0580748
$$ 114327967 136661631 164547241 199542582 242635945 292036600 341596839 382177587
55941C82177587K3504617L031073j5495914k8816066l6291696l8904036l8178079
$$ 382177587 405682204 408713277 393217363 364401297 328109601 289205565 251027486
55934B51027486l5550432l2019617k8091673k4042781k0164003j6713048j3774943
$$ 251027486 215477054 183457437 155365764 131322983 111158980 94445932 80670989
55927H0670989j1312103r296155p700966o436333n396124m541935l869104l331883
$$ 80670989 69358886 60062731 52361765 45925432 40529308 35987373 32118269 28786386
55919B8786386k871431k480224k172926j924606j696152j490684j329278j197461
$$ 28786386 25914955 23434731 21261805 19337199 17641047 16150363 14821085 13623624
55911A3623624j066833r44430q51905p78498p00149o23866n69723n28574m78808
$$ 13623624 12556791 11612361 10760456 9981958 9281809 8657943 8088220 7559646 7080838
55902G080838m26898l92083l67727l35088k99632k77941k63456k39372k11685
$$ 7080838 6653940 6261857 5894130 5559042 5259410 4981469 4718013 4478641 4266956
55893D266956j96680j88712j71888j51354j42505j40741j31230j17772j13625
$$ 4266956 4070276 3881564 3709676 3558322 3415817 3275076 3143846 3026074 2912449
55884B912449j14026j05365r1982q7381q8035q1546p1938p1697p6860p4411o6862
$$ 2912449 2798423 2693058 2601076 2513695 2425660 2344114 2272176 2200479 2123619 2049208 1982346
55873A982346o5862o8585o3484n2860m7800m6819m0778l2807l2650l7028l5542
$$ 1982346 1916484 1847899 1784415 1731555 1683755 1636936 1596158 1563351 1530701 1493673 1458131
55862A458131l0268l0233l2477k7740j9122j6188j6081r096K381Q615J0679J5858
$$ 1458131 1427863 1397630 1365153 1337413 1318291 1302103 1286022 1276926 1279307 1287922 1298601 1314459
55850A314459K0330J4661J885p570j4308k5929l9222m4308m2691m3900m7518m5457
$$ 1314459 1334789 1349450 1351335 1343765 1329457 1303528 1264306 1219998 1177307 1133407 1085889 1040432
55838A040432l8959l6467l7271l3563k6481k4158k5904k3778j8025j5927j7145
$$ 1040432 1001473 965006 927735 894172 867691 843533 817629 793851 775826 759899 742754
55827G42754j4850r699q346r805p418k615k682o465o212k146j548m575m566j477
$$ 742754 727904 718205 709859 700054 692636 690021 687339 680874 674662 672516 670968 666393 661827 660350
55813F60350j677n200o041m379n908r848j0020p082p434j0757j0815p764p535
$$ 660350 658673 653473 647432 643053 637145 627297 617277 610195 602761 592004 581189 573425 565890
55800E65890r728q352m033l332o283o658m381n655j0617j2798j1301j1869j5190
$$ 565890 556162 547810 543777 540445 534162 527504 523123 517468 506851 494053 482752 470883 455693
55787D55693j5532j1972r968j0712r548o000m943o646n709j129K152K542L173
$$ 455693 440161 428189 418221 407509 397961 391961 387018 380372 374663 373534 375686 378228 381401
55774C81401L531n05p557j1260j0683j0930j2858j1875p694n502o320n568k478
$$ 381401 384932 384427 376870 365610 354927 343997 331139 319264 311570 306068 299748 294180 291702
55761B91702j582l588l868j444n96k214k351p01j788o162q991q871r673j2116
$$ 291702 290120 286532 282664 281220 280624 278410 276059 275358 273570 267408 258417 249546 239873 227757
55747B27757j1999q484o006o154n569l418l116m955m831j949l32j139r66R03J105
$$ 227757 215758 207274 201268 195114 189545 186127 183011 178056 173225 171276 170944 169805 168839 169742 170847
55732A70847n94k47K679M111K995K805M139L370m4k284k528m047o773o495k960
$$ 170847 170253 170006 172685 176796 179791 182596 186735 190105 190061 187777 185249 181202 174429 167934 164974
55717A64974j050k189k217M48K213J818K764O052P881O973P013R502J1175J0797
$$ 164974 163924 161735 159518 159966 162179 163997 166761 172813 180694 187667 194680 204182 215357 226154
55703B26154J1462J3789J3802J0137O489M511J066m822r083r495r110j0059j0139
$$ 226154 237616 251405 265207 275344 281833 286344 287410 282588 273505 264010 254900 244841 234702
55690B34702q230o965p319o471l469j301j058O6K818M085L141L488O158P492O044
$$ 234702 226472 219507 212188 205717 202248 200947 199889 199955 202773 206858 209999 213487 219645 227137 233181
55675B33181N318O955P498M861K034J336P70r90j684m50j10j642j833P10K656
$$ 233181 238499 245454 252952 257813 259847 261183 261953 260963 259279 258829 258719 257077 255244 255954 258610
55660B58610J804L93Qj275l943m936l337k661m594n979m943m393o329q181q060
$$ 258610 260414 260807 260815 259540 255597 250661 247324 244663 240069 234090 229147 224754 218425 210244 202184
55645B02184q273j0315j1586j0383r116r352q804o386n069o349p037n002l037
$$ 202184 193911 183596 172010 161627 152511 143159 134355 127969 122900 116551 109514 104512 101475
55632A01475l500m105k689j388k298l605l560l820n262n156k101O54M27p38n09
$$ 101475 97975 93870 91181 89793 87495 83890 80330 76510 71248 66092 63991 64645 65072 64334 63825
55617F3825l60j606k025k27R49o79k511j778k00k59q13k16J32r00j125Q57K413
$$ 63825 63465 61859 59834 59607 60556 59877 57366 55588 55388 55129 54316 54100 54232 53332 52207 53064 55477
55600E5477J357j27L76J313Q34N69J903K484N43j142J28K028J246r65j664j304
$$ 55477 56834 56707 57083 58396 59230 59799 61702 64186 64729 63587 63715 65743 66989 66024 64360 63056
55584F3056j654j667O9J566M77j589j852j012j216j815j051K94N47L00O02M12
$$ 63056 61402 59735 59804 61370 61847 60258 58406 57394 56178 54363 53312 53606 54153 54453 55055 55467
55568E5467j007j750m66Q28K90l63P11J769P63o91l64M39k70r81O01L116L801
$$ 55467 54460 52710 52244 53072 53362 52999 53710 55479 56242 55551 55187 55626 55356 54375 54976 58092 61893
55551F1893L010K699K589J606R51K006L278K920K192K946L864K883J161J036J969
$$ 61893 64903 67602 70191 71797 72748 74754 78032 80952 83144 86090 89954 92837 93998 95034 97003
55536I7003K084J701J957J883K88j312j113l43r32j869j297j91m91j497j487j092
$$ 97003 99087 100788 102745 104628 104916 103604 102491 102148 101216 99347 98050 97859 97368 95871 94384 93292
55520I3292j710k438j889j158j721k309j184M04K38j217k309l256m674n207l898
$$ 93292 91582 89144 87255 86097 84376 82067 80883 81287 81525 80308 77999 74743 70069 64862 60964
55505F0964k727l532m631l753k068j800k232j682j128k082l088k177p58j151k322
$$ 60964 58237 54705 50074 46321 44253 42453 40221 38539 37411 35329 32241 30064 29306 28155 25833
55490B5833k000r56j209j907j149mn17j549q47N59L90k38J211L553L504J311q
$$ 25833 23833 22877 21668 19761 18612 18608 18091 16542 15695 16254 16644 16406 17617 21170 24674 25985 25977
55473B5977o7j005k640k453k90J251J139P56O33K3n00L12J447Q30r07j306l07
$$ 25977 25910 24905 22265 19812 19522 20773 21912 22668 23301 23324 22824 23136 24583 25413 24506 23200 22893
55456B2893lp34r37m89p09j322r25l1k76j088n22R83J224J33l50j5l60j214r08
$$ 22893 22890 22156 21219 20730 20021 18699 17774 17743 17467 16379 15857 16840 18064 18197 17847 17832 17472 16258 15350
55437A5350L23N61k56l58L95M29k53LJ211J583P13J4J5l1j1O53R79k98j969j925
$$ 15350 15673 16234 15978 15620 16015 16444 16191 16194 17405 18988 19701 19715 19730 19699 19688 20341 21320 21022 19053 17128
55417A7128q49r71j849j103R47J388m25j850j363l88j26J76R86J464J417J774
$$ 17128 16279 15308 13459 12356 13303 14691 14266 12416 11053 10665 10539 10715 11701 13165 14582 16356
55401A6356K492K451J659J213J016J0j338j390j73O93P88J001J146J95j237j422
$$ 16356 18848 21299 22958 24171 25187 25197 23859 22469 22296 22989 23777 24778 25924 26119 24882 23460
55385B3460m89j77p53q88l54j26k9Q74J809J195l08o62p5n22j890k053q22l86
$$ 23460 22971 22794 22041 21153 20799 20673 20644 21518 23327 24522 24214 23552 23477 22955 21065 19012 18190 17804
55367A7804j460k309k044j731j703q89N57R77J86p6P47J227P81N33Q97R31N65
$$ 17804 16344 14035 11991 10260 8557 7668 8225 9202 9388 9312 10059 11286 12067 12600 13497 14428 14993
55350A4993Q42J563J291O4n44k45k47n09K39J564J514Q2o14p6j33j285j591j92
$$ 14993 15835 17398 18689 18753 18209 17964 17717 17208 17447 19011 20525 20607 19993 19917 19784 18499 16908 16716
55332A6716J068P47k07o06p27q26l28N71O71j14n37l30n05j023o39N05P29k74
$$ 16716 17784 18531 18324 17718 16991 16165 15837 16408 17079 16965 16428 16098 15593 14570 13931 14436 15165 14891
55314A4891r07n29k45l98O7J129J306L94N7R64J860K009K097K199J417P7l34J44
$$ 14891 13984 13455 13210 12812 12879 14008 15314 15708 15765 16729 18589 20598 22695 24894 26311 26388 26054 26198
55296B6198q8j124j238r5O29L38L64J093J254O47O13J117M93j152j510K6J195
$$ 26198 26110 24986 23748 23653 24282 24620 24984 26077 27331 27978 28591 29708 30201 29049 27539 27565 28760
55279B8760O47k37l69o18j304j155j35j27j493k030q12J51l57o34N36J501Q88
$$ 28760 29407 29170 28801 28183 26879 25724 25589 25462 23969 21939 21127 21278 20921 20287 20823 22324 23212
55262B3212J48P27J413P75k05j93J16j98l00M81R05O7p22j90O65O05L43P65R94
$$ 23212 23360 24087 25500 26275 26070 25877 25993 25795 25495 25976 26881 26948 26226 26036 26701 27306 27649 28414 29408
55243B9408K09n44l69l65j510k581k227j296j079j052m43j91j166k131j666o54
$$ 29408 29617 29073 28704 28339 26829 24248 22021 20725 19646 18594 18151 17960 16794 14663 12997 12343
55227A2343n66p51K86K077K928K603K137J828J223N20L00M01L84M26O71N53k19
$$ 12343 11777 11026 11312 13389 16317 18920 21057 22885 24108 24628 24928 25329 25713 26139 26810 27363 27144
55210B7144r06r31o97n05J12J084J314M15m52l69J35M78R44J370P61p47j412n05
$$ 27144 26238 25307 24610 24105 24217 25301 26615 27030 26578 26209 26344 26822 27766 29136 29897 29150 27738 27233
55192B7233L99Op22m80L18P52J040J481J406N63K6M89J099J099R63R41L18q08
$$ 27233 27632 27638 26916 26436 26754 27506 28546 30027 31433 31996 32022 32511 33610 34709 35672 36613 36931 36123
55174C6123j078k65%q79j183R5J357J198O77R69J063o7j219j084o40j117j561
$$ 36123 35045 34780 34780 33901 32718 32813 34170 35368 36045 37014 38077 38010 36791 35707 35067 33950 32389
55157C2389p76J56k89j332j444j044j263j530q86k86j036k163j902o89k22m85
$$ 32389 31613 31769 31480 30148 28704 27660 26397 24867 23981 23695 22659 20496 18594 17905 17683 17198
55141A7198k23M74N15M2J14O09N80J09L1L44N89R82J594J461J58q77l99M62J26
$$ 17198 16975 17449 17964 18006 18120 18729 19309 19418 19449 19793 20382 21364 22958 24419 24577 23700 23301 23763 23889
55122B3889o78k77R18J220N96L56N58J84n64m62M29Q85P10Q36J316J194L22l47
$$ 23889 23211 22934 23852 25072 25668 26024 26582 26766 26202 25740 26169 27054 27764 28600 29916 31110 31432 31085
55104C1085l14pK27L92L73L02P82J777K056R78j59N6J032J365J114J169J287O62
$$ 31085 30771 30764 30991 31383 31756 32058 32840 34617 36673 37651 37492 37548 38580 39945 41059 42228 43515 44177
55086D4177k32j64Q78J839K223K248J922J326J108J390J142j07j057n70L13O1
$$ 44177 43945 43781 44659 46498 48721 50969 52891 54217 55325 56715 57857 57750 56693 56123 56436 56497
55070E6497q52r95n62p78j623j996j614r38P6J408K002J185K91R13K302K467J218
$$ 56497 55645 54650 54088 53310 51687 49691 48077 47139 47215 48623 50625 51810 52101 53014 55316 57783 59001
55053E9001J47J01N27R36J223J025L06L7P48J194J41j491k010j511j137p58L41
$$ 59001 59148 59249 59776 60712 61935 62960 63266 63303 64051 65245 65386 63895 61885 60374 59237 58479 58820
55036E8820J360R10m67j016n23j81j57M18J335J449Q13N48P21L59n01q47o57q77
$$ 58820 60180 61090 60623 59607 59084 58903 58746 59164 60499 61948 62761 63309 64030 64389 63888 63041 62384 61507
55018F1507j469j377m94J14l4m57j003j877k548k242j375r44q09j84O63Q88Q36
$$ 61507 60038 58661 58167 58281 58247 57790 56787 54910 52362 50120 48745 47801 46992 46808 47471 48359 49195
55001D9195J403K075J548O5p34k42N98J051J170Q66O7m26P6P30L16o70q35k45
$$ 49195 50598 52673 54221 54286 53552 53310 53908 54959 56129 56995 57062 56636 56712 57442 57758 57088 56253 56008
54983E6008k7j59K80J074J230J021J570K600K805K234K201K914L350L353L735
$$ 56008 55981 55822 56102 57176 58406 59427 60997 63597 66402 68636 70837 73751 77101 80454 84189
54968H4189M345M241L708M007N118N811O081P283R737J2236J4101J5752J7077
$$ 84189 88534 92775 96483 100490 105608 111419 117500 124783 134520 146756 160857 176609 193686
54955A93686J7193J6019J4197J1501P201J998k463n903r271j2415j4190j4697
$$ 193686 210879 226898 241095 252596 259797 261795 259332 253429 244158 231743 217553 202856
54943B02856j5105j5290j4059j1763j0189r606q552o780n784n836n315l677k441
$$ 202856 187751 172461 158402 146639 136450 126844 118292 111512 105728 99892 94577 90900 88459
54930H8459k317j876l02R95Q43K92P48J907K894L832N069O265P322Q853J0930
$$ 88459 86142 84266 83964 84959 85802 86094 86842 88749 91643 95475 100544 106809 114131 122984 133914
54915A33914J2679J3733J4670J5467J5150J3506J1439R057N252p7n200q823j1490
$$ 133914 146593 160326 174996 190463 205613 219119 230558 239615 244867 244790 239590 230767 219277
54902B19277j3918j5577j5946j5565j4909j3613j1593r610p988o190m207k921
$$ 219277 205359 189782 173836 158271 143362 129749 118156 108546 100558 94368 90161 87240
54890H7240k486j987j224j164k010k529k057j449j350j172n57r6Q9P39J621J252
$$ 87240 84754 82767 81543 80379 78369 75840 73783 72334 70984 69812 69255 69159 69248 69987 71608 72860
54874G2860o17k099j882j036r48j219r81p05j196k011k295k145k015j789j367
$$ 72860 72243 70144 68262 67226 66278 65059 64078 63373 62177 60166 57871 55726 53711 51922 50555
54859E0555j153j112n24N85J024K80n67n43j00J13L47P65O82j79r64j077j042
$$ 50555 49402 48290 47766 48351 49375 49655 49088 48545 48445 48558 48905 49670 50352 50173 49209 48132 47090
54842D7090j251j194p46o73j011n17J249K813K891K168J783J535Q57K67M52R18
$$ 47090 45839 44645 43899 43226 42215 41698 42947 45760 48651 50819 52602 54137 54994 55261 55713 56631
54826E6631Q47M28K53K96M04Q85J781K454K607K726K967K854K552L059M462N546
$$ 56631 57478 57906 58159 58455 58859 59744 61525 63979 66586 69312 72279 75133 77685 80744 85206 90752
54810I0752N758O049P005P883Q358R437J1611J3797J5179J6322J7376J6998J4425
$$ 90752 96510 102559 109564 117447 125805 135242 146853 160650 175829 192151 209527 226525 240950
54797B40950J0836P306L210j877o556r572j1604j3364j3725j1847r460q762r267
$$ 240950 251786 259092 262302 260425 253869 244297 232693 219329 205604 193757 184297 175535 166268
54784A66268q986p621o340n420m346l527l691m118l504k024p42L37J746K821K557
$$ 166268 157282 149661 143321 137901 133555 130028 126337 122219 118715 116691 115949 116286 118032 120853 123410
54769A23410J667J773K882L727M225N467P454Q933R693J0990J3335J5510J6263
$$ 123410 125077 126850 129732 133459 137684 143151 150605 159538 169231 180221 193556 209066 225329
54756B25329J5571J3880J1349Q247M963J373k786o822r347r958r654r459r407
$$ 225329 240900 254780 266129 274376 279339 280712 277926 271104 261757 251799 242145 232686 223279
54743B23279r098q449p721p279p483q262q933q802p912o842o004n478n183m874
$$ 223279 214181 205732 198011 190732 183249 174987 166054 157252 149340 142498 136494 131016 125833 120959
54729A20959m310l677l349l155k601j926j903k394k323j509j102j595j787p85
$$ 120959 116649 112972 109623 106468 103867 101941 100038 97644 95321 93812 92710 91115 89328 88543
54715H8543M67P71M80M65M58m1l43L21J166R80J67%M67N32P6q3J61J69l9K00P88
$$ 88543 89010 89781 90261 90726 91184 91143 90800 91121 92287 93267 93434 93434 93901 94433 94509 94426 94587 94756 94717 94917 95705
54694I5705Q72K64k85l31k02j78j31P3L88P93J140J137R28J095J619J656J006
$$ 95705 96577 96841 96556 96225 96023 95845 95714 95787 96175 96968 98108 99245 100173 101268 102887 104543 105549
54677A05549P57J571K325J716L12l49O7Q08J573K505L144K918K349K469L265L957
$$ 105549 106306 107877 110202 111918 112230 111881 111948 112756 114329 116834 119978 122896 125245 127714 130979 134936
54661A34936M360M775M957M534M037M205M602M297L544L290L342K614J117J10
$$ 134936 139296 144071 149028 153562 157599 161804 166406 170703 174247 177537 180879 183493 184610 184720
54647A84720J46L96K20J09O47J564K317K819L249L766M515N422N983N738M855
$$ 184720 184866 185262 185482 185591 186238 187802 190119 192938 196187 199953 204468 209890 215873 221611 226466
54632B26466L791K560Q43j469m234p168r575j0548j0066r246q929q682p823o618
$$ 226466 230257 232817 233660 232191 227957 220789 211214 200666 190600 181354 172425 163743 155920 149302
54618A49302n631m753l763l051k806k284r48M24Q35N46L53K82J67O57K205L792
$$ 149302 143671 138918 135155 132104 129298 127014 126066 126490 127325 127871 128224 128506 128673 129330 131535 135327
54602A35327M099L373K728K251J374M36K28L38m10k013l304l764l877l841l349
$$ 135327 139426 142799 145527 147778 149152 149588 149816 150154 149744 147731 144427 140663 136786 132945 129596
54587A29596k587k159k071j896j797k210k741k605j944j530j432j166q91j199
$$ 129596 127009 124850 122779 120883 119086 116876 114135 111530 109586 108056 106624 105458 104567 103368
54573A03368j962k540k814k966k657j714j008j345j939j538n23k41p24q16l57
$$ 103368 101406 98866 96052 93086 90429 88715 87707 86362 84423 82885 82362 82121 81397 80581 80224
54558H0224l74j103j604j490j413j562j242k80M77M35%k41p3N08J133R17l86j462
$$ 80224 79850 78747 77143 75653 74240 72678 71436 71156 71633 72068 72068 71827 71754 72262 73395 74312 73926 72464
54540G2464q44J061K641L219L191K572J238K54R93K951M228M241M121M417M310
$$ 72464 71620 72681 75322 78541 81732 84304 85542 85796 86789 89740 93968 98209 102330 106747 111057
54525A11057L470K770K594K116Q41n57j476k191k898l242l192l255l491l433l100
$$ 111057 114527 117297 119891 122007 122848 122291 120815 118624 115726 112484 109292 106037 102546 99113 96013
54510I6013k940k771k080j347j571k425k483j483p27r16j212q41j43M29R23J157
$$ 96013 93073 90302 88222 86875 85304 82879 80396 78913 78186 77270 76058 75217 75074 75503 76426 77583
54494G7583P98M43J175K716L555L199K687K574K171J267Q38J283J661J467J513
$$ 77583 78381 78824 79999 82715 86270 89469 92156 94730 96901 98168 99006 100289 101950 103417 104930
54479A04930K276K847K510J977K025K204J850J231Q20M28o5j83J60J47o95j719
$$ 104930 107206 110053 112563 114540 116565 118769 120619 121850 122670 123098 123033 122850 123010 123157 122462 120743
54463A20743k208k287k292k193k226k852l677l512k156q66n09m82j71j23q91j843
$$ 120743 118535 116248 113956 111763 109537 106685 103008 99496 97340 96474 95965 95483 95312 95189 94298 92455
54447I2455k076j652j153q37q25j242j704j580j128j189j588j170J05P93K54l08
$$ 92455 90379 88727 87574 86737 85912 84670 82966 81386 80258 79069 77481 76311 76416 77209 77463 77155
54431G7155M6M89J27l40J8O89P36M41N57R21J006J072J516J917J800J595J717
$$ 77155 77201 77690 77817 77477 77495 78184 78920 79361 79918 80839 81845 82917 84433 86350 88150 89745 91462
54414I1462J642R78O01J388K548K627J643R09J071J569J898K207K629K862K619
$$ 91462 93104 94082 94683 96071 98619 101246 102889 103798 104869 106438 108336 110543 113172 116034 118653
54399A18653K010J427J279J596J846J541J079J313K243K952L043L059L286L148
$$ 118653 120663 122090 123369 124965 126811 128352 129431 130744 132987 135939 138982 142041 145327 148475
54385A48475K246R91k08j355k094j779q24o61j770l003l548m024m834n003l896
$$ 148475 150721 151712 151504 150149 148055 146276 145452 144791 143021 140018 136470 132446 127612 122609 118713
54370A18713k697k686l192k889k103k172l088l451k546j118k30l33j304k420k595
$$ 118713 116016 113330 110138 107249 105146 102974 99886 96435 93889 92771 92541 92208 90904 88484 85889
54355H5889j494j14M05J42j10j08p8J8L00M47K86M07J340K551L093K888K613K672
$$ 85889 84395 84281 84686 84828 84718 84610 84532 84550 84850 85297 85583 85990 87330 89881 92974 95862 98475 101147
54337A01147L002L536M180M544M336L749L083K386J709J181N48o21k010k764k846
$$ 101147 104149 107685 111865 116409 120745 124494 127577 129963 131672 132853 133401 132780 130770 128006 125160
54322A25160l166l912m028l034k076k198k800k892k751l068l468l224k700k673
$$ 125160 121994 118082 114054 111020 108944 106746 103946 101054 98303 95235 91767 88543 85843 83170
54308H3170k869k512j832j645j837j599q76m01m71o73p43p53o66m64n13r81j298
$$ 83170 80301 77789 75957 74312 72475 70876 70000 69599 69128 68455 67712 66959 66293 65829 65316 64335 63037
54291F3037q37J59J024J539J703J276L18l60j89K79K84K4O8K42R3p3K75Q13Q58
$$ 63037 62200 62359 63383 64922 66625 67901 68219 67859 67670 67949 68233 68257 68325 68567 68660 68587 68862 69675 70533
54272G0533N85O80J105J240J005R20J117J163P98J98l03l21L70J307J518P25k39
$$ 70533 71118 71798 72903 74143 75148 76068 77185 78348 79146 79344 79041 78720 79090 80397 81915 82640 82401
54255H2401o78q70j125r89k31L01j34r14j070p94q73j273j443j402j400j075j61
$$ 82401 81723 80853 79728 78739 78508 78809 78675 77761 76691 75897 75024 73751 72308 70906 69506 68431 68270
54238F8270N53J48r37j488j212p61m37nM61O42O37O53M10k90q47o18P8O14J114
$$ 68270 68823 68971 68034 66546 65334 64573 64136 64131 64592 65234 65871 66524 66934 66644 65797 65179 65257 65871 66985
54219F6985J894K430K040J069L37j17o68j024p11j64j61o30r82j173j309r38J50
$$ 66985 68879 71309 73349 74418 74755 74638 73970 72946 72235 72071 71910 71280 70298 69125 67816 66878 67028
54202F7028J001O65l32r87j471k309k751j740k2O73K52J40O96P69m8o45l36J17
$$ 67028 68029 68694 68362 67375 65904 63595 60844 59104 59082 59755 60007 60147 60843 61612 61564 60919 60583 60700
54184F0700k5m27o74j001j494j604j081m94l78n80p31o38k08L45K96p10j715j372
$$ 60700 60675 60248 59574 58573 57079 55475 54394 53900 53522 52942 52211 51573 51365 51710 52006 51296 49581 48209
54166D8209L11K018K774K564J612K18p87p19j66l21j223j772j428p34j57L61O85
$$ 48209 48520 50538 53312 55876 57488 57706 56919 56200 56034 55713 54490 52718 51290 50556 50399 50760 51445
54149E1445N13J89L55P55N89n5k52K67Q48J141J369J375P42j15l08P4J62jM14
$$ 51445 51958 52147 52502 53257 53846 53791 53539 53806 54654 55795 57164 58539 59281 59166 58858 58932 59094 59093 59507
54130E9507J196J003m18j623j573r79p46n97o8K94j50r10j047n27j33l42q57j028
$$ 59507 60703 61706 61288 59665 58092 57113 56367 55770 55702 55996 55846 54936 53889 53362 53229 52887 52030 51002
54112E1002m92L95P91L62k29l28k66n79q50m50R9j14o52l49N53O17l88j015m67
$$ 51002 50510 50905 51696 52058 51829 51501 51235 50656 49806 49356 49455 49341 48689 48340 48893 49510 49122 48107 47640
54093D7640L14L48k2j38OK74P18R16K68p06p04L14Q83L03m05l44m2n2J16O82P23
$$ 47640 47954 48302 48280 48142 48148 48422 49140 50056 50324 49618 48914 49228 50111 50414 50009 49665 49623 49571 49687 50369 51092
54072E1092j77p37J66J568J793R55N54J115J669J389N89K8P0N96J188J409J191
$$ 51092 50915 50178 50344 51912 53705 54660 55214 56329 57998 59387 59976 60004 60074 60670 61858 63267 64458
54055F4458P77K65l70p43l02O98J218P99J91J88N92P31M59J67K85J021K119K746
$$ 64458 65235 65500 65130 64387 64085 64783 66001 66800 66991 67179 67771 68502 68961 69128 69413 70434 72553 75299
54037G5299K285J274Q69J361K116K917M144N541O046N292M156L436L055K940L401
$$ 75299 77584 78858 79727 81088 83204 86121 90265 95806 101852 107144 111300 114736 117791 120731 124132
54022A24132M186M389L855L449L437K951J736R82J444K125J916J385J555K026
$$ 124132 128318 132707 136562 140011 143448 146399 148135 149117 150561 152686 154602 155987 157542 159568
54008A59568J663M67o39j292j751j942j671j404j730k318k349j766j194r21p57
$$ 159568 161231 161698 161059 159767 158016 156074 154403 152999 151269 148951 146602 144836 143642 142721 141964
53993A41964o59p43q98j028j349j881k069j528o91j15L28Q84J101N02l95o20q4
$$ 141964 141305 140562 139664 138636 137287 135406 133337 131809 131118 131003 131331 132215 133316 133818 133423 132803 132719
53976A32719M56N92O04P21P90P02N29K01n22j627k669l023k350j004J4r6j018
$$ 132719 133175 133767 134371 135092 135882 136584 137113 137314 136792 135165 132496 129473 127123 126119 126133 126037 125019
53959A25019j739j865j880j998j692p68l0j83p31o54K55J372K210K741K970K749
$$ 125019 123280 121415 119535 117537 115845 115077 115047 114864 114133 113479 113734 115106 117316 120057 123027 125776
53943A25776K099J471J575K821M635N735N579N248O104P863Q981Q753P779O414
$$ 125776 127875 129346 130921 133742 138377 144112 149691 154939 161043 168906 177887 186640 194419 200833
53929B00833M276J566n14j385j781k287k379j682q66m44J17J179J996J984J872
$$ 200833 205109 206675 206161 204776 202995 200708 198329 196647 195781 195337 195454 196633 198629 200613 202485
53914B02485K394K855K253J065N73J062J919K911M162N148N081M124L215K811
$$ 202485 204879 207734 209987 211052 211625 212687 214606 217517 221679 226827 231908 236032 239247 242058
53900B42058K620K403K192J856J158J63q82j809k351k191j607j422j798j890j342
$$ 242058 244678 247081 249273 251129 252287 252450 251568 249759 247408 245217 243610 242188 240390 238500 237158
53885B37158j247k635m715n783n404m712m681n126n305m862m126l863m490n360
$$ 237158 235911 233276 228561 222778 217374 212662 207981 202855 197550 192688 188562 184699 180209 174849
53871A74849n371m499l841l834l541k421j532j979l136l669l474l259k927j904
$$ 174849 169478 164979 161138 157304 153763 151342 149810 147831 144695 141026 137552 134293 131366 129462
53857A29462o51m11j488k925l815l898l134j762o98q23j812k479k257j579r86
$$ 129462 128811 128400 126912 123987 120172 116274 113140 111378 110680 109857 108045 105566 103309 101730 100744
53842A00744o25n53p45q80o86m16m47o91q71j007j124r66n51m20p61r40n75k92
$$ 100744 100119 99566 98821 97941 97255 96839 96392 95701 94830 93823 92699 91733 91182 90762 90001 89061 88486 88194
53824H8194n56o39J35R28N27o10r15q1O49M66m7j15K52O97R96R03L26j93Q8J060
$$ 88194 87638 86999 87134 88062 88589 87979 87064 86983 87632 88098 88051 87936 88188 88885 89881 90784 91110 90917 91005 92065
53804I2065J786J659J018O33J036K194L435L932L650L400L597L618L012K491K869
$$ 92065 93851 95510 96528 97161 98197 100391 103826 107758 111408 114808 118405 122023 125035 127526 130395
53789A30395L657L833L381L022K828K390J925K021K400K204J390P65O44N19P3
$$ 130395 134052 137885 141266 144288 147116 149506 151431 153452 155852 158056 159446 160211 160855 161374 161447
53774A61447m68r58j455j736j555j315j677k540l191l316l143k742k027j277r27
$$ 161447 160979 160021 158566 156830 155275 153960 152283 149743 146552 143236 140093 137351 135324 134047 133120
53759A33120r07q77q76j114j453j709k034k325j942p71Q1k72j070j068l48J75
$$ 133120 132213 131336 130460 129346 127893 126184 124150 121825 119883 119112 119193 118921 117851 116783 116435 116610
53743A16610M17Q44J144O92j8oM68L77j79j81L26K34o43j217r47m57j56K39O02
$$ 116610 117027 117871 119015 119707 119689 119683 120151 120528 120349 120168 120494 120728 120085 118868 117921 117464 117308 117547 118149
53724A18149L11m13n93j30K8l53l61L05P65N67M60R02J209R23P49J372K402L169
$$ 118149 118460 118047 117454 117324 117352 116999 116638 116943 117708 118275 118735 119637 120846 121769 122518 123890 126292 129461
53706A29461L646L950L828L222K503J829J069O30J219K525L230K754J838J107
$$ 129461 133107 137057 140885 144107 146610 148439 149508 150138 151357 153882 157112 159866 161704 162811
53692A62811L76k81k24L14J7j409k296j325M18R24r4j254j585j264p30j48M07
$$ 162811 163187 162906 162682 162996 163013 161604 159308 157983 158401 159325 159231 157977 156392 155128 154398 154250 154657
53675A54657R32J576K194K178J234m5q97j211j254j048n33N2M64P56R56Q48M03
$$ 154657 155589 157165 159359 161537 162771 162726 161829 160618 159364 158316 157783 157835 158299 159055 160011 160859 161262
53658A61262O2K33P76J196J095M62j11K62J686K946K826J798J361J853K162J697
$$ 161262 161324 161557 162333 163529 164624 165086 164975 165237 166923 169869 172695 174493 175854 177707 179869 181566
53642A81566J212J298J357P85O0j67j90o04j320j894k239k332j893r44j71p2k56
$$ 181566 182778 184076 185433 186218 186278 186111 185921 185317 183997 182103 179864 177532 175639 174695 174524 174452 174196
53625A74196j05L44O68P23O56N82N81N96K67o05j427j305l18N29P17P37J073J607
$$ 174196 174091 174435 175103 175826 176482 177064 177645 178241 178508 177903 176476 175171 174853 175382 176099 176836 177909 179516
53607A79516K134K566K467J542P19J441L439M633L834K288J696K011K216K167
$$ 179516 181650 184216 186683 188225 188944 190385 193824 198457 202291 204579 206275 208286 210502 212669
53593B12669K458L146L755M059M049L632L010K866L435M063M162L911L528K726
$$ 212669 215127 218273 222028 226087 230136 233768 236778 239644 243079 247142 251304 255215 258743 261469
53579B61469J622J148J717K342K000J095N75M26J38k3N29J431J718J230O59M03
$$ 261469 263091 264239 265956 268298 270298 271393 271968 272394 272532 272509 273038 274469 276187 277417 278076 278479
53563B78479L11L71P74J365J753J897K006K045J917J854K094K393K404K288K439
$$ 278479 278790 279161 279935 281300 283053 284950 286956 289001 290918 292772 294866 297259 299663 301951 304390
53548C04390K785K883K570K186K270L104M278M793M145L247L429M568N243M919
$$ 304390 307175 310058 312628 314814 317084 320188 324466 329259 333404 336651 340080 344648 349891 354810
53534C54810M644N149N650N322M723M666M814M523M158M316M578M290L994M630
$$ 354810 359454 364603 370253 375575 380298 384964 389778 394301 398459 402775 407353 411643 415637 420267
53520D20267N887O633O680O786P168P312P221P629Q801J0085J0800J0850J0478
$$ 420267 426154 432787 439467 446253 453421 460733 467954 475583 484384 494469 505269 516119 526597
53507E26597J0054J0056J0651J1387J1816J2157J2749J3259J3243J3201J4138
$$ 526597 536651 546707 557358 568745 580561 592718 605467 618726 631969 645170 659308
53496F59308J6146J8254J9659K0397K0833K1108K1210K1122K0811K0400K0198
$$ 659308 675454 693708 713367 733764 754597 775705 796915 818037 838848 859248 879446
53485H79446K0336K0566K0617K0446J9990J9205J8470J8312J8476J8066J7078
$$ 879446 899782 920348 940965 961411 981401 1000606 1019076 1037388 1055864 1073930 1091008
53474A091008J6722J7659J8803J8815J7876J7073J6746J6533J6382J6376J6085
$$ 1091008 1107730 1125389 1144192 1163007 1180883 1197956 1214702 1231235 1247617 1263993 1280078
53463A280078J5213J4377J4181J3968J2704J0692R177Q477P714O263M323K082
$$ 1280078 1295291 1309668 1323849 1337817 1350521 1361213 1370390 1378867 1386581 1392844 1397167 1399249
53451A399249n27l183n284o808q251r726j0956j2040j3381j4828j5780j6185j6611
$$ 1399249 1398722 1395539 1390255 1383447 1375196 1365470 1354514 1342474 1329093 1314265 1298485 1282300 1265689
53438A265689j7311j7944j8297j8566j8899j9195j9416j9604j9681j9667j9836
$$ 1265689 1248378 1230434 1212137 1193571 1174672 1155477 1136061 1116457 1096776 1077109 1057273
53427A057273k0193k0159j9380j8416j7871j7301j5790j3341j0831q920p728p216
$$ 1057273 1037080 1016921 997541 979125 961254 943953 928163 914822 903991 895071 887343 880127
53415H80127p053o430m941l319k447k044j204J91J600K904M211N029M951M898
$$ 880127 873074 866644 861703 858384 855937 853893 852689 852880 854480 857384 861595 866624 871575 876473
53401H76473O301R063J1641J3156J4158J5269J6412J7579J9086K0757K1942K2675
$$ 876473 882774 891837 903478 916634 930792 946061 962473 980052 999138 1019895 1041837 1064512
53389A064512K3757K5488K7311K9009L1092L3669L5946L7350L8280L9284M0219
$$ 1064512 1088269 1113757 1141068 1170077 1201169 1234838 1270784 1308134 1346414 1385698 1425917
53378A425917M0731M0903M1048M1364M2013M2979M3771M3950M3816M3890M3724
$$ 1425917 1466648 1507551 1548599 1589963 1631976 1674955 1718726 1762676 1806492 1850382 1894106
53367A894106M2325L9811L7569L6447L5775L4456L2153K8992K5119K1056J7630
$$ 1894106 1936431 1976242 2013811 2050258 2086033 2120489 2152642 2181634 2206753 2227809 2245439
53356B245439J4994J2254Q593M137n88n383j0172j4664j8722k2583k6356k9698
$$ 2245439 2260433 2272687 2281280 2285417 2284829 2279446 2269274 2254610 2235888 2213305 2186949 2157251
53344B157251l2193l3711l4329l4416l4777l5980l7497l8236l8058l7937l8411
$$ 2157251 2125058 2091347 2057018 2022602 1987825 1951845 1914348 1876112 1838054 1800117 1761706
53333A761706l8799l8221l6697l4824l3055l1768l1398l1989l2920l3389l2921
$$ 1761706 1722907 1684686 1647989 1613165 1580110 1548342 1516944 1484955 1452035 1418646 1385725
53322A385725l1385k9105k6941k5673k5089k4289k2843k1147j9578j8065j6527
$$ 1385725 1354340 1325235 1298294 1272621 1247532 1223243 1200400 1179253 1159675 1141610 1125083
53311A125083j4983j3273j1391j0039r915j0446j0306r291q571q837r350r228
$$ 1125083 1110100 1096827 1085436 1075397 1065482 1055036 1044730 1035439 1026868 1018031 1008681 999453
53299I99453q486p295n399k946q57M31J685L527N248N917N959O572Q074R796J1237
$$ 999453 990967 983672 978273 975327 974470 974901 976586 980113 985361 991278 997237 1003809 1011883 1021679 1032916
53284A032916J2428J3408J4160J4955J6130J7537J8710J9546K0378K1554K3144
$$ 1032916 1045344 1058752 1072912 1087867 1103997 1121534 1140244 1159790 1180168 1201722 1224866
53273A224866K4794K5725K5304K3908K2779K2566K2527K1582J9683J7630J5938
$$ 1224866 1249660 1275385 1300689 1324597 1347376 1369942 1392469 1414051 1433734 1451364 1467302
53262A467302J4474J2971J1274R186O649M091K143R44o4j599l869o418q630j0384
$$ 1467302 1481776 1494747 1506021 1515207 1521856 1525947 1528090 1529034 1528970 1527371 1523502 1517084 1508454 1498070
53248A498070j2108j4068j5920j7242j8197j9148k0003k0477k0770k1193k1350
$$ 1498070 1485962 1471894 1455974 1438732 1420535 1401387 1381384 1360907 1340137 1318944 1297594
53237A297594k0665j9562j9100j9328j9178j8226j7416j7481j7776j7405j6635
$$ 1297594 1276929 1257367 1238267 1218939 1199761 1181535 1164119 1146638 1128862 1111457 1094822
53226A094822j6321j6567j6763j6543j5953j5066j4019j3193j2809j2605j2241
$$ 1094822 1078501 1061934 1045171 1028628 1012675 997609 983590 970397 957588 944983 932742
53215I32742j1737j1216j0566r704q795p968p180o523o202o089n866n751o366
$$ 932742 921005 909789 899223 889519 880724 872756 865576 859053 852851 846762 840896 835145 828779
53202H28779p678q884r579j0238j1193j2036j2464j2788j3075j2722j1571j0542
$$ 828779 821101 812217 802638 792400 781207 769171 756707 743919 730844 718122 706551 696009
53190F96009j0277j0095r238q353q514r437r928r787r937j0779j1620j1880j1810
$$ 696009 685732 675637 666399 658046 649532 640095 630167 620380 610443 599664 588044 576164 564354
53177E64354j1821j1911j1983j2035j1813j0963r774r088r261r660r536q964q614
$$ 564354 552533 540622 528639 516604 504791 493828 484054 474966 465705 456045 446509 437545 428931
53164D28931q881r484r800r373q232o922o118o067o293n974m786l361k733l162
$$ 428931 420050 410566 400766 391393 383161 376239 370121 364054 357761 351787 347001 343640 340907 337745
53150C37745l775l647k926k454k488k408j733p66q9J48J63J09j23q48k184l569
$$ 337745 333970 330323 327397 324943 322455 320047 318314 317548 317459 317607 317770 317879 317756 316908 314724 311155
53134C11155m043l499l122l884n056n271m643m447m939n085m585m466n087n288
$$ 311155 307112 303613 300491 296607 291551 286280 281637 277190 272251 267166 262581 258115 253028 247740
53120B47740m421l686m206n169n180m400l841l487k730k031k398l501l937l282
$$ 247740 243319 239633 235427 230258 225078 220678 216837 213350 210620 208589 206191 202690 198753 195471
53106A95471k512k284k221k057k254l017l722l745l216k599k132j965k166k419
$$ 195471 192959 190675 188454 186397 184143 181126 177404 173659 170443 167844 165712 163747 161581 159162
53092A59162k197j507j028j234j757j834j160k07J54n68j944k960l042k513j861
$$ 159162 156965 155458 154430 153196 151439 149605 148445 148238 148392 147824 145880 142920 139878 137365 135504
53077A35504j064LR43J228Q76K60n40j575k411k378j383j50L97k63j891l445l740
$$ 135504 134440 134443 135386 136614 137490 137750 137210 135635 133224 130846 129463 129313 129710 129447 127556 124111 120371
53060A20371k572r74J8M10O88Q05L63n13j208j328q96j24N87O90J07n20o26l41
$$ 120371 117799 116825 116843 117253 117941 118746 119109 118596 117388 116060 115164 115040 115627 116317 116424 115904 115278 114937
53042A14937N5O69J375J399M04o14n10L56P09K55j94k17k01k51L0N10L19r03k351
$$ 114937 114992 115661 117036 118435 118839 118225 117715 118071 118780 119035 118841 118624 118423 118172 118202 118712 119031 118128 115777
53023A15777k991k521j269K10J215J281P66N98J229K255K974K957K160J084O29
$$ 115777 112786 110265 108996 109206 110421 111702 112468 113066 114295 116550 119524 122481 124641 125725 126354
53008A26354J163J896J757P98l5k10J40J017K475L807M049L472L470M536N503
$$ 126354 127517 129413 131170 131968 131933 131723 131863 132880 135355 139162 143211 146683 150153 154689 160192
52993A60192N244M112L078K351J626R56N16L4p62j525j792j795k020k312k082
$$ 160192 165436 169548 172626 174977 176603 177559 178075 178109 177347 175822 174030 172235 170215 167903 165821
52978A65821j372j026j621k689l173k530j287m42m44q43j006r27j009j292j434
$$ 165821 164449 163423 161802 159113 155940 153410 152123 151681 151237 150394 149388 148461 147452 146160 144726
52963A44726j317j082o05L61J402J575O80k90l71J63M07R8k98m95o88r59r45l00
$$ 144726 143409 142327 141722 142083 143485 145060 145740 145450 145079 145242 145649 145747 145449 144954 144266 143307 142362 142062
52945A42062Q42J940K455K139J200J56n14p05o56n93m68o8O65J501K132K432K409
$$ 142062 142904 144844 147299 149438 150638 150794 150280 149575 148919 148326 147858 147790 148455 149956 152088 154520 156929
52928A56929J979J146L07l1Pl25j273j951j374J98J538J901J615J248R30O10L87
$$ 156929 158908 160054 160361 160330 160337 160012 158739 156788 155414 155612 157150 159051 160666 161914 162844 163454 163841
52911A63841L33L25L44N89J136J650J719J311P48M07M60Q06J126J145Q45M52K57
$$ 163841 164174 164499 164843 165432 166568 168218 169937 171248 171996 172403 172863 173669 174795 175940 176785 177237 177494
52894A77494M52R29J209Q64J51j19L90J021J027N77M52R58J676K142K267K183
$$ 177494 177946 178875 180084 180948 181099 180980 181370 182391 183418 183995 184447 185405 187081 189223 191490 193673
52878A93673K103K256K571K594K153J804K144K878L201K945K671K648K503J946
$$ 193673 195776 198032 200603 203197 205350 207154 209298 212176 215377 218322 220993 223641 226144 228090
52864B28090J225O00o1r13j712k085j966j647j515j734k058k093j881j976k609
$$ 228090 229315 229915 229854 228941 227229 225144 223178 221531 220016 218282 216224 214131 212250 210274 207665
52849B07665l145k850j964j377j444j715j695j337q04l75m09q85j127o17P8L7
$$ 207665 204520 201670 199706 198329 196885 195170 193475 192138 191334 190959 190550 189665 188538 187921 187999 188036
52833A88036o41r93p34n60p98q50l45J01j20o79r69j037j203j313j075p60q41
$$ 188036 187395 186402 185668 185108 184310 183460 183115 183216 183096 182417 181448 180411 179208 177895 176820 176060 175219
52816A75219j218j342j007n13j11J44P5n84j702k591k616j905j263j330j947k373
$$ 175219 174001 172659 171652 171139 171028 171172 171247 170663 168961 166370 163754 161849 160586 159256 157309 154936
52800A54936k143j468q32m45k78k77k55Q6O89Q61j5j620k959l364k922k084j271
$$ 154936 152793 151325 150493 150048 149770 149493 149238 149324 150013 150874 150859 149239 146280 142916 139994 137910 136639
52783A36639p90o73n80k26J64J02n25j344j862j713q86nO0p45j455j409j192j573
$$ 136639 135849 135176 134596 134370 134534 134636 134111 132767 130905 129192 128306 128301 128361 127616 126161 124752 123560 121987
52765A21987k176k153j671j535j702j464r29r71j571j633q00j65o29j612k101
$$ 121987 119811 117658 115987 114452 112750 111286 110357 109386 107815 106182 105382 105217 104588 102976 100875
52750A00875k022j857j643j115l33L51O87N15j99r90j186p74m32m76m27K2L99
$$ 100875 98853 96996 95353 94238 93905 94256 94943 95458 95259 94269 93083 92309 91877 91401 90974 90996 91395
52733I1395K75R5N83J779L115M024M149L375K104J109P81Q42R78J232J542J462
$$ 91395 91670 91765 92348 94127 97242 101266 105415 108790 110894 112003 112784 113626 114604 115836 117378 118840
52717A18840P49k47j072j680k155k409k427k370k264j990j692j694j922j945j706
$$ 118840 119589 119342 118270 116590 114435 112026 109599 107229 104965 102975 101283 99589 97667 95722 94016
52702I4016j546j442j028n16p33j826k807k801k050j314r32q56r71r68o16l85
$$ 94016 92470 91028 90000 89484 88751 86925 84118 81317 79267 77953 77021 76165 75194 74226 73610 73225
52686G3225r87k085k380j426k54K60N48J148J548J134L61n0k92p99j157q50m15
$$ 73225 72238 70153 67773 66347 66093 66353 66901 68049 69597 70731 71092 71042 70750 69951 68794 67944 67529
52669F7529o56j213j120m11Jk18n43n82l70J22P97R84K16p42p17J57O07J27m48
$$ 67529 66873 65660 64540 64129 64130 63912 63369 62787 62417 62539 63336 64320 64536 63794 63077 63234 63841 63968 63520
52650F3520l87J0K41L92O18O73M27K96O59J235J474J261Q89N97M05K94L11N18
$$ 63520 63133 63143 63384 63776 64394 65067 65494 65790 66449 67684 69158 70419 71308 71905 72310 72604 72915 73433
52632G3433Q43J005O79j08r21j370j410j143o52j75n4k11j56K01K67l16r63r87
$$ 73433 74276 75281 75960 75852 74931 73561 72151 71008 70356 70181 70127 69916 69760 69961 70228 69912 68949 67962
52614F7962o41o01p37l35O20J222Q70L9m32l30j04j19j97J21Q79J448J228N35
$$ 67962 67321 66720 65983 65648 66268 67490 68360 68399 67967 67637 67533 67414 67217 67338 68217 69665 70893 71428
52596G1428K47N94Q93P04M94P10R35O59K29K37M55K70j85k13K69O82P45P19P40
$$ 71428 71675 72269 73162 73866 74360 75070 76005 76664 76893 77130 77585 77855 77670 77457 77726 78408 79153 79872 80612
52577H0612O80O31Q32J077Q87L21mJ51L58K41j1k3K80O92R64R89R87J354K073
$$ 80612 81292 81923 82755 83832 84719 85040 85036 85187 85545 85786 85775 85752 86032 86724 87688 88677 89664 91018 93091
52558I3091K518K230J626J455J825K219K249J823Q45n04j423j160rJ009J414J595
$$ 93091 95609 97839 99465 100920 102745 104964 107213 109036 109881 109377 107954 106794 106785 107794 109208 110803
52542A10803J926K253K289J958J285M97J81P49J706K112J770J377J392J457J098
$$ 110803 112729 114982 117271 119229 120514 121011 121192 121941 123647 125759 127529 128906 130298 131755 132853
52527A32853M26j24l00r8K42K32m67j407j650q77K44R52J231J460J625J403Q19
$$ 132853 133279 133155 132855 132757 132999 133231 132764 131357 129707 128830 129074 130026 131257 132717 134342 135745 136564
52510A36564M16O07J065J049L88j60J27P98O88m37j405j191k47K43p8o86j164
$$ 136564 136980 137587 138652 139701 140089 139929 140056 140854 141542 141105 139700 138509 138262 138505 138427 137741 136577
52493A36577j482j502j051m07q4j42k59l26m38m01J4N11N84L18K29L81L56P9J0
$$ 136577 135095 133593 132542 132135 132051 131909 131650 131324 130886 130485 130499 131010 131594 131912 132141 132522 132878 132957 132967
52474A32967L88R39J368J620J566J072M03P1K00N06Q84J427J890J812J247Q40
$$ 132967 133355 134294 135662 137282 138848 139920 140323 140394 140594 141100 141984 143411 145301 147113 148360 149200
52458A49200R76J395J705J767J475P71j9l21k6L60M20K95L38O56J133J585J865
$$ 149200 150176 151571 153276 155043 156518 157289 157270 156949 156923 157283 157703 157998 158336 158992 160125 161710 163575
52441A63575J976K086K230K160J814J576J731J974J966J986K421K871K596J656
$$ 163575 165551 167637 169867 172027 173841 175417 177148 179122 181088 183074 185495 188366 190962 192618
52427A92618Q33M87K63j25n61j023j664k333k660k709k885l179l179k884k806
$$ 192618 193451 193938 194201 194076 193515 192492 190828 188495 185835 183126 180241 177062 173883 170999 168193
52412A68193l144l472l352k802k079j556j596k044k070j244m64q56j999k368j530
$$ 168193 165049 161577 158225 155423 153344 151788 150192 148148 146078 144834 144370 143514 141515 139147 137617
52397A37617o56o59j018q89l05K32M77K76n02j394j470o25J13J9l05L7Q75J358
$$ 137617 136961 136302 135284 134395 134090 134322 134799 135075 134573 133179 131709 131084 131197 131216 130911 130948 131823 133181
52379A33181J197Q16O70Q54J194J264P63M8o1O63J475J615J152O23L45L91P28
$$ 133181 134378 135194 135864 136718 137912 139176 139939 139987 139926 140589 142064 143679 144831 145454 145799 146190 146918
52362A46918J094J191J217J648K356K575K035J402J287J557J977K734L762M306
$$ 146918 148012 149203 150420 152068 154424 156999 159034 160436 161723 163280 165257 167991 171753 176059
52348A76059L862K979K511K534K593K562K548K456K160J942K115K517K765K771
$$ 176059 179921 182900 185411 187945 190538 193100 195648 198104 200264 202206 204321 206838 209603 212374
52334B12374K562K001J150N96R04J874K727K878K302J399P44O88J044J377J606
$$ 212374 214936 216937 218087 218683 219587 221461 224188 227066 229368 230767 231511 232199 233243 234620 236226
52319B36226J958K361K506K562L056L893M280L908L442L461L720L922M378N243
$$ 236226 238184 240545 243051 245613 248669 252562 256842 260750 264192 267653 271373 275295 279673 284916
52305B84916N882N750N345N512O267P000P426P654P690P611P863Q719R676J0046
$$ 284916 290798 296548 301893 307405 313672 320672 328098 335752 343442 351053 358916 367635 377311 387357
52291C87357R928J0006J0600J1395J2020J2367J2490J2517J2528J2427J2176J2197
$$ 387357 397285 407291 417891 429286 441306 453673 466163 478680 491208 503635 515811 528008
52279E28008J3030J4476J5694J6329J6727J6845J5994J4177J2664J2404J2729
$$ 528008 541038 555514 571208 587537 604264 621109 637103 651280 663944 676348 689077
52268F89077J2437J1394J0137Q696O975N667N438N599M799K891J004r8o20q12
$$ 689077 701514 712908 723045 731741 738716 744383 749821 755420 760219 763110 764114 764016 763396 762584
52254G62584o17l58o82j504j875j167J58J152J194K26j159j819j018O18J724J780
$$ 762584 761967 761609 760927 759423 757548 756381 756539 757691 758885 759111 757952 756133 755115 755733 757457 759237
52238G59237J523J737K445L433M706O174P416Q231Q853R462R864R967J0053J0304
$$ 759237 760760 762497 764942 768375 773081 779255 786671 794902 803755 813217 823081 833048 843101 853405
52224H53405J0475J0346J0158J0228J0421J0358J0013R678R366Q655P277N687
$$ 853405 863880 874226 884384 894612 905033 915391 925404 935082 944448 953103 960380 966067
52212I66067M677M351L851K412M52r18j333j538k258l375m442n320n903n850n211
$$ 966067 970744 975095 978946 981358 981810 980892 979559 978021 975763 972388 967946 962626 956723 950873 945662
52197I45662m793n298o391p152p167o715o184n843n819n842n339m214l185k855
$$ 945662 940869 935571 929180 922028 914861 908146 901962 896119 890300 884458 879119 874905 871720 868865
52183H68865k972l082l336l927m260l709k781k554l171l783l858l580l061k205
$$ 868865 865893 862811 859475 855548 851288 847579 844798 842244 839073 835290 831432 827852 824791 822586
52169H22586j346j113j424j540j265j237j809k471k693k599k416k031j454j137
$$ 822586 821240 820127 818703 817163 815898 814661 812852 810381 807688 805089 802673 800642 799188 798051
52155G98051j288j390r32k54j71r82k236l314l910m032l886l773l974m609n494
$$ 798051 796763 795373 794441 794187 794016 793034 790798 787484 783574 779542 775656 771883 767909 763300 757806
52140G57806o117o004n212m378m074m305m781n301n629n391m543l653l248l159
$$ 757806 751689 745685 740473 736095 732021 727716 722935 717634 712005 706614 702071 698418 695170 692011
52126F92011l015k981l394l943l993l555l247l336l538l711m019m352m210l381
$$ 692011 688996 686015 682621 678678 674685 671130 667883 664547 661009 657298 653279 648927 644717 641336
52112F41336k190j094m00k96n77m56N93J960K550K321K289L043M145N150O222
$$ 641336 639146 638052 637652 637356 636779 636323 636916 638876 641426 643747 646036 649079 653224 658374 664596
52097F64596P411Q219Q424Q581R196J0035J0830J1945J3650J5297J6003J5936
$$ 664596 672007 680226 688650 697231 706427 716462 727292 739237 752887 768184 784187 800123
52085H00123J6135J7113J8244J8586J7910J6792J5995J5855J6087J6104J5555
$$ 800123 816258 833371 851615 870201 888111 904903 920898 936753 952840 968944 984499
52074I84499J4518J3232J1830J0366Q945P747O920O395N739M427K475N63p64j706
$$ 984499 999017 1012249 1024079 1034445 1043390 1051137 1058057 1064452 1070191 1074618 1077093 1077656 1076892 1075186
52060A075186k691l554l903m114n063o773q067p929o713n629n507o290p349p869
$$ 1075186 1072495 1068941 1065038 1060924 1055861 1049088 1041021 1033092 1026379 1020750 1015243 1008953 1001604 993735
52046I93735p284n765m148l233l139l453l659l403k563j379l36J89J48k42n95
$$ 993735 986451 980686 976538 973305 970166 966713 963054 959651 957088 955709 955373 955562 955710 955468 954873
52031I54873m80K20J104J687J950K192K433K432K216K116K230K341K373K440K384
$$ 954873 954393 954613 955717 957404 959354 961546 963979 966411 968627 970743 972973 975314 977687 980127 982511
52016I82511J819Q70K74M33P43L25q94k174k929l350m037n270o707p857q707r618
$$ 982511 984330 985200 985474 985907 986650 986975 986081 983907 980978 977628 973591 968321 961614 953757 945050 935432
52000I35432j0599j1134j1045j1088j2103j3774j4966j5187j5076j5414j6328
$$ 935432 924833 913699 902654 891566 879463 865689 850723 835536 820460 805046 788718
51989G88718j7562j8911k0039k0455k0002j9108j8307j7825j7671j7823j8145
$$ 788718 771156 752245 732206 711751 691749 672641 654334 636509 618838 601015 582870
51978E82870j8475j8846j9231j9159j8075j6200j4465j3397j2590j1522j0328
$$ 582870 564395 545549 526318 507159 489084 472884 458419 445022 432432 420910 410582
51967D10582r444q916q479q042p689p361o868o164n418m873m657m652m531m098
$$ 410582 401138 392222 383743 375701 368012 360651 353783 347619 342201 337328 332671 328019 323488 319390
51953C19390l495k986k680k602k834l243l345k891k321k223k507k684k718k928
$$ 319390 315895 312909 310229 307627 304793 301550 298205 295314 292993 290770 288263 285579 282861 279933
51939B79933l186k973k216j398q04l93l93j218k521l190k634j488p58p83j299
$$ 279933 276747 273774 271558 270160 269356 268963 268570 267352 264831 261641 259007 257519 256761 255978 254679
51924B54679j956k383k298j847j527j567j709j617j123r5J300K342K395J846J613
$$ 254679 252723 250340 248042 246195 244668 243101 241392 239775 238652 238557 239857 242199 244594 246440 248053
51909B48053J797J677J092O68M77k87j764k781k470j545j142j333j668k309l451
$$ 248053 249850 251527 252619 253287 253764 253477 251713 248932 246462 244917 243775 242442 240774 238465 235014
51894B35014m291l872k606j822j950k187j904j409j197j329j704k219k510k125
$$ 235014 230723 226851 224245 222423 220473 218286 216382 214973 213776 212447 210743 208524 206014 203889
51880B03889j202m52k95m42m71l78l36k93j53j13m79j132j456r56J32J018J234
$$ 203889 202687 202235 201940 201498 201027 200649 200313 200020 199867 199754 199275 198143 196687 195731 195863 196881 198115
51863A98115J018P87M96p4p10r04n17J55Q43J330J202K82p63r84l81J84L18M98
$$ 198115 199133 199920 200416 200342 199632 198728 198211 198366 199209 200539 201741 202023 201260 200276 199895 200079 200397 200895
51845B00895J044J524J570J417J330J287J502K310L228L156K022J166J407J939
$$ 200895 201939 203463 205033 206450 207780 209067 210569 212879 216107 219263 221285 222451 223858 225797
51831B25797J936K104L273M546M421L268K956M089N115M504K599Q49L7j89o38
$$ 225797 227733 229837 233110 237656 242077 245345 248301 252390 257505 262009 264608 265457 265494 265305 264667
51816B64667j734l116l964l962l692l783m035l916l541l387l325k812j880j071
$$ 264667 262933 259817 255853 251891 248199 244416 240381 236465 232924 229537 226212 223400 221520 220449
51802B20449m74L19J225J589J265R86J285J755J795J572J703K345L008L146K672
$$ 220449 219975 220294 221519 223108 224373 225359 226644 228399 230194 231766 233469 235814 238822 241968 244640
51787B44640J967J465J196P88Q1m91m94k90p44k058l323l458k383j080o13j144
$$ 244640 246607 248072 249268 250056 250137 249646 249152 248862 248118 246060 242737 239279 236896 235816 235203 234059
51771B34059j836j780r43p7L01M15O39R00R73R63J083J259J319J337J340J072
$$ 234059 232223 230443 229500 229423 229724 230139 230778 231678 232651 233614 234697 235956 237275 238612 239952 241024
51755B41024L86l69p76q42o83j39Q03J560J613J279J277J724K170K368K394K209
$$ 241024 241410 241041 240265 239423 238740 238601 239404 240964 242577 243856 245133 246857 249027 251395 253789 255998
51739B55998J805J630K154L089L652L551L122K602J943J403J493K255L113L586
$$ 255998 257803 259433 261587 264676 268328 271879 275001 277603 279546 280949 282442 284697 287810 291396
51725B91396L669L527L349L574M617O146P164P078O305N608N195M590L270J212
$$ 291396 295065 298592 301941 305515 310132 316278 323442 330520 336825 342433 347628 352218 355488 356700
51711C56700j020k723l693m258m597m395l509k514k189k572l106l417l511l459
$$ 356700 355680 352957 349264 345006 340409 336014 332505 329991 327802 325230 322124 318707 315196 311737
51697C11737l393l614m198m697m729m550m471m192l473l003l566m588m668l524
$$ 311737 308344 304730 300532 295835 291106 286556 282085 277893 274420 271417 267851 263263 258595 255071
51683B55071k286j748j470q79k40M0P0r9q80k306l496l644l094k690k545k153
$$ 255071 252785 251037 249567 248688 248448 248488 248558 248459 247579 245273 241777 238133 235039 232349 229804 227651
51667B27651j445r40q77q38l71L50P77O88M66O72J418K278K899L400M041M665
$$ 227651 226206 225266 224389 223551 223180 223530 224307 224995 225461 226133 227551 229829 232728 236128 240169 244834
51651B44834M945M973N163N627O037O213O377O762P268P607P517O907N977N086
$$ 244834 249779 254752 259915 265542 271579 277792 284169 290931 298199 305806 313323 320230 326207 331293
51637C31293M246K988J093q94k416l794n642p620q711q681q375q423q537q357
$$ 331293 335539 338527 339620 338726 336310 332516 326874 319254 310543 301862 293487 285064 276527 268170
51623B68170q073p788p063n680m303l735l972m461m923n345n458m853l600k373
$$ 268170 260097 252309 245246 239566 235263 231528 227556 223095 218172 212827 207369 202516 198916 196543
51609A96543j805j887j973j434l78L41Q5q16j497j594j377j113q93r55j441j817
$$ 196543 194738 192851 190878 189444 189066 189407 189492 188676 187179 185585 184208 183095 182202 181247 179806 177989
51593A77989j375m12l0n32q84k84O55R18N50K86L34M32P28J598K680L022K396
$$ 177989 176614 176202 176172 175640 174756 174472 175127 176045 176595 176881 177215 177647 178375 179973 182653 185675 188071
51576A88071J723J876K629L159L230L352L996N058O131O953P470P701P784Q026
$$ 188071 189794 191670 194299 197458 200688 204040 208036 213094 219225 226178 233648 241349 249133 257159
51562B57159Q596R252R672R975J0506J1078J0984R885Q188O294M075J536o90k160
$$ 257159 265755 275007 284679 294654 305160 316238 327222 337107 345295 351589 355664 357200 356510 354350
51548C54350l369m891o232o473n718m985m771m682m400m002l303j914j77R45J200
$$ 354350 350981 346090 339858 333385 327667 322682 317911 313229 308829 304827 301524 299610 299433 300378 301578
51533C01578J435K357L743N149O555P920Q931R559J0129J0536J0233R410R159
$$ 301578 303013 305370 309113 314262 320817 328737 337668 347227 357356 367892 378125 387535 396694
51520C96694R825J0126Q725N988L378J652N27l93j250k224l398m473n112n397
$$ 396694 406519 416645 425370 431358 434736 436388 436915 436522 435272 433048 429650 425177 420065 414668
51506D14668n408m860l665k500k037j919j236J41J443K150K497K811K992K856
$$ 414668 409260 404400 400735 398235 396198 394279 393043 393184 394627 396777 399274 402085 405077 407933
51492D07933K519K186J793J020m09k392m336n515n746n586n737o375p144p557
$$ 407933 410452 412638 414431 415451 415042 412650 408314 402799 397053 391467 385730 379355 372211 364654
51478C64654p289o378n273m464l961l465k996k868k888k394j331o92j234k312
$$ 364654 357365 350987 345714 341250 337289 333824 330828 327960 325072 322678 321347 320655 319421 317109
51464C17109k655j943r28k15L78J209K102K511K201J569J287J555J886J883K043
$$ 317109 314454 312511 311583 311368 311746 312955 315057 317568 319769 321338 322625 324180 326066 327949 329992
51449C29992L178N076O477O641O229O229O729P280P850Q619R260R194Q443P592
$$ 329992 333170 338246 344723 351364 357593 363822 370551 377831 385681 394300 403560 412754 421197 428789
51435D28789P046O717O310N524M133K342P81j74q95j911l095l897m129m093m031
$$ 428789 435835 442552 448862 454386 458519 460861 461642 461468 460573 458662 455567 451670 447541 443448 439417
51420D39417l822l148j796P6J811K757K948K941K874K269J046o7n23p63j500k824
$$ 439417 435595 432447 430651 430727 432538 435295 438243 441184 444058 446327 447373 447306 446783 446020 444520 441696
51404D41696m477o363q133q986q670q147q435r256r604r218q581p924p209o801
$$ 441696 437219 430856 422723 413737 405067 396920 388485 379229 369625 360407 351826 343902 336693 329892
51390C29892p091p622p489o523n323m259l357k839k890k910k127p55L35J083K168
$$ 329892 322801 315179 307690 301167 295844 291585 288228 285389 282499 279589 277462 276707 277042 278125 280293
51375B80293L584M511M820N457O786P737P279N887M754M264L866K992J407r16
$$ 280293 283877 288388 293208 298665 305451 313188 320467 326354 331108 335372 339238 342230 343637 342721
51361C42721l643o086p803q971r924j0667j1152j1502j1652j1130r726q000o751
$$ 342721 339078 332992 325189 316218 306294 295627 284475 272973 261321 250191 240465 232465 225714
51348B25714o253o261o447o454n920m891l998l779l989l957l456k858k525k441
$$ 225714 219461 213200 206753 200299 194379 189488 185490 181711 177722 173765 170309 167451 164926 162485
51334A62485k398k274k078j900j793j622j170n08j07l09p92q72k50O67J241J225
$$ 162485 160087 157813 155735 153835 152042 150420 149250 148742 148635 148326 147534 146662 146412 147079 148320 149545
51318A49545Q34M02Q2p7rK96O09O24L63K69P30J645K607L320L728L847L713L472
$$ 149545 150379 150781 150863 150786 150777 151073 151682 152306 152669 152938 153668 155313 157920 161240 164968 168815 172528 176000
51300A76000L331L517M202N351O567P416P935Q539R292R777R865J0044J0530J0625
$$ 176000 179331 182848 187050 192401 198968 206384 214319 222858 232150 241927 251792 261836 272366 282991
51286B82991R581P770O217N187L953J922o85l304n592p391q666r631j0518j1204
$$ 282991 292572 300342 306559 311746 315699 317621 316936 313632 308040 300649 291983 282352 271834 260630
51272B60630j1378j1041j0421r523q298p140o616o706o859o801o584n945m451
$$ 260630 249252 238211 227790 218267 209969 202829 196213 189507 182648 175847 169263 163318 158867
51259A58867k506j285j338j918k138k034k010j894j367q04q51j426j875j968k061
$$ 158867 156361 155076 153738 151820 149682 147648 145638 143744 142377 141573 140722 139296 137421 135453 133392
51244A33392k270k158j489o58j37J48N11R45J177J186J278J652K147K469K528
$$ 133392 131122 128964 127475 126817 126680 126828 127339 128284 129461 130647 131925 133577 135724 138193 140721
51229A40721K429K283K150K060J952J677J244R16Q63Q20L33o29j668k454k901
$$ 140721 143150 145433 147583 149643 151595 153272 154516 155432 156295 157115 157448 156819 155151 152697 149796
51214A49796k913k439j872j808k162k109j239k32J32M6J61M70M16p8n28o81p10
$$ 149796 146883 144444 142572 140764 138602 136493 135254 135022 135154 135200 135361 135831 136247 136169 135641 134960 134250
51197A34250o01o7P98J336J025j5j223k008j979j259n37m20p33q15m15J40N53
$$ 134250 133649 133582 134380 135716 136741 136726 135503 133495 131516 130257 129720 129300 128567 127752 127337 127477 128030
51180A28030P81P19K69k97n73o41r41j539k009k086j890j541j112q83j011j047
$$ 128030 128811 129530 129799 129502 128929 128288 127347 125808 123799 121713 119823 118282 117170 116287 115276 114229
51164A14229n18J01r5r02j012P7J273J532J295J461J843J631R11N53Q55J201J102
$$ 114229 113711 113812 113717 112815 111803 111880 113153 114685 115980 117441 119284 120915 121826 122379 123234 124435 125537
51147A25537P41M73M56Q37J656K416K315J230m7p52r80j264j756k242k645l044
$$ 125537 126278 126751 127207 128044 129700 132116 134431 135661 135614 134862 133882 132618 130862 128620 125975 122931
51131A22931l172k516j165m0O2n46q35m09R9J4m94p66n05O8N98Q91R37R70J181
$$ 122931 119759 117243 116078 116038 116100 115554 114719 114310 114409 114423 113929 113163 112658 112726 113324 114215 115152 116122 117303
51112A17303J309Q82J11M0J296L108M193M249L978L861L749L514L354L286L006
$$ 117303 118612 119494 119605 119645 120941 124049 128242 132491 136469 140330 144079 147593 150947 154233 157239
51097A57239K455J963J692J392P98r1j159k189k791k745k429k431k729k763k283
$$ 157239 159694 161657 163349 164741 165539 165448 164289 162100 159309 156564 154135 151704 148975 146212 143929
51082A43929j656j272j121j019r09q25q84j160j399j098k38M94O74P79J164J108
$$ 143929 142273 141001 139880 138861 137952 137127 136243 135083 133684 132586 132348 132842 133516 134295 135459 136567
51066A36567o7j444j458k30N10j15j136j456j214r51o65k83o1KK25L49l50j589
$$ 136567 136500 135056 133598 133368 133878 133763 132627 131171 129957 129006 128341 128058 127997 127999 128224 128573 128223 126634
51048A26634j939p90O59J173J058J127J259J057R46J373J684J107K60L78J442
$$ 126634 124695 123905 124564 125737 126795 127922 129181 130238 131184 132557 134241 135348 135608 135986 137428
51033A37428K245K170J767J740K234L060L838M045L556K948K716K629K424K520
$$ 137428 139673 141843 143610 145350 147584 150644 154482 158527 162083 165031 167747 170376 172800 175320
51019A75320L170L570K920J869J720K391K475J262m21j494j757j555j246j178
$$ 175320 178490 182060 184980 186849 188569 190960 193435 194697 194276 192782 191025 189470 188224 187046
51005A87046j413j409p31k6l29j312j331M25K762L998L873L410L402L826M338
$$ 187046 185633 184224 183493 183467 183138 181826 180495 180920 183682 187680 191553 194963 198365 202191 206529
50990B06529M807N275N792O301O683O969P397Q110Q880R406R802J0498J1712J3323
$$ 206529 211336 216611 222403 228704 235387 242356 249753 257863 266743 276149 285951 296449 308161 321484
50976C21484J5107J6879J8496K0142K2331K5223K8187L0513L2430L4818L8085
$$ 321484 336591 353470 371966 392108 414439 439662 467849 498362 530792 565610 603695
50965F03695M1794M5299M8161N0037N0823N0948N0952N0697M9455M6805M3057
$$ 603695 645489 690788 738949 788986 839809 890757 941709 992406 1041861 1088666 1131723
50954A131723L8715L4043K9120K3976J8658J3473R033N580K541o58l450m556l600
$$ 1131723 1170438 1204481 1233601 1257577 1276235 1289708 1298741 1304321 1306862 1306204 1302754 1298198 1294598
50941A294598j622J57J374K236K804K907K286N36k718p309j2477j7423k1789k5655
$$ 1294598 1292976 1293133 1294507 1296743 1299547 1302454 1304740 1305276 1302558 1295249 1282772 1265349 1243560 1217905
50927A217905k9405l3451l7765m1770m5046m7869n0470n2113n1737m9464m6592
$$ 1217905 1188500 1155049 1117284 1075514 1030468 982599 932129 880016 828279 778815 732223
50916G32223m3961m1200l7842l4298l1274k8836k6551k4140k1573j8884j6197
$$ 732223 688262 647062 609220 574922 543648 514812 488261 464121 442548 423664 407467
50905D07467j3722j1460r266p198n438l908k497j651j926k862l080j986n85j59
$$ 407467 393745 382285 373019 365821 360383 356475 353978 352327 350401 347539 344459 342473 341888 341729
50891C41729p18j316j333p93Q5J029J674J969K388L269M221M695M822N046N325
$$ 341729 341011 339695 338362 337569 337654 338683 340357 342326 344714 347983 352204 356899 361721 366767 372092
50876C72092N340N372O153P760R303R958R919J0059J0908J2239J3518J4615J5976
$$ 372092 377432 382804 388957 396717 406020 415978 425897 435956 446864 459103 472621 487236 503212
50863E03212J8018K0492K2818K5033K7895L1755L5864L9500M3311M8682N5791
$$ 503212 521230 541722 564540 589573 617468 649223 685087 724587 767898 816580 872371
50852H72371O3206O9716P5753Q2479R0055R7502J04003J09560J14302J17776J19275
$$ 872371 935577 1005293 1081046 1163525 1253580 1351082 1455085 1564645 1678947 1796723 1915998
50841A915998J18455J15332J09722J01127Q9203P4456N8398M2909K9147J6953
$$ 1915998 2034453 2149785 2259507 2360634 2449837 2524293 2582691 2625600 2654747 2671700
50831B671700N623m732j2927j8002k0192k0120j7548j1881l856M362J0981J5633
$$ 2671700 2677323 2672591 2659664 2641662 2621470 2601350 2583802 2571921 2568065 2572427 2583408 2599041
50819B599041J8207J7644J2887M373o387j8435l1612m5483n9130p2131q4683r6517
$$ 2599041 2617248 2634892 2647779 2652152 2645765 2627330 2595718 2550235 2491105 2418974 2334291 2237774
50807B237774j06527j13892j18662j20845j19834j15495j09108j02290r5305q7393
$$ 2237774 2131247 2017355 1898693 1777848 1658014 1542519 1433411 1331121 1235816 1148423
50797A148423p8553p0012o2775n6579n0623m4706l9152l4076k9367k5089k1394
$$ 1148423 1069870 999858 937083 880504 829881 785175 746023 711947 682580 657491 636097
50786F36097j8092j4891j2064j0273r475q564o643m285k905k950l482l587l503
$$ 636097 618005 603114 591050 580777 571302 562738 556095 551810 548905 545955 542473 538886 535383
50773E35383l884m615m966m656m078l622l283k993k792k571k113j460r63o97j66
$$ 535383 531499 526884 521918 517262 513184 509562 506279 503286 500494 497923 495810 494350 493387 492690 492524
50758D92524J129L013M737N679N882N951O553P967R968J2107J4042J5648J6983
$$ 492524 493653 496666 501403 507082 512964 518915 525468 533435 543403 555510 569552 585200 602183
50745F02183J8264J9829K1963K4715K7861L0975L3701L6103L8686M1871M5501
$$ 602183 620447 640276 662239 686954 714815 745790 779491 815594 854280 896151 941652
50734I41652M9290N3580N9076O5652P2001P6855Q0012Q1827Q2228Q0827P7604
$$ 941652 990942 1044522 1103598 1169250 1241251 1318106 1398118 1479945 1562173 1643000 1720604
50723A720604P2763O6195N7650M7255L5339K2011P674o241j7909k6564l2712l6809
$$ 1720604 1793367 1859562 1917212 1964467 1999806 2021817 2029491 2023250 2005341 1978777 1946065 1909256
50711A909256l8488l7332l3786k8859k3332j7587j1962o864k654L76J934J568
$$ 1909256 1870768 1833436 1799650 1770791 1747459 1729872 1717910 1711046 1708392 1708768 1710702 1712270
50699A712270j354p245j5726k5613l5823m5915n5548o3748o9426p2365p3183p2439
$$ 1712270 1710916 1703671 1687945 1662332 1626509 1580594 1525046 1461298 1391872 1319507 1246324 1173885
50687A173885p0315o7016o2765n7561n1533m5463m0228l5774l1458k7240k3695
$$ 1173885 1103570 1036554 973789 916228 864695 819232 779004 743230 711772 684532 660837
50676F60837k0766j7581j3862j0509q269o661m782k527l04J834M097O281P932
$$ 660837 640071 622490 608628 598119 589850 583189 578407 575880 575576 577410 581507 587788 595720
50663E95720Q961R609R995J0104J0088J0180J0379J0540J0648J0789J1074J1781
$$ 595720 604681 614290 624285 634389 644477 654657 665036 675576 686224 697013 708087 719868
50651G19868J3253J5458J7895K0229K2631K5276K7847K9991L1966L4414L7564
$$ 719868 733121 748579 766474 786703 809334 834610 862457 892448 924414 958828 996392
50640I96392M1064M4445M7422M9783N1437N2580N3508N4124N3811N1946M8487
$$ 996392 1037456 1081901 1129323 1179106 1230543 1283123 1336631 1390755 1444566 1496512 1544999
50629A544999M3955L8885L3458K7775K2196J7112J2425P864L868J527J222J948
$$ 1544999 1588954 1627839 1661297 1689072 1711268 1728380 1740805 1748669 1752537 1754064 1755286 1757234
50617A757234K623L523N531Q422J0961J2596J3852J4911J4916J3255J0585Q007
$$ 1757234 1759857 1763380 1768911 1777333 1788294 1800890 1814742 1829653 1844569 1857824 1868409 1876416
50605A876416N845L772J603p14l486p141j1884j7806k4994l3201m1650m9450n6047
$$ 1876416 1882261 1886033 1887636 1886922 1883436 1876295 1864411 1846605 1821611 1788410 1746760 1697310 1641263
50592A641263o1136o4577o6503o7196o6650o4704o1648n8239n4953n1673m8220
$$ 1641263 1580127 1515550 1449047 1381851 1315201 1250497 1188849 1130610 1075657 1023984 975764
50581I75764m4713m1167l7359l3224k8945k4534j9964j5736j2631j0660q985p000
$$ 975764 931051 889884 852525 819301 790356 765822 745858 730122 717491 706831 697846 690846
50569F90846m720k023J393M922P095P461P427Q511J0609J2785J4801J6863J8630
$$ 690846 686126 684103 685496 690418 697513 704974 712401 720912 731521 744306 759107 775970 794600
50556G94600J9644K0271K1132K2102K2832K3793K5624K7774K8992K8924K8208
$$ 794600 814244 834515 855647 877749 900581 924374 949998 977772 1006764 1035688 1063896
50545A063896K7162K5606K3884K2795K2326K1566K0229J9227J9375K0406K1710
$$ 1063896 1091058 1116664 1140548 1163343 1185669 1207235 1227464 1246691 1266066 1286472 1308182
50534A308182K3392K5974K9602L3973L8760M3769M8915N4293O0036O6005P1875
$$ 1308182 1331574 1357548 1387150 1421123 1459883 1503652 1552567 1606860 1666896 1732901 1804776
50523A804776P7505Q2858Q7577R1085R3141R3910R3349R0999Q6467P9767P1031
$$ 1804776 1882281 1965139 2052716 2143801 2236942 2330852 2424201 2515200 2601667 2681434 2752465
50512B752465O0293M7761L3989J9568M785j0310k5511m0193n3350o4124p2355
$$ 2752465 2812758 2860519 2894508 2914076 2918861 2908551 2883040 2842847 2789497 2725373 2653018
50501B653018p8432q2380q3445q0922p5133o7116n7552m6524l4261k1533r200
$$ 2653018 2574586 2492206 2408761 2327839 2252706 2185590 2128038 2081514 2047253 2025720 2016520
50490B016520K244J2653K1995L0137L6515M0058L9844L5722K7988J6644J583j6440
$$ 2016520 2018764 2031417 2053412 2083549 2120064 2160122 2199966 2235688 2263676 2280320 2281903 2265463
50478B265463l5526n3510o8896q0965q9545r4915r7561r7724r5344r0692q4820
$$ 2265463 2229937 2176427 2107531 2026566 1937021 1842106 1744545 1646821 1551477 1460785 1375965
50467A375965p9004p3725o8285o1662n3710m5535l8587l3471k9677k6227k2380
$$ 1375965 1296961 1223236 1154951 1093289 1039579 994044 955457 921986 892309 866082 843702
50456H43702j7928j3303r305o272l539k18L514O591Q590J0273J2334J4489J6316
$$ 843702 825774 812471 803166 796894 793355 793137 796651 803242 811832 822105 834439 848928 865244
50443H65244J8185K0576K3074K4878K5941K6794K7657K8473K9504L1068L2729
$$ 865244 883429 904005 927079 951957 977898 1004692 1032349 1060822 1090326 1121394 1154123
50432A154123L3564L3218L2124L0705K8952K6662K3712K0095J6145J2523R606
$$ 1154123 1187687 1220905 1253029 1283734 1312686 1339348 1363060 1383155 1399300 1411823 1421429
50421A421429P127M804K916J762J024L16J9P98K602M878P543J0950J5075J9454
$$ 1421429 1428556 1433360 1436276 1438038 1439062 1439378 1439397 1440195 1442797 1447675 1455218 1466168 1481243 1500697
50407A500697K3716K7489L0059L1016L1026L1045L0943K9776K7274K4004K0082
$$ 1500697 1524413 1551902 1581961 1612977 1644003 1675048 1705991 1735767 1763041 1787045 1807127
50396A807127J4879Q146L98q078j7611k8092l8409m7427n4871o0843o5133o7409
$$ 1807127 1822006 1830152 1830550 1822472 1804861 1776769 1738360 1690933 1636062 1575219 1510086 1442677
50384A442677o7686o6172o3076n8731n3509m7440m0314l2333k4189j6434r160
$$ 1442677 1374991 1308819 1245743 1187012 1133503 1086063 1045749 1013416 989227 972793 963633
50373I63633k283M211J0370J6083K0873K4235K5969K5739K2763J6755Q882Q73
$$ 963633 961350 965561 975931 992014 1012887 1037122 1063091 1088830 1111593 1128348 1137230 1138103
50361A138103o604j3796k0414k5667k9542l2716l5024l5370l3610l1133k9079
$$ 1138103 1131499 1117703 1097289 1071622 1042080 1009364 974340 938970 905360 874227 845148
50350H45148k7180k4921k2590k0457j8099j5479j3550j2793j2128j0406q186o757
$$ 845148 817968 793047 770457 750000 731901 716422 702872 690079 677951 667545 659359 652602
50338F52602o078n048l426k120j576j079J64K037L952N535O737P699Q702R896
$$ 652602 646524 641476 638050 635930 634354 633275 633439 635476 639428 644963 651700 659399 668101 677997
50324F77997J1083J2054J2998J4219J5508J6220J6088J5699J6055J7666J9970
$$ 677997 689080 701134 714132 728351 743859 760079 776167 791866 807921 825587 845557
50313H45557K1683K1994K1315K0562J9816J8328J5813J2952J0394Q100N977M384
$$ 845557 867240 889234 910549 931111 950927 969255 985068 998020 1008414 1016514 1022491 1026875
50301A026875L362K145J24k181l838m751n504o417p442q614r811j0437j0076r358
$$ 1026875 1030237 1032382 1032506 1030325 1026487 1021736 1016232 1009815 1002373 993759 983948 973511 963435 954077
50287I54077r394j0433j1740j2718j3483j4357j5415j6568j7585j7947j7332j6207
$$ 954077 944683 934250 922510 909792 896309 881952 866537 849969 832384 814437 797105 780898
50275G80898j5548j5791j6457j6891j6912j6681j6267j5617j4746j3837j3125
$$ 780898 765350 749559 733102 716211 699299 682618 666351 650734 635988 622151 609026
50264F09026j2620j1911j0452q246o022m508l692l110k527k039j639j158n76r4
$$ 609026 596406 584495 574043 565797 559775 555267 551575 548465 545938 543899 542260 541102 540526 540432
50250E40432K48P25J676L145M720N710N748N218M882M939M827M109L141K532K316
$$ 540432 540680 541405 543081 546226 550946 556656 562404 567622 572504 577443 582270 586379 589520 592052 594368
50235E94368K099J738J381R82L11o10j452k084k801l907n236o167o152n292m358
$$ 594368 596467 598205 599586 600568 600879 600269 598817 596733 593932 590025 584789 578622 572470 567178 562820
50220E62820m085m427m666m228l130j687k35Q44J261J223J290J605J673J176O47
$$ 562820 558735 554308 549642 545414 542284 540597 540362 541206 542467 543690 544980 546585 548258 549434 550081
50205E50081R22K130L554M377M343L830L414L357L450L456L456L542L326K363
$$ 550081 551003 553133 556687 561064 565407 569237 572651 576008 579458 582914 586370 589912 593238 595601
50191E95601R04l55j235k130l134l934m627n805p455q716r087r133r492r943j0021
$$ 595601 596505 596150 594915 592785 589651 585717 581090 575285 567830 559114 550027 540894 531402 521459 511438
50176E11438r840r612r017p719o047m587l531k897k798k922k536j540r05j311
$$ 511438 501598 491986 482969 475250 469203 464616 461085 458188 455390 452468 449932 448392 447487 446176
50162D46176k122k479k671l357m194m363m040l992m099l543k389j692j917k391
$$ 446176 444054 441575 438904 435547 431353 426990 422950 418958 414859 411316 408927 407235 405318 402927
50148D02927k559k685l024l191k824k154j578j219j127j366j722j805j607j502
$$ 402927 400368 397683 394659 391468 388644 386490 384912 383693 382566 381200 379478 377673 376066 374564
50134C74564j599j539j012r1R50J748J961J700J707K489L447L647L335L760N394
$$ 374564 372965 371426 370414 370323 371273 373021 374982 376682 378389 380878 384325 387972 391307 395067 400461
50119D00461P233Q173Q314Q423Q792R114R143Q936Q589Q124P575P067O779O748
$$ 400461 407694 415867 424181 432604 441396 450510 459653 468589 477178 485302 492877 499944 506723 513471
50105E13471O636N909M509L107K335K010J496N29p19k097l370l931l363k126j087
$$ 513471 520107 526016 530525 533632 535967 537977 539473 540002 539283 537186 533816 529885 526522 524396 523309
50090E23309m49J89R34J485J869K489L347L980M208M287M357M398M722N691O886
$$ 523309 522860 523049 523983 525468 527337 529826 533173 537153 541361 545648 550005 554403 559125 564816 571702
50075E71702P451P351P418P977Q353Q124P894Q279Q867Q866Q190P354O701O307
$$ 571702 579153 586504 593922 601899 610252 618376 626270 634549 643416 652282 660472 667826 674527 680834
50061F80834O235O435O600O563O541O766P176P644Q087Q161P464O319N752O214
$$ 680834 687069 693504 700104 706667 713208 719974 727150 734794 742881 751042 758506 764825 770577 776791
50047G76791O791O299M770L301K674K682K742K554K108J387L36r72k203k987l354
$$ 776791 783582 789881 794651 797952 800626 803308 806050 808604 810712 812099 812435 811463 809260 806273 802919
50032H02919l857m942o330p370p954q564r441j0198j0510j0568j0636j0548j0114
$$ 802919 799062 794120 787790 780420 772466 763902 754461 744263 733753 723185 712549 702001 691887
50019F91887r603r443r496r131p959o323m941m180l736l075k121j251n88K51J459
$$ 691887 682284 672841 663345 654214 646255 639932 634991 630811 627075 624000 621879 620628 620040 620291 621750
50004F21750K555L039L176L462L687L287K402J741J462J069M09k06r07k306m292
$$ 621750 624305 627344 630520 633982 637669 640956 643358 645099 646561 647630 648039 647833 646926 644620 640328
49989F40328n745n953n561n592o256p232q386r533j0048r517q427p638p355p110
$$ 640328 634583 628630 623069 617477 611221 603989 595603 586070 576022 566505 558078 550440 543085 535975
49975E35975o477n408m079k803j783p06J014L309N239O088O311O941Q409J0345
$$ 535975 529498 524090 520011 517208 515425 514719 515733 519042 524281 530369 536680 543621 552030 562375
49961E62375J2122J3200J3290J2708J2177J1875J1040R062O497M404K949J487
$$ 562375 574497 587697 600987 613695 625872 637747 648787 657849 664346 668750 671699 673186
49949F73186j77j339j340l32J040K335L416M112M023K663p0l648p310j0827j4583
$$ 673186 673009 671670 670330 669998 671038 673373 676789 680901 684924 687587 687517 683869 676559 665732 651149
49934F51149j8657k2180k4005k3878k2624k1270k0240j9303j8000j6133j3990
$$ 651149 632492 610312 586307 562429 539805 518535 498295 478992 460992 444859 430869
49923D30869j2059j0516r131p706o357n277m496l972l722l693l714l634l354k746
$$ 430869 418810 408294 399163 391457 385100 379823 375327 371355 367633 363940 360226 356592 353238 350492
49909C50492j858j154j091j456j551j159q33j098j821k563l078l256l075k744
$$ 350492 348634 347480 346389 344933 343382 342223 341390 340292 338471 335908 332830 329574 326499 323755
49895C23755k501k123j188K2N79J60m45m49l1K59M45Q31J274J365R68J89q12j531
$$ 323755 321254 319131 317943 317965 318544 318704 318259 317810 317779 318038 318483 319314 320588 321953 322921 323110 322298 320767
49877C20767j191K86J836K375J987J495J322J339J533K012K583K942L088L117
$$ 320767 319576 319862 321698 324073 326060 327555 328877 330216 331749 333761 336344 339286 342374 345491
49863C45491K904K455K285K813L723M548N452O833Q371R252R254R015R335J0624
$$ 345491 348395 350850 353135 355948 359671 364219 369671 376504 384875 394127 403381 412396 421731 432355
49849D32355J2736J4879J6081J6428J7348J9879K3029K4750K4283K2611K0822
$$ 432355 445091 459970 476051 492479 509827 529706 552735 577485 601768 624379 645201
49838F45201J9149J7609J6350J5144J3453J1499J0382J0720J1902J3080J4219
$$ 645201 664350 681959 698309 713453 726906 738405 748787 759507 771409 784489 798708
49827G98708J5558J6615J6428J4481J0917O143O98m704r517j3728j7537k0749
$$ 798708 814266 830881 847309 861790 872707 878850 879548 874844 865327 851599 834062 813313
49815H13313k2807k3531k3466k3292k3026k2173k0699j9406j9004j9045j8453
$$ 813313 790506 766975 743509 720217 697191 675018 654319 634913 615909 596864 578411
49804E78411j7003j5570j4742j4012j2879j1914j1902j2381j1995j0198p838o018
$$ 578411 561408 545838 531096 517084 504205 492291 480389 468008 456013 445815 437977 431959
49792D31959n075m726m626m669n022n934p189p985p789o997o276n605m643l743
$$ 431959 426884 422158 417532 412863 407841 401907 394718 386733 378944 371947 365671 360066 355423 351680
49778C51680l679m391m862m389l321k374j946k163k946l685l548k388r70p9J84
$$ 351680 348001 343610 338748 334359 331038 328664 326718 324555 321609 317924 314376 311988 311018 310939 311123
49763C11123J28nn8L4R8RP5P12J699K313K280K003J774J457J106J178J839K632
$$ 311123 311251 311246 311188 311222 311320 311329 311404 312116 313815 316128 318408 320411 322185 323642 324748 325926 327765 330397
49745C30397L131L405L580L570L475L731M403M938N017N149N943P218Q318Q915
$$ 330397 333528 336933 340513 344083 347558 351289 355692 360630 365647 370796 376739 383957 392275 401190
49731D01190R114R098R103R401R892J0113J0077J0684J2648J5348J7431J8421
$$ 401190 410304 419402 428505 437906 447798 457911 467988 478672 491320 506668 524099 542520
49719E42520J9000J9622J9643J8265J5837J3563J1991J0450Q252N974M835N075
$$ 542520 561520 581142 600785 619050 634887 648450 660441 670891 679143 685117 689952 695027
49707F95027N742O293P422R631J1813J2266J0755Q355N479J379m170r892j4336
$$ 695027 700769 707062 714484 724115 735928 748194 758949 767304 772783 774162 769992 760100 745764
49694G45764j7246j9051j9893j9866j9471j9087j8402j7062j5416j3973j2590
$$ 745764 728518 709467 689574 669708 650237 631150 612748 595686 580270 566297 553707
49683E53707j0862q962p316n859m282k848k098j963j804j291o59j98p4m61j219
$$ 553707 542845 533883 526567 520708 516426 513578 511480 509517 507713 506422 505763 505565 505491 505030 503811
49668E03811j551p16Q86K080K398K469K829L071K587J608R26R07J114Q59j76j643
$$ 503811 502260 501544 502430 504510 506908 509377 512206 515277 517864 519472 520398 521305 522419 523278 523102 521459
49652E21459k770l010k561k054j766j493j193j265j893k548k526j802r59m10j04
$$ 521459 518689 515679 513118 511064 509298 507805 506612 505347 503454 500906 498380 496578 495619 495209 495105
49637D95105O7K1k06k36K39R72J353J096N78L99O90J019R31N13L31P85J625K194
$$ 495105 495172 495193 494987 494751 494990 495962 497315 498411 498989 499388 500078 501097 502028 502541 502872 503657 505282 507476
49619E07476K233K234K782L638L892L147K191K062K817L618L983M310N062O039
$$ 507476 509709 511943 514725 518363 522255 525402 527593 529655 532472 536090 540073 544383 549445 555484
49605E55484O763P215P742Q422Q979R326R779J0616J1550J1964J1641J1132J1236
$$ 555484 562247 569462 577204 585626 594605 603931 613710 624326 635876 647840 659481 670613 681849
49592F81849J2129J3259J4082J4691J5470J6504J7655J9034K0844K2834K4476
$$ 681849 693978 707237 721319 736010 751480 767984 785639 804673 825517 848351 872827
49581H72827K5748K7231K9199L1099L2324L3083L4178L6061L8496M0976M3101
$$ 872827 898575 925806 955005 986104 1018428 1051511 1085689 1121750 1160246 1201222 1244323
$$ [...]
##END NTUPLES=NMR SPECTRUM
##END=
