
##TITLE=AC1347_GUAAH12165_7433174_i217NLlGqE
##JCAMPDX= 6.0         $$ Bruker NMR JCAMP-DX V2.0
##DATA TYPE= NMR SPECTRUM
##DATA CLASS= NTUPLES
##ORIGIN= BRUKER
##OWNER= Administrator
$$ 1.72 TOPSPIN		Version 2.1
$$ 2013-01-29 22:07:08.843 -0500  Administrator@X
$$ Compression mode = diff/dup
##.OBSERVE FREQUENCY= 400.02188249412
##.OBSERVE NUCLEUS= ^1H
##.ACQUISITION MODE= SIMULTANEOUS (DQD)
##.ACQUISITION SCHEME= undefined
##.AVERAGES= 8
##.DIGITISER RES= 22
##SPECTROMETER/DATA SYSTEM= spect
##.PULSE SEQUENCE= zg30
##.SOLVENT NAME= COFFEE_meoh
##.SHIFT REFERENCE= INTERNAL, COFFEE_meoh, 1, 14.98509
##AUDIT TRAIL= $$ (NUMBER, WHEN, WHO, WHERE, PROCESS, VERSION, WHAT)
$$ ##TITLE= Audit trail, TOPSPIN		Version 2.1
$$ ##JCAMPDX= 5.01
$$ ##ORIGIN= Bruker BioSpin GmbH
$$ ##OWNER= Administrator
$$ $$ E:\/data/COFFEE/nmr/AC1347_GUAAH12165_7433174_i217NLlGqE/10/pdata/1/auditp.txt
$$ ##AUDIT TRAIL=  $$ (NUMBER, WHEN, WHO, WHERE, PROCESS, VERSION, WHAT)
(   1,<2013-01-29 22:07:00.796 -0500>,<Administrator>,<X>,<go>,<TOPSPIN 2.1>,
      <created by zg
	started at 2013-01-29 22:05:54.140 -0500,
	POWCHK enabled, PULCHK disabled,
       configuration hash MD5:
       86 BA 57 50 F2 9D 5C 9B 26 00 A9 28 5F 66 2E 89
       data hash MD5: 64K
       E1 69 99 51 05 27 6A FE DB F8 93 49 9F 76 50 34>)
(   2,<2013-01-29 22:07:03.874 -0500>,<Administrator>,<X>,<proc1d>,<TOPSPIN 2.1>,
      <Start of raw data processing
       efp LB = 0 FT_mod = 6 PKNL = 1 PHC0 = 0 PHC1 = 0 SI = 32K 
       data hash MD5: 32K
       E6 63 8D 35 94 15 EF 26 6B F4 A8 F6 4B F7 2E 75>)
(   3,<2013-01-29 22:07:04.374 -0500>,<Administrator>,<X>,<proc1d>,<TOPSPIN 2.1>,
      <pk PHC0 = 98.78906 PHC1 = 0 
       data hash MD5: 32K
       67 EB D6 9D 50 76 A0 76 CB 6F E4 89 89 DA 1F 5D>)
(   4,<2013-01-29 22:07:04.609 -0500>,<Administrator>,<X>,<proc1d>,<TOPSPIN 2.1>,
      <abs ABSG = 1 
       data hash MD5: 32K
       BC 11 57 B3 89 2F 76 74 D1 A1 46 49 D3 AB 17 01>)
(   5,<2013-01-29 22:07:04.749 -0500>,<Administrator>,<X>,<proc1d>,<TOPSPIN 2.1>,
      <abs ABSG = 2 
       data hash MD5: 32K
       75 1D 5F 67 C4 9D 4A F8 88 D2 EA AC B8 30 C2 02>)
(   6,<2013-01-29 22:07:04.905 -0500>,<Administrator>,<X>,<proc1d>,<TOPSPIN 2.1>,
      <abs ABSG = 3 
       data hash MD5: 32K
       43 C9 AC B1 E4 20 F0 1A 6E 98 ED 36 C6 97 C2 EF>)
(   7,<2013-01-29 22:07:05.046 -0500>,<Administrator>,<X>,<proc1d>,<TOPSPIN 2.1>,
      <abs ABSG = 4 
       data hash MD5: 32K
       C3 BF 93 F7 03 87 7B 1F 5E FD EC 3D BE 80 35 DF>)
(   8,<2013-01-29 22:07:05.218 -0500>,<Administrator>,<X>,<proc1d>,<TOPSPIN 2.1>,
      <abs ABSG = 5 
       data hash MD5: 32K
       3C 22 70 2B 06 E9 13 8B A4 A1 96 40 B3 27 D5 48>)
$$ ##END=
$$ 
$$ $$ hash MD5
$$ $$ 41 BC 56 D7 E5 8D 33 0C E1 88 F8 0A FF FB AD 4E
##$RELAX= 
##$RELAX= 
##$RELAX= 
##$RELAX= 
##$RELAX= 
##$RELAX= 
##$RELAX= 
$$ Bruker specific parameters
$$ --------------------------
##$DU= <E:\>
##$EXPNO= 10
##$NAME= <AC1347_GUAAH12165_7433174_i217NLlGqE>
$$ [...]
##$TP= (0..7)
150 150 150 150 150 150 150 150
##$TP07= 0
##$TPNAME0= <>
##$TPNAME1= <>
##$TPNAME2= <>
##$TPNAME3= <>
##$TPNAME4= <>
##$TPNAME5= <>
##$TPNAME6= <>
##$TPNAME7= <>
##$TPOAL= (0..7)
0.5 0.5 0.5 0.5 0.5 0.5 0.5 0.5
##$TPOFFS= (0..7)
0 0 0 0 0 0 0 0
##$TUNHIN= 0
##$TUNHOUT= 0
##$TUNXOUT= 0
##$USERA1= <user>
##$USERA2= <user>
##$USERA3= <user>
##$USERA4= <user>
##$USERA5= <user>
##$V9= 5
##$VALIST= <valist>
##$VCLIST= <CCCCCCCCCCCCCCC>
##$VD= 0
##$VDLIST= <DDDDDDDDDDDDDDD>
##$VPLIST= <PPPPPPPPPPPPPPP>
##$VTLIST= <TTTTTTTTTTTTTTT>
##$WBST= 1024
##$WBSW= 4
##$XGAIN= (0..3)
0 0 0 0
##$XL= 0
##$YL= 0
##$YMAX_a= 662117
##$YMIN_a= -563898
##$ZGOPTNS= <>
##$ZL1= 120
##$ZL2= 120
##$ZL3= 120
##$ZL4= 120
##$ABSF1= 14.98509
##$ABSF2= -5.573092
##$ABSG= 5
##$ABSL= 3
##$ALPHA= 0
##$AQORDER= 0
##$ASSFAC= 0
##$ASSFACI= 0
##$ASSFACX= 0
##$ASSWID= 0
##$AUNMP= <proc_prof1d_extract_pilot.lims>
##$AXLEFT= 0
##$AXNAME= <>
##$AXNUC= <1H>
##$AXRIGHT= 0
##$AXTYPE= 0
##$AXUNIT= <>
##$AZFE= 0.1
##$AZFW= 0.1
##$BCFW= 0
##$BC_mod= 0
##$BYTORDP= 0
##$COROFFS= 0
##$CY= 15
##$DATMOD= 1
##$DC= 0
##$DFILT= <>
##$DTYPP= 0
##$F1P= 0
##$F2P= 0
##$FCOR= 0.5
##$FTSIZE= 32768
##$FT_mod= 6
##$GAMMA= 0
##$GB= 0
##$INTBC= 1
##$INTSCL= 1
##$ISEN= 128
##$LB= 0
##$LEV0= 0
##$LPBIN= 0
##$MAXI= 10000
##$MC2= 0
##$MEAN= 0
##$ME_mod= 0
##$MI= 0
##$NCOEF= 0
##$NC_proc= -8
##$NLEV= 6
##$NOISF1= 0
##$NOISF2= 0
##$NSP= 0
##$NTH_PI= 0
##$NZP= 0
##$OFFSET= 14.98509
##$PC= 1
##$PHC0= 98.78906
##$PHC1= 0
##$PH_mod= 1
##$PKNL= yes
##$PPARMOD= 0
##$PPDIAG= 0
##$PPIPTYP= 0
##$PPMPNUM= 2147483647
##$PPRESOL= 1
##$PSCAL= 4
##$PSIGN= 0
##$PYNMP= <proc.py>
##$REVERSE= no
##$SF= 400.02
##$SI= 32768
##$SIGF1= 0
##$SIGF2= 0
##$SINO= 400
##$SIOLD= 32768
##$SPECTYP= <>
##$SREGLST= <1H.CDCl3>
##$SSB= 0
##$STSI= 32768
##$STSR= 0
##$SW_p= 8223.68421052631
##$SYMM= 0
##$S_DEV= 0
##$TDeff= 65536
##$TDoff= 0
##$TI= <>
##$TILT= no
##$TM1= 0
##$TM2= 0
##$TOPLEV= 0
##$USERP1= <user>
##$USERP2= <user>
##$USERP3= <user>
##$USERP4= <user>
##$USERP5= <user>
##$WDW= 1
##$XDIM= 32768
##$YMAX_p= 460092777
##$YMIN_p= -737750
##$CURPLOT= <Network HP LaserJet P1505>
##$CURPRIN= <$Network HP LaserJet P1505>
##$DFORMAT= <normdp>
##$LAYOUT= <+/1D_H.xwp>
##$LFORMAT= <normlp>
##$PFORMAT= <normpl>
##$SURQMSG= 1
$$ End of Bruker specific parameters
$$ ---------------------------------
##NTUPLES= NMR SPECTRUM
##VAR_NAME=  FREQUENCY,     SPECTRUM/REAL,   SPECTRUM/IMAG
##SYMBOL=    X,             R,               I
##VAR_TYPE=  INDEPENDENT,   DEPENDENT,       DEPENDENT
##VAR_FORM=  AFFN,          ASDF,            ASDF
##VAR_DIM=   32768,         32768,           32768
##UNITS=     HZ,            ARBITRARY UNITS, ARBITRARY UNITS
##FACTOR=    0.250966925370066, 1,           1
##FIRST=     8223.43324360094, 107362,       3186
##LAST=      0,             86015,           6025
##MIN=       0,             -737750,         0
##MAX=       8223.43324360094, 460092777,    0
$$ Real data points
##PAGE= N=1
##DATA TABLE= (X++(R..R)), XYDATA
$$ [...]
19541H0757R6180g0502j21383G6138J59511d5644q3204D5470N8894i1538c6600
$$ 80757 176937 -70502 -191885 76138 235649 -45644 -128848 45470 104364 -91538 -36600
19529a41142B25041a87205M6028e5186H9712a16611B33033b71662M1930c1146
$$ -141142 225041 -187205 -141177 -55186 89712 -116611 233033 -271662 -229732 -31146
19518h8458l2046j13155d9226k6053G598L036e7607j85282h6414k35625Q4518
$$ -88458 -120504 -233659 -49226 -75279 7598 10634 -57607 -242889 -86414 -322039 -237521
19507b37521J00668B3276c5832k05775B44023a5705B3112f6267l31116A37692
$$ -237521 -136853 23276 -35832 -241607 244023 -15705 23112 -66267 -397383 137692
19496c40392A56420b36208C5099F192a06227B52643A146a40115G6204A0086b49956
$$ -340392 156420 -236208 35099 6192 -106227 252643 1146 -140115 76204 10086 -249956
19484a37815C48565b21088b2297q1834A01427j8000j5624h6781l443A11014k3122
$$ -137815 348565 -221088 -22297 -104131 101427 83427 67803 -86781 -90224 111014 87892
19473H7892Q3589b28661Q7347f8142p169b325j54237j34500K8264E1951M0645
$$ 87892 171481 -228661 -141314 -68142 -75311 -2325 -156562 -291062 -262798 51951 92596
19462I2596D4542a07885n751j07223i382m48324a92934j13331a10882A74427a47475
$$ 92596 44542 -107885 -113636 -220859 -9382 -457706 -192934 -306265 -110882 174427 -147475
19450C4137c37846J46873k15664A31322b22438F9889a05889B8441e38036b30932
$$ 34137 -337846 -190973 -406637 131322 -222438 69889 -105889 28441 -538036 -230932
19439H8919c55296l9032a3507k68420F6375c96977E1329c258o227A64872e9314
$$ 88919 -355296 -394328 -13507 -281927 66375 -396977 51329 -3258 -9485 164872 -59314
19427A59747A7579P7194L3117d8528A95261d0601r6607e975l00997H4923J08794
$$ 159747 17579 94773 127890 -48528 195261 -40601 -137208 -5975 -306972 84923 193717
19416A93717a43665j68962J16229i1402H2546l5384c40100B72987a6049k56983
$$ 193717 -143665 -312627 -196398 -91402 82546 47162 -340100 272987 -16049 -273032
19406b73032c8966D5668M1746A0667h5449l04448g4824A38450b83944J05027e1230
$$ -273032 -38966 45668 87414 10667 -85449 -389897 -74824 138450 -283944 -178917 -51230
19394E6853a22488C7371a99125H4661A7095i7850A32838F5304B4935a82528J5824
$$ 56853 -122488 37371 -199125 84661 17095 -97850 132838 65304 24935 -182528 -166704
19383a66704O1890k0627L499n4406O0627c3810h953k18915A72921a51383A36081
$$ -166704 -104814 -125441 -121942 -176348 -115721 -33810 -8953 -227868 172921 -151383 136081
19371a89333F0157K00871c7648C00803A17659c9159n7411k58288N1235j00202
$$ -189333 60157 261028 -37648 300803 117659 -39159 -96570 -354858 -303623 -403825
19361d03825J94164D1590J07762J29796j32403e4195H6519b05042F0915a07116
$$ -403825 -209661 41590 149352 279148 146745 -54195 86519 -205042 60915 -107116
19350G3768a5002l28780P5240A05618a64099A26289c16288O419F2354a46328F5771
$$ 73768 -15002 -343782 -268542 105618 -164099 126289 -316288 -309869 62354 -146328 65771
19338d9076p8060p0007h1237j65135N6948e7541E4115a26608F314L50527j30650
$$ -49076 -127136 -197143 -81237 -246372 -189424 -57541 54115 -126608 6314 356841 226191
19327B26191g5582k3577n1094L8312D7407c07384E3565K16292a26843j32285F1746
$$ 226191 -75582 -99159 -150253 -111941 47407 -307384 53565 269857 -126843 -259128 61746
19315b87890P1622d8023B67074K14550A500a39729A75951a26485q9654k8936g1674
$$ -287890 -216268 -48023 267074 481624 1500 -139729 175951 -126485 -216139 -245075 -71674
19303c45187a00305b7300l63998a48833d8430E4045c35743A47700b0183p948k02718
$$ -345187 -100305 -27300 -391298 -148833 -48430 54045 -335743 147700 -20183 -28131 -230849
19292b30849a1828F5426b79242A03675l5440b07777A4385b5711D76157B16524
$$ -230849 -11828 65426 -279242 103675 68235 -207777 14385 -25711 476157 216524
19281f3680n3472r5204P3638o9197o3127g6693A1552M43969a99458I5183J05490
$$ -63680 -117152 -212356 -138718 -207915 -271042 -76693 11552 455521 -199458 95183 200673
19270B00673d4405q8472K8749N0024A9779i6058A83974d48634J12968P3296A47968
$$ 200673 -44405 -132877 -104128 -54104 19779 -96058 183974 -448634 -335666 -262370 147968
19258a56213D5707R2672i05A16246k0048a64710k1260g6643q2647B16728d5244
$$ -156213 45707 138379 -905 116246 96198 -164710 -185970 -76643 -159290 216728 -45244
19246a64498k9830A27704a61220b1885k28664A37861o5661i9840r9746B77067
$$ -164498 -194328 127704 -161220 -21885 -250549 137861 72200 -99840 -199586 277067
19235d19015A36130g3050A57077p3350M6888J57512h2162j04238J1899N2762F1091
$$ -419015 136130 -73050 157077 83727 130615 288127 -82162 -186400 -174501 -121739 61091
19223b06508H1256q490a08235k13953a30303M2034n6721C46897a4698C43788c49056
$$ -206508 81256 72766 -108235 -322188 -130303 -88269 -144990 346897 -14698 343788 -349056
19211a38834M4297B3474i0013C9329J60867a06818C13099b08319K2888N0466B24140
$$ -138834 -94537 23474 -90013 39329 200196 -106818 313099 -208319 -185431 -134965 224140
19199a98477i4013B34322h4301I8504Q1026l9970b45903b0930k99825A02374b8883
$$ -198477 -94013 234322 -84301 98504 179530 139560 -245903 -20930 -320755 102374 -28883
19187c0845F3570i8623A29720a10484A38655m2251e8890l7167D9822b48909B7115
$$ -30845 63570 -98623 129720 -110484 138655 96404 -58890 -96057 49822 -248909 27115
19175a71167A27303B4989e6085n5687n7480b670A99247a79431c2029J2029A26811
$$ -171167 127303 24989 -56085 -111772 -169252 -2670 199247 -179431 -32029 -20000 126811
19163B42871a93208H7148f4405a1472F1271a36313E4028a20425A69939b06202
$$ 242871 -193208 87148 -64405 -11472 61271 -136313 54028 -120425 169939 -206202
19152a34361A83353d09237J22565B17509o9841c5531I45e1597A94954a71974a419
$$ -134361 183353 -409237 -286672 217509 147668 -35531 945 -51597 194954 -171974 -1419
19140b54466J01859B92508b45451c0911q1426l5406j42297a06651L8115a8490
$$ -254466 -152607 292508 -245451 -30911 -112337 -147743 -290040 -106651 -68536 -18490
19129A65807b58086J15923p6596j8856N0318k03235a25029p640F0421c72130c0454
$$ 165807 -258086 -142163 -218759 -237615 -187297 -390532 -125029 -132669 60421 -372130 -30454
19117D3431J32378b73629B60206j14817a60424B2477J0459b04528e5802j4570
$$ 43431 175809 -273629 260206 145389 -160424 22477 32936 -204528 -55802 -70372
19107g0372A26938M9288a36274k94620A33021J16774d4885H2442a01400M6102
$$ -70372 126938 176226 -136274 -430894 133021 249795 -44885 82442 -101400 -55298
19097e5298D2199d6901k30217R600Q6078O1813F9709a43048k38141C9469b07705
$$ -55298 42199 -46901 -277118 -267518 -181440 -119627 69709 -143048 -381189 39469 -207705
19085g869k87893A6711a29389e0747C63079i9161J4968j22851k8871E3064a0463
$$ -7869 -295762 16711 -129389 -50747 363079 -99161 -84193 -207044 -235915 53064 -10463
19073g8234c3501k33464I6009B1727N5773c30437B0606c4372l1381m34181i7281
$$ -78234 -33501 -266965 96009 21727 77500 -330437 20606 -34372 -65753 -499934 -97281
19061G8040h9901j722A80623J05810b10210A94768b34820Q8722H4847b3811j80380
$$ 78040 -89901 -91623 180623 286433 -210210 194768 -234820 -146098 84847 -23811 -204191
19050b04191N5033m7e166C814J52401B8084N4109B9707J50584b83500C7968J41136
$$ -204191 -149158 -149205 -5166 3814 156215 28084 82193 29707 180291 -283500 37968 179104
19038A79104m4260b4286r5503A73677d8821k33090A40496A5233a73094k9703A73947
$$ 179104 134844 -24286 -119789 173677 -48821 -281911 140496 15233 -173094 -202797 173947
19026I9059j9554J39664l7710J22277F2391K64841c2816o9748k10268A12160c61852
$$ 99059 79505 219169 181459 303736 62391 327232 -32816 -102564 -312832 112160 -361852
19014e2831q7293j57200a39320f5042j06730B08863a25886O2694A62025C1126
$$ -52831 -140124 -297324 -139320 -65042 -171772 208863 -125886 -63192 162025 31126
19003b61248C1105K5360a13739j04843j06959a02835n55782B86798A17813a19703
$$ -261248 31105 56465 -113739 -218582 -325541 -102835 -658617 286798 117813 -119703
18992A29696a72620D2425b48958A60957f6543N000A06988a48862b4767D7405R6206
$$ 129696 -172620 42425 -248958 160957 -66543 -61543 106988 -148862 -24767 47405 143611
18981A43611f9915k90048G6860b71982G5551a84321D3978a78883I6119a16813
$$ 143611 -69915 -359963 76860 -271982 75551 -184321 43978 -178883 96119 -116813
18970A60394c7752D8884a58326M879d6460j81052j25596J71840o1615c3875o142
$$ 160394 -37752 48884 -158326 -153447 -46460 -227512 -353108 -181268 -242883 -33875 -40017
18959d0017j50061g0720K4826j65326J00607K213A39574K08080a03398k51406
$$ -40017 -190078 -70720 -45894 -211220 -110613 -108400 139574 347654 -103398 -354804
18949c54804R6444K0467C4019a41225d5402e452I8904b90062B68233A15880b21499
$$ -354804 -258360 -237893 34019 -141225 -45402 -5452 98904 -290062 268233 115880 -221499
18937A85759a12344o0699I6628a10311G2711N3581c2722j38799D2185b61482C6578
$$ 185759 -112344 -173043 96628 -110311 72711 126292 -32722 -171521 42185 -261482 36578
18925A01063j8571Q43f9131B57618A23558h8247A56373h5660G0787b45271H6435
$$ 101063 82492 83335 -69131 257618 123558 -88247 156373 -85660 70787 -245271 86435
18913c56680C30942a63341n0941J06728I7008a8218C600a35951f0538b0747j64729
$$ -356680 330942 -163341 -214282 -107554 97008 -18218 3600 -135951 -60538 -20747 -185476
18902a85476M1057g1709A81115n7299d70993a00788B98578a25262a3069I294N2350
$$ -185476 -144419 -71709 181115 123816 -470993 -100788 298578 -125262 -13069 9294 61644
18891F1644Q7624B5839L49484A09579h3768j38661K4451O253f9506A48367O1399
$$ 61644 149268 25839 375323 109579 -83768 -222429 -197978 -191725 -69506 148367 209766
18880B09766A03351d6909k06715K8269O8049f3989E4159c5913l47390a36240B78669
$$ 209766 103351 -46909 -253624 -225355 -157306 -63989 54159 -35913 -383303 -136240 278669
18868a82943L7472c4858A104J03910P3516C803a49007j75416f2827A51625D4776
$$ -182943 -145471 -34858 1104 105014 178530 3803 -149007 -324423 -62827 151625 44776
18856i758m681k14808A45607e2202B71464J49603a87204B8098K71158a40822M8004
$$ -9758 -14439 -229247 145607 -52202 271464 421067 -187204 28098 299256 -140822 -92818
18845i2818A7059c56176E8571k8324J0682J08972h5253j4625C23282a31331F8293
$$ -92818 17059 -356176 58571 30247 40929 149901 -85253 -99878 323282 -131331 68293
18833a22768C5264O0885c87294B37859A7361a68392E6385a21941M0329j2427B6316
$$ -122768 35264 96149 -387294 237859 17361 -168392 56385 -121941 -81612 -94039 26316
18821a00306D1086M1943J52203k3158b17470i5067J699L6106A93831H8116a26632
$$ -100306 41086 83029 235232 212074 -217470 -95067 -93368 -57262 193831 88116 -126632
18809F4859d8016i086o7613G019O5839j0373J49630m7234J9595p8037K0931E8187
$$ 64859 -48016 -9086 -76699 7019 72858 62485 212115 164881 184476 106439 127370 58187
18796a68394P7490D51788G3178a41873B76526c61551A64147g3174o06068a51925
$$ -168394 -90904 451788 73178 -141873 276526 -361551 164147 -73174 -679242 -151925
18785i7406L3918A96127F4447b84203d9944n9472l68614b751k01945B4062a20933
$$ -97406 -63488 196127 64447 -284203 -49944 -109416 -478030 -2751 -204696 24062 -120933
18773a75416p9385B9206a88338L3108a762k34167E2377L5653b59025e0461C93414
$$ -175416 -254801 29206 -188338 -155230 -1762 -235929 52377 88030 -259025 -50461 393414
18761B29760E438d6796A39160a64014B1381L94395j60789A6442J2334c6053m35960
$$ 229760 5438 -46796 139160 -164014 21381 415776 254987 16442 28776 -36053 -472013
18750d72013C5529O0853R8987B3817J03173i5140C0564b19795J08544e1322j28515
$$ -472013 35529 96382 195369 23817 126990 -95140 30564 -219795 -111251 -51322 -179837
18739a79837j93491H9109J7680a75217k96798K06714B53271j07572b06928A38043
$$ -179837 -373328 89109 106789 -175217 -472015 -265301 253271 145699 -206928 138043
18728c87682C2366J66716d01967J30376A14755a56737c5322l32414a09799C50731
$$ -387682 32366 199082 -401967 -271591 114755 -156737 -35322 -367736 -109799 350731
18717a43661I1016L4164M8710c15102c1792A3895K13958N6758b72429F7331b11646
$$ -143661 91016 125180 173890 -315102 -31792 13895 227853 284611 -272429 67331 -211646
18705c61944a17738M8646r0861L9207E631b82163N5474i3821D7458e297j71559
$$ -361944 -117738 -69092 -159953 -120746 5631 -282163 -226689 -93821 47458 -5297 -176856
18694a76856J3506A08732k7022J07285n4872a82035D5358a77630o8098a1892q1298
$$ -176856 -163350 108732 81710 188995 134123 -182035 45358 -177630 -245728 -11892 -93190
18683i3190L8151l5250j00813L7822i796q1737D2836i7772B85788e289B42427
$$ -93190 -55039 -90289 -191102 -153280 -9796 -91533 42836 -97772 285788 -5289 242427
18671h0159l27820p4824A22791b386j65255p43d1374j19450D4761g5710A33036
$$ -80159 -407979 -482803 122791 -2386 -167641 -168384 -41374 -160824 44761 -75710 133036
18659A8064d30400C38401h5780H491M80689a77444N0449C86233a0499o0467A44321
$$ 18064 -430400 338401 -85780 8491 489180 -177444 -126995 386233 -10499 -70966 144321
18647e4287b0784k879e90j19671A3480K18145I0779e7990b7877j37448o2643C12824
$$ -54287 -20784 -23663 -590 -120261 13480 231625 90779 -57990 -27877 -165325 -227968 312824
18634b31856j0039j35270J40939g9947K1099A10899a48427a7948j60299r1170
$$ -231856 -241895 -377165 -236226 -79947 -58848 110899 -148427 -17948 -178247 -269417
18624b69417h9400A33440f1790D517g7184E3771J49855a00284C4338L2238M8136
$$ -269417 -89400 133440 -61790 4517 -77184 53771 203626 -100284 34338 66576 114712
18613A14712a1208k2011A80984H1372a75465k5080d986E4587a62043F4351i1853
$$ 114712 -11208 -33219 180984 81372 -175465 -200545 -4986 54587 -162043 64351 -91853
18601a771j53499C77246a11543M9204m2878B1013a68191c341j28293M2806k0602
$$ -1771 -155270 377246 -111543 -62339 -105217 21013 -168191 -3341 -131634 -88828 -109430
18590a09430p7636P4854H7396e9633B54897l5499e1257D6548a16093A0046J9492
$$ -109430 -187066 -112212 87396 -59633 254897 219398 -51257 46548 -116093 10046 29538
18579B9538a69761E7107a07622j03353F578a34526B33032E8548f8367r7711h225
$$ 29538 -169761 57107 -107622 -210975 6578 -134526 233032 58548 -68367 -166078 -8225
18567a45422D565b03990j43821A23387b03106D7788a74109M1148K1571N1118l1726
$$ -145422 4565 -203990 -347811 123387 -203106 47788 -174109 -132961 -111390 -60272 -91998
18556i1998A1682M7454c02368B90581i312A27622g0624m7963K7468E4790J94039
$$ -91998 11682 59136 -302368 290581 -9312 127622 -70624 -118587 -91119 54790 248829
18545B48829I463O259M1798c0450j37260l9566j35313J47504O9590I9064b90042
$$ 248829 9463 15722 57520 -30450 -167710 -207276 -342589 -195085 -125495 99064 -290042
18533B7081P6393k7713i7232F6571P856p828J18857f0255j12419I2211e8915A93956
$$ 27081 103474 75761 -97232 66571 74427 66599 185456 -60255 -172674 92211 -58915 193956
18520B03418i9037k96561A62036J23399e2183r8465F7483g1795k24062j25203
$$ 203418 -99037 -395598 162036 285435 -52183 -150648 67483 -71795 -295857 -421060
18510d21060K04129N569g7499A80883f7708m4103k1647B08411a02516k72415B8829
$$ -421060 -216931 -211362 -77499 180883 -67708 -111811 -133458 208411 -102516 -374931 28829
18498B98361A24120J84044b48206B02084I2518k0245a4495A90963a64331G1031
$$ 298361 124120 308164 -248206 202084 92518 72273 -14495 190963 -164331 71031
18487c30268a28741a8729C87554B1757e4224G8290J20274i395A9002d0667r0896
$$ -330268 -128741 -18729 387554 21757 -54224 78290 198564 -9395 19002 -40667 -131563
18476a31563N8228L0019n0646A2358M2327c1807r6298A16738b61005B21981G0243
$$ -131563 -73335 -43316 -93962 12358 54685 -31807 -128105 116738 -261005 221981 70243
18464A60946b58984J21369E2450K72537a66758e0684J9130D9467K8496g4051A17706
$$ 160946 -258984 -137615 52450 324987 -166758 -50684 -31554 49467 77963 -74051 117706
18452D07759A70640a77969B8945K51740A18521J18813c38971B3992d45613C241
$$ 407759 170640 -177969 28945 280685 118521 237334 -338971 23992 -445613 3241
18441h8709B45235a10188k43187G5107E189e7395A76345e5024J6163a7314F7494
$$ -88709 245235 -110188 -353375 75107 5189 -57395 176345 -55024 -38861 -17314 67494
18429a71865I7721K20171a00211B1514b21751H6918C5552J82899E4620a26060
$$ -171865 97721 317892 -100211 21514 -221751 86918 35552 218451 54620 -126060
18418C8315r210J75806p7843k5430b22226D1770J69125Q8411a93504i0890n208
$$ 38315 29105 204911 127068 101638 -222226 41770 210895 299306 -193504 -90890 -96098
18407i6098A4763i7146B25340d76345A93061L1891E1258d1318A372i7500H2571
$$ -96098 14763 -97146 225340 -476345 193061 224952 51258 -41318 1372 -97500 82571
18395b99641e6265j85045J18956B06440L42383B46902a98851A1273b22920O9597
$$ -299641 -56265 -241310 -122354 206440 548823 246902 -198851 11273 -222920 -153323
18385a53323f4238A21197b10440n1906F4496f0089k96801A15404e4995p2603q631
$$ -153323 -64238 121197 -210440 -262346 64496 -60089 -356890 115404 -54995 -127598 -136229
18374a36229p6187A00697g1826j82078k10185C71055A0998b86946I2403i7506
$$ -136229 -212416 100697 -71826 -253904 -464089 371055 10998 -286946 92403 -97506
18363a36447D0796a69534I464c4658m6888A76589a00906C6740J03050A2591g2130
$$ -136447 40796 -169534 9464 -34658 -81546 176589 -100906 36740 139790 12591 -72130
18351C7996K97274b81889J04318B41534i5603p9668B12310c35286A73312K7781
$$ 37996 335270 -281889 -177571 241534 -95603 -175271 212310 -335286 173312 201093
18341B01093d408k18496b5259A30612N3908a08994p6078P3201B09961b3581g408
$$ 201093 -4408 -222904 -25259 130612 184520 -108994 -185072 -111871 209961 -23581 -7408
18329a61409B8023c7602A03300J86343I3477a13557A89819a81913f8642j62948
$$ -161409 28023 -37602 103300 289643 93477 -113557 189819 -181913 -68642 -231590
18319b31590P3154K6317l1114O5073n7329L7154j92003R1348B04929D8013j8300
$$ -231590 -158436 -132119 -163233 -98160 -155489 -118335 -310338 -218990 204929 48013 29713
18308B9713R797h8818j33723M7265f2125c0354A25486Q3788n7372K259F4999a62265
$$ 29713 39510 -88818 -222541 -175276 -62125 -30354 125486 209274 151902 154161 64999 -162265
18295d1685B79614c5589j77198e6827k6675A56631A1094a08502E1876K6029g4667
$$ -41685 279614 -35589 -212787 -56827 -83502 156631 11094 -108502 51876 77905 -74667
18283f566j90732h038k72538f1119m3735F7819a51321A66554b55175A39849Q8715
$$ -6566 -197298 -8038 -280576 -61119 -104854 67819 -151321 166554 -255175 139849 228564
18272B28564a1533n32959H5160g8096m0452j949e1958k46301R86a17680A87519
$$ 228564 -11533 -544492 85160 -78096 -118548 -120497 -51958 -298259 -297273 -117680 187519
18260c30344f8138k66240c3825l61111G9960b4500k28340c650j17116A35373a06267
$$ -330344 -68138 -334378 -33825 -394936 79960 -24500 -252840 -3650 -120766 135373 -106267
18248a53247d2732A52879n4116O8696a13872J0874B2014b81829A53784a4094A1823
$$ -153247 -42732 152879 98763 167459 -113872 -102998 22014 -281829 153784 -14094 11823
18236h4404A75677c41112B18512b58699R8791j0214g985k18697P5372g274I2784
$$ -84404 175677 -341112 218512 -258699 -159908 -170122 -7985 -226682 -151310 -7274 92784
18224c96357C64016a28895C56514a52305A59657n9086P3120c66732P9951N239
$$ -396357 364016 -128895 356514 -152305 159657 100571 173691 -366732 -286781 -281542
18214b81542I3743a97403C27943c3187j76329b8834j68934H4864J12182C7188
$$ -281542 93743 -197403 327943 -33187 -209516 -28834 -197768 84864 197046 37188
18203b98333A65916a01532b0831j25829B06798N1531i9030b4729k85146g0054
$$ -298333 165916 -101532 -20831 -146660 206798 258329 -99030 -24729 -309875 -70054
18192c1594m5392A72411d4311n286C437b61861R0747e3767I1474c66453e2609
$$ -31594 -76986 172411 -44311 -49597 3437 -261861 -171114 -53767 91474 -366453 -52609
18180c9897j31205g0992k02908B04229a61864J5952f1744b2078D4424a24495J6418
$$ -39897 -171102 -70992 -273900 204229 -161864 -145912 -61744 -22078 44424 -124495 -108077
18169a08077L7809B75789P7975f4936J5364l10133B09742h4904A01335a02728
$$ -108077 -70268 275789 353764 -64936 -49572 -359705 209742 -84904 101335 -102728
18158A15003a63181B03375c68303A02634J8437b60053D64288F34a37579j37210
$$ 115003 -163181 203375 -368303 102634 121071 -260053 464288 634 -137579 -274789
18148b74789R7363H9632K7756C667i2651k4487c2167j26634d8086j02537k7656
$$ -274789 -177426 89632 117388 3667 -92651 -117138 -32167 -158801 -48086 -150623 -178279
18137a78279A25180b07209A3124J12987l337a03156D4655J93856B730g4427m2909
$$ -178279 125180 -207209 13124 126111 122774 -103156 44655 238511 2730 -74427 -117336
18126a17336B09002B899P5080d9964j3196j8713O162G7753a41301B0025J52059
$$ -117336 209002 2899 77979 -49964 -63160 -81873 -75711 77753 -141301 20025 172084
18115A72084J0411B165a63462A68323a18644I6468J50722E2256c8712H8994b01007
$$ 172084 182495 2165 -163462 168323 -118644 96468 247190 52256 -38712 88994 -201007
18103e806C5791b96283J45506C1021g4733l41322a70004E6606i6901J3187A91006
$$ -5806 35791 -296283 -150777 31021 -74733 -416055 -170004 56606 -96901 -83714 191006
18091A7118d6537o8194C28862b55816d4114L085n7972B73601j15401m9081N6961
$$ 17118 -46537 -114731 328862 -255816 -44114 -41029 -99001 273601 158200 109119 166080
18080A66080d66550i0751A0752a30492j60995B1192p693N6478P5012a35410A3947
$$ 166080 -466550 -90751 10752 -130492 -291487 21192 13499 69977 144989 -135410 13947
18068H858f7091o5325e8716B7536e2491B28852G3658k8494a48973G3600k7866
$$ 8858 -67091 -132416 -58716 27536 -52491 228852 73658 45164 -148973 73600 45734
18057D5734a96716A12282a21372B6074a10667a7880A17989d5822j81011g3940
$$ 45734 -196716 112282 -121372 26074 -110667 -17880 117989 -45822 -226833 -73940
18046A67096a47582e9838B372N0765c7548k32557c9824q3876j5374D5373b00859
$$ 167096 -147582 -59838 2372 53137 -37548 -270105 -39824 -123700 -139074 45373 -200859
18034G6472K44204E8379a27473C4182g4645C04020F0638L1220a66140Q2294M780
$$ 76472 320676 58379 -127473 34182 -74645 304020 60638 91858 -166140 -83846 -79066
18023g9066A03579J9667a01966B63235d68066g3095A25836O155a82523C63616
$$ -79066 103579 123246 -101966 263235 -468066 -73095 125836 131991 -182523 363616
18012a4421G8956J93840b95700J13068C9190N7916l4751a43703j53312E7445K675
$$ -14421 78956 272796 -295700 -182632 39190 97106 62355 -143703 -297015 57445 60120
18001F0120d81945f4197j33967B661e0303F1758M3397f6967n7717k6979j61126
$$ 60120 -481945 -64197 -198164 2661 -50303 61758 105155 -66967 -124684 -151663 -312789
17990c12789B13204b99345C22953b82711e9873C544a28204o71L0630A85641o3621
$$ -312789 213204 -299345 322953 -282711 -59873 3544 -128204 -128875 -98245 185641 122020
17979A22020L5595a94762c8409C919b0372j2020E8389J58003e2009m3711R074
$$ 122020 157615 -194762 -38409 3919 -20372 -32392 58389 216392 -52009 -95720 -86646
17968h6646A20710E6012g3486j99287R6818d5882n367j61734B53940p1743b78641
$$ -86646 120710 56012 -73486 -272773 -175955 -45882 -51249 -212983 253940 182197 -278641
17956B5461M3049a35794d8259H1211c33349a31713C2144b73717j78282a40170
$$ 25461 68510 -135794 -48259 81211 -333349 -131713 32144 -273717 -451999 -140170
17945e2040C09276b00619C7845f978C8265R3764K20311d8199e468A0483a1975
$$ -52040 309276 -200619 37845 -6978 38265 132029 352340 -48199 -5468 10483 -11975
17933c57889b7411l7826A4553b11236A31625J5027E8641j5803d10256H752J22406
$$ -357889 -27411 -65237 14553 -211236 131625 146652 58641 42838 -410256 8752 131158
17922A31158o3960J1054k8851b63095a7865j13430D5174P0072i8241k9079M9766
$$ 131158 67198 78252 49401 -263095 -17865 -131295 45174 115246 -98241 -127320 -77554
17911g7554j31925i1196K7043l4297o3016b0106k2647j92698c3730D6603O8736
$$ -77554 -209479 -91196 -64153 -98450 -161466 -20106 -42753 -235451 -33730 46603 115339
17900A15339f4986A23528m2978a63261g6768j03834l543K9063B5759R4679P7297
$$ 115339 -64986 123528 80550 -163261 -76768 -180602 -184145 -155082 25759 120438 197735
17889A97735B6236b10771M3327A8647i487A59548a35926N8959A65242p5246a61845
$$ 197735 26236 -210771 -167444 18647 -9487 159548 -135926 -76967 165242 89996 -161845
17877C88043p151a08235L7048C4074P9420K64i5373D8061a13319g307A77978k3545
$$ 388043 380892 -108235 -71187 34074 113494 113758 -95373 48061 -113319 -7307 177978 154433
17865A54433b34052B86845b32648b5342F1708a88505J5108b550A220Q6623e8855
$$ 154433 -234052 286845 -232648 -25342 61708 -188505 -173397 -2550 1220 87843 -58855
17853A2827a9578N318r7640A66641p163K2291m3313f8970k2443D8390m758L9365
$$ 12827 -19578 -14260 -111900 166641 159478 181769 138456 -68970 -91413 48390 43632 82997
17841H2997N4458N6994C1073R7195M134N2627o9862Q1201c77130K2284B13442
$$ 82997 137455 194449 31073 128268 132402 185029 115167 196368 -377130 -354846 213442
17829C58159A45060l6156f0250j52315F6680L00328g3251k6454M2280I3453R461
$$ 358159 145060 108904 -60250 -212565 66680 367008 -73251 -99705 -57425 93453 102914
17818A02914K25233a92593c0645H3414b47488g1005A08600a47371j20129A93411
$$ 102914 328147 -192593 -30645 83414 -247488 -71005 108600 -147371 -267500 193411
17807B13673c85482C68502A25836b35812A55108D8478c07937e1332A77050B7457
$$ 213673 -385482 368502 125836 -235812 155108 48478 -307937 -51332 177050 27457
17796A80082a69516N8540I5941C0178J55992E1423d6770C4851i4629I4531a29294
$$ 180082 -169516 -110976 95941 30178 186170 51423 -46770 34851 -94629 94531 -129294
17784a48753G976Q7929j054B0712P2879J8777h4195K0389j222j62775a03355D7906
$$ -148753 7976 95905 94851 20712 93591 112368 -84195 -63806 -65028 -227803 -103355 47906
17771I888K25062j17297O6066a05446n0693B8049A0397K20205c42751B91120a83462
$$ 9888 234950 117653 183719 -105446 -156139 28049 10397 230602 -342751 291120 -183462
17759d8277j51217q0855J12036B06273F9185e2470o1937K8892F5388i4780A23221
$$ -48277 -199494 -280349 -168313 206273 69185 -52470 -114407 -85515 65388 -94780 123221
17747e1707E1240B3271i5820B85794A41339L0657b50790k6089G4122d1844B25721
$$ -51707 51240 23271 -95820 285794 141339 171996 -250790 -276879 74122 -41844 225721
17735i1618m2985i786k30106f1045J8147D8979d06989b2444j14562B20586E6425
$$ -91618 -134603 -9786 -239892 -61045 -42898 48979 -406989 -22444 -137006 220586 56425
17723F540O9113M115b74679a32854f3434C99122G7809j2680k6678L8691r834a98415
$$ 6540 75653 79768 -274679 -132854 -63434 399122 77809 65129 38451 77142 67308 -198415
17710B71775A25531j3164J44699b32362O4705B05085I3915N5985a91416Q1642
$$ 271775 125531 112367 257066 -232362 -167657 205085 93915 149900 -191416 -109774
17700a09774I5469K6457a15833I5325J65367p4536f364I3944h070p524l41095
$$ -109774 95469 121926 -115833 95325 260692 186156 -6364 93944 -8070 -15594 -356689
17689c56689A32718b3156D9678a39462C3539a49193f310j29526F9169K63545e55644
$$ -356689 132718 -23156 49678 -139462 33539 -149193 -6310 -135836 69169 332714 -555644
17677a04371B70599F2727K0756a53104A29808n3487J17352K39153a2649k8394
$$ -104371 270599 62727 83483 -153104 129808 76321 193673 432826 -12649 -41043
17667d1043j14346C40382d6986F0674B4772N5453e6294k64544i3541B81278a01732
$$ -41043 -155389 340382 -46986 60674 24772 80225 -56294 -320838 -93541 281278 -101732
17655H9612L8665a86614A72675A9916J06247a96015g6773G6106J71529c6512o5265
$$ 89612 128277 -186614 172675 19916 126163 -196015 -76773 76106 247635 -36512 -101777
17644a01777j54815e1320o8332A29397J34469K8668b36222H3633L22630a44916
$$ -101777 -256592 -51320 -119652 129397 263866 292534 -236222 83633 406263 -144916
17633E48728c75949A70882i4662L0823C58005b69942P9825b5988j91791A56365
$$ 548728 -375949 170882 -94662 -63839 358005 -269942 -190117 -25988 -217779 156365
17622c8345N196A5333K1134Q4110L63079F9872b59959J5146A92431E2737j8887
$$ -38345 -33149 15333 36467 120577 483656 69872 -259959 -244813 192431 52737 33850
17611C3850a13331B48659c6628C60258H996J65984F7653L5249b9466A28752L6104
$$ 33850 -113331 248659 -36628 360258 8996 174980 67653 102902 -29466 128752 164856
17600A64856a22422C24472C9653d77395F6276j3912K95587H2469J63385R153l7973
$$ 164856 -122422 324472 39653 -477395 66276 52364 347951 82469 245854 255007 217034
17589B17034a14242i951K74j55299N5229k04995A91256B3661K96841h705j94703
$$ 217034 -114242 -9951 -9677 -164976 -109747 -314742 191256 23661 320502 -8705 -203408
17578b03408a0760A05816J77648j02852J7096m8754b64620D2394P51M4259a8287
$$ -203408 -10760 105816 283464 180612 197708 148954 -264620 42394 43145 87404 -18287
17566b7918p0147k20992C05098A06462b61463e8795b2521k5783R882n3259e222
$$ -27918 -98065 -319057 305098 106462 -261463 -58795 -22521 -48304 -38422 -91681 -5222
17554A46617D031J17417b15026c0661C06334B2700K39910B9981a61790B99379
$$ 146617 4031 121448 -215026 -30661 306334 22700 262610 29981 -161790 299379
17543H6058i0191C3388K75992A2061b04436A88927R9611G7392K09446A9795K56394
$$ 86058 -90191 33388 309380 12061 -204436 188927 288538 77392 286838 19795 276189
17532B76189I4603b6017B61432b35841A69570a3824G725K52711A29159m3236b78600
$$ 276189 94603 -26017 261432 -235841 169570 -13824 7725 260436 129159 85923 -278600
17520A52285J05942k4524A1852J64210j0047a70142D1537a69477k9304B7202e6796
$$ 152285 258227 233703 11852 176062 166015 -170142 41537 -169477 -198781 27202 -56796
17508A64386q0270O3487n6476b25839A51154a48830A42833P9232a16520j20383
$$ 164386 84116 147603 91127 -225839 151154 -148830 142833 222065 -116520 -236903
17498b36903f4731K6783I3958A3118c7891F36099a0856B63805q764C3363J9963
$$ -236903 -64731 -37948 93958 13118 -37891 636099 -10856 263805 255041 33363 53326
17487E3326J11428e152D1159b6837A84283a87553C25041k2301r5684m0967M9648
$$ 53326 164754 -5152 41159 -26837 184283 -187553 325041 302740 207056 166089 215737
17476B15737r0697L2997e1559A15534b06435B91626B6787J09417K07382a2185
$$ 215737 125040 158037 -51559 115534 -206435 291626 26787 136204 343586 -12185
17465a20703B32267a03879A16959e628A43638g847A21254a10663I6805J54393
$$ -120703 232267 -103879 116959 -5628 143638 -7847 121254 -110663 96805 251198
17455B51198b4822C59065q9301J86566j88290K9224j10545K61907p7866D4210
$$ 251198 -24822 359065 269764 456330 268040 297264 186719 448626 370760 44210
17444B00705J99140I360K62799N6295j7681j0762m0633J16709o1147a58407E1790
$$ 200705 399845 9360 272159 328454 310773 300011 259378 376087 314940 -158407 51790
17432C69178o3119L0970j47037R2621A06693L14363j42918f7316D21467K6666
$$ 369178 306059 337029 189992 282613 106693 421056 278138 -67316 421467 448133
17422D48133A78505J98638j3097b0155c118A83753k4679b3392E72641C8448K70010
$$ 448133 178505 377143 364046 -20155 -3118 183753 159074 -23392 572641 38448 308458
17411C08458J44034d1690I6770k0062J29546B7250J32618m8722c0651A70053L2098
$$ 308458 452492 -41690 96770 76708 206254 27250 159868 111146 -30651 170053 202151
17400B02151h756B67484F3018K01336D8879N44885j61514A9735M01877a24749
$$ 202151 -8756 267484 63018 264354 48879 593764 432250 19735 421612 -124749
17389b5551A6529F09J90943O6135q0466K16269j30327B8386Q1071K42063j04458
$$ -25551 16529 609 191552 257687 177221 393490 263163 28386 109457 351520 247062
17378B47062A04691L4048D6290M34305C0613M95816k59916m7224o4249K0837q3445
$$ 247062 104691 138739 46290 480595 30613 526429 266513 219289 155040 175877 92432
17367I2432J34149j0238h3192R08A42433O8411J4740F3869P1856K08261j68303
$$ 92432 226581 216343 -83192 -82284 142433 210844 225584 63869 135725 343986 175683
17356A75683h2894B81761j20185K221M5545j02970j7923D3092K02475n8856n671
$$ 175683 -82894 281761 161576 163797 209342 106372 88449 43092 245567 186711 181040
17345A81040a45163B64358F9313g9872C54453A04856J79335j09610g3126C15474
$$ 181040 -145163 264358 69313 -79872 354453 104856 284191 174581 -73126 315474
17334B78472b25844D5431K95523j20282G7532J79896F7866l2545K73174a15588
$$ 278472 -225844 45431 340954 220672 77532 257428 67866 35321 308495 -115588
17323b42764B14738H1458a16507B05109f8313A42658K1619J83292A44403P4431
$$ -242764 214738 81458 -116507 205109 -68313 142658 164277 347569 144403 218834
17313B18834a0846A92754p0063a22575H0736L9451a65117B98552F9249M14784
$$ 218834 -10846 192754 122691 -122575 80736 120187 -165117 298552 69249 484033
17303D84033j89007P9158m935E6089L5299P1321N0618b08145C27219a99709C1684
$$ 484033 295026 374184 369249 56089 91388 162709 213327 -208145 327219 -199709 31684
17291A03604a1316n2013n0325A86657P8655J2503a71693h175A70627a30926A48172
$$ 103604 -11316 -63329 -113654 186657 265312 277815 -171693 -8175 170627 -130926 148172
17279B51633M03093I5739L9674k7134O9295K3490L1566M4223b4637A64245d1442
$$ 251633 654726 95739 135413 108279 177574 201064 232630 276853 -24637 164245 -41442
17267D56532D1481J78743K55634j88394E2985f2602A73929p6488K09262j49364
$$ 456532 41481 220224 475858 287464 52985 -62602 173929 97441 306703 157339
17257A57339G6992k1287N9235a2235C44940l5065m1914E3359M79547k21080j39537
$$ 157339 76992 55705 114940 -12235 344940 309875 267961 53359 532906 311826 172289
17246A72289J31171r8924m2459B0022L49198p8430q9788q1636a8089A63862K50685
$$ 172289 303460 204536 162077 20022 369220 290790 201002 119366 -18089 163862 414547
17235D14547H7393C2721K45397L2591A36919J15336F9969h2208A23232d9050C76824
$$ 414547 87393 32721 278118 310709 136919 252255 69969 -82208 123232 -49050 376824
17223F9997R5327O2972J86392j87540J00063j40425k7594n1720B158L31524f5620
$$ 69997 165324 228296 414688 227148 327211 186786 159192 107472 2158 333682 -65620
17211A37073C1188J02154J39547B8628N31199B29444K42793B18000P5550N9391
$$ 137073 31188 133342 272889 28628 559827 229444 472237 218000 293550 352941
17201C52941A44901O7962p8618L38752q0766c1884A42530j7699J74369h3250A25347
$$ 352941 144901 212863 134245 472997 392231 -31884 142530 124831 299200 -83250 125347
17189B94406j6405J43867B08984N87555l02266A30845J31823n108a63555C40903
$$ 294406 278001 421868 208984 796539 494273 130845 262668 257560 -163555 340903
17178b7622B84929o9910O8441A02110K33164e885A3886J34716a48723B52417K43993
$$ -27622 284929 215019 283460 102110 335274 -5885 13886 148602 -148723 252417 496410
17167D96410A38499K47162j56363h4302E7164K48572f919B88968J345J16094g136
$$ 496410 138499 385661 229298 -84302 57164 305736 -6919 288968 290313 406407 -7136
17155C7994b1983C32651k1234j03524O86185C54208N8981P9819B43787o8751L9646
$$ 37994 -21983 332651 311417 207893 894078 354208 413189 493008 243787 175036 214682
17144B14682J66715h0953D81248r7110A02941N5157K24162j72146J81522P820
$$ 214682 381397 -80953 481248 384138 102941 158098 382260 210114 391636 399456
17134C99456E8923J5462L86479j99324j26715M26438k71203Q7097j02693J7743
$$ 399456 58923 74385 460864 261540 134825 561263 290060 377157 274464 292207
17124B92207n7985M24133k54180O5168L51949B95864K26065B52213J66372q5461
$$ 292207 234222 658355 404175 469343 821292 295864 521929 252213 418585 333124
17114C33124j34721K96750G3483N6098J08969K41640q820Q4512k49836L66566
$$ 333124 198403 495153 73483 129581 238550 480190 471370 555882 306046 672612
17104F72612B07833L58359J77396A41366J96202K17745j60821j92991K80716j07602
$$ 672612 207833 566192 743588 141366 337568 555313 394492 201501 482217 374615
17094C74615l5758I2930K56725l2511n8381L56287l02293N1437A52195N33761
$$ 374615 338857 92930 349655 317144 258763 615050 312757 364194 152195 685956
17084F85956A43508Q3659L19834j31100M8449J33147B72781L39116A06915J17814
$$ 685956 143508 227167 547001 415901 464350 597497 272781 611897 106915 224729
17074B24729J98709J26873j33447k022J15281M8889n7926r5583K41581o3905j34889
$$ 224729 423438 550311 416864 414842 530123 579012 521086 425503 667084 603179 468290
17063D68290J09817P4808B11114O37811l19442P4041M2040j64370K3296e6921
$$ 468290 578107 652915 211114 848925 529483 603524 645564 481194 504490 -56921
17052E37329r2829p2618J60617n401M78806D26429L60471j04551Q7277k36351
$$ 537329 444500 371882 532499 527098 1005904 426429 786900 682349 769626 533275
17042E33275j47683K75267Q6929C19265N8857K53602K64466j44420l13609K08501
$$ 533275 385592 660859 747788 319265 378122 631724 896190 751770 438161 646662
17032F46662l2843k86803M87948B56924O18507m00846K56159k09359K31715l26998
$$ 646662 613819 327016 814964 256924 875431 474585 730744 521385 753100 426102
17022D26102M455L67466P6842l2265k04853j23236j23279L61730l28179n5307
$$ 426102 430557 798023 874865 842600 637747 514511 391232 752962 424783 369476
17012C69476J46097J40526K69264j11648r3843K97639l46288J62838K32711m40092
$$ 369476 515573 656099 925363 813715 719872 1017511 671223 834061 1066772 626680
17002F26680j9022L26921k8590j58421P955j04499K49676m04605L14309k18255
$$ 626680 607658 934579 905989 747568 755523 651024 900700 496095 810404 592149
16992E92149J02513K2333L97435J30213l00829k53639n5208J86479L35901j87051
$$ 592149 694662 716995 1114430 1244643 943814 690175 634967 821446 1157347 970296
16982I70296R698j11130k44623J00649M08965k53798j66708p674K70603j0121
$$ 970296 979994 868864 624241 724890 1133855 880057 713349 705675 976278 966157
16972I66157K08502k94982M9441j11050r5646J95114K03074m18173L61288m99256
$$ 966157 1174659 879677 929118 818068 722422 917536 1120610 702437 1063725 564469
16962E64469L64940Q8015k67130M61535n03693N76084j76966j58535r741q2923
$$ 564469 929409 1017424 750294 1211829 708136 1284220 1107254 948719 938978 856055
16952H56055K46512l0873p3574J10399M11269p38628J99884M58578l19305J14924
$$ 856055 1102567 1071694 998120 1108519 1519788 781160 981044 1439622 1120317 1235241
16942A235241p8274K43199m77677L2623M41256j43888J43205j17056j9051K41087
$$ 1235241 1156967 1400166 922489 955112 1396368 1252480 1395685 1278629 1259578 1500665
16932A500665k20448l68314K81484K17447q3781j58753L65902l66298J786J22874
$$ 1500665 1280217 911903 1193387 1410834 1327053 1168300 1534202 1167904 1169690 1292564
16922A292564Q6289L90826r8732j80924r0050J58612j66953R3148l751L94394
$$ 1292564 1378853 1769679 1670947 1490023 1399973 1558585 1391632 1484780 1481029 1875423
16912A875423m96531K79655J52082l34239M6352L24676j94765p5637m9533l4703
$$ 1875423 1378892 1658547 1810629 1476390 1522742 1847418 1652653 1577016 1527483 1492780
16902A492780M64549l88021J93332J99273n9216P8473k71482K44262J52155k31468
$$ 1492780 1957329 1569308 1762640 1961913 1902697 1981170 1709688 1953950 2106105 1874637
16892A874637N8699J56662K2505j38648M4671M26770m81814K06894L1650l29138
$$ 1874637 1933336 2089998 2112503 1973855 2018526 2445296 1963482 2170376 2202026 1872888
16882A872888M56128q0552K45061J10524o4140j71060n3348K75402j82548K81674
$$ 1872888 2329016 2248464 2493525 2604049 2539909 2368849 2315501 2590903 2408355 2690029
16872B690029p1082j15536J71627l820L5069K18444k51016P3771J59170j88261
$$ 2690029 2618947 2503411 2675038 2671218 2706287 2924731 2673715 2747486 2906656 2718395
16862B718395K17836n928L75087J64577m69449J69383L9719J85407n418k22452
$$ 2718395 2936231 2930303 3305390 3469967 3000518 3169901 3209620 3395027 3389609 3167157
16852C167157j03275M00461k03514J01819K33172m6669P1492J33030O227l0373
$$ 3167157 3063882 3464343 3260829 3362648 3595820 3549151 3620643 3753673 3759900 3729527
16842C729527k2098J87492q9353K22690J88221l16118K19373K07923K46844j92492
$$ 3729527 3707429 3894921 3805568 4028258 4216479 3900361 4119734 4327657 4574501 4382009
16832D382009j1646J43762k8153J05232J33722L24110Q4900n1036r0237N54839
$$ 4382009 4370363 4514125 4485972 4591204 4724926 5049036 5133936 5082900 4992663 5547502
16822E547502q2741k0876P7094Q6622l4593J01097J27687K47014R2655J54335
$$ 5547502 5464761 5443885 5520979 5607601 5573008 5674105 5801792 6048806 6141461 6295796
16812F295796J4331L25502J28111K91818k74671N03561Q0802n2887L37789L78312
$$ 6295796 6310127 6635629 6763740 7055558 6780887 7284448 7365250 7312363 7650152 8028464
16802H028464j06119K35888K16225J19932O1787K81544L49503M45007j38119N48284
$$ 8028464 7922345 8158233 8374458 8494390 8556177 8837721 9187224 9632231 9494112 10042396
16792A0042396j63425M26253J48398K88712M46295L42063l4535P12881L34381
$$ 10042396 9878971 10305224 10453622 10742334 11188629 11530692 11496157 12209038 12543419
16783A2543419P2009P86000k74250Q17264M38614M76034K10397N22011R72894
$$ 12543419 12615428 13401428 13127178 13944442 14383056 14859090 15069487 15591498 16564392
16774A6564392J8666N78762Q53366L67782N65893O98359R82874N77864P79018
$$ 16564392 16583058 17161820 18015186 18382968 18948861 19647220 20630094 21207958 21986976
16765B1986976Q37600P44208J007955Q39763J018964Q15317R66923J623762R35101
$$ 21986976 22824576 23568784 24576739 25416502 26435466 27250783 28217706 29841468 30776569
16756C0776569J581508J404478J178692J965891J885938J319873K085655J967035
$$ 30776569 32358077 33762555 34941247 36907138 38793076 40112949 42198604 44165639
16748D4165639J910327K420700K463572K600781K773252L086936K995883L562194
$$ 44165639 46075966 48496666 50960238 53561019 56334271 59421207 62417090 65979284
16740F5979284L624801L504546M102399M601931M485679N103206N488661N323137
$$ 65979284 69604085 73108631 77211030 81812961 86298640 91401846 96890507 102213644
16732A02213644N638989O153292O222418O633224O477958O963053O610368O524643
$$ 102213644 107852633 114005925 120228343 126861567 133339525 140302578 146912946 153437589
16724A53437589O779602O118998N723705N195978M176082L339338K307292J375346
$$ 153437589 160217191 166336189 172059894 177255872 181431954 184771292 187078584 188453930
16716A88453930J87793j109259k253067l108960m139366m983308n548359o317669
$$ 188453930 188641723 187532464 185279397 182170437 178031071 173047763 167499404 161181735
16708A61181735o638966o750070o792933p081119o953383o388456o519025o295073
$$ 161181735 154542769 147792699 140999766 133918647 126965264 120576808 114057783 107762710
16700A07762710o027287n673621n180311n070046m807327m523835m348562l536146
$$ 107762710 101735423 96061802 90881491 85811445 81004118 76480283 72131721 68595575
16692F8595575l821006l366410l301675k871150k846607k893769k146996k288529
$$ 68595575 64774569 61408159 58106484 55235334 52388727 49494958 47347962 45059433
16684D5059433k459406j908835j872678j843567j733027j203625j595138j311684
$$ 45059433 42600027 40691192 38818514 36974947 35241920 34038295 32443157 31131473
16676C1131473j205902j907039n76531j317597n43873j668790l77071j065137
$$ 31131473 29925571 28018532 27442001 26124404 25580531 23911741 23534670 22469533
16668B2469533p38162p87089q76998q12431l84074r93634l64994q81756l44187
$$ 22469533 21731371 20944282 20067284 19254853 18870779 17877145 17512151 16630395 16286208
16659A6286208p37051k77579o94491j44469m74099n53557l49439o51846j5794
$$ 16286208 15549157 15271578 14577087 14432618 13958519 13404962 13055523 12403677 12387883
16650A2387883m87587m53388J1748k10286l86394k16544n09886j42103m15130
$$ 12387883 11900296 11446908 11458656 11248370 10861976 10645432 10135546 9993443 9578313
16641I578313l49728j70704O0942j81527m82191j0047l45436j84290j65049k90366
$$ 9578313 9228585 9057881 9118823 8937296 8455105 8445058 8099622 7915332 7750283 7459917
16631G459917l601n28092k14678l5739o0291k17033K14573m46551j19065k00468
$$ 7459917 7456316 6928224 6713546 6677807 6617516 6400483 6615056 6168505 6049440 5848972
16621E848972l33895j85524L04407k18070J8273l45816J88229k13129k55583J46098
$$ 5848972 5515077 5329553 5633960 5415890 5434163 5088347 5276576 5063447 4807864 4953962
16611D953962p6655l58850j52609J11511k90545J56362m1631M6601J2065k99659
$$ 4953962 4877307 4518457 4365848 4477359 4186814 4343176 4301545 4348146 4360211 4060552
16601D060552n73568N40793L0835k19802m68579L08784k14078l2244L445k30008
$$ 4060552 3486984 4027777 4058612 3838810 3370231 3679015 3464937 3432693 3436138 3206130
16591C206130J75426m51687J11473K0955P5123j23773J13485j44800n3963m117
$$ 3206130 3381556 2929869 3041342 3062297 3137420 3013647 3127132 2982332 2928369 2924252
16581B924252j18200J25257m81947K01084r7517J17577j12436O2563j74434L2850
$$ 2924252 2806052 2931309 2449362 2650446 2552929 2670506 2558070 2620633 2446199 2479049
16571B479049k69274Q6755J01443l5510n4552j18823o0704K5409m26426L62839
$$ 2479049 2209775 2296530 2397973 2362463 2307911 2189088 2128384 2153793 1727367 2090206
16561B090206J41190k60033k01349K19408K9491Q2974k54729j72480L20325j26439
$$ 2090206 2231396 1971363 1770014 1989422 2018913 2101887 1847158 1674678 1995003 1868564
16551A868564J20390k66465n2502K71181p246L0014k50010j55454K82529n7200
$$ 1868564 1988954 1722489 1669987 1941168 1933922 1963936 1713926 1558472 1841001 1783801
16541A783801j93896j03836K77982j59255j58806k9825L91678k51722L51442j3815
$$ 1783801 1589905 1486069 1764051 1604796 1445990 1416165 1807843 1556121 1907563 1893748
16531A893748m40420J08990N8941l68746p4885K33986L19m5992m0710K09125o39023
$$ 1893748 1453328 1562318 1621259 1252513 1177628 1411614 1411933 1365941 1325231 1534356 895333
16520H95333L45944j86751J70465J43807k95280M75o4122K97564k19822j01595
$$ 895333 1241277 1054526 1224991 1368798 1073518 1073993 1009871 1307435 1087613 986018
16510I86018L81523j10841m6844j44511p0575l5599K12231O2113l7603l29131
$$ 986018 1367541 1256700 1209856 1065345 994770 959171 1171402 1233515 1195912 866781
16500H66781K58041k74367k5754L9779O3890M174K74701l15814n9673Q701L137
$$ 866781 1124822 850455 824701 864480 928370 932544 1207245 891431 831758 840459 843596
16489H43596q7787N51474l22916k56001l4331J15539K42947j75366J12723l2453
$$ 843596 755809 1307283 984367 728366 694035 809574 1052521 877155 989878 957425
16479I57425j19964J01117k52121o7485q1110O40679l68768K00084l65475j29146
$$ 957425 837461 938578 686457 618972 537862 1178541 809773 1009857 644382 515236
16469E15236J85066Q200P9476L4804L5354m9207j54725J09398J0377j12290k2267
$$ 515236 700302 708502 787978 822782 858136 808929 654204 763602 773979 661689 639422
16458F39422j01193M31105m27804j38264K43079k86305M28828l3979l3872j26374
$$ 639422 538229 969334 541530 403266 646345 360040 788868 754889 721017 594643
16448E94643m287j22316J97327k33237M31134j19954J56342m25914M35227D38814
$$ 594643 590356 468040 665367 432130 863264 743310 899652 473738 908965 438814
16437D34652J28749J11305J47408A83975J55307R8363K16143j39805J57175o2121
$$ 434652 563401 674706 822114 183975 339282 437645 653788 513983 671158 609037
16427F09037k87115M20921K0951l19017J61369j24772j74870K63079O8247j68387
$$ 609037 321922 742843 763794 444777 606146 481374 306504 569583 637830 469443
16417D69443J89788l5164j47021K5573j08464K25470B22259O1199J09779J66494
$$ 469443 659231 624067 477046 502619 394155 619625 222259 283458 393237 559731
16407E59731j60693J39960K7902K8270A27072K38379M7109l6546K57226B06282
$$ 559731 399038 538998 566900 595170 127072 365451 412560 376014 633240 206282
16396D28385j58743p7310L78467A81908L38017N0096A71423m7441L30157l7173
$$ 428385 269642 192332 570799 181908 519925 570021 171423 123982 454139 416966
16386D16966j07874O1081F3062R6621L13446m7056F053O30997k38673j80300K95674
$$ 416966 309092 370173 63062 159683 473129 426073 6053 637050 398377 218077 513751
16375E13751B55374K66795j40632j05866Q7866H8990K05613j0512L19571I7046
$$ 513751 255374 522169 381537 275671 363537 88990 294603 284091 603662 97046
16364D04886A99800J10834N2877J50636J7832j60953L0612F6776M54083n2018
$$ 404886 199800 310634 363511 514147 531979 371026 401638 66776 520859 468841
16354D68841E3803M52614Q1189k51809K69603c8969D31403K4586q1583p4491G4898
$$ 468841 53803 506417 587606 335797 605400 -38969 431403 455989 374406 299915 74898
16342B01811J24143P7452A44165M2555N11123C17663K00934j21370a43464D19345
$$ 201811 325954 403406 144165 186720 697843 317663 518597 397227 -143464 419345
16331D39809r3234A59409K71302g7370D88764j49607a62469B55536N2156r0933
$$ 439809 346575 159409 430711 -77370 488764 339157 -162469 255536 307692 216759
16321B16759Q1201l7267K54199q9784j35849n3390O8470r2609J3389J49493A73660
$$ 216759 297960 260693 514892 425108 289259 235869 304339 211730 225119 374612 173660
16309A41964J35339J91365p0035J56412B44110b728D6497K26348q1397i6654I714
$$ 141964 277303 468668 398633 555045 244110 -2728 46497 272845 191448 -96654 9714
16297C11873j27777a35570C30121A20595b44077A61416A2859K26514A12291b64406
$$ 311873 184096 -135570 330121 120595 -244077 161416 12859 239373 112291 -264406
16286A14781J87518m5687n525C4050J09220d5354q2993A92124n9251K49236a71445
$$ 114781 302299 256612 251087 34050 143270 -45354 -128347 192124 132873 382109 -171445
16274A45420b7124I4379K04057D1265b42937B62924K57894A33497f3787j32535
$$ 145420 -27124 94379 298436 41265 -242937 262924 520818 133497 -63787 -196322
16264a96322a5600A18571J80437A36433K20887g292D49477c900A4124M94469C8826
$$ -196322 -15600 118571 299008 136433 357320 -7292 449477 -3900 14124 508593 38826
16252a45530P1389A29729B2183h444j7068F85850e3462C23195Q6837J26911B09165
$$ -145530 -74141 129729 22183 -8444 -25512 685850 -53462 323195 410032 536943 209165
16240F1034B1244J74979c6599L775E6193J03543J25698H2170h3985B62040g2688
$$ 61034 21244 196223 -36599 -32824 56193 159736 285434 82170 -83985 262040 -72688
16228A02826J16724e2764A00503Q8693J07325a45370O0747G5781L6944J28746
$$ 102826 219550 -52764 100503 189196 296521 -145370 -84623 75781 112725 241471
16218B41471K00868O0948E8036K20530E1327R2707B3902E586L39192j53376J30959
$$ 241471 442339 503287 58036 278566 51327 144034 23902 5586 344778 191402 322361
16207C22361K1741m1029P2511C0351b9690F7408i862A14170b15937l84682A98786
$$ 322361 344102 303073 375584 30351 -29690 67408 -9862 114170 -215937 -600619 198786
16195D9530K03605j14567e3919B23035j00585a00812l03274a16746a6450j47034
$$ 49530 253135 138568 -53919 223035 122450 -100812 -404086 -116746 -16450 -163484
16185a63484A33160l9197j9418e6096A79194C578K34729a20512A40251b65827
$$ -163484 133160 93963 74545 -56096 179194 3578 238307 -120512 140251 -265827
16174B03500J34682f0099E0482Q2985m6883O6298E1725h345A67936p8610K89601
$$ 203500 338182 -60099 50482 133467 86584 152882 51725 -8345 167936 89326 378927
16163C78927a07307B27033J45603h7069A24389J26480A5034J93623b53928A01584
$$ 378927 -107307 227033 372636 -87069 124389 250869 15034 208657 -253928 101584
16152a25808j48782g5651L0291J1534A67698a49159A52519M330p2312m078c8927
$$ -125808 -274590 -75651 -45360 -33826 167698 -149159 152519 156849 84537 80459 -38927
16140a8358p3742b8981C5055a17495B37306a93612E3992d1593D1417L9061J00494
$$ -18358 -92100 -28981 35055 -117495 237306 -193612 53992 -41593 41417 80478 180972
16129A80972p3774C3673O4001L2796c8299E4293Q4950e3624D4821a84043A20752
$$ 180972 107198 33673 97674 130470 -38299 54293 139243 -53624 44821 -184043 120752
16117b44599d0230A70444b1372B10866g221A69494o3570g6435K0887A6353a29833
$$ -244599 -40230 170444 -21372 210866 -7221 169494 105924 -76435 -55548 16353 -129833
16105f4770R554A30341l726K15079j7880r5810A5577J57834H1771a92103C71875
$$ -64770 -55216 130341 126615 341694 323814 228004 15577 173411 81771 -192103 371875
16093C61143A54391J64543A55072p3885J87137i9716k03141J33693N822l5179
$$ 361143 154391 318934 155072 81187 268324 -99716 -302857 -169164 -163342 -198521
16083a98521e3344j37572B47508b89694b6667j72773A33979Q505a07025G3699
$$ -198521 -53344 -190916 247508 -289694 -26667 -199440 133979 142484 -107025 73699
16072A7554a61371A76764G7883a15251C28778D9336J37210a93260C6617g931l5200
$$ 17554 -161371 176764 77883 -115251 328778 49336 186546 -193260 36617 -7931 -43131
16061d3131B28249b60800B03212d8234p2810A00708g9408H0172e1206m9263k1827
$$ -43131 228249 -260800 203212 -48234 -121044 100708 -79408 80172 -51206 -100469 -122296
16050a22296k8567n0993K6709K7168E3054a9827k72666A44717c6290G6933M4080
$$ -122296 -150863 -201856 -175147 -147979 53054 -19827 -292493 144717 -36290 76933 121013
16039A21013a89296j19203d0240G2727N0532c30155C42413c9590B7153g083j64477
$$ 121013 -189296 -308499 -40240 72727 123259 -330155 342413 -39590 27153 -7083 -171560
16028a71560A07247f7682A0343K01856A0744b13817a2705m6480m8040j70913A34772
$$ -171560 107247 -67682 10343 212199 10744 -213817 -12705 -59185 -107225 -278138 134772
16016B49313A8871a82726A02363b5378j64368B7250a66909D4399b40516A52724
$$ 249313 18871 -182726 102363 -25378 -189746 27250 -166909 44399 -240516 152724
16005b71745C46910E3914g2924J9334A9964a68286F9070b65169I1110g2464r0483
$$ -271745 346910 53914 -72924 -53590 19964 -168286 69070 -265169 91110 -72464 -162947
15994a62947A202K58423a46576c9075H1382c8527l38461g8465E5104J60052A04686
$$ -162947 1202 259625 -146576 -39075 81382 -38527 -376988 -78465 55104 215156 104686
15982A00648N847b7642C58178j26135O9013J64962a00220b6311F5814b14945D8236
$$ 100648 106495 -27642 358178 232043 301056 466018 -100220 -26311 65814 -214945 48236
15970c28101c8030D17997b16173E5405a81336j2654M6717j65328J6672R1229R0873
$$ -328101 -38030 417997 -216173 55405 -181336 -193990 -147273 -312601 -295929 -204700 -113827
15959a13827K3686L8962o9191N5372m9751F3546a59262e4323j09160F1669e206
$$ -113827 -90141 -51179 -120370 -64998 -114749 63546 -159262 -54323 -163483 61669 -5206
15947g4610J3881D8726J83230a04645A34301o2587p135a75955h1909E2561J52898
$$ -74610 -60729 48726 231956 -104645 134301 71714 64579 -175955 -81909 52561 205459
15936B05459c86994E3098a87936g282A00620c02682F6558I84b02415j85563h4438
$$ 205459 -386994 53098 -187936 -7282 100620 -302682 66558 984 -202415 -387978 -84438
15924A78230B1297i4732B63179F6596a41607f3925A12393d1298j09766E667e6406
$$ 178230 21297 -94732 263179 66596 -141607 -63925 112393 -41298 -151064 5667 -56406
15912C00310a93534I0793d2181j61608A63422p3509Q273C310a70903A27187A0591
$$ 300310 -193534 90793 -42181 -203789 163422 89913 98186 3310 -170903 127187 10591
15900F1461a07485A6954b9882j25511M3417a8859B31972p6535a27504j33431a16725
$$ 61461 -107485 16954 -29882 -155393 -111976 -18859 231972 155437 -127504 -260935 -116725
15888d988j54565B89196b03162E3371a72301F403J35833l8348K70440a54141G5328
$$ -4988 -159553 289196 -203162 53371 -172301 6403 142236 103888 374328 -154141 75328
15876b74261g9644b7210G5922P3468a34212B19825k4039b06684j68415N6564G5801
$$ -274261 -79644 -27210 75922 149390 -134212 219825 195786 -206684 -375099 -318535 75801
15864F7694a62345L3077B34389q9144B0884c44344i4343A94979a77946j69918
$$ 67694 -162345 -129268 234389 145245 20884 -344344 -94343 194979 -177946 -347864
15854c47864a63236f6538A26727a11185c0956H3154M2161a45675L4580e0657I8124
$$ -347864 -163236 -66538 126727 -111185 -30956 83154 125315 -145675 -111095 -50657 98124
15842b07325Q0312J820G5625J26292L51352a02292A5354b6709A52796k4620b23299
$$ -207325 -127013 -125193 75625 201917 553269 -102292 15354 -26709 152796 128176 -223299
15830A09103a93319A01912J79505l7280b65241A50051l2720a27053n2385h1311
$$ 109103 -193319 101912 281417 244137 -265241 150051 117331 -127053 -179438 -81311
15819B239a9660r2377c1608f815k17029A11641b48354a3687B6837Q2131b12617
$$ 2239 -19660 -112037 -31608 -6815 -223844 111641 -248354 -13687 26837 108968 -212617
15807B32415b17299H372K73806a77756a276j19535I652J30149J98455b63331A10190
$$ 232415 -217299 8372 282178 -177756 -1276 -120811 9652 139801 338256 -263331 110190
15795E7334a47772d9972K346j808B72013a13986b5117j4715I9340c21561B05594
$$ 57334 -147772 -49972 -47626 -49434 272013 -113986 -25117 -39832 99340 -321561 205594
15783H152b5135A2956K89616b50759N4944K6536j41848G5739a53578g0090k1887
$$ 8152 -25135 12956 302572 -250759 -195815 -169279 -311127 75739 -153578 -70090 -91977
15772i1977K0391N300E4370a25219b9548l6332D8620J07591M4909c05012H3423
$$ -91977 -71586 -66286 54370 -125219 -29548 -65880 48620 156211 201120 -305012 83423
15760a16089E2517k5947b43445@d9223D3551a28542A68136b91781O5831A76619
$$ -116089 52517 26570 -243445 0 -49223 43551 -128542 168136 -291781 -225950 176619
15748I9581a95773C13997C5305K01227E7626a59426B9629N0148Q4874d7511m3085
$$ 99581 -195773 313997 35305 236532 57626 -159426 29629 79777 164651 -47511 -90596
15737i0596C1852a54000d686j7626l30840g5865A41962D5134N931b29890j73346
$$ -90596 31852 -154000 -4686 -22312 -353152 -75865 141962 45134 51065 -229890 -403236
15726d03236d3046C68917b12406j40504A08328a8740j3325l3330F8947L9895e3450
$$ -403236 -43046 368917 -212406 -352910 108328 -18740 -32065 -65395 68947 108842 -53450
15714b6243A17034J7302J29888a239E4976a14225I2328J11351c40289a00713C993
$$ -26243 117034 134336 264224 -1239 54976 -114225 92328 203679 -340289 -100713 3993
15702a54490B22162b65538O7106J6247E1573a45886G5774b9168H7269J064K48040
$$ -154490 222162 -265538 -198432 -182185 51573 -145886 75774 -29168 87269 88333 336373
15691C36373D0832j3806d08426H7807a64216j3973b2012M481j11838j80480e59
$$ 336373 40832 27026 -408426 87807 -164216 -178189 -22012 -17531 -129369 -309849 -559
15679A69173b40518M6448O4544j4644O77j16701a8190A68597A9873M13970A89148
$$ 169173 -240518 -194070 -129526 -144170 -143493 -260194 -18190 168597 19873 433843 189148
15667G7591a14805j58468g4728A6459b06382j5623R3959j25044B07613k3144a9110
$$ 77591 -114805 -273273 -74728 16459 -206382 -222005 -128046 -253090 207613 184469 -19110
15655g2089B69448E7155b2265k51687D1732h3764j88223G488c31004a24582Q192
$$ -72089 269448 57155 -22265 -273952 41732 -83764 -271987 7488 -331004 -124582 -116390
15644a16390B17675d5551A29051b65479B95953e4741Q431C53142c00754F225J65292
$$ -116390 217675 -45551 129051 -265479 295953 -54741 -46310 353142 -300754 6225 171517
15633A71517a29116k10409D6023a28319B58322b11829A13987c0171a3808B0453
$$ 171517 -129116 -339525 46023 -128319 258322 -211829 113987 -30171 -13808 20453
15622A83210G1151f4416A68764c27803G2636K24974c1072j76803E5567M8418f0591
$$ 183210 71151 -64416 168764 -327803 72636 297610 -31072 -207875 55567 103985 -60591
15610b91523P2380G6406i7965D01205B5305b00161O6791j67142i6243E3591N9551
$$ -291523 -219143 76406 -97965 401205 25305 -200161 -133370 -300512 -96243 53591 113142
15599A13142d4959l93052G5099r994e218B83893g72p1600c4714B20807i9979m0450
$$ 113142 -44959 -438011 75099 65105 -5218 283893 -772 -72372 -34714 220807 -99979 -140429
15587a40429A26400a22792j92921A5206O4097a3491j44722C11815l7360i5093
$$ -140429 126400 -122792 -315713 15206 79303 -13491 -158213 311815 274455 -95093
15576b12141A964i3927o504k2178A78526O2726b21632F4750J40836a57683b8320
$$ -212141 1964 -93927 -100431 -122609 178526 241252 -221632 64750 205586 -157683 -28320
15564f1555a7388j82131b1019l0175A37930l4085K53761f2420C1415j2316J38085
$$ -61555 -17388 -199519 -21019 -51194 137930 103845 357606 -62420 31415 19099 157184
15553A57184j6598a9710j17308a3417H1937L92549F9478i5052j923B00335p1176
$$ 157184 140586 -19710 -137018 -13417 81937 474486 69478 -95052 -96975 200335 129159
15542A29159J38443d1720D1895J809K0573K00983O2132a5539j35267h144k29183
$$ 129159 267602 -41720 41895 43704 64277 265260 327392 -15539 -150806 -8144 -237327
15531b37327B5303d0754A28640m8597b53205D3321c5925G667e5754A67303e4839
$$ -237327 25303 -40754 128640 80043 -253205 43321 -35925 7667 -55754 167303 -54839
15519h3161K9365C4516J63297r1531j9926J1553K62415I9831J66518a90187R002
$$ -83161 -53796 34516 197813 106282 86356 97909 360324 99831 266349 -190187 -181185
15508a81185p6467A27798C8388a50458I4232J34312f6647A26059b62971k99758
$$ -181185 -257652 127798 38388 -150458 94232 228544 -66647 126059 -262971 -562729
15498e62729c778I8167a2992k48386P3918g2738K2621A6578a3777C05358j19530
$$ -562729 -3778 98167 -12992 -261378 -187460 -72738 -50117 16578 -13777 305358 185828
15487A85828b39389a5805l3150B07423o7185c9571a1637k83237a33827O4185H1215
$$ 185828 -239389 -15805 -48955 207423 140238 -39571 -11637 -294874 -133827 -69642 81215
15475B77054d5661b955F2883J50801H1570J82890P3156c26475a36501E520g5436
$$ 277054 -45661 -2955 62883 213684 81570 264460 337616 -326475 -136501 5520 -75436
15463b18018A01005b21105A11091D725a5771A14900b5278A17117P5243F3317H161
$$ -218018 101005 -221105 111091 4725 -15771 114900 -25278 117117 192360 63317 8161
15451c99419h8596b9143k1470a4820q5124B78579c09185c4909E3266a81774M001
$$ -399419 -88596 -29143 -50613 -14820 -99944 278579 -309185 -34909 53266 -181774 -177773
15440a77773A40250e396F4717d4936A08864A7893c48520C79475a03364p9795H9
$$ -177773 140250 -5396 64717 -44936 108864 17893 -348520 379475 -103364 -183159 89
15428b83780a00086k88124a17889l7934B41447b6853I5524c58358a59170K3251
$$ -283780 -100086 -388210 -117889 -155823 241447 -26853 95524 -358358 -159170 -135919
15418a35919A79053f2274B00826J237a47566A85968a02395l07108d4472j23707
$$ -135919 179053 -62274 200826 202063 -147566 185968 -102395 -409503 -44472 -168179
15408a68179c7196l68873a34498o0776C72496e8832B39108d4849j11824A28550
$$ -168179 -37196 -406069 -134498 -195274 372496 -58832 239108 -44849 -156673 128550
15397C03640n2125c141A68054L1408c8508A68892A4600J53396o1446h8553m8428
$$ 303640 251515 -3141 168054 199462 -38508 168892 14600 167996 106550 -88553 -136981
15386a36981k06903c2653q8118L592J0576k88201d5698A69541B5264c3476j89771
$$ -136981 -343884 -32653 -120771 -117179 -106603 -394804 -45698 169541 25264 -33476 -223247
15375b23247a8216I9880b10439A4369b09836C27266b39034g9082c4517l04978
$$ -223247 -18216 99880 -210439 14369 -209836 327266 -239034 -79082 -34517 -339495
15365c39495A45634a57629l9919L5540c1737B2489a01233c644k4463A79692e3503
$$ -339495 145634 -157629 -197548 -162008 -31737 22489 -101233 -3644 -28107 179692 -53503
15353c0883q7949I5240c5092B4479P9003h4574B85030g4734A62013a73698j91643
$$ -30883 -118832 95240 -35092 24479 103482 -84574 285030 -74734 162013 -173698 -365341
15342c65341F4428a86745B3523O1248a46604M7781H2187a34019A21355C2822h7667
$$ -365341 64428 -186745 23523 84771 -146604 -98823 82187 -134019 121355 32822 -87667
15330b00425N0459j74717d151l3584k28272Q1922B98658a03504J3150B3121e9947
$$ -200425 -149966 -324683 -4151 -37735 -266007 -184085 298658 -103504 -90354 23121 -59947
15318a79001L3059O8810G4839a24854A18186a32004j3863A42857o1620i4402j36907
$$ -179001 -145942 -77132 74839 -124854 118186 -132004 -145867 142857 81237 -94402 -231309
15307b31309K611B38319g4365b3292C26973a90890j52406G1015M6437j0549d7246
$$ -231309 -228698 238319 -74365 -23292 326973 -190890 -343296 71015 117452 106903 -47246
15295F2491K39053A39129h0757K9053A38584F7174a9918l6744n6727B14952r5976
$$ 62491 301544 139129 -80757 -51704 138584 67174 -19918 -56662 -113389 214952 118976
15284A18976b74222A2360K12067L3590a30256A99778d7576A30156K15915a26896
$$ 118976 -274222 12360 224427 258017 -130256 199778 -47576 130156 346071 -126896
15273C0111K3794J78814a53015A55433J2871c33971B27107F7815j6565J54460
$$ 30111 53905 232719 -153015 155433 168304 -333971 227107 67815 51250 205710
15263B05710L05068G9553M26347A92905B9407j1669h5815C02148o2630j09190
$$ 205710 510778 79553 505900 192905 29407 17738 -85815 302148 239518 130328
15253A30328a13023A89592J48546k3867J233007k06401k14318J26476D96124f8467
$$ 130328 -113023 189592 338138 314271 1547278 1340877 1126559 1253035 496124 -68467
15242B10573E8103k8435g0242B92596c97n9812a8797j47933A0656M923J71604
$$ 210573 58103 29668 -70242 292596 -397 -60209 -18797 -166730 10656 15579 187183
15231A87183a74552B78866g5046k64212G7679L18493c608C4042K04147D5987J9088
$$ 187183 -174552 278866 -75046 -339258 77679 396172 -3608 34042 238189 45987 65075
15220F5075q89J99454K5689j43607J0313m8h8336L0987K2761I3168J32708k7713
$$ 65075 64186 263640 289329 145722 156035 155987 -88336 -57349 -34588 93168 225876 198163
15208A98163P0798g9351C68855c3967B54888C5370c09052A3162L62737j7994D04
$$ 198163 268961 -79351 368855 -33967 254888 35370 -309052 13162 375899 357905 404
15196a35753B8657J97570c2554A8447g748A66956b00371R6067h655D862J80306
$$ -135753 28657 226227 -32554 18447 -7748 166956 -200371 -104304 -8655 4862 185168
15185A85168b991I78h0592A72487a40649A4130J87463L1947o6746N2467I6270
$$ 185168 -2991 978 -80592 172487 -140649 14130 201593 233540 166794 219261 96270
15173i7952o0723A95125r5938J28381D0504M4892e825B34211a37084e8630C9987
$$ -97952 -158675 195125 99187 227568 40504 85396 -5825 234211 -137084 -58630 39987
15161B2085a3771j04377A86272G0750J54154O4829m2899b08146F6308P0577A2213
$$ 22085 -13771 -118148 186272 70750 224904 289733 246834 -208146 66308 136885 12213
15149h3456C38114F6503K74629l5098j50220c33856C46680n5971H7061b13542
$$ -83456 338114 66503 341132 306034 155814 -333856 346680 290709 87061 -213542
15138F2920N794J38557K17589A42703i2474B83856E8318a39054F5550B5137a54984
$$ 62920 68714 207271 424860 142703 -92474 283856 58318 -139054 65550 25137 -154984
15126A7197P3251L58972a44651A78839o4466J05037q547K45323m4813A12758J34991
$$ 17197 90448 449420 -144651 178839 114373 219410 210863 456186 411373 112758 247749
15115B47749h8573A94725I4553B24J11546c52767a76162A33117L0101l2897O599
$$ 247749 -88573 194725 94553 224 111770 -352767 -176162 133117 163218 130321 136920
15104A36920i7469A02327e5720A12203A0334L06671o8836R0437J45378A2327b3198
$$ 136920 -97469 102327 -55720 112203 10334 317005 248169 338606 483984 12327 -23198
15092C12658N3946I2156D4736N018a28592F02504B56534b1718B17392k0004a66477
$$ 312658 366604 92156 44736 49754 -128592 602504 256534 -21718 217392 197388 -166477
15080D22627A20515j912m0544c84044C23036A47939M42682A42526m2794K98463
$$ 422627 120515 118603 78059 -384044 323036 147939 590621 142526 99732 398195
15070C98195P069F1475i055A5521L51085A41818m3395B802K10439R7858f1865
$$ 398195 405264 61475 -9055 15521 366606 141818 98423 2802 213241 311099 -61865
15058C41051l1346a55299B32223f2543n127A21116J40292P4592c8102A50371d6602
$$ 341051 309705 -155299 232223 -62543 -67670 121116 261408 336000 -38102 150371 -46602
15046F5565K504L95700A81654A3270K15469A03242K30604r8158n0910J77866N6141
$$ 65565 68069 463769 181654 13270 228739 103242 333846 235688 184778 362644 418785
15035D18785j84264e8582G9916L86333A83396D5800K43315d1590F5465j2205e0531
$$ 418785 234521 -58582 79916 466249 183396 45800 289115 -41590 65465 53260 -50531
15023B15017J45417j67802K07524j80059M5955j00450J28176O6362A62969k1169
$$ 215017 360434 192632 400156 220097 266052 165602 293778 360140 162969 141800
15013A41800J9400L50850A96965d3200D44625i2898B06801n0147m5055b541H4411
$$ 141800 161200 512050 196965 -43200 444625 -92898 206801 156654 111599 -2541 84411
15001A21751b6358D8815L22773E3471n212K21958A8518H251J47072J41989K72945
$$ 121751 -26358 48815 371588 53471 48259 270217 18518 8251 155323 297312 570257
14990E70257A25891J06697m231N8856j16912J31786J70247b216C99202g9254B06382
$$ 570257 125891 232588 228357 287213 170301 302087 472334 -2216 399202 -79254 206382
14978A63639E6380K05583P484Q9143B9036J91515n2877p3533M2814a8405A78975
$$ 163639 56380 261963 269447 358590 29036 220551 167674 94141 136955 -18405 178975
14966C59280D3063P3700J49077I9943m730L01961n0390D5332L7949J11789O0733
$$ 359280 43063 116763 265840 99943 95213 397174 346784 45332 83281 195070 255803
14955B55803G7956f9057D71013J16256k83094q462j33792L33823B27593K36990
$$ 255803 77956 -69057 471013 587269 304175 295713 161921 495744 227593 464583
14945D64583D9369O0746J11810K08204O0408A48321M7576L49306B72126L02073
$$ 464583 49369 110115 221925 430129 490537 148321 195897 545203 272126 574199
14935E74199B83199J24252Q5549A27270J35971J47194r8044J98941B39733H2443
$$ 574199 283199 407451 493000 127270 263241 410435 312391 511332 239733 82443
14924C68427J40779J17569a12322B60450K42861k35248k61J45545p9070m0205
$$ 368427 509206 626775 -112322 260450 503311 268063 267802 413347 334277 294072
14914B94072i3668k3975B98433I7668L3022O16994A57490L18992B29814l549m6133
$$ 294072 -93668 -117643 298433 97668 130690 747684 157490 476482 229814 226265 180132
14903A80132K85727j16547a06621C05845j06416L48725E5537L87112j10226j14252
$$ 180132 465859 349312 -106621 305845 199429 548154 55537 442649 332423 218171
14893B18171N8572P6105Q9188j74655L82142B03709K59520E4455K49990p8216
$$ 218171 276743 352848 442036 267381 649523 203709 463229 54455 304445 226229
14883B26229o5294L89445j27787K59827j81654o4324H3437b9869B18027o0401
$$ 226229 160935 550380 422593 682420 500766 436442 83437 -29869 218027 157626
14873A57626N33939n0603k01501j72612J69800j2988k7149K38475l15281O7625
$$ 157626 691565 640962 439461 266849 436649 423661 396512 634987 319706 387331
14863C87331j04074j30015L79333j22101J2116J40388B37332N437J38261p4284
$$ 387331 283257 153242 532575 410474 422590 562978 237332 242769 381030 306746
14853C06746J95235k03832r9153n1895N43086P0934A11260R0471O24322C73979
$$ 306746 501981 298149 198996 147101 690187 761121 111260 201731 826053 373979
14842E16978k6922J48127m077k32090j31418A14566J65472K75690K04510C68078
$$ 516978 490056 638183 634106 402016 270598 114566 280038 555728 760238 368078
14831H42649l44314m3252j07622j0158G5510N28688A22463L81247q7323q2479
$$ 842649 498335 455083 347461 337303 75510 604198 122463 503710 416387 333908
14821C33908M44737C85864J25338K9634j18764j19841K81371q7437k04477J84984
$$ 333908 778645 385864 511202 540836 422072 302231 583602 496165 291688 476672
14811D76672J6484Q2410o9955j00011K20896j69045L49754p7892o2367j28935
$$ 476672 493156 575566 505611 405600 626496 457451 807205 729313 666946 538011
14801E38011j86937J17021q4551J19183J13000K30354k39425k27171j47352P14637
$$ 538011 351074 468095 383544 502727 615727 846081 606656 379485 232133 946770
14791I46770D02829r784L346l2302L1653Q7535k38739M75246n0924A94875K20600
$$ 946770 402829 393045 396391 364089 395742 483277 244538 719784 668860 194875 415475
14780D15475J30471K0484P7282K12310D21112J76398J1307m8104M2099q3559R4326
$$ 415475 545946 566430 643712 856022 421112 597510 608817 560713 602812 519253 613579
14769F13579m1673J09423J71411k10718J28392j28771k09866J77595J33291J6829
$$ 613579 571906 681329 852740 642022 770414 641643 431777 609372 742663 759492
14759G59492p9506A41688L73524K4719K97358k32666j04009J61239l6705J9304
$$ 759492 679986 141688 515212 539931 837289 604623 500614 661853 625148 644452
14749F44452J9294j1442k27346K62494L3954k25054R0616K28643k16780j78315
$$ 644452 663746 652304 424958 687452 721406 496352 586968 815611 598831 420516
14739D20516O52158k50386N8823J75717J50732k97518k05854p2857N1585J0552
$$ 420516 1072674 822288 881111 1056828 1207560 910042 704188 631331 682916 693468
14729F93468j05091L78232j27520J21521l58509J32765P0394j30274m5424J52316
$$ 693468 588377 966609 839089 960610 602101 734866 805260 674986 629562 781878
14719G81878P5199m6645l30174M43941j87277K41772k58426r5334J27535K29676
$$ 781878 857077 810432 480258 924199 736922 978694 720268 624934 752469 982145
14709I82145j77234K32602J52399n88943k09146L49746K83035k97171k12991r5916
$$ 982145 804911 1037513 1189912 600969 391823 741569 1024604 727433 514442 418526
14699D18526L61446J31212J78573m19440Q869N6749L20282R3436k96966k12640
$$ 418526 779972 911184 1089757 670317 679186 735935 1056217 1149653 852687 640047
14689F40047M28476K22802m75496K82335k08604P1415j35451J06608p6039K55805
$$ 640047 1068523 1291325 815829 1098164 889560 960975 825524 932132 856093 1111898
14679A111898l69169L95773k54863L09523l73818K26145j84668O6193N35209o34387
$$ 1111898 742729 1138502 883639 1193162 819344 1045489 860821 927014 1462223 827836
14669H27836Q5986Q1812r9598K01801o748k12246j36148M69045j84820K63575
$$ 827836 913822 995634 896036 1097837 1091089 878843 742695 1211740 1026920 1290495
14659A290495l97461K11249M27822l20258j25705J07882l6231J45156k7434k3193
$$ 1290495 893034 1104283 1532105 1211847 1086142 1194024 1157793 1302949 1275515 1252322
14649A252322R2777j5369k66180K9078L806k2599J40965k4381j95852J88521L46806
$$ 1252322 1345099 1329730 1063550 1092628 1096434 1073835 1214800 1190419 994567 1183088 1529894
14638A529894j20488j96948N8283m7779j52155O40546l11065j58770K89073J01356
$$ 1529894 1409406 1212458 1270741 1222962 1070807 1711353 1400288 1241518 1530591 1631947
14628A631947l22086P7956P5082k54863K79613q3705l28305L31581k4350P5952
$$ 1631947 1309861 1387817 1462899 1208036 1487649 1403944 1075639 1407220 1382870 1458822
14618A458822O0970j45104J25429L1128J41478o8426J02453q2384P5586K94154
$$ 1458822 1519792 1374688 1500117 1531245 1672723 1604297 1706750 1624366 1699952 1994106
14608A994106j95410k41408P0845n7614K25229n4826j12300q6066J19856O1522
$$ 1994106 1798696 1557288 1628133 1570519 1795748 1740922 1628622 1542556 1662412 1723934
14598A723934P8799K35355k45774J2730N9611m05110N32982k31088r2346n0846
$$ 1723934 1802733 2038088 1792314 1805044 1864655 1459545 1992527 1761439 1669093 1618247
14588A618247N31556m27629L85011q5270o3966M8046P8195J99013k08324q9033
$$ 1618247 2149803 1722174 2107185 2021915 1957949 2005995 2084190 2283203 2074879 1985846
14578A985846J86014k16171J43239K34539n7568O0749m12114M29153k9102q4013
$$ 1985846 2171860 1955689 2098928 2333467 2275899 2336648 1924534 2353687 2324585 2240572
14568B240572K63577l52542O8886m3517L37078J66904K20186j15800Q2016o5924
$$ 2240572 2504149 2151607 2220493 2176976 2514054 2680958 2901144 2785344 2867360 2801436
14558B801436K97711o2411J04067P3409L17158K44626M54277N37661J217552J975720
$$ 2801436 3099147 3036736 3140803 3214212 3531370 3775996 4230273 4767934 5985486 7961206
14548G961206M062144R407210K1598963L143428B0894369H321811m035940j460956
$$ 7961206 12023350 21430560 43029523 46172951 20894369 8321811 4285871 2824915
14540B824915l72566k25277k02825j07710j98658L29453O4290N2145J23211k00465
$$ 2824915 2452349 2227072 2024247 1916537 1717879 2047332 2111622 2163767 2286978 2086513
14530B086513K56270K30653m27834J02737J54782K31756j59223k56999p0388J53845
$$ 2086513 2342783 2573436 2145602 2248339 2403121 2634877 2475654 2218655 2148267 2302112
14520B302112j46263L37442n1292N0408o1047L65484K51414m15081M3878J09006
$$ 2302112 2155849 2493291 2441999 2492407 2431360 2796844 3048258 2633177 2677055 2786061
14510B786061j41170J36262Q7912K96865m13737K01337K55899j94744M17059J03473
$$ 2786061 2644891 2781153 2869065 3165930 2752193 2953530 3209429 3014685 3431744 3535217
14500C535217m79886J41598M5593L14586k89222J36012j46313P5532o4218P1293
$$ 3535217 3055331 3196929 3242522 3557108 3267886 3403898 3257585 3333117 3268899 3340192
14490C340192k1362M94461k60433j76044K90729J7742L71186k08165k7225J45167
$$ 3340192 3318830 3813291 3552858 3376814 3667543 3685285 4056471 3848306 3821081 3966248
14480C966248J7330L37171q4521p0767k2547K88567j3j94864m756K99997k90063
$$ 3966248 3983578 4320749 4236228 4165461 4142914 4431481 4431468 4236604 4231848 4531845 4241782
14469D241782J01505L91529k23303M7711K84139k26231r5071L92229q3243J9102
$$ 4241782 4343287 4734816 4511513 4559224 4843363 4617132 4522061 4914290 4831047 4850149
14459D850149M76264j49492K9946J83054k08190N95470l2329p799J26060l51874
$$ 4850149 5326413 5176921 5206867 5389921 5181731 5777201 5744872 5737073 5863133 5511259
14449E511259P06095l63182J19704K6177j92183J48806L45027k6478k23470J27179
$$ 5511259 6217354 5854172 5973876 6000053 5807870 5956676 6301703 6275225 6051755 6178934
14439F178934O03617k20731j93551R7634M46576P8715j9356q6850M13771k75633
$$ 6178934 6782551 6561820 6368269 6465903 6912479 6991194 6971838 6884988 7298759 7023126
14429G023126K61411J45927k66258K52444J90436L00329N0029j08940K28465k10360
$$ 7023126 7284537 7430464 7164206 7416650 7607086 7907415 7957444 7848504 8076969 7866609
14419G866609K02569K35322J28551R9292L46623J25714J42455k24891M10056K43410
$$ 7866609 8069178 8304500 8433051 8532343 8878966 9004680 9147135 8922244 9332300 9575710
14409I575710q277K38553J61050q2012M10036q8676L85287P0251J47792J86878
$$ 9575710 9567433 9805986 9967036 9885024 10295060 10206384 10591671 10661922 10809714 10996592
14399A0996592j48948M53463M00010K97977M3018K38064j57873J70367P47985
$$ 10996592 10847644 11301107 11701117 11999094 12042112 12280176 12122303 12292670 13040655
14390A3040655k90846M40375p5154L59120L15033K09812J9276L35707L14368K46749
$$ 13040655 12749809 13190184 13115030 13474150 13789183 13998995 14018271 14353978 14668346 14915095
14380A4915095L76127L54088M34845J06523J24068L79416L98583J02754O16680
$$ 14915095 15291222 15645310 16080155 16186678 16310746 16690162 17088745 17191499 17808179
14371A7808179N58493j0565L72998K92382M14028O28197N41512j3382Q42805K79914
$$ 17808179 18366672 18356107 18729105 19021487 19435515 20063712 20605224 20591842 21434647 21714561
14361B1714561L56563M59124M00757O34399L30871Q58664M98168N08250O93991
$$ 21714561 22071124 22530248 22931005 23565404 23896275 24754939 25253107 25761357 26455348
14352B6455348P28122N45899R00567N20774R18129O64532O98442P37441J025758
$$ 26455348 27183470 27729369 28629936 29150710 30068839 30733371 31431813 32169254 33195012
14343C3195012L62480J004490J026794Q04182J084809J350996P55621J472017
$$ 33195012 33557492 34561982 35588776 36392958 37477767 38828763 39584384 41056401
14335D1056401P68349J627549J002466J321081J652647J846786Q22571J578528
$$ 41056401 41824750 43452299 44454765 45775846 47428493 49275279 50097850 51676378
14327E1676378J707357J827805J469519K240212K068995K041953K023398K278018
$$ 51676378 53383735 55211540 56681059 58921271 60990266 63032219 65055617 67333635
14319F7333635K538503K661335K949673K446277L215077K978711L418760L381576
$$ 67333635 69872138 72533473 75483146 77929423 81144500 84123211 87541971 90923547
14311I0923547L456178M018112M060870M401092M492197N104707M949001N211513
$$ 90923547 94379725 98397837 102458707 106859799 111351996 116456703 121405704 126617217
14303A26617217O031086O167544O321861O957705O985285P645737Q320151Q372447
$$ 126617217 132648303 138815847 145137708 152095413 159080698 166726435 175046586 183419033
14295A83419033R293368R391487R656837J1097875J1000024J1586980J2297846
$$ 183419033 192712401 202103888 211760725 222858600 233858624 245445604 257743450
14288B57743450J2487099J3655263J3775469J3917460J4767938J4409243J4730801
$$ 257743450 270230549 283885812 297661281 311578741 326346679 340755922 355486723
14281C55486723J4379912J4693544J3878013J3009630J2328218J1167272R802872
$$ 355486723 369866635 384560179 398438192 411447822 423776040 434943312 444746184
14274D44746184P707150N161798J660438P04529J12678j431902m330799k704611
$$ 444746184 452453334 457615132 459275570 459980099 460092777 458660875 454330076 451625465
14266D51625465n731848q452994j0413159j1963747j3185272j3597253j4937246
$$ 451625465 445893617 437440623 427027464 415063717 401878445 388281192 373343946
14259C73343946j5022445j5546187j5141032j4193866j4491273j4219021j3488916
$$ 373343946 358321501 342775314 327634282 313440416 298949143 284730122 271241206
14252B71241206j3115402j2440090j2084210j1219467j0705958j0219864r700844
$$ 271241206 258125804 245685714 233601504 222382037 211676079 201456215 191755371
14245A91755371r146964q423606p846138p633926p474415o860960o446558n587343
$$ 191755371 182608407 174184801 166338663 158704737 151230322 144369362 137922804 132335461
14237A32335461n499980o080222n068980m359538m718257l952679l828303m084607
$$ 132335461 126835481 120755259 115686279 111326741 106608484 102655805 98827502 94742895
14229I4742895l676176l258626l533467l118313l023380l151801k471492k540305
$$ 94742895 91066719 87808093 84274626 81156313 78132933 74981132 72509640 69969335
14221F9969335k447137k149654k053023k141222k340767j547818j523997j989626
$$ 69969335 67522198 65372544 63319521 61178299 58837532 57289714 55765717 53776091
14213E3776091j529327j420985j629976j755892j274481j107615j012630r60105
$$ 53776091 52246764 50825779 49195803 47439911 46165430 45057815 44045185 43085080
14205D3085080j619008j158663r06610j038488j327863k66674q09818j610643
$$ 43085080 41466072 40307409 39400799 38362311 37034448 36767774 35957956 34347313
14197C4347313p50312r41366r42823o63794j032538k84195p72144o50696r89370
$$ 34347313 33597001 32655635 31712812 31049018 30016480 29732285 28960141 28309445 27320075
14188B7320075j98311q79463n47962m40434p48047l05989n83539r81372m47275
$$ 27320075 27121764 26242301 25694339 25253905 24505858 24199869 23616330 22634958 22187683
14179B2187683l00986m94414n61854j90243n61388o34286k5572l73083m65460
$$ 22187683 21886697 21392283 20830429 20640186 20078798 19444512 19418940 19045857 18580397
14170A8580397j37671o63136k28319l28063l97768j69815l48640k53669j38325
$$ 18580397 18442726 17779590 17551271 17223208 16825440 16655625 16306985 16053316 15914991
14161A5914991n84247k17545k49746k26057j41621k86446l84009o5046n66194
$$ 15914991 15330744 15113199 14863453 14637396 14495775 14209329 13825320 13760274 13194080
14152A3194080K10300m84188k68218k8565l57863k01711j28534k33733o5330j53742
$$ 13194080 13404380 12920192 12651974 12623409 12265546 12063835 11935301 11701568 11636238 11482496
14142A1482496k33978R6953m38461l58752j46544J39088l3085J79607n42867m38010
$$ 11482496 11248518 11345471 10907010 10548258 10401714 10540802 10507717 10687324 10144457 9706447
14132I706447l7218k5657m46308K48004j58585m05522K8177k68701L66809l66603
$$ 9706447 9669229 9643572 9197264 9445268 9286683 8881161 8909338 8640637 9007446 8640843
14122H640843n7363m67994L96944k84934l78550j7628k29580J89922m83423K14612
$$ 8640843 8583480 8115486 8512430 8227496 7848946 7831318 7601738 7791660 7308237 7522849
14112G522849j68105l2569Q4504j56399j77378K27386m16064j16154K1379j79840
$$ 7522849 7354744 7322175 7406679 7250280 7072902 7300288 6884224 6768070 6789449 6609609
14102F609609j59677m8229o6338q6336R6404j62696N99870p59962j20482J2869
$$ 6609609 6449932 6401703 6335365 6249029 6345433 6182737 6782607 6022645 5902163 5915032
14092E915032K3692l85316J69399M5927k30620N4668j89480l2150L72420j60655
$$ 5915032 5938724 5553408 5722807 5768734 5538114 5592782 5403302 5371152 5743572 5582917
14082E582917k02036l95616J15942Q9723n10111K15543j31022N44Q180L41738
$$ 5582917 5380881 4985265 5101207 5190930 4680819 4896362 4765340 4765884 4774064 5115802
14072E115802m99246N9192j03202L74500n18087K15687l15047j47408O06695l61491
$$ 5115802 4616556 4675748 4572546 4947046 4428959 4644646 4329599 4182191 4788886 4427395
14062D427395K0067k69864Q378o052j21737K66186j90109R9563k53592J69191
$$ 4427395 4447462 4177598 4185976 4179924 4058187 4324373 4134264 4233827 3980235 4149426
14052D149426j04377k49013L43127o77529M16349k26673L1415J57067j84299N9118
$$ 4149426 4045049 3796036 4139163 3461634 3877983 3651310 3682725 3839792 3655493 3714611
14042C714611l86354J53780j26058L10956j97091k74085Q7634l94J50881p7950
$$ 3714611 3328257 3482037 3355979 3666935 3469844 3195759 3283393 3282999 3433880 3355930
14032C355930j07345K42558l93499K65034k27167J3970l2011r1695L1691L39848
$$ 3355930 3248585 3491143 3097644 3362678 3135511 3149481 3117470 3025775 3057466 3397314
14022C397314m14072p7567J3217n0117k34186M6572L84195n23567M77458l94168
$$ 3397314 2983242 2905675 2918892 2868775 2634589 2681161 3065356 2541789 3019247 2625079
14012B625079K79633j90462l26945L03236M1978p0491o3427k57984J40596k40685
$$ 2625079 2904712 2714250 2387305 2690541 2732519 2662028 2598601 2340617 2481213 2240528
14002B240528R7077k74418L52831l21161Q6234R7881l45932K66628o0766m9491
$$ 2240528 2337605 2063187 2416018 2094857 2181091 2278972 1933040 2199668 2138902 2089411
13992B089411K83775N24108p9578J100649K370187P272805J9810201J4360526
$$ 2089411 2373186 2897294 2817716 3918365 6288552 13561357 33371558 47732084
13984D7732084k0143236j3653816n107628k698287j165477p13072l85254l48615
$$ 47732084 27588848 13935032 8827404 6129117 4963640 4250568 3865314 3516699
13976C516699q0360n78952J5193J58018j73455L88811n78552p3323J11j90174
$$ 3516699 3436339 2857387 2872580 3030598 2857143 3245954 2667402 2594079 2594190 2404016
13966B404016K61740Q303k86641L3768K74230j78238n87675M52646n3247K63855
$$ 2404016 2665756 2674059 2387418 2421186 2695416 2517178 1929503 2382149 2328902 2592757
13956B592757p46187L22664o0019K01350m42306J44653k75163M91940k1355j97080
$$ 2592757 1846570 2169234 2109215 2310565 1868259 2012912 1737749 2229689 2208334 2011254
13946B011254k26291K988L34756k33041K20262R44J55796m46367j46405L69274
$$ 2011254 1784963 1787951 2122707 1889666 2109928 2110872 2266668 1820301 1673896 2043170
13936B043170j25895j10703K26212l45147J65435L4613l24200L87743j92179k42809
$$ 2043170 1917275 1806572 2032784 1687637 1853072 1887685 1563485 1951228 1759049 1516240
13926A516240J83193j66789J91694K3746p0765K01481k63889j3395K39416k60509
$$ 1516240 1699433 1532644 1724338 1748084 1677319 1878800 1614911 1601516 1840932 1580423
13916A580423J02057j82404K09693r9207K4948J3015k35933J83796n1436k60814
$$ 1580423 1682480 1500076 1709769 1610562 1635510 1648525 1412592 1596388 1544952 1284138
13906A284138L97533m78743K84979p1508j44440K69628l72043J04262K47433r817
$$ 1284138 1681671 1202928 1487907 1416399 1271959 1541587 1169544 1273806 1521239 1511422
13896A511422r2128n9285R6338J11406n2997k41541J51062l17005L98080k3405
$$ 1511422 1419294 1360009 1456347 1567753 1514756 1273215 1424277 1107272 1505352 1481947
13886A481947k45080J40305j21633r5808K44955K78616o75668L34487j33933R0397
$$ 1481947 1236867 1377172 1255539 1159731 1404686 1683302 1007634 1342121 1208188 1298585
13876A298585l04003J42220o4257K47059j72356p4407M14019m76689L59330J61367
$$ 1298585 994582 1136802 1072545 1319604 1147248 1072841 1486860 1010171 1369501 1530868
13866A530868l51789M1420l1234K31187m2642l37892J39449j46982n0674K68249
$$ 1530868 1179079 1220499 1189265 1420452 1377810 1039918 1179367 1032385 981711 1249960
13856A249960j38787L16602L5815l10131j76006k19483j2174N83647k36597j74690
$$ 1249960 1111173 1427775 1463590 1153459 977453 757970 745796 1329443 1092846 918156
13846I18156L39923j25481m90117M61399k77687L25799r1254j35689L4477K02573
$$ 918156 1258079 1132598 642481 1103880 826193 1151992 1060738 925049 959526 1162099
13836A162099j47587n9724K76325m01373n5414L38179m04063K61213J47007l63900
$$ 1162099 1014512 954788 1231113 829740 774326 1112505 708442 969655 1116662 752762
13826G52762K88934L33148l67709P3100k60753K02106R4788j07362j02270k25710
$$ 752762 1041696 1374844 1007135 1080235 819482 1021588 1116376 1009014 906744 681034
13816F81034J27711L52913m49171K47419J10567m53150J21376J96590K58192j51245
$$ 681034 808745 1161658 712487 959906 1070473 617323 738699 935289 1193481 1042236
13806A042236l79891O7999J17690M4596j05646K75995l93310j83025N84830k01228
$$ 1042236 662345 730344 848034 892630 786984 1062979 669669 486644 1071474 870246
13796H70246N0691L8186J3987o1554l56538K20239K11213l78583j08971K10661
$$ 870246 920937 959123 973110 911556 555018 775257 986470 607887 498916 709577
13786G09577L16123m3759N8159p7001n4223m3509l8904r5467N0847j77457K53437
$$ 709577 1025700 981941 1040100 963099 908876 865367 826463 730996 781843 604386 857823
13775H57823m2424l01898M25042o8581J6091J68964E02420K44047J43333k23239
$$ 857823 815399 513501 938543 869962 886053 1055017 502420 746467 889800 666561
13765F66561l0812J81757J80522o6451j45720k61611J29973m9816J55301K69172
$$ 666561 635749 817506 998028 931577 785857 524246 654219 604403 759704 1028876
13755A028876k50691j92174J94636k20912M4530r0409J36750O8797J46982D03114
$$ 1028876 778185 586011 780647 559735 604265 513856 650606 719403 866385 403114
13744E78532N8379K79638m53613L69694l59104M26459j87480n1579K8805L94658
$$ 578532 636911 916549 462936 832630 473526 899985 712505 660926 689731 1084389
13734A084389l30123P3522k35952J8914B90118K78351K9348E3749L25232K65475
$$ 1084389 754266 827788 591836 610750 290118 568469 597817 53749 378981 644456
13724F44456K4958j08109M205J30588q9297k01197L73811n6091P079k21355Q3470
$$ 644456 669414 561305 565510 696098 606801 405604 779415 723324 730403 509048 592518
13713E92518Q6681j90594l8660O8765o2720P2905J00670p0331J34819K3408j67840
$$ 592518 679199 488605 449945 518710 455990 528895 629565 559234 694053 717461 549621
13702E49621K27287l61708P9730J99256l4600k00802K00256J17784N2334k03724
$$ 549621 776908 415200 494930 694186 659586 458784 659040 776824 829158 625434
13692F25434K54319l37546M8288o4598m9861J47442l0258k82901M35870j77170
$$ 625434 879753 542207 590495 525897 476036 623478 593220 310319 746189 569019
13682E69019k29235M72620k10698j83396N16864k21352k79777J46781J80194l38487
$$ 569019 339784 812404 601706 418310 935174 713822 434045 580826 761020 422533
13672D22533Q700O3249O5238j84568j44006L62762L359k63186L02720M2447j56690
$$ 422533 431233 494482 559720 375152 231146 593908 597267 334081 636801 679248 522558
13661E22558E4594L87093J87912k22548J11580R0234j70480J4324p7122A70769
$$ 522558 54594 441687 629599 407051 518631 608865 438385 452709 375587 170769
13650E26265j95287J16986L20980k34610m7128n4585O5259j77631Q957p2667K42498
$$ 526265 330978 447964 768944 534334 487206 432621 497880 320249 329206 256539 499037
13639D99037J30533k6486J3257n8680N8490B83424L36860j85729N2832m1859j60564
$$ 499037 629570 603084 616341 557661 616151 283424 620284 434555 487387 445528 284964
13628B84964K54443M4391n6590A07918K88665j9563j65560G3415L31145j58960
$$ 284964 539407 583798 527208 107918 396583 377020 211460 73415 404560 245600
13618B45600J67763M7445j65477K90817J4928A73309L64889j15188l5851M4798
$$ 245600 413363 460808 295331 586148 601076 173309 538198 423010 387159 431957
13608D31957r7312K86279p5813j84674j0341J42274k8219n6999J42373I5689Q459
$$ 431957 334645 620924 545111 360437 350096 492370 464151 407152 549525 95689 104148
13597A04148M30146c1297A15391K67775J58877j04804j04129J31687j82298A09451
$$ 104148 534294 -31297 115391 383166 542043 437239 333110 464797 282499 109451
13586B74526q3508K79422K48903C21221M089J56476A39550M02700j86484O3128
$$ 274526 191018 470440 719343 321221 325310 481786 139550 542250 355766 418894
13576D18894o5107Q8152b1012A9271M0087J97603N8279J12886F5455M23397K457
$$ 418894 353787 441939 -21012 19271 59358 256961 315240 428126 65455 488852 491309
13565D91309j55019Q0342J01403j88557M737j20969M28817B57385L53874B9004
$$ 491309 336290 416632 518035 329478 334215 213246 642063 257385 611259 29004
13554C98781M1467m1146j76761Q6287J09935O5940j56092R6174J60453e8948B09672
$$ 398781 440248 399102 222341 308628 418563 484503 328411 424585 585038 -58948 209672
13542E26804j85997A14812J9484b2670G72918k92124N7390j06357L11352k68341
$$ 526804 340807 114812 134296 -22670 772918 480794 538184 431827 743179 474838
13532D74838j34053p7912L36151o0776j75317j27255K22073j16490J75410j04045
$$ 474838 340785 262873 599024 538248 362931 235676 457749 341259 516669 412624
13522D12624j54924P2601j32712d9441C86837A65652J13224K99876I2691K29621
$$ 412624 257700 330301 197589 -49441 386837 165652 278876 578752 92691 322312
13512C22312E8482j8286f4404C48198H0173O11507k86356j14628i849B02659A2915
$$ 322312 58482 40196 -64404 348198 80173 691680 405324 290696 -9849 202659 12915
13500A06726K54791A46757j1073j230M0999j2189J99049A00643R2199J3647j01152
$$ 106726 361517 146757 135684 134454 175453 163264 362313 100643 192842 206489 105337
13489A05337b6315C11477r0620J7238G4080J53048L41710j46438A10396J00164
$$ 105337 -26315 311477 220857 238095 74080 227128 568838 422400 110396 210560
13479B10560K9028A16098K51476J59448A40154J84822K34472I8511L06092A38653
$$ 210560 239588 116098 367574 527022 140154 324976 559448 98511 404603 138653
13468A39688L65576A30034P7386J92413J90768B3344L84366N2887j87289M2852
$$ 139688 505264 130034 207420 399833 590601 23344 407710 460597 273308 316160
13458C16160K89955F6899L28100A47975K13000N2171j63140I196J93877J278J27553
$$ 316160 606115 66899 394999 147975 360975 413146 250006 9196 203073 204351 331904
13447C31904l104M3958k2132q3446K7930o0636J15513j1951J20473J07956j20933
$$ 331904 328800 372758 350626 267180 295110 234474 349987 338036 458509 566465 445532
13436D45532B10964I8663L89348n6354j97275J88167A84558D4513M53848j02864
$$ 445532 210964 98663 488011 431657 234382 422549 184558 44513 498361 395497
13426C95497j38116l9323p1481K63061j43436j15746E0019K53976A51708M101
$$ 395497 257381 218058 146577 409638 266202 150456 50019 303995 151708 155809
13416A55809J27614j04588J78289C4341Q2858J98472Q4583K0274j09567l8657
$$ 155809 283423 178835 357124 34341 117199 315671 400254 420528 310961 272304
13406B72304A33401b01265C91572j27172a1762B79749m7022L1345Q8015J02421
$$ 272304 133401 -201265 391572 264400 -11762 279749 232727 264072 352087 454508
13396D54508M5067j74576D1391J01457L9352n047L62551A618J89571J22904d9019
$$ 454508 499575 324999 41391 142848 182200 177153 539704 1618 191189 314093 -49019
13384D09346E2237h7592C86362j15584m1938J54002j26421B5229b090C92121F9593
$$ 409346 52237 -87592 386362 270778 228840 382842 256421 25229 -2090 392121 69593
13372A29583J78934N0100a84058B42424n2992j6908J63488H5283k8233K11366
$$ 129583 308517 358617 -184058 242424 189432 172524 336012 85283 57050 268416
13362B68416n1412a38189A77047m8626J97758B9253K41458G4215J68170j01613
$$ 268416 217004 -138189 177047 128421 326179 29253 270711 74215 242385 140772
13352A40772J9706f9729A27184L3116L72440j91866J07536c487C64862r2882A9601
$$ 140772 160478 -69729 127184 160300 532740 340874 448410 -3487 364862 271980 19601
13340C38170J50819j41736j5442m0680J6766J0834a5599A19403M12455A80070
$$ 338170 488989 347253 331811 291131 307897 318731 -15599 119403 531858 180070
13329B17897B9256R367E824L33440g9157C80976K31964k42386J12493A90286i62
$$ 217897 29256 38623 5824 339264 -79157 380976 612940 370554 483047 190286 -962
13317D15229A97079F3217A1884K10576b3432A60349K18981A88203B9822L65091
$$ 415229 197079 63217 11884 222460 -23432 160349 379330 188203 29822 394913
13307C94913A88677A5357K01873R5296C261a90362D47063A97204b2134D4199M67080
$$ 394913 188677 15357 217230 312526 3261 -190362 447063 197204 -22134 44199 511279
13296E11279B00151J1570I4143J36426c5488C1060K22265a08795B69428J30660
$$ 511279 200151 211721 94143 230569 -35488 31060 253325 -108795 269428 400088
13286D00088A88314L5105C5475J98495J97779A46730J42756J91874A24692J3158
$$ 400088 188314 223419 35475 233970 431749 146730 289486 481360 124692 137850
13276A37850n7651f6626C21239j02206j6555d0l5376B77394K49919B58397p0153
$$ 137850 80199 -66626 321239 219033 202478 -40 -35416 277394 527313 258397 188244
13265A88244M8775B4814Q0334B8168M6975C0756K86203O0410N34a3519E42401
$$ 188244 237019 24814 105148 28168 75143 30756 316959 377369 377903 -13519 542401
13253I9054b5174m429B27103a89044K946B61706o1157b04900d6777j0024J3814
$$ 99054 -25174 -29603 227103 -189044 -186098 261706 200549 -204900 -46777 -56801 -42987
13242d2987D70820A10833O1467J92672n9660d2564F2574J20230J45787C9863N14354
$$ -42987 470820 110833 172300 364972 305312 -42564 62574 182804 328591 39863 554217
13231E54217B28767o8751K18989F1692A7556g2181D69593F7194f5685A67167J18998
$$ 554217 228767 160016 379005 61692 17556 -72181 469593 67194 -65685 167167 286165
13220B86165h3090A34921a5605m6688F0611L32339H6192f2285E90843A51553G5131
$$ 286165 -83090 134921 -15605 -62293 60611 392950 86192 -62285 590843 151553 75131
13208A09062a9484C95022d0819A22760J58987D2412b14558Q6085F6277Q7721a90573
$$ 109062 -19484 395022 -40819 122760 281747 42412 -214558 -128473 66277 153998 -190573
13196H0879J73791I300O1778O7311e5874A32991K0973N7269e9229C0455J89126
$$ 80879 254670 9300 71078 138389 -55874 132991 153964 211233 -59229 30455 219581
13185B19581F9857p243K25556f7093C4504c33633B19748b72695B26069P2672k5150
$$ 219581 69857 62614 288170 -67093 34504 -333633 219748 -272695 226069 298741 273591
13174B73591m023J92880d8470A16138E7729K53705f3898B83124C9900L67734L9310
$$ 273591 269568 462448 -48470 116138 57729 311434 -63898 283124 39900 407634 446944
13163D46944H6334C5952e8961A65145K77501I5278K1836C9269R9276j8011l1177
$$ 446944 86334 35952 -58961 165145 442646 95278 117114 39269 138545 120534 89357
13152H9357C3093L72086j47104a74170B85241c05205D80482B06712r1284Q315
$$ 89357 33093 405179 258075 -174170 285241 -305205 480482 206712 115428 123743
13142A23743R7875a75941L5046d3393H8610J26794B8546f5661C33896c9902G1182
$$ 123743 221618 -175941 -140895 -43393 88610 215404 28546 -65661 333896 -39902 71182
13130C8031N3261a7295G4920A8830a66948A88674f6344A26998C653K1287J68239
$$ 38031 91292 -17295 74920 18830 -166948 188674 -66344 126998 3653 24940 193179
13119A93179J55573d6783C20354G2508J01581e0657p4350E36917B44639d4650
$$ 193179 348752 -46783 320354 72508 174089 -50657 -125007 536917 244639 -44650
13108a78664K229B31366j15242e424A48415b7737B48521I797M3951a8204j28981
$$ -178664 -176435 231366 116124 -5424 148415 -27737 248521 9797 53748 -18204 -147185
13097a47185A17456K72616I9179J01751l8442J05779I9971R7480a14389C68496
$$ -147185 117456 390072 99179 200930 162488 268267 99971 197451 -114389 368496
13086B26183H5956L35975l5560h1522A3295L2697O0005D7194k414b03405I7732
$$ 226183 85956 421931 386371 -81522 13295 45992 105997 47194 44780 -203405 97732
13074D6727J2657L50124H9734J97048m4226a04245b5554J1911I7351P4402b0411
$$ 46727 59384 409508 89734 286782 242556 -104245 -25554 -13643 97351 171753 -20411
13062C23018J51622h4868C30746i213l4792A95122L3872M9986d9452B31182e4102
$$ 323018 474640 -84868 330746 -9213 -44005 195122 228994 278980 -49452 231182 -54102
13050D1629M4312e2040C67346e3963k84882A22173n5876M5461c968l17960A84670
$$ 41629 85941 -52040 367346 -53963 -338845 122173 66297 111758 -3968 -321928 184670
13038a98956f9169D37804C5672K63313B5422N81811E6649j2013Q3500J63483j33045
$$ -198956 -69169 437804 35672 298985 25422 607233 56649 44636 128136 291619 158574
13027A58574J26533j8241j11588e277E9674c2690l57082A5957a93632b7938m0376
$$ 158574 285107 266866 155278 -5277 59674 -32690 -389772 15957 -193632 -27938 -68314
13016f8314A84576G5595d1602A38154K8198J58811p2324a22702N7195A09228m0687
$$ -68314 184576 75595 -41602 138154 166352 325163 252839 -122702 -65507 109228 68541
13005F8541L8447K42817m0432J1290o3369o5316a92329B16005a55637L7205A25139
$$ 68541 106988 349805 309373 320663 257294 191978 -192329 216005 -155637 -118432 125139
12993B07178A7338K69270p9273o4271l750K1846p0728K7445j1733a33635G0404
$$ 207178 17338 286608 207335 143064 139314 161160 90432 117877 106144 -133635 70404
12981B75146b22545C61564a0551H6804M38538g359k52040P3942B55065o7421R2156
$$ 275146 -222545 361564 -10551 86804 525342 -7359 -259399 -185457 255065 187644 279800
12970B79800r5994c25323A91651a21791M3605j84687k08882E401L79542C2876
$$ 279800 183806 -325323 191651 -121791 -78186 -262873 -471755 5401 384943 32876
12959a55038j00307F6919K70184A67681h3574A92832r5905c3923A79776m3726
$$ -155038 -255345 66919 337103 167681 -83574 192832 96927 -33923 179776 136050
12949A36050R5710j02680J10403A16658N5106L7100a43316k0878A3170K37728
$$ 136050 231760 129080 239483 116658 171764 208864 -143316 -164194 13170 250898
12939B50898G5597K0677j3020J4376R6328E4623b33422C61587n6845j29231h8215
$$ 250898 75597 96274 83254 97630 193958 54623 -233422 361587 304742 175511 -88215
12927a83918e7905A32729m004a01014b424B5895R0030a27861a2325j01085A6301
$$ -183918 -57905 132729 128725 -101014 -2424 25895 115925 -127861 -12325 -113410 16301
12915b29237j16347A72114K4384o603L00316d0864I9172c8285k28379J23777A7000
$$ -229237 -345584 172114 196498 189895 490211 -40864 99172 -38285 -266664 -142887 17000
12903B5864h3890E6706K39672j14211a8055E7064O6009A8229O4717Q5444g7320
$$ 25864 -83890 56706 296378 182167 -18055 57064 123073 18229 82946 168390 -77320
12891A38525a51638A46084l648C5068h6471F9818N1904L0728D6264a6889q6560
$$ 138525 -151638 146084 142436 35068 -86471 69818 121722 152450 46264 -16889 -103449
12880a03449M3366B17928a71860B9728J05335e0907l55408b264j72269N7086A21183
$$ -103449 -60083 217928 -171860 29728 135063 -50907 -406315 -2264 -174533 -117447 121183
12868e5433A66682c02242J14908c2907A69279o6045a53183G5100a8524j23507
$$ -55433 166682 -302242 -187334 -32907 169279 103234 -153183 75100 -18524 -142031
12858a42031B12211a83704F9701a37886K4104C7627K47973a38918A53710o8602
$$ -142031 212211 -183704 69701 -137886 -113782 37627 285600 -138918 153710 85108
12848H5108K34948H7907a92477e8307B6659f7569D21338p5687I0871N9940K2724
$$ 85108 320056 87907 -192477 -58307 26659 -67569 421338 345651 90871 150811 173535
12837A73535q0971a87840A03734r249j8785b74474a00227B59026a64302b697n1501
$$ 173535 92564 -187840 103734 94485 75700 -274474 -100227 259026 -164302 -2697 -54198
12826e4198F2519c86802A85319Q9226m1577o8157e6116J4203o8933G3549B2210
$$ -54198 62519 -386802 185319 274545 232968 164811 -56116 -41913 -110846 73549 22210
12814A33146J21547b22090B55480K01780B06365b33915D07909f6684A90324D1678
$$ 133146 254693 -222090 255480 457260 206365 -233915 407909 -66684 190324 41678
12803h0988A2225K19031K8337f772B8607J62998b85719N5159i9741A09162J67146
$$ -80988 12225 231256 259593 -6772 28607 191605 -285719 -230560 -99741 109162 276308
12792B76308j07568D8705J26508a42336C3807J41151o8145P1972H4162f543A62536
$$ 276308 168740 48705 175213 -142336 33807 174958 106813 178785 84162 -6543 162536
12780D2118L5819d16303a85155B14120a21289E4483L30013A09742a45788a6003
$$ 42118 77937 -416303 -185155 214120 -121289 54483 384496 109742 -145788 -16003
12769G6538i4723J1229K1362A42278K24805h0277F0914L3740A5017a44482j20035
$$ 76538 -94723 -83494 -62132 142278 367083 -80277 60914 94654 15017 -144482 -264517
12758b64517B38203d8485B50452c0014P393F1191g0420A90626I2142P4897B0586
$$ -264517 238203 -48485 250452 -30014 -22621 61191 -70420 190626 92142 167039 20586
12746E2139K14514a98809A69783r429i9675d9420g224A26848N6481o0479a5812
$$ 52139 266653 -198809 169783 160354 -99675 -49420 -7224 126848 183329 122850 -15812
12734A24429A7659K01671L52158B14109j04196j733B0976a79506h1740B6279r8
$$ 124429 17659 219330 571488 214109 109913 108180 20976 -179506 -81740 26279 26181
12723B6181L32556A54343K37743A02553a3906j36414c0153j12274E2516k2191
$$ 26181 358737 154343 392086 102553 -13906 -150320 -30153 -142427 52516 30325
12713C0325J00532I826K78899m7749G7797K80556j06016M2285A45487K01811I9456
$$ 30325 130857 9826 288725 240976 77797 358353 252337 294622 145487 347298 99456
12701B47636q4364L3324C1518E746J21769K11688A175e6668o5416d8153A25134
$$ 247636 163272 196596 31518 5746 127515 339203 1175 -56668 -122084 -48153 125134
12689H1569a69323c4370B09253D2200J69592H8000K04098p3574m2434C1747J29308
$$ 81569 -169323 -34370 209253 42200 211792 88000 292098 218524 176090 31747 161055
12678A61055E6852B6175Q0642P9093Q1399A24085N7283c4879B28209l2248a63219
$$ 161055 56852 26175 106817 185910 267309 124085 181368 -34879 228209 195961 -163219
12666b06535J2797C2313a69102A70544K24a271G6940J8026a03673D34629b4647
$$ -206535 -193738 32313 -169102 170544 170768 -1271 76940 94966 -103673 434629 -24647
12654c1376A43838L14471A06815a01672A39046M23765e1716A23664C6954l569
$$ -31376 143838 458309 106815 -101672 139046 562811 -51716 123664 36954 33385
12644C3385R733a6308A11012J77007j28209j8968k4767c1970A57577a06848A82218
$$ 33385 43118 -16308 111012 288019 159810 140842 116075 -31970 157577 -106848 182218
12632A46948E1820A9217N5942i1167C77931j13783r5042l1570b4153A62122N5395
$$ 146948 51820 19217 75159 -91167 377931 264148 169106 137536 -24153 162122 217517
12621B17517a1800N644D0616A0175K26439N7023H2783C1104i9613A46935l7849
$$ 217517 -11800 -6156 40616 10175 236614 293637 82783 31104 -99613 146935 109086
12610A09086b84716A68222i686q176B95910i5320I4152B9341h3243c5878o3574
$$ 109086 -284716 168222 -9686 -17862 295910 -95320 94152 29341 -83243 -35878 -99452
12599i9452C69669j30477h6821A56138Q4012E3685i3776j38192D27412F8380J59242
$$ -99452 369669 239192 -86821 156138 240150 53685 -93776 -231968 427412 68380 227622
12588B27622o3241f5738F1089a04680k763B46428j13082c25507H5109M1203a32952
$$ 227622 164381 -65738 61089 -104680 -107443 246428 133346 -325507 85109 126312 -132952
12576H9624a07202j77320J24507A15495a20671l1930B29766I3156l394O0250f5066
$$ 89624 -107202 -284522 -160015 115495 -120671 -152601 229766 93156 89762 150012 -65066
12564I0612l8618r771J61484e3426i543l20073d884A6869b65137E9125L480P1139
$$ 90612 51994 42223 203707 -53426 -9543 -329616 -4884 16869 -265137 59125 62605 133744
12552A33744n2146a4777N904k26300R8034q4045E4012O821a66937J3862P5041
$$ 133744 81598 -14777 -8873 -235173 -137139 -221184 54012 60833 -166937 -153075 -78034
12541g8034L3825k51807C28241H8109J9057i6557H2823J5577R5954J91418C4751
$$ -78034 -44209 -296016 328241 88109 107166 -96557 82823 98400 194354 385772 34751
12529A52069J57386j53644I189K24282M2103a14117k3978n1980E4457a5743B08915
$$ 152069 309455 155811 9189 233471 275574 -114117 -138095 -190075 54457 -15743 208915
12517E4521a13068B835J59638b39846A91960G3188A5750K165a12116B6473F593
$$ 54521 -113068 2835 162473 -239846 191960 73188 15750 17915 -112116 26473 6593
12505A31636O4835A9810K3866f3782k70671a4784l0034a1946n6308q934j83534
$$ 131636 196471 19810 43676 -63782 -334453 -14784 -44818 -11946 -68254 -77188 -260722
12494b60722h2129j13557o5791j34421a04624L2498E2817J86204J29825a05485
$$ -260722 -82129 -195686 -261477 -395898 -104624 -72126 52817 239021 368846 -105485
12483B36929p1775a26623N3660I327J07593L28221A11021J44966K3136h1463m1436
$$ 236929 165154 -126623 -72963 9327 116920 445141 111021 255987 279123 -81463 -122899
12472a22899A17905L0800i9465E1038L24843c42390A34184J7357B7991a4825B9945
$$ -122899 117905 148705 -99465 51038 375881 -342390 134184 151541 27991 -14825 29945
12460B26880G9507K36449i6384A80473P6616H2998K8847g9320A65702f1372B82966
$$ 226880 79507 315956 -96384 180473 257089 82998 111845 -79320 165702 -61372 282966
12448I8789J6854c48731a0733C154K8442a40318B27338E3337i8141B00497J35993
$$ 98789 115643 -348731 -10733 3154 31596 -140318 227338 53337 -98141 200497 336490
12437C36490b73448C12807a62271C41129A37878I1i3570A65894B4907a24114b9977
$$ 336490 -273448 312807 -162271 341129 137878 91 -93570 165894 24907 -124114 -29977
12425C694a15639I0603J11169q3812c85898a05289H3384a29821B33957j02985
$$ 3694 -115639 90603 201772 117960 -385898 -105289 83384 -129821 233957 130972
12415A30972c39096h2215r1920K1081k35529b8260n90I4285g7795q0015I5844
$$ 130972 -339096 -82215 -174135 -153054 -388583 -28260 -28850 94285 -77795 -157810 95844
12403a7520k84022J23776G0907J83810a41146I1646m882J98116A21274M1290h4251
$$ -17520 -301542 -177766 70907 254717 -141146 91646 86764 284880 121274 162564 -84251
12391E7188a20319H9470K21771a41733j17603C14684A8505a99366A66893b36528
$$ 57188 -120319 89470 311241 -141733 -259336 314684 18505 -199366 166893 -236528
12380f2133l25981A6146c4434j65377f4289k09812C74295j38731c19308E9752
$$ -62133 -388114 16146 -34434 -199811 -64289 -274101 374295 235564 -319308 59752
12369A49911D9113J35003q3647J8478A6343Q0321i1171G5444a46657q5304f3570
$$ 149911 49113 184116 100469 118947 16343 96664 -91171 75444 -146657 -231961 -63570
12357B45a70998f6660A6993H211a98063O8927k82246a49739r000B34653p6447
$$ 245 -170998 -66660 16993 8211 -198063 -129136 -411382 -149739 -158739 234653 158206
12346A58206D5329A9025L92397H7239b31853D04444k01108a25112p6965H7597
$$ 158206 45329 19025 411422 87239 -231853 404444 203336 -125112 -202077 87597
12335b16861C9509M07271r9560i3642A08469J11081M9354C8902J33537b37634
$$ -216861 39509 446780 347220 -93642 108469 219550 268904 38902 172439 -237634
12324b14728A5632J72493i4644A14304P9005b12833D9968h006M86k164A54865
$$ -214728 15632 188125 -94644 114304 193309 -212833 49968 -8006 -7520 -9684 154865
12312F8594a8051F4957Q2695c62528A8869G738J32264B6080L55223A29809a94348
$$ 68594 -18051 64957 147652 -362528 18869 7738 140002 26080 381303 129809 -194348
12300A7776b250I0005a30918B77409i7301j57564a7752C56681G3683E318b5160
$$ 17776 -2250 90005 -130918 277409 -97301 -254865 -17752 356681 73683 5318 -25160
12288D4937M3318c59217A18186P3374d2442B40296j14519g6454A03376J52570
$$ 44937 88255 -359217 118186 191560 -42442 240296 125777 -76454 103376 255946
12278B55946O06c60584A86118n9413E512J70571m0841i0699B29254a73528l8079
$$ 255946 256552 -360584 186118 126705 5512 176083 135242 -90699 229254 -173528 -211607
12267b11607a1299l62346G1110j5304b42103A5118J3534H69J9835a27681L4992
$$ -211607 -11299 -373645 71110 55806 -242103 15118 28652 869 20704 -127681 -92689
12256i2689j97892L7613D56183E5941e5207l7071D8749J36098G1404M1083L7871
$$ -92689 -290581 -252968 456183 55941 -55207 -92278 48749 184847 71404 112487 150358
12245A50358Q9820g2881F7423J05762J74304H9470g9409A1877M0017b9055D3814
$$ 150358 240178 -72881 67423 173185 347489 89470 -79409 11877 51894 -29055 43814
12233e3074A05043J34538M7414o9439A03205K46191P8576A92009K13914A83081
$$ -53074 105043 239581 286995 217556 103205 349396 427972 192009 405923 183081
12222D96896B21521H8012A7487M92056G9665a4891D40189a71435B59281F7934
$$ 496896 221521 88012 17487 509543 79665 -14891 440189 -171435 259281 67934
12211C13849j33279F8514J71208G9694M9689e5514B93104l0088A01197b50518
$$ 313849 180570 68514 239722 79694 129383 -55514 293104 263016 101197 -250518
12200B92641j43476R6514O4045B133M2394J56759E8508B6865J30864R3968O7212
$$ 292641 149165 245679 309724 2133 44527 201286 58508 26865 157729 251697 318909
12189C18909B7106J69563J22308A52728K27745m6932E5784K45667a0206A69419
$$ 318909 27106 196669 318977 152728 380473 333541 55784 301451 -10206 169419
12178a2972B33092a47541A74919K47895A45102a83579A60236g3468L0262A72089
$$ -12972 233092 -147541 174919 422814 145102 -183579 160236 -73468 -43206 172089
12167b69898A80105M2395l3011i7288C45579I4703m102K12390B9966a57166B35034
$$ -269898 180105 222500 189489 -97288 345579 94703 90601 302991 29966 -157166 235034
12155E4868k5388g6465I1718K31758A3355a29891H7312j9895j279C0446J90394
$$ 54868 29480 -76465 91718 323476 13355 -129891 87312 67417 66138 30446 220840
12144B20840l4649R4691a28166J915b0920I2328b30906B21267O4758d2787B37090
$$ 220840 186191 280882 -128166 -126251 -20920 92328 -230906 221267 286025 -42787 237090
12132a57179B6678f6631A76402G0695J45855g0598B38392b16654a6252l467o4525
$$ -157179 26678 -66631 176402 70695 216550 -70598 238392 -216654 -16252 -19719 -84244
12121h4244o0327C40943G6748L7510a48236C85286D3550d3484k79792G3280A4834
$$ -84244 -144571 340943 76748 114258 -148236 385286 43550 -43484 -323276 73280 14834
12109b03158E7335K0543K21739j39181N2138a29403r2106E5776a16988A00316
$$ -203158 57335 77878 299617 160436 212574 -129403 -221509 55776 -116988 100316
12098B11822M0856d9037D7652c6319E3760l616a13638D15972c14706J05338B34550
$$ 211822 252678 -49037 47652 -36319 53760 50144 -113638 415972 -314706 -209368 234550
12086a1798D6680K21639b06825g4502B23275K36637e2256b4690D6302J037867
$$ -11798 46680 268319 -206825 -74502 223275 459912 -52256 -24690 46302 1084169
12076A084169Q13458H91343G2816K0650K340c7166m77j72373A71219q3148a61119
$$ 1084169 1897627 891343 72816 93466 95806 -37166 -37643 -210016 171219 88071 -161119
12064g2283j33150F4797P6571p290c1603n0055A28782b63165I023a39358O2416
$$ -72283 -205433 64797 141368 134078 -31603 -81658 128782 -263165 9023 -139358 -76942
12053g6942a513j09074A3979O0351O7766E6547i4245D40626a02634o8008K6816
$$ -76942 -1513 -110587 13979 74330 142096 56547 -94245 440626 -102634 -170642 -143826
12042a43826h687A79061b36333A10685B6536R8767b3280k45208K5056B5725R0876
$$ -143826 -8687 179061 -236333 110685 26536 125303 -23280 -268488 -243432 25725 116601
12031A16601a12684j00635L221c2134F2673j6847J616b5226j02526B07171F0502
$$ 116601 -112684 -213319 -210098 -32134 62673 45826 47442 -25226 -127752 207171 60502
12019C885a3617j50912j12778B47093A13404g8288B90761p8794g4849A7899a71889
$$ 3885 -13617 -164529 -277307 247093 113404 -78288 290761 211967 -74849 17899 -171889
12007d6179r7994A4210a971G7347R3399b41949C44741a16906d2250j61487A00378
$$ -46179 -144173 14210 -1971 77347 170746 -241949 344741 -116906 -42250 -203737 100378
11995H2356a13576j11074a01192A89178a72132l1772C7823R7370a61742p9405
$$ 82356 -113576 -224650 -101192 189178 -172132 -203904 37823 135193 -161742 -241147
11985b41147c5857o1948E5957a09119B9979a17462j35641B13052n9505c8215k13019
$$ -241147 -35857 -97805 55957 -109119 29979 -117462 -253103 213052 153547 -38215 -251234
11974b51234B068f656k86705I4334J90068A8163J5953J47530K21661b4156l2902
$$ -251234 2068 -6656 -293361 94334 284402 18163 34116 181646 403307 -24156 -57058
11963e7058j06745e813l07986J52836c4618I4810k4393c80585B12971b26664a02429
$$ -57058 -163803 -5813 -313799 -160963 -34618 94810 70417 -380585 212971 -226664 -102429
11951d0157H3836K0291Q3512C9051N3937Q8851D7173c06772i4915c9613j63425
$$ -40157 83836 104127 187639 39051 92988 181839 47173 -306772 -94915 -39613 -203038
11940b03038H1361j1565k2963K15108b22465b6733p9809m086A21390J15972F4738
$$ -203038 81361 69796 46833 261941 -222465 -26733 -106542 -110628 121390 237362 64738
11928a42067b9240Q538k91796a22306r4262j65400A99074o1671c0248f449A17596
$$ -142067 -29240 -20702 -312498 -122306 -216568 -381968 199074 137403 -30248 -6449 117596
11916E2374i5313p44j31807B10180N4233C0418M31375C3907b19944A20623E8322
$$ 52374 -95313 -96057 -227864 210180 264413 30418 461793 33907 -219944 120623 58322
11904g451k8674A39436L1625b40338a2346j289m5731j11081C7330Q5329C5629
$$ -7451 -36125 139436 171061 -240338 -12346 -13635 -59366 -170447 37330 122659 35629
11892c20184q3257F521L67636a04792K6642n9085G2640B8756a62721C3380f6583
$$ -320184 -403441 6521 374157 -104792 -78150 -137235 72640 28756 -162721 33380 -66583
11880a09135B5586c5576I6595K4914a45889I1483a76235f0642k97805A71333L5100
$$ -109135 25586 -35576 96595 121509 -145889 91483 -176235 -60642 -358447 171333 206433
11869B06433b580A329Q2569J26637d4347E754N0172k7148a01491c3057A94184
$$ 206433 -2580 1329 83898 210535 -44347 5754 55926 28778 -101491 -33057 194184
11857a34582l3181D9830K7206a47187A47372j2613b37533P9640j28663R2867b898
$$ -134582 -167763 49830 77036 -147187 147372 134759 -237533 -157893 -286556 -193689 -2898
11845b37439J01163N0570A28388P0380K7413G9871f2398p3902A73145G6330K2936
$$ -237439 -136276 -85706 128388 198768 226181 79871 -62398 -136300 173145 76330 99266
11834I9266d5955m82317a82887b4463k00336a6404A24084b16807j04463K8165
$$ 99266 -45955 -528272 -182887 -24463 -224799 -16404 124084 -216807 -321270 -293105
11824b93105H4503J95230e8112G46h101k02518h0345J5838K3053l19086h5377
$$ -293105 84503 279733 -58112 746 -8101 -210619 -80345 -64507 -41454 -360540 -85377
11812A42410p451J2145a0708j87294A3041J14092K7032a94725P7733A97155b62195
$$ 142410 134959 147104 -10708 -198002 13041 127133 154165 -194725 -116992 197155 -262195
11800A25933h2551A24240A7291L57108A507c212E1887L6007l4476e1092k1209
$$ 125933 -82551 124240 17291 374399 1507 -3212 51887 87894 53418 -51092 -72301
11789g2301r3928e9739j17095B54011a18658a5650o0568B17550h3020j53985c6601
$$ -72301 -166229 -59739 -176834 254011 -118658 -15650 -76218 217550 -83020 -237005 -36601
11777e9145m1526A93350r5063a30235k56352c605A92870m3579n722c89040a00577
$$ -59145 -100671 193350 98287 -130235 -386587 -3605 192870 149291 143569 -389040 -100577
11765E56211F7424J44663C6948L2719b06326R1724A31658C9713R3479a98672d5083
$$ 556211 67424 212087 36948 69667 -206326 -114602 131658 39713 133192 -198672 -45083
11753B3129b30660e2111k29613B13918a2366p5222r6296D40990b01021B4910G370
$$ 23129 -230660 -52111 -281724 213918 -12366 -87588 -183884 440990 -201021 24910 7370
11741e8349C78926F3693i6363D39317E8288c39252A82144H9464J19771h0764B26122
$$ -58349 378926 63693 -96363 439317 58288 -339252 182144 89464 209235 -80764 226122
11729F029b08524I5961e4943C00973d78544c9016B79077b53311B72503F2572a56623
$$ 6029 -208524 95961 -54943 300973 -478544 -39016 279077 -253311 272503 62572 -156623
11717A39838a46516A69689A1508J17699O4195o1098n0609c4209m1427F6149n236
$$ 139838 -146516 169689 11508 129207 193402 132304 81695 -34209 -75636 66149 60913
11706F0913a7611k28101A27098P4207b6193q801m7765A43007c9112j68950A76893
$$ 60913 -17611 -245712 127098 201305 -26193 -34994 -82759 143007 -39112 -208062 176893
11694a80527A35901a41216d8444D419a88292A23989E6036J08345M4701a01480
$$ -180527 135901 -141216 -48444 4419 -188292 123989 56036 164381 209082 -101480
11683C45876j39889r0865C8130Q8828M4367m6093K2636J04382E3283K05454l5321
$$ 345876 205987 115122 38130 126958 171325 125232 147868 252250 53283 258737 223416
11672B23416b7610k6689j17247B32862r3080j1489J48163g2472F4057J13485a36796
$$ 223416 -27610 -54299 -171546 232862 139782 128293 276456 -72472 64057 177542 -136796
11660a64819A95921f5236H4057O3409D397b0235j1023o8225L7593D7759j5063
$$ -164819 195921 -65236 84057 147466 4397 -20235 -31258 -99483 -61890 47759 32696
11649C2696b98205a46589j2826g8317A25650q648a45070A85364e02094B86928
$$ 32696 -298205 -146589 -159415 -78317 125650 117002 -145070 185364 -502094 286928
11638a73603A85502a05216A01072c67612B4484J3108K28970n372l025H5966l2308
$$ -173603 185502 -105216 101072 -367612 24484 37592 266562 261190 258165 85966 53658
11627E3658f7051j31041A66179f9600K7625j98851i1963p5521B86489K2649i1789
$$ 53658 -67051 -198092 166179 -69600 -41975 -240826 -91963 -167484 286489 309138 -91789
11615a20467a6864j67850j60253e8625B51933G2339J71529P2453j14355d0160
$$ -120467 -16864 -184714 -344967 -58625 251933 72339 243868 316321 201966 -40160
11604a05729J360C8764h8269I4243c1413B5851M318C399a1607b675E3823L3645
$$ -105729 -104369 38764 -88269 94243 -31413 25851 30169 3399 -11607 -2675 53823 87468
11592H7468L60101d7213A04502D5767J38198a35376l2616A26132j0466A9028b94073
$$ 87468 447569 -47213 104502 45767 183965 -135376 -167992 126132 115666 19028 -294073
11580A77327e8377C51040b02124g4226A36787k6762c0377B74322K8907j07257
$$ 177327 -58377 351040 -202124 -74226 136787 110025 -30377 274322 303229 195972
11570A95972g6423a8511J966A34899J1859O8463J59215j30619B4684f6323K8030
$$ 195972 -76423 -18511 -16545 134899 146758 215221 374436 243817 24684 -66323 -38293
11559c8293j95612J07502a9886A58782C3079d1576A73225J9561b82051C33975
$$ -38293 -233905 -126403 -19886 158782 33079 -41576 173225 192786 -282051 333975
11548d9672J0109m4912p8279b2713R771B49644a89968e5268J1740p3667A44080
$$ -49672 -39563 -84475 -162754 -22713 -12942 249644 -189968 -55268 -43528 -117195 144080
11536a35754E5867L13759q9509J43724A05322i4441E5305B3242J1944A4218N3012
$$ -135754 55867 369626 280117 423841 105322 -94441 55305 23242 35186 14218 67230
11525F7230f1101A49573L64438a54189A53350K49999j78090g2142C02651q0229
$$ 67230 -61101 149573 514011 -154189 153350 403349 225259 -72142 302651 222422
11515B22422a11142E7682O1216L49757a5478j48195B7358o972g5432B45757r7476
$$ 222422 -111142 57682 118898 468655 -15478 -163673 27358 20386 -75432 245757 148281
11504A48281K8071m3854h5989p1885H8978a67195I7833A4381K55575a15605A19214
$$ 148281 176352 132498 -85989 -157874 88978 -167195 97833 14381 269956 -115605 119214
11492C35472a09277C67716r1864b98443B56470I2965c9092D42873H8463L52700
$$ 335472 -109277 367716 275852 -298443 256470 92965 -39092 442873 88463 441163
11482D41163E9178L49142j57797p1779k0089p2773K5989R596J78194I941i5924
$$ 441163 59178 408320 250523 178744 158655 85882 111871 121467 299661 9941 -95924
11470C41740E3514J54720m0137E8541J06657g2965A19155f8405e248A47910A9643
$$ 341740 53514 208234 168097 58541 165198 -72965 119155 -68405 -5248 147910 19643
11458A87272a57694d8613j03033C45052K2908c2007C26036j02137a57680J3960
$$ 187272 -157694 -48613 -151646 345052 367960 -32007 326036 223899 -157680 -143720
11448a43720A82459c51499H3223O6216l4578R5827H6478L5702a2978n3257p8148
$$ -143720 182459 -351499 83223 149439 114861 210688 86478 122180 -12978 -66235 -144383
11437a44383A80456N5606c04536b7499C00480j10933a40257k23145A42648k9865
$$ -144383 180456 236062 -304536 -27499 300480 189547 -140257 -363402 142648 112783
11427A12783J11995B4116M485j1511K69793J88634I8822b23073D5138a55249A11047
$$ 112783 224778 24116 28601 17090 286883 475517 98822 -223073 45138 -155249 111047
11415D0170a61049j4798J086k55843A24675C0795J07761a24790B22389b76562
$$ 40170 -161049 -175847 -174761 -430604 124675 30795 138556 -124790 222389 -276562
11404A9020a15197A01855C084J09300k8577a47547C4351a0869A17996m1841J39929
$$ 19020 -115197 101855 3084 112384 83807 -147547 34351 -10869 117996 76155 216084
11393B16084K8533g4340A10795C1759h2584C7194J71122F2259L8898a44916j08427
$$ 216084 244617 -74340 110795 31759 -82584 37194 208316 62259 101157 -144916 -253343
11382b53343J26552A1302a56094f4565B89720a05383k00192A61058a51507B87490
$$ -253343 -126791 11302 -156094 -64565 289720 -105383 -305575 161058 -151507 287490
11371G7543e2495b0681j12139G1357Q3063J926D8713a57608A65002b73018F2889
$$ 77543 -52495 -20681 -132820 71357 154420 156346 48713 -157608 165002 -273018 62889
11359d5578I655J5736Q262K49038c38985A81843c65487E4547J18177g4457j49608
$$ -45578 9655 25391 33653 282691 -338985 181843 -365487 54547 172724 -74457 -224065
11348b24065a7583j63793O9332A34501J37945A34993J28706a09308H9876q048
$$ -224065 -17583 -181376 -112044 134501 272446 134993 263699 -109308 89876 81828
11338H1828a32694A73355a2606A13949Q8486f7328q4082c2354a697A17322b34970
$$ 81828 -132694 173355 -12606 113949 202435 -67328 -151410 -32354 -1697 117322 -234970
11326A55715k4941b59927A68525a42938J3953f1821D6361b04791a5049r5894a2472
$$ 155715 130774 -259927 168525 -142938 -128985 -61821 46361 -204791 -15049 -110943 -12472
11314A48583j3858a0777E1114a22961M1905D0950I036a96666h3262A29518a57424
$$ 148583 134725 -10777 51114 -122961 -81056 40950 9036 -196666 -83262 129518 -157424
11302A75868a14446e4631N239k31806F157a36616F6120D568c16013a39392D0477
$$ 175868 -114446 -54631 -49392 -281198 6157 -136616 66120 4568 -316013 -139392 40477
11290G9979B6135a72555r1390J7606R9086i82k43075g8550A45982o6289J2559
$$ 79979 26135 -172555 -263945 -246339 -147253 -982 -244057 -78550 145982 79693 92252
11279I2252R31a3717j34733O6285k8983A67359G7634f5311B16052o1839b4379
$$ 92252 93183 -13717 -148450 -82165 -111148 167359 77634 -65311 216052 154213 -24379
11267i1987l1482k0086L9147j11576e8660j35116i722k09590G1674d9922j6357
$$ -91987 -123469 -143555 -104408 -215984 -58660 -193776 -9722 -219312 71674 -49922 -66279
11256f6279b5031j39099G5636j7581K62468F2588b67875G3388b6343A39827b306
$$ -66279 -25031 -164130 75636 58055 320523 62588 -267875 73388 -26343 139827 -2306
11244d10513h7748k5844c8838A24316J65725A22580b9000A0501a91835A2199P0224
$$ -410513 -87748 -113592 -38838 124316 290041 122580 -29000 10501 -191835 12199 82423
11233H2423b39465B5325a67443q2238Q8076d4150B6109O9669a05616n2450k298
$$ 82423 -239465 25325 -167443 -249681 -161605 -44150 26109 95778 -105616 -158066 -160364
11222a60364g3421E8442J8443b09336L0838l0727C48699C0227a36429K8986j10969
$$ -160364 -73421 58442 76885 -209336 -178498 -209225 348699 30227 -136429 -107443 -218412
11211b18412C38657j12185a67151P0408k66901A30228K092L4196a21344g543C7365
$$ -218412 338657 226472 -167151 -96743 -363644 130228 132320 166516 -121344 -7543 37365
11199B2858L94834f4199D4671e7674m15534a31581J6449j31004A57875L6274D0837
$$ 22858 417692 -64199 44671 -57674 -473208 -131581 -115132 -246136 157875 194149 40837
11187i7495j20647A32527N7079c6089B8157a58443j15575j8583D6793a09200H5561
$$ -97495 -218142 132527 189606 -36089 28157 -158443 -274018 -292601 46793 -109200 85561
11175B3488a14482A38329A8009M3496J60289o1802n0342E3175K4075a33002A16184
$$ 23488 -114482 138329 18009 61505 221794 159992 109650 53175 77250 -133002 116184
11163a98000c4991d566A82501J56211I6187a74159a4565A03829m2007i1850k1478
$$ -198000 -34991 -4566 182501 338712 96187 -174159 -14565 103829 61822 -91850 -113328
11152a13328M2749B28067a90171A89757a29869H0794b8664m5795m07C26922I7537
$$ -113328 -70579 228067 -190171 189757 -129869 80794 -28664 -74459 -74866 326922 97537
11140A44656a32513B10714d7678C1898h5298G4478a51340l46466B88651b39688
$$ 144656 -132513 210714 -47678 31898 -85298 74478 -151340 -497806 288651 -239688
11129B00750A3152a26886A28793d4243m42897B27275A7812J30438A7501a78724
$$ 200750 13152 -126886 128793 -44243 -487140 227275 17812 148250 17501 -178724
11118A19660a44098A60927D2013a7149j30961c7217N04I4052P9869F7347a58052
$$ 119660 -144098 160927 42013 -17149 -148110 -37217 -36713 94052 173921 67347 -158052
11106B04490J57534j03799A18202a25083c2850A89861l7110R6918A15967l8740
$$ 204490 362024 258225 118202 -125083 -32850 189861 152751 249669 115967 77227
11096G7227J95900A07991J11696j09732K27378D0648N5949K13767E9804J67950
$$ 77227 273127 107991 219687 109955 337333 40648 96597 310364 59804 227754
11086B27754j7089J48690j28848J57882b40790B09761H9407J02094O7631q8881
$$ 227754 210665 359355 230507 388389 -240790 209761 89407 191501 259132 170251
11076A70251K17266A00841L73638j24724j73778P6174C24N47260k68126Q1950
$$ 170251 387517 100841 474479 349755 175977 252151 324 547584 279458 361408
11066C61408J94713k37502J38611J34966k04830J0414J57928j88423Q6808K9760
$$ 361408 556121 318619 457230 592196 387366 397780 555708 367285 454093 483853
11056D83853J479P4621j77890L88863k11419l8551N5035M53777m42394L17349
$$ 483853 485332 559953 382063 770926 559507 520956 575991 1029768 587374 904723
11046I04723l89283K11457k61137M68713D59670J772N63569l57511r190k74498
$$ 904723 515440 726897 465760 934473 459670 461442 1025011 667500 658310 383812
11036C83812J09165j06518J72140K77111k50162j72086K26523J07600q4037j5916
$$ 383812 492977 386459 558599 835710 585548 413462 639985 747585 663548 647632
11026F47632q4782K20306L240l74361M55807l66058J3662Q1542B89005J74934
$$ 647632 562850 783156 786396 412035 867842 501784 515446 596988 289005 463939
11016D63939P3694j0299j62021L30141k4247J8398j65514R8028j41107p6316J52822
$$ 463939 537633 527334 365313 695454 671207 689605 524091 622119 481012 404696 557518
11005E57518p0828O7101O3216j48675K24822k2114K16433D32298M57587l26347
$$ 557518 486690 553791 617007 468332 693154 671040 887473 432298 889885 563538
10995E63538J42075k4563j74395k1628J24086k47913K28890K81778P6429Q6946
$$ 563538 705613 681050 506655 485027 609113 361200 590090 871868 948297 1035243
10985A035243P4934l17663J44032K96332l27876L59476K12390k27470L10825j90983
$$ 1035243 1110177 792514 936546 1232878 905002 1264478 1476868 1249398 1560223 1369240
10975A369240M16015M73380Q3040M07618k2667l15575N0761m89116K84972m72761
$$ 1369240 1785255 2258635 2341675 2749293 2726626 2411051 2461812 1972696 2257668 1784907
10965A784907j28877k27753L288Q9654J29031r6371k20262P7749N985k55752J101
$$ 1784907 1656030 1428277 1431565 1521219 1650250 1553879 1333617 1411366 1417351 1161599 1162700
10954A162700K53607l12198J53555k17740k49790M2739C80620j4968j2356P8397
$$ 1162700 1416307 1104109 1257664 1039924 790134 832873 380620 365652 353296 431693
10944D31693n3576j26071J16194b06608C27566k5609j47548o169a63803A40249
$$ 431693 378117 252046 368240 -206608 327566 301957 154409 148240 -163803 140249
10933A86911J64934g9992A38405a53661k49988D0840a40544C47873c9873j19401
$$ 186911 351845 -79992 138405 -153661 -403649 40840 -140544 347873 -39873 -159274
10923a59274D43709B08634j7276L6411b2314n5387q484I512K31667R6081a41942
$$ -159274 443709 208634 191358 227769 -22314 -77701 -86185 9512 241179 337260 -141942
10911A03342O3422g6827B18226G5367K99022a54079A00143f6438f867A84818i4610
$$ 103342 166764 -76827 218226 75367 374389 -154079 100143 -66438 -6867 184818 -94610
10899a46941q099A64349E3266K18175J7371j11063a37590A65846h8020D9674J28827
$$ -146941 -155040 164349 53266 271441 288812 177749 -137590 165846 -88020 49674 178501
10888A78501D6994a32736A24617c47823B81477b37794e6341A67316b77179B14215
$$ 178501 46994 -132736 124617 -347823 281477 -237794 -56341 167316 -277179 214215
10877D5140b34302C46712h4509A01911l9779K8869A1369c8406j1835l4791J265
$$ 45140 -234302 346712 -84509 101911 62132 91001 11369 -38406 -50241 -85032 -83767
10866h3767l1150b8361l3607l4978j05051B98466g4246E0859J0825b86172J01710
$$ -83767 -114917 -28361 -61968 -96946 -201997 298466 -74246 50859 61684 -286172 -184462
10855a84462A50365J4473f6270L1248k38958A64598N2989p3897D054a54198B08960
$$ -184462 150365 164838 -66270 -35022 -273980 164598 217587 143690 4054 -154198 208960
10843B3825a34190H8623a52318B62617e6374B9368b36724A98889a42439A23610
$$ 23825 -134190 88623 -152318 262617 -56374 29368 -236724 198889 -142439 123610
10832b02362A36459E7951a1000F7684k2659C143a95961N5272J7360C02325F3798
$$ -202362 136459 57951 -11000 67684 45025 3143 -195961 -140689 -123329 302325 63798
10820a49427B38438g0514l55764E6774i5455o9170G2402e1095h739B1099c0616
$$ -149427 238438 -70514 -426278 56774 -95455 -164625 72402 -51095 -8739 21099 -30616
10808A27632h4786C70655h5391a3525A66334a57114P8240J3217l342j5793j02489
$$ 127632 -84786 370655 -85391 -13525 166334 -157114 -78874 -65657 -68999 -84792 -187281
10797a87281A19445A5068L4495b12464B10666K6208a53371a3858D2632b49208
$$ -187281 119445 15068 49563 -212464 210666 236874 -153371 -13858 42632 -249208
10786b59971N0547C42189i7336m5857l22849B48939K5013a92394d4135j26743
$$ -259971 -209424 342189 -97336 -143193 -466042 248939 273952 -192394 -44135 -170878
10776a70878b6381F275J87067J75174a98698b865A86087h5184l27446B8990J15084
$$ -170878 -26381 6275 193342 368516 -198698 -2865 186087 -85184 -412630 28990 144074
10765A44074a00133m4509B00770a719F8942a3694A47513d97692a54931k31007
$$ 144074 -100133 -144642 200770 -1719 68942 -13694 147513 -497692 -154931 -385938
10755c85938g6330j32826g2806j10441P4295A26046o0683b05055B21857e6173
$$ -385938 -76330 -209156 -72806 -183247 -108952 126046 65363 -205055 221857 -56173
10744H5255J83503j19409a81893D05K33809E5653a17479j38949D0331j5078a92690
$$ 85255 268758 149349 -181893 405 234214 55653 -117479 -256428 40331 25253 -192690
10732c01394A94526c56802G2650C5026b64326N5235f5519p090E5820b14485j47180
$$ -301394 194526 -356802 72650 35026 -264326 -209091 -65519 -72609 55820 -214485 -361665
10721c61665A53745c19212B05886c443A50092C8803M8305a44363A28689a57545
$$ -361665 153745 -319212 205886 -3443 150092 38803 87108 -144363 128689 -157545
10710b13525L6332E6995J11574A6824L6713k911f3344k67451a36560H2830q689
$$ -213525 -177193 56995 168569 16824 53537 50626 -63344 -330795 -136560 82830 74141
10699G4141D088h6538O718j49182H8458a66053e0426E215J37864a36078B21551
$$ 74141 4088 -86538 -79820 -229002 88458 -166053 -50426 5215 143079 -136078 221551
10687h6222l71462D7388a90729C23351B3477d5070B71706a74704d0289j36442
$$ -86222 -457684 47388 -190729 323351 23477 -45070 271706 -174704 -40289 -176731
10677a76731c1574k75292J00900H9072L0903a37363p3392A35417g3420E6898b79331
$$ -176731 -31574 -306866 -205966 89072 119975 -137363 -210755 135417 -73420 56898 -279331
10665a39593j9104O3551k78040E8450g5462D9127F760g1656k08817h030q0437
$$ -139593 -158697 -95146 -373186 58450 -75462 49127 6760 -71656 -280473 -8030 -88467
10654h8467B0646M6587c12293a36263d2806a4683j62290A00298a7126k51673R4822
$$ -88467 20646 67233 -312293 -136263 -42806 -14683 -176973 100298 -17126 -268799 -173977
10643a73977L6725J8813e4491E1102d169F186Q5089a68443j64053A32735k0275
$$ -173977 -137252 -118439 -54491 51102 -4169 6186 91275 -168443 -332496 132735 112460
10632A12460a22897N9215B58146d026n9311n9647l95812a59144d5829D4865a90822
$$ 112460 -122897 -63682 258146 -4026 -63337 -122984 -518796 -159144 -45829 44865 -190822
10620a9539j12235C9516i1227C2364A0096J3332A433g2459R031a2706B26902a80479
$$ -19539 -131774 39516 -91227 32364 10096 23428 1433 -72459 -63428 -12706 226902 -180479
10607b4602k69086h0801F6309b7532R960B51960b47366b2753j2216F5704a78081
$$ -24602 -293688 -80801 66309 -27532 -17572 251960 -247366 -22753 -34969 65704 -178081
10595i1037C15787D3420K51705B9907c37729a13344c9597n92369D5182a85447
$$ -91037 315787 43420 295125 29907 -337729 -113344 -39597 -631966 45182 -185447
10584b5439A0421N3143J66423j13431b10041R6751D2397a34857J0169A02687e0675
$$ -25439 10421 63564 229987 116556 -210041 -113290 42397 -134857 -124688 102687 -50675
10572a1953B84741j40343b48252I5025d2867A53948i2946r0233A18832n5912J8760
$$ -11953 284741 144398 -248252 95025 -42867 153948 -92946 -183179 118832 62920 81680
10561H1680a25010F4536b46493j58740R9332D8888b03651j56668e7795B00574
$$ 81680 -125010 64536 -246493 -405233 -305901 48888 -203651 -360319 -57795 200574
10550a34240B7148L1039J35871b98934e9524k44143A50550c31832J17802d0473
$$ -134240 27148 58187 194058 -298934 -59524 -303667 150550 -331832 -214030 -40473
10539a58638A46316P1994j00056m9189b74169C5222d9534A30915b92998a35523
$$ -158638 146316 218310 118254 69065 -274169 35222 -49534 130915 -292998 -135523
10528B470a65361c8637C20473A17435a9929k4623A10541b5497J2059N298l1616
$$ 2470 -165361 -38637 320473 117435 -19929 -44552 110541 -25497 -13438 -8140 -39756
10517c9756j44251D5644a85861A24005r405b45806C12327a46739A13161j6979
$$ -39756 -184007 45644 -185861 124005 114600 -245806 312327 -146739 113161 96182
10507I6182a72757A21757k5214l479a32169B74658a3889B62389j24991Q6930N5568
$$ 96182 -172757 121757 96543 93064 -132169 274658 -13889 262389 137398 224328 279896
10496B79896b29313j32508e4203o6632C7698L60129D7294b38878B08549d3995
$$ 279896 -229313 -361821 -54203 -120835 37698 397827 47294 -238878 208549 -43995
10485A8762c54196C43565p4117a60897E06356k23954G761d11j11511I4471a01854
$$ 18762 -354196 343565 269448 -160897 506356 282402 7761 -411 -111922 94471 -101854
10473B03972a73937F3791P9634a33393A14249n972a14451A3189c17923f1894A48809
$$ 203972 -173937 63791 143425 -133393 114249 108277 -114451 13189 -317923 -61894 148809
10461c9093a0055D05642f9844a378C7985K50184j43354a4945o8072k2568l29601
$$ -39093 -10055 405642 -69844 -1378 37985 288169 144815 -14945 -83017 -105585 -435186
10450d35186a29292q7435K2189A32917J70759c92284C68621A22802f2600A92159
$$ -435186 -129292 -216727 -194538 132917 303676 -392284 368621 122802 -62600 192159
10439B86830P5198a21808F2580b90127I328J37551e5049F5570c46879C7966d20944
$$ 286830 362028 -121808 62580 -290127 9328 146879 -55049 65570 -346879 37966 -420944
10427c8437E9829B7479d2690A35354a97864P0216I7326c09208a20419l0774p4589
$$ -38437 59829 27479 -42690 135354 -197864 -127648 97326 -309208 -120419 -151193 -225782
10416b25782j6011J10558C34995b08150B20589A3950b77405B30606c0932n3499
$$ -225782 -241793 -131235 334995 -208150 220589 13950 -277405 230606 -30932 -84431
10406h4431j03314p8057A01532L0765A5400a56960d6520A51424A5065R2082C6249
$$ -84431 -187745 -265802 101532 132297 15400 -156960 -46520 151424 15065 107147 36249
10394a00594c066j94590B99422E9830e917B04384c2451E9787J1184B3147f2753
$$ -100594 -3066 -197656 299422 59830 -5917 204384 -32451 59787 70971 23147 -62753
10382b2036A14376J45166C2029M41026A52957b320j4020F1495L71397g6257A28211
$$ -22036 114376 259542 32029 473055 152957 -2320 -16340 61495 432892 -76257 128211
10370B45762J83328j80961J32688J20688j92561j06100N97360B34564a2220o3235
$$ 245762 429090 248129 380817 501505 308944 202844 800204 234564 -12220 -75455
10360g5455B17979D8984N6477J20618H7954j8772K21454j37774m2787M72954o3270
$$ -75455 217979 48984 105461 226079 87954 69182 290636 152862 110075 583029 519759
10349E19759j71365P0503B02792K10075j87932J84468j52117K9720p9934M9682
$$ 519759 348394 418897 202792 412867 224935 409403 257286 287006 207072 256754
10339B56754m7709K1444a668C67168J16199r2194r8189B0795a69242G5510g7003
$$ 256754 209045 230489 -1668 367168 483367 391173 292984 20795 -169242 75510 -77003
10327B04180a59141g0313A52037D7622M1454J11872C3309l453J18980a82039B28352
$$ 204180 -159141 -70313 152037 47622 89076 200948 33309 29856 148836 -182039 228352
10315c9587q1110k34178A75726j8570D0272g7295m3718N546N3727B17464a29729
$$ -39587 -120697 -354875 175726 157156 40272 -77295 -121013 -115467 -61740 217464 -129729
10303D4139P1350b5241B74538i0216E1525a14844o172D27536f5247n234j07336
$$ 44139 115489 -25241 274538 -90216 51525 -114844 -121016 427536 -65247 -70481 -177817
10292a77817D2978c6824j09995m3970B66783a15141A27725a09128m9458j08909
$$ -177817 42978 -36824 -146819 -190789 266783 -115141 127725 -109128 -158586 -267495
10282b67495F485K99457d0487p6051q4494d5035D1581K038P5456e1259D04L94684
$$ -267495 6485 305942 -40487 -116538 -201032 -45035 41581 43619 119075 -51259 404 395088
10270C95088E8362J24906b67554F957l90b64342C4692a46039A15782L33779k14700
$$ 395088 58362 183268 -267554 6957 6567 -264342 34692 -146039 115782 449561 234861
10259B34861N7441Q1047F6776K72331A37625J33216q518b88782J27277k44230
$$ 234861 292302 373349 66776 339107 137625 270841 262323 -288782 -161505 -405735
10249d05735P5351J52216o8437E7062R4041e402A23492e6072B74404O0667H1879
$$ -405735 -330384 -178168 -246605 57062 151103 -5402 123492 -56072 274404 335071 81879
10237i0762b2063j88016Q2427a5835C9008J8453a4793m50733J15339R2277h3169
$$ -90762 -22063 -210079 -127652 -15835 39008 57461 -14793 -465526 -350187 -257910 -83169
10225F5244k9177J27106B2102b13234D9547d2639A9864b99763c1086C30761c48103
$$ 65244 36067 163173 22102 -213234 49547 -42639 19864 -299763 -31086 330761 -348103
10213a71277g152A60913B6585a14045j05914N9549k8645A86657b13248F0597f9854
$$ -171277 -7152 160913 26585 -114045 -219959 -160410 -189055 186657 -213248 60597 -69854
10201G322a19447m8101C52393a85623P8487M1469A83905a29546j16973j0785E6093
$$ 7322 -119447 -167548 352393 -185623 -107136 -65667 183905 -129546 -246519 -257304 56093
10189H1231l2895f6753l45792a46889K5875q5301P1563c6550B77964c0693I7460
$$ 81231 48336 -66753 -412545 -146889 -121014 -206315 -134752 -36550 277964 -30693 97460
10177A39799m9730b30830P779H6071A5543d4484H5493d2402E2009J72214d820
$$ 139799 90069 -230830 -223051 86071 15543 -44484 85493 -42402 52009 224223 -4820
10165c50173g8237j04491h7977A59375D3815e468p7652b0955B16365b50550g9197
$$ -350173 -78237 -182728 -87977 159375 43815 -5468 -83120 -20955 216365 -250550 -79197
10153a72286c7289B29114A07086h2911j14427E9499d854l36847d6461o2099J7348
$$ -172286 -37289 229114 107086 -82911 -197338 59499 -4854 -341701 -46461 -108560 -91212
10142i1212n3262p7897A27085b55212H7185Q864b67975h3597j77149l6418f8576
$$ -91212 -144474 -222371 127085 -255212 87185 96049 -267975 -83597 -260746 -297164 -68576
10130c64007f2890n5060H1386J13699e36175a7537B54831r9103a85497l553g8181
$$ -364007 -62890 -117950 81386 195085 -536175 -17537 254831 155728 -185497 -189050 -78181
10118A64647J2213b71340J10623L7548M0786A22517a63845N7049B05147a1261
$$ 164647 176860 -271340 -160717 -123169 -82383 122517 -163845 -106796 205147 -11261
10107A32714a74598B2578Q8698a76672I393J30242f4661k60162j7735C9987K16513
$$ 132714 -174598 22578 111276 -176672 9393 139635 -64661 -324823 -342558 39987 256500
10096B56500B0729P2214c54696h074q4311r5207j09609D48086A72173j0218i2498
$$ 256500 20729 92943 -354696 -8074 -92385 -187592 -297201 448086 172173 161955 -92498
10084A18601F593a51487K9805A21222B0767J5777e6462k85840A985a09322H092
$$ 118601 6593 -151487 -121682 121222 20767 36544 -56462 -342302 1985 -109322 8092
10072G7256C0954c6441e296j29173B72468i0823I371b10801g5052L1206r4392
$$ 77256 30954 -36441 -5296 -134469 272468 -90823 9371 -210801 -75052 -43846 -138238
10061a38238c4113H5329i8472k68659b312l23570a45018M919A45859a47374R018
$$ -138238 -34113 85329 -98472 -367131 -2312 -325882 -145018 -140099 145859 -147374 -138356
10050a38356e0054C74920b32252b9677A79352b05519e9923j03783d9028F7928
$$ -138356 -50054 374920 -232252 -29677 179352 -205519 -59923 -163706 -49028 67928
10039A39913a77946P263N2141A08117C4337b8938o1640L8236j91101R0447a860
$$ 139913 -177946 -170683 -118542 108117 34337 -28938 -90578 -52342 -243443 -152996 -1860
10027f0462E8253J1368A5821b28615k4565B86908d3293A58063B5850c23509F9578
$$ -60462 58253 69621 15821 -228615 -253180 286908 -43293 158063 25850 -323509 69578
10015a82272A38472e480A27093D1973K7840g0271J9087H578a8930k46335C1026
$$ -182272 138472 -5480 127093 41973 69813 -70271 -51184 8578 -18930 -265265 31026
10003B29983a98866H0261e6380L196A3138e5941k07161c1625A8536h6916B08665
$$ 229983 -198866 80261 -56380 -53184 13138 -55941 -263102 -31625 18536 -86916 208665
9991a29781f3383j4999j229q0944q1820q1062A89911b7149p1298j18519H4487
$$ -129781 -63383 -78382 -79611 -160555 -242375 -323437 189911 -27149 -98447 -216966 84487
9979a41411j36683E1619b71087A01136J98104a69476A0135c14642D3488a92943
$$ -141411 -278094 51619 -271087 101136 299240 -169476 10135 -314642 43488 -192943
9968e5383a9362r7797G1649i4962j49998M7769d094C99146A22711b84895E3183
$$ -55383 -19362 -117159 71649 -94962 -244960 -197191 -4094 399146 122711 -284895 53183
9956b28260L4861B6420J70570e6018a335l3644A85070G4136a74387j10657c2048
$$ -228260 -193399 26420 196990 -56018 -1335 -34979 185070 74136 -174387 -285044 -32048
9944A04432f8812K7514A7986a75787b6719A53879K53661g3861D2616M8614d73452
$$ 104432 -68812 -41298 17986 -175787 -26719 153879 407540 -73861 42616 91230 -473452
9932a62775o8306O0517l18419a8466k9666j61557M7976A24068c8367j44362e7411
$$ -162775 -231081 -170564 -488983 -18466 -48132 -209689 -161713 124068 -38367 -182729 -57411
9920B2676O3740J2961b3337A43737c40915E3066d4167j34434A61827a80524I3241
$$ 22676 86416 99377 -23337 143737 -340915 53066 -44167 -178601 161827 -180524 93241
9908c49608a06001C376O3429a01301A15962D9699a23486b0580j76267O2335c627
$$ -349608 -106001 3376 66805 -101301 115962 49699 -123486 -20580 -196847 -134512 -3627
9896A6328L52390A41417a46966J0894m5604G906b8215K158j57663l5142B43639
$$ 16328 368718 141417 -146966 -136072 -181676 7906 -28215 -26057 -183720 -218862 243639
9884a28244j8605o1329C57263j41315H7068e5938f944k44205j11322a69012k41772
$$ -128244 -146849 -208178 357263 215948 87068 -55938 -6944 -251149 -362471 -169012 -410784
9873d10784a64892F8706b60851a16828E3415g8073q6670B77188r0786J67863j67401
$$ -410784 -164892 68706 -260851 -116828 53415 -78073 -164743 277188 186402 354265 186864
9862A86864G8784a89097C37431b63800J9509J12103n6699o179c0176C2395A1399
$$ 186864 78784 -189097 337431 -263800 -244291 -132188 -188887 -195066 -30176 32395 11399
9850c2490j52067a0511B6283J76292b08202c914q2689k8469a2216j14482q237
$$ -32490 -184557 -10511 26283 202575 -208202 -3914 -86603 -115072 -12216 -126698 -134935
9839a34935C81838a59978A85778k6260a98724c1799j49293A28016m7594k3937
$$ -134935 381838 -159978 185778 159518 -198724 -31799 -181092 128016 80422 56485
9829E6485Q6468b99262f1017r96m7755A06563b01809O1137A25261K8873b72231
$$ 56485 142953 -299262 -61017 -62013 -109768 106563 -201809 -140672 125261 154134 -272231
9817A23088E6270Q8611i6520c3720j74985e1913G6165a49990B2603b30835j26996
$$ 123088 56270 144881 -96520 -33720 -208705 -51913 76165 -149990 22603 -230835 -357831
9806c57831Q9757H5746M8012c58012J27057a05340C0630O0361a79251D919b75704
$$ -357831 -268074 85746 133758 -358012 -230955 -105340 30630 90991 -179251 4919 -275704
9794c4845j79311A12147a06280c287k68361b0518B01740a4206r1680B5771N1108
$$ -34845 -214156 112147 -106280 -3287 -271648 -20518 201740 -14206 -105886 25771 76879
9783G6879a81462L1753A43232C3966a27529A69470h919A2896d25848q3263G0885
$$ 76879 -181462 -149709 143232 33966 -127529 169470 -8919 12896 -425848 -509111 70885
9771e51791e9354B1734c97477e1208K0596l10363B27360b04943c4632k53156a0951
$$ -551791 -59354 21734 -397477 -51208 -30612 -340975 227360 -204943 -34632 -287788 -10951
9759b14995l6076Q6161b5460j72291n1264A71321h998q7688k62541f6168r8455
$$ -214995 -251071 -164910 -25460 -197751 -249015 171321 -8998 -96686 -359227 -66168 -164623
9748a64623E885J5713c3555G3608d6933D2155a41147B42537d60875A1734c6085
$$ -164623 5885 21598 -33555 73608 -46933 42155 -141147 242537 -460875 11734 -36085
9736B02596F4538a7970C34834C1204a99517e7747A52344n1013b55175A89751e2323
$$ 202596 64538 -17970 334834 31204 -199517 -57747 152344 101331 -255175 189751 -52323
9724i4414A03637a90266K0389j4790A14809K160b13648j3335j4319R6004N0741
$$ -94414 103637 -190266 -169877 -184667 114809 116969 -213648 -226983 -241302 -145298 -94557
9713i4557D2503a08905j20283L0056L1790E5531R3914e6899k20031l2055C29110
$$ -94557 42503 -108905 -229188 -199132 -167342 55531 149445 -56899 -276930 -308985 329110
9701B81783a17944k13120B81817g2281k56751A22815e5357A07997a15689l7877
$$ 281783 -117944 -331064 281817 -72281 -329032 122815 -55357 107997 -115689 -153566
9691a53566d8483j26469k23348a8399j52702N5410D2555h2180A06879a08301f83
$$ -153566 -48483 -174952 -398300 -18399 -171101 -115691 42555 -82180 106879 -108301 -683
9679A530J7096b19978A1383N7552K92843D2508A4857g320B7830i0253A61350J44589
$$ 1530 18626 -219978 11383 68935 361778 42508 14857 -7320 27830 -90253 161350 305939
9667C05939A47983b01171A56512k5150j8501K4946a66572A3315b15255B23063
$$ 305939 147983 -201171 156512 131362 112861 137807 -166572 13315 -215255 223063
9656a77064C8313J36014a85923A157c3184a5198j37383M366H8160D0968b36273
$$ -177064 38313 174327 -185923 1157 -33184 -15198 -152581 -148215 88160 40968 -236273
9644a93851H4098b57670a22582l6734F8594k8126j0867c27004R9041k7008G8244
$$ -193851 84098 -257670 -122582 -159316 68594 40468 29601 -327004 -227963 -254971 78244
9632b09712h3362j5536k18675A77245e0209l8900k2552j37163E0151b65467N0741
$$ -209712 -83362 -98898 -317573 177245 -50209 -89109 -111661 -248824 50151 -265467 -214726
9621b14726j10643A32612E7944b06749R3430E0371a77069J4317C1203O695f2593
$$ -214726 -325369 132612 57944 -206749 -113319 50371 -177069 -162752 31203 37898 -62593
9609F4362a91144F1013b3378C9632b32660A02301m7792Q782f7084K1287B01119
$$ 64362 -191144 61013 -23378 39632 -232660 102301 54509 63291 -67084 -45797 201119
9597A71900f5122l9462C5071b26544b838l0854r9352A80606d26714C6812K6518
$$ 171900 -65122 -104584 35071 -226544 -2838 -33692 -133044 180606 -426714 36812 63330
9586F3330a08450N3499A1768N3121J25328q3113J22766a84307m6259c2628A44079
$$ 63330 -108450 -54951 11768 64889 190217 107104 229870 -184307 -230566 -32628 144079
9574B26093g0866k20810A46349J38812d02991J58052g2762H5866a45043G9617
$$ 226093 -70866 -291676 146349 285161 -402991 -244939 -72762 85866 -145043 79617
9563c16418k5567H0374J64949g1489b7344G6685Q072r857a24551c8460k42208
$$ -316418 -341985 80374 245323 -71489 -27344 76685 84757 74900 -124551 -38460 -280668
9552b80668J20994n4717d4366F6886b81823a29514b5741l3990G63d23548D5785
$$ -280668 -159674 -214391 -44366 66886 -281823 -129514 -25741 -59731 763 -423548 45785
9540a72477A31144b42359q0048a05595I128c64519f340I9630a1628k18261D4237
$$ -172477 131144 -242359 -322407 -105595 9128 -364519 -6340 99630 -11628 -229889 44237
9528b03475f5177k04611R7774e3713a9966q3970j26149B53754i6993j2311J9170
$$ -203475 -65177 -269788 -172014 -53713 -19966 -103936 -230085 253754 -96993 -109304 -90134
9517i0134K0570j02079K1763o6995A09567L5300a62955H0310B8220e175k68653
$$ -90134 -69564 -171643 -149880 -216875 109567 144867 -162955 80310 28220 -5175 -273828
9506b73828f3248k34159I524a88491j10898c2584r0480H5258R3999h6326j89530
$$ -273828 -63248 -297407 9524 -188491 -299389 -32584 -123064 85258 179257 -86326 -275856
9495b75856G6448c4016B48710d6599k27150B59609d4846B12594a93947Q0235B48745
$$ -275856 76448 -34016 248710 -46599 -273749 259609 -44846 212594 -193947 -113712 248745
9483f84646g2206l0651o030A05133a32871A39738L25379B6409b8923j79739n2556
$$ -684646 -72206 -102857 -108887 105133 -132871 139738 465117 26409 -28923 -208662 -261218
9472b61218d3940p4633L8517A34021a11703A8205J3844d3109k2187k9161j05536
$$ -261218 -43940 -118573 -80056 134021 -111703 18205 32049 -43109 -65296 -94457 -199993
9461a99993q3927a3721p3056A12924c59986J01788h6868A04874a14285M4248A25077
$$ -199993 -283920 -13721 -86777 112924 -359986 -258198 -86868 104874 -114285 -70037 125077
9449d01085A13062I452c8521l943A41285b05258C37789c25375H5887P1351c12697
$$ -401085 113062 9452 -38521 -42464 141285 -205258 337789 -325375 85887 157238 -312697
9437a97403d9725B8653J70843g4419j2285E6197a52383C77338e2573O678C1752
$$ -197403 -49725 28653 199496 -74419 -86704 56197 -152383 377338 -52573 -45895 31752
9425a92126l25353A4134N9758b09406j43056F4373h6221a6449A77496a70749j63996
$$ -192126 -517479 14134 73892 -209406 -352462 64373 -86221 -16449 177496 -170749 -334745
9414c34745O4000A84701i2816A31826b4089E1416B0036b32493A11830i134k06367
$$ -334745 -270745 184701 -92816 131826 -24089 51416 20036 -232493 111830 -9134 -215501
9403b15501B3961d1465A87110j768e5018A39155A7713f4864j82944M085A27047
$$ -215501 23961 -41465 187110 185342 -55018 139155 17713 -64864 -247808 -243723 127047
9391G8112d3147k5224k12028F4550J79205a64700r8383K6644L6428g2904C0390
$$ 78112 -43147 -68371 -280399 64550 243755 -164700 -263083 -236439 -200011 -72904 30390
9379I7631a05476A26183b0185j06764c5921A57902a15281m14851a36462K3240
$$ 97631 -105476 126183 -20185 -126949 -35921 157902 -115281 -530132 -136462 -113222
9369a13222j36436h2629A0934K1792b84465O345Q630M0272n0845A31224L761c53201
$$ -113222 -249658 -82629 10934 32726 -284465 -278120 -269490 -229218 -280063 131224 134985 -353201
9356D803b41171B00480a30310b9446r3455r9749J6385B17598e3997B21726i5496
$$ 4803 -241171 200480 -130310 -29446 -122901 -222650 -206265 217598 -53997 221726 -95496
9344f1789A97149J02220C9184N7446J1123J7120C2265K72745b33089N5086n1265
$$ -61789 197149 299369 39184 96630 107753 124873 32265 305010 -233089 -178003 -229268
9333b29268e5269a4957A82550c1775o0990a4636j80104L0180b1109m1837a2620
$$ -229268 -55269 -14957 182550 -31775 -92765 -14636 -194740 -164560 -21109 -62946 -12620
9321b82518M5041a14239H3517i6692K1757j58762f4302m1785M8477i376A56464
$$ -282518 -237477 -114239 83517 -96692 -74935 -233697 -64302 -106087 -57610 -9376 156464
9309a76599G8668e5633H9539r740a03886A50322p3615D713d64360A91104L9719
$$ -176599 78668 -55633 89539 79799 -103886 150322 76707 4713 -464360 191104 230823
9298B30823o8624J579a53571J041a9101j24861B28147D3849b05426Q1149m302
$$ 230823 162199 163778 -153571 -152530 -19101 -143962 228147 43849 -205426 -124277 -128579
9287a28579j06159e0121J1566C08027c48223C15814F8038k473A8776g4320j70252
$$ -128579 -234738 -50121 -38555 308027 -348223 315814 68038 65565 18776 -74320 -244572
9276b44572A0739a50221j43902k6226B09430d0563P736D9405A1278g6051A0981
$$ -244572 10739 -150221 -294123 -320349 209430 -40563 -32827 49405 11278 -76051 10981
9264a30008A5850b3258j39366r0366H8784b4792j55457G3075a03922R705A94792
$$ -130008 15850 -23258 -162624 -252990 88784 -24792 -180249 73075 -103922 -94217 194792
9252a4276j29009l01608A36249b38441A78878G1147e6010j23728E8694b4677o1298
$$ -14276 -143285 -444893 136249 -238441 178878 71147 -56010 -179738 58694 -24677 -85975
9241h5975A87300p7196b50655J6258Q8995B3170h4001j50033Q1326P1591r9403
$$ -85975 187300 110104 -250655 -234397 -145402 23170 -84001 -234034 -152708 -81117 -180520
9230a80520C45839i8612l2641I7262j7821A8922h0176j17819A56860b930m12377
$$ -180520 345839 -98612 -131253 97262 79441 18922 -80176 -197995 156860 -2930 -415307
9219d15307B9707a10572j52598e659B3770J54954g0191j94610f6411k12081a6118
$$ -415307 29707 -110572 -263170 -5659 23770 178724 -70191 -264801 -66411 -278492 -16118
9207A813O4948c14732G8044Q857b46029i5991n7646A04822b10905R2580k5286
$$ 1813 66761 -314732 78044 86901 -246029 -95991 -153637 104822 -210905 -118325 -143611
9196a43611A37596b71353E3963a6281j88822f6201J5219B05832b21866J7175A74555
$$ -143611 137596 -271353 53963 -16281 -205103 -66201 -50982 205832 -221866 -204691 174555
9184H0199e2438A05218a73628c261p510A18769l3919a64924M9498k40217a1758
$$ 80199 -52438 105218 -173628 -3261 -10771 118769 84850 -164924 -115426 -355643 -11758
9172a5583j9081j30206j21608c764A00381j988b39737J8757a6475F7291B4975
$$ -15583 -34664 -164870 -286478 -3764 100381 98393 -239737 -220980 -16475 67291 24975
9160A20872i4590M6716k80073R3285a05010E2823g1666l1592A40242D7186b95362
$$ 120872 -94590 -47874 -327947 -234662 -105010 52823 -71666 -103258 140242 47186 -295362
9148a42475D5343e2153C9748K65723P0029G6679a02073j43414e9197K6575j31340
$$ -142475 45343 -52153 39748 305471 375500 76679 -102073 -245487 -59197 -32622 -163962
9137a63962h14j90841i3171l765F1971i2856j47483B27373a3115B9328J4591j8295
$$ -163962 -814 -191655 -93171 -96936 61971 -92856 -240339 227373 -13115 29328 43919 25624
9125B5624a01314A20735a82253g0707r6018a0294B03364d9195j28522b3818A05885
$$ 25624 -101314 120735 -182253 -70707 -166725 -10294 203364 -49195 -177717 -23818 105885
9113A63999g4165m09182e1907k27584A45143a76628b2215D26462c5701j02234
$$ 163999 -74165 -483347 -51907 -279491 145143 -176628 -22215 426462 -35701 -137935
9103a37935A29880j1729l1479A2911K38735B3010K38112b78288A0108b08247C5186
$$ -137935 129880 118151 86672 12911 251646 23010 261122 -278288 10108 -208247 35186
9091A79507b8407B8198P821Q0106b2673A70047l6924l0287N444a12880A2029b29151
$$ 179507 -28407 28198 36019 116125 -22673 170047 133123 102836 108280 -112880 12029 -229151
9078a63635l48231H1414b06649J01915H5294i4095p1531I3363f4008m1443r1738
$$ -163635 -511866 81414 -206649 -104734 85294 -94095 -165626 93363 -64008 -105451 -197189
9067a97189A7308a82083C5053d0840E5094h8835I278L0280i8178M3937j79882
$$ -197189 17308 -182083 35053 -40840 55094 -88835 9278 39558 -98178 -54241 -234123
9056b34123J04311J0299k51913a14739C69045d0610j1299B27796b63247J11981
$$ -234123 -129812 -119513 -371426 -114739 369045 -40610 -51909 227796 -263247 -151266
9046a51266q1204A88556a12751j38364e1730A24116a32235B44888i0727E9436
$$ -151266 -232470 188556 -112751 -251115 -51730 124116 -132235 244888 -90727 59436
9035a22723b0607j55515l8880A07381j8414Q6600c46066f4078O057q3685q8427
$$ -122723 -20607 -176122 -215002 107381 88967 175567 -346066 -64078 -58021 -141706 -230133
9024b30133j31238a55142f2522k22677H1731a38973j55781J11097K0259n0578
$$ -230133 -361371 -155142 -62522 -285199 81731 -138973 -294754 -183657 -163398 -213976
9014b13976i0660k01557n5106h8744K6341l0490k60329A88878a30743A56428b76409
$$ -213976 -90660 -292217 -347323 -88744 -62403 -92893 -353222 188878 -130743 156428 -276409
9002d07006B72671a20773D6036a45203A63661P9798d6728j12683k79346O6092
$$ -407006 272671 -120773 46036 -145203 163661 243459 -46728 -159411 -438757 -372665
8992c72665a62446h1045k83854C87115c76766E4904i95j69345A7390a61718J8120
$$ -372665 -162446 -81045 -364899 387115 -376766 54904 -995 -170340 17390 -161718 -143598
8981a43598B94771A5960a71554a4806j58666E5311a19431H2707O6171p0647o133
$$ -143598 294771 15960 -171554 -14806 -173472 55311 -119431 82707 148878 78231 72098
8970G2098J33295G102a09704J8192G7590a32311a1342m9826B48499b16243A01270
$$ 72098 205393 7102 -109704 -91512 77590 -132311 -11342 -61168 248499 -216243 101270
8958A18853a23996B57977b92958r8546D6564J36198B6199J8888J80011G727c07557
$$ 118853 -123996 257977 -292958 -391504 46564 182762 26199 45087 225098 7727 -307557
8946i6044r2587d4198H3994A1796c6414n3377n840o6778j33944A71604a5508A44633
$$ -96044 -188631 -44198 83994 11796 -36414 -89791 -95631 -162409 -296353 171604 -15508 144633
8933D59903A41398G267N0275R2872a25428E7927e9547A28841N64723N84992J617515
$$ 459903 141398 7267 57542 150414 -125428 57927 -59547 128841 693564 1278556 2896071
8922B896071P533911L909487D162590A600541G33090J2751l23395D0420h9001
$$ 2896071 10429982 14339469 4162590 1600541 733090 745841 422446 40420 -89001
8912E7183b31403A99162h9117B87043J81291B02629d4737l0370B9937J75510G1401
$$ 57183 -231403 199162 -89117 287043 468334 202629 -44737 -75107 29937 205447 71401
8900a25823E4538d3599r0556d7233j15661H297O0432c25146j70927h8673q6174
$$ -125823 54538 -43599 -134155 -47233 -162894 8297 68729 -325146 -496073 -88673 -174847
8889a74847f1796B51612b73587d4051G5138n962a84965j21985A91117j1009a3096
$$ -174847 -61796 251612 -273587 -44051 75138 69176 -184965 -306950 191117 180108 -13096
8877I7158K37780b9154l16585A93867g3697l0093J9924c5663m80573J95079O9350
$$ 97158 334938 -29154 -345739 193867 -73697 -103790 -83866 -35663 -516236 -321157 -251807
$$ [...]
##END NTUPLES=NMR SPECTRUM
##END=
