
##TITLE=AC1347_GUAAH12165_7433174_i217NLlGqE
##JCAMPDX= 6.0         $$ Bruker NMR JCAMP-DX V2.0
##DATA TYPE= NMR SPECTRUM
##DATA CLASS= NTUPLES
##ORIGIN= BRUKER
##OWNER= Administrator
$$ 1.72 TOPSPIN		Version 2.1
$$ 2013-01-29 22:20:12.359 -0500  Administrator@X
$$ Compression mode = diff/dup
##.OBSERVE FREQUENCY= 400.02188249412
##.OBSERVE NUCLEUS= ^1H
##.ACQUISITION MODE= SIMULTANEOUS (DQD)
##.ACQUISITION SCHEME= undefined
##.AVERAGES= 64
##.DIGITISER RES= 22
##SPECTROMETER/DATA SYSTEM= spect
##.PULSE SEQUENCE= noesygpps1d.comp
##.SOLVENT NAME= COFFEE_meoh
##.SHIFT REFERENCE= INTERNAL, COFFEE_meoh, 1, 14.96097
##AUDIT TRAIL= $$ (NUMBER, WHEN, WHO, WHERE, PROCESS, VERSION, WHAT)
$$ ##TITLE= Audit trail, TOPSPIN		Version 2.1
$$ ##JCAMPDX= 5.01
$$ ##ORIGIN= Bruker BioSpin GmbH
$$ ##OWNER= Administrator
$$ $$ E:\/data/COFFEE/nmr/AC1347_GUAAH12165_7433174_i217NLlGqE/12/pdata/1/auditp.txt
$$ ##AUDIT TRAIL=  $$ (NUMBER, WHEN, WHO, WHERE, PROCESS, VERSION, WHAT)
(   1,<2013-01-29 22:20:06.484 -0500>,<Administrator>,<X>,<go>,<TOPSPIN 2.1>,
      <created by zg
	started at 2013-01-29 22:08:36.437 -0500,
	POWCHK enabled, PULCHK disabled,
       configuration hash MD5:
       86 BA 57 50 F2 9D 5C 9B 26 00 A9 28 5F 66 2E 89
       data hash MD5: 64K
       08 AB 14 B8 8F 29 9A 02 DA 9D 4B F6 88 FB 70 11>)
(   2,<2013-01-29 22:20:09.562 -0500>,<Administrator>,<X>,<proc1d>,<TOPSPIN 2.1>,
      <Start of raw data processing
       efp LB = 0.3 FT_mod = 6 PKNL = 1 PHC0 = 0 PHC1 = 0 SI = 128K 
       data hash MD5: 128K
       41 04 FC 0B 2E FA B9 DB 94 8B C6 00 11 67 FF F8>)
(   3,<2013-01-29 22:20:10.624 -0500>,<Administrator>,<X>,<proc1d>,<TOPSPIN 2.1>,
      <pk PHC0 = -79.19495 PHC1 = 0 
       data hash MD5: 128K
       35 73 22 91 75 BA BC 48 A4 2A 6F B8 B9 B0 EE D6>)
(   4,<2013-01-29 22:20:11.312 -0500>,<Administrator>,<X>,<proc1d>,<TOPSPIN 2.1>,
      <abs ABSG = 1 
       data hash MD5: 128K
       37 65 45 03 07 0C 58 AB D3 9D 8C F7 AC 85 03 D1>)
(   5,<2013-01-29 22:20:11.484 -0500>,<Administrator>,<X>,<proc1d>,<TOPSPIN 2.1>,
      <abs ABSG = 2 
       data hash MD5: 128K
       10 AE 9C 52 29 AD 51 BE 8C B5 2E 99 86 07 83 8D>)
(   6,<2013-01-29 22:20:11.655 -0500>,<Administrator>,<X>,<proc1d>,<TOPSPIN 2.1>,
      <abs ABSG = 3 
       data hash MD5: 128K
       33 64 91 AB 61 97 60 E4 3F 7D D7 D2 88 CD AC AF>)
(   7,<2013-01-29 22:20:11.843 -0500>,<Administrator>,<X>,<proc1d>,<TOPSPIN 2.1>,
      <abs ABSG = 4 
       data hash MD5: 128K
       52 84 AA 83 31 41 9B 07 E2 38 1D 14 3D EA E1 B2>)
(   8,<2013-01-29 22:20:12.015 -0500>,<Administrator>,<X>,<proc1d>,<TOPSPIN 2.1>,
      <abs ABSG = 5 
       data hash MD5: 128K
       08 B9 90 6F BF 16 AC E3 14 93 01 F0 10 77 36 10>)
$$ ##END=
$$ 
$$ $$ hash MD5
$$ $$ AB E1 4D 82 DF DE FB C9 38 61 D3 60 19 2F CC CE
##$RELAX= 
##$RELAX= 
##$RELAX= 
##$RELAX= 
##$RELAX= 
##$RELAX= 
##$RELAX= 
##$RELAX= 
$$ Bruker specific parameters
$$ --------------------------
##$DU= <E:\>
##$EXPNO= 12
$$ [...]
##$TP07= 0
##$TPNAME0= <>
##$TPNAME1= <>
##$TPNAME2= <>
##$TPNAME3= <>
##$TPNAME4= <>
##$TPNAME5= <>
##$TPNAME6= <>
##$TPNAME7= <>
##$TPOAL= (0..7)
0.5 0.5 0.5 0.5 0.5 0.5 0.5 0.5
##$TPOFFS= (0..7)
0 0 0 0 0 0 0 0
##$TUNHIN= 0
##$TUNHOUT= 0
##$TUNXOUT= 0
##$USERA1= <user>
##$USERA2= <user>
##$USERA3= <user>
##$USERA4= <user>
##$USERA5= <user>
##$V9= 5
##$VALIST= <valist>
##$VCLIST= <CCCCCCCCCCCCCCC>
##$VD= 0
##$VDLIST= <DDDDDDDDDDDDDDD>
##$VPLIST= <PPPPPPPPPPPPPPP>
##$VTLIST= <TTTTTTTTTTTTTTT>
##$WBST= 1024
##$WBSW= 4
##$XGAIN= (0..3)
0 0 0 0
##$XL= 0
##$YL= 0
##$YMAX_a= 6080323
##$YMIN_a= -12132490
##$ZGOPTNS= <>
##$ZL1= 120
##$ZL2= 120
##$ZL3= 120
##$ZL4= 120
##$ABSF1= 14.96097
##$ABSF2= -5.597212
##$ABSG= 5
##$ABSL= 3
##$ALPHA= 0
##$AQORDER= 0
##$ASSFAC= 0
##$ASSFACI= 0
##$ASSFACX= 0
##$ASSWID= 0
##$AUNMP= <proc_prof1d_extract.lims>
##$AXLEFT= 0
##$AXNAME= <>
##$AXNUC= <1H>
##$AXRIGHT= 0
##$AXTYPE= 0
##$AXUNIT= <>
##$AZFE= 0.1
##$AZFW= 0.1
##$BCFW= 0
##$BC_mod= 0
##$BYTORDP= 0
##$COROFFS= 0
##$CY= 15
##$DATMOD= 1
##$DC= 0
##$DFILT= <>
##$DTYPP= 0
##$F1P= 0
##$F2P= 0
##$FCOR= 0.5
##$FTSIZE= 131072
##$FT_mod= 6
##$GAMMA= 0
##$GB= 0
##$INTBC= 1
##$INTSCL= 1
##$ISEN= 128
##$LB= 0.3
##$LEV0= 0
##$LPBIN= 0
##$MAXI= 10000
##$MC2= 0
##$MEAN= 0
##$ME_mod= 0
##$MI= 0
##$NCOEF= 0
##$NC_proc= -2
##$NLEV= 6
##$NOISF1= 0
##$NOISF2= 0
##$NSP= 0
##$NTH_PI= 0
##$NZP= 0
##$OFFSET= 14.96097
##$PC= 1
##$PHC0= -79.19495
##$PHC1= 0
##$PH_mod= 1
##$PKNL= yes
##$PPARMOD= 0
##$PPDIAG= 0
##$PPIPTYP= 0
##$PPMPNUM= 2147483647
##$PPRESOL= 1
##$PSCAL= 4
##$PSIGN= 0
##$PYNMP= <proc.py>
##$REVERSE= no
##$SF= 400.020009649478
##$SI= 131072
##$SIGF1= 0
##$SIGF2= 0
##$SINO= 400
##$SIOLD= 131072
##$SPECTYP= <>
##$SREGLST= <1H.CDCl3>
##$SSB= 0
##$STSI= 131072
##$STSR= 0
##$SW_p= 8223.68421052631
##$SYMM= 0
##$S_DEV= 0
##$TDeff= 65536
##$TDoff= 0
##$TI= <>
##$TILT= no
##$TM1= 0
##$TM2= 0
##$TOPLEV= 0
##$USERP1= <user>
##$USERP2= <user>
##$USERP3= <user>
##$USERP4= <user>
##$USERP5= <user>
##$WDW= 1
##$XDIM= 131072
##$YMAX_p= 465628879
##$YMIN_p= -12352
##$CURPLOT= <Network HP LaserJet P1505>
##$CURPRIN= <$Network HP LaserJet P1505>
##$DFORMAT= <normdp>
##$LAYOUT= <+/1D_H.xwp>
##$LFORMAT= <normlp>
##$PFORMAT= <normpl>
##$SURQMSG= 1
$$ End of Bruker specific parameters
$$ ---------------------------------
##NTUPLES= NMR SPECTRUM
##VAR_NAME=  FREQUENCY,     SPECTRUM/REAL,   SPECTRUM/IMAG
##SYMBOL=    X,             R,               I
##VAR_TYPE=  INDEPENDENT,   DEPENDENT,       DEPENDENT
##VAR_FORM=  AFFN,          ASDF,            ASDF
##VAR_DIM=   131072,        131072,          131072
##UNITS=     HZ,            ARBITRARY UNITS, ARBITRARY UNITS
##FACTOR=    0.0627417313425164, 1,          1
##FIRST=     8223.62146879497, 2613,         -59357
##LAST=      0,             4616,            -59563
##MIN=       0,             -12352,          0
##MAX=       8223.62146879497, 465628879,    0
$$ Real data points
##PAGE= N=1
##DATA TABLE= (X++(R..R)), XYDATA
$$ [...]
63938B606979K12615K15595K15227K09827J98142J80843J59406J34277J05445
63929D238356P4241M2825J1770k0239n3800q7172j17850j44637j67383j85681
63919C590430j98852k06831k10065k08914k03795j95703j85798j74554j61877
63910A844041j47996j33633j19376j05444r2139q0002o9396o0314n2700m6477
63900I36564m1142l5871l0406k5492k1960j9623j7569j5537j4327j4557j5570
63889F84510j6065j5590j4769j4105j3258j1752r793p933o264m470k441k90K096
63876E69876M918P847J0158J1639J2909J4558J6438J8029J9198K0207K1205K2074
63864G49056K2622K2611K1779K0178J8334J6714J5084J2814R836O820M215J550
$$ plain form
63938 2606979 2819594 3035189 3250416 3460243 3658385 3839228 3998634 4132911 4238356
63929 4238356 4312597 4355422 4367192 4346953 4293153 4205981 4088131 3943494 3776111 3590430
63919 3590430 3391578 3184747 2974682 2765768 2561973 2366270 2180472 2005918 1844041
63910 1844041 1696045 1562412 1443036 1337592 1245453 1165451 1096055 1035741 983041 936564
63900 936564 895422 859551 829145 803653 781693 762070 744501 728964 714637 700080 684510
63889 684510 668445 652855 638086 623981 610723 598971 589178 581245 574981 570511 568070 567780 569876
63876 569876 574794 582641 592799 604438 617347 631905 648343 666372 685570 705777 726982 749056
63864 749056 771678 794289 816068 836246 854580 871294 886378 899192 909028 915848 920063 921613
63852I21613j914o054r854j2464j3966j5075j6396j8103k0022k1817k3195k4151
63840G38602k4921k5654k6209k6383k6203k5867k5574k5410k5167k4229k2042
63829D60943j9062j6725j5909j5766j4792j2860j1301j0892j0778r830q185o796
63817C08047o038n604n357n434n596n296m440l557l048k786k594k586k747k611
63803B50353j748m86J99l70j831l082l317k693j935j490j321j385j770k277k395
63788B24452k021j765k093k566k455j818j344j275j121n21K10N87N56L65J36j65
63772B09162n37q90j170j426j742j997j743n90J110K298K271J459Q22O38M34o5
63756B08034m93m60j39kj98m02j65N97J379J479P72m9k71P7N24R45J564K312K765
$$ plain form
63852 921613 919699 913645 903791 891327 877361 862286 845890 827787 807765 785948 762753 738602
63840 738602 713681 688027 661818 635435 609232 583365 557791 532381 507214 482985 460943
63829 460943 441881 425156 409247 393481 378689 365829 354528 343636 332858 323028 314843 308047
63817 308047 302009 296405 291048 285614 280018 274722 270282 266725 263677 260891 258297 255711 252964 250353
63803 250353 248605 248119 248318 247948 246117 243035 239718 237025 235090 233600 232279 230894 229124 226847 224452
63788 224452 222431 220666 218573 216007 213552 211734 210390 209115 207994 207473 207683 208270 208826 209191 209327 209162
63772 209162 208625 207735 206565 205139 203397 201400 199657 199067 200177 202475 204746 206205 207027 207665 208099 208034
63756 208034 207541 207081 206942 206940 206742 206340 206175 206772 208151 209630 210402 210353 210082 210159 210683 211628 213192 215504 218269
63737B18269K725K452K249K235K437K717K594J707N21kN10J474K225K710L119
63722B47942L412L539L746M221M732M885M573L890K839J449N0r16j342j523j811
63707B79686k293k814l130l047k517j717j055r08j154j120k62J035J806J740J548
63692B65798J901K597L140L585M133M416M017L300K901K619J749M14m68o02o86
63677B98814j128j409j046l79M6J67K5m90j025o54R12K578K981K027Q13K81M89
63660C03002Q13M40j029l040m420m633m270m054l882l372k755k523k559k327j730
63645B63661j110n57J13Q17J197J130Q26N08M26R67K180L385L856L820M200N327
63629B90746O531P059O964O863P308Q395R680J0358R995R262R485J1280J3908
$$ plain form
63737 218269 220994 223446 225695 227930 230367 233084 235678 237385 237906 237904 238414 239888 242113 244823 247942
63722 247942 251354 254893 258639 262860 267592 272477 277050 280940 283779 285228 285278 284362 283020 281497 279686
63707 279686 277393 274579 271449 268402 265885 264168 263113 262205 261051 259931 259669 260704 262510 264250 265798
63692 265798 267699 270296 273436 277021 281154 285570 289587 292887 295788 298407 300156 300570 300102 299500 298814
63677 298814 297686 296277 295231 294852 294898 295065 295090 294600 293575 292921 293833 296411 299392 301419 302232 302513 303002
63660 303002 303815 304255 303226 300186 295766 291133 286863 282809 278927 275555 272800 270277 267718 265391 263661
63645 263661 262551 261994 262107 262924 264121 265251 266077 266585 267011 267978 270158 273543 277399 281219 285419 290746
63629 290746 297277 304336 311300 318163 325471 333866 343546 353904 363899 373161 382646 393926 407834
63616D07834J6241J8064K0067K2709K5516K7653K9026L0426L2508L4881L6522
63605G01447L6902L6123L3893K9217K1695J2646M264k216o940j0294j2210j2719
63593H31808j2377j1726j0917j0272j0770j3241j7180k0989k3577k5216k6633
63582F48910k7693k7580k6119k4202k2625k1015j8445j4863j1230q339o122m294
63570D36383k986k270j557q6K115M295N952P342Q910J0560J1693J1913J1555J1471
63556E15290J2241J3685J5203J6614J8406K1167K4957K9353L3930L8569M3183
63545G82598M7139M8838M6307L8747K7489J5071L452o486j4037j8390j9541j8670
63533I32517j7035j4962j2445j0102q941r452j1512j4855j9054k3347k7071l0128
$$ plain form
63616 407834 424075 442139 462206 484915 510431 538084 567110 597536 630044 664925 701447
63605 701447 738349 774472 808365 837582 859277 871923 876187 873971 867031 856737 844527 831808
63593 831808 819431 807705 796788 786516 775746 762505 745325 724336 700759 675543 648910
63582 648910 621217 593637 567518 543316 520691 499676 481231 466368 455138 446799 440677 436383
63570 436383 433397 431127 429570 429484 431599 435894 441846 449188 458098 468658 480351 492264 503819 515290
63556 515290 527531 541216 556419 573033 591439 612606 637563 666916 700846 739415 782598
63545 782598 829737 878575 924882 963629 991118 1006189 1009641 1003155 989118 970728 951187 932517
63533 932517 915482 900520 888075 877973 869032 859580 848068 833213 814159 790812 763741 733613
63521G33613l2549l3904l3738l2428l0941k9730k8424k6556k4101k1298j8413
63510D21531j5728j3467j1645j0203r151q341p405o265n462n446n776n564m572
63497C12506l333k333j622j186j038q93l44M71Q82N39j76o37n21J77J246K245
63481C05983K775K900K971L131L274L449L762L950L605K875K370K180J628K27
63467C45080j598l133m213m976n153m329k836j859k240l415l900k904j206p9L33
63452C03572R46K065K778K541K480L947O267P330O492N553O403Q843J1445J3656
63438C84318J6022J8950K2360K6232L0391L3655L4161L1019K5242J8766J2967
63427F54083Q367N253L986M717P150J0714J4849J9135K3473K8181L3706L9831
$$ plain form
63521 733613 701064 667160 633422 600994 570053 540323 511899 485343 461242 439944 421531
63510 421531 405803 392336 380691 370488 361337 352996 345591 339326 333864 328418 322642 317078 312506
63497 312506 309173 306840 305218 304032 302994 302101 301757 302228 303110 303649 303473 302836 302315 302492 303738 305983
63481 305983 308758 311658 314629 317760 321034 324483 328245 332195 335800 338675 341045 343225 344853 345080
63467 345080 343482 340349 336136 331160 326007 321678 318842 316983 314743 311328 307428 304524 303318 303239 303572
63452 303572 304518 306583 309361 311902 314382 318329 324596 331926 338418 343971 350374 359217 370662 384318
63438 384318 400340 419290 441650 467882 498273 531928 566089 597108 622350 641116 654083
63427 654083 662450 667703 671689 676406 683556 694270 709119 728254 751727 779908 813614 853445
63415H53445M5255M8198M7571M3472L6668K7974J8246Q464n48q315j4377j8088
63403A087965j9153j8264j6776j5788j5803j7054j9633k3236k7227l1076l4455
63392H49500l6933l7981l7473l5858l3685l1196k8417k5501k2724k0253j7967
63381E21512j5560j2870j0139p768n769l765j590M65K238M055O097P904R082J0097
63367E03989J1769J4204J6900J9571K2144K4197K5429K6615K9072L2928L6824
63356G63642L9562M1179M2077M2006M0381L6939L1564K4171J5290O246j749q259
63344A073049j3107j5933j6790j6542j6018j5332j4684j5128j7666k1859k6277
63333H83713l0094l3374l5947l7031l6200l4010l1336k8563k5636k2384j8494
$$ plain form
63415 853445 898700 946898 994469 1037941 1074609 1102583 1120829 1129293 1128745 1120430 1106053 1087965
63403 1087965 1068812 1050548 1033772 1017984 1002181 985127 965494 942258 915031 883955 849500
63392 849500 812567 774586 737113 701255 667570 636374 607957 582456 559732 539479 521512
63381 521512 505952 493082 482943 475175 469406 465641 464051 464516 466754 470809 476906 484810 493892 503989
63367 503989 515758 529962 546862 566433 588577 612774 638203 664818 693890 726818 763642
63356 763642 803204 844383 886460 928466 968847 1005786 1037350 1061521 1076811 1083057 1081308 1073049
63344 1073049 1059942 1044009 1027219 1010677 994659 979327 964643 949515 931849 909990 883713
63333 883713 853619 820245 784298 747267 711067 677057 645721 617158 591522 569138 550644
63322E50644j3586p812k354R66Q50k570p825j3116j7232j9679k0310j9298j7348
63309D11330j5351j3642j1911r993q235o939n948n038m310l820l358k908k801
63296C17076l024k932k250j708k007k675k788k421k327k462k004q71j01l72j118
63281B88016j487j385j112o40J07P35Q35O17O51J050J334J000K4j070j544j053
63265B86078m9O86R46J147J464J513J138R00J294J950K261K409L001L883M171
63250C12792L538K818K911L689M335M476M514M995O021P292Q429R248R785J0230
63236C95073J0813J1729J3031J4487J5622J6152J6310J6569J6995J7202J7041
63225E61024J6947J7360J8012J8216J7696J6841J6182J5961J6090J6228J5883
$$ plain form
63322 550644 537058 529246 526892 527858 528708 526138 518313 505197 487965 468286 447976 428678 411330
63309 411330 395979 382337 370426 360433 352198 345259 339311 334273 329963 326143 322785 319877 317076
63296 317076 314052 311120 308870 307162 305155 302480 299692 297271 294944 292482 290478 289607 289506 289134 288016
63281 288016 286529 285144 284032 283392 283499 284234 285069 285686 286337 287387 288721 289721 289745 288675 287131 286078
63265 286078 286029 286715 287661 288808 290272 291785 292923 293823 295117 297067 299328 301737 304738 308621 312792
63250 312792 316330 319148 322059 325748 330083 334559 339073 344068 350089 357381 365810 375058 384843 395073
63236 395073 405886 417615 430646 445133 460755 476907 493217 509786 526781 543983 561024
63225 561024 577971 595331 613343 631559 649255 666096 682278 698239 714329 730557 746440
63214G46440J4868J3634J2747J1948J0227P010K814j488n571r411j2744j5326
63202G75148j7425j9411k1012k1595k1040j9754j7863j5154j1904q949o659m400
63190E89982j471J957N259Q230J0996J3385J5016J5969J6812J7906J9078K0083
63178G33202K0964K1812K2406K2389K1769K0982K0446K0098J9594J8813J7939
63167I60414J6895J4996J1598P019K331j856o030j0934j6457k1688k5961k9369
63155I00958l2251l4457l5375l4647l2726l0607k8993k7790k6403k4364k1642
63144E71703j8587j5885j4219j3611j3106j1711r579p808o958o367n220l675k501
63131D42476j991j767j462j026m63K17Q12J081J205J710K772L885M404M245L801
$$ plain form
63214 746440 761308 774942 787689 799637 809864 816874 819688 818200 812629 803218 790474 775148
63202 775148 757723 738312 717300 695705 674665 654911 637048 621894 609990 601041 594382 589982
63190 589982 588511 590468 595727 603957 614953 628338 643354 659323 676135 694041 713119 733202
63178 733202 754166 775978 798384 820773 842542 863524 883970 904068 923662 942475 960414
63167 960414 977309 992305 1003903 1010922 1013253 1011397 1005367 994433 977976 956288 930327 900958
63155 900958 868707 834250 798875 764228 731502 700895 671902 644112 617709 593345 571703
63144 571703 553116 537231 523012 509401 496295 484584 475005 467197 460239 453872 448652 444977 442476
63131 442476 440485 438718 437256 436230 435767 435984 436796 437877 439082 440792 443564 447449 451853 456098 459899
63116D59899L340K753J972J261R24Q82Q79R86J451K044K103J468Q63R50J429J572
63100D84776J298J021Q20M46L1o7m8n01j378j929j788j381j074o92j30L62P39
63083D80505J250J758J811J713K390L759M415L678K875L546N279O535O852O952
63069E33318P163P145P008P399Q479R790J1110J2478J3534J3933J4351J5937J8675
63056F80320K1345K3257K4988K7173K9672L2250L5065L7967M0222M1426M1950
63045A035635M2067M1460M0126L8974L8774L9096L9012L8406L7985L8215L8831
63034A468581L9197L8772L7451L5653L3767L1356K7382K1406J4035N917k981j2610
63022A737926k2060l0237l6858m2198m6229m8708m9748m9557m7883m4435l9670
$$ plain form
63116 459899 463239 465992 467964 469225 470149 471031 471910 472896 474347 476391 478494 479962 480825 481775 483204 484776
63100 484776 486074 487095 487915 488361 488392 488325 488277 487776 486398 484469 482681 481300 480226 479534 479404 479766 480505
63083 480505 481755 483513 485324 487037 489427 493186 497601 501279 504154 507700 512979 519514 526366 533318
63069 533318 540481 547626 554634 562033 570512 580302 591412 603890 617424 631357 645708 661645 680320
63056 680320 701665 724922 749910 777083 806755 839005 874070 912037 952259 993685 1035635
63045 1035635 1077702 1119162 1159288 1198262 1237036 1276132 1315144 1353550 1391535 1429750 1468581
63034 1468581 1507778 1546550 1584001 1619654 1653421 1684777 1712159 1733565 1747600 1753517 1750536 1737926
63022 1737926 1715866 1685629 1648771 1606573 1560344 1511636 1461888 1412331 1364448 1320013 1280343
63011A280343l4450k9053k3204j7033j1123n532L87O897J3190J8361K2596K6841
62999A248220L1471L5782L8802M0298M0821M1039M1210M1226M0938M0295L9309
62988A679411L8040L6600L4971L2773K9450K4745J8830J1958M188m388j3427k2577
62976A870574l1775m1079n0173n8155o3941o6980o7747o7367o6532o4876o1733
62965A230216n7411n3094m9435m5881m1752l7394l3699l0903k8524k6312k4521
62954H01290k3192k1815j9895j7612j5707j4823j4942j5249j4783j3448j2275
62943F17549j2227j2972j3278j2566j1453j0663j0070r185p997o819n663m366
62931E00290l218k856l402m113m176l488k523j592o60K43P41N36k02j031j706
$$ plain form
63011 1280343 1245893 1216840 1193636 1176603 1165480 1159948 1160335 1167232 1180422 1198783 1221379 1248220
62999 1248220 1279691 1315473 1354275 1394573 1435394 1476433 1517643 1558869 1599807 1640102 1679411
62988 1679411 1717451 1754051 1789022 1821795 1851245 1875990 1894820 1906778 1910966 1906578 1893151 1870574
62976 1870574 1838799 1797720 1747547 1689392 1625451 1558471 1490724 1423357 1356825 1291949 1230216
62965 1230216 1172805 1119711 1070276 1024395 982643 945249 911550 880647 852123 825811 801290
62954 801290 778098 756283 736388 718776 703069 688246 673304 658055 643272 629824 617549
62943 617549 605322 592350 579072 566506 555053 544390 534320 525135 517138 510319 504656 500290
62931 500290 497072 494216 490814 486701 482525 479037 476514 474922 474262 474505 475246 475782 475580 474549 472843
62916D72843k190k289j800j050q99j751k890l223k567j778j625k037k504k736
62902D43504k698k448k240k402k730k367q54R61J678R90o4n64o77q90r95n24K27
62885D27907M34k7l46N7P63R96O24J04k28l56k62J24O18P95N22K05L04O94P49
62866D33677R3q96j509j522j397j536j682j298l97L99N86K83o0j19K24Q26J210
62849D26882R31K50J3N79J241J176N79K94N60P69M68p8m76p63j085j254j033o15
62831D28438m73p79j266j608j689j531j117m39L36Q18P13J44l61l39K94J372K656
62814D25169L720M014L479K960L421M722N620N213M020L342L819M938N856O306
62800D86599O625P125P723Q145Q270Q204Q088Q157Q811J0362J2568J4822J6909
$$ plain form
62916 472843 470653 468364 466564 465514 464615 462864 459974 456751 454184 452406 450781 448744 446240 443504
62902 443504 440806 438358 436118 433716 430986 428619 427765 428726 430404 431394 431330 430766 430089 429199 428204 427680 427907
62885 427907 428341 428314 427968 428025 428788 429784 430408 430512 430284 429928 429666 429790 430408 431203 431725 431930 432234 432928 433677
62866 433677 433770 432874 431365 429843 428446 426910 425228 423930 423533 423932 424518 424801 424741 424622 424846 425672 426882
62849 426882 427813 428063 428076 428655 429896 431072 431651 431945 432505 433274 433742 433664 433188 432425 431340 430086 429053 428438
62831 428438 427965 427186 425920 424312 422623 421092 419975 419536 419872 420690 421403 421547 421186 420847 421141 422513 425169
62814 425169 428889 432903 436382 439342 442763 447485 453105 458318 462338 465680 469499 474437 480293 486599
62800 486599 493224 500349 508072 516217 524487 532691 540779 548936 557747 568109 580677 595499 612408
62787F12408J9232K2048K4989K7740L0829L5005M0046M4890M8968N2701N6550
62776A015406O0256O3334O5734O7548O8415O7679O4894N9861N2480M2998L2245
62765A660850K1171J0116j177j2772k4026l3990m2216m9020n4852n9540o2357
62754A352187o3000o2166o0891n9488n7583n5008n2096m9014m5446m1292l7158
62743G69045l3728l0952k8207k5107k1804j8698j6175j4424j3197j1885j0082
62732E44786q040o346n238m470l732k923k096j382r17o91m67N2J056K613M586
62717E16791O437P513P813Q182R345J1035J2501J3798J5842J9122K2922K6184
62705F77485K8778L1484L4885L8792M2801M6994N1777N7164O2541O7255P1246
$$ plain form
62787 612408 631640 653688 678677 706417 737246 772251 812297 857187 906155 958856 1015406
62776 1015406 1075662 1138996 1204730 1272278 1340693 1408372 1473266 1533127 1585607 1628605 1660850
62765 1660850 1682021 1692137 1690960 1678188 1654162 1620172 1577956 1528936 1474084 1414544 1352187
62754 1352187 1289187 1227021 1166130 1106642 1049059 994051 941955 892941 847495 806203 769045
62743 769045 735317 704365 676158 651051 629247 610549 594374 579950 566753 554868 544786
62732 544786 536746 530400 525162 520692 516960 514037 511941 510559 509642 508951 508484 508536 509592 512205 516791
62717 516791 523228 530741 538554 546736 556081 567116 579617 593415 609257 628379 651301 677485
62705 677485 706263 737747 772632 811424 854225 901219 952996 1010160 1072701 1139956 1211202
62694A211202P4939P8479Q1289Q2386Q1135P7566P1933O4194N4061M1592K7465
62683A946241J2476k990j8684l3845m7321n8412o7203p3885p8288q0369q0702
62672A417018p9962p8212p5221p1261o6967o2504n7507n1920m6324m1364l7154
62661G48622l3401k9726k5983k2560k0235j9178j8345j6552j4100j2467j2263
62650E23812j2478j2057j1285j0923j0745r892q273o762o044n893n634m861l724
62637D15241k746k282k056j400j79Q68R36K9j191k067k200j540o34m11j234k370
62621C96764k812k335j396m11M06Q88J144J623K424K926K679K254K514L411M291
62606D14370N070O083P020P171O852P475R793J2918J5540J7386J8981K0741K2836
$$ plain form
62694 1211202 1286141 1364620 1445909 1528295 1609430 1686996 1758929 1823123 1877184 1918776 1946241
62683 1946241 1958717 1955727 1937043 1903198 1855877 1797465 1730262 1656377 1578089 1497720 1417018
62672 1417018 1337056 1258844 1183623 1112362 1045395 982891 925384 873464 827140 785776 748622
62661 748622 715221 685495 659512 636952 616717 597539 579194 562642 548542 536075 523812
62650 523812 511334 499277 487992 477069 466324 456432 448159 441397 435353 429460 423826 418965 415241
62637 415241 412495 410213 408157 406757 406578 407446 408382 408411 407220 405153 402953 401413 400779 400368 399134 396764
62621 396764 393952 391617 390221 389810 390216 391104 392248 393871 396295 399221 401900 404154 406668 410079 414370
62606 414370 419440 425523 432543 439714 446566 454041 463834 476752 492292 509678 528659 549400 572236
62593E72236K5377K8114L0348L1701L2611L3510L3847L2539K9173K4300J8716
62582H92472J3003P542K304l294r717j6364k1870k5494k7700k9157k9763k9201
62570G22761k7946k7025k6723k6266k4944k3015k1149j9448j7571j5531j3756
62559D79387j2324j0819r079p571o700o197n537m614l610k566j566j032j223j582
62545D04967j290m53j6l29m94L90J881K662K104Q14k44o07k78O25J834K853L360
62528D17779L611M212N416O888Q175R252J0487J2256J4694J7715K0986K3991K6389
62515E81851K8449L0876L4104L7833M1336M4044M5777M6569M6416M5200M2796
62504A025251L9252L4771K9397K2879J5112O684j361q385j4552k0236k5326k9174
$$ plain form
62593 572236 597613 625727 656075 687776 720387 753897 787744 820283 849456 873756 892472
62582 892472 905475 913017 915321 912027 902310 885946 864076 838582 810882 781725 751962 722761
62570 722761 694815 667790 641067 614801 589857 566842 545693 526245 508674 493143 479387
62559 479387 467063 456244 447165 439594 432894 426697 421160 416546 412936 410370 408804 407772 406549 404967
62545 404967 403677 403224 403208 402879 402385 402775 404656 407318 409422 410236 409992 409385 409107 409732 411566 414419 417779
62528 417779 421390 425602 431018 437906 446081 455333 465820 478076 492770 510485 531471 555462 581851
62515 581851 610300 641176 675280 713113 754449 798493 844270 890839 937255 982455 1025251
62504 1025251 1064503 1099274 1128671 1151550 1166662 1173346 1171985 1163600 1149048 1128812 1103486 1074312
62492A074312l1084l0783k8638k5445k1786j7699j3174q726m819r37L920R601
62480I04742J4570J7713J9483K0617K0584J8252J3686Q247L128j427n619r796
62468A024180j4557k0275k6313l1344l4625l6418l7235l7361l7118l6765l5898
62457F76271l3695l0092k6065k2474j9247j6091j3327j1441j0246r047p448n539
62445D71559l588j884p31r2N71J809L542N126N990O084N871N973O621P204O650
62430E20705M486J334j781m348o376p855q732r212r670j0163j0388j0115r431
62417D38454q507p408o212n122m371m049m077m270m370m131l463k557j816j555
62403C76546j613j420n98N30J286J462J490J766K116K211K106K084K110J922J548
$$ plain form
62492 1074312 1043228 1012445 983807 958362 936576 918877 905703 896977 892158 891221 895141 904742
62480 904742 919312 937025 956508 977125 997709 1015961 1029647 1037894 1041022 1039595 1033976 1024180
62468 1024180 1009623 989348 963035 931691 897066 860648 823413 786052 748934 712169 676271
62457 676271 642576 612484 586419 563945 544698 528607 515280 503839 493593 484546 477098 471559
62445 471559 467971 466087 465356 465264 465835 467644 471186 476312 482302 488386 494257 500230 506851 514055 520705
62430 520705 525191 526525 524744 520396 514020 506165 497433 488221 478551 468388 458000 447885 438454
62417 438454 429947 422539 416327 411205 406834 402785 398708 394438 390068 385937 382474 379917 378101 376546
62403 376546 374933 373513 372915 373445 374731 376193 377683 379449 381565 383776 385882 387966 390076 391998 393546
62388C93546J359J566K001K520L204L994M491M492M476N100O217O926O753O342
62374D52987O630P686Q744R276R538J0044J0952J2178J3761J5861J8467K1308
62362E97432K4033K6490K8988L2234L6735M2135M7405N1838N5639N9363O2911
62351A065203O5243O4943O0990N3284M2743L0932J9401R169O08o576j3137j9697
62339A373106k6161l1965l6883m1182m4891m7423m8162m7098m4701m1503l7998
62328I25139l4487l0771k6502k2131j8902j7475j7084j6635j6070j5991j6428
62317F92663j6910j7433j8415j9675k0385k0088j9045j7427j5050j2147r719q590
62305D97779q427q134o910m806k515q49j73r2K48J420L279N142O368O872P250
$$ plain form
62388 393546 394905 396471 398472 400992 404196 408190 412681 417173 421649 426749 432966 439892 446645 452987
62374 452987 459617 467303 476047 485323 494861 504905 515857 528035 541796 557657 576124 597432
62362 597432 621465 647955 676943 709177 745912 788047 835452 887290 942929 1002292 1065203
62351 1065203 1130446 1195389 1256379 1309663 1352406 1383338 1402739 1411908 1412516 1405940 1392803 1373106
62339 1373106 1346945 1314980 1278097 1236915 1192024 1144601 1096439 1049341 1004640 963137 925139
62328 925139 890652 859881 833379 811248 792346 774871 757787 741152 725082 709091 692663
62317 692663 675753 658320 639905 620230 599845 579757 560712 543285 528235 516088 506369 497779
62305 497779 489352 481218 474308 469502 466987 466138 465965 465873 466121 467541 470820 475962 482330 489202 496452
62290D96452Q171R524J0436J0361R742R259Q887Q178P130O112N187M148L041K036
62276E98664R66l52j458j632q71J44R72J706K481L374M727O839R423J1998J4712
62261F51693J8016K1766K5609L0094L6186M3575N0541N5871N9911O3365O5958
62250A122585O6761O4968O0058N2031M1975L1515K1259J0692p0r619j7083k3517
62238A421555l0443l7825m4588n0410n5695o0077o2295o1654n8780n4838n0581
62227H54369m6234m1671l6703l1612k7226k4105k1743j9129j5991j3048j1057
62216E65850j0021r324q380p213o402o335o460n808m323l030k612k491j881j065
62202D90505q37j185j298p11L46J501K485K956K828K730L513N245P197Q748R832
$$ plain form
62290 496452 504623 514147 524583 534944 544686 553945 562832 571010 578140 584252 589439 593587 596628 598664
62276 598664 599630 599278 597820 596188 595317 595461 596433 598139 600620 603994 608721 615560 624983 636981 651693
62261 651693 669709 691475 717084 747178 783364 826939 877480 933351 993262 1056627 1122585
62250 1122585 1189346 1254314 1314372 1366403 1408378 1439893 1461152 1471844 1471774 1462155 1445072 1421555
62238 1421555 1391112 1353287 1308699 1258289 1202594 1142517 1080222 1018568 959788 904950 854369
62227 854369 808135 766464 729761 698149 670923 646818 625075 605946 589955 576907 565850
62216 565850 555829 546505 538125 530912 524510 518175 511715 505907 501584 498554 495942 493451 491570 490505
62202 490505 489668 488483 487185 486474 486820 488321 490806 493762 496590 499320 502833 508078 515275 524023 533855
62187E33855J0471J0554J0213R954J0233J1078J2300J3656J4728J4901J3732J1465
62175F77140R060P613P530Q389R673J1474J4100J7296K0524K3962K8406L3983
62163H69150L9701M4506M8038M9977M9562M6401M1080L4315K6189J6983Q012O35
62151A274549n195j0471j5606k0345k4817k9513l4166l7664l9360l9710l9445
62140I78257l8698l7115l4321l0157k4968j9812j5818j3214j1254r168o869m742
62128G32121l201k502k611l107l336k732j053J366L481M157L310J991J062K77
62114G29223q59j959k213j555o44k9q5j361m075p416j0129j1701j2264j1701r848
62099F53384p395n467m247k915j037R33K603M144N606O649P267P898Q532Q617
$$ plain form
62187 533855 544326 554880 565093 575047 585280 596358 608658 622314 637042 651943 665675 677140
62175 677140 686200 693813 701343 709732 719405 730879 744979 762275 782799 806761 835167 869150
62163 869150 908851 953357 1001395 1051372 1100934 1147335 1188415 1222730 1248919 1265902 1273914 1274549
62151 1274549 1269354 1258883 1243277 1222932 1198115 1168602 1134436 1096772 1057412 1017702 978257
62140 978257 939559 902444 868123 837966 812998 793186 777368 764154 752900 743732 736863 732121
62128 732121 728920 726418 723807 720700 717364 714632 713579 714945 718426 722583 725893 727884 728946 729223
62114 729223 728364 726405 724192 722637 721993 721964 721879 720518 716443 709027 698898 687197 674933 663232 653384
62099 653384 645989 640522 636275 633360 632323 633256 635859 640003 645609 652258 659525 667423 675955 684572
62085F84572Q168Q104Q964J0045J0497J0574J1183J2639J4525J6429J8192J9659
62073H33551K0710K1461K2049K2337K2178K1805K1777K2485K3881K5530K6979
62062A084743K8233K9786L1798L3284L2687K9327K3890J7417J0469L453k882p896
62050A314309j1707j5026j8510k2486k7008l1789l6234l9832m2460m4186m4955
62039I80116m4600m3069m0540l7526l4748l2640l0870k8688k5835k2812k0188
62028F18600j7946j5707j3348j1167r614q904q772q581p894o978o517o812p538
62015D88822q206q547q428p775o746n685m776l924l029k147j338n56K88J295K591
62000D31839M119N506O294O363N884N039L962K832J757O83l81j290k094l142m496
$$ plain form
62085 684572 692740 700844 709808 719853 730350 740924 752107 764746 779271 795700 813892 833551
62073 833551 854261 875722 897771 920108 942286 964091 985868 1008353 1032234 1057764 1084743
62062 1084743 1112976 1142762 1174560 1207844 1240531 1269858 1293748 1311165 1321634 1325087 1322205 1314309
62050 1314309 1302602 1287576 1269066 1246580 1219572 1187783 1151549 1111717 1069257 1025071 980116
62039 980116 935516 892447 851907 814381 779633 746993 716123 687435 661600 638788 618600
62028 618600 600654 584947 571599 560432 550818 541914 533142 524561 516667 509689 503172 496360 488822
62015 488822 480616 472069 463641 455866 449120 443435 438659 434735 431706 429559 428221 427665 427953 429248 431839
62000 431839 435958 441464 447758 454121 460005 465044 469006 471838 473595 474278 473897 472607 470513 467371 462875
61985D62875n594n999o066o428p079p565p713p553o848n491m136l547l509l222
61971C82125k671k604l126l367k766j790j127r11j014j313j384p58K45P28N40
61956C60807O10J594K980L940M338M470M504M632N128N844O282O565P543R458
61942D28695J1351J2394J3087J4344J6065J7453J8205J8517J8354J7667J6992
61931F03124J6904J7001J6276J4501J2443J0701R035O981M489J752j126l995o488
61918G01598q284r382r952r991r267p640n383l067r33J359M170P183R694J1553
61904F71658J3265J5074J6415J6419J4593J0971O132J185k799n707q271j0950
61892G37985j3375j5100j6226j6905j6881j6035j4936j4264j3976j3502j2537
$$ plain form
61985 462875 457281 451282 445216 438788 431709 424144 416431 408878 402030 396539 392403 388856 385347 382125
61971 382125 379454 376850 373724 370357 367591 365801 364674 363763 362749 361436 360052 359294 359539 360267 360807
61956 360807 361417 363011 365991 369931 374269 378739 383243 387875 393003 398847 405129 411694 419237 428695
61942 428695 440046 452440 465527 479871 495936 513389 531594 550111 568465 586132 603124
61931 603124 620028 637029 653305 667806 680249 690950 699985 706966 711455 713207 712081 708086 701598
61918 701598 693314 683932 673980 663989 654722 647082 641699 638632 637699 639058 643228 650411 660105 671658
61904 671658 684923 699997 716412 732831 747424 758395 764527 765712 762913 757206 748935 737985
61892 737985 724610 709510 693284 676379 659498 643463 628527 614263 600287 586785 574248
61881E74248j1343j0453j0273j0722j1072j0532r173p825o998o427n843n451n309
61868D62827m894l843k522j357j43J452L190M590N580O444P472R047J1447J4159
61854E13449J6114J7082J8172K0361K3209K5810K8134L0477L2223L2440L1355
61843G88826L0006K8581K6223K2533J8140J3634Q895L769j373o116j0333j3684
61831I09101j5433j5127j3105j0087o532k622J527N772R792J2948J4576J4558
61819I05368J3344J1320Q409M398n81o072j1651j7133k2374k6901k9995l1305
61807G96827l1277l0581k9343k7398k5152k3367k1979k0059j7298j4663j3052
61796E42658j2032j0649q848p256o131n343m942m933m811m200l565l457l453k775
$$ plain form
61881 574248 562905 552452 542179 531457 520385 509853 500680 492855 485857 479430 473587 468136 462827
61868 462827 457933 454090 451568 450211 450068 451520 454710 459300 464880 471324 478796 487843 499290 513449
61854 513449 529563 546645 564817 585178 608387 634197 662331 692808 725031 757471 788826
61843 788826 818832 847413 873636 896169 914309 927943 936838 940607 939234 933118 922785 909101
61831 909101 893668 878541 865436 855349 848817 846195 847722 853494 863286 876234 890810 905368
61819 905368 918712 930032 938441 942839 942258 936186 924535 907402 885028 858127 828132 796827
61807 796827 765550 734969 705626 678228 653076 629709 607730 587671 570373 555710 542658
61796 542658 530626 519977 511129 503873 497742 492399 487457 482524 477713 473513 469948 466491 463038 460263
61782D60263j747j495k255k984k783j870r92n84p21j215j599j491j024n51p1M99
61766D39380Q06M84r5l18l62q12j425j294l27N36P17O96R92J348J423J398J425
61749D44572J194N34j36m68o78j007j237j195j189j450j690j704j863k412k750
61734D28521k100o56O30J271J618K051K381K286J856J488J441J698K148K631K798
61719D50062K269J130J96L28J459K606K994K772K412J959J269N94K58J7o35j659
61703D68031k599l313l989m484m414l917l603l612l410k736k110k114k632l174
61689D21924l446l374k972k470k249k381k553k584k654k871l027k973k881k827
61675C82662k600k120j731j752j975j943j520r41m28l8K04K46J23pK0K26M25M16
$$ plain form
61782 460263 458516 457021 454766 451782 448999 447129 446137 445553 444832 443617 442018 440527 439503 438952 438881 439380
61766 439380 440186 440670 440575 440257 439895 439083 437658 436364 436037 436573 437290 437986 438978 440326 441749 443147 444572
61749 444572 445766 446300 446164 445696 445018 444011 442774 441579 440390 438940 437250 435546 433683 431271 428521
61734 428521 426421 425765 426395 427666 429284 431335 433716 436002 437858 439346 440787 442485 444633 447264 450062
61719 450062 452331 453461 453657 453985 455444 458050 461044 463816 466228 468187 469456 470050 470308 470325 469690 468031
61703 468031 465432 462119 458130 453646 449232 445315 441712 438100 434690 431954 429844 427730 425098 421924
61689 421924 418478 415104 412132 409662 407413 405032 402479 399895 397241 394370 391343 388370 385489 382662
61675 382662 380062 377942 376211 374459 372484 370541 369021 368080 367652 367614 367818 368064 368187 368180 368200 368426 368851 369267
61657C69267L14M97J076J669J836J586J237R87R63J330J970K355K130J687J671
61642C90575K171K830L467M040M207L638K621J754J131M24m03j162k049l377m763
61627D05104n342m931m186l613l176k932l114l433l166k241j407j033n76L38J112
61612C67404J027K30o29j314j943k490k821k974l049l111l357l990m764n144n001
61597C28074m731m534m190l698l429l362k979k150j426j071o55n0Q2n79j202j004
61581B93096n45q22j621j888j483j365j968k393j683k22O84L66n31r02m59Q3M0
61564B78387l52l06M83J595K444K620J914O70j6O52J961K380J592P86P47Q88O88
61547B97133P81J690K532K155Q84l7j61R5O19J558K379K219J230N05N94R90J136
$$ plain form
61657 369267 369581 370078 371154 372823 374659 376245 377482 378469 379432 380762 382732 385087 387217 388904 390575
61642 390575 392746 395576 399043 403083 407290 410928 413549 415303 416434 416858 416455 415293 413244 409867 405104
61627 405104 399762 394831 390645 387032 383856 380924 377810 374377 371211 368970 367563 366530 365954 366292 367404
61612 367404 368431 368661 368032 366718 364775 362285 359464 356490 353441 350330 346973 342983 338219 333075 328074
61597 328074 323343 318809 314619 310921 307492 304130 301151 299001 297575 296504 295849 295799 295881 295302 294100 293096
61581 293096 292551 291729 290108 288220 286737 285372 283404 281011 279328 279106 279790 280156 279625 278723 278264 278347 278387
61564 278387 278035 277729 278212 279807 282251 284871 286785 287455 287439 288091 290052 292432 294024 294810 295557 296445 297133
61547 297133 297914 299604 302136 304291 305175 305138 304977 305072 305691 307249 309628 311847 313077 313582 314176 315166 316302
61530C16302J053P97J73p20j322j314r79p20p11j050j733k369k467k058j599j226
61514C00057p10j61o0l94m97q7K35m3m45k03N22Q26L71k00k21J20J92p9j50K96
61494B99369Q00P93M57M35P80P92J06n97m41M44J147J189R49R03J027J113J195
61477C10461J441J830K203K416K290J575K98r71j448r15o5J44n13j345j568j108
61461C14725m86j55k36o57j128j120l98M67N97p5p01o61k00J60L41M45L47j2k44
61442C11009R2Q88J638J999J972J731J568J795K461L278L886M064L700K941K295
61427C45317K112J991J334M80M35J308J965J688J189J364J891K014J889K139K561
61412C69677K399J624R07M76m1p04j092j103j110j370j860k659l768m624m543
$$ plain form
61530 316302 317355 318152 318325 317605 316283 314969 313990 313270 312559 311509 309776 307407 304940 302882 301283 300057
61514 300057 299347 299186 299126 298732 298235 298148 298383 298340 297895 297692 298214 299040 299411 299211 298990 299110 299302 299223 299073 299369
61494 299369 300169 300962 301419 301854 302634 303426 303532 302935 302494 302938 304085 305274 306223 307126 308153 309266 310461
61477 310461 311902 313732 315935 318351 320641 322216 322514 321543 320095 319180 319115 319259 318746 317401 315833 314725
61461 314725 314239 314084 313848 313191 312063 310943 310545 311012 311609 311534 310833 310172 309972 310132 310473 310918 311265 311253 311009
61442 311009 311101 311989 313627 315626 317598 319329 320897 322692 325153 328431 332317 336381 340081 343022 345317
61427 345317 347429 349420 350754 351234 351669 352977 354942 356630 357819 359183 361074 363088 364977 367116 369677
61412 369677 372076 373700 374607 375083 375042 374338 373246 372143 371033 369663 367803 365144 361376 356752 352209
61397C52209l681k757j949q37M71J169Q72J89k22l86n01l80J23O98J008J136J258
61380C48420J241J000Q68J203J812K161J992J554J272J390J796K092J978J642
61366C70421J580J965K417K483K170J917K063K409K339J550O60O87J780K890L105
61351D00436K915L483M949O201O365N738N067M606M151L543K788K002J511J674
61337D55429K398L096L354L267L006K439J449K96p55j775k854l624l616k995k456
61322D56659k383k470k305j871j245k14J349K886L625L640L878M814N761O012
61308D78136O125P202R179J0916J1868J2636J3475J3486J1908R428P295N721M026
61295F01401J994J60j080j898k618l415m395n449o189o543p052q104r119r196
$$ plain form
61397 352209 348528 345771 343822 342985 343456 344625 345497 345686 345464 345078 344577 344197 344320 345018 346026 347162 348420
61380 348420 349661 350661 351529 352732 354544 356705 358697 360251 361523 362913 364709 366801 368779 370421
61366 370421 372001 373966 376383 378866 381036 382953 385016 387425 389764 391314 391974 392661 394441 397331 400436
61351 400436 403351 406834 411783 417984 424349 430087 435154 439760 443911 447454 450242 452244 453755 455429
61337 455429 457827 460923 464277 467544 470550 472989 474438 474734 473979 472204 469350 465726 462110 459115 456659
61322 456659 454276 451806 449501 447630 446385 446171 447520 450406 454031 457671 461549 466363 472124 478136
61308 478136 484261 491463 500642 511558 523426 536062 549537 563023 574931 584359 591654 597375 601401
61295 601401 603395 603555 602475 600577 597959 594544 590149 584700 578511 571968 564916 556812 547693 538497
61281E38497q314p182o124m921l663k808k287j456j60Q88J149J025J204J737K172
61266E09757K210J905J536J608K617M435O129O751O285N600N471N787N828N223
61252E71142M390L876L504K658J335K30k91o79j282j726j746j933k863l982m335
61237E68298m020m045m811n638n777n074l710j986m54M79J049J681K169K009J504
61222E41674J654K870M474N668O327O760P269Q012Q788R005Q428P732P591P461
61208F33713O317M442L314L556M193M361M501N273O267O710O733P094Q057R306
61194G13837J0681J2324J4077J5218J4850J2622R205O022M095L134K161Q54k93
61181H18787j016j721k708l751m662n690o985q227q969r033q478p721p584q578
$$ plain form
61281 538497 530183 523001 516877 511956 508293 505485 503198 501742 501582 502470 503619 504644 505848 507585 509757
61266 509757 511967 513872 515408 517016 519633 524068 530197 536948 543233 548833 554304 560091 565919 571142
61252 571142 575532 579408 582912 585570 586905 587135 586844 586165 584883 583157 581411 579478 576615 572633 568298
61237 568298 564278 560233 555422 549784 544007 538933 535223 533237 532783 533262 534311 535992 538161 540170 541674
61222 541674 543328 546198 550672 556340 562667 569427 576696 584708 593496 602501 610929 618661 626252 633713
61208 633713 640030 644472 647786 651342 655535 659896 664397 669670 675937 682647 689380 696474 704531 713837
61194 713837 724518 736842 750919 766137 780987 793609 802814 808836 812931 816065 818226 819080 818787
61181 818787 817771 816050 813342 809591 804929 799239 792254 784027 775058 766025 757547 749826 742242 733664
61167G33664j0042j0783j0549j0170j0217j0431j0546j0681j0695j0220r575r600
61155F10155j0104r674p617n038l259k114p65O75J309P42p25k654m484n470n443
61140E55534n284n809o507o154m459k390j032o00n44j29R38K284L343M138N160
61125E38489O455P601Q581R939J1716J3223J4272J5619J7641J9487K0364K0713
61113G04100K1302K1961K2230K2480K3270K4104K3975K2832K1457K0202J8752
61102I46665J6905J4689J1898Q364M518R29k374n527q114r715j0802j2167j3703
61089I41566j4599j4605j4273j4049j3913j3746j3404j2537j1035r366p950o553
61077G95536m946l618k981k331o15K076M734O886Q789J0460J1603J2382J3281
$$ plain form
61167 733664 723622 712839 702290 692120 681903 671472 660926 650245 639550 629330 619755 610155
61155 610155 600051 590377 582760 577722 574463 572349 571584 572259 573568 574310 573585 570931 566447 560977 555534
61140 555534 550250 544441 537934 531780 527321 524931 523899 523299 522755 522626 523564 525848 529191 533329 538489
61125 538489 544944 552545 561126 571065 582781 596004 610276 625895 643536 663023 683387 704100
61113 704100 725402 747363 769593 792073 815343 839447 863422 886254 907711 927913 946665
61102 946665 963570 978259 990157 998521 1003039 1003968 1001594 996067 987953 978238 967436 955269 941566
61089 941566 926967 912362 898089 884040 870127 856381 842977 830440 819405 810039 802089 795536
61077 795536 790590 786972 783991 781660 781045 783121 787855 794741 803530 813990 825593 837975 851256
61064H51256J4297J5158J6216J8076K0488K2598K4184K5576K6593K6733K6418
61053A087593K6748K7869K8789K8951K8921K9212K9534K9528K9197K8398K6873
61042A401613K5064K3900K3429K2718K1374K0122J9599J9542J9676K0248K1258
61031A638543K2089K2409K2512K2434K1796K0995K1440K4069K8666L4993M3276
61020A923222N2949O2386P0783P9178Q8869J00338J14795J35065J63505K00435
61010B991525K46058L02186L70455M51099N46264O62535Q07191R84726J200713
61001H562752J460147J742097J967368K010221J775429J283655O78901J43465
60993A9624035j99753l16044k27025J2033K97921M78245M11988N8971m86587j054625
$$ plain form
61064 851256 865553 880711 896927 915003 935491 958089 982273 1007849 1034442 1061175 1087593
61053 1087593 1114341 1142210 1170999 1199950 1228871 1258083 1287617 1317145 1346342 1374740 1401613
61042 1401613 1426677 1450577 1474006 1496724 1518098 1538220 1557819 1577361 1597037 1617285 1638543
61031 1638543 1660632 1683041 1705553 1727987 1749783 1770778 1792218 1816287 1844953 1879946 1923222
61020 1923222 1976171 2038557 2109340 2188518 2277387 2377725 2492520 2627585 2791090 2991525
61010 2991525 3237583 3539769 3910224 4361323 4907587 5570122 6377313 7362039 8562752
61001 8562752 10022899 11764996 13732364 15742585 17518014 18801669 19480570 19624035
60993 19624035 19424282 19108238 18881213 18893246 19191167 19669412 20081400 20140371 19653784 18599159
60983A8599159j497289j747988j815953j748583j599731j414337j222844j041372
60975F511062q76640p31445o06621n01005m12535l39793k81670k36109k00362
60966B324882j72299j50526j33449j19237j06777r5819q6102p7055o8430o0507
60956A254681n3435m6913m0778l5434l1478k9222k8621k9073k9255k7876k4980
60945H77616k1916j9635j7673j5359j3260j2461j2832j3133j2781j2438j2691
60934G13437j3137j3193j3050j3159j3369j3144j2344j1204r851q343o998o166
60922E79479n718n185m388l606l084k681k114j405r86j322k320l197l175k366
60908E37932j594j343j283r42l99pJ88L58N52P05P24L82n71j947l168l991m700
$$ plain form
60983 18599159 17101870 15353882 13537929 11789346 10189615 8775278 7552434 6511062
60975 6511062 5634422 4902977 4296356 3795351 3382816 3043023 2761353 2525244 2324882
60966 2324882 2152583 2002057 1868608 1749371 1642594 1546775 1460673 1383618 1315188 1254681
60956 1254681 1201246 1154333 1113555 1078121 1046643 1017421 988800 959727 930472 902596 877616
60945 877616 855700 836065 818392 803033 789773 777312 764480 751347 738566 726128 713437
60934 713437 700300 687107 674057 660898 647529 634385 622041 610837 600986 592643 585645 579479
60922 579479 573761 568576 564188 560582 557498 554817 552703 551298 550312 548990 546670 543473 540298 537932
60908 537932 536338 534995 533712 532770 532371 532364 532552 532910 533462 534167 534891 535273 534702 532755 529587 525596 520896
60891E20896n331n411m853m453m846n570n873n925o305o785o684o171o122o688
60877D39879p044o632n727m637l297j954j319j575j930j619p82M8P67J566K371
60862D08115K922L104L001K783K709K884L009K746K375K470K927L015K612K483
60848D47155L000L328K617J327N88O54Q33O81L72l3q32j997k925l255l440m048
60832D44025m814m946m288l690l916m583m640l717k567j951j781j675j914l001
60818C96542m467n018m129k883k704l701m704m736l928l013k429k164k154k421
60804C48091k760k652j833p99l59o64j072j062p86n29j90L10O24M87K76M25P21
60787C38228P81Q49J319J822J711J262J355J990K177J499P76P90J271J613J781
$$ plain form
60891 520896 515565 510154 505301 500848 496002 490432 484559 478634 472329 465544 458860 452689 446567 439879
60877 439879 432835 426203 420476 415839 412542 410588 409269 407694 405764 404145 403363 403411 404178 405744 408115
60862 408115 411037 414141 417142 419925 422634 425518 428527 431273 433648 436118 439045 442060 444672 447155
60848 447155 450155 453483 456100 457427 458015 458669 459502 460183 460555 460522 459690 457693 454768 451513 448073 444025
60832 444025 439211 434265 429977 426287 422371 417788 413148 409431 406864 404913 403132 401457 399543 396542
60818 396542 392075 387057 382928 380045 377341 373640 368936 364200 360272 357259 354830 352666 350512 348091
60804 348091 345331 342679 340846 340047 339688 339024 337952 336890 336104 335575 335385 335695 336319 336806 337082 337507 338228
60787 338228 339009 339858 341177 342999 344710 345972 347327 349317 351494 352993 353769 354559 355830 357443 359224
60772C59224J944J891J413P83L55P6k02l82m29o06j006j306j325j330j504j601
60756C55995j503j535j856k069j913j732j731j451n62L94Q06J016J676K495K560
60741C50590J653L81q64k156l306l848l834l844m002l806l157k715k819k813k073
60726C13387j079p17q64n27O19J625J520O26J39O36J532J980J855J596J443J219
60710C24990P52K21j1K97J059J861K252K213K212K531K732K149Q19m99j157j019
60694C41402j91J034J928J720N68m58o11k18L8Lj49m32p74p08J05J257K048K310
60676C48872K317K127J554P18K6l24m69n02l96k81m30q98j463j918k251k484k552
60659C41646k330j673n89N58J212J164P97N79N55N23N20Q07J499K427L257L610
$$ plain form
60772 359224 361168 363059 364472 365255 365610 365686 365484 365102 364673 364067 363061 361755 360430 359100 357596 355995
60756 355995 354492 352957 351101 349032 347119 345387 343656 342205 341643 342037 342843 343859 345535 348030 350590
60741 350590 352243 352624 351760 349604 346298 342450 338616 334772 330770 326964 323807 321092 318273 315460 313387
60726 313387 312308 311591 310727 310200 310819 312444 313964 314590 314729 315365 316897 318877 320732 322328 323771 324990
60710 324990 325742 325963 325952 326249 327308 329169 331421 333634 335846 338377 341109 343258 344077 343578 342421 341402
60694 341402 341211 342245 344173 345893 346461 346003 345392 345174 345212 345215 345066 344634 343860 343152 343257 344514 346562 348872
60676 348872 351189 353316 354870 355588 355614 355290 354821 354319 353923 353642 353212 352314 350851 348933 346682 344198 341646
60659 341646 339316 337643 337054 337612 338824 339988 340785 341364 341919 342442 342962 343769 345268 347695 350952 354562
60643C54562L198K100P59m28j416k270k921l276l316k951k109j126o01o26n93
60628C38986j25L29K82J20N85J573K174J823Q21k09q40q82m49k5Rj07J35O58Q62
60609C45720M97n2m22o91r61j003n79K09J061J674J715J050J67p6N66J348J525
60592C51748J301J395J908K154J573L61q67j663j873j627j321j364j627j520p92
60577C47786ML02M52J262K678L696L771L583L990M843N477N848O406P115P412
60562D04625P073O394N474M112K439R56k48j591l100m131m293l956l430k381n58
60547D07385J437K765L344L694M145M681N326O144P127Q370J0073J1994J3261
60534D89746J3205J2013J0182P753M695J642n48j835k898m041m780m678m019l506
$$ plain form
60643 354562 357760 359860 360619 360191 358775 356505 353584 350308 346992 344041 341932 340806 340205 339579 338986
60628 338986 338861 339190 339472 339592 340177 341750 343924 345747 346568 346359 345519 344637 344188 344163 344172 344065 344200 344858 345720
60609 345720 346217 346165 345743 345052 344091 343088 342509 342718 343779 345453 347168 348218 348385 348309 348875 350223 351748
60592 351748 353049 354444 356352 358506 360079 360440 359573 357910 356037 354410 353089 351725 350098 348578 347786
60577 347786 347790 348092 348544 349806 352484 356180 359951 363534 367524 372367 377844 383692 390098 397213 404625
60562 404625 411698 418092 423566 427678 430117 431073 430825 429234 426134 422003 417710 413754 410324 407943 407385
60547 407385 408822 411587 414931 418625 422770 427451 432777 438921 446048 454418 464491 476485 489746
60534 489746 502951 514964 525146 532899 537594 539236 538688 536853 533955 529914 525134 520456 516437 512931
60520E12931l554m031m439m336l682k776j891j136n82k35K16J107K161K748K976
60505D95477L757N441P219Q492J0058J2973J6883K0546K3600K6615K9685L2171
60493F92917L3828L4914L5001L2927K8399K2569J6348R135J01r926j8868k5494
60481H51851l0250l3984l6632l7485l6303l3719l0606k7452k4449k1931k0235
60470E18805j9062j7465j4893j1962r798q739q088p120n848m716l982l608l524
60457D00000l690l960m001l500k516j574j161j196j245j190j268j408j168n73
60443C71550l70r25j475j134k17J85l04j044j386j254p52K5P28Q36K68n52j154
60426C63025j291q44K1P63R26O78M87M96O39J051J747K136J649P41M64J087J857
$$ plain form
60520 512931 509377 505346 500907 496571 492889 490113 488222 487086 486504 486269 486485 487592 489753 492501 495477
60505 495477 499234 504675 511894 520386 530444 543417 560300 580846 604446 631061 660746 692917
60493 692917 726745 761659 796660 829587 857986 880555 896903 906038 906139 896213 877345 851851
60481 851851 821601 787617 750985 713500 677197 643478 612872 585420 560971 539040 518805
60470 518805 499743 482278 467385 455423 445625 436886 428798 421678 415830 411114 407132 403524 400000
60457 400000 396310 392350 388349 384849 382333 380759 379598 378402 377157 375967 374699 373291 372123 371550
60443 371550 371180 370255 368780 367646 367429 367614 367310 366266 364880 363626 362874 362899 363627 364463 364731 364179 363025
60426 363025 361734 360890 360911 361674 362600 363278 363765 364261 364900 365951 367698 369834 371483 372224 372688 373775 375632
60409C75632K117J929J531J007N54M01L39ol62m5R39J820K229K601L200L661L786
60392D01333L894L954L303J792L95O7N75J141J532J914K200K326K678L459M038
60377D34601L754K984K658K877K895K375J795J580J513J279J035J129J584K113
60363D64172K484K764L224L937M487M313L596L451M774P150R374J0905J2170J3357
60349E50158J3678J2289R458O213L066l31m116p471r420j0025j0217j0450j0188
60336E32644q939p262o200n997n960n524m839m243l709l094k582k515k916l400
60322D65464l523l142k473j780r93K72K122M094N688P052Q685J0588J2206J3173
60308E17433J3582J3442J2385J0260P594N202L540K528J787Q29o12k331l966n621
$$ plain form
60409 375632 377749 379678 381209 382216 382770 383171 383510 383504 383142 383097 384036 385856 388085 390686 393886 397547 401333
60392 401333 405227 409181 412484 414276 414671 414738 415313 416454 417986 419900 422100 424426 427104 430563 434601
60377 434601 438355 441339 443997 446874 449769 452144 453939 455519 457032 458311 459346 460475 462059 464172
60363 464172 466656 469420 472644 476581 481068 485381 488977 492428 497202 504352 513726 524631 536801 550158
60349 550158 563836 576125 585583 591796 594862 594531 590415 582944 573524 563499 553282 542832 532644
60336 532644 523705 516443 510243 504246 498286 492762 487923 483680 479971 476877 474295 471780 468864 465464
60322 465464 461941 458799 456326 454546 453553 453825 455947 460041 465729 472781 481466 492054 504260 517433
60308 517433 531015 544457 556842 567102 574696 579898 583438 585966 587753 588582 587970 585639 581673 576052
60294E76052p803j0547j3021j4309j4246j3338j2055j0522q643o340l871k015
60282D59342j542k272l019k793j817j024r07j234j621j836j699j201q15j163k216
60267D34183l153l300k878k569k529k251j425m84m4q7o2K72N88O10N46O57P90
60250D18864O84M74N21Q97J426K047K756L294L284K694J830R38J24m46o67p77
60234D37943j121j565j550p97L26J244J722J905K037K171K071J505P52M89R99
60219D48131J771K230K512L052L735M189M587N327O073O013N246M960N851P095
60205E10772P441O784O122O218O793O951O138M719L649L437L531L042J990J262
60191E78849J331J558J070j59j493k512l279l908m225m034l551l412m101n312
$$ plain form
60294 576052 568249 557702 544681 530372 516126 502788 490733 480211 471568 465228 461357 459342
60282 459342 457800 455528 452509 449716 447899 446875 445968 444734 443113 441277 439578 438377 437562 436399 434183
60267 434183 431030 427730 424852 422283 419754 417503 416078 415594 415550 415463 415401 415673 416261 416871 417417 418074 418864
60250 418864 419548 420022 420543 421440 422866 424913 427669 430963 434247 436941 438771 439709 439833 439387 438720 437943
60234 437943 436822 435257 433707 432910 433236 434480 436202 438107 440144 442315 444386 445891 446643 447132 448131
60219 448131 449902 452132 454644 457696 461431 465620 470207 475534 481607 487620 492866 497826 503677 510772
60205 510772 518213 524997 531119 537337 544130 551081 557219 561938 565587 569024 572555 575597 577587 578849
60191 578849 580180 581738 582808 582649 581156 578644 575365 571457 567232 563198 559647 556235 552134 546822
60177E46822o096n802m695l572l006l100l551l682k873j411m25n06r43q80o50
60162E05630j029j702j585m63P82J516J897K068J895J551J419J276N89l07m24
60147E13113L31R57R75J102J859K643K887L083L927N131N901O029N997O404P602
60132E67941R387J0731J0536Q921P110N816M583K966J321j0j301k603l239k833
60118F19326k054j718j763j732j554j341j079r58j227j428p55M31O17o56j901
60103F02208j847j261j486k357k920l265m103n112n206m236l099k350j802j297
60089E61867r34o21k23J13M28J247K699L873L952L417L278L646M023M283M321
60074E95369L484J533n41j911l381n969q701r704r035q541q941r088q255p309
$$ plain form
60177 546822 540726 534924 530229 526657 523651 520551 517000 513318 510445 509034 508609 508103 507160 506280 505630
60162 505630 504601 502899 501314 500851 501633 503149 505046 507114 509009 510560 511979 513255 513844 513537 513113
60147 513113 513444 514401 515376 516478 518337 520980 523867 526950 530877 536008 541909 547938 553935 560339 567941
60132 567941 577328 588059 598595 607516 614626 620442 625025 627991 629312 629302 628001 625398 622159 619326
60118 619326 617272 615554 613791 612059 610505 609164 608085 607127 605900 604472 603717 604148 604765 604109 602208
60103 602208 600361 599100 597614 595257 592337 589072 584969 579857 574651 570415 567316 564966 563164 561867
60089 561867 560933 560312 560089 560202 560630 561877 564576 568449 572401 575818 579096 582742 586765 591048 595369
60074 595369 598853 600386 599845 597934 594553 588584 579883 570179 561144 552603 543662 534574 526319 519010
60060E19010p009o851o284n658n274m667l574k573k112j865j571j454j321l46
60046D68451J569L220L718L709M135M705M564L866L472L541L341K465J357O84
60032E12797P01J192J604J302J14j399k495k989l265l753m572n581o501p101p363
60017D72691p379p108o502n856n683o071o427o105n102l954l069k359j539o11
60003D04926M4J97J55L59O88O89M64P01J570K279K215J818J728J697J204O11P12
59986D22057J404J834J697J448J299R95O64Q86J695K339K304J766R13l55j737
59971D39209k337j720n47L11Q05J395K226L065L807M524N144N446N406N286N393
59956D77413N684N658M800L180J463J15j100k558m030m872m836m282l714l427
$$ plain form
60060 519010 512001 505150 498866 493208 487934 483267 479693 477120 475008 473143 471572 470118 468797 468451
60046 468451 470020 473240 476958 480667 484802 489507 494071 497937 501409 504950 508291 510756 512113 512797
60032 512797 513498 514690 516294 517596 517710 516311 513816 510827 507562 503809 499237 493656 487155 480054 472691
60017 472691 465312 458204 451702 445846 440163 434092 427665 421560 416458 412504 409435 407076 405537 404926
60003 404926 404970 405167 405322 405681 406369 407058 407522 408223 409793 412072 414287 416105 417833 419530 420734 421345 422057
59986 422057 423461 425295 426992 428440 429739 430734 431398 432284 433979 436318 438622 440388 441301 440946 439209
59971 439209 436872 435152 434605 434916 435721 437116 439342 442407 446214 450738 455882 461328 466734 472020 477413
59956 477413 483097 488755 493555 496735 498198 498313 497213 494655 490625 485753 480917 476635 472921 469494
59942D69494l447l525l416l334l728m442m639l941l016k520k124j256o1J142K622
59927D33809M455N659N389M434M263M854M870L794K470J526O59l26j031j320j435
59912D72070j116K49K380M145N145O011O868O925O089N586O132O656N846L975
59898E36961K176O98r55k703l774l799l147k282j390n90l0L71R63K036L379M184
59882E32098L753K587K268L706N852P009O989O961P365P337O290M778L413K085
59868F02491P38j24k52p4J85R12K126L017L019K478J807Q96l4o7J064K218K353
59851F22753K076K621L825M204K810J45k662m813o017o312n848m728l202k069
59837F02783k321m093o370p970q450p907o561m832l333k347j676j124p35m36p7
$$ plain form
59942 469494 466047 462522 459106 455772 452044 447602 442963 439022 436006 433486 431362 430106 430045 431187 433809
59927 433809 438264 443923 449312 453746 458009 462863 467733 471527 473997 475523 476182 475856 474825 473505 472070
59912 472070 470954 471203 473583 477728 482873 488884 495752 502677 508766 514352 520484 527140 532986 536961
59898 536961 539137 539835 538880 536177 532403 528604 525457 523175 521785 521195 521165 521536 522499 524535 527914 532098
59882 532098 535851 538438 540706 544412 550264 557273 564262 571223 578588 585925 592215 596993 600406 602491
59868 602491 603229 603105 602853 602779 602964 603876 606002 609019 612038 614516 616323 617219 617185 617118 618182 620400 622753
59851 622753 624829 627450 631275 635479 638289 638434 635772 630959 624942 618630 612782 608054 604852 602783
59837 602783 600462 596369 589999 582029 573579 565672 559111 554279 550946 548599 546923 545799 545064 544628 544551
59822E44551M7o14j973l266m001m354m508m357l946l379k366p33N82L49j093k070
59806E08869j961j870k497k957k518j964k119k415k149j929k499l150k798j855
59792D76188j538j940k250k346k681k909k130m76Q17R68L08n81j369j660j184
59777D57217l70L5M6L95J364K339K642K301J914K032K670L234L143K646K634L495
59761D87737M662N513O013O189N857N302N349O199P066P563Q428J0073J1463J1546
59747E88960J0893J0708J1001J0973J0587J0378J0173R389Q265P503O883N522
59735G01235L365J227n18k113l427l875l500l135l358m064m966n752n884n120
59721F60115m098l670l816l957l995m151m104l382k407k034k249k282j977j910
$$ plain form
59822 544551 544598 543984 542011 538745 534744 530390 525882 521525 517579 514200 511834 511101 511683 512032 510939 508869
59806 508869 506908 505038 502541 499584 497066 495102 492983 490568 488419 486490 483991 480841 478043 476188
59792 476188 474650 472710 470460 468114 465433 462524 460394 459918 460735 461703 462011 461430 460061 458401 457217
59777 457217 456847 456882 456928 457323 458687 461026 463668 465969 467883 469915 472585 475819 478962 481608 484242 487737
59761 487737 492399 497912 503925 510114 515971 521273 526622 532821 539887 547450 555878 565951 577414 588960
59747 588960 599853 610561 621562 632535 643122 653500 663673 673062 681327 688830 695713 701235
59735 701235 704600 705827 705309 703196 699769 695894 692394 689259 685901 681837 676871 671119 665235 660115
59721 660115 656017 652347 648531 644574 640579 636428 632324 628942 626535 624501 622252 619970 617993 616083
59707F16083k196k265j896j542j502j632j904k446l027l248l149k945k395j321
59693E84615m07m51j133j587j870k632l570l664k949k537k741k651j923j546k195
59678E52759l153l496l350l261l290l409l884m655n016m637m185m329m792m940
59664D96362m720m344l653k493j312p53p95q06k70Q40K190L255L577L136K360
59649D92574J746J493J513J536J283P49K09k72j029k192l233l594l447l230k858
59634D81248k043j060m37j84l0r8n05p72o05q15k215l876l931k162l63M9n11j064
59616D60626j473k037k704l275l608l269j890j34O84L04j74K2M26N32O60J008
59600D45698J014N03M34J478K667K586J339L30L87J017J398J327J229J605K399
$$ plain form
59707 616083 613887 611622 609726 608184 606682 605050 603146 600700 597673 594425 591276 588331 585936 584615
59693 584615 584208 583757 582624 581037 579167 576535 572965 569301 566352 563815 561074 558423 556500 554954 552759
59678 552759 549606 546110 542760 539499 536209 532800 528916 524261 519245 514608 510423 506094 501302 496362
59664 496362 491642 487298 483645 481152 479840 479087 478292 477486 477216 478056 480246 483501 487078 490214 492574
59649 492574 494320 495813 497326 498862 500145 500894 501103 500831 499802 497610 494377 490783 487336 484106 481248
59634 481248 479205 478145 477708 477524 477494 477396 476891 476119 475514 474699 472484 468608 464677 462515 462152 462201 461690 460626
59616 460626 459153 457116 454412 451137 447529 444260 442370 442236 442920 443224 443050 443072 443498 444030 444690 445698
59600 445698 446712 447215 447649 449127 451794 454380 455719 456049 456436 457453 458851 460178 461407 463012 465411
59585D65411K812K078N70m29l09J94K06j94n73j057j878k544k309j253k29J05
59569D60601j83n99o36r5O58J014Q27N46M87M28J02l16n36n00k64J18M01L15Q5
59550D62453J83N30O11N27J018K137K958L140L785N771Q158R514J0344J2828J7823
59535E41780K3051K4640K0280J1008M72p500j1209j1571j0542r296p857n976l772
59522E53508j653P9J357K204K513K065R48k36r48j442k413l975n468o388o898
59507E33253p279p400p068o413n675m967m433m257m319m298m226m357m412l665
59493D60484k100p84n93j125j393j112o52j78M45J114J435J294R99R43J340K223
59477D62340L391M376M754M517M041L691L512L277K860K519K584K862K718K010
$$ plain form
59585 465411 468223 470301 470871 470442 470133 470327 470533 470339 469766 468709 466831 464287 461978 460725 460496 460601
59569 460601 460418 459819 459183 459088 459746 460760 461587 462133 462620 463048 463150 462834 462298 461798 461534 461652 462053 462368 462453
59550 462453 462636 463166 463777 464304 465322 467459 470417 473557 477342 483113 491271 500785 511129 523957 541780
59535 541780 564831 589471 609751 620759 621231 613731 602522 590951 580409 571113 563256 557280 553508
59522 553508 551855 551934 553291 555495 558008 560073 561021 560785 559837 558395 555982 552007 546539 540151 533253
59507 533253 525974 518574 511506 505093 499418 494451 490018 485761 481442 477144 472918 468561 464149 460484
59493 460484 458384 457600 457007 455882 454489 453377 452725 452547 452992 454106 455541 456835 457834 458777 460117 462340
59477 462340 465731 470107 474861 479378 483419 487110 490622 493899 496759 499278 501862 504724 507442 509452
59463E09452J481J786K473K605K094J698J856K302K780L374M091M779N493O300
59449E52564O792O498N691N038M547L674K348R54o41k880n288o638o621o121n613
59434E54304m532k773j462j436j949j837j110m64Q0J102K712M339N450O062O839
59419E65325Q740J2044J5627J7984J9122K0564K3328K6886L0259L2603L2223K6793
59407H31498J5983K935q035j4635j6906j5695j2149p646k692L407J0318J4784
59395H01167J2926M465o719j6247k2179k4553k3954k1355j8214j5602j3528j1538
59383F44669r552p813o381n104l934l032k599k579k587k207j459p29k08K48O05
59368E97338N16o3n77n24O4R38J952K770K953K788L280M814O396O965O848P152
$$ plain form
59463 509452 510933 512719 515192 517797 519891 521589 523445 525747 528527 531901 535992 540771 546264 552564
59449 552564 559356 565854 571545 576583 581130 584804 587152 588106 587465 584585 579297 572659 566038 559917 554304
59434 554304 549772 546999 545537 544101 542152 540315 539205 538741 538821 539923 542635 546974 552424 558486 565325
59419 565325 574065 586109 601736 619720 638842 659406 682734 709620 739879 772482 804705 831498
59407 831498 847481 850416 842381 827746 810840 795145 782996 775350 772658 776065 786383 801167
59395 801167 814093 818558 811839 795592 773413 748860 724906 703551 685337 669735 656207 644669
59383 644669 635117 627304 620923 615819 611885 608853 606254 603675 601088 598881 597422 596693 596485 596733 597338
59368 597338 597854 597791 597214 596690 596754 597692 599644 602414 605367 608155 611435 616249 622645 629610 636458 643610
59352F43610Q192R333J0164J0944J1974J3141J4142J4759J4963J4954J4900J4455
59340G95531J2995J0555Q005N959M107J988k31k295m536p276j0036j2075j3247
59327G89444j3776j3674j3129j2908j3484j4133j3736j2313j0899j0116r601q847
59315F42828p867o882n926m930l884k777j452L35K655N075O893Q180J0025J2899
59301F55172J5008J3628Q220J053n451j0579j4252j5936j5734j5059j4833j4119
59289E87118j1845q826o599n194l665k094j403j505j387p25L9J018K790M990O514
59274E59226P180P921R200J0476J1346J2006J2372J1949J0874J0016R618Q922
59262F81106P471N919M987M373L236J373o56k225l233m104n209o269o524n718
$$ plain form
59352 643610 651802 661135 671299 682243 694217 707358 721500 736259 751222 766176 781076 795531
59340 795531 808526 819081 827086 833045 837152 839140 838909 836614 832078 824802 814766 802691 789444
59327 789444 775668 761994 748865 735957 722473 708340 694604 682291 671392 661276 651675 642828
59315 642828 634961 628079 622153 617223 613339 610562 609110 609445 612100 617175 624068 632248 642273 655172
59301 655172 670180 683808 692028 693081 687630 677051 662799 646863 631129 616070 601237 587118
59289 587118 575273 566447 559848 554654 550989 548895 547492 545987 544600 543875 543914 544932 547722 552712 559226
59274 559226 566406 574327 583527 594003 605349 617355 629727 641676 652550 662566 672184 681106
59262 681106 688577 694496 699483 703856 707092 708465 707809 705584 702351 698247 693038 686769 680245 674527
59248F74527m485l469k551j448m21K27R02K040L179L590L523L819M428M289K785
59233F90935N82j075j500j038q44j885l823n294n631n673o370p477q336r053r873
59218F23645j0193r434q212p475o947n850m572m255m931n439n014l833k283r56
59204E44251r06k450l953l407j139O14P64L90O42J325J980K725L425L386K584
59189E50231K028K271K667K644K671L280M065M409M494M827N339N531N175M497
59175F04129L885L638L676L578L176K877K904K686J782R13J096K032K494K090
59161F40956J472R58K10q04j732k776m428o250p212p388p894q919r266q291o970
59146E71666o387o331o044n326m321l077j970j766k652l861m567m543l815k545
$$ plain form
59248 674527 670042 666573 664022 662574 662153 662380 663282 665322 668501 672091 675614 679433 683861 688150 690935
59233 690935 691517 690442 688942 687904 687060 685175 681352 676058 670427 664754 658384 650907 642571 633518 623645
59218 623645 613452 604018 595806 588331 581384 575534 570962 566707 561776 556337 551323 547490 545207 544251
59204 544251 543345 540895 536942 533535 532396 533010 533774 534164 534806 536131 538111 540836 544261 547647 550231
59189 550231 552259 554530 557197 559841 562512 565792 569857 574266 578760 583587 588926 594457 599632 604129
59175 604129 608014 611652 615328 618906 622082 624959 627863 630549 632331 633244 634340 636372 638866 640956
59161 640956 642428 643386 643596 642792 641060 638284 633856 627606 620394 613006 605112 596193 586927 578636 571666
59146 571666 565279 558948 552904 547578 543257 540180 538210 536444 533792 529931 525364 520821 517006 514461
59132E14461j458j395k080k237j296n1O53R86J548K507L762N122O088O190N788
59117E38588N797O456P221P824Q412Q708Q207P421P544Q597R156Q371P066O258
59103F45626N811N205M524L934L107J890P67P4m90j166j709k043k513l101l255
59088F56661k845k374j984j279m42l85j297k266k810l597m981o084o162n877o223
59073F08055p018p317o748n667m564l886l854m024l640k797k441k880l236k788
59059E47195j957j471j407j568j927k232k084j736j869k230j723k78O71K71m81
59044E27174m33J1j12o35p07k12L13O14P66Q20R89J647K598L064K888K888L621
59027E45294M703N862P565R961J2266J3979J5663J7700J9258J9408J8354J6708
$$ plain form
59132 514461 513003 511608 509528 507291 505995 505944 506597 507583 509131 511638 515400 520522 526610 532800 538588
59117 538588 544385 550841 558062 565886 574298 583006 591213 598634 606178 614775 623931 632302 639368 645626
59103 645626 651437 656642 661166 665100 668207 670097 670864 670938 670448 669282 667573 665530 663017 659916 656661
59088 656661 653816 651442 649458 648179 647737 647352 646055 643789 640979 637382 632401 626317 620155 614278 608055
59073 608055 601037 593720 586972 581305 576741 572855 569001 564977 561337 558540 556099 553219 549983 547195
59059 547195 545238 543767 542360 540792 538865 536633 534549 532813 530944 528714 526991 526713 527384 527655 527174
59044 527174 526741 526752 526640 526005 525298 525086 525399 526013 526779 527599 528588 530235 532833 535897 538785 541673 545294
59027 545294 549997 555859 563424 573385 585651 599630 615293 632993 652251 671659 690013 706721
59015G06721J4381J1088P213L323m82m032o724q347r446j0232j0052q651o912
59002F77848n641m513l062j608m35R28K640L780L579K561J611Q67L24L48P19L16
58986F80262j161k382k396k180k903l867l743k721j817r05P71K802M123M909O297
58971F75089Q458J0365J1417J1945J2258J2302J2164J1956J1410J0420R610R500
58959H06894R549Q926P695O242M196J024k726n891q098r766j1142j2214j3171
58946G81518j4088j4592j4533j4356j4084j2852j0409q138p391p613p325o208
58934F49929m863l324j287P05J804K216K721L210L045K469K322K613K600K028
58920F66188J165n3j755l325m008m024m030l980l508k956k760k388j145M49J432
$$ plain form
59015 706721 721102 732190 739403 742726 742244 738212 731488 723141 713695 703463 693411 684760 677848
59002 677848 672207 667694 664632 663024 662589 663517 666157 669937 673516 676077 677688 678555 678879 679227 679946 680262
58986 680262 679101 676719 674323 672143 669240 665373 661630 658909 657092 656187 656958 659760 663883 668792 675089
58971 675089 683547 693912 705329 717274 729532 741834 753998 765954 777364 787784 797394 806894
58959 806894 816443 825369 833064 839306 843502 844526 841800 835909 827811 818045 806903 794689 781518
58946 781518 767430 752838 738305 723949 709865 697013 686604 678466 671075 663462 656137 649929
58934 649929 645066 641742 640455 641160 642964 645180 647901 651111 654156 656625 658947 661560 664160 666188
58920 666188 667353 667300 665545 662220 658212 654188 650158 646178 642670 639714 636954 634566 633421 633870 635302
58905F35302K073L389N390P194Q582R983J1241J1810J1959J2407J2890J2560J1628
58892G56408J1269J1866J2684J3323J4251J5800J7702J9597K1041K1122J9204
58881I34267J5912J2473R299O159L255R20j403m557q252j1435j3738j5405j6183
58868I11312j5706j4674j4123j3653j1923q917o247n013m750m693m798n149n525
58855G96141n890o454p044p207o964o664o152n012l510k410j946j809j983k768
58841G30328m076n593p342r377j1184j2159j2338j1994j1135j0060r555r611q906
58828F06998o714m373l465l447k668r35N29J190J539J933K559L941N933O937N843
58813F15800L980L330L606L205K286K335L161K974J419J6o10j442k686l112k444
$$ plain form
58905 635302 637375 640764 646154 653348 661930 671913 683154 694964 706923 719330 732220 744780 756408
58892 756408 767677 779543 792227 805550 819801 835601 853303 872900 893941 915063 934267
58881 934267 950179 962652 971951 978110 981365 982285 980882 976325 968073 956638 942900 927495 911312
58868 911312 895606 880932 866809 853156 841233 832316 826069 821056 816306 811613 806815 801666 796141
58855 796141 790251 783797 776753 769546 762582 755918 749766 744754 741244 738834 736888 735079 733096 730328
58841 730328 726252 720659 713317 703940 692756 680597 668259 656265 645130 635070 625515 615904 606998
58828 606998 600284 595911 592446 588999 586331 585396 585925 587115 588654 590587 593146 597087 603020 609957 615800
58813 615800 619780 623110 626716 629921 632207 634542 637703 640677 642096 642112 641502 640060 637374 634262 631818
58798F31818k171l208m666n646o468p388p816p583p427p561p158n841m299k963
58784E51623j568k32M25O02J175K001K029J360J440K731L948M043L300K061J42
58769E75080j906k803k542k672l907n088n234m899m639l846k112k88Q40J708K889
58754E40581M089M931N594N975N467M211L276K982K236L50j760k835k665j662
58740E70770j75J166J631J381J345J772K029J991K271K963L517M016N011N983
58726F05671N786M800M668N512N601M359L529M383N811O415O581P191P913Q134
58712F86354Q211Q528Q541P841O918N950M144J244j656l786n814q417j1020j2986
58698F94052j4614j6034j6531j5964j5461j5594j5273j3618j1618j0609j0284
$$ plain form
58798 631818 629647 626439 621773 616127 609659 602271 594455 586872 579445 571884 564726 558885 554586 551623
58784 551623 550055 549823 550248 550850 552025 554026 556055 557415 558855 561586 565534 569577 572877 574938 575080
58769 575080 573174 570371 567829 565157 561250 556162 550928 546029 541390 537544 535432 535144 535984 537692 540581
58754 540581 544670 549601 555195 561170 566637 570848 574124 577106 579342 579692 577932 575097 572432 570770
58740 570770 570595 571761 573392 574773 576118 577890 579919 581910 584181 587144 590661 594677 599688 605671
58726 605671 611457 616257 620925 626437 632038 636397 639926 644309 650120 656535 663116 670307 678220 686354
58712 686354 694565 703093 711634 719475 726393 732343 736487 737731 736075 732289 726475 718058 707038 694052
58698 694052 679438 663404 646873 630909 615448 599854 584581 570963 559345 548736 538452
58687E38452r509q109o722n659m964m733m620l893k619j811j828j772j072l36
58673D80805nM11J117J420J195J533L121N269P247R180J0989J1999J2262J2638
58659E59181J2814J1081P055K737j63k110l883m779m233l416l564m131m120l871
58645E58598m080m318m016l656l638l229j963p92n14l25P15K045K700K779K599
58630E42905J748K92n93m48n64j773k811k452j642j770k253j786o78nM70J628
58614E30268L076L758L694L538L177K320J600J611J686J063L35L27N33Q9n94o98
58598E55783n42q55j397j640j913k488k562j533l29k4k9Q90K675M381N650O625
58582E62692P236P663Q505R550R552Q228P101P263P814P634P179P181P267P301
$$ plain form
58687 538452 528943 520834 514112 508453 503489 498756 494136 490243 487624 485813 483985 482213 481141 480805
58673 480805 480800 481211 482328 483748 484943 486476 489597 494866 502113 511293 522282 534281 546543 559181
58659 559181 571995 583076 590131 592868 592705 590595 586712 581933 577700 574284 570720 566589 562469 558598
58645 558598 554518 550200 546184 542528 538890 535661 533698 532906 532392 532067 532782 534827 537527 540306 542905
58630 542905 544653 544945 544352 543904 543340 541567 538756 536304 534662 532892 530639 528853 528175 528170 528640 530268
58614 530268 533344 537102 540796 544334 547511 549831 551431 553042 554728 555791 556126 556453 556986 557075 556481 555783
58598 555783 555241 554386 552989 551349 549436 546948 544386 542853 542524 542500 542471 543361 546036 550417 556067 562692
58582 562692 569928 577591 586096 595646 605198 613426 620527 627790 635604 643238 650417 657598 664865 672166
58568F72166Q353J0747J2848J3521J4090J6045J8507J9944K0814K2253K3650K3692
58556H76630K2612K1140J8514J3795Q168L692O10k133m583n937o140n572m192
58543I36604k558k486m833p946j0093j1937j4711j7513j8757j8831j8933j8528
58531G89478j6496j3659j1639j0197q066n606m197l819l436k966k806k388j302
58518G02901p41j702k946k923k402k860l630l227k237k144k502j990j256j831
58504F70510l201l704l440l547l568k377q30n13p64J10J468J387L03L81J681K232
58488F56128J659J607K651L724M555N858P207P459P197Q108J0084J1539J2295
58475G40071J3436J4554J3971J1600Q913O189K479j758m761o252p605r131r581
$$ plain form
58568 672166 680519 691266 704114 717635 731725 747770 766277 786221 807035 829288 852938 876630
58556 876630 899242 920382 938896 952691 960859 964551 965161 963028 958445 952508 946368 940796 936604
58543 936604 934046 931560 926727 918781 908688 896751 882040 864527 845770 826939 808006 789478
58531 789478 772982 759323 747684 737487 729421 723815 719618 715799 712363 709397 706591 704203 702901
58518 702901 702160 700458 697512 694589 692187 689327 685697 682470 680233 678089 675587 673597 672341 670510
58504 670510 667309 663605 660165 656618 653050 650673 649843 649330 648566 648676 650144 651531 651834 652215 653896 656128
58488 656128 657787 659394 662045 665769 670324 676182 683389 690848 698045 706153 716237 727776 740071
58475 740071 753507 768061 782032 793632 802545 808734 811213 809455 804694 798442 790837 781706 772125
58462G72125q470o678m738k479j68J822M005O651Q602R142R775J1829J3637J2768
58448H27823R748O722L806o8m009o259p396r012j0203q975o176m377l651k243
58434G85730o02o59j714j114J152K595K724L476N211O254O487P479Q977R068P861
58419H42925P212O790M440N62j942k347k856m336n267n256n762o820o877o110
58405H14356o194o603n120k219q06j306j169L97J439J495K436M450N414N004N247
58390H16821O375O281M834M349N118M780K954K093K883L194K453K510L312K423
58376H70380n8p95J219L055L099L337M871N849N531N958P818Q927Q450Q421R528
58361I45590R783Q847R254J1591J2920J1721J0112R505Q457O507N671O306N892
$$ plain form
58462 772125 763655 756977 752239 749760 749592 751414 755419 762070 770672 779814 789589 801418 815055 827823
58448 827823 837571 844293 848099 848031 844022 837763 830367 821355 811152 802177 796001 791624 787973 785730
58434 785730 785128 784469 782755 781641 782793 785388 788112 791588 796799 803053 809540 817019 825996 835064 842925
58419 842925 850137 856927 861367 861929 859987 857640 854784 850448 845181 839925 834163 827343 820466 814356
58405 814356 808162 801559 796439 794220 793414 792108 790939 791336 792775 794270 796706 801156 806570 811574 816821
58390 816821 823196 829477 834311 838660 843778 848558 851512 853605 856488 859682 862135 864645 867957 870380
58376 870380 870322 869527 870746 873801 876900 880237 885108 890957 896488 902446 910264 919191 927641 936062 945590
58361 945590 955373 964220 973474 985065 997985 1009706 1019818 1029323 1037780 1044287 1049958 1056264 1062156
58348A062156L680K305L047L925M025N184P742R196Q836R142J0965J2015J1692
58335A153910J2483J4905J6129J5353J5431J7331J8239J7006J6056J6010J4033
58324A326886R693O704O534O014L680K610M224N317M180L836O075Q008P800Q089
58310A409650J0487J2293J1965J2212J4450J5846J5070J5192J7647J9214J8233
58299A572259J7829J9586K0269J8362J7457J9479K0898J9556J8832K1016K2947
58288A788490K2310K1820K3179K3419K1368K0970K4094K6802K6869K7825L1436
58277B058582L3705L2831L3329L7411M0292L9114L8430M1451M4080M3351M3464
58266B486040M7395N0890N0986N2090N7214O1769O2624O4490P0506P5481P5627
$$ plain form
58348 1062156 1065836 1068141 1071188 1075113 1079138 1084322 1092064 1101260 1110096 1119238 1130203 1142218 1153910
58335 1153910 1166393 1181298 1197427 1212780 1228211 1245542 1263781 1280787 1296843 1312853 1326886
58324 1326886 1336579 1343283 1349817 1355831 1359511 1362121 1366345 1371662 1375842 1379678 1385753 1393761 1401561 1409650
58310 1409650 1420137 1432430 1444395 1456607 1471057 1486903 1501973 1517165 1534812 1554026 1572259
58299 1572259 1590088 1609674 1629943 1648305 1665762 1685241 1706139 1725695 1744527 1765543 1788490
58288 1788490 1810800 1832620 1855799 1879218 1900586 1921556 1945650 1972452 1999321 2027146 2058582
58277 2058582 2092287 2125118 2158447 2195858 2236150 2275264 2313694 2355145 2399225 2442576 2486040
58266 2486040 2533435 2584325 2635311 2687401 2744615 2806384 2869008 2933498 3004004 3079485 3155112
58255C155112P5738P9470Q1939P9806P8885Q3415Q7726Q7187Q7461R3773J01064
58244D091576J04274J08204J17396J26540J30957J36167J46778J56747J61309
58235E279948J67140J79654J92055J98713K07035K23720K41928K55173K70683
58226G216049K95206L21342L42455L66808M01508M37449M66803M99862N46752
58217A0894234N98771O46786P01226P73449Q54937R36693J030804J149550J282821
58208A8869271J421279J581166J779410K007591K260889K568453K962350L443834
58200C6894243M017795M731177N635392O743355Q071242R686884J1665322J4043876
58192A01489286J6886936K0338874K4531317K9499599L5232767M1515297M7257485
$$ plain form
58255 3155112 3230850 3310320 3392259 3472065 3550950 3634365 3722091 3809278 3896739 3990512 4091576
58244 4091576 4195850 4304054 4421450 4547990 4678947 4815114 4961892 5118639 5279948
58235 5279948 5447088 5626742 5818797 6017510 6224545 6448265 6690193 6945366 7216049
58226 7216049 7511255 7832597 8175052 8541860 8943368 9380817 9847620 10347482 10894234
58217 10894234 11493005 12139791 12841017 13614466 14469403 15406096 16436900 17586450 18869271
58208 18869271 20290550 21871716 23651126 25658717 27919606 30488059 33450409 36894243
58200 36894243 40912038 45643215 51278607 58021962 66093204 75780088 87445410 101489286
58192 101489286 118376222 138715096 163246413 192746012 227978779 269494076 316751561
58185C16751561M9959700M6483259L5130928J7303431k946898k1117071l4292862
58178D07272048m1705326m4103066m2896990l9549018l5206292l0582604k6077776
58171A47150976k1943769j8324803j5240785j2642472j0487975q737991p318970
58164E2454211o148746n183975m404840l773568l245466k803412k446045k155094
58156B2293065j904534j688249j509936j357587j214115j081739r71112q76758
58148A1689035p85992p01582o33261n76399n20264m68533m31209m04319l76879
58139F790597l50212l31762l17204k96938k73805k56969k44266k27219k07766
58130D284456j93800j83388j69183j53610j44537j40031j31984j21097j14310
$$ plain form
58185 316751561 366711261 413194520 448325448 465628879 462681981 441564910 407272048
58178 407272048 365566722 321463656 278566666 239017648 203811356 173228752 147150976
58171 147150976 125207207 106882404 91641619 78999147 68511172 59773181 52454211
58164 52454211 46305465 41121490 36716650 32943082 29697616 26894204 24448159 22293065
58156 22293065 20388531 18700282 17190346 15832759 14618644 13536905 12565793 11689035
58148 11689035 10903043 10201461 9568200 8991801 8471537 8003004 7571795 7167476 6790597
58139 6790597 6440385 6108623 5791419 5494481 5220676 4963707 4719441 4492222 4284456
58130 4284456 4090656 3907268 3738085 3584475 3439938 3299907 3167923 3046826 2932516
58121B932516j10909j04565r6037r1055q8542q2976p5587p1691o9842o4664n7521
58110B019127n3696n2039m7914m3210m3007m5268m4239m1078m1027m2933m1715
58099A523001l8466l8031l9085l6592l1834l0144l0821k8905k5110k4399k6296
58088A173318k5859k2961k1661k1771j9723j6616j6743j9319j9799j8309j8711
58077I51846k0574k0210j8359j8786k0341j8667j4849j4139j6681j7481j5285
58066G56474j3673j3527j2063r366q623r589q793o320n801p590q472q055r050
58053F35552j1261j1670j0393j0380j1327j0160p351o477p551p093m848m190n682
58040E27169o327n477n519o512o009m500n051p236p304m852l561m756n853n772
$$ plain form
58121 2932516 2821607 2717042 2621005 2529950 2441408 2358432 2282845 2211154 2141312 2076648 2019127
58110 2019127 1965431 1913392 1865478 1822268 1779261 1733993 1689754 1648676 1607649 1564716 1523001
58099 1523001 1484535 1446504 1407419 1370827 1338993 1308849 1278028 1249123 1224013 1199614 1173318
58088 1173318 1147459 1124498 1102837 1081066 1061343 1044727 1027984 1008665 988866 970557 951846
58077 951846 931272 911062 892703 873917 853576 834909 820060 805921 789240 771759 756474
58066 756474 742801 729274 717211 707845 699222 689633 680840 674520 668719 661129 652657 644602 635552
58053 635552 624291 612621 602228 591848 580521 570361 563010 556533 548982 541889 537041 532851 527169
58040 527169 520842 515365 509846 503334 497325 492825 487774 480538 473234 468382 464821 460065 454212 448440
58026D48440o352p680p528o139o297p901p683n089l275l513l596k618k265k695
58012C75809j968m06n75k303k518p56J09p38r28N7j74j910k299n78M89l02p86
57995C60223r3m38k694m516m496m157m314l475j384k08p77j187m91j71q74j296
57979C29652j286k375m249m479k735j622k307l037k868l027l633k972j077k18
57965B93767p55l81J442K307J292O26J546K365K047J889K278J557m03j280m95
57950C07802n35k516m183l908l039k597j396P61J754R64Q59K740M500M622M859
57935C10687O599Q075P705P043P728Q397P302N299L733J784j485m721o412p413
57921C54321r077j0752j1207j0828j0412r621q244p237o947o117m095k209j534
$$ plain form
58026 448440 442088 434408 426880 420741 414444 406543 398860 393771 390496 386983 383387 380769 378504 375809
58012 375809 373841 373435 372860 370557 368039 367283 367392 366654 365726 365783 365609 363699 361400 360822 361311 361009 360223
57995 360223 360130 359692 356998 352482 347986 343829 339515 336040 334656 334448 333671 332484 331993 331822 330948 329652
57979 329652 328366 325991 321742 317263 314528 312906 310599 307562 304694 301667 298034 295062 293985 293767
57965 293767 293012 292631 294073 296380 297672 298298 299844 302209 304256 306145 308423 309980 309577 308297 307802
57950 307802 307267 304751 300568 296660 293621 291024 289628 290389 292143 293107 293966 296706 301206 305828 310687
57935 310687 317286 325361 333066 340109 347837 356234 363536 368835 372568 374352 372867 368146 361734 354321
57921 354321 345244 334492 323285 312457 302045 292424 284180 276943 269996 263879 259784 257575 256041
57908B56041j295o81k04o9O26J872K186J208N23P65M66r57j771r40Q1J16K57J395
57890B59619K384K386K529L433L598K190Q89J059J449Q34M49J508K587J927M44
57875B87285l8J87k32j069j264r79r11p35K2P01N97J74q6n98j280r06Q41K354
57857B84063K422J855J676J541J163J295K010K051J163Q41J471J111j195l365
57843B98102l413k359k006k053j601j357k089k680j946p34j80L37J534K371J995
57828B83921J720K852M247M279L545L427L544K986K463K913L374K540J063P7j059
57813C21892l376n974p472q384r764j0794j0130q472p379o755n777n100n653o326
57799B20536n452l691k957l280l200k498k090j781o27Q88J308N98R2K70M91N40
$$ plain form
57908 256041 254746 254065 253861 253792 254418 256290 258476 259684 260207 260972 261438 260481 258710 257770 257851 257967 258224 259619
57890 259619 262003 264389 266918 270351 273949 276139 277028 278087 279536 280370 280819 282327 284914 286841 287285
57875 287285 287247 287434 287202 286133 284869 283890 282979 282244 282266 282967 283564 283738 283652 283054 281774 280868 281709 284063
57857 284063 286485 288340 290016 291557 292720 294015 296025 298076 299239 300080 301551 302662 301467 298102
57843 298102 294689 292330 290324 288271 286670 285313 283224 280544 278598 277864 277684 278021 279555 281926 283921
57828 283921 285641 288493 292740 297019 300564 303991 307535 310521 312984 315897 319271 321811 322874 322951 321892
57813 321892 318516 312542 305070 296686 286922 276128 265998 257526 250147 243392 237615 232515 226862 220536
57799 220536 215084 211393 208436 205156 201956 199458 197368 195587 194960 195848 197156 197754 197846 198116 198607 199147
57783A99147P99J228J738K926M979O607O638N820N443N286M556L751L584L196
57769B55698J589k21o74m37j342l285m490m377l936l648l096k318j661p15Q30
57754B27917J922J597R12J424K540K622J979K275L449L802L005K470K605K083
57740B60602K90j597k449k451k146j743j676k423l521l943l511k920k534k216
57726B27762k052k111j916j181m85j88M51J821K701J974N36j38k92r17j605j429
57710B22931j024j591k494k195q91l5J59M88O69n8p58J16J769J871K63p85j99
57693B18236O01M20j65n41j073j733j776j338j554k504k833j923p26L9P42J544
57677B05416J964K230L463O012R078J2307J6252K0993K5944L1334L8174M6127
$$ plain form
57783 199147 199946 201174 202912 205838 210817 217424 224062 229882 235325 240611 245167 248918 252502 255698
57769 255698 257287 257066 256392 255955 254613 251328 246838 242461 238525 234877 231781 229463 227802 227087 227917
57754 227917 229839 231436 232348 233772 236312 238934 240913 243188 246637 250439 253444 255914 258519 260602
57740 260602 260892 259295 256846 254395 252249 250506 248830 246407 242886 238943 235432 232512 229978 227762
57726 227762 225710 223599 221683 220502 220017 219829 220280 222101 224802 226776 227312 227174 226882 225965 224360 222931
57710 222931 221907 220316 217822 215627 214736 214701 214860 215348 216017 215959 215201 215317 217086 218957 219220 218435 218236
57693 218236 218837 219257 219092 218551 217478 215745 213969 212631 211077 208573 205740 203817 203091 203130 203872 205416
57677 205416 207380 209610 213073 219085 228163 240470 256722 277715 303659 334993 373167 419294
57665D19294N2717N4942N0587L8348J8865l915k4325l8717m6816m9662m8136m3726
57653C79456l8472l3338k7921k2341j7794j4811j2496j0090p931o367n065l861
57641A78969l044k461j617q14q46j383j193j66M66J91j43l4m7l67l11J73J03q61
57623A66615j748j875j737j795j704j298j063j180j209j090j265j641j695j629
57609A45686k055k491j838m21J91l62p73l81m5k87m48k71m80j166j372r25q94
57592A31668j547j759j209j225k433l406k909j806j513j895j950j407n58L58P70
57577A09179k7j531k180j539r38j223j538j163q97j386j753j220o46j041j787
57562I0310j811j400j392j514r71J03R79J452J540R42k28r13m12N74J070J233
$$ plain form
57665 419294 472011 526953 577540 615888 634753 630838 606513 567796 520980 471318 423182 379456
57653 379456 340984 307646 279725 257384 239590 224779 212283 202193 194262 187895 182830 178969
57641 178969 175925 173464 171847 171033 170187 168804 167611 167445 167911 168102 167959 167925 167878 167511 167200 167373 167476 166615
57623 166615 164867 162992 161255 159460 157756 156458 155395 154215 153006 151916 150651 149010 147315 145686
57609 145686 143631 141140 139302 138881 139072 138710 137937 137556 137511 137224 136776 136505 136025 134859 133487 132562 131668
57592 131668 130121 128362 127153 125928 123495 120089 117180 115374 113861 111966 110016 108609 108051 108409 109179
57577 109179 109152 107621 105441 103902 102964 101741 100203 99040 98143 96757 95004 93784 93138 92097 90310
57562 90310 88499 87099 85707 84193 83222 83325 84304 85756 87296 88238 88010 87097 86685 87259 88329 89562
57546H9562J635K074K027J620J228Q47O17J091K252L103L060K772K820K661J723
57531A19092N17k82q57j393j297l10N22J70q61j407j320j286j628k231k960l401
57515A01068k936j796j209j720k363k185j550j081n02M24Q86K60o65q43m89l03
57499H4996j16M29P54K55m28l95o8m13j225j607j575j846k315k153j242k93K69
57482G3027N68N95K69j6K35Q02J078R14N10j26r25j357j075n49l73l73o9L78M09
57463G3922j01p65j122q03J83J012P44k67n85K59J022O99o1k94k45n00o58j93
57445G2247L29J22l89l24J94M65M94O62O97J98l25q2P19J206J088O68R4m90o19
57426G6954j44K77J70J1K89N02O7n67p00n69p17q95n84OM44R03J553J877J530
$$ plain form
57546 89562 91197 93271 95298 96918 98146 98993 99610 100701 102953 106056 109116 111888 114708 117369 119092
57531 119092 119609 119327 118470 117077 115780 115470 115992 116162 115301 113894 112574 111288 109660 107429 104469 101068
57515 101068 98132 96336 95127 93407 91044 88859 87309 86228 85726 86150 87036 87296 86631 85788 85299 84996
57499 84996 84880 85309 86063 86318 85890 85495 85427 85014 83789 82182 80607 78761 76446 74293 73051 72758 73027
57482 73027 73595 74190 74459 74443 74678 75480 76558 77472 77982 77856 76931 75574 74499 73950 73577 73204 73135 73513 73922
57463 73922 73821 73056 71934 71131 71314 72326 73070 72803 72218 72477 73499 74198 74137 73843 73598 73098 72440 72247
57445 72247 72576 72698 72309 71985 72179 72644 73138 73800 74497 74695 74370 74288 75007 76213 77301 77969 78063 77573 76954
57426 76954 76810 77087 77257 77268 77557 78059 78126 77559 76859 76290 75573 74678 74094 74100 74544 75447 77000 78877 80407
57407H0407J092J024P76q1q61r96j192k034k601j910o98j54J41J205K395K190
57391G8703O93n30q20q80j054q68k22M41J011J563J609P82r2j2O32Q63Q73J385
57373H4077J845J160j80o12K0M12J57K09Q63J136M71m72j046j214q22K82J285
57356H7571J125K30J00R96J661J507J414J988K616K766K742K647J974P77J8K19
57340A10351Q05J163J270J030J90p72r04k21L05L84P74J676K152J660R06N57K31
57323A21557n24j236j189m10N15J053Q76Q5n68m14K16N25N60R34J461J309N12
57306A25262JM6j2k93j0J043J894J810J194O87L51J21L1k33r89j635j173J35Q44
57287A29074L27n31r65j301j887k311k368k642l503m409m804m893n111n525o004
$$ plain form
57407 80407 81499 82523 83299 83218 82357 81361 80169 78135 75534 73624 72926 72772 72913 74118 76513 78703
57391 78703 79396 78866 78046 77166 76112 75244 75022 75463 76474 78037 79646 80428 80336 80324 80956 81819 82692 84077
57373 84077 85922 87082 86902 86290 86310 86722 86879 87088 87951 89087 89558 89086 88040 86826 86004 86286 87571
57356 87571 88696 88926 89026 90022 91683 93190 94604 96592 99208 101974 104716 107363 109337 110114 110132 110351
57340 110351 111156 112319 113589 114619 114809 114037 113133 112912 113217 113601 114375 116051 118203 119863 120769 121326 121557
57323 121557 121033 119797 118608 118198 118713 119766 120642 120727 120159 119745 119961 120486 121046 121980 123441 124750 125262
57306 125262 125263 125309 125297 125004 124994 126037 127931 129741 130935 131622 131973 132094 132125 131892 130903 129268 128095 128230 129074
57287 129074 129401 128870 127905 126604 124717 122406 120038 117396 113893 109484 104680 99787 94676 89151 83147
57272H3147o283n811m437l098k770k878k080m20Q53J598L014N251O822O972O847
57257H6727P379P802P349O802P051P437O888N746N139N341N806O151O180N660
57243A77458M878M718N430O095N941N414N245N359N370N393N637N953O375P268
57229B56534Q407Q879Q492Q283Q959R786R782R080Q344P770P387P478P997Q332
57215C75510Q329Q616R446J0235J0826J1981J3873J5297J5355J4835J4895J5452
57203E24650J5925J6553J7804J9176J9830J9778J9540J9309J9231J9798K1099
57192G32693K2366K3024K3384K3703K3533K2773K2236K2313K2248K1678K1674
57181I81625K2985K4479K4701K4009K3699K3929K4064K4228K4889K5479K5063
$$ plain form
57272 83147 76864 71053 66616 63518 60748 57870 55790 55370 56223 57821 60835 66086 72908 79880 86727
57257 86727 94106 101908 109257 116059 123110 130547 137435 143181 148320 153661 159467 165618 171798 177458
57243 177458 182336 187054 192484 198579 204520 209934 215179 220538 225908 231301 236938 242891 249266 256534
57229 256534 264941 273820 282312 290595 299554 309340 319122 328202 336546 344316 351703 359181 367178 375510
57215 375510 383839 392455 401901 412136 422962 434943 448816 464113 479468 494303 509198 524650
57203 524650 540575 557128 574932 594108 613938 633716 653256 672565 691796 711594 732693
57192 732693 755059 778083 801467 825170 848703 871476 893712 916025 938273 959951 981625
57181 981625 1004610 1029089 1053790 1077799 1101498 1125427 1149491 1173719 1198608 1224087 1249150
57170A249150K3997K3433K3460K3208K2536K2259K2783K3730K4765K5766K6368
57159A511455K6466K6893K8524L0859L2567L3233L3643L4605L6350L8849M1617
57148A875061M3512M3747M3062M3033M4355M6394M8203M9248M9524M9654N0443
57137B386236N1827N2857N3278N4134N6042N7994N8933N9432O0352O0888N9678
57126C011651N7199N5242N4392N3817N3324N3826N5795N8694O2145O6260P0831
57115C653176P5425Q0310Q6110R2729R9847J08244J19210J32844J48378J66164
57105D762437J87762K14101K45206K81965L26700L81740M48796N30057O28564
57096H007328P47098Q87781J052588J242600J456303J689528J936932K191978
$$ plain form
57170 1249150 1273147 1296580 1320040 1343248 1365784 1388043 1410826 1434556 1459321 1485087 1511455
57159 1511455 1537921 1564814 1593338 1624197 1656764 1689997 1723640 1758245 1794595 1833444 1875061
57148 1875061 1918573 1962320 2005382 2048415 2092770 2139164 2187367 2236615 2286139 2335793 2386236
57137 2386236 2438063 2490920 2544198 2598332 2654374 2712368 2771301 2830733 2891085 2951973 3011651
57126 3011651 3068850 3124092 3178484 3232301 3285625 3339451 3395246 3453940 3516085 3582345 3653176
57115 3653176 3728601 3808911 3895021 3987750 4087597 4195841 4315051 4447895 4596273 4762437
57105 4762437 4950199 5164300 5409506 5691471 6018171 6399911 6848707 7378764 8007328
57096 8007328 8754426 9642207 10694795 11937395 13393698 15083226 17020158 19212136
57088A9212136K445717K687571K907506L095433L237990L317130L310434L189772
57080D3403689K922741K487569J897827J212279N11168j45381p39831j283569
57072E0266492j786567k240366k623295k914825l104860l194823l194333l116872
57064B8090551k976538k787205k563344k320134k071733j829243j600274j389689
57056A0552391j200170j032437q85974p59972o53504n64979m92081m32375l83459
57047D147440l42631l07162k75290k46463k20318j96103j73466j53023j35411
57038B097573j20200j06320r3072q0107o6873n2915l8357k3534q686M753J2846
57027A525108J0632l960k7568n2852p2632q3436q6163q3884p8971p2234o4245
$$ plain form
57088 19212136 21657853 24345424 27252930 30348363 33586353 36903483 40213917 43403689
57080 43403689 46326430 48813999 50711826 51924105 52435273 52289892 51550061 50266492
57072 50266492 48479925 46239559 43616264 40701439 37596579 34401756 31207423 28090551
57064 28090551 25114013 22326808 19763464 17443330 15371597 13542354 11942080 10552391
57056 10552391 9352221 8319784 7433810 6673838 6020334 5455355 4963274 4530899 4147440
57047 4147440 3804809 3497647 3222357 2975894 2755576 2559473 2386007 2232984 2097573
57038 2097573 1977373 1871053 1777981 1697874 1631001 1578086 1539729 1516195 1507509 1512262 1525108
57027 1525108 1535740 1531780 1504212 1451360 1378728 1295292 1209129 1125245 1046274 974040 909795
57016I09795n6296m9484m3678l8282l3526l0032k7514k4905k1687j8304j5317
57005E50770j2934j1269j0302r610q787q008p647p494o998o159n447n015m613
56992D46487m147l625k794j477r1Q98J820L412N712Q045R772J0281Q652M418j450
56977D85913p221j2007j5786j8107j8121j6010j3210j0823q700o424m239k525
56965C52740j076N56K489M671P217J0253J3720J7471K1168K3926K4428K1633J5346
56952E14542O347l742j2924j9708k3559k4545k3040k0074j7135j4864j2485r166
56940C39647n441k375R2K908O344R858J3316J7312K2274K7929L3289L6288L4009
56927E35450K4855J0663m388j7004k6176l1904l4176l3520l1148k7908k3931j9572
$$ plain form
57016 909795 853499 804015 760337 722055 688529 658497 630983 606078 584391 566087 550770
57005 550770 537836 526567 516265 506655 497868 489860 482213 474719 467721 461562 456115 451100 446487
56992 446487 442340 438715 435921 434444 434353 435251 437071 440483 446195 454240 464012 474293 482945 487363 485913
56977 485913 478692 466685 450899 432792 414671 398661 385451 374628 365928 359504 355265 352740
56965 352740 351664 352220 354709 359380 366597 376850 390570 408041 429209 453135 477563 499196 514542
56952 514542 520889 517147 504223 484515 460956 436411 413371 393297 376162 361298 348813 339647
56940 339647 334206 331831 331923 334831 341175 351033 364349 381661 403935 431864 465153 501441 535450
56927 535450 560305 570968 566580 549576 523400 491496 457320 423800 392652 364744 340813 321241
56915C21241j5829j3398j1997j0941r823q530p205o195n567m781l472k209j719
56902B19575j711j414q99p36o70J23J533K615L195M134N947Q235J0555J2762J4559
56887B77803J5878J7607K0501K3298K3311J9216J2101L828m212j0599j3988j4457
56875C70287j3562j2428j0807q315n326k190J274M998Q499J1919J6165K1523K7277
56862D09314L3041L9419M6769N4054N9109N9146N1330L4754J2405j0068k8150
56851G61123m0232m6118m6011m1495l5452k9656k3646j6653r204j998N310J3236
56839D89204K1608L0420M0301N1383O3075P5443Q8712J00033J02609R0296O2779
56828A215863K5562j3740m8070p2203q4328q6663q3014p5803o6039n5034m4423
$$ plain form
56915 321241 305412 292014 280017 269076 259253 250723 243518 237323 231756 226975 223503 221294 219575
56902 219575 217864 216450 215551 214815 214145 214268 215801 218416 221611 225745 231692 239927 250482 263244 277803
56887 277803 293681 311288 331789 355087 378398 397614 409715 413543 409331 398732 384744 370287
56875 370287 356725 344297 333490 325175 319849 317659 318933 323931 332430 344349 360514 382037 409314
56862 409314 442355 481774 528543 582597 641706 700852 752182 786936 799341 789273 761123
56851 761123 720891 674773 628762 587267 551815 522159 498513 481860 472656 470658 475968 489204
56839 489204 510812 541232 581533 632916 695991 771434 860146 960179 1062788 1153084 1215863
56828 1215863 1241425 1227685 1179615 1107412 1023084 936421 853407 777604 711565 656531 612108
56817F12108l4844k5917j7323q940l05R030J8824K8642L8688M9409O0387O9723
56805G99482P3879O8310N0145K1621j0023l7226n6419o7701p2158p0980o5947
56794F32983n8854n0495m1209l1943k3813j7103j1487o664k036L361R810J6528
56782D19078K3008K9627L5892L9248L6902K8180J4339k591j9601l2857m0147m2626
56770D88452m2780m1411l7999l3064k8151k3917j9971j6329j3472j1242r105p295
56758B03716o330n760m836m030m308n150m915l201j385o93j022j727k374k564
56744A55421k166j742j847k008j420m57l03j113j747j432o97m31q38j495j785
56729A35940j294k61N67Q89J139J436J130J31l66M42J509J491Q76J022J786J898
$$ plain form
56817 612108 577264 551347 534024 525084 524779 533809 552633 581275 619963 669372 729759 799482
56805 799482 873361 941671 991816 1013437 1003414 966188 909769 842068 769910 698930 632983
56794 632983 574129 523634 482425 450482 426669 409566 398079 391415 389379 392740 402550 419078
56782 419078 442086 471713 507605 546853 583755 611935 626274 623683 604082 571225 531078 488452
56770 488452 445672 404261 366262 333198 305047 281130 261159 244830 231358 220116 211011 203716
56758 203716 197386 191626 186790 182760 178452 173302 168387 165186 163801 163108 162086 160359 157985 155421
56744 155421 153255 151513 149666 147658 146238 145781 145478 144365 142618 141186 140489 140058 139220 137725 135940
56729 135940 134646 134385 134952 135841 136980 138416 139546 139677 139311 139753 141262 142753 143629 144651 146437 148335
56713A48335J216P87Q39N49j95m37J83Q83J113J169J181P45r7p03q07p52n97l4
56695A53378P28J041Q73Q42J122J253J029O95L45m6r9M75J129J172R28J079J239
56678A67183M90q90j570j061j71L49M17pq39j221l17J199J824J358J028J414J801
56661A70987J791J965K542K769K304J899K158K613K689K582K678K855K885K738
56647B05455K297J407M46L1N0j64o42p09k24P7k85r50j489j943k408k830l272
56630A94847l715l629k647j445j080j524j811j495r50m02J94M20k49j398k062
56615A73054k117k152k115j433m05l4l78n12j76o6l60m02j11k49r27j260q97n11
56597A58949l75J39J104J559J102P03J160J900K079J829J646J415Q26O0n19q56
$$ plain form
56713 148335 149551 150338 151177 151726 151531 151094 151277 152160 153273 154442 155623 156368 156271 155568 154761 154009 153412 153378
56695 153378 154106 155147 156020 156862 157984 159237 160266 160961 161306 161260 161161 161636 162765 163937 164865 165944 167183
56678 167183 167673 166783 165213 164152 163981 164330 164747 164740 163901 162680 162363 163562 165386 166744 167772 169186 170987
56661 170987 172778 174743 177285 180054 182358 184257 186415 189028 191717 194299 196977 199832 202717 205455
56647 205455 207752 209159 209605 209636 209686 209522 208880 208171 207947 208024 207739 206789 205300 203357 200949 198119 194847
56630 194847 191132 187503 184856 183411 182331 180807 178996 177501 176551 176149 176343 176763 176514 175116 173054
56615 173054 170937 168785 166670 165237 164832 164798 164420 163908 163732 163666 163306 162904 162793 162544 161617 160357 159460 158949
56597 158949 158574 158713 159817 161376 162478 163181 164341 166241 168320 170149 171795 173210 174036 174096 173577 172721
56581A72721r95r32q11p30l64M54J062P52Q5K39J255K137K520K815K878K149J155
56564A86390J134J920K036J223J101K573M421N264N385N571N573M812L570K469
56550B33442J570P55J54k81q04j062m13O63P27n15j629j585j071j001j002l98
56534B27550M24N91n9j100k041k262j351K7N84J17k66L8L31K0n65j174k100l073
56516B15691l116k198j570j823k044j684j599k298k735k049j118j013j207o79
56502A90558K14M60J27KQ6k63j102j781j815j139j2Q88R01L69M14J288J923J564
56484A92682Q34O45R79J406J735J637O69p11j254n94K15L87L70N89N66K8l30m0
56466A99813M24P47J363K238K414J610R30J034R95j8j218j436p72k4N07P60N25
$$ plain form
56581 172721 171726 170794 169983 169253 168889 169343 170405 171157 171242 171481 172736 174873 177393 180208 183086 185235 186390
56564 186390 187524 189444 191480 192703 193804 196377 200798 206062 211447 217018 222591 227403 230973 233442
56550 233442 235012 235767 235921 235640 234836 233774 233361 234024 234751 234236 232607 231022 229951 228950 227948 227550
56534 227550 227974 228565 228506 227406 225365 223103 221752 221779 222363 222480 222214 222252 222583 222603 222038 220864 218764 215691
56516 215691 212575 210377 208807 206984 204940 203256 201657 199359 196624 194575 193457 192444 191237 190558
56502 190558 190772 191232 191359 191361 191447 191184 190082 188301 186486 185347 185335 186223 187124 187493 187907 189195 191118 192682
56484 192682 193516 194161 195140 196546 198281 199918 200587 199876 198622 198028 198243 198630 199000 199589 200155 200183 199853 199813
56466 199813 200237 200984 202347 204585 206999 208609 209539 210573 211568 211550 210332 208896 208124 208100 208607 209367 209892
56449B09892J01K78R79J128M76Q2L51K41o29r55O5J186J070K75o3j26n07p82m19
56430B12643J0q9j75L04Q03P84P58J054R75K60n8N41R35L28k61J12N96K50j47
56411B19623L12Q51M83q3J42N56K61j05L32Q98P27N15J078J581J140P79J689K887
56393B33666K797J902J585J504N68o36p74l22p42j851k299j963j630j062L61J758
56377B32862J784R56P46R90M57o69j128q85q19p02K52J369J374Q18J248K381K560
56360B43594J688J306J766J777Q89J74K70O84J178K054K917K888K090J427J063
56345B65765N41K1j51m65j252j437j52J315J240L40O14K043K914K871L096L679
56329B80982L448K322J548J517J504J471J981K533K179J530J930K814K360O19
$$ plain form
56449 209892 209993 210271 211250 212378 212854 212936 213287 213528 212899 211944 212009 213195 214265 214540 214477 214351 213844 213062 212643
56430 212643 212653 212564 212389 212693 213496 214280 215038 216092 217067 217327 217269 217810 218745 219073 218812 218924 219520 219770 219623
56411 219623 219935 220786 221269 221186 221328 221884 222145 222040 222372 223270 223997 224512 225590 227171 228311 229090 230779 233666
56393 233666 236463 238365 239950 241454 242022 241386 240612 240290 239548 237697 235398 233435 231805 230743 231104 232862
56377 232862 234646 235602 236348 237338 237795 237126 235998 235113 234294 233592 233844 235213 236587 237405 238653 241034 243594
56360 243594 245282 246588 248354 250131 251020 251194 251464 252148 253326 255380 258297 261185 263275 264702 265765
56345 265765 266306 266327 266176 265711 264459 263022 262870 264185 265425 265765 266379 268422 271336 274207 277303 280982
56329 280982 284430 286752 288300 289817 291321 292792 294773 297306 299485 301015 302945 305759 308119 308738
56315C08738m36M3R59J554K177K677K337J544J447J904J852J545K189L493M009
56300C36032L765M120N059N164M357M086M623M765M362M583N355N226M209M113
56286C99819N419O447O256O006O576P159P121P162P788Q454Q938R829J1145J2167
56272E10286J2891J3921J4871J4846J4491J5347J7246J8584J9269K0832K3507
56261F96091K5811K7367K9558L2956L6603M0445M5812N2829N9882O6429P3993
56250A187776Q3438R3613J03446J13233J23068J32039J39749J46714J52625J56057
56240B431758J56179J52949J45629J33334J17011R8505P7743N3470K6650J52k4985
56229C368395m9718p3280r2783j07352j19127j29163j35620j37425j36527j34886
$$ plain form
56315 308738 308302 308345 309304 310858 313035 315712 318049 319593 321040 322944 324796 326341 328530 332023 336032
56300 336032 339797 343917 348976 354140 358497 362583 367206 371971 376333 380916 386271 391497 395706 399819
56286 399819 405238 411685 417941 423947 430523 437682 444803 451965 459753 468207 477145 486974 498119 510286
56272 510286 523177 537098 551969 566815 581306 596653 613899 632483 651752 672584 696091
56261 696091 721902 749269 778827 811783 848386 888831 934643 987472 1047354 1113783 1187776
56250 1187776 1271214 1364827 1468273 1581506 1704574 1836613 1976362 2123076 2275701 2431758
56240 2431758 2587937 2740886 2886515 3019849 3136860 3235365 3313108 3366578 3393228 3393380 3368395
56229 3368395 3318677 3245397 3152614 3045262 2926135 2796972 2661352 2523927 2387400 2252514
56219B252514j32022j27134j21105j14810j07776r9924r2455q5778p8769p1160
56209A221581o4442n9346n4684m9701m5163m1372l7424l3306l0228k8112k5372
56198G52431k1865j9308j8009j6190j3422j1573j1286j0687q874p514p496p194
56186E99013n629m315m247l982k576j524j968k539j951j150j162j196n38PL3N12
56170E66788J566J793J086J386L352N011N049M647M783M728M442N384P450Q349
56156F25814P511P357R183J1185J2199J3826J6950J9749K1228K3339K7394L1807
56144H27542L5623M0817M8783N7799O6334P5358Q4831R1306R1790Q7044P8821
56133A586048O7297N3806M2517L6240L3392L1517L0489K9690K5821J6976O013
$$ plain form
56219 2252514 2120492 1993358 1872253 1757443 1649667 1549743 1457288 1371510 1292741 1221581
56209 1221581 1157139 1097793 1043109 993408 948245 906873 869449 836143 805915 777803 752431
56198 752431 730566 711258 693249 677059 663637 652064 640778 630091 621217 613703 606207 599013
56186 599013 593384 589069 584822 580840 578264 576740 574772 572233 570282 569132 567970 566774 566236 566243 566276 566788
56170 566788 568354 570147 571233 572619 575971 580982 586031 590678 595461 600189 604631 610015 617465 625814
56156 625814 633325 640682 649865 661050 673249 687075 704025 723774 745002 768341 795735 827542
56144 827542 863165 903982 952765 1010564 1076898 1152256 1237087 1328393 1420183 1507227 1586048
56133 1586048 1653345 1707151 1749668 1785908 1819300 1850817 1881306 1910996 1936817 1953793 1959806
56122A959806l152r708j4059j5466j4843j6541k3753l4835m6861n9495p2237q1479
56110A567377q4214q1967p7736p1730o3331n4232m6218l8486l0295k3540j9633
56099I75995j6683j2739q880o390m071j160N33K94O31K798M127K966K112L854
56085I43387N831N590N108O677Q422Q109P495Q629R754R117Q820J0618J1970J0811
56071A060338R948J2083J4677J4627J3768J4743J5686J4339J3149J4847J7085
56060A215290J6956J6543J8425K0006J8300J6047J6853J8502J7428J5624J6513
56049A406487J8109J7021J5386J6880J9674K0191K0006K2033K3911K2414K0550
56038A622662K2715K6583K7420K6734K8857L2511L3687L3495L5310L7561L7132
$$ plain form
56122 1959806 1956654 1946946 1932887 1917421 1902578 1886037 1862284 1827449 1780588 1721093 1648856 1567377
56110 1567377 1483163 1401196 1323460 1251730 1188399 1134167 1087949 1049463 1019168 995628 975995
56099 975995 959312 946573 937693 931303 927232 926072 926605 926899 927530 930328 934455 937421 939533 943387
56085 943387 949218 954808 959916 966593 975015 983124 990619 999248 1009002 1018119 1026939 1037557 1049527 1060338
56071 1060338 1070286 1082369 1097046 1111673 1125441 1140184 1155870 1170209 1183358 1198205 1215290
56060 1215290 1232246 1248789 1267214 1287220 1305520 1321567 1338420 1356922 1374350 1389974 1406487
56049 1406487 1424596 1441617 1457003 1473883 1493557 1513748 1533754 1555787 1579698 1602112 1622662
56038 1622662 1645377 1671960 1699380 1726114 1754971 1787482 1821169 1854664 1889974 1927535 1964667
56027A964667L6389L8979M2390M2495M1601M3876M7185M7811M8725N4170O0663
56016B468951O2736O3022O6936P2071P3138P2743P6548Q2120Q3718Q3795Q8410
56005C294188R5453R8968J00960J07003J14543J17852J20237J28534J39802J46593
55995D464133J50989J59878J71007J77862J83739J96282K12594K24970K36539
55986F177993K55496K78916K98721L18405L46551L79364M07839M36331M74838
55977I374454N19236N59855O02831O60820P29549P97419Q71132R66086J079113
55968A6160495J198688J334492J506531J713236J943714K213618K553042K968449
55960C1592265L457704M053900M809192N745080O869388Q231673R905240J1931056
$$ plain form
56027 1964667 2001056 2040035 2082425 2124920 2166521 2210397 2257582 2305393 2354118 2408288 2468951
56016 2468951 2531687 2594709 2661645 2733716 2806854 2879597 2956145 3038265 3121983 3205778 3294188
56005 3294188 3389641 3488609 3589569 3696572 3811115 3928967 4049204 4177738 4317540 4464133
55995 4464133 4615122 4775000 4946007 5123869 5307608 5503890 5716484 5941454 6177993
55986 6177993 6433489 6712405 7011126 7329531 7676082 8055446 8463285 8899616 9374454
55977 9374454 9893690 10453545 11056376 11717196 12446745 13244164 14115296 15081382 16160495
55968 16160495 17359183 18693675 20200206 21913442 23857156 26070774 28623816 31592265
55960 31592265 35049969 39103869 43913061 49658141 56527529 64759202 74664442 86595498
55952H6595498J4350693J7276454K0841650K5100290L0049921L5583042M0994915
55945B70792463M4369114M2899811L4558906J9865541K009773j4881866k7782815
55938C71830927l5601242l8765130l8432529l5905314l2275674k8263253k4269878
55931A38317907k0537794j7221601j4370844j1954190r932414q277061o934937
55924D9089066n832234m919979m178034l577154l075418k651222k304242k022697
55916B0528086j780636j567329j389447j243137j111096r88170q84099p99190
55908A0764982p20937o46161n84148n35840m90620m45680m09128l81877l54727
55899F195864l25355l01132k83209k64018k42256k24871k12622j98350j80952
$$ plain form
55952 86595498 100946191 118222645 139064295 164164585 194214506 229797548 270792463
55945 270792463 315161577 358061388 392620294 412485835 414495608 399613742 371830927
55938 371830927 336229685 297464555 259032026 223126712 190851038 162587785 138317907
55931 138317907 117780113 100558512 86187668 74233478 64301064 56024003 49089066
55924 49089066 43256832 38336853 34158819 30581665 27506247 24855025 22550783 20528086
55916 20528086 18747450 17180121 15790674 14547537 13436441 12448271 11564172 10764982
55908 10764982 10044045 9397884 8813736 8277896 7787276 7341596 6932468 6550591 6195864
55899 6195864 5870509 5569377 5286168 5022150 4779894 4555023 4342401 4144051 3963099
55890C963099j66924j56824j44034j28274j17039j12245j08183j03686j03578
55881B822312j06891j06171j00148r5189r2737q7068p7176o9360o5932o2206n6753
55870A902681n4116n5152n4700n1131m8766m8748m6724m1666l8096l7556l6337
55859A389689l3468l2620l4296l4258l1429k9529k9405k7507k3390k1047k1402
55848A071338k1096j9866k1367k5332k6783k4599k3218k4204k3775k0621j8563
55837H21914j9218j9157j6732j4966j5298j4959j2764j1396j1765j1117q704p509
55825F58329q401q435o670n945p217p874p316q364j1408j2921j1603j0365j0548
55812E41262r836p658o830p886p433m303j863k033k321r84J67K88J694N118P647
$$ plain form
55890 3963099 3796175 3639351 3495317 3367043 3250004 3137759 3029576 2925890 2822312
55881 2822312 2715421 2609250 2509102 2413913 2321176 2234108 2156932 2087572 2021640 1959434 1902681
55870 1902681 1848565 1793413 1738713 1687582 1638816 1590068 1543344 1501678 1463582 1426026 1389689
55859 1389689 1356221 1323601 1289305 1255047 1223618 1194089 1164684 1137177 1113787 1092740 1071338
55848 1071338 1050242 1030376 1009009 983677 956894 932295 909077 884873 861098 840477 821914
55837 821914 802696 783539 766807 751841 736543 721584 708820 697424 685659 674542 665838 658329
55825 658329 649928 641493 634823 628878 621661 613787 606471 598107 586699 573778 562175 551810 541262
55812 541262 531426 523768 516938 509052 501619 497316 495453 493420 491099 490115 490282 490570 492264 497382 505029
55797E05029P652P193P454O496L581J099J19j406m113n466m536l849m536m406
55783E10311k937l311o947j0638j1715j1772j2593j2660j0473p490m992j622L385
55770D16546P909J0105J0563R375M811k873r822j3158j3978j4030j2922j0628
55758C81898r121r210q936p133n541n457n659n359n891p648q669q144p864q538
55744B78728q197o035m182l775k923o45Q93K62p58q07j439l535m840l714k038
55729B36995j790j925j214j040k581m208m286l896m209l994k241n74m80p51K3
55714B03829R47J092J575L157M410M444M644N518M963K076m29l96J97j244l626
55699B31157m622m815o027p585p582o212n029m285l529l270l732l550j882j28
$$ plain form
55797 505029 512681 519874 527328 533824 537405 538504 538623 537217 533104 527638 523102 519253 514717 510311
55783 510311 507374 504063 497116 486478 474763 462991 450398 437738 427265 419775 414783 413161 416546
55770 416546 424455 434560 445123 454498 459309 456436 446614 433456 419478 405448 392526 381898
55758 381898 372777 363567 354631 347498 341957 336500 330841 325482 319591 311943 303274 295130 287266 278728
55744 278728 270531 264496 260314 256539 253616 252971 253864 254126 253368 252561 251122 247587 242747 239033 236995
55729 236995 235205 233280 232066 231026 228445 224237 219951 216055 211846 207852 205611 205037 204557 203806 203829
55714 203829 204776 205868 207443 210600 215010 219454 224098 229616 234579 236655 236226 235830 236027 234783 231157
55699 231157 226535 221720 215693 208108 200526 194314 189285 185000 181471 178201 174469 170919 169037 168909
55685A68909L95N67J423K089J841J941L296M512M415M186M771M629K554K77l12
55670B05493k98j391k712k670j928j763j429QJ172N63o35o95l73r76j339J22K101
55653A93250K324J357J385K528L327L701M432M720L238P39r73j816k806l745l976
55638B07685m310n682o980o677n538n326n868n812n139m651m027k782j883k125
55624A40885k199q19O84L72j049j658j523j760j805o52M55l00j986k357j650j791
55608A22847k676k552j457j004j165n12N78K04j558k503j793q56n93m08j97p38
55592A05617j733j874j100o41p18l92L08L71j20o5M80M48K0M10J379J354K54k22
55574A03776N77J397J423J298J377J062N06Q67K213K988K322J212P67P16L44l80
$$ plain form
55685 168909 169304 169871 171294 173383 175224 177165 180461 184973 189388 193574 198345 202974 205528 205805 205493
55670 205493 205195 203804 201092 198422 196494 194731 193302 193310 194482 195045 194410 193715 193342 192366 191027 191149 193250
55653 193250 195574 196931 198316 200844 204171 207872 212304 217024 220262 221001 220028 218212 215406 211661 207685
55638 207685 203375 197693 190713 184036 178498 173172 167304 161492 156353 151702 147675 144893 143010 140885
55624 140885 138686 137867 138551 138923 137874 136216 134693 132933 131128 130476 130931 130631 128645 126288 124638 122847
55608 122847 120171 117619 116162 115158 113993 113481 114059 114263 112705 110202 108409 107553 106960 106552 106355 105617
55592 105617 103884 102010 100910 100269 99551 99159 99467 99838 99718 99653 100133 100581 100601 101011 102390 103744 103998 103776
55574 103776 104353 105750 107173 108471 109848 110910 111416 112283 114496 117484 119806 121018 121785 122501 122845 122465
55558A22465j194j933k193j587n69m8j49k80k93n18r19j219j535j821j338J57
55542A07026J371J107K17K77J082J252P88R28J755K031J409Q91R58R46M46j26
55526A22358n72j111j606j735j809k152k159j251k71l68j111j243q15p90j123
55511A04242j051q51j337k074j983j463j776k670k716j844j389j629j409m08K86
55496H1928J17k68n18j010j568j394n16K14N66R24J056N12p9J61N52j18j223j105
55478G8231kK36o50r47n2O15K72oN22R71N95n4m60r43j471j316m97L1N4K66N97
55457G5992J42q71j049k48O2o14q96L2J091J323J293J518J328M05k37Q2N29L03
55439H0185o5O5K49N0L8O60J217R27R5n54p86o10p3L47J78m2N83J579J556N26
$$ plain form
55558 122465 121271 119338 117145 115558 114989 114941 114792 114512 114219 113701 112782 111563 110028 108207 106869 107026
55542 107026 108397 109504 109721 109998 111080 112332 113120 114048 115803 117834 119243 120134 121092 122038 122484 122358
55526 122358 121786 120675 119069 117334 115525 113373 111214 109963 109692 109324 108213 106970 106155 105365 104242
55511 104242 103191 102340 101003 98929 96946 95483 93707 91037 88321 86477 85088 83459 82050 81642 81928
55496 81928 82045 81777 81259 80249 78681 77287 76771 76985 77551 78475 79531 80043 79964 80125 80677 80559 79336 78231
55478 78231 78229 78465 77815 76868 76816 77431 77703 77697 78219 79190 79785 79731 79271 78328 76857 75541 75044 75075 75129 75395 75992
55457 75992 76134 75263 74214 73966 74028 73414 72518 72550 73641 74964 76257 77775 79103 79508 79271 79353 79882 80185
55439 80185 80120 80185 80434 80484 80522 81182 82399 83326 83421 82867 82081 81471 81398 81745 81923 81881 82464 84043 85599 86125
55419H6125K1N41Q61M18L38J273K074J787J190J184J162K77r91j756k061k243
55403I0200j991j166m41k77j71K54N11L44L84Q78J016K71o43j028j168j302q94
55386H4777J80R16O51J08P2J03m55j222j519j424j201o46J88O05L32O2K08K16
55368H1951j67k20M02Q13L64k67l80m53j051j545j076Q7J117J662J580O43o65
55351H2795j133m50K05%l00J02N58K18m86p43p70j001r84k76L98K24l19l58r6
55332G7584j42j54N00J407J649J221P11J24p87j570j507p16Q0N19N73K09k33l6
55314G9432P94J144L62p11j091j071j258j206k72R25J277Q34M56L25L0l02j76
55297G9492K61M19J87j78o73j222j206k63Q98J410J427J544J581R57j30r33j246
$$ plain form
55419 86125 86146 86687 87548 87966 88304 89577 91651 93438 94628 95812 96974 97251 96260 94504 92443 90200
55403 90200 88209 87043 86602 86325 86154 86408 86919 87263 87647 88525 89541 89812 89169 88141 86973 85671 84777
55386 84777 84957 85873 86524 86632 86704 86807 86352 85130 83611 82187 80986 80340 80528 81133 81465 81527 81735 81951
55368 81951 81784 81564 81966 82779 83143 82876 82496 82043 80992 79447 78371 78458 79575 81237 82817 83460 82795
55351 82795 81662 81212 81417 81417 81117 81219 81777 81995 81509 80766 79996 78995 78011 77735 78133 78357 78038 77680 77584
55332 77584 77442 77288 77788 79195 80844 82065 82776 82900 82113 80543 79036 78320 78400 78919 79492 79701 79468 79432
55314 79432 80226 81370 81732 81021 79930 78859 77601 76395 76123 77048 78325 79159 79615 79940 79970 79668 79492
55297 79492 79753 80172 80359 80181 79508 78286 77080 76817 77715 79125 80552 82096 83677 84634 84504 83571 82325
55280H2325j422j585j596j416r23J47J478K066J537Q39Q21R86O03J53M68J127
55264H5608J047K23m24n84p39j003r22m03Q7K94L72M45N11O15O41K77l92p47n12
55245H4394j44O2M14Q77P49m2l62M03J134O14n56r39l43L65P94J083R88L00l67
55226H9424m13l81j012j783j714j049p01n62J26J051J079N8r92j382j193m72O84
55209H0768J412Q93k53o83l28k22n36l53M43P09r2r65q68o0O10Q53Q22O21L88
55190H3159K60J00k51m44J7Q63J290J091Q02O89L62m27j287j643j220j18J086
55173H4329J516Q92M0j28K09K87N6J3J61P6j08J72Q69J335J324J089O33j97r60
55154I1608r63l24J65K47L73P27R72R79R04N98j44q08n50N08J288J140M29k97
$$ plain form
55280 82325 80903 79318 77722 76306 75383 75530 77008 79074 80611 81450 82271 83257 83860 84013 84481 85608
55264 85608 86655 86878 86454 85870 85131 84128 83206 82803 82890 83184 83556 84001 84512 85127 85768 86045 85653 84906 84394
55245 84394 84250 84312 84726 85603 86352 86310 85948 86351 87485 88099 87543 86604 86261 86626 87420 88503 89491 89791 89424
55226 89424 89011 88630 87618 85835 84121 83072 82371 81809 81935 82986 84065 84123 83131 81749 80556 80084 80768
55209 80768 82180 83073 82820 82137 81809 81587 81051 80698 81141 81850 81758 80793 79925 79865 80475 81328 82150 82771 83159
55190 83159 83419 83519 83268 82824 82841 83704 84994 86085 86887 87576 87938 87511 86224 84581 83361 83243 84329
55173 84329 85845 86737 86777 86649 86858 87145 87201 87214 87375 87451 87343 87515 88384 89719 91043 92132 92765 92568 91608
55154 91608 90645 90321 90486 90733 91106 91833 92805 93784 94688 95286 95142 94334 93784 94292 95580 96720 97149 96852
55136I6852q67j131q85l06J43L62N71P32N97J67m10j143j774j553k94Q44O81l68
55118I2218j033j156j531k108j922p90L48R90J574K203K220J450O46K93O5j74
55102I3293j6M80N46M5n8P93J792J950J335N22l33j126j281m63O61J090O47l4
55084I9843l79l11p6L1m5n0J29R5m59r78n95N01J147P77M8l39n17p27n75K30J062
55063I8812J049K58m11m45k33l59p20o05L63J597K066J426L07n57j010j139r10
55046I9489n02l96o15n57m2J39n14j195r36j26K09L3K7K15J16q3K05P58Q35N18
55026I7578M74O50M61J13L09P50M59m40p82l36j24n36o93j56K74M3k45k6L22M56
55006I8551P48J351J640J291Q67Q16P60M07J58K92M20K47ql21r53j520j139P9
$$ plain form
55136 96852 95985 94854 93969 93663 93806 94168 94739 95471 96068 96235 95825 94682 92908 91355 91061 91905 92586 92218
55118 92218 91185 90029 88498 86390 84468 83678 84026 85016 86590 88793 91013 92463 93109 93402 93467 93293
55102 93293 93277 93757 94303 94348 94290 95083 96875 98825 100160 100682 100349 99223 97942 97479 98140 99230 99877 99843
55084 99843 99464 99153 99077 99108 99063 99013 99142 99237 98778 97800 97205 97706 98853 99630 99678 99339 98822 98095 97520 97750 98812
55063 98812 99861 100119 99708 99263 99030 98671 97951 97346 97709 99306 101372 102798 103105 102548 101538 100399 99489
55046 99489 98987 98591 97976 97419 97377 97516 97002 95807 94871 94745 94954 94987 95014 95229 95345 95262 95467 96225 97060 97578
55026 97578 98052 98702 99163 99276 99585 100335 100794 100354 99572 99236 99112 98576 97883 97727 98001 98044 97799 97773 98095 98551
55006 98551 99299 100650 102290 103581 104448 105264 106024 106431 106589 106881 107301 107548 107540 107219 106266 104746 103607 103686
54988A03686Q33N21K2O5J50j49r4R03K030K180J486O67j76j120j569j004K0O09
54970A09060P29P96P55M91N16J209J868J542M11n56r75j096r46l12M99Q31N95
54953A15417K90K43K79J44k04o15q25o94n20p57j254j346q64m72o14q43o30j96
54935A06539k7r7j42k18m38n52k34M22J049J383J386J366J912L231M579N079M917
54918A30155M925N112M823M215M195M611M065K068o8j177j718k506l314l679l875
54903A47832m089l792k896k339k549k538j627p96r96j477j300j176j998k655j486
54888A16118P96J855J112K78N08J042J011P93R88J441J918K609L527M207M388
54873A42591M275L981L452K900K541J961O26j078k244k776l301l868l910l520
$$ plain form
54988 103686 104519 105040 105062 105127 105277 105128 105034 105937 107967 110147 111633 112300 112124 111004 109435 108431 108451 109060
54970 109060 109789 110585 111340 111831 112347 113556 115424 116966 117377 116821 115846 114750 113804 113492 113991 114822 115417
54953 115417 115707 115950 116229 116373 116169 115554 114729 114035 113515 112758 111504 110158 109294 108822 108208 107365 106735 106539
54935 106539 106512 106415 106273 106055 105617 105065 104831 105253 106302 107685 109071 110437 112349 115580 120159 125238 130155
54918 130155 135080 140192 145015 149230 153425 158036 162101 164169 164101 162924 161206 158700 155386 151707 147832
54903 147832 143743 139951 137055 134716 132167 129629 128002 127206 126210 124733 123433 122257 120259 117604 116118
54888 116118 116914 118769 119881 120159 120667 121709 122720 123513 124501 125942 127860 130469 133996 138203 142591
54873 142591 146866 150847 154299 157199 159740 161701 162327 161249 159005 156229 152928 149060 145150 141630
54859A41630l516m002m057l236k360k203k416k272j785j394j167q75n61m43n40
54844A10803o76o83m22R0M70J92p33j568j563p05K77O68M56K69N71J013R18L07
54826A09684p1J80O15P41O52N06J31m15n94k67j08n11q46n61j87l54n21J05J020
54807A09199J079K96k48j69p6k49k34J55M74N10N24N15J90k53k30K36N34N31P41
54788A13525J228J321P24L4j88j13j19k15l05m47n45k65M96J397K031K188J854
54771A22601J399J542K536L628L964L765L825M170M165L806L739L984L772K887
54757A69783K021J461M79j430l616n118n731n707n053l836k583j819j462j170
54743A36219r66j100j513j792j591r39k34R1No7J59M25M46M37O52P36K87k70j21
$$ plain form
54859 141630 138114 134112 130055 126819 124459 122256 119840 117568 115783 114389 113222 112347 111786 111343 110803
54844 110803 110127 109444 109022 109112 109582 109774 109041 107473 105910 105205 105482 106150 106606 106875 107446 108459 109377 109684
54826 109684 109613 109793 110408 111149 111801 112307 112438 112023 111429 111162 111054 110543 109697 109136 108949 108595 108074 108179 109199
54807 109199 110278 110574 110326 110157 110081 109832 109598 109753 110227 110737 111261 111776 111966 111713 111483 111719 112253 112784 113525
54788 113525 114753 116074 116798 116832 116644 116531 116412 116197 115892 115445 114900 114635 115131 116528 118559 120747 122601
54771 122601 124000 125542 128078 131706 135670 139435 143260 147430 151595 155401 159140 163124 166896 169783
54757 169783 171804 173265 173744 172314 168698 163580 157849 152142 147089 143253 140670 138851 137389 136219
54743 136219 135253 134153 132640 130848 129257 128318 128084 128175 128180 128113 128272 128697 129143 129580 130232 130968 131255 130985 130864
54724A30864P44J593K123K658L298L746M025M449M796M382L146J744M68j030k735
54709A64271m002m582m978n348n067l857k510j870j772j608j251q55l48K57N33
54694A27013K31k81o08r37j540k066j928j101j50L53J71n32j176j229q53p36j083
54677A13548j263p57P5M73J81m45q30n25M94J539J696Q39k48q63j002q92n22l7
54659A11461R1l37q31q29m04K7K93M44M59L53L12N04Q95J332J513J030j35j170
54641A15008j169l08L39K46o4m5J43K36L51M59J96l43m02L34J118J165P09L76
54623A18349J54l22q86r98n82j10m2m78j129j396r01p7K41K3J10Q38J391J117
54605A15302N76N83R52J021Q60R86J303J252P68K50j88o67r63p45k02J93L63M66
$$ plain form
54724 130864 131608 133201 135324 137982 141280 145026 149051 153500 158296 162678 165824 167568 168036 167006 164271
54709 164271 160269 155687 150709 145361 140294 136437 133927 132057 130285 128677 127426 126571 126223 126480 127013
54694 127013 127244 126963 126355 125418 123878 121812 119884 118783 118633 118986 119157 118625 117449 116220 115367 114631 113548
54677 113548 112285 111528 111603 112076 112257 111812 110982 110457 110951 112490 114186 115025 114777 113914 112912 112020 111498 111461
54659 111461 111552 111215 110384 109555 109151 109178 109471 109915 110374 110727 111039 111543 112438 113770 115283 116313 116178 115008
54641 115008 113839 113531 113870 114116 114052 114007 114150 114386 114737 115196 115392 115049 114647 114981 116099 117264 117973 118349
54623 118349 118503 118181 117295 116297 115715 115605 115563 115085 113956 112560 111659 111582 111823 111846 111956 112794 114185 115302
54605 115302 115878 116461 117413 118434 119294 120280 121583 122835 123603 123853 123665 122998 122035 121290 121088 121281 121644 122110
54587A22110L30k23p35o58l34n79j288j382l13J123J732J102k65j481j688o51
54571A16800Q17J481R60N9k91J1M94Q06Q22M88k9k64K7M54M30n5m30l17L3K18
54551A22514K69M56P16P27M84M23P17R58Q49P30R49J091N71k72m93rK03m28j200
54532A29255j201n09J96O32R28J024P49K17k99p47j128j181p25r8R8l01q73j085
54514A24952p59k16%l06o46m79m9q2n68o15K06J094J121M50j24l35m22m21j69
54495A22632K08M50O03Q41J061J133J179J190P43k39r62o86Q0J83o06j374j339
54478A25097n93M19J342J834J684J240J121J424J686J649J506J356J013M62l5
54463A41205m31r38j387j209l24M87N10k0l69l16k44l44l01J35O27O19J24j72
$$ plain form
54587 122110 122440 122217 121482 120824 120490 119911 118623 117241 116928 118051 119783 120885 120620 119139 117451 116800
54571 116800 117617 119098 120058 120117 119826 119837 120331 121137 121959 122447 122418 122154 122181 122635 123065 123010 122580 122263 122296 122514
54551 122514 122783 123239 123955 124682 125166 125589 126306 127264 128113 128843 129792 130883 131454 131182 130689 130680 130883 130455 129255
54532 129255 128054 127545 127741 128373 129301 130325 131074 131291 130992 130245 129117 127936 127211 127113 127211 126910 126037 124952
54514 124952 124193 123977 123977 123671 123025 122546 122497 122415 121847 121232 121438 122532 123653 124103 123979 123644 123222 122801 122632
54495 122632 122840 123290 123893 124734 125795 126928 128107 129297 130040 129801 128839 128153 128233 128416 127810 126436 125097
54478 125097 124504 124923 126265 128099 129783 131023 132144 133568 135254 136903 138409 139765 140778 141240 141205
54463 141205 140774 139836 138449 137240 136916 137403 137913 137893 137524 137208 136964 136620 136319 136454 137081 137700 137824 137652
54445A37652K84J179J715J551R89L20n04j351j649j050pO67O38P0p58j468j585
54428A36693j082o47q54j234q58L49J484J890J776J569J280P75K08j85l70l52
54412A40442p3L87O78M72k21j105j779j840j112R8J165J674J759J764J746J472
54396A45527P86q0p09r36j009j183j280r24j66M67O33M92K66j15o13p42j00R74
54378A41288J709J751J377J001P96P64Q43R72J203J669K282K705K810K933L392
54363A67495L983M243L981L287K223R16k94j145j762k351k797k908k798k687k508
54348A66878k149j843j853j985j848j542j499j735j756j292o69l76n43r27j143
54333A45718q87j69N86Q62M70l50j096j215n37M20P99L18m80j009j209j135o24
$$ plain form
54445 137652 137936 139115 140830 142381 143370 143690 143186 141835 140186 139136 139129 139796 140434 140504 139746 138278 136693
54428 136693 135611 134964 134110 132876 132018 132367 133851 135741 137517 139086 140366 141141 141349 141164 140794 140442
54412 140442 140369 140756 141434 141906 141685 140580 138801 136961 135849 135947 137112 138786 140545 142309 144055 145527
54396 145527 146313 146233 145524 144588 143579 142396 141116 140192 140026 140493 141126 141618 141884 141769 141156 140414 140314 141288
54378 141288 142997 144748 146125 147126 147922 148686 149529 150501 151704 153373 155655 158360 161170 164103 167495
54363 167495 171478 175721 179702 182989 185212 186128 185834 184689 182927 180576 177779 174871 172073 169386 166878
54348 166878 164729 162886 161033 159048 157200 155658 154159 152424 150668 149376 148707 148331 147788 146861 145718
54333 145718 144831 144662 145248 146110 146580 146230 145134 143919 143382 143802 144601 144919 144439 143430 142221 141086 140462
54316A40462K16P34N12M5K9L96O05N12K63k06q40j011k65P23R09L44PK29L62L2
54296A44058k94k67j98l27l07J50P51J102J161R50L87l27p41q46j095j519j454
54279A41184n84M64J009J258J684K044J761R76M22K68j13j092k050k078j118J4
54263A44049O17Q15J159J794K275K221J861J738K013K267K002J185K79k39l67
54248A63669n13q75j143j083j078j572k080j577J7J531K047J907J753J440O08
54233A63051k89n31k43j55n25j041j512j866j770j029j86O4j37j29K41O29R18
54216A55490J141R72K19m84m49l9n9l55k42m2p55k194k909k187q73J36Q38J282
54198A49490J060K48l27l11k64m95n39l23n17j082q44O05J799J314k12j158j136
$$ plain form
54316 140462 140678 141412 141924 141969 141998 142394 142999 143511 143774 143568 142728 141717 141452 142175 143084 143428 143435 143664 144026 144058
54296 144058 143764 143497 143299 142972 142665 142815 143566 144668 145829 146779 147166 146839 146098 145252 144157 142638 141184
54279 141184 140600 141064 142073 143331 145015 147059 148820 149796 150218 150486 150373 149281 147231 145153 144035 144049
54263 144049 144666 145481 146640 148434 150709 152930 154791 156529 158542 160809 162811 163996 164275 164036 163669
54248 163669 163156 162281 161138 160055 158977 157405 155325 153748 153765 155296 157343 159250 161003 162443 163051
54233 163051 162762 162231 161988 161833 161308 160267 158755 156889 155119 154090 153904 153968 153831 153702 153943 154572 155490
54216 155490 156631 157603 157822 157338 156889 156850 156791 156436 156194 156152 155397 153203 150294 148107 147234 147370 148208 149490
54198 149490 150550 150798 150471 150160 149896 149401 148862 148539 148022 146940 146096 146701 148500 149814 149602 148444 147308
54181A47308q85o76j34P07J346J544J311M63q31j578j008J31M34k19o00L4J075
54164A48422J596J405Q17J07n27q97r67q45n81k01J48L43L81K03l08r23j105p29
54146A46339k72J0M87J267J609R80J36K01J048J548J224P45P04Q44P06L08r0l99
54128A57395o44p70p00l64K44Q51R94O20L55P34J442J801J759J796K030K045J591
54111A71179R38M66L65P17J400J949J984J830K263L572N142O032N765M571L107
54096B11280J843O21r56k619l409k838j617p06j93L49Q52R44P38O11L41o19k079
54079B02543l190l643l925m250m098l183k081j441j176r07o97q07j030q38q8P67
54063A71956J182J003M89n0n51j108j548j356k89J074J771J479P47K68K84P26
$$ plain form
54181 147308 146423 145747 145613 146320 147666 149210 150521 150984 150153 148575 147567 147698 148132 147913 147313 147347 148422
54164 148422 150018 151423 152240 152347 151820 150923 149956 149111 148530 148329 148477 148820 149201 149404 149096 148173 147068 146339
54146 146339 146067 146077 146564 147831 149440 150420 150556 150757 151805 153353 154577 155322 156026 156870 157576 157884 157794 157395
54128 157395 156751 155981 155281 154917 155161 156012 157006 157626 157981 158715 160157 161958 163717 165513 167543 169588 171179
54111 171179 172117 172583 172948 173665 175065 177014 178998 180828 183091 186663 191805 197837 203602 208173 211280
54096 211280 213123 213744 212788 210169 206760 203922 202305 201599 201406 201755 202607 203551 204289 204900 205241 204622 202543
54079 202543 199353 195710 191785 187535 183437 180254 178173 176732 175556 174649 173952 173145 172115 171277 171189 171956
54063 171956 173138 174141 174630 174580 174029 172921 171373 170017 169728 170802 172573 174052 174799 175067 175351 176077
54047A76077J440K160K564K611K587K726L036L544M345N244N689N364M595L919
54033B25901L456K996K610K709L395M093M061L143J836O85j2n9O88J864K567K148
54017B62081R19l28j282k173l081l709l878l683l270k862k955l768m605m527l692
54002B19187l145l218l151k575k136k142j766n24N94M98k92n51k89m68j223j705
53986A97094j549j229j057q64o60n87k62P71J900J926Q36N4N90J952L141L885
53970B05941M434M960N700P027Q875J0493J1077J0245P862M039m85m514p215q437
53956B60002q317p191n886n185m838l854k003k96L16Jm54n49j37O97J503J823
53940B25632J919K531L698M630M910M969N042M673L761L049K891K552J547P24
$$ plain form
54047 176077 177517 179677 182241 184852 187439 190165 193201 196745 201090 206334 212023 217387 221982 225901
54033 225901 229357 232353 234963 237672 241067 245160 249221 252364 254200 254885 254873 254814 255502 257366 259933 262081
54017 262081 263000 262672 261390 259217 256136 252427 248549 244866 241596 238734 235779 232011 227406 222879 219187
54002 219187 216042 212824 209673 207098 204962 202820 201054 200530 201124 201622 201330 200779 200490 200022 198799 197094
53986 197094 195545 194316 193259 192395 191735 191148 190886 191657 193557 195483 196319 196373 196963 198915 202056 205941
53970 205941 210375 215335 221035 228062 236937 247430 258507 268752 276614 280653 280168 275654 268439 260002
53956 260002 251685 244494 238608 233423 228585 224731 222728 222432 222748 222749 222295 221746 221609 222306 223809 225632
53940 225632 227551 230082 233780 238410 243320 248289 253331 258004 261765 264814 267705 270257 271804 272528
53926B72528R49J564J391P27Q87K133L382L961M292M656M600M056L941M893O134
53911C20094O397N518M388L580K857J980J251R17N46m64j933k939k904k208j588
53896C35492j358j570k470m150n896o671o330n755n639n747n612n277m947m467
53882B69603l662k808k312k192k311k745l481m058m047l654l411l412l315k962
53868B25233k492k021j583j322j366j548j588j371q83j60L93M3j295k512k421
53853B05107j273m03m57q20q97j011j582k160j941q79K58P60N06j84q09r26m90
53836A92799N8L07L76O24J053J311J271J179J145R05K74m66q75q57n92j55M85
53819A98842J182J646J748J550J077M52J80Q11K104K995K710J687R82J093J699
$$ plain form
53926 272528 273477 275041 276432 277159 278046 280179 283561 287522 291814 296470 301070 305126 309067 313960 320094
53911 320094 326491 332009 336397 339977 342834 344814 346065 346982 347528 347064 345131 342192 339288 337080 335492
53896 335492 334134 332564 330094 325944 320048 313377 307047 301292 295653 289906 284294 279017 274070 269603
53882 269603 265941 263133 260821 258629 256318 253573 250092 246034 241987 238333 234922 231510 228195 225233
53868 225233 222741 220720 219137 217815 216449 214901 213313 211942 211059 210899 211292 211335 210040 207528 205107
53853 205107 203834 203431 202974 202154 201257 200246 198664 196504 194563 193684 193942 194702 195208 195024 194215 193289 192799
53836 192799 192857 193164 193540 194164 195217 196528 197799 198978 200123 201028 201302 200836 199961 199104 198512 198357 198842
53819 198842 200024 201670 203418 204968 206045 206497 206677 207488 209592 212587 215297 216984 217966 219059 220758
53804B20758K345K839L124L221L302L495L614L444L225L456M116M523M089K904
53790B68455J544N48K31O82J652K553K677J623k75j961k547k411k899m525o026
53775B59321n908m454l222k914k874k692k921l792m386l842k564j502r04n14m34
53760B16398r45j765k244k163j825j520j324j217j040n91q3q7p12j247j103o06
53744A97926l55k94q0J08p0k97O5Q64J288J015N54M15N53P08P86P75Q09J170J865
53725B07805K275J906J266J319K036K329J570M32j38l6K67N71R66J408J759K093
53709B27828K481K665K341J738J544K151L131L637L302K643K458K906L412L497
53695B65734L360L401L556L522L331L186K852J845K89j013j552j676j962k419
$$ plain form
53804 220758 223103 225942 229066 232287 235589 239084 242698 246142 249367 252823 256939 261462 265551 268455
53790 268455 269999 270547 270778 271460 273112 275665 278342 279965 279690 277729 275182 272771 269872 265347 259321
53775 259321 253413 248959 245737 242823 239949 237257 234336 230544 226158 222316 219752 218250 217346 216832 216398
53760 216398 215453 213688 211444 209281 207456 205936 204612 203395 202355 201764 201681 201594 200882 199635 198532 197926
53744 197926 197571 197277 197197 197305 197235 196938 197003 197867 199155 200170 200724 201139 201692 202400 203186 203961 204770 205940 207805
53725 207805 210080 211986 213252 214571 216607 218936 220506 220938 220800 220764 221031 221602 222568 223976 225735 227828
53709 227828 230309 232974 235315 237053 238597 240748 243879 247516 250818 253461 255919 258825 262237 265734
53695 265734 269094 272495 276051 279573 282904 286090 288942 290787 291076 290063 288511 286835 284873 282454
53681B82454k645k469k019j361m41N66J202J174P45M86N70N32q1r22j115m03M27
53664B76700N38O7k45j25P9J70L67P02P42J77o41j049p90j79L01M28K76k2m15
53645B77081p14m60O58K182L164L215K891K753K594K070J549J664K330K939L300
53630C07216L652L911L754L380L349L604L436K632J788J291Q10K16P6P13J415
53615C41243J369Q96J038K174L647M638M901M676M295L893L389K745K279K342
53601C83525K650K471J664R70R24J068P35J61R1O19J073R22J82r13k006k546k225
53584C89365j568j441j940k352k230j949j952k117k125k021j951j770j383j180
53570C63386j596k317k460j609l18N79Q17O83L98n7n70p74m58R6M84O90R69J309
$$ plain form
53681 282454 279809 277340 275321 273960 273519 274085 275287 276461 277206 277692 278262 278794 278713 277791 276676 276273 276700
53664 276700 277238 277305 277060 276935 277014 277184 277551 278253 278995 279172 278531 277482 276692 276513 276814 277242 277518 277496 277081
53645 277081 276367 275907 276565 278747 281911 285126 288017 290770 293364 295434 296983 298647 300977 303916 307216
53630 307216 310868 314779 318533 321913 325262 328866 332302 334934 336722 338013 338823 339039 339115 339828 341243
53615 341243 342612 343508 344546 346720 350367 355005 359906 364582 368877 372770 376159 378904 381183 383525
53601 383525 386175 388646 390310 391280 392204 393272 394007 394168 394259 394878 395951 396873 397055 396142 394136 391590 389365
53584 389365 387797 386356 384416 382064 379834 377885 375933 373816 371691 369670 367719 365949 364566 363386
53570 363386 361790 359473 357013 355404 355086 355665 356482 357165 357563 357506 356936 356162 355704 355800 356284 356974 357943 359252
53552C59252J351R33M34L51P80J433K018K422K602K531K249J869J599J679K152
53537C83655K698K965L188M031N621P083P523P196P263Q405J0153J1621J2338
53524D73740J2284J1634J0830J0541J1122J2221J3251J4153J5327J6889J8428
53513F20420J9613K0634K1750K2698K3022K2897K3119K4146K5452K6141K5867
53502H75759K4948K3819K2856K2386K2427K2366K1531K0157J9254J9289J9565
53491A114357J9286J8677J8530J8974J9369J9292J8933J8531J8012J7435J7209
53480A318605J7589J8203J8440J8034J7116J5868J4298J2267R572O211K642m27
53468A468418k688m465o234q169j0227j2350j4269j5466j5756j5688j5981j6704
$$ plain form
53552 359252 360603 361536 361970 362321 363101 364534 366552 368974 371576 374107 376356 378225 379824 381503 383655
53537 383655 386353 389318 392506 396537 402158 409241 416764 423960 431223 439628 449781 461402 473740
53524 473740 486024 497658 508488 519029 530151 542372 555623 569776 585103 601992 620420
53513 620420 640033 660667 682417 705115 728137 751034 774153 798299 823751 849892 875759
53502 875759 900707 924526 947382 969768 992195 1014561 1036092 1056249 1075503 1094792 1114357
53491 1114357 1133643 1152320 1170850 1189824 1209193 1228485 1247418 1265949 1283961 1301396 1318605
53480 1318605 1336194 1354397 1372837 1390871 1407987 1423855 1438153 1450420 1459992 1466203 1468845 1468418
53468 1468418 1465730 1461265 1455031 1446862 1436635 1424285 1410016 1394550 1378794 1363106 1347125 1330421
53456A330421j7421j8044j8945k0211k1367k2041k2409k2714k2716k2022k0773
53445A101758j9556j8749j8167j7310j5777j3579j1268r595q764q139o956n205
53433I48693l539k444j823j309n55Q03K914N295P044P760Q029Q712J0037J1582
53419A001199J3049J4578J6337J8111J9531K0620K1873K3712K5878K7679K8847
53408A231414K9922L1542L3576L5371L6702L7969L9482M1149M2982M5328M8155
53397A653592N0671N2186N3058N4218N5883N7343N7927N7709N7204N6740N6293
53386B262824N5651N4595N3102N1363M9498M7394M4985M2478L9977L7030L3050
53375B771947K8129K3010J8172J3420Q436L293j867p280j3323k0013k6998l3901
$$ plain form
53456 1330421 1313000 1294956 1276011 1255800 1234433 1212392 1189983 1167269 1144553 1122531 1101758
53445 1101758 1082202 1063453 1045286 1027976 1012199 998620 987352 977757 968993 960854 953898 948693
53433 948693 945154 942710 940887 939578 939023 939826 942740 948035 955079 962839 970868 979580 989617 1001199
53419 1001199 1014248 1028826 1045163 1063274 1082805 1103425 1125298 1149010 1174888 1202567 1231414
53408 1231414 1261336 1292878 1326454 1361825 1398527 1436496 1475978 1517127 1560109 1605437 1653592
53397 1653592 1704263 1756449 1809507 1863725 1919608 1976951 2034878 2092587 2149791 2206531 2262824
53386 2262824 2318475 2373070 2426172 2477535 2527033 2574427 2619412 2661890 2701867 2738897 2771947
53375 2771947 2800076 2823086 2841258 2854678 2863114 2866407 2864540 2857260 2843937 2823924 2796926 2763025
53363B763025m0389m6011n0342n3259n4968n5769n5891n5616n5288n5091n4813
53352B185588n3977n2284m9947m7557m5606m4213m3288m2817m2825m3140m3382
53341A676552m3175m2339m0910l9036l6821l4237l1260k8175k5479k3376k1541
53330A310203j9562j7500j5784j4663j3960j3353j2697j2182j2213j2948j3845
53319A151496j3973j3030j1740j0892j0249q946o747m351k403q73N04J686K604
53306A073086L554M916O584Q068R140J0190J1825J4114J6377J7885J8738J9770
53294A214247K1516K3664K5686K7549K9343L0594L0586K9225K7133K4952K3037
53283A507532K1597K0554J9353J7494J5154J2750J0081O633K674q10l355n451
$$ plain form
53363 2763025 2722636 2676625 2626283 2573024 2518056 2462287 2406396 2350780 2295492 2240401 2185588
53352 2185588 2131611 2079327 2029380 1981823 1936217 1892004 1848716 1805899 1763074 1719934 1676552
53341 1676552 1633377 1591038 1550128 1511092 1474271 1440034 1408774 1380599 1355120 1331744 1310203
53330 1310203 1290641 1273141 1257357 1242694 1228734 1215381 1202684 1190502 1178289 1165341 1151496
53319 1151496 1137523 1124493 1112753 1101861 1091612 1082666 1075919 1071568 1069165 1068292 1068796 1070482 1073086
53306 1073086 1076640 1081556 1088140 1096208 1105348 1115538 1127363 1141477 1157854 1175739 1194477 1214247
53294 1214247 1235763 1259427 1285113 1312662 1342005 1372599 1403185 1432410 1459543 1484495 1507532
53283 1507532 1529129 1549683 1569036 1586530 1601684 1614434 1624515 1631148 1633822 1633012 1629657 1624206
53271A624206p682j0136j2806j5680j8337k0247k1695k3530k5787k7580k8636
53260A412090k9756l1180l1787l0858k9525k9284k9859k9875k9065k8375k8191
53249A084335k7825k6829k5608k4629k3944k3750k4412k5629k6397k6086k5045
53238H04181k3870k2758k1671k0644j9552j8095j6179j4066j2086j0489r497q999
53226F06275q461p630p108p515q294q317p619p505q712j0465j1708j2359j2758
53213D87824j2826j2420j1862j1419j0758r588q330p508o919o080n148m664m695
53200C75607m934n394o261p172p399o800o006n589n561n684n738n438m622l660
53186B95349l149l108k966k484k098k152k340k296k275k652l069k771j747r67
$$ plain form
53271 1624206 1616524 1606388 1593582 1577902 1559565 1539318 1517623 1494093 1468306 1440726 1412090
53260 1412090 1382334 1351154 1319367 1288509 1258984 1229700 1199841 1169966 1140901 1112526 1084335
53249 1084335 1056510 1029681 1004073 979444 955500 931750 907338 881709 855312 829226 804181
53238 804181 780311 757553 735882 715238 695686 677591 661412 647346 635260 624771 615274 606275
53226 606275 597814 590184 583076 575561 567267 558950 551331 543826 535114 524649 512941 500582 487824
53213 487824 474998 462578 450716 439297 428539 418951 410621 403113 396194 390114 384966 380302 375607
53200 375607 370673 365279 359018 351846 344447 337647 331641 326052 320491 314807 309069 303631 299009 295349
53186 295349 292200 289092 286126 283642 281544 279392 277052 274756 272481 269829 266760 263989 262242 261275
53172B61275j289k462l442l490k697j631p35j39K11L68L36Q6l13o52o40j59N34
53155B45161R31P15M3o07r28r88r83r10o47k35P8J58J10O3l0k04l50m30o31r97
53135B39319j107n75K73O83N54O01J293K138K409K058J492Q52J37k65R8R95J715
53118B52670J970J999J870J380P22M10L61k03j482k480k291j365q20q84q93o01
53102B50363n94j233j964j984j186j22O53Q76M96l43j222j591j137p1R16J074
53086B42931K11j055j754j412m62K16J14m71p93m14L37P34M39k28p56r86j054
53069B35597j064j034j002j031j108j205j323j352j093n45l0K27L70N31M79M1
53053B26458l34p8N91R19P78Q59J471J867J256l1r29r23m30r4k17o97j113r59
$$ plain form
53172 261275 259986 257524 254082 250592 247895 246264 245529 245390 245601 245969 246305 246391 246078 245426 244786 244627 245161
53155 245161 246092 246807 246850 246243 245315 244327 243344 242434 241787 241552 241630 241788 241898 241961 241931 241727 241377 240947 240316 239319
53135 239319 238212 237637 237910 238593 239147 239748 241041 243179 245588 247646 249138 249990 250127 249862 249960 250955 252670
53118 252670 254640 256639 258509 259889 260611 261021 261382 261179 259697 257217 254926 253561 252741 251857 250964 250363
53102 250363 249769 248536 246572 244588 243402 243280 243933 244809 245305 244962 243740 242149 241012 240941 241857 242931
53086 242931 243142 242087 240333 238921 238459 238675 238789 238318 237525 237111 237448 238182 238621 238393 237637 236651 235597
53069 235597 234533 233499 232497 231466 230358 229153 227830 226478 225385 224840 224810 225037 225407 225938 226417 226458
53053 226458 226124 226046 226637 227556 228334 229193 230664 232531 233787 233756 232827 231904 231474 231380 231163 230466 229353 228394
53035B28394k15M52M60R3Q0N07P80N72K13Rj65m49o61o20l87K9P01J329J320O74
53015B33116J82L11M78J6o37n04M01R92N12o40j592j864j430n59K58O02N67N22
52997B30731M81J71k56k28L49Q06O69L00K76N88Q93J095J242J197R15O97P25O55
52979B41306K22j09K86J188J812J927J981K077J672N10p15j124o33J76Q15J157
52963B52548J175R04O11O57J017J191P43j32p90r23r79j507k231k274j447p96
52947B47767j360k739l494k888j574n54j20o2k36n19n49j02N14P43L93l17j132
52930B33771j822k038j530n50K94O52O52N09K39j05k03K11Q52J017L65n59p99
52913B30956k4J041J377P60j31o46q13r46r10l41M83N83n55k130k743j924m64
$$ plain form
53035 228394 228179 228631 229091 229184 229264 229771 230551 231123 231336 231345 231180 230731 230070 229450 229063 229092 229793 231122 232442 233116
53015 233116 233298 233609 234087 234103 233466 232962 233363 234355 234867 234227 232635 230771 229341 228782 229040 229642 230209 230731
52997 230731 231212 231383 231127 230899 231248 232054 232723 233023 233299 233887 234780 235875 237117 238314 239229 239926 240651 241306
52979 241306 241528 241419 241705 242893 244705 246632 248613 250690 252362 252872 252157 251033 250400 250576 251391 252548
52963 252548 253723 254627 255238 255895 256912 258103 258846 258714 257924 257001 256022 254515 252284 250010 248563 247767
52947 247767 246407 243668 240174 237286 235712 235158 235038 234976 234740 234221 233672 233570 234084 234827 235220 234903 233771
52930 233771 231949 229911 228381 227831 228125 228777 229429 229938 230177 230072 229869 230080 230932 231949 232314 231755 230956
52913 230956 230932 231973 233350 234110 233979 233333 232520 231574 230664 230323 230806 231389 230834 228704 225961 224037 223573
52896B23573P04J412J882K030J699J259J267J591J467O01l72p77p25o71n58l0
52880B34352P89J277J121O54L72M00N38N33L47K95Q71K093L122K973J690M08R2
52863B51927N59R02N60k73j087j558j703j800k084k467k618k446k330k621l034
52848B29927k839j765n22j41q44j774j955j308n14p6O0K9k72p86j070q52m55k77
52830B14566j17M29J140J347Q91L28P5n0k91m84m17k09j8K47O47R30Q83P57R56
52811B21610J506K063K321K252K012J835J794J593Q09m93j623k024j908j858k014
52796B27875k046j775j383j066q33o87o71o66m74j47J6QK83J140K131K443J832
52779B25980Q36N8m42q62j138j094q82q30r16q63p02q06j157j269j005r30j313
$$ plain form
52896 223573 224277 225689 227571 229601 231300 232559 233826 235417 236884 237485 237113 236336 235611 234940 234382 234352
52880 234352 235141 236418 237539 238193 238565 238965 239503 240036 240383 240678 241549 243642 246764 249737 251427 251835 251927
52863 251927 252486 253388 253948 253675 252588 251030 249327 247527 245443 242976 240358 237912 235582 232961 229927
52848 229927 227088 225323 224801 224660 223816 222042 220087 218779 218265 218189 218249 218278 218006 217220 216150 215298 214843 214566
52830 214566 214449 214878 216018 217365 218256 218584 218659 218609 218318 217834 217417 217208 217190 217437 218084 219014 219897 220654 221610
52811 221610 223116 225179 227500 229752 231764 233599 235393 236986 237795 237302 235679 233655 231747 229889 227875
52796 227875 225829 224054 222671 221605 220772 220085 219414 218748 218274 218127 218143 218151 218434 219574 221705 224148 225980
52779 225980 226816 226874 226432 225570 224432 223338 222456 221626 220710 219847 219145 218339 217182 215913 214908 213978 212665
52762B12665j470p32L59O80J62k05J14O09P94R02J180J326J159J113J541K046
52746B22243K137K005K060K126J788J235J018J202J411J592J994K401K165J123
52732B46500l8n67l88J52Q23J472J735J168k76k000l059k861j710n94k92o88j129
52715B38248j263j244j194q87j19Q11J268R15J10l83j08O41J186J187Q98P34Q27
52698B41627J051J148P69k35j389j852j383o62l81l67j04K98L02j20m49m90n79
52681B37184q77j098j091j085j126r02m27k70o63r33m00N40R52P25O18J003J366
52664B33516J279J113J338J650J448Q57N77Q47J221J449J897K755L396L008J578
52649B57929j40j425j931j645j014q64j584k455k468j680j082j104j096n77o1
$$ plain form
52762 212665 211195 210463 210822 211502 211664 211459 211573 212182 212976 213878 215058 216384 217543 218656 220197 222243
52746 222243 224380 226385 228445 230571 232359 233594 234612 235814 237225 238817 240811 243212 245377 246500
52732 246500 246462 245895 245507 245659 246482 247954 249689 250857 250581 248581 245522 242661 240951 240357 240065 239377 238248
52715 238248 236985 235741 234547 233660 233541 234352 235620 236535 236645 236262 236154 236795 237981 239168 240066 240800 241627
52698 241627 242678 243826 244595 244360 242971 241119 239736 239074 238693 238326 238222 238520 238822 238702 238253 237763 237184
52681 237184 236307 235209 234118 233033 231907 231005 230578 230308 229645 228712 228312 228852 229804 230529 231147 232150 233516
52664 233516 234795 235908 237246 238896 240344 241201 241778 242625 243846 245295 247192 249947 253343 256351 257929
52649 257929 257789 256364 254433 252788 251774 250910 249326 246871 244403 242723 241641 240537 239441 238864 238803
52634B38803r9k56K45J292K118K402K432K386K152J807J513J047M7j184j863j777
52618B51065j577j749j945j629q68q0N21Q32N84k89j183j301n72L14P97R06P61
52601B44587K14o28r94k06J217J941J416N21L01O26P09M15K72L75K62j15j68K64
52583B51009M75J2n51m73R4N23P10Q81Q86M10l06p33q16p86m46N28J630J808Q11
52564B55666m21j002r92q20n07J11P81J044P75K46l22q93j362j414q24Q1M51k24
52546B50374j333j641p73L59Q98J133J635J986J381J28n84l86p2j27k5O32J265
52529B54850J239Q32O47O58M87J44j63n84j364k166k272j377R9J389J846J395
52513B55660P35Q27J827K840L019K588K376K645K861K437J353L3j075j849k513
$$ plain form
52634 238803 238704 238448 238693 239985 242103 244505 246937 249323 251475 253282 254795 255842 255889 254705 252842 251065
52618 251065 249488 247739 245794 244165 243297 243217 243738 244570 245154 244865 243682 242381 241809 242123 242920 243826 244587
52601 244587 244801 244173 243179 242973 244190 246131 247547 248068 248369 248995 249704 250119 250391 250766 251028 250913 250745 251009
52583 251009 251484 251496 250945 250472 250566 251089 251799 252680 253566 253976 253670 252937 252121 251335 250889 251417 253047 254855 255666
52564 255666 255245 254243 253251 252431 251924 252035 252816 253860 254635 254881 254559 253666 252304 250890 250066 250147 250598 250374
52546 250374 249041 247400 246627 246986 247884 249017 250652 252638 254019 254147 253563 253177 253105 252978 252953 253585 254850
52529 254850 256089 256921 257568 258226 258713 258857 258694 258110 256746 254580 252308 250931 251030 252419 254265 255660
52513 255660 256395 257222 259049 261889 264908 267496 269872 272517 275378 277815 279168 279201 278126 276277 273764
52498B73764l239l699l368k308j246o76l77l2J76M0j21O2L41K02k84n56l58K8
52480B58349K88L79L73L30L30L34J75j55l82l45k03k0M85J348J936J722J194J264
52462B67402K039K822L237L535L758L433K308P48q76k511l915m442l858k806j977
52447B68897j237k11P17P06k60j178j233o95l55m96p51p60n93n57p41q56n28K01
52429B60070P30M90l45r82r15m33j2L31P35R25N86J04K56J125J991K461K979L883
52411B73979M773N291N869P002Q409R618J0876J2373J2992J1045O395Q09l907
52398C65524p217r213r891r518q834q204p234n683m098k996k132j137k78L0m3
52383B89076j01j14q6L15J110J628J458J301J963K990L296K842K651L133L512
$$ plain form
52498 273764 270525 266826 263458 261150 259904 259228 258851 258819 258995 259035 258914 258976 259317 259519 259235 258679 258321 258349
52480 258349 258637 259016 259389 259719 260049 260383 260558 260403 260021 259676 259473 259453 259938 261286 263222 264944 266138 267402
52462 267402 269441 272263 275500 279035 282793 286226 288534 289282 288406 285895 281980 277538 273680 270874 268897
52447 268897 267660 267449 268166 268872 268612 267434 266201 265506 265151 264655 263904 263144 262551 261994 261253 260397 259869 260070
52429 260070 260800 261290 260945 259963 259048 258615 258603 258934 259669 260594 261180 261284 261540 262665 264656 267117 270096 273979
52411 273979 278752 284043 289912 296914 305323 314941 325817 338190 351182 362227 368622 369431 365524
52398 365524 358307 349094 339203 329685 320851 312647 305413 299730 295632 292636 290504 289367 289089 289119 289076
52383 289076 288975 288861 288775 289090 290200 291828 293286 294587 296550 299540 302836 305678 308329 311462 314974
52368C14974L063K092J396J317J648K007K033J559P48j51j011j583j371k43J054
52353C27532J602J405J134J038Q42O64J106K211L135L177K558J961J816K257L181
52338C55619M116M477M295M259M870N992P281Q530R464R805R864J0454J1839J3304
52324D64169J4149J4579J5152J5848J6282J6467J6737J7036J6896J6147J5206
52313F38668J4605J4440J4358J3917J3005J1968J1268J1001J0905J0797J0683
52302G75615J0416R632Q224O605N275M398L919L700L319K135k1k417m133n027
52288H21640n756o815p907q287p578o181m887m032l147j601N02K438L807M897
52274G77093O060P236Q311R433J0585J1267J1086J0385R840R644R478R147Q833
$$ plain form
52368 314974 318037 320129 321525 322842 324490 326497 328530 330089 330837 330686 329675 328092 326721 326478 327532
52353 327532 329134 330539 331673 332711 333553 334217 335323 337534 340669 343846 346404 348365 350181 352438 355619
52338 355619 359735 364212 368507 372766 377636 383628 390909 399439 408903 418708 428572 439026 450865 464169
52324 464169 478318 492897 508049 523897 540179 556646 573383 590419 607315 623462 638668
52313 638668 653273 667713 682071 695988 708993 720961 732229 743230 754135 764932 775615
52302 775615 786031 795663 803887 810492 815767 820165 824084 827784 831103 833238 833217 830800 826667 821640
52288 821640 815884 809069 801162 792875 785297 779116 774229 770197 767050 765449 765951 768389 772196 777093
52274 777093 783153 790389 798700 808133 818718 829985 841071 851456 861296 870940 880418 889565 898398
52261H98398Q768R003R448R859R903R467Q841Q391Q181Q090Q004P655O584M705
52247A015297K649J094j08j664l748n788p254q182q725q741q138p264o643o450
52233I46335o489o485o208n457m196k670j272l43o7m02r55j091m33P32J718K170
52217I14887K446L160M382N467N774N465N402O197P500Q309P894O326M291K579
52203I90079J700J735K413L303M047M461M522M383M306M517N019N519N547M834
52189A046385L698K941L102L749L802K623N14j933m488o950q665r077q623q379
52175A018699q618q413p044n198m187m311m633m284l312k173j086j72L04K84J57
52160I66013K71M92O88J183K141K822K292P97m16p37p46r15p98j5Q18R80P74Q34
$$ plain form
52261 898398 907166 916169 925617 935476 945379 954846 963687 972078 980259 988349 996353 1004008 1010592 1015297
52247 1015297 1017946 1019040 1018932 1017268 1013520 1007732 1000478 992296 983571 974830 966692 959428 952785 946335
52233 946335 939846 933361 927153 921696 917500 914830 913558 913215 913148 912746 911791 910700 910267 910999 912717 914887
52217 914887 917333 920493 924875 930342 936116 941581 946983 953180 960680 968989 976883 983209 987500 990079
52203 990079 991779 993514 995927 999230 1003277 1007738 1012260 1016643 1020949 1025466 1030485 1036004 1041551 1046385
52189 1046385 1050083 1053024 1056126 1059875 1063677 1066300 1066814 1064881 1060393 1053443 1044778 1035701 1027078 1018699
52175 1018699 1010081 1001668 994624 989426 985239 980928 976295 972011 968699 966526 965440 965268 965572 965856 966013
52160 966013 966284 966776 967464 968647 970788 973610 975902 976699 976283 975546 974800 973885 973087 973072 973890 974870 975644 976478
52142I76478Q66J38j090j745j506j149j211j334j098n55L06J784L730N497P031
52127I86142R095J1922J4494J5912J6736J8097K0070K1829K2997K3810K4185K3676
52115A208965K2364K0972J9937J9065J8127J7133J5927J4144J1773R264O999N113
52103A389783L834L319L049K091K97j323j935j989k588m127o152q244j0358j2365
52089A353292j3847j4590j4862j4912j4513j3153j0742p871n390l698k494j170
52077A236050N09K226L572M614N873P696R789J1483J2413J2835J3197J3600J3765
52064A347622J3425J2502J1070R381P974P327P209O727N287L369K012J606J471
52051A436982N87j502m435p446r954j1884j3505j4992j6251j7178j7922j8673
$$ plain form
52142 976478 977344 977482 976392 974647 973141 971992 970781 969447 968349 967794 968100 969884 973614 979111 986142
52127 986142 995237 1007159 1021653 1037565 1054301 1072398 1092468 1114297 1137294 1161104 1185289 1208965
52115 1208965 1231329 1252301 1272238 1291303 1309430 1326563 1342490 1356634 1368407 1377671 1384670 1389783
52103 1389783 1393617 1396936 1399985 1402076 1402373 1401050 1399115 1397126 1394538 1390411 1384259 1376015 1365657 1353292
52089 1353292 1339445 1324855 1309993 1295081 1280568 1267415 1256673 1248802 1243412 1239714 1237220 1236050
52077 1236050 1236559 1238785 1242357 1246971 1252844 1260540 1270329 1281812 1294225 1307060 1320257 1333857 1347622
52064 1347622 1361047 1373549 1384619 1394000 1401974 1409301 1416510 1423237 1428524 1431893 1433905 1435511 1436982
52051 1436982 1437569 1436067 1431632 1424186 1414232 1402348 1388843 1373851 1357600 1340422 1322500 1303827
52039A303827j9366j9724j9482j8457j6642j4458j2607j1405j0423r146p773o967
52027A137377o915p218p629q335r379j0309j0693j0616j0431j0269j0078r885
52015A025620r793r893j0275j0893j1336j1081j0291r906j0556j1657j2145j2013
52003H95781j2404j4059j6209j7436j7252j6372j5559j4761j3446j1449r252p559
$$ plain form
52039 1303827 1284461 1264737 1245255 1226798 1210156 1195698 1183091 1171686 1161263 1152117 1144344 1137377
52027 1137377 1130462 1123244 1115615 1107280 1097901 1087592 1076899 1066283 1055852 1045583 1035505 1025620
52015 1025620 1015827 1005934 995659 984766 973430 962349 952058 942152 931596 919939 907794 895781
52003 895781 883377 869318 853109 835673 818421 802049 786490 771729 758283 746834 737582 730023
$$ [...]
##END NTUPLES=NMR SPECTRUM
##END=
