
##TITLE=AC1347_GUAAH12165_6647600_VdxQAAQbsf
##JCAMPDX= 6.0         $$ Bruker NMR JCAMP-DX V2.0
##DATA TYPE= NMR SPECTRUM
##DATA CLASS= NTUPLES
##ORIGIN= BRUKER
##OWNER= Administrator
$$ 1.72 TOPSPIN		Version 2.1
$$ 2012-08-10 16:59:08.484 -0500  Administrator@TOPSPIN
$$ Compression mode = diff/dup
##.OBSERVE FREQUENCY= 400.02188249412
##.OBSERVE NUCLEUS= ^1H
##.ACQUISITION MODE= SIMULTANEOUS (DQD)
##.ACQUISITION SCHEME= undefined
##.AVERAGES= 8
##.DIGITISER RES= 22
##SPECTROMETER/DATA SYSTEM= spect
##.PULSE SEQUENCE= zg30
##.SOLVENT NAME= COFFEE_meoh
##.SHIFT REFERENCE= INTERNAL, COFFEE_meoh, 1, 14.98509
##AUDIT TRAIL= $$ (NUMBER, WHEN, WHO, WHERE, PROCESS, VERSION, WHAT)
$$ ##TITLE= Audit trail, TOPSPIN		Version 2.1
$$ ##JCAMPDX= 5.01
$$ ##ORIGIN= Bruker BioSpin GmbH
$$ ##OWNER= Administrator
$$ $$ C:\Bruker\TOPSPIN/data/COFFEE/nmr/AC1347_GUAAH12165_6647600_VdxQAAQbsf/10/pdata/1/auditp.txt
$$ ##AUDIT TRAIL=  $$ (NUMBER, WHEN, WHO, WHERE, PROCESS, VERSION, WHAT)
(   1,<2012-08-10 16:59:00.546 -0500>,<Administrator>,<TOPSPIN>,<go>,<TOPSPIN 2.1>,
      <created by zg
	started at 2012-08-10 16:57:53.984 -0500,
	POWCHK enabled, PULCHK disabled,
       configuration hash MD5:
       6B 1B 68 BB D9 2E 58 E2 7F 35 AD 54 07 DF 0E 41
       data hash MD5: 64K
       B1 A8 B5 24 4A 25 FE 61 AA 4B 7B 2A 04 E1 96 12>)
(   2,<2012-08-10 16:59:04.187 -0500>,<Administrator>,<TOPSPIN>,<proc1d>,<TOPSPIN 2.1>,
      <Start of raw data processing
       efp LB = 0 FT_mod = 6 PKNL = 1 PHC0 = 0 PHC1 = 0 SI = 32K 
       data hash MD5: 32K
       9A 33 89 D0 92 E6 7D F3 90 AB 25 03 FE 5E 5A CA>)
(   3,<2012-08-10 16:59:04.500 -0500>,<Administrator>,<TOPSPIN>,<proc1d>,<TOPSPIN 2.1>,
      <pk PHC0 = 178.3026 PHC1 = 0 
       data hash MD5: 32K
       94 88 36 CD 05 03 D1 35 9D 4D A4 FD F6 A2 7F 66>)
(   4,<2012-08-10 16:59:04.578 -0500>,<Administrator>,<TOPSPIN>,<proc1d>,<TOPSPIN 2.1>,
      <abs ABSG = 1 
       data hash MD5: 32K
       25 CC 22 10 83 67 A5 57 AE 62 AD C1 28 20 03 15>)
(   5,<2012-08-10 16:59:04.609 -0500>,<Administrator>,<TOPSPIN>,<proc1d>,<TOPSPIN 2.1>,
      <abs ABSG = 2 
       data hash MD5: 32K
       94 8D 05 96 CE 10 68 4F 04 02 C8 C5 26 3E 55 E9>)
(   6,<2012-08-10 16:59:04.796 -0500>,<Administrator>,<TOPSPIN>,<proc1d>,<TOPSPIN 2.1>,
      <abs ABSG = 3 
       data hash MD5: 32K
       45 B4 14 02 0D 0E E8 8F 9C 60 35 33 70 CE E9 6C>)
(   7,<2012-08-10 16:59:04.843 -0500>,<Administrator>,<TOPSPIN>,<proc1d>,<TOPSPIN 2.1>,
      <abs ABSG = 4 
       data hash MD5: 32K
       F9 1D 68 06 19 10 12 B0 42 90 00 B3 77 73 2C E0>)
(   8,<2012-08-10 16:59:04.875 -0500>,<Administrator>,<TOPSPIN>,<proc1d>,<TOPSPIN 2.1>,
      <abs ABSG = 5 
       data hash MD5: 32K
       2E A9 88 19 4B B0 09 C5 63 E6 B2 D7 55 DE 42 75>)
$$ ##END=
$$ 
$$ $$ hash MD5
$$ $$ 63 CD 66 67 06 0F 15 18 37 7F B2 1F 39 4E 3D 19
##$RELAX= 
##$RELAX= 
##$RELAX= 
##$RELAX= 
##$RELAX= 
##$RELAX= 
##$RELAX= 
$$ Bruker specific parameters
$$ --------------------------
$$ [...]
##$TP= (0..7)
150 150 150 150 150 150 150 150
##$TP07= 0
##$TPNAME0= <>
##$TPNAME1= <>
##$TPNAME2= <>
##$TPNAME3= <>
##$TPNAME4= <>
##$TPNAME5= <>
##$TPNAME6= <>
##$TPNAME7= <>
##$TPOAL= (0..7)
0.5 0.5 0.5 0.5 0.5 0.5 0.5 0.5
##$TPOFFS= (0..7)
0 0 0 0 0 0 0 0
##$TUNHIN= 0
##$TUNHOUT= 0
##$TUNXOUT= 0
##$USERA1= <user>
##$USERA2= <user>
##$USERA3= <user>
##$USERA4= <user>
##$USERA5= <user>
##$V9= 5
##$VALIST= <valist>
##$VCLIST= <CCCCCCCCCCCCCCC>
##$VD= 0
##$VDLIST= <DDDDDDDDDDDDDDD>
##$VPLIST= <PPPPPPPPPPPPPPP>
##$VTLIST= <TTTTTTTTTTTTTTT>
##$WBST= 1024
##$WBSW= 4
##$XGAIN= (0..3)
0 0 0 0
##$XL= 0
##$YL= 0
##$YMAX_a= 451772
##$YMIN_a= -588396
##$ZGOPTNS= <>
##$ZL1= 120
##$ZL2= 120
##$ZL3= 120
##$ZL4= 120
##$ABSF1= 14.98509
##$ABSF2= -5.573092
##$ABSG= 5
##$ABSL= 3
##$ALPHA= 0
##$AQORDER= 0
##$ASSFAC= 0
##$ASSFACI= 0
##$ASSFACX= 0
##$ASSWID= 0
##$AUNMP= <proc_prof1d_extract_pilot.lims>
##$AXLEFT= 0
##$AXNAME= <>
##$AXNUC= <1H>
##$AXRIGHT= 0
##$AXTYPE= 0
##$AXUNIT= <>
##$AZFE= 0.1
##$AZFW= 0.1
##$BCFW= 0
##$BC_mod= 0
##$BYTORDP= 0
##$COROFFS= 0
##$CY= 15
##$DATMOD= 1
##$DC= 0
##$DFILT= <>
##$DTYPP= 0
##$F1P= 0
##$F2P= 0
##$FCOR= 0.5
##$FTSIZE= 32768
##$FT_mod= 6
##$GAMMA= 0
##$GB= 0
##$INTBC= 1
##$INTSCL= 1
##$ISEN= 128
##$LB= 0
##$LEV0= 0
##$LPBIN= 0
##$MAXI= 10000
##$MC2= 0
##$MEAN= 0
##$ME_mod= 0
##$MI= 0
##$NCOEF= 0
##$NC_proc= -8
##$NLEV= 6
##$NOISF1= 0
##$NOISF2= 0
##$NSP= 0
##$NTH_PI= 0
##$NZP= 0
##$OFFSET= 14.98509
##$PC= 1
##$PHC0= 178.3026
##$PHC1= 0
##$PH_mod= 1
##$PKNL= yes
##$PPARMOD= 0
##$PPDIAG= 0
##$PPIPTYP= 0
##$PPMPNUM= 2147483647
##$PPRESOL= 1
##$PSCAL= 4
##$PSIGN= 0
##$PYNMP= <proc.py>
##$REVERSE= no
##$SF= 400.02
##$SI= 32768
##$SIGF1= 0
##$SIGF2= 0
##$SINO= 400
##$SIOLD= 32768
##$SPECTYP= <>
##$SREGLST= <1H.CDCl3>
##$SSB= 0
##$STSI= 32768
##$STSR= 0
##$SW_p= 8223.68421052631
##$SYMM= 0
##$S_DEV= 0
##$TDeff= 65536
##$TDoff= 0
##$TI= <>
##$TILT= no
##$TM1= 0
##$TM2= 0
##$TOPLEV= 0
##$USERP1= <user>
##$USERP2= <user>
##$USERP3= <user>
##$USERP4= <user>
##$USERP5= <user>
##$WDW= 1
##$XDIM= 32768
##$YMAX_p= 458296386
##$YMIN_p= -656903
##$CURPLOT= <Network HP LaserJet P1505>
##$CURPRIN= <$Network HP LaserJet P1505>
##$DFORMAT= <normdp>
##$LAYOUT= <+/1D_H.xwp>
##$LFORMAT= <normlp>
##$PFORMAT= <normpl>
##$SURQMSG= 1
$$ End of Bruker specific parameters
$$ ---------------------------------
##NTUPLES= NMR SPECTRUM
##VAR_NAME=  FREQUENCY,     SPECTRUM/REAL,   SPECTRUM/IMAG
##SYMBOL=    X,             R,               I
##VAR_TYPE=  INDEPENDENT,   DEPENDENT,       DEPENDENT
##VAR_FORM=  AFFN,          ASDF,            ASDF
##VAR_DIM=   32768,         32768,           32768
##UNITS=     HZ,            ARBITRARY UNITS, ARBITRARY UNITS
##FACTOR=    0.250966925370066, 1,           1
##FIRST=     8223.43324360094, 105243,       -8548
##LAST=      0,             15097,           -36973
##MIN=       0,             -656903,         0
##MAX=       8223.43324360094, 458296386,    0
$$ Real data points
##PAGE= N=1
##DATA TABLE= (X++(R..R)), XYDATA
$$ [...]
19486f1281H2195c58056f5863j46363A92490a66286j19508C9092N8847b66738
19475c3531j15253p8430A95548a52122A10403a25576A25503K4846b74872B29125
19464e0478C54b4935m7185J4836A02907e6846B3634f9946I0543l2524B4139f56903
19451a14999A89938a13218K300B3312P5345b38069h3954I0027c35645b3409D1532
19439E8860a4883n14313K61455G0643a45683r1672B3516O776d75990g2069j6352
19428h8421j58737D0949a67537F7874a25826j44555i4692k7782b9938M700A10237
19416d5966N028A628a92097B58465D5332a45267j32437d4619H382K5484b66970
19404D5167e1357C4155c35468R0655N5709j22013g0633B02339b89721Q6150f2011
$$ y = [-61281, 82195, -358056, -65863, -212226, 192490, -166286, -285794, 39092, 97939, -266738, -33531, -148784, -227214, 195548, -152122, 110403, -125576, 125503, 150349, -274872, 229125, -50478, 354, -24935, -72120, -57284, 102907, -56846, 23634, -69946, 90543, 58019, 24139, -656903, -114999, 189938, -113218, -110918, 23312, 98657, -238069, -83954, 90027, -335645, -23409, 41532, 58860, -14883, -529196, -267741, 70643, -145683, -237355, 23516, 30292, -475990, -72069, -88421, -247158, 40949, -167537, 67874, -125826, -270381, -94692, -122474, -29938, -25238, 110237, -45966, -40938, 1628, -192097, 258465, 45332, -145267, -277704, -44619, 8382, 33866, -266970, 45167, -51357, 34155, -335468, -244813, -189104, -311117, -70633, 202339, -289721, -203571, -62011]
19392A09604d76531C7988b26889J0284h3676B92037j40493E4391b31780A22067
19381C1213a5719j68483I3293b6274E984c83113a58631M2981A1217J33321B9920
19369a76385k7963l5015B00959f6983b1936A29920i1308B11792H7812K36185b88743
19357c81417C159c7707A30198c45254G6545c34367J02100I2308P987b28806M3833
19346a84973h7989E3110P879L0997b5874j89027C4579J78710a27319p6513C97492
19334c38406A57855J02117A23289a38994L9104k82891d514j94874L4533F7584
19323b4537q5097q1415L2402q5896J12588a3572A25183E6661L89398c88829C5746
19311f6812k23187a305q2892I3180c15714P719b5153j92068b1287B11662g451
$$ y = [109604, -476531, 37988, -226889, -216605, -83676, 292037, 151544, 54391, -231780, 122067, 31213, -15719, -184202, 93293, -26274, 5984, -383113, -158631, -115650, 11217, 144538, 29920, -176385, -204348, -239363, 200959, -66983, -21936, 129920, -91308, 211792, 87812, 323997, -288743, -381417, 3159, -37707, 130198, -345254, 76545, -334367, -232267, 92308, 100295, -228806, -184973, -87989, 53110, 60989, 91986, -25874, -214901, 34579, 213289, -127319, -203832, 397492, -338406, 157855, 259972, 123289, -138994, -99890, -382781, -4514, -199388, -164855, 67584, -24537, -109634, -191049, -158647, -244543, -131955, -13572, 125183, 56661, 446059, -388829, 35746, -66812, -289999, -1305, -84197, 93180, -315714, -307995, -25153, -217221, -21287, 211662, -7451]
19299f3291A02843R0119a81877a3380j95091g6785A11959d2860p8387p5217a184
19287a7894n9562r5167C7981N8687l7944N5320b40218a6763C2137f9385l44549
19276d13934C5565i6060A50987d17650H7663K445e1858r5972B7556k96b01469
19264B5094E246f1059j92218D0104i2055J185l4794K9455A30846K0618g3745A71288
19251b6603D3084f755j32198O0948n7671B34207f0658k10873A0326Q2144c1233
19239D3171J17757b75657J17391A99692e53296i5364j70975a27339L9828b8741
19228G1503b15506l1332g6880B93038q0580I141a5827A12311h5986B35516A4696
19216a89593h7433j64838I6367b62123c7258j43183M1993c7317m4165j83341J29564
$$ y = [-63291, 102843, 192962, -181877, -13380, -208471, -76785, 111959, -42860, -121247, -196464, -1184, -17894, -77456, -172623, 37981, 96668, 58724, 114044, -240218, -16763, 32137, -69385, -413934, 35565, -96060, 150987, -417650, 87663, 90108, -51858, -147830, 27556, 27260, -201469, 25094, 5246, -61059, -253277, 40104, -92055, -90870, -125664, -96209, 130846, 151464, -73745, 171288, -26603, 43084, -6755, -138953, -78005, -135676, 234207, -60658, -271531, 10326, 92470, -31233, 43171, 160928, -275657, -158266, 199692, -553296, -95364, -266339, -127339, -87511, -28741, 71503, -215506, -246838, -76880, 293038, 212458, 9141, -15827, 112311, -85986, 235516, 14696, -189593, -87433, -252271, 96367, -262123, -37258, -180441, -138448, -37317, -81482, -264823, -135259]
19205a35259q6100p9012K4945Q0087d242q7734j47463B2878K98972G4109a87193
19193G2979c2389j36033G4423c46810J69237B07406a98737j49619J64892j13612
19183b97076O3981h0705P542K4748n3026p6170n8760A06820c87527B36627b42206
19171A03393j4223b26584p4018e314j01327I5009d52543A85481e03177b11651
19160c2939A66435D0943j5201C557a37492e7362E3559c16008j47969A84886a63247
19148B24542e8878G6989J4731b0367G4048k7003c06239A63400c54966J53323h6077
19136c92684a6985o2749J0909A45761a02926K9917I6753D3388h2333r8234A07694
19124E0249O772J13787E4793a12995l5857L741e8212j72248A32758g3584b6033
$$ y = [-135259, -221359, -300371, -275426, -195339, -4242, -91976, -239439, 22878, 321850, 74109, -187193, 72979, -32389, -168422, 74423, -346810, -177573, 207406, -198737, -348356, -183464, -297076, -233095, -80705, -73163, -48415, -101441, -177611, -236371, 106820, -387527, 236627, -242206, 103393, 89170, -226584, -300602, -5314, -106641, 95009, -452543, 185481, -503177, -211651, -32939, 166435, 40943, 25742, 3557, -137492, -57362, 53559, -316008, -463977, 184886, -163247, 224542, -58878, 76989, 91720, -20367, 74048, 47045, -306239, 163400, -354966, -201643, -86077, -392684, -16985, -79734, -68825, 145761, -102926, -73009, 96753, 43388, -82333, -180567, 107694, 50249, 57021, 170808, 54793, -112995, -148852, -145111, -58212, -230460, 132758, -73584, -26033]
19112B7487J57211J37542b6929l4154A64150E3754k5158K1002a71962f6021B57645
19100b18842a01943A135b63267a16533L9070A41390h9418K428k87300a42138k52552
19089c94690a8172B2860K56542a44785j84658A48664d41827a29329j76214B01069
19078F3155J10952a19782A55985l5512a12310A89760b21965A29809F1653J12464
19068A74117J28156I9118K59170b42470p2354d9873k4810C7581b1832j28058A47664
19056B91767f1717k8730A4372K10845d1980j99911D18672a59870B20290a12300
19045a67972B38071D975a10471p2299A10772E0290b8942E1259a7523j5027A97807
19033b5754j19546j12257N858b9918A24320b49368A7581h8558q0435A06453N0038
$$ y = [27487, 184698, 322240, -26929, -61083, 164150, 53754, 28596, 49598, -171962, -66021, 257645, -218842, -101943, 1135, -263267, -116533, -77463, 141390, -89418, -86990, -374290, -142138, -394690, -18172, 22860, 279402, -144785, -329443, 148664, -441827, -129329, -305543, 201069, 63155, 174107, -119782, 155985, 120473, -112310, 189760, -221965, 129809, 61653, 174117, 302273, 99118, 358288, -242470, -314824, -49873, -74683, 37581, -21832, -149890, 147664, 291767, -61717, -90447, 14372, 225217, -41980, -241891, 418672, -159870, 220290, -112300, -167972, 238071, 4975, -110471, -182770, 110772, 50290, -28942, 51259, -17523, -32550, 197807, -25754, -145300, -257557, -251699, -29918, 124320, -249368, 17581, -88558, -168993, 106453, 156491]
19022A56491b00390r3209a30874B01982o9531E0455J07178j9295b73155E3626
19011g2291k46183J57812A11325A6014K56808j17132B7875c20880A98343b10762
19000A76560a7105k07898a02620J3839j2917j65380D7507L01257a39261d0811
18989b67004H5739c13347a28218H5009a86024a0286j81958f8009H332a66739K0968
18978a45771g2287C5985K24185f1549D65648J86019K02418C09939j23061B7617
18967E9713a02224C04g4761j82149d5908B1840a10596L7198j86060R1688L9153
18956a28617E1150J29641b46692R1929c605k7489A09003a92583E3382J60058F7591
18944C7290b14672H2639h4486E5711c9117B16047d2436A4876Q5140D2362J90235
$$ y = [156491, -200390, -293599, -130874, 201982, 132451, 50455, 157633, 138338, -273155, 53626, -72291, -318474, -160662, 111325, 16014, 272822, 155690, 27875, -320880, 198343, -210762, 176560, -17105, -225003, -102620, -88781, -101698, -267078, 47507, 348764, -139261, -40811, -267004, 85739, -313347, -128218, 85009, -186024, -10286, -192244, -68009, 8332, -166739, -145771, -72287, 35985, 260170, -61549, 465648, 651667, 854085, 309939, 186878, 27617, 59713, -102224, 304, -74761, -256910, -45908, 21840, -110596, -73398, -259458, -167770, -128617, 51150, 180791, -246692, -154763, -3605, -31094, 109003, -192583, 53382, 213440, 67591, 37290, -214672, 82639, -84486, 55711, -39117, 216047, -42436, 14876, 100016, 42362, 232597]
18933B32597g2627F0197d026E5127b15555f5961K1388k08699B68477a38492j59175
18922b97667a07248j65180E8752a3763G6111j0339b4700A22029l498a61165N3696
18911a07469A97538J06568L11353k01906F5071O8606a81186e5858a0215j14062
18901a24277k5958F8972a35261B60090f1851m4762E3308B4513b28808H1941h2717
18889a05978M795j52286j61371h5674n2562K3358c1924a5483B17633F1381L0801
18878I2182j0233b90807G9535C2876B439d7134C6514c8200a7953q5177j6518J5741
18866a03907k80151f0498B00212a06836k56384h438j98753f5171K093A04458b09682
18854I4153l782b9285k28069j19955n8699E139b58414a18283j8297c6486j75535
$$ y = [232597, -72627, 60197, -4026, 55127, -215555, -65961, -44573, -253272, 268477, -138492, -297667, -107248, -272428, 58752, -13763, 76111, 65772, -24700, 122029, 118531, -161165, -107469, 197538, 304106, 615459, 413553, 65071, 133677, -181186, -55858, -10215, -124277, -150235, 68972, -135261, 260090, -61851, -106613, 53308, 24513, -228808, 81941, -82717, -105978, -101183, -253469, -414840, -85674, -138236, -114878, -31924, -15483, 217633, 61381, 92182, 81949, -290807, 79535, 32876, 2439, -47134, 36514, -38200, -17953, -103130, -119648, -103907, -384058, -60498, 200212, -106836, -363220, -8438, -207191, -65171, -63078, 104458, -209682, 94153, 90371, -29285, -257354, -377309, -436008, 5139, -258414, -118283, -136580, -36486, -212021]
18843b12021C44529b19887A6450b26402e9565B13459I915c15677m9312A8374c67098
18831c06743h2668K3851A50307P2508i3471B642L5487a69626j6651A01461a35606
18819I7733a60615L8364c013D45598a63066b0271B8701K38035I3424e9797k6019
18808h5816E0254M1836O9017m9536a12029A50608k9495E1144J29458c0408q1430
18797a11838j99595a08616J7574r588A62580C4163N7060B3916a74025N4866k9291
18786a48450J797A44596a99545a9387G6150c35820C7506a34945A68544o0975a96429
18774c88543B00363c47986i3115j95857C29366A12534A9944a17991I7950d7158
18763B33937a13037D7569d1080j20018j66302E8638K447j6668A1299R8294e6931
$$ y = [-212021, 344529, -219887, 16450, -226402, -59565, 213459, 9915, -315677, -364989, 18374, -367098, -306743, -82668, -58817, 150307, 222815, -93471, 2642, 38129, -169626, -186277, 101461, -135606, 97733, -160615, -122251, -3013, 445598, -163066, -20271, 28701, 266736, 93424, -59797, -85816, 50254, 92090, 161107, 111571, -112029, 150608, 121113, 51144, 180602, -30408, -111838, -311433, -108616, -91042, -100630, 162580, 34163, 91223, 23916, -174025, -119159, -148450, -146653, 144596, -199545, -19387, 76150, -335820, 37506, -134945, 168544, 107569, -196429, -388543, 200363, -347986, -93115, -288972, 329366, 112534, 19944, -117991, 97950, -47158, 233937, -113037, 47569, -41080, -161098, -327400, 58638, 61085, 44417, 11299, 109593, -56931]
18751A12951a05090A69646H2294a41825F186c85669i9431L1216A1279K28166h9980
18739C3560c5082A2804a05253B11158b29166k79501a39800B04926b71899B0732
18728c2572F9009a17945L5100A23776c43506A64038b7425l4082j7615o4594B03080
18716H4659K1708a12879L9234b7549e188r96B8565j327f1532b6598k60466g9512
18703a40965C04149a29275L1528G4562a62317A8229M4099C39b44252f2733L1100
18692c1633B27514h6336N379j65428h4022k17274A73547D7414J74739A10141d6241
18680c06732A91037b50249A79852b70341p7936I0198a64825M7434A0150L2407
18670D2557b03366A40990o8784K21025a76984G813J57709b19634a7270l9313l34287
$$ y = [112951, -105090, 169646, 82294, -141825, 6186, -385669, -99431, -68215, 11279, 239445, -89980, 33560, -35082, 12804, -105253, 211158, -229166, -508667, -139800, 204926, -271899, 20732, -32572, 69009, -117945, -82845, 123776, -343506, 164038, -27425, -61507, -79122, -143716, 203080, 84659, 106367, -112879, -73645, -27549, -5188, -6184, 28565, 27238, -61532, -26598, -287064, -79512, -140965, 304149, -129275, -97747, 74562, -162317, 18229, 62328, 339, -244252, -62733, -31633, 227514, -86336, -80957, -246385, -84022, -301296, 173547, 47414, 222153, 110141, -46241, -306732, 191037, -250249, 179852, -270341, -348277, 90198, -164825, -117391, 10150, 42557, -203366, 140990, 72206, 293231, -176984, 7813, 165522, -219634, -17270, -56583, -390870]
18659c90870A72292b05523L003B60683b03016N7198f9129B0039L19318J5985a7111
18647a24321g344j50627B62763i4608k61583B8770Q8915J02769a68798p9541a18376
18635B75446a74408b3204B86940A8078g4999q1802G2637a16867B01792h4984B44686
18623h1996j46903A00084a38149j366N8762m4994n6777a7904A5612a55969B81434
18611i3839I4787l3286K4555d0116A51854i0743C36776c2522A49103D3456O9459
18600A12915g4536E31J30520a88145N5722N9328E5477K24357b24022p6861m2138
18589c43021g5050J3248b0413B0834b1990k3438A17156d66145b25754o5089b7973
18577a68737A27820b39803j15861J42520G3801O1387a00946j74493F1772a69889
$$ y = [-390870, 172292, -205523, -202520, 260683, -203016, -145818, -69129, 20039, 339357, 355342, -17111, -124321, -7344, -157971, 262763, -94608, -356191, 28770, 117685, 220454, -168798, -248339, -118376, 275446, -174408, -23204, 286940, 18078, -74999, -156801, 72637, -116867, 201792, -84984, 244686, -81996, -228899, 100084, -138149, -139515, -80753, -125747, -182524, -17904, 15612, -155969, 281434, -93839, 94787, 61501, 86056, -40116, 151854, -90743, 336776, -32522, 149103, 43456, 112915, -74536, 531, 131051, -188145, -132423, -73095, 55477, 279834, -224022, -300883, -343021, -75050, -61802, -20413, 20834, -21990, -45428, 117156, -466145, -225754, -290843, -27973, -168737, 127820, -239803, -355664, -213144, 73801, 135188, -100946, -275439, 61772, -169889]
18566H6517B251P5224C3270j2050a00475B40846H5373c45526a49551a5514A02380
18554F0260c7891K277G6795a82858m31j07339F0574e38438a27251F7055l2793
18543C4262f497A93727f6848m1073j47558c2878L666H2763R9058i5049a386q6937
18531h8323q307c5246k17117A07050b3705k21235A79484b82758j3029a45773f705
18519g7533A41500a1042A6891J06804E7465a87123E4360J40247b34133J02240
18509a31893L9919B0058R7544c13546b7449o4045A46756J22206h5326A25864b8482
18497B81501d8658O552k45496R6557e646G1803d9388j99751j03198F9668a60446
18485h3053k65312J45843c4839k56058K3654A0730J46239D8340J1901b33560B3763
$$ y = [86517, 2251, 77475, 33270, 21220, -100475, 240846, 85373, -345526, -149551, -15514, 102380, 60260, -37891, -35614, 76795, -182858, -183289, -290628, 60574, -538438, -127251, 67055, 34262, -6497, 193727, -66848, -107921, -255479, -32878, -29212, 82763, 181821, -95049, -1386, -88323, -96630, -35246, -252363, 107050, -23705, -244940, 179484, -282758, -295787, -145773, -6705, -77533, 141500, -11042, 16891, 123695, 57465, -187123, 54360, 194607, -234133, -131893, -91974, 20058, 117602, -313546, -27449, -91494, 146756, 268962, -85326, 125864, -28482, 281501, -48658, -42106, -287602, -191045, -5646, 71803, -49388, -249139, -352337, 69668, -160446, -83053, -348365, -202522, -34839, -290897, -267243, 10730, 156969, 48340, 60241, -233560, 23763]
18473a14623c7496o2241K899j16933d7769E8793d6961j74981a06406M2762K7541
18462c6103A65290b04084d5777l47690n7638J53422B45231a4637F9725a47767
18451I921b38325I9876g3837b7638B9269b73078J29693j675A10875K1438h5134
18439a21412C49162j40987D150g7903J4609I3085l3941J36098k2372d1694l477
18428d5171E4111b53672p3216a46290q7011C697a12534m66048f567C50555A50483
18416h2317g782j23971L7713A99718b07740e1161j89032B16945a34180J8309C2736
18404B54948q0492Q6680b71799B10967r0280i3846A18888b95716A05242b03934
18393f8842n6694c3162C971d4205C6723d0076C77441A06377B8520i268C26577
$$ y = [-114623, -37496, -99737, -96838, -213771, -47769, 58793, -46961, -221942, -106406, -63644, -36103, 165290, -204084, -45777, -393467, -451105, -297683, 245231, -14637, 69725, -147767, 9921, -238325, 99876, -73837, -27638, 29269, -273078, -143385, -145060, 110875, 132313, -85134, -121412, 349162, 208175, 4150, -77903, -63294, 93085, 59144, 195242, 172870, -41694, -45171, 54111, -253672, -326888, -146290, -233301, 3697, -112534, -578582, -6567, 350555, 150483, -82317, -7782, -131753, -94040, 199718, -207740, -51161, -240193, 216945, -134180, -115871, 32736, 254948, 174456, 261136, -271799, 210967, 120687, -93846, 118888, -295716, 105242, -203934, -68842, -125536, -33162, 3971, -44205, 36723, -40076, 377441, 106377, 28520, -9268, 326577]
18381f2891p5649j83723R7279C1553b08696F9892L36367H0599C0768a38298q9652
18370b27950A03797c00280a36459j92282a2686A97282r6711M4789E7164k2927
18360C4237J62261a75470g3566A29696a19928A7492A566K2209a5346r2606B06755
18348I7800a96019M6358A58889a71477J4677A8437a89588L4447e8604A15J73668
18337A73783f4540B2696a75376B28668a68152D6761K1882f8802j1357K3199m4188
18326a01148c0066B39837A04705a30001j6224d5702l7567J7347o4035J3504q2560
18315a99013C4451a1947A17386f9742a2786H3108a59630d1146I818J78414a68559
18303g9589k2427E363b99807f0596k08555j48130E29992j34429j03419j19118
$$ y = [-62891, -138540, -322263, -224984, 31553, -208696, 69892, 406259, 80599, 30768, -138298, -227950, 103797, -300280, -136459, -328741, -12686, 197282, 100571, 145360, 57164, 34237, 196498, -175470, -73566, 129696, -119928, 17492, 1566, 23775, -15346, -107952, 206755, 97800, -196019, -149661, 158889, -171477, -156800, 18437, -189588, -155141, -58604, 115, 173783, -64540, 22696, -175376, 228668, -168152, 46761, 68643, -68802, -80159, -56960, -101148, -30066, 239837, 104705, -130001, -146225, -45702, -83269, -65922, -129957, -116453, -199013, 34451, -11947, 117386, -69742, -12786, 83108, -159630, -41146, 9818, 188232, -168559, -79589, -102016, 5363, -299807, -60596, -269151, -417281, 529992, 395563, 292144, 173026]
18293A73026a93183A13704L60340h9451C1066K61674a79106O3357B2205c18821
18282c0706D0356N0713Q3836R8316b53491A1992K01848g4417j63472H0891a51167
18270i506j57629d2010k22367j21748B09920C6372b06672p7711K2575A3432J13619
18259A27051A4222b54069l8184A72f690j73112k42348B41697G9522L7826b87414
18247c2967k9663L967A2690b76738a24983j2815k10468a08133A72498f8145l41854
18236d09999A20782c04781G0151g1207J093G6011a8892G0102a58890f1292E5800
18224b10428d4127H9623l2630N3151k0426K6516h4443m223B03331e3197l6558
18213h9755A6878L8174c16491J33834k1275E03634j27663E6204A3917j14b62067
$$ y = [173026, -193183, 113704, 474044, -89451, 31066, 292740, -179106, -115749, 22205, -318821, -30706, 40356, 91069, 174905, 273221, -253491, 11992, 213840, -74417, -237889, 80891, -151167, -9506, -167135, -42010, -264377, -386125, 209920, 36372, -206672, -284383, -261808, 13432, 127051, 14222, -254069, -292253, 172, -6690, -179802, -422150, 241697, 79522, 117348, -287414, -32967, -62630, -58663, 12690, -276738, -124983, -137798, -348266, -108133, 172498, -68145, -409999, 120782, -304781, 70151, -71207, -70114, 76011, -18892, 70102, -158890, -61292, 55800, -210428, -44127, 89623, 56993, 110144, 89718, 116234, -84443, -88666, 203331, -53197, -89755, 16878, 55052, -316491, -182657, -203932, 503634, 375971, 56204, 13917, 13803, -262067]
18201e9743j74321G1221K11193b6170A32791a44542m9201R4799K7337A12490d02352
18189b89450a02119G3519p409P7371c29137b7987q0870A68534a76530g4218K1220
18178e2998I386d6271I151b65862m0650C5953A0345J28793j8933l640k2993K9911
18166A23483p663J4514D7502b59900j4667M6719A22611a71624A37637J48501j40614
18155A45524d33685Q6849d6479E4185a05604D1199J02834L9400b28627G5562b389
18143f8922a3572B54263h1870B78373e1440k18623B47101f2959o5258A12829a70751
18131B34125m291k7911c04929I9532J06769b82362a02984D39880e5672p7582C21759
18119G5967a82699F456a08479A92113a13136A6314J0565P1045J40323a36982E7558
$$ y = [-59743, -234064, 71221, 282414, -26170, 132791, -144542, -193743, -98944, -71607, 112490, -402352, -289450, -102119, 73519, 66110, 143481, -329137, -27987, -108857, 168534, -176530, -74218, -52998, 9386, -46271, 9151, -265862, -306512, 35953, 10345, 139138, 120205, 116565, 93572, 123483, 115820, 130334, 47502, -259900, -274567, -227848, 122611, -171624, 137637, 286138, 145524, -433685, -346836, -46479, 54185, -105604, 41199, 144033, 183433, -228627, 75562, -2389, -68922, -13572, 254263, -81870, 278373, -51440, -270063, 247101, -62959, -128217, 112829, -170751, 234125, 229834, 201923, -304929, 99532, 206301, -282362, -102984, 439880, -55672, -133254, 321759, 75967, -182699, 6456, -108479, 192113, -113136, 16314, 26879, 97924, 238247, -136982, 57558]
18107a2113A3340P5996l714j9463b00076k64505Q7633B1328a63002C03433b2320
18095a85174O5428M5101B77033j29583C2047K4310a76326O270B52238b9761j38141
18084a67902B71176h0975j10508E1438O4830h0677A4317P0043B4288r792N627
18073B0123i0720j47383M3815A33635i8612a5307k10561C34118m9404N3711b8567
18061A32265D3014a85625d5585j6520A11806J5542b6189p7126A18136a67805q9048
18050b56853b0835B32677A03100e7781l30767G7628a67385o6131C9013a48570
18039A70435a9483B0550a4847C81901A50165f7622A22927P0278D5890P3568d6418
18027A83513N3560i4685A7691F693h1017m8606j9910B87313c9007A54284E1057
$$ y = [-12113, 13340, 89336, 85622, 66159, -200076, -464581, -376948, 21328, -163002, 303433, -22320, -185174, -119746, -74645, 277033, 147450, 32047, 56357, -176326, -170056, 252238, -29761, -167902, 271176, -80975, -191483, 51438, 116268, -80677, 14317, 84360, 24288, 14496, 20123, -90720, -238103, -194288, 133635, -98612, -15307, -225868, 334118, 284714, 338425, -28567, 132265, 43014, -185625, -45585, -62105, 111806, 127348, -26189, -103315, 118136, -167805, -256853, -20835, 232677, 103100, -57781, -388548, 77628, -167385, -233516, 39013, -148570, 170435, -19483, 20550, -14847, 381901, 150165, -67622, 122927, 193205, 45890, 119458, -46418, 183513, 237073, -94685, 17691, 6693, -81017, -129623, -149533, 287313, -39007, 154284, 51057]
18015A1232a4289q8945c8419a8897j79180D59728j73644a31797j016F2295A7827
18003I3369c03188A2184L59215a51917E3155a62019A43453e650j59530H418L26666
17992C35084G9866J61929B2337L3798K19019h045l21810N3126a4188A30834C1793
17980e1655A50569a26957D33219f5911F7729K55189A08900a30037n4015r0912
17970b74964H5651P1986A0303N2304J84765r484a06942E84589b59138c8842A16325
17958A61967m7593J13693c2886n4343c2338k70083a43813d6925H813c0650k77064
17947c07714J40734j1991G3842R577a3011k41489C80641a8001F5831B8711a78952
17935b34960f6336A18359d3238j66074H5821K67213E6313J28768a52846A51636
$$ y = [11232, -14289, -103234, -38419, -18897, -198077, 459728, 286084, -131797, -132813, 62295, 17827, 93369, -303188, 12184, 371399, -151917, 53155, -162019, 143453, -5650, -165180, 8418, 335084, 79866, 241795, 22337, 56135, 275154, -8045, -329855, -276729, -14188, 130834, 31793, -51655, 150569, -126957, 433219, -65911, 67729, 322918, 108900, -130037, -184052, -274964, 85651, 157637, 10303, 62607, 247372, 237888, -106942, 584589, -259138, -38842, 116325, 161967, 114374, 228067, -32886, -87229, -32338, -302421, -143813, -46925, 8813, -30650, -307714, -166980, -178971, 73842, 83419, -13011, -254500, 380641, -18001, 65831, 28711, -178952, -234960, -66336, 118359, -43238, -209312, 85821, 353034, 56313, 185081, -152846, 151636]
17924a02212I7453a52276A97771b68814I5535L2988a08719C83689a67565I2968
17913g3201c2953k61773a3748B04537C0358J30149a80339b9604J1589A9601K43192
17902B62793d2102Q767C9274b2712E6020Q1063c1836C5196i7120L5680D4676b4698
17889h9022b0145m2480D4375i2809j2959k0280B99074G831K34005A15316a22381
17877A62480J54841j39927L8239G3475K76887a81656A53564a41545C12000b17089
17866f3661l27529A022M5789e4980A75804K23305c5107l54300J92912G8483J09799
17855A88282c05586C06832j45278F753J11401a97616b4301i701D1564j0352a13417
17843c21446c8058A47156K7925f5960A34024a67364C9214K55659A04013e2308
$$ y = [-102212, 97453, -152276, 197771, -268814, 95535, 128523, -108719, 383689, -167565, 92968, -73201, -32953, -294726, -13748, 204537, 30358, 160507, -180339, -29604, -18015, 19601, 262793, -42102, -33335, 39274, -22712, 56020, 137083, -31836, 35196, -97120, -61440, 44676, -24698, -89022, -20145, -62625, 44375, -92809, -105768, -126048, 299074, 7831, 241836, 115316, -122381, 162480, 317321, 177394, 215633, 73475, 350362, -181656, 153564, -141545, 312000, -217089, -63661, -391190, 1022, 46811, -54980, 175804, 399109, -35107, -389407, -196495, 78483, 188282, -305586, 306832, 161554, 6753, 118154, -197616, -24301, -9701, 41564, 31212, -113417, -321446, -38058, 147156, 175081, -65960, 134024, -167364, 39214, 294873, 104013, -52308]
17832D20543f2093G791K23644j03727D8483b55103A99264g9016A13032K8718O6690
17821B08440D8765J06264l4733K856c57371C1496m491e734G8700b02012D1733
17809C51397j10500E5928e1529F5995k6120J45158f3964A57361g2159G1649K32768
17798C04417A27397m3177Q7670F871a2138k94968b5389E2613L09664E1587l991
17787D7596a2436M420A06635J41442g09l6674B2267a27805a0014o1495b0771j81372
17775b02143e2563d237k32k14972h8178A51595b13366L0642j05871F2600B5746
17763a2513j20439A004a47990O5274A33267D7153E997a1136l0319j60516C02350
17751I2430L5182b58636A80044H1022J30915N9989j310G0641J05826p1464L00533
$$ y = [420543, -62093, 7791, 231435, 127708, 48483, -255103, 199264, -79016, 113032, 141750, 208440, 48765, 155029, 120296, 123152, -357371, 31496, 27005, -5734, 78700, -202012, 41733, 351397, 240897, 55928, -51529, 65995, 39875, 185033, -63964, 157361, -72159, 71649, 304417, 127397, 84220, 171890, 6871, -12138, -307106, -25389, 52613, 362277, 51587, 47596, -12436, -8016, 106635, 248077, -709, -37383, 22267, -127805, -10014, -71509, -20771, -202143, -52563, -4237, -4469, -219441, -88178, 151595, -213366, -182724, -288595, 62600, 25746, -12513, -132952, 1004, -147990, -82716, 133267, 47153, 5997, -11136, -41455, -201971, 302350, 92430, 127612, -258636, 180044, 81022, 211937, 271926, 270616, 70641, 176467, 105003, 405536]
17740D05536d2293B49913i4234C55604a06253B94127n4926B7566g472A91561b1429
17728B94093B3374b3568C1290a77977B84569A28747J03488G8143O3054l9140C8487
17716e0402A89296g021G5645d6506A72806l7798a98608C518e5342H5574J17677
17705B03251B1291K35077o9455f2575H1743J67361C4233M04555H1824c04086A5634
17693c10186B49934j11277J60043j25992p1386K78816j69895L6990c5139A8116
17682B05829m0358k5202b62674C155J61568i7400H3904K25768C8501J30143f4811
17670a23589B38780J84646C1462O9607J61403A20752a18800D0211J60384e2050
17659A05703e7501K4356A71815r874g7304j29538D9843j6499b29243o4779Q4162
$$ y = [405536, -42293, 249913, -94234, 355604, -106253, 294127, 239201, 27566, -7472, 191561, -21429, 294093, 23374, -23568, 31290, -177977, 284569, 128747, 232235, 78143, 141197, 102057, 38487, -50402, 189296, -7021, 75645, -46506, 172806, 135008, -198608, 3518, -55342, 85574, 203251, 21291, 256368, 186913, -62575, 81743, 249104, 34233, 438788, 81824, -304086, 15634, -310186, 249934, 138657, 298700, 172708, 101322, 380138, 210243, 247233, -35139, 18116, 205829, 165471, 140269, -262674, 3155, 164723, -97400, 83904, 309672, 38501, 168644, -64811, -123589, 238780, 423426, 31462, 101069, 262472, 120752, -118800, 40211, 200595, -52050, 105703, -57501, -33145, 171815, 161941, -77304, -206842, 49843, 33344, -229243, -294022, -209860]
17648b09860h7498o9777j17997E0312J49938n289I0673J25637n8703J36895h7136
17636f0046A01839K82779l9149j41306g7337b33B89629P511a24536C03585F0886
17624A89951a13984A25922K3474b9469B63548n1376q2195J62632A34649P2247
17614B06896b86389C82122A30310n5267l4882R7015l7083J49079F952L48496A33634
17602i8536C97201A06592l0503J35888N3933J3435j03014D9520b1630E8360O2471
17591A20831L4357K20355j17886j21605L99743A9271a76062I3621k1724d3988
17580c4122B04260c6592A42958m8112D4900J39859P5166Q3079a2998C00949H6126
17568c366r8176B59073C3750M58956G4980R74J12257K14371n9766J9133A73200
$$ y = [-209860, -87498, -157275, -275272, 50312, 200250, 194961, 90673, 216310, 157607, 294502, -87136, -60046, 101839, 384618, 345469, 204163, -77337, -233, 289629, 297140, -124536, 303585, 60886, 189951, -113984, 125922, 149396, -29469, 263548, 212172, 129977, 292609, 134649, 206896, -286389, 382122, 130310, 75043, 40161, 137176, 100093, 249172, 6952, 355448, 133634, -98536, 397201, 106592, 76089, 211977, 265910, 279345, 176331, 49520, -21630, 58360, 120831, 155188, 375543, 257657, 136052, 535795, 19271, -176062, 93621, 71897, -43988, -34122, 204260, -36592, 142958, 94846, 44900, 184759, 259925, 343004, -12998, 300949, 86126, -3366, -101542, 259073, 33750, 492706, 74980, 75954, 188211, 402582, 342816, 361949, 173200]
17556E23789B46067F6923L1444m7023J42713i0913B22894a25290b9291F6877J57992
17545B24869L5190J71617j3419j26252b7188F0273J06623J47232e1169a6046A43772
17533B02586J01668j44848c077B70027K24329A87876N89668J73955N7299L06603
17523A315401k82556j82680K3508k67226B00355L54024k05565K6288E7181K94211
17513C51392L9025K86076K95851m3237L00912j73898l28811B89608q5278q79j01365
17502A02086L85849A15961J68169q1613q8479M18361a91725C88473j76413J40820
17492C52880A8074L41832J22742A46880L1327o8896K51669K13229j9821M2127
17482E96515k55489A70045J82281j12004J03398m382n7834C2570O4653K24218
$$ y = [523789, 246067, 66923, 98367, 51344, 194057, -90913, 222894, -125290, -29291, 66877, 224869, 260059, 431676, 418257, 292005, -27188, 60273, 166896, 314128, -51169, -16046, 143772, 202586, 304254, 159406, -3077, 270027, 494356, 187876, 777544, 951499, 1008798, 1315401, 1032845, 850165, 873673, 606447, 200355, 554379, 348814, 375102, 57181, 351392, 390417, 676493, 972344, 929107, 1230019, 1056121, 727310, 289608, 204330, 203451, 102086, 487935, 115961, 284130, 202517, 114038, 532399, -191725, 388473, 212060, 352880, 18074, 359906, 482648, 146880, 178207, 109311, 360980, 574209, 554388, 596515, 341026, 170045, 352326, 240322, 343720, 339338, 281504, 32570, 97223, 321441]
17472C21441R0079j08140K1155o0659r0990G7845K14046H1784J04575n223m6917
17461A34219e1177B91509K16762A27369L80993A91074J96410j48266L14511B67457
17450B30174K77278o4898A84365j5949N7735k9488J8219K08170r7592M8986j2155
17439C62291l4021P0924J09324j11810K3788J62178A92940D0188K23560O8928
17429C32676n6363A9104K51352q0671J30620n5172R825O57847C95465m4335Q4380
17418D35510A11777K35959h03A36129L59296j42774J97088A77252L73688A24938
17407C5918P31376C32199j03361p6811c8961A72195J80912J9756O1421k02792
17397B31492E9638J11304p4531K59540J2785A52432k6908m9657M26643A70344
$$ y = [321441, 411520, 303380, 324535, 263876, 172886, 77845, 291891, 81784, 186359, 181136, 134219, -51177, 291509, 508271, 127369, 508362, 191074, 387484, 239218, 553729, 267457, 230174, 507452, 442554, 184365, 168416, 226151, 196663, 214882, 423052, 325460, 374446, 362291, 328270, 399194, 508518, 396708, 420496, 582674, 192940, 40188, 263748, 332676, 276313, 19104, 270456, 189785, 320405, 265233, 275058, 932905, 395465, 351130, 435510, 111777, 347736, -803, 136129, 495425, 352651, 549739, 177252, 550940, 124938, 35918, 767294, 332199, 228838, 152027, -38961, 172195, 353107, 372863, 434284, 231492, 59638, 170942, 96411, 355951, 368736, 152432, 125524, 75867, 502510, 170344]
17386C92407A85501J14029K2183P3127l8321P8925I3247L49873A57737J60325
17376C18062p6162r4357M9213K244L84398r1140J07640B43889m1970K75931R0452
17365E68302B55383j0798l6679p1649J22731A14255b2912F1319K05581l7377j0611
17354B18912K65941k41802f658C28310L71922l26602j84376J71483A518J98597
17344B00115J57026A35418L6628O5055J00806J0077j8453j04199J72925L91233
17334G89490B85066j21139d4094B86385J76202B13471k1249J99811j09061K2261
17324C05233F7258J57749O9617j01772I35M66272k29952J04158K47124j57600
17314D30937e8570B53140N7857j11106P5542A27312K65404J90486B91134J0755
$$ y = [392407, 185501, 299530, 321713, 394840, 356519, 435444, 93247, 443120, 157737, 318062, 241900, 147543, 196756, 199000, 583398, 492258, 599898, 243889, 201919, 477850, 568302, 255383, 244585, 207906, 136257, 258988, 114255, -22912, 61319, 266900, 229523, 218912, 484853, 243051, -6658, 328310, 700232, 373630, 189254, 360737, 1518, 200115, 357141, 135418, 172046, 237101, 337907, 347984, 329531, 225332, 398257, 789490, 285066, 163927, -44094, 286385, 462587, 213471, 192222, 392033, 282972, 305233, 67258, 225007, 294624, 192852, 935, 467207, 237255, 341413, 588537, 430937, -58570, 253140, 310997, 199891, 275433, 127312, 392716, 583202, 291134, 301889]
17304C01889J08373j41628q1089J23471B0962L65960n6692q7755A3101K74731
17294B87832K8358K279o6083B3540Q8372L98747j52327j21779A08599K61316m5075
17283C24840A0292L91366o1671j06035K41822A73991J32204k3455j0327K7536
17273B99949l2847j07492M09492r2182A88823N1728n7169K34382A84578P3524
17263B58102K19636B32597J47478D8770K20959K32432I3257J02486j1898K63908
17253D47753J33415B06698L13899j03345Q262P1714J32729k36115Q227J02600
17243E04669p4774A32726K89036c2853C08918R9053J82178j91008A85845b7604
17232E05148J8934j50195r7543A03714L16777L2285L9871N1973k31355L11563
$$ y = [301889, 410262, 268634, 187545, 311016, 20962, 386922, 330230, 242475, 13101, 287832, 316190, 318469, 252386, 23540, 111912, 510659, 358332, 236553, 108599, 369915, 324840, 10292, 401658, 339987, 233952, 475774, 173991, 306195, 282740, 272413, 299949, 267102, 159610, 569102, 476920, 188823, 240551, 183382, 417764, 184578, 258102, 477738, 232597, 380075, 48770, 269729, 502161, 93257, 195743, 183845, 447753, 581168, 206698, 520597, 417252, 425514, 497228, 629957, 393842, 402069, 504669, 429895, 132726, 421762, -32853, 308918, 407971, 590149, 399141, 185845, -27604, 505148, 524082, 373887, 276344, 103714, 420491, 452776, 492647, 544620, 313265, 624828]
17222F24828q7459l3881k21537I1642M19324A91307M55371O8702m5025B38651
17211C46145K08587k076J97937C10447K39796k0609j2119j09743Q9801N7281k47055
17200C07799M222L50058k70908O2388J36706j90624j52724p376K05874M727I5316
17188C01979n4837M56855k38881k5170o1326j32652J26847K35942B53042M22903
17178F75945C17114M03193A10130D1588N95591k01522K15422M0921j47223r8221
17168D46556l5143Q8964J27069k03068J34415O5097k7878L2937L375K95601k40542
17157F87383B90256M70894l37235Q1300R4784j25781l3131J76602r0856j15786
17147D11047L13314o0065L6300k7630j00385J830K16413l75808J5609o8387N14961
$$ y = [624828, 537369, 503488, 281951, 91642, 510966, 191307, 646678, 715380, 670355, 238651, 346145, 554732, 552656, 750593, 310447, 550243, 529634, 517515, 407772, 497573, 554854, 307799, 312021, 662079, 391171, 453559, 590265, 399641, 246917, 239541, 445415, 450142, 95316, 301979, 247142, 703997, 465116, 439946, 378620, 245968, 372815, 608757, 253042, 675945, 317114, 720307, 110130, 41588, 637179, 435657, 651079, 692000, 544777, 446556, 411413, 500377, 627446, 424378, 558793, 623890, 596012, 628949, 632324, 927925, 687383, 290256, 761150, 423915, 505215, 599999, 474218, 441087, 617689, 526833, 411047, 724361, 664296, 700596, 672966, 572581, 574411, 790824, 415016, 430625, 362238, 877199]
17136H77199m38583K7200J42546P4819C03403K83432q4487J16632J71321k88290
17126E02011K11121j67366j83886J99811k70520K46886L8404J98791K73714l02517
17116G46449C21019K93981p4965K03221o3795L05089q9139m05982J04199L21518
17106I15146l74188K50424k18385j45207J48822K46806l79056K34823l2704J83491
17096H29972j28004J77805C81416J26234p5699m303K50722J81566o6859j67232
17086F25845M82199n23507J69747k88937M56036k92115K55518O4719m18759J81573
17076G12319k8170M9913j15243J61764Q4225m4285J69149m57246L39109j9201
17066H52334K99861l69634O2339j9864P4387j56000J74938J44262j16113p3671
$$ y = [877199, 438616, 465816, 608362, 683181, 303403, 586835, 502348, 618980, 790301, 502011, 713132, 545766, 361880, 561691, 291171, 538057, 576461, 775252, 1048966, 746449, 321019, 615000, 540035, 743256, 679461, 984550, 895411, 489429, 593628, 915146, 540958, 791382, 572997, 427790, 576612, 823418, 444362, 679185, 646481, 829972, 701968, 879773, 381416, 507650, 431951, 427648, 678370, 859936, 793077, 625845, 1108044, 584537, 754284, 465347, 921383, 629268, 884786, 949505, 530746, 712319, 684149, 734062, 618819, 780583, 864808, 820523, 989672, 532426, 871535, 852334, 1152195, 782561, 844900, 825036, 899423, 743423, 918361, 1062623, 946510, 872839]
17056H72839p093r8938M42907m10494J69206o9032k21444J55843K20824N7324
17046A111942o8692j44397j5449K90836M4281o07003L75703J9863m6911P9453
17036A039626n4506j05909L32478j32761j07963K13060j28290j72026J64775K00872
17026A249356m61719L39758K13229o1653j08026j11696R6939n8133k03792K81358
17016A175621J36054j72883j46996K64449R8335j88727j23434m543M36597l62584
17006A111889K15726M5376k23152l23810N37539j97707K97282j58379l9715R0452
16996A355501j5752j01120j99112M03640q7187m2516K45057k75500J50668n6254
16986A377425l4532j8003J36348j68625K73147q9620k34234M3545M6146J13217
$$ y = [872839, 865746, 766808, 1209715, 799221, 968427, 899395, 677951, 833794, 1054618, 1111942, 1043250, 898853, 883404, 1174240, 1218521, 611518, 987221, 1007084, 960173, 1039626, 985120, 879211, 1211689, 1078928, 970965, 1184025, 1055735, 883709, 1048484, 1249356, 787637, 1127395, 1340624, 1278971, 1170945, 1059249, 1156188, 1098055, 894263, 1175621, 1311675, 1138792, 991796, 1256245, 1354580, 1165853, 1042419, 1037876, 1474473, 1111889, 1327615, 1372991, 1149839, 826029, 1363568, 1165861, 1463143, 1304764, 1265049, 1355501, 1339749, 1238629, 1039517, 1443157, 1355970, 1313454, 1558511, 1283011, 1433679, 1377425, 1342893, 1324890, 1461238, 1292613, 1565760, 1476140, 1241906, 1285451, 1331597, 1444814]
16976A444814o3641J25849l45729L67551K21327k92774L28329n9622j42632J18476
16966A701948J13798J3358l31247J414J49277L25892r9264n1267k72424K93603
16956A845088j50538J6205J41130J78868j18184l1582k47003K06041P8574L1682
16946A950281J09819j13767k476j24731j4737P2843J64203J23637M661j54625
16936B015108K24741k31238L48048J48481k12732j08799K31855k93336k8869N0827
16926B144086K19380j75129O1199J66180M0462k84923K78526L04265M3448l47635
16916B449859l6473J67526r2397R8396L22062k13449k8089K78610J40586j77093
16906B909538l9654r6028J53660j31266K63844J07168m33945J88459K01537J85256
$$ y = [1444814, 1381173, 1507022, 1161293, 1528844, 1750171, 1457397, 1785726, 1726104, 1583472, 1701948, 1815746, 1829104, 1497857, 1499271, 1648548, 1974440, 1875176, 1823909, 1551485, 1845088, 1694550, 1710755, 1851885, 2030753, 1912569, 1880987, 1633984, 1840025, 1918599, 1950281, 2060100, 1946333, 1943857, 1819126, 1804389, 1877232, 2041435, 2165072, 2169733, 2015108, 2239849, 2008611, 2356659, 2505140, 2292408, 2183609, 2415464, 2122128, 2093259, 2144086, 2363466, 2188337, 2249536, 2415716, 2456178, 2171255, 2449781, 2754046, 2797494, 2449859, 2413386, 2580912, 2488515, 2586911, 2908973, 2695524, 2667435, 2946045, 3086631, 2909538, 2869884, 2773856, 2927516, 2796250, 3060094, 3167262, 2733317, 2921776, 3123313, 3308569]
16896C308569k09435J9939K17369j59066J57190N6647j46948J60707j03443J12516
16886C414045L54138k67547M01304j07824M01880l15820m1196J07439k1418j40750
16876C784251N12748l90454O10518m19597K06109M71509r0760l36665J4800J01544
16866D464003Q3789N1223j28769K44500o4162L18772l0121M0929J88123J67041
16856E335328R6543K4716K2854L06818l30368J68458J46627J53863K38489l536
16846F159792L402J02470J61809J639J64111k1594K38214R1752J3600J2241L11203
16835G238639Q0628p8185M42808j48968K70624R5358J90951r4542K62717K80845
16825H540875J62676M9730j02026N28087K50293p6919K38795K98830L63604m7785
$$ y = [3308569, 3099134, 3119073, 3336442, 3177376, 3334566, 3391213, 3244265, 3404972, 3301529, 3414045, 3768183, 3500636, 3901940, 3794116, 4195996, 3880176, 3838980, 3946419, 3925001, 3784251, 4296999, 3906545, 4517063, 4097466, 4303575, 4775084, 4684324, 4347659, 4362459, 4464003, 4547792, 4599015, 4470246, 4714746, 4650584, 4969356, 4939235, 4980164, 5168287, 5335328, 5431871, 5456587, 5479441, 5786259, 5455891, 5624349, 5770976, 5924839, 6163328, 6159792, 6163194, 6265664, 6427473, 6429112, 6593223, 6571629, 6809843, 6901595, 6915195, 6927436, 7238639, 7319267, 7241082, 7683890, 7534922, 7805546, 7900904, 8091855, 7997313, 8260030, 8540875, 8703551, 8753281, 8651255, 9179342, 9429635, 9352716, 9591511, 9890341, 10253945, 10206160]
16815A0206160L35877J98108q4843N90740m1342L03834M16833J17572J0403N95863
16805A2649205J40782L65921P111P19768j03540N60810P4366P32890Q9235J68934
16795A5405482L82466J70788P81372M00772R6755Q37959M17904N39987M86777
16786A9520262N33464L04932N01024M66746O48115Q28693M55015P41273M14263
16777B4413787P51073P81518Q16403P53299O25045Q30510R43296J000798O24652
16768C1540381J564634N16738J297413J025683J224451R81761J157455J444643
16760D0753159J392497J098763J150760J777421J442608J665668J691713J833424
16752E2806013J667756J461904J737287J985670J830623K244299K093309J692412
$$ y = [10206160, 10542037, 10740145, 10655302, 11246042, 11204700, 11508534, 11925367, 12042939, 12053342, 12649205, 12789987, 13155908, 13163019, 13882787, 13779247, 14340057, 14414423, 15147313, 15236548, 15405482, 15787948, 15958736, 16740108, 17140880, 17237635, 18075594, 18493498, 19033485, 19520262, 20053726, 20358658, 20859682, 21326428, 21974543, 22803236, 23258251, 23999524, 24413787, 25164860, 25946378, 26762781, 27516080, 28141125, 28971635, 29914931, 30915729, 31540381, 33105015, 33621753, 34919166, 35944849, 37169300, 38151061, 39308516, 40753159, 42145656, 43244419, 44395179, 46172600, 47615208, 49280876, 50972589, 52806013, 54473769, 55935673, 57672960, 59658630, 61489253, 63733552, 65826861, 67519273]
16744F7519273K266200K116058K254414K338671J518406K375515K294807K054505
16736H4737849J470602K107985K298090J889264J470159K027466R21249J567474
16728I8490138J062286Q59765N31343N64877O38375M6818j09700k52574o88377
16719A01142951o28132q72151j027409j182926k038284j412109j444607j951174
16711I0586159j461627k278952k412196j861065j979206k042143k448270k055156
16703G4047544k029431k277884k011684k044842j915514k560251j574348j683570
16695E7950020k397161j340397j893159j696142j608695j662233j507198j653539
16687D4191496j013898j529224j392737j383943r42054j605098m11908j651700
$$ y = [67519273, 69785473, 71901531, 74155945, 76494616, 78013022, 80388537, 82683344, 84737849, 86208451, 88316436, 90614526, 92503790, 93973949, 96001415, 96922664, 98490138, 99552424, 100412189, 100943532, 101508409, 102146784, 102193602, 102083902, 101831328, 101142951, 100514819, 99642668, 98615259, 97432333, 95394049, 93981940, 92537333, 90586159, 89124532, 86845580, 84433384, 82572319, 80593113, 78550970, 76102700, 74047544, 72018113, 69740229, 67728545, 65683703, 63768189, 61207938, 59633590, 57950020, 55552859, 54212462, 52319303, 50623161, 49014466, 47352233, 45845035, 44191496, 43177598, 41648374, 40255637, 38871694, 37929640, 36324542, 35912634, 34260934]
16679C4260934j020160j055390o72569r46957j159573p94891p97069o98409j017447
16670B6098469n89996o85086r70991k00110r73085p04083o41374l23387n03542
16661B0506815p03284l95226l37092m67995p89604j00456o01068k70879n68805
16652A6272406m54423l85730l64204j38463n53000k28823n42909J4350k10025
16643A3409179o20257m00239K73099m21304m65852m2267o24580j34075p8018q2727
16633A0812959k67131n14469L79191m14416l4896m72471m62513K38399m30815
16624H833838l1253k16493o8042m42813K23496n73931L39608k50669L8921l19852
16614G532810l44101m5511p6706j89557K06119j98514m68550K62974m91678K66653
$$ y = [34260934, 33240774, 32185384, 31512815, 30565858, 29406285, 28611394, 27814325, 27115916, 26098469, 25508473, 24823387, 23852396, 23652286, 22679201, 21975118, 21333744, 21010357, 20506815, 19803531, 19408305, 19071213, 18603218, 17813614, 17713158, 17112090, 16841211, 16272406, 15817983, 15432253, 15068049, 14929586, 14376586, 14147763, 13604854, 13619204, 13409179, 12788922, 12388683, 12661782, 12240478, 11774626, 11732359, 11107779, 10973704, 10895686, 10812959, 10545828, 10031359, 10410550, 9996134, 9961238, 9488767, 9026254, 9264653, 8833838, 8802585, 8586092, 8518050, 8075237, 8298733, 7724802, 8064410, 7813741, 7852662, 7532810, 7188709, 7143198, 7066492, 6876935, 7083054, 6884540, 6415990, 6678964, 6187286, 6453939]
16604F453939l26574R0804j61141j52293n8536k5669j85398J52365m13083L1965
16594E406379Q8770o43329L91843n4506m68099R8706K62476m12987q61j51353
16584D517039p0419L79771n17292L28472m7465m98449L46441l09964m4131j6763
16574D067240l1642p8883m7524n19194P46943l98214O5050n7533l49074m7972
16564C349197K72706Q0037r3675j38002K68981k37414l23866K1981m9447R2256
16554C242754j47592L3258O992J9271k43647m05378O61664q0541k08857J40930
16544C018854m48534M20685k81864L05909j38899n7778J7634j76789K46863k20545
16534B685536j45414l16828N1232q4700K91610k73086K27186k59715J44497j16357
$$ y = [6453939, 6127365, 6218169, 6057028, 5904735, 5846199, 5820530, 5635132, 5787497, 5374414, 5406379, 5495149, 4851820, 5243663, 5189157, 4721058, 4819764, 5082240, 4669253, 4668392, 4517039, 4446620, 4826391, 4309099, 4637571, 4590106, 4091657, 4438098, 4128134, 4084003, 4067240, 4035598, 3956715, 3909191, 3389997, 4136940, 3738726, 3803776, 3746243, 3397169, 3349197, 3621903, 3701940, 3608265, 3470263, 3739244, 3501830, 3177964, 3199945, 3150498, 3242754, 3095162, 3128420, 3135412, 3154683, 2911036, 2505658, 3167322, 3086781, 2877924, 3018854, 2570320, 2991005, 2709141, 3015050, 2876151, 2818373, 2836007, 2659218, 2906081, 2685536, 2540122, 2223294, 2274526, 2189826, 2481436, 2208350, 2435536, 2175821, 2320318, 2203961]
16524B203961m498J67598m1197q2801l03785K96978K3659m45004M49633k19691
16514B044853q1593j664N1346J96168r4471j51186M6992j10939o2343q0209L88896
16503B145850j1608l04231n2350j18371L018L59988M6626k68208k6237k10265
16493A564212J4374R0835r4674m699J09217o7535Q1494K14827K19836m49741k62874
16482A415272L24573k57048k2251J20955l50683K40568p617R4165l3309J50192
16472A674817j59034l36419J99017k61560L09801j16261j56280j13092M32664
16463A473653k35226k40762L51625j49013K81383l06010K76375l19216Q2718N3058
16453A268585Q305N6160J57668k03919m4688O6992K4930P4832k95737j40932L39025
$$ y = [2203961, 2199463, 2367061, 2325864, 2243063, 1939278, 2236256, 2259915, 1814911, 2264544, 2044853, 1963260, 1961596, 2012942, 2209110, 2114639, 1963453, 2010445, 1899506, 1837163, 1756954, 2145850, 2134242, 1830011, 1777661, 1659290, 1662308, 2022296, 2068922, 1800714, 1774477, 1564212, 1578586, 1669421, 1574747, 1570048, 1679265, 1611730, 1693224, 1908051, 2127887, 1678146, 1415272, 1739845, 1482797, 1460546, 1581501, 1230818, 1471386, 1463769, 1557934, 1524625, 1674817, 1515783, 1179364, 1378381, 1116821, 1426622, 1310361, 1154081, 1040989, 1473653, 1238427, 997665, 1349290, 1200277, 1481660, 1175650, 1452025, 1132809, 1215527, 1268585, 1276890, 1333050, 1490718, 1286799, 1242111, 1309103, 1334033, 1408865, 1113128, 972196, 1311221]
16442A311221J26102r2253k19489P3822J14806j27374k5398n9625q6511J39515
16432A154816j13423o2280J19842N1129p5647j37753K51771l78321k3178O8948
16422H55904L22888j74254K57524n08784K99213L08413F68539n1547L16172k7003
16412I06161o6273J95942n7354k23855J06891K27138k30898q8135J50463q2883
16402H37197J73763m66069J79568K78125j53157r7507K88305j07007j94641j11665
16392F26912K52148L636l57802K15641j08848M43842n27984k71523Q58150j73689
16382I60483k09609j16019P2617n7283J48021O9825j05678C53979K505P19305
16372A075789E21756N73598m30965P0629k24160K96067C74947K96310j61694K87269
$$ y = [1311221, 1437323, 1345070, 1125581, 1199403, 1314209, 1186835, 1161437, 1101812, 1015301, 1154816, 1041393, 979113, 1098955, 1150084, 1074437, 936684, 1188455, 810134, 786956, 855904, 1178792, 1004538, 1262062, 753278, 1052491, 1360904, 668539, 616992, 933164, 906161, 839888, 1035830, 978476, 754621, 861512, 1088650, 857752, 769617, 920080, 837197, 1010960, 544891, 724459, 1002584, 849427, 751920, 1040225, 933218, 738577, 626912, 879060, 882696, 524894, 740535, 631687, 1075529, 547545, 276022, 1134172, 960483, 750874, 634855, 707472, 650189, 798210, 868035, 762357, 353979, 356484, 1075789, 521756, 1095354, 664389, 735018, 510858, 806925, 374947, 671257, 509563, 796832]
16362G96832k62836k57906N27608l69189M23150k47151q570M44395m3401j79993
16352H22939k71133p9373J58094J70359l30810L71732D07786J75117j70548K67268
16342F79623k78207l250j0302M32862A90516N11716k18883M00796k73422k24869
16332C85854J33541L85139m46845L13232j83533P9842Q9739C72365Q2984l8216
16322D17133j21502M07311l50017D1202N02436l8388M9855j40266L5595R0225
16312E40659Q2197j30824o5411J06477A70498L99510N6087C8063N47116I3329
16301B59158J26733m1924K9020q8257J09854M03208k72757j32332A34038L46874
16291D80912J92025q3080k55920M31637k92166o3283J61298G7854K45191j18412
$$ y = [796832, 533996, 276090, 803698, 434509, 857659, 610508, 601938, 1046333, 1002932, 822939, 551806, 472433, 630527, 800886, 470076, 841808, 407786, 582903, 412355, 679623, 401416, 398166, 387864, 820726, 190516, 702232, 483349, 884145, 610723, 385854, 519395, 904534, 457689, 770921, 587388, 667230, 756969, 372365, 455349, 417133, 295631, 702942, 352925, 41202, 543638, 505250, 555105, 414839, 450434, 540659, 622856, 492032, 426621, 533098, 170498, 570008, 626095, 38063, 585179, 93329, 259158, 385891, 343967, 372987, 284730, 394584, 797792, 525035, 392703, 134038, 480912, 672937, 589857, 333937, 765574, 473408, 410125, 571423, 77854, 323045, 204633]
16281B04633K19246q2965J22096j89942K56547J04925n0214B06095O7980K25230
16271D99305A66684K65102o5521Q7269j62356K64391j24155j31887o1192J4367
16261B52702A06430Q6153K27682k00342m5462K81861Q4295K47721l22382j60937
16251C05019d0347A69253P0616J9217M21648j79191A34108K21051M34696I8547
16240A59972J56881L3769L5680J24400n9875m06j96151K37418j99735j29657J85825
16229C48121j26678Q7443A8833L94701A76092K56106A33253L00924G8689L37937
16219D16626j4504o9572J02087r8249r8869K07869j95263K34075A71121J77667
16209C48788J0063M1161a60297D86785n4918A43774P4327K50611J220j66807j22930
$$ y = [204633, 423879, 340914, 463010, 273068, 529615, 634540, 584326, 206095, 274075, 499305, 166684, 431786, 366265, 453534, 291178, 555569, 431414, 299527, 238335, 252702, 106430, 192583, 420265, 219923, 174461, 456322, 540617, 788338, 465956, 305019, -40347, 169253, 239869, 259086, 680734, 501543, 134108, 355159, 789855, 98547, 159972, 316853, 350622, 386302, 510702, 450827, 450421, 254270, 491688, 291953, 162296, 348121, 221443, 308886, 18833, 413534, 176092, 432198, 133253, 434177, 78689, 416626, 402122, 332550, 434637, 336388, 237519, 445388, 250125, 484200, 171121, 348788, 358851, 400012, -160297, 486785, 431867, 143774, 218101, 468712, 469932, 303125, 180195]
16198A80195L1347J94698j23935m012o6655p6146J47535J18872N7402j61381O7748
16187C65668A29854K89638o8041N1624b31147A36246K51991j21946G7554L49401
16177D26955j11375K87493k52351o1648d9406j6816B61890b0327C53985A69742
16166c00695B21257a71245I0448M65685A17904K0877C0449K55164r2216M56451
16156F49848B07866A6343K87497I3708J3520m6136J13371J72565K20309B16438
16145E18867A50300M07106A36097K77860C4488J44483l2252K52863G7629K20417
16135B98046c8839A94166j4197J11075m3253K740B2370M82911A62534M9664Q064
16124B20262C0068p588K64364e7264J6841C17063c944j65705B76673A31828b23495
$$ y = [180195, 211542, 406240, 282305, 278293, 211638, 135492, 283027, 401899, 459301, 297920, 365668, 129854, 419492, 351451, 403075, -231147, 136246, 388237, 266291, 77554, 426955, 315580, 603073, 350722, 289074, -49406, -66222, 261890, -20327, 353985, 169742, -300695, 221257, -171245, 90448, 556133, 117904, 138781, 30449, 285613, 193397, 649848, 207866, 16343, 303840, 93708, 107228, 61092, 174463, 347028, 567337, 216438, 518867, 150300, 557406, 136097, 413957, 34488, 178971, 146719, 399582, 77629, 298046, -38839, 194166, 179969, 291044, 247791, 250531, 22370, 505281, 162534, 212198, 220262, 30068, 22480, 286844, -57264, -40423, 317063, -3944, -169649, 276673, 131828, -223495]
16112A45710J14310O3254N3858A76646K45102p4898j16845O6239a26780A35440
16101H6817a04264G1082b2434j9394I488g9546j1711C952K05842m5817E9534J17217
16089A76751D8207j5984Q9064O0500b38587A25002J56061a06722A32977O6670
16079A99647a47349c5786C01360q3174b63411L2709B8388j1717K20815j11170
16069A26316K07072g2726k37247B4522L79286h1070A5798i342A73146l7027a8446
16057D46357A6459M04145b26038A81035L1579b05668e0733j9620B705J3430N28162
16046E44297A39303L0003n5329J29958p4136J61273a41441H1943K02582a9377
16035h8199B12697a80619A03068a220D28709d6733I7440g7456e210B04658B5327
$$ y = [145710, 260020, 323274, 377132, 176646, 421748, 346850, 230005, 296244, -126780, 135440, 86817, -104264, 71082, -22434, -41828, 9488, -79546, -91257, 3952, 209794, 163977, 59534, 176751, 48207, 32223, 121287, 181787, -238587, 125002, 281063, -106722, 132977, 199647, -147349, -35786, 301360, 218186, -263411, -230702, 28388, 16671, 237486, 126316, 333388, -72726, -309973, 24522, 403808, -81070, 15798, -9342, 173146, 136119, -18446, 446357, 16459, 420604, -226038, 181035, 212614, -205668, -50733, -70353, 2705, 16135, 544297, 139303, 169306, 113977, 243935, 169799, 331072, -141441, 81943, 284525, -19377, -88199, 212697, -180619, 103068, -1220, 428709, -46733, 97440, -77456, -5210, 204658, 25327]
16023B48467i861I5189D6445h3264C36742m737D3736A5742J48351a29530j17839
16012b47369A11620c45725b3844B58437i9882F3882K1198D206J79708F0645O2887
16001A23532i4306I2145O2983a60457B64630r2526b43064C60613a51057A74034
15990h106C08433J64416N4603J99389M95441J2552M6484K32740n65588D28796
15979A93192Q365N4176l0995R9422A28987a67087C06920a9514B50232H0627d3491
15967b34417A08545a59340A82332L9896a63607C41076r2321f8401k84153B48588
15956H1646N1788r167K03404A01751d7820A22946E7193e9156p6702J4325A23249
15944i6204C24489b02208j57653A7405b16963A76071D8800c7222B75422b52581
$$ y = [248467, -9861, 95189, 46445, -83264, 336742, 332005, 43736, 15742, 164093, -129530, -247369, 111620, -345725, -23844, 258437, -99882, 63882, 85080, 4206, 183914, 60645, 123532, -94306, 92145, 155128, -160457, 264630, 172104, -243064, 360613, -151057, 174034, -8106, 308433, 472849, 527452, 726841, 1222282, 1234834, 1281318, 1514058, 948470, 428796, 193192, 201557, 255733, 224738, 324160, 128987, -167087, 306920, -19514, 250232, 80627, -43491, -234417, 108545, -159340, 182332, 222228, -163607, 341076, 248755, -68401, -352554, 248588, 81646, 133434, 124267, 327671, 101751, -47820, 122946, 57193, -59156, -135858, -121533, 123249, -96204, 324489, -202208, -359861, 17405, -216963, 176071, 48800, -37222, 275422, -252581]
15933A95152r3495D1969L07587j57507H8017h9308B63066a59990B48167e4149
15922A65580m8334E4994b71663a6465k8786A42011n0688g4203C173b35510R9179
15911a36331A90654b41636d9157m2677o681c8237A89761l2317b1160A69560C5647
15899A4165J8876d035A90849b53186C0632e9803r7716A22901a1945m303A25238
15887i0720j92108a7703G5773c1177C28535N349a57123I4525d8780C3564K951
15876C6515R4186K30563G5276E449J2558F974M0803h2817C9504A9233Q8059D5042
15863e1838D07400i992k6797G1342m039e159k96023E032J87018d5777r3235A52969
15850A06020j4199b04664J2960k0837d7558G4396N781a19142A15150c6991A22384
$$ y = [195152, 101657, 41969, 349556, 192049, 88017, -89308, 263066, -159990, 248167, -54149, 165580, 117246, 54994, -271663, -16465, -45251, 142011, 91323, -74203, 3173, -235510, -136331, 190654, -241636, -49157, -91834, -98515, -38237, 189761, 157444, -21160, 169560, 35647, 14165, 33041, -4035, 190849, -253186, 30632, -59803, -157519, 122901, -11945, -16248, 125238, -90720, -282828, -17703, 75773, -31177, 328535, 333884, -157123, 94525, -48780, 33564, 36515, 130701, 361264, 75276, 5449, 18007, 6974, 47777, -82817, 39504, 19233, 107292, 45042, -51838, 407400, -9992, -36789, 71342, 67303, -5159, -301182, 5032, 192050, -45777, -139012, 152969, 106020, 91821, -204664, -191704, -212541, -47558, 74396, 80177, -119142, 115150, -36991, 122384]
15838a09542j75245E0922b16886G5689b0112j15343N8188F3314J03005a0802A60998
15826a99305a7063m7186B46185D7344K88113d33530A95553b11592I8695g0522
15815A58108O424k3697j7176a67255d4574I391b54140C10705B9393a05504j58953
15804b64457h0001B174k30h8293A99019a22231j0895j3437k6312P0823l92474
15793d94526F9207J71085l4233a10769H544g6150K1833D3230J85444a68057L8423
15782a29634n2173o4451B68746i2994K3428E5183J79507A12360c0874D0812a00451
15770g5024C6024h0145a6200F6815L58436k02392b10285l3335J7236A1433J55241
15759A66674c62412a47996B39788B3188g6184A93760G8344c70055a3232A21046
$$ y = [-109542, -284787, 50922, -216886, 75689, -20112, -135455, -77267, 63314, 166319, -10802, 160998, -199305, -17063, -64249, 246185, 47344, 335457, -433530, 195553, -211592, 98695, -70522, 158108, 164532, 140835, 123659, -167255, -44574, 9391, -254140, 310705, 29393, -105504, -264457, -80001, 2174, 1944, -88293, 199019, -122231, -133126, -146563, -172875, -102052, -494526, 69207, 240292, 206059, -110769, 8544, -76150, -54317, 43230, 228674, -168057, -129634, -181807, -246258, 268746, -92994, -69566, 55183, 234690, 112360, -30874, 40812, -100451, -75024, 36024, -80145, -16200, 66815, 425251, 222859, -210285, -243620, -226384, 11433, 166674, -362412, -147996, 239788, 23188, -76184, 193760, 78344, -370055, -13232, 121046]
15748F7154e787A93779J25874a79225j86833D8500R4753n0712l1294a23622c9073
15736e2590A73274I066J28378b4401j83940A99772J28515A30446b8716m97r888
15725c9101I2112a54871A3100a48106c4885A41414n7907l3193a00762J4470A86797
15713i3600E311a41A83964q9685D3662R7687b51037a17238M2443L1185k08850
15702b52460C1485c53907A32975a08563C0547J7632O617a45334B0287a35174B55172
15690b9573C9599a43254B1869b7500H299b96680A34939K06958a79512g8821m2403
15679a21224A721J18781c0067A19990O0477B6479h4715K8849B93808b4076A80115
15667d3970f526m3671q9052F0806j8561d3695j1378k5331H2153f0924A9402R6458
$$ y = [67154, -5787, 193779, 319653, -179225, -366058, 48500, 143253, 92541, 61247, -123622, -39073, -52590, 173274, 9066, 137444, -24401, -208341, 199772, 328287, 130446, -28716, -29213, -39101, 92112, -154871, 13100, -148106, -34885, 141414, 83507, 50314, -100762, -86292, 186797, -93600, 5311, -141, 183964, 94279, 43662, 141349, -251037, -117238, -74795, -43610, -252460, 31485, -353907, 132975, -108563, 30547, 48179, 54796, -145334, 20287, -135174, 255172, -29573, 39599, -143254, 21869, -27500, 8299, -296680, 134939, 341897, -179512, -78821, -121224, 1721, 120502, -30067, 119990, 180467, 26479, -84715, -55866, 293808, -24076, 180115, -43970, -6526, -50197, -139249, 60806, 42245, -43695, -55073, -80404, 82153, -60924, 19402, 115860]
15655A15860B2711J46607h5066C867a11860k63817B0574M0363L7356m1701K75033
15644C31625b65131A88125a73069D06608a66732A46653a73557o0384g7955A9773
15633a03567l11656B04377f9905H1897a17581o3928O1846E7303b60688J26796
15623a33892B27777C6972g6729q4190A55972n7576d8891B33853b14149A6489a34633
15611G7929g5721l36518J61819A02089k4054R3439a31477d2460o0961j370p6088
15600a80879o9102h4540B4597a15445B78308I8443m5021a2715q2578l4586C0917
15588A83084E9993K26516b59103A81147F6355K24166i1981k2319B6620J514a6230
15576a78540A31008c4830k1611A1107b47348E8996A498J50487F160N8421a84537
$$ y = [115860, 22711, 169318, -85066, 3867, -111860, -375677, 20574, 60937, 98293, 56592, 331625, -265131, 188125, -173069, 406608, -166732, 146653, -173557, -233941, -77955, 19773, -103567, -415223, 204377, -69905, 81897, -117581, -181509, -119663, 57303, -260688, -133892, 227777, 36972, -76729, -160919, 155972, 98396, -48891, 233853, -214149, 16489, -134633, 77929, -75721, -412239, -250420, 102089, 78035, 171474, -131477, -42460, -103421, -104791, -180879, -249981, -84540, 24597, -115445, 278308, 98443, 53422, -12715, -95293, -129879, 30917, 183084, 59993, 286509, -259103, 181147, 66355, 290521, -91981, -114300, 26620, 28134, -16230, -178540, 131008, -34830, -56441, 11107, -247348, 58996, 1498, 151985, 6160, 64581, -184537]
15564i6700o9735m4937Q6677d232m9188j59030b6939l17785J65113B08439b80334
15552b46613p1820C7504b9587k52771A11462b90085A5495J70874N799J23635J30833
15541D46636b35825H0562J97436a94706H0036a59215G9592i3638P084c6249q6749
15530a22998N2945A5149O0526J4222a49988F5247J48147f0889o4443k5632f3083
15518B33994o4606d0328A28681E1725K89472n3338b61973A82108m2420K54597
15508C94285j2593C8380J34609a07621D79172A80309A624L09442A43618A502M0161
15497D1663N7618J78117j24877l6553K39907c0713B67664a04056F9333J72542
15487B41875n4252b9327j69024R98A25847J04898a92004e6868B57108A5660K90684
$$ y = [-96700, -166435, -211372, -124695, -4232, -53420, -212450, -26939, -344724, -179611, 208439, -280334, -246613, -318433, 37504, -29587, -282358, 111462, -290085, 15495, 186369, 192168, 315803, 446636, -235825, 80562, 277998, -194706, 80036, -159215, 79592, -93638, -86554, -36249, -122998, -70053, 15149, 75675, 89897, -149988, 65247, 213394, -60889, -125332, -150964, -63083, 233994, 169388, -40328, 128681, 51725, 341197, 287859, -261973, 182108, 139688, 394285, 381692, 38380, 172989, -107621, 479172, 180309, 1624, 311066, 143618, 1502, 41663, 99281, 277398, 152521, 115968, 355875, -30713, 267664, -104056, 69333, 241875, 187623, -29327, -198351, -197353, 125847, 230745, -192004, -56868, 257108, 15660, 306344]
15476C06344m1971J07044M66483D05294N1128j66548C2291J54910M8359B2055
15465A44582c29734i1676A1557b91722F9364N9855a07111i155j63074m3452D0557
15453C8758J11608m3423J70801m3891b245B03675R5192I1230L11952L2483J54587
15442E90252L56843M92305m26362l48383k05372j66977a20197C88914a1210j02832
15432a14042B03068o3089h8375j9485j70693B88476j33111f1627A13606f5526
15421d0322k32306C54798J0362f5768B18354a97559C53578C9670L556i7088c4795
15409D5437K64189F7671b95389e0928j0699C17650D5797K1902a70855H3875g7848
15397a01708L7160c227D5242P3083G946l719K3381a52396C4096K3762j5974L9338
$$ y = [306344, 264373, 371417, 837900, 405294, 456422, 289874, 32291, 187201, 235560, 22055, 144582, -329734, -91676, 11557, -291722, 69364, 129219, -107111, -9155, -172229, -215681, 40557, 38758, 150366, 106943, 277744, 233853, -2245, 203675, 298867, 91230, 403182, 435665, 590252, 947095, 1439400, 1013038, 664655, 459283, 292306, -120197, 388914, -11210, -114042, 203068, 139979, -88375, -107860, -278553, 288476, 155365, -61627, 113606, -65526, -40322, -272628, 354798, 365160, -65768, 218354, -197559, 353578, 39670, 43226, -97088, -34795, 45437, 309626, 67671, -295389, -50928, -61627, 317650, 45797, 67699, -170855, 83875, -77848, -101708, -64548, -3227, 45242, 118325, 7946, 4227, 27608, -152396, 34096, 57858, 41884, 81222]
15385H1222L35491F05J4612O667d5159j07082A97566R7852H3339N39481B41810
15373D26484a81141K6108B3267K91667A13069Q4537K2809r613G4163b24401H7041
15361C68701A42926A2147P7363K88087F2545J45263J94130a48655A06147a39329
15350C08995j08909J98955b8284E4896R6147M0817k2900M85500j72549J59276
15340F41187B34744m0579J17527C3987J86919c2291l8944B61893a8056A48622
15329B51542Q909J61632C1133Q5870Q8677l2305n5405O5484n0993b34162I2316
15317C93646I5221L8612l2939a50931G687J64386K2288q3354J44898O8111D1630
15305B77704a43164A31495f0283j98751J13882B32616J09268g9672A20610J63289
$$ y = [81222, 416713, 605, 15217, 21884, -45159, -152241, 197566, 295418, 83339, 622820, 241810, 426484, -181141, -155033, 23267, 314934, 113069, 197606, 220415, 210802, 74163, -224401, 87041, 368701, 142926, 12147, 89510, 377597, 62545, 207808, 401938, -148655, 106147, -139329, 308995, 200086, 399041, -28284, 54896, 151043, 191860, 168960, 654460, 481911, 641187, 234744, 194165, 311692, 33987, 220906, -32291, -71235, 261893, -18056, 148622, 251542, 260451, 422083, 31133, 117003, 205680, 173375, 117970, 183454, 132461, -234162, 92316, 393646, 95221, 133833, 100894, -150931, 7687, 172073, 194361, 111007, 255905, 324016, 41630, 277704, -143164, 131495, -60283, -259034, -145152, 232616, 341884, -79672, 120610, 283899]
15295B83899C8653L17904j36044L8460D3867M34071A08229f3925D984J77693O5269
15284B47946A18874h6039C7721L7879P3773b16328i6194M7164A0487K4377a37951
15272A31113a60873A83310H6565B7683a04737K9387o8559M6249B54198i2235j5701
15261a07936m544B51026e3177k6563l12652A28840a34802L4604A1137d950G0073
15249h6730B22805b08162L5804A46695m4859K01264J68851J071223j98163J39274
15239A484285O98938A020263C97267j15631j31798a58184D08003j64629q435a79046
15228C01937A15954A8367K06710f4476I4196A408g7386C72205a45285F3376L3367
15217I6743a03357A64038a45479A31918m6753c0302C03809a72404a9575H9670
$$ y = [283899, 38653, 356557, 220513, 258973, 43867, 477938, 108229, -63925, 4984, 182677, 247946, 118874, -86039, 37721, 75600, 149373, -216328, -96194, -49030, 10487, 34864, -137951, 131113, -160873, 183310, 86565, 27683, -104737, -75350, -143909, -97660, 254198, -92235, -107936, -112480, 251026, -53177, -79740, -392392, 128840, -134802, -100198, 11137, -4950, 70073, -86730, 222805, -208162, -172358, 146695, 101836, 303100, 471951, 1543174, 1345011, 1484285, 2183223, 1020263, 397267, 281636, 149838, -158184, 408003, 243374, 234939, -179046, 301937, 115954, 18367, 225077, -64476, 94196, 1408, -77386, 372205, -145285, 63376, 96743, -103357, 164038, -145479, 131918, 85165, -30302, 303809, -172404, -19575, 89670]
15206B72597M2723q4145j08996J40476p9057H6644J9342A2830a1384k52133A87450
15194A69792a63400b7785A50496h6228c9219B3323J01654l3229J93324F5364J55184
15183B20548k8720a59518G7816N269a69921O7349C11817h855B85466J26773F7221
15171h2536E3104J81854F2982b35530d8359j60275e6587F9608b13238B6630K3763
15160E0393N1948M41906A43128a31560N8563B83370j30636J03698F7403O3687
15150A31090e5862A45209a01162A63239k515g625A48960e7655n1493E0243a13608
15138B8304K87523A47723a09344A44128M7322j6013Q5204A8639c602D6861M66005
15127E12866A50031J63915h204C51517A74086M0610q8970J49004J45678J53818
$$ y = [272597, 315320, 231175, 122179, 262655, 183598, 86644, 105986, 12830, -11384, -263517, 187450, 169792, -163400, -27785, 150496, -86228, -39219, 23323, 124977, 91748, 285072, 65364, 220548, 191828, -159518, 77816, 83085, -169921, -102572, 311817, -8855, 285466, 412239, 67221, -82536, 53104, 234958, 62982, -235530, -48359, -208634, -56587, 69608, -213238, 26630, 50393, 102341, 544247, 143128, -131560, -72997, 283370, 152734, 256432, 67403, 131090, -55862, 145209, -101162, 163239, 160724, -7625, 148960, -57655, -109148, 50243, -113608, 28304, 315827, 147723, -109344, 144128, 191450, 175437, 260641, 18639, -3602, 46861, 512866, 150031, 313946, -8204, 351517, 174086, 214696, 125726, 274730, 420408, 574226]
15117E74226a7820B30039I8748M1j794a84075C5880J84967o6638g6284C4281R6274
15105A30555A0822J47440a4707C4047b79885B29217c5705A74074b13358G4418
15094H8309J14753e214B40P2613M03J52744I5476M5841k6254P5729q9740N208
15082A06260M5804Q338o7087J14353a32267B29785p6420c9160A70409Q3946r8704
15071A55651L65292k37815B8915c4582C13330k3641D7337a13816A83854P9600
15061B63454C0372L50238j40576K8028b8525D28343K01724A43782L23030K6487
15051D93299j56414A24500L23936G1889M47517L02328B97890j42233J79364J14324
15041D49345J4026n3568j2023p48k021L9126J44312B70730A3258M95608L54231
$$ y = [574226, -17820, 230039, 98748, 98789, 96995, -184075, 35880, 220847, 154209, -76284, 34281, 130555, 10822, 158262, -14707, 34047, -279885, 229217, -35705, 174074, -213358, 74418, 88309, 203062, -5214, 240, 72853, 73256, 226000, 95476, 141317, 115063, 190792, 101052, 106260, 152064, 160402, 93315, 207668, -132267, 229785, 153365, -39160, 170409, 254355, 155651, 520943, 283128, 28915, -34582, 313330, 289689, 47337, -113816, 183854, 263454, 30372, 380610, 240034, 268062, -28525, 428343, 630067, 143782, 466812, 493299, 336885, 124500, 448436, 71889, 519406, 821734, 297890, 155657, 335021, 449345, 463371, 409803, 397780, 397032, 395011, 434137, 578449, 270730, 13258, 508866, 863097]
15030H63097l90705K83774Q4135k00553M2163k67390K4164j24702q4953K55258
15020D84288R6121J46384l42427J66228q0204j77000l5015l7471K11211P7638
15010E09753j53520O2165J69317A36623L06179J91435l11110m8759L4408p3035
15000B35741J03603L07617n5473j98424L7247J51235r5259k0082R5023B29338
14989E04840J76081J06301B16042O6945N0237K62523L0105J56099j93849J92607
14979G80709o4725j03762L04335l28144p3398m6387R0938P8977k43211n45L20696
14968G15483B73710K8945l4071b4033B65664k5416r4474J94842o4408J32649N1167
14957D60024j83634M9036j02882c9745F36277p0688N8755A30557n4380K58046
$$ y = [863097, 472392, 756166, 840301, 639748, 681911, 414521, 438685, 313983, 229030, 484288, 580409, 726793, 384366, 550594, 470390, 293390, 258375, 220904, 432115, 509753, 356233, 418398, 587715, 136623, 442802, 634237, 323127, 274368, 308776, 235741, 339344, 646961, 591488, 393064, 430311, 581546, 486287, 466205, 561228, 229338, 504840, 680921, 787222, 216042, 282987, 333224, 595747, 625852, 781951, 588102, 780709, 715984, 612222, 916557, 588413, 515015, 468628, 559566, 638543, 395332, 394787, 715483, 273710, 302655, 268584, -24033, 265664, 240248, 145774, 340616, 276208, 408857, 460024, 276390, 325426, 222544, -39745, 636277, 565589, 624344, 130557, 76177, 334223]
14947C34223M4686L709l811M67169J87098C48946j15591M69777L7901M408l19244
14936D26197j20297K14221j04845Q598J54665M67084L9203k48677L95992L45662
14926A577803j94934M05942k07682k7832k87050j48330L09106M39837L46520M37138
14916B650518j44714p23437k75260o7648l27931o4025j14361l64973N3853j21615
14906E00407j44200n0865K8799J67921P8866j22071J98624j85566F4809J00394
14896A65203L10487N711B32638L9088J58747R0414J12367k8739L5578j32912L04743
14885H11924j13417K16966M2295L89712k65111l89672J91590J27175j49974l18918
14875E42570B38722J127J0314K61478A44061J15600L90640q438J2645K54352l20551
$$ y = [334223, 378909, 382618, 378807, 845976, 1033074, 348946, 233355, 703132, 741033, 745441, 426197, 305900, 520121, 415276, 423874, 578539, 1045623, 1084826, 836149, 1232141, 1577803, 1382869, 1788811, 1581129, 1553297, 1266247, 1117917, 1427023, 1866860, 2213380, 2650518, 2505804, 1782367, 1507107, 1439459, 1111528, 1047503, 933142, 568169, 622022, 500407, 356207, 305342, 334141, 502062, 580928, 458857, 657481, 471915, 64809, 165203, 475690, 481401, 232638, 271726, 430473, 520887, 633254, 604515, 640093, 507181, 811924, 698507, 915473, 957768, 1347480, 1082369, 692697, 884287, 1011462, 861488, 542570, 238722, 239849, 250163, 511641, 144061, 259661, 650301, 641863, 654508, 908860, 588309]
14864E88309L6862K8269J40127l82154L48410C05726K08607j06940q8717j31069
14854A87607L4084L23592J23956k7743k32430A48384K37381K01021j64929N14356
14844I36213L0303N7681Q5143k148j15172J57554m79137M62974D69349K31762
14834G01111R2704N270B59801K4018K35452J56096B60711K42158k6027A44296
14823F12338J53151k90247J72146k3742N7177J59905j24877J17831k92455K93219
14813H34446j77851J08593B19495O11568k57635M48809j18204J91475N20k90355
14803H05673k35519K25719l56964J85327j49055J58311o8808m5910k6116d1375
14792C66513J31380j80804L22096B87139K81633r1695K65154j97420K64025D04013
$$ y = [588309, 625171, 653440, 793567, 411413, 759823, 305726, 514333, 407393, 318676, 187607, 221691, 545283, 669239, 641496, 409066, 148384, 385765, 586786, 421857, 936213, 966516, 1024197, 1109340, 1107192, 992020, 1149574, 670437, 1133411, 469349, 701111, 793815, 799085, 259801, 283819, 519271, 675367, 260711, 502869, 476842, 144296, 612338, 765489, 475242, 647388, 623646, 680823, 840728, 715851, 833682, 541227, 834446, 656595, 765188, 219495, 831063, 573428, 1022237, 904033, 1095508, 1096028, 805673, 570154, 795873, 438909, 624236, 475181, 633492, 564684, 518774, 492658, -41375, 366513, 497893, 317089, 639185, 287139, 568772, 477077, 742231, 544811, 808836, 404013]
14781F54755M29149D56813L97228J53030J11951J13605j19215D62795J8149N66529
14771A047473m20708R099q1373O0375J08070k71398J13255J59138J37853A97741
14760D64921L39167l52759J2850m3125K48370k96513A28589O81581j56511l3129
14750F20530J20321j35929J49937C34299J03568N41507m13740J59310K71941q5651
14740I11234l38827n2653N51626M2053l12428l5862J14862j16197L28760K21868
14730A314436m23997O98413J38202J19986o7811l39902k90068k62312J69588r8580
14720I57955r1924K63347l83620j58526N16092l12969j50373Q608m8673K72753
14710H72670l7394j12812k8339M08625p7503M2404K24486L1881L51930J43734
$$ y = [654755, 1083904, 456813, 854041, 1007071, 1119022, 1232627, 1113412, 462795, 480944, 1047473, 626765, 635864, 554491, 614866, 722936, 451538, 564793, 723931, 861784, 197741, 464921, 804088, 451329, 464179, 421054, 669424, 372911, 128589, 810170, 653659, 620530, 740851, 604922, 754859, 334299, 437867, 979374, 565634, 724944, 996885, 911234, 572407, 519754, 1071380, 1113433, 801005, 765143, 880005, 763808, 1092568, 1314436, 890439, 1588852, 1727054, 1847040, 1779229, 1439327, 1149259, 886947, 1056535, 957955, 866031, 1129378, 745758, 587232, 1103324, 790355, 639982, 648590, 599917, 872670, 835276, 722464, 694125, 1102750, 1025247, 1067651, 1292137, 1324018, 1675948, 1819682]
14700A819682R6951m74581l4270m16722K96346l59767k75283M86705k08263O5089
14690I95887P1019l78802M20879m03867o2673N76327l82881j6359Q4818J846l3798
14679H72396k79945j37520L31326J47788k54113J33302J9112K14136l77363q0226
14669E88893K30444r7222J16269Q2738j45535j1877q477K87988m04419L78776
14659A017578k15408K51603j28750k8852K4458O06772l18573m8760J78147k56250
14649A081965K79235l27379j61550q5831K37448l4499m2548r649N1910m5645L19408
14638A262865k24516P217K29020k88091j0416N95390l77248j91701L50218K4762
14628A377500m03505J93731l56227L75069J45702k73707M02829m61100K394K5179
$$ y = [1819682, 1916633, 1442052, 1407782, 991060, 1287406, 927639, 652356, 1139061, 930798, 995887, 1066906, 688104, 1108983, 705116, 642443, 1218770, 835889, 819530, 904348, 906194, 872396, 592451, 454931, 786257, 934045, 679932, 813234, 832346, 1046482, 669119, 588893, 819337, 722115, 838384, 921122, 775587, 763710, 755233, 1043221, 638802, 1017578, 802170, 1053773, 925023, 896171, 920629, 1527401, 1208828, 1160068, 1338215, 1081965, 1361200, 1033821, 872271, 786440, 1023888, 989389, 946841, 937192, 989102, 943457, 1262865, 1038349, 1045566, 1274586, 986495, 976079, 1571469, 1194221, 1002520, 1352738, 1377500, 973995, 1167726, 811499, 1186568, 1332270, 1058563, 1461392, 1000292, 1002686, 1027865]
14618A027865K10140j07620L1574J95036n1879l24440K42748l4242K47224K63462
14608A699868l58241O7578J12205j62854j54200p418J38499l29351K67245K04402
14598A477733j08940p5881M40271n41121M67726m30051M05018j39922m9262j681
14588A443890K48818k71050K41832k93904K86498l72489P0355N92943l48364n9876
14578A538653K36041R3565K76862l64350O8455j94191j98069N71265J43895m22706
14568A749420L57167j81350J6544n5447J23400J33918O0735j13114m9380J77651
14558B219544N7573M07070j53246N34181k40489N36375j66591N70062P56746J115473
14548E636698L242165P639801K1923027Q277321A9804245G965050C665160r95648
$$ y = [1027865, 1238005, 1130385, 1161959, 1356995, 1305116, 980676, 1223424, 1189182, 1436406, 1699868, 1341627, 1409205, 1521410, 1358556, 1204356, 1196938, 1335437, 1006086, 1273331, 1477733, 1368793, 1292912, 1733183, 1192062, 1659788, 1229737, 1634755, 1494833, 1445571, 1443890, 1692708, 1421658, 1663490, 1369586, 1656084, 1283595, 1353950, 1946893, 1598529, 1538653, 1774694, 1868259, 2145121, 1780771, 1849226, 1655035, 1456966, 2028231, 2172126, 1749420, 2106587, 1925237, 1941781, 1886334, 2009734, 2143652, 2204387, 2091273, 2041893, 2219544, 2277117, 2684187, 2530941, 3065122, 2824633, 3361008, 3194417, 3764479, 4521225, 5636698, 8878863, 16518664, 38441691, 46719012, 19804245, 7965050, 3665160, 2669512]
14540B669512m17007M00915J027809J487606k453548p88827j72888Q4831R4622
14531A933025k31836J21914k72020K92447R975N563N54470p07462L08176N7586
14521B071838J38455J94056l14976M2060J07631M88205m11488k02802O0858o9153
14511B104684m2107P07655o00439J23839M90435n49662K37101O6852q0912L21841
14501B779287k22107p2350J80019K3327L46873o41587Q01462l78618N38668j88135
14491C166839k17896M2700K06497m23787L34035Q3339J55981o1795k05533J11150
14481C191530J75518k83183L07720L40215k69695P438J69434n00416Q80793o02986
14471C416368K47826j41696L642K17932J63929j12199K17009j21235p6680L15054
$$ y = [2669512, 2252505, 2653420, 3681229, 5168835, 2715287, 1926460, 1753572, 1838403, 1933025, 1701189, 1823103, 1551083, 1843530, 1853505, 1859068, 2413538, 1706076, 2014252, 2071838, 2210293, 2404349, 2089373, 2131433, 2239064, 2727269, 2315781, 2112979, 2173837, 2104684, 2062577, 2770232, 2169793, 2293632, 2784067, 2234405, 2471506, 2538358, 2457446, 2779287, 2557180, 2484830, 2664849, 2688176, 3035049, 2393462, 3194924, 2816306, 3354974, 3166839, 2948943, 2991643, 3198140, 2774353, 3108388, 3191727, 3347708, 3285913, 3080380, 3191530, 3367048, 3083865, 3391585, 3731800, 3462105, 3469543, 3638977, 3138561, 4019354, 3416368, 3664194, 3522498, 3526140, 3744072, 3908001, 3795802, 4012811, 3891576, 3814896, 4129950]
14461D129950k64106L4124O23359j82135L1354j12612L27908l48339M550J26247
14451D370300L10821L7116J67031j31061K46765k8857k50701L59016K4696J79951
14441E285077L8834n226J18392N4364n9178L00425l88933L37894O7350k4781M05770
14430F129988k59973L13332J94350k62989K89026L48976j88850M9372M90961j2065
14420G092128L17204J85969j81775k60690M95123r4451j42062M35791N163J43195
14410G995595j29003K87414O1078L15373K95275L31531K9690k30658O3357J66712
14400I186364J0233K47784J82103L7880q2481K91718K0926O64861q5492M34161
14390A0908057m26795O83922K4721P8631K73939P02572k86580P08350J23023N06110
$$ y = [4129950, 3865844, 3899968, 4523327, 4341192, 4372546, 4259934, 4587842, 4239503, 4244053, 4370300, 4681121, 4718237, 4885268, 4754207, 5000972, 4972115, 4721414, 5080430, 5105126, 5285077, 5323911, 5318685, 5437077, 5491441, 5432263, 5732688, 5343755, 5681649, 5748999, 5724218, 6129988, 5870015, 6183347, 6377697, 6114708, 6403734, 6752710, 6563860, 6613232, 7104193, 7092128, 7409332, 7595301, 7413526, 7152836, 7647959, 7553508, 7411446, 7847237, 7852400, 7995595, 7866592, 8154006, 8215084, 8530457, 8825732, 9157263, 9186953, 8956295, 9019652, 9186364, 9196597, 9444381, 9626484, 9664364, 9581883, 9873601, 9894527, 10559388, 10473896, 10908057, 10481262, 11165184, 11189905, 11268536, 11542475, 12245047, 11958467, 12666817, 12789840, 13295950]
14380A3295950k2784p9116R1498K89147L48902J61280L71186M43540K60530J46102
14370A5306235N39753J73172N88323K21827M47179J65733j24748P40962J46088
14361A8204524L28023Q26239J69786K84713Q12899K30204O49424M46993M89657
14352B2442462P08809L34159O33132O77950O66338O63971K79054R94837O31117
14343B8031829Q27372Q73838N43245P45563Q73445R45850P56634J182566J124570
14334C5904912J007732J517045O85126J044286J434202J186731J565579J539341
14326D5884954J487312J587165J858979J804500J443267K098935J979190K835276
14318F0979578J663082K333565J780409K930806L061898K933785K883998L124433
$$ y = [13295950, 13273166, 13194050, 13285548, 13574695, 13923597, 14084877, 14456063, 14899603, 15160133, 15306235, 15845988, 16019160, 16607483, 16829310, 17276489, 17442222, 17317474, 18058436, 18204524, 18532547, 19358786, 19528572, 19813285, 20626184, 20856388, 21505812, 21952805, 22442462, 23151271, 23485430, 24118562, 24796512, 25462850, 26126821, 26405875, 27400712, 28031829, 28859201, 29733039, 30276284, 31021847, 31895292, 32841142, 33597776, 34780342, 35904912, 36912644, 38429689, 39114815, 40159101, 41593303, 42780034, 44345613, 45884954, 47372266, 48959431, 50818410, 52622910, 54066177, 56165112, 58144302, 60979578, 62642660, 64976225, 66756634, 69687440, 72749338, 75683123, 78567121, 81691554]
14310H1691554L426976L861928L571188M268894M430642M575073N176424N038930
14302A16041609N337367O039208O369537O609125P466780P268245Q189878Q650366
14294A71972115R433774R749365J0235562J1132580J1333906J2303640J3003077
14287B49164019J3533821J4164554J4505153J5400132J5208936J6041214J5593334
14280C53611163J5963537J5613940J4807709J4227320J3169845J1676588R628333
14273D48698435O739007K439542M19402l829780k663717l541186n605188o584282
14265D36072233r490293j1625431j3377895j5189383j5940332j6496132j6236890
14258C37715877j6502920j6045143j5688963j4852434j4449606j3819953j3192698
$$ y = [81691554, 85118530, 88980458, 92551646, 96820540, 101251182, 105826255, 111002679, 116041609, 121378976, 127418184, 133787721, 140396846, 147863626, 155131871, 163321749, 171972115, 181405889, 191155254, 201390816, 212523396, 223857302, 236160942, 249164019, 262697840, 276862394, 291367547, 306767679, 321976615, 338017829, 353611163, 369574700, 385188640, 399996349, 414223669, 427393514, 439070102, 448698435, 455437442, 457876984, 458296386, 454466606, 451802889, 448261703, 442656515, 436072233, 426581940, 414956509, 401578614, 386389231, 370448899, 353952767, 337715877, 321212957, 305167814, 289478851, 274626417, 260176811, 246356858, 233164160]
14251B33164160j2488861j2077135j0814980r028632r383220r723978q478803
14244A61168551p283538q202547o854199o912955o456603n670566n430477m787167
14236A09570499n237573m624005m700295l877654l582146l563849k910035l530786
14228G7544156l510332l003163k523048k463465k738108k166975k007161k555899
14220E6576005j485690j733607k117373j879651j394765j449642j411891j274143
14212D3829243r96618k062413r72686j400491r53632l4314j392141j272278j186109
14203C3558561q74593j063641l07542m29041j107257j001471j067993m80170p31812
14194B6495041l78031n96260p86644q18065n01509q01573k15048n23354o16745
$$ y = [233164160, 220675299, 208598164, 197783184, 188754552, 179371332, 169647354, 161168551, 153885013, 145682466, 138828267, 131915312, 125458709, 119788143, 114357666, 109570499, 104332926, 99708921, 95008626, 91130972, 87548826, 83984977, 81074942, 77544156, 74033824, 71030661, 68507613, 66044148, 63306040, 61139065, 59131904, 56576005, 55090315, 53356708, 51239335, 49359684, 47964919, 46515277, 45103386, 43829243, 42832625, 40770212, 39797526, 38397035, 37443403, 37409089, 36016948, 34744670, 33558561, 32683968, 31620327, 31312785, 30883744, 29776487, 28775016, 27707023, 27226853, 26495041, 26117010, 25520750, 24734106, 23916041, 23414532, 22612959, 22397911, 21874557, 21257812]
14185B1257812l98981l82950n97574k31944m81351l71420l54579j53010j091435
14176A7194568l13427j95624l92067n79070j71228j7187l63488k52620l98971
14167A4510886p4239m05561j27341o59355K55092m90963n46150N70j5176n47236
14157A1900527j62704p3088l12217M4442k54410m08748J28263l25824m38345L48361
14147A0446257l74771j72164k16009K39534l93340j66977k33092k59599J99107
14138I068946j16827p82744O84771l66053n5169j41985o54981M88312n91433N0947
14128G583784J54231m29800L77859l50769r1712J80198l05036l20231P8730n8238
14118F819016n04268O0093P7821L3436N6930k73994K24723o13588j23988L26642
$$ y = [21257812, 20858831, 20475881, 19878307, 19646363, 19165012, 18793592, 18439013, 18286003, 17194568, 16881141, 16685517, 16293450, 15714380, 15543152, 15525965, 15162477, 14909857, 14510886, 14436647, 14031086, 13903745, 13244390, 13499482, 13008519, 12462369, 12462939, 12447763, 11900527, 11737823, 11664735, 11352518, 11396960, 11142550, 10733802, 10862065, 10536241, 10097896, 10446257, 10071486, 9899322, 9683313, 9922847, 9529507, 9362530, 9129438, 8869839, 9068946, 8952119, 8169375, 8854146, 8488093, 8432924, 8290939, 7635958, 8124270, 7532837, 7583784, 7738015, 7308215, 7686074, 7335305, 7243593, 7423791, 7118755, 6798524, 6877254, 6819016, 6314748, 6374841, 6452662, 6486098, 6543028, 6269034, 6493757, 5880169, 5756181, 6082823]
14108F082823l2635k66993Q9778o4363J68929m58027J62716k63139m6882J57672
14098E529879l83821K8006k00445o4858K08773L2381k10002k8964l18894j46806
14088D445249M73864m41892R9307k01385P9435j06594J62800j49637l8321m64338
14078C858488M39684j14868j98960L8328L4002r852l9226J01967q3907k75508
14068C750148J95693m04591N15469n15446j65949M781J06046L45489J82513m62425
14058C551728q5981M35218m24726K99898l76038N8049j59027j55856q2816r2152
14048B968297K90237k57719j85493N728J50992j8804k50709L06887j79911R4708
14038B924213j05347j74695k5160K62363k32062j1902j7089K02058k94610L74586
$$ y = [6082823, 6050188, 5783195, 5872973, 5808610, 5977539, 5519512, 5682228, 5419089, 5372207, 5529879, 5146058, 5174064, 4973619, 4908761, 5117534, 5149915, 4939913, 4910949, 4592055, 4445249, 4919113, 4477221, 4576528, 4375143, 4454578, 4347984, 4510784, 4361147, 4322826, 3858488, 4298172, 4183304, 3984344, 4022672, 4056674, 4046822, 4007596, 4109563, 4025656, 3750148, 3945841, 3541250, 4056719, 3541273, 3375324, 3380105, 3486151, 3831640, 4014153, 3551728, 3465747, 3900965, 3476239, 3776137, 3400099, 3458148, 3299121, 3143265, 3060449, 2968297, 3258534, 3000815, 2815322, 2821050, 2972042, 2953238, 2702529, 3009416, 2829505, 2924213, 2818866, 2644171, 2619011, 2881374, 2649312, 2637410, 2620321, 2822379, 2527769, 2902355]
14028B902355j84213j11589K53209m94006K03891k28529J54916m26721L06573
14019B375886q1858M8583j88769M5897o5469J28673J37997k99108j70458j51821
14009A779553J48220r546Q3015J75221p2611j26530j50803J52194m5391J65858
13999B099180j20375q8519o5125M1138j12794L98233l21566j29456p4897K16709
13989A842528K41482J771069N017398J9084445K1544704k1324215A3173453n865065
13981G308388j980219j272162o13718n20956k21786j13869m8425j61027J01964
13972B478190k66618J49741o5445j93212j46054M22169k21801K68154o38627K37340
13962B023837j3805q7514P8761j43219J62295l1357k76544O5303J49464m64878
$$ y = [2902355, 2718142, 2606553, 2859762, 2365756, 2569647, 2341118, 2496034, 2069313, 2375886, 2294028, 2342611, 2153842, 2199739, 2134270, 2262943, 2400940, 2101832, 1931374, 1779553, 1927773, 1918227, 2001242, 2176463, 2103852, 1977322, 1826519, 1978713, 1933322, 2099180, 1978805, 1890286, 1825161, 1866299, 1753505, 2151738, 1830172, 1700716, 1625819, 1842528, 2084010, 3855079, 8872477, 27956922, 49501626, 28177411, 13173453, 7308388, 5328169, 4056007, 3442289, 2921333, 2699547, 2585678, 2537253, 2376226, 2478190, 2211572, 2361313, 2295868, 2102656, 1956602, 2378771, 2156970, 2425124, 1786497, 2023837, 2010032, 1922518, 2001279, 1858060, 2020355, 1988998, 1712454, 1777757, 1927221, 1462343]
13952A462343K12673q5721k2681n5964J88803K16482l77916l78349P9755L96790
13942A636215j88919J11039M2285p8439J57339m0783R662k01347k12569M33019
13932A667502m81746L08393q693k78721M01926j10923k97203L2511K75773O4259
13922A573078k53176j51247L52279p45056O19558o9883r23K42975j85514j92109
13912A189982K6084K88758j58746J73726l12304M2895l7531L78668k76845n721
13902A308966k75222J27162j69171j04024L3072K58151k21070q5316K44338K27573
13892A344459k65585K22246j03882Q6981j92814j14108M0526k78486J96028M17166
13882A352531k93515L4055L3584j58877J59686J45672E30575O38400p5282l28521
$$ y = [1462343, 1675016, 1589295, 1566614, 1510650, 1699453, 1915935, 1538019, 1159670, 1239425, 1636215, 1447296, 1558335, 1600620, 1522181, 1679520, 1638737, 1648399, 1447052, 1234483, 1667502, 1185756, 1494149, 1485456, 1206735, 1608661, 1497738, 1200535, 1233046, 1508819, 1573078, 1319902, 1168655, 1520934, 775878, 1395436, 1325553, 1324630, 1567605, 1382091, 1189982, 1216066, 1504824, 1346078, 1519804, 1207500, 1250395, 1212864, 1591532, 1314687, 1308966, 1033744, 1160906, 991735, 887711, 920783, 1178934, 957864, 872548, 1116886, 1344459, 1078874, 1301120, 1197238, 1284219, 1091405, 977297, 1017823, 739337, 935365, 1352531, 1059016, 1093071, 1126655, 967778, 1127464, 1273136, 530575, 1168975, 1093693, 765172]
13872G65172J04650j9658j31697J53295Q8867j03332K859M81344o01808K09470
13862I49162j18232m2962M58716m29637o3172j85054K69593j73892L39383k10613
13852G93292n1805K40640k14869j58433Q4029J87381m5334O9098p6923L73056
13842A200132k32461j68864J4326j25865K1521J22568J49923q6952o1592J82070
13832A014806j57224J81832k56974k05818K98096K50405D83156O21975j36964
13823I68167l10460K64227j09033l8402j87343K28944p3647K15048l68857O1991
13813F50635j49577L09313N8380p6784n2951k46607N71751m43250J53413p7569
13803F96754J43847m10815J00303J77553k85102P03370l21121J3151k43197M01652
$$ y = [765172, 869822, 850164, 718467, 871762, 960629, 857297, 860156, 1341500, 739692, 949162, 830930, 787968, 1246684, 817047, 753875, 568821, 838414, 664522, 1003905, 793292, 741487, 982127, 767258, 608825, 692854, 880235, 834901, 903999, 827076, 1200132, 967671, 798807, 813133, 687268, 708789, 831357, 981280, 894328, 832736, 1014806, 857582, 1039414, 782440, 576622, 874718, 1125123, 483156, 1105131, 968167, 657707, 921934, 812901, 774499, 587156, 816100, 742453, 957501, 588644, 650635, 501058, 810371, 868751, 791967, 739016, 492409, 1064160, 620910, 774323, 696754, 840601, 429786, 530089, 707642, 422540, 1125910, 804789, 817940, 574743, 976395]
13793I76395l91561J64533j695p5069L38436m64902M3503K1523M1685M3495p7105
13782F19238K25741M422l00031R7508j14281K06042C49011M18797n8105K45889
13772I55592m62915K24256B70703K92417j42688Q8415K57311k75285K8708J51500
13762F71081j08425o8803J11133p4782L49046j12742j20303k76016J28048J00283
13752E98520j06941o9925J6600q2659K33424k4932p424p0335j47100L41847R4814
13741G75889C08780J08715M91710C70360L55498A72223M17108p6007j21030J8077
13731D10371m7806M0671J57105A07193N15682K35406k0070B88091M76817j77391
13721E87517k41407A62147K11054K16688r3279j9862O0210A52103K16631A62004
$$ y = [976395, 584834, 749367, 747672, 672603, 1011039, 546137, 589640, 611163, 652848, 696343, 619238, 844979, 849401, 549370, 646878, 532597, 738639, 349011, 767808, 709703, 955592, 492677, 716933, 270703, 563120, 420432, 508847, 766158, 490873, 519581, 671081, 562656, 493853, 604986, 530204, 879250, 766508, 646205, 370189, 498237, 598520, 491579, 421654, 438254, 355595, 589019, 564087, 556663, 486328, 339228, 681075, 775889, 308780, 417495, 909205, 370360, 725858, 172223, 589331, 513324, 392294, 410371, 362565, 403236, 560341, 107193, 622875, 858281, 838211, 288091, 764908, 587517, 346110, 162147, 373201, 589889, 496610, 476748, 536958, 152103, 368734, 162004]
13710D47591L1825N1865J59346A32726L45692j4129J18788p6018j24684b5395
13699F53479B16824M62956k75676J0319N7707A20599M45607k57272L20171j13662
13689E15443j55382J12427R865K12945B20621K22923n8867K64281B2007N20657
13679E42664p2303l826p9372g0687F47525k18077p6366l6088j2432J74246P8143
13668E56951O5669k76438K6460L01990j33332r5454K17473A85851J02159J32504
13658D20514P3347k35277Q9989J52243j47105q6585j2138Q3366K77151j28503
13648D87002j3841Q2056k37381M37925l35198j73763P495m4131L75399j70119
13638D15444k02078K06631A94932C5253L01934j39139J47238K32077a4463A52470
$$ y = [447591, 479416, 531281, 690627, 132726, 478418, 464289, 583077, 507059, 382375, -25395, 653479, 216824, 679780, 404104, 414423, 472130, 120599, 566206, 308934, 629105, 515443, 360061, 472488, 482353, 695298, 220621, 443544, 384677, 648958, 22007, 542664, 470361, 466535, 387163, -70687, 647525, 429448, 353082, 316994, 304562, 478808, 556951, 622620, 346182, 372642, 674632, 541300, 445846, 663319, 185851, 288010, 420514, 493861, 258584, 348573, 500816, 353711, 267126, 254988, 338354, 615505, 487002, 473161, 555217, 317836, 755761, 420563, 246800, 254295, 210164, 585563, 415444, 213366, 419997, 194932, 35253, 337187, 198048, 345286, 577363, -14463, 152470]
13627B59994L2360K02070l3252l3254j39906P6792N3390n2699k0610A34045Q7651
13616B21696A00724O8056O4808K4404R206C9697J06158L82079A98771M2955K19887
13605D61613A73818M6445J40673J12634n9261A47881K73010j12264j00014L3192
13595B41805J66401A11245J94431K20767A12876M11740k04030j12834m2261j9814
13585A45677R4583J77633P0364B42216J30473P9621o3389k3172A47450b9332D98283
13573E25414B35236K88366k05760A1517J06850l584K5504K05490D6000M06016
13563D52016b1877B79048A06386J34544J64430R3443A27145P6858M35795j30941
13553E08857B23069L43996B25406j4393K48671j4827p7734Q529a3858B37738Q0249
$$ y = [259994, 292354, 494424, 461172, 427918, 288012, 364804, 418194, 365495, 344885, 134045, 221696, 100724, 168780, 233588, 257992, 267198, 39697, 145855, 527934, 198771, 241726, 461613, 173818, 220263, 360936, 473570, 414309, 147881, 420891, 308627, 208613, 241805, 408206, 111245, 305676, 526443, 112876, 524616, 320586, 207752, 165491, 145677, 240260, 417893, 488257, 242216, 372689, 452310, 388921, 365749, 147450, -29332, 498283, 525414, 235236, 523602, 317842, 11517, 118367, 114783, 140287, 345777, 46000, 452016, -21877, 279048, 106386, 240930, 405360, 498803, 127145, 204003, 639798, 508857, 223069, 567065, 225406, 211013, 459684, 444857, 367123, 375652, -13858, 237738, 317987]
13542C17987k3949j02519D9741J94680J95333k18901J60823j4026A01200J57024
13532B58224Q2998D9217M16617b7279C44380N997H5905J31732l2960O2827F2652
13520B91271N1500B0311M63436B38900J4791I9442J09887P0052D3719J95220j11294
13509A27645M6794R3085g0900B50768N7576A16655J2179J0886a8247A92165R3609
13498B85774j11014J09812k8262K44832J549J8022A69570L7870Q5924J20855j56934
13487B57285j15801K44343H0020j7117B8597K47942K43928i2155B01305j2099
13477A89206K02226A37742J67334e84C3209L46646j06664J74332I916J64373J9079
13466A93368Q1082J31078c59566A60638N5383h1826A12123a45925E0690g6968
$$ y = [317987, 294038, 191519, 49741, 244421, 439754, 220853, 381676, 367650, 101200, 258224, 341222, 49217, 465834, -27279, 344380, 350377, 85905, 217637, 184677, 247504, 62652, 291271, 342771, 20311, 483747, 238900, 253691, 99442, 209329, 279381, 43719, 238939, 127645, 174439, 267524, -70900, 250768, 308344, 116655, 128834, 139720, -18247, 192165, 285774, 174760, 284572, 256310, 501142, 502691, 520713, 169570, 207440, 293364, 414219, 257285, 141484, 385827, 80020, 62903, 28597, 276539, 520467, -92155, 201305, 189206, 391432, 137742, 305076, -584, 33209, 379855, 273191, 447523, 9916, 174289, 193368, 274450, 405528, -359566, 160638, 216021, -81826, 112123, -145925, 50690, -76968]
13455C10324H9895P1255L71622E7226L4025J83367j27069P593C0824K01286l6860
13444A95250G1829J59869K20006A87723L34625D154P9912J96111b42305A55140
13433A55121L17002F4001L0378m6311a01282B80313j26558J6817K06530E1174
13422C9490k191L53654J84239B18304j239J58204b9424C45841a11636c9212B79334
13410C24065g6859C14046I9716k9048G321a10541B12840a66671F7434J93932I3236
13398B1764b1087A80656b1714j4556C12324E5691M613O2839D7143J77222a42585
13386A91605J333J2996q5668B0947b32024A96440E7184J09448H1803N1943n1127
13375H2619M8509J21627E9141K75523l7838K4696G7676A5016i7671B93365j35804
$$ y = [310324, 89895, 161150, 532772, 57226, 91251, 274618, 147549, 155142, 30824, 232110, 195250, 71829, 231698, 451704, 187723, 522348, 4154, 84066, 280177, -242305, 155140, 155121, 472123, 64001, 94379, 48068, -101282, 280313, 153755, 170572, 377102, 51174, 39490, 37299, 390953, 575192, 218304, 217065, 375269, -29424, 345841, -111636, -39212, 279334, 324065, -76859, 314046, 99716, 70668, 7321, -110541, 212840, -166671, 67434, 261366, 93236, 21764, -21087, 180656, -21714, -36270, 312324, 55691, 60304, 123143, 47143, 224365, -142585, 191605, 192938, 205934, 120266, 20947, -232024, 196440, 57184, 166632, 81803, 133746, 82619, 131128, 252755, 59141, 334664, 296826, 321522, 77676, 15016, -97671, 293365, 157561]
13364A57561C8668i3771q164B19123l7619P6631A1766J30763d7932j16031A46549
13352A80958B979c4747A16923m0965L92904C5268K0922L38611A8276K39698G8378
13340D60819G1327J77422A05459J15883c1413B07154G8418J66574q5081K00403
13330C60314p0507M6491h1839C94184n8391f8956A1301J43355N5121D6022Q2989
13319A29011K44340D830e7502B30141j09143L32583G985J46209l053K98843j65703
13308B84281E0217J95734M3536j40957b2831I1114J76933h1648B49312b8969B22196
13296H3782B1090J96612H596R9347M58156B78790q2401K65638j74163a1336j15293
13285a26629A70767a09286D365N1111J1123R2132F0616A9409J26316k187C7263
$$ y = [157561, 38668, -93771, -101935, 219123, 181504, 258135, 11766, 142529, -47932, -163963, 146549, 180958, 2979, -34747, 116923, 75958, 468862, 35268, 56190, 394801, 18276, 257974, 78378, 460819, 71327, 248749, 105459, 221342, -31413, 207154, 78418, 244992, 159911, 360314, 289807, 336298, -81839, 394184, 335793, -68956, 11301, 154656, 209777, 46022, 129011, 373351, 4830, -57502, 230141, 120998, 453581, 7985, 154194, 151141, 449984, 284281, 50217, 245951, 289487, 148530, -22831, 91114, 268047, -81648, 249312, -28969, 222196, 83782, 21090, 217702, 8596, 107943, 566099, 278790, 196389, 462027, 287864, -11336, -126629, 170767, -109286, 4365, 55476, 66599, 158731, 60616, 19409, 145725, 143538, 37263]
13273A92164E6835L1061K54291D3135N94006B75925A20746J28188A5495J23798
13263A39293m1772d919B35741I2616q859N677e260j74040I8060K65862a20823
13251a439A57819A4234d5366B91127b99592b6469G757J18666J49325p0568l1707
13240A73473C333Q4262J02261J35673r4304l2179r5187J1631c7155A98315A0305
13228a3656r7042A68874a03024g671k48995E48658I8875D4042a61883A43462r997
13217A33465P8754I5748a05612j03712C171a87478F9951L269j8518g5038N021
13206g0017I4864K85009A73098G6937F775P4582r323L14322A19870j2170l1770
13195G5930K20454j36870O76J11424b27600A32957K19146j67722o4992E8985h4170
$$ y = [192164, 56835, 87896, 342187, 43135, 637141, 275925, 120746, 248934, 15495, 139293, 97521, -4919, 235741, 92616, 83757, 89434, -5260, -179300, 98060, 363922, -120823, -1439, 157819, 14234, -45366, 291127, -299592, -26469, 7757, 126423, 275748, 205180, 173473, 3333, 87595, 189856, 325529, 231225, 199046, 103859, 115490, -37155, 198315, 10305, -13656, -110698, 168874, -103024, -7671, -256666, 548658, 98875, 44042, -161883, 143462, 133465, 212219, 95748, -105612, -209324, 3171, -187478, 69951, 73220, 54702, -75038, -70017, 94864, 379873, 173098, 76937, 6775, 81357, 72034, 386356, 119870, 107700, 75930, 296384, 159514, 160190, 271614, -227600, 132957, 352103, 184381, 119389, 58985, -84170]
13183G8261a240D48498a08107J2226A51639P5345O563e6919n3660B41171c63780
13171a2171C01940J309a54452c9601f719C39677a6125A69541P3403H1196a02353
13159B93640B0719a06716A7881h945j12721A76423a17902F2537c61007C2431b836
13147B63370i1198K310b5321A92628E5322K12518D808h5519L6321j16894A30125
13135a43595l9885N5886B62343B8386J78065a52257d3073A02180O6307q818l5487
13124A24182J04471A1906J33823O0582b73420H8626A1304d6144A1366R0684j2739
13113H9311N3386J40001D3265e6073A46002c73694a47668e6743j04250B6743O5726
13102I2469m1932L5855a1224C36812E93c2646C19702r6872i3001a9350A58806
$$ y = [78261, -1240, 448498, -108107, -95881, 151639, 226984, 233547, -56919, -110579, 241171, -363780, -12171, 301940, 303249, -154452, -39601, -6719, 339677, -16125, 169541, 242944, 81196, -102353, 293640, 20719, -106716, 17881, -8945, -121666, 176423, -117902, 62537, -361007, 32431, -2836, 263370, -91198, -88888, -25321, 192628, 55322, 267840, 4808, -85519, -49198, -166092, 130125, -143595, -183480, -127594, 262343, 28386, 206451, -152257, -43073, 102180, 168487, 159669, 124182, 228653, 11906, 145729, 206311, -273420, 88626, 11304, -46144, 11366, 102050, 89311, 142697, 282698, 43265, -56073, 146002, -373694, -147668, -56743, -160993, 26743, 92469, 50537, 86392, -11224, 336812, 593, -32646, 319702, 222830, -93001, -19350, 158806]
13090D9182i2474A82589h6279J8331A66970c51386a9375k8383m3719B39758b14533
13078B25910M5516c40396B14867c13146d2865A64334a39727F2091c1266B87872
13067B70356a87276A52971a02749k9856C6965a45286Q720A8762c8615J8288C53188
13055B47456A16838a36088A59563Q7393j16317n5486C6380J08485Q7367a77383
13044i3002j91756B77702H6705f9030B5M9388P1455K75716a34774B630K81024
13033B83654l8331b07907B30931j15412a02472G8889J84922F737c2665A96790
13022g6938A87250K71560A92961H1031d9557B37224e4555A75435a82890E1267
13011c35374C4694J81787I5324C9955J02520n3259h4331A30764c5985A34993K4790
$$ y = [49182, -92474, 182589, -86279, -67948, 166970, -351386, -19375, -47758, -91477, 239758, -214533, 225910, 271426, -340396, 214867, -313146, -42865, 164334, -139727, 62091, -31266, 287872, 270356, -187276, 152971, -102749, -132605, 36965, -145286, -136566, 18762, -38615, -20327, 353188, 247456, 116838, -136088, 159563, 246956, 130639, 75153, 36380, 144865, 232232, -177383, -93002, -284758, 277702, 86705, -69030, 25, 49413, 120868, 396584, -134774, 2630, 283654, 245323, -207907, 230931, 115519, -102472, 78889, 263811, 6737, -32665, 196790, -76938, 187250, 458810, 192961, 81031, -49557, 237224, -54555, 175435, -182890, 51267, -335374, 34694, 216481, 95324, 39955, 142475, 89216, -84331, 130764, -35985, 134993, 159783]
13000A59783A9981c8772I0261c6940D67728h1511j81642f4527C12695n0743b58791
12988A63111a7735F3085a18097R387A8098b990C73266A04030b2621j49663B7023
12976B37993c026j5652j00217n542l6309I1775J67236l8005a62814B05402a76642
12964B50555a34837r6996C71413j30162b38110B34331a39204a4529o0450l67212
12954d42191B16908o687g6685B75674a28080c0675k13122J2248D13387d6264J6413
12943b9851A21849a74052b673k1982F1922N5248E3694f0070A58221a07349l51
12932a07700A82260K1135n2094a63738e6304j18241O3582A83898b95652A554a23730
12920g2367A29479n5874J55750G0065J68210a82798A49653e716E8945d2421B40314
$$ y = [159783, 19981, -38772, 90261, -36940, 467728, -81511, -263153, -64527, 312695, 261952, -258791, 163111, -17735, 63085, -118097, -108710, 18098, -2990, 373266, 104030, -22621, -172284, 27023, 237993, -3026, -18678, -118895, -124437, -160746, 91775, 259011, 221006, -162814, 205402, -176642, 250555, -134837, -231833, 371413, 241251, -238110, 234331, -139204, -14529, -74979, -442191, 216908, 210221, -76685, 275674, -128080, -30675, -243797, -231549, 413387, -46264, -29851, 121849, -174052, -2673, -24655, 61922, 117170, 53694, -60070, 158221, -107349, -107700, 182260, 203395, 151301, -163738, -56304, -174545, -110963, 183898, -295652, 1554, -123730, -72367, 129479, 73605, 229355, 70065, 238275, -182798, 149653, -5716, 58945, -42421, 240314]
12908c4015c29F8842e7427a8570B9763b17129D7689b54524C29441j18214b04289
12896C8299a7185j27127B09028p9258b39395B8812I39d1535n5163c1451j02812
12885a34263c9463B61994d6598k5919B46571c746E2647e3200A85310p5366D3775
12873A6684J7109M6343J28197c385p0578J4554J3017k31915P4260c7197C67769
12861b36188J10962d1657l43685C7270L42155b01743O781j72137F5480a22216
12850A30170N6773E2211K7600a94269O6624N7509r9029B54469a33812A27967K7412
12839A55379b32142B30022B2473J7461a52359B8563a84906f9065a8396C40572
12828D7494A0302J39365a13332C94822b35051F8332J04393k1001a99755R3936
$$ y = [-34015, -329, 68842, -57427, -18570, 29763, -217129, 47689, -254524, 329441, 211227, -204289, 38299, -17185, -144312, 209028, 129770, -239395, 28812, 939, -41535, -96698, -31451, -134263, -39463, 261994, -46598, -72517, 246571, -3746, 52647, -53200, 185310, 109944, 43775, 16684, 33793, 80136, 208333, -3385, -73963, -59409, -46392, -278307, -204047, -37197, 367769, -236188, -125226, -41657, -385342, 37270, 379425, -201743, -194962, -367099, 65480, -122216, 130170, 186943, 52211, 79811, -194269, -127645, -70136, -169165, 254469, -133812, 127967, 155379, -232142, 230022, 22473, 39934, -152359, 28563, -184906, -69065, -18396, 340572, 47494, 10302, 149667, -113332, 394822, -235051, 68332, 172725, 151724, -199755, -105819]
12818a05819d315r6842a0567j78850r1726A8163b73630A27728a04256B30552m8779
12807A81773J9837H1462J08231b91999e6782B60893a14572c6059J5273B47157
12796a45542k4742d4131C765M9222J3987q948b1010A06221e40307e5293j83089
12785b38382a0513G8412C0169b61447I38L00054j06171a39649F1089B0168J30340
12774A50508L9074i5815L1807B23838b13618l5338a04098A0555J0063a01076K078
12763i8998a9385j24486E2025d1335r483j40456N9507k99104A9871J8246J37813
12752A75930a81448A14714K03759a12804G395J3538c8309G4040a50186j7221j40106
12741c07513B50639A432O0810P1064a81975G8426R3760c5406B2299o388o561L8797
$$ y = [-105819, -4315, -101157, -10567, -189417, -281143, 18163, -273630, 127728, -104256, 230552, 181773, 201610, 81462, 189693, -291999, -56782, 260893, -114572, -36059, -20786, 247157, -145542, -170284, -44131, 3765, 52987, 66974, 58026, -21010, 106221, -540307, -55293, -238382, -10513, 78412, 30169, -261447, 938, 300992, 194821, -139649, 61089, 20168, 150508, 189582, -95815, -64008, 223838, -213618, -248956, -104098, 10555, 20618, -101076, -98998, -19385, -143871, 52025, -41335, -50818, -191274, -131767, -430871, 19871, 38117, 175930, -181448, 114714, 318473, -112804, 7395, 20933, -38309, 74040, -150186, -167407, -307513, 250639, 1432, 62242, 133306, -181975, 78426, 172186, -35406, 22299, 15911, 9350, 48147]
12729D8147b28735K4059D95322a12412q8014A47077j8335j0142b09619p4940i0371
12717a24463i160H4802a07215r7485A90780a12621C23253j53328J30581A20294
12706A58133Q9746l3922I0968J71710b46307d6877D7814e1605J4715p534j5968
12695f0392k08433i0888A86942N6298d619l46324a8950A7988a14190n3469I8979
12683D8259b46816J04676M5616j39924i4332B25868H5240E997J36892m6901h4224
12671A03700b7498r963B73875j17536b39662A6635J5252b64955A3006N5953b17571
12659D85405a52683E2439L7741K09745j09914o6584M671a38834C3838L6201J49308
12648B19347o9157K3817R3741A08999h1384m19257a94692B31062F8271a32816
$$ y = [48147, -228735, -204676, 495322, -112412, -200426, 147077, 128742, 118600, -209619, -284559, -90371, -124463, -9160, 84802, -107215, -204700, 190780, -112621, 323253, 169925, 300506, 120294, 158133, 247879, 213957, 90968, 262678, -246307, -46877, 47814, -51605, -36890, -44424, -60392, -268825, -90888, 186942, 243240, -4619, -350943, -18950, 17988, -114190, -167659, 98979, 48259, -246816, -142140, -96524, -236448, -94332, 225868, 85240, 5997, 142889, 95988, -84224, 103700, -27498, -37461, 273875, 156339, -239662, 16635, 31887, -264955, 13006, 68959, -217571, 485405, -152683, 52439, 90180, 299925, 190011, 123427, 128098, -138834, 33838, 70039, 219347, 150190, 174007, 267748, 108999, -81384, -500641, -194692, 231062, 68271, -132816]
12637b73229H8852a2732B716J00162a2435C13117B4064J89695N0375r3888c4425
12625F4418e2962a1570b327C1057K13699m4464m5521o7006k780N8810g3483H3870
12612b5228k3673G6343P0200a75814F52a7871k0209A48631d9939A90962b3280
12600h5743B01461A7892M19958e1959j97990b8413j38144c922A66803a34222L381
12589a30841A72977i0370I7432Q1059e3993k19244O7519J7079k888B43123F0130
12577B4799b44810o4786o0313a38487E2626e275A56472n9020b983l15732O8110
12566b50605A54252C8047L1173B4428N2634a03380M7175A13354b6630g25j38752
12555a39477k31618a04914j42299B52515o3456N3226i5463B0038e6308H9590a80837
$$ y = [-273229, 88852, -12732, 2716, 102878, -12435, 313117, 24064, 213759, 264134, 170246, -34425, 64418, -52962, -11570, -2327, 31057, 244756, 200292, 154771, 87765, 84985, 143795, -73483, 83870, -25228, -48901, 76343, 146543, -175814, 652, -17871, -38080, 148631, -49939, 190962, -23280, -85743, 201461, 17892, 437850, -51959, -249949, -28413, -166557, -3922, 166803, -134222, -130841, 172977, -90370, 97432, 178491, -53993, -273237, -205718, -188639, -191527, 243123, 60130, 24799, -244810, -309596, -369909, -138487, 52626, -5275, 156472, 97452, -2983, -318715, -250605, 154252, 38047, 69220, 24428, 77062, -103380, -56205, 113354, -26630, -725, -139477, -371095, -104914, -247213, 252515, 189059, 242285, -95463, 20038, -56308, 89590, -180837]
12543a01458m1167f1886k36544a4321m3715b2247k23050d8767A89884a72280A00835
12531B37252l0327a1089j97057C080P4115J96213c0284D7295g5271c5738j5816
12520e1554B95506A23496a60805j67391h5911n4394q0817n5762I7147k7013O1763
12509A31897N528o4993d09450A64869f7491A49046J95647j12326b2462B81964
12498b08486R3927k0071j66110C6983e2093j5795m5740p32c4052j7915J6264D5099
12485A2743Q0223d239C8321J57642b70853G1715g9604q327B46687A00671M2357
12474A43028a92939B66140a62276k16194C24744A37956a26696H4967b71624a03366
12463A36500f9157j23896L1907B22861b0772j72363A89649d7403B9987A0071d7421
$$ y = [-101458, -142625, -61886, -298430, -14321, -58036, -22247, -245297, -48767, 189884, -172280, 100835, 237252, 206925, -11089, -208146, 3080, 77195, 273408, -30284, 47295, -75271, -35738, -51554, 295506, 123496, -160805, -328196, -85911, -140305, -221122, -276884, 97147, 70134, 131897, 137425, 72432, -409450, 164869, -67491, 149046, 344693, 232367, -22462, 281964, -208486, -114559, -134630, -300740, 36983, -52093, -67888, -113628, -114360, -34052, -51967, -35703, 45099, 12743, 92966, -4239, 38321, 195963, -270853, 71715, -79604, -87931, 246687, 100671, 143028, -192939, 266140, -162276, -378470, 324744, 137956, -126696, 84967, -271624, -103366, 136500, -69157, -193053, -161146, 222861, -20772, -193135, 189649, -47403, 29987, 10071, -47421]
12451A60309L4794c8636r5230C4583j836b20076C5584a81544J8669j77736i1229
12439A59880d41735H870a54173g1647A2479J42965C0453a07920c2758A54241a59397
12427A22597a82139C31877r4934b37883A35739j4702D388J88075J6195a89909
12416d20478c9393H783J74258a3118l65771e1287E6208c00419A1878K84396G7310
12404E6941L0088a98501A08648J4144g2692e594l6397m3869G7252k4262Q7626
12393A40616c1487B2246L92604j81600I0486i6293a581A33976i8349n6960N6089
12382i9220o6684M9115H4414C6683J93535a58751B49307c7007m8502b9741B54245
12370A50357j3430L3214o6505g3920j13390B30953a4282A93271P5055G8870a83410
$$ y = [160309, 195103, -38636, -133866, 34583, 32747, -220076, 35584, -181544, -162875, -340611, -91229, 159880, -441735, 8870, -154173, -71647, 12479, 155444, 30453, -107920, -32758, 154241, -159397, 122597, -182139, 331877, 236943, -237883, 135739, 121037, 4388, 192463, 208658, -189909, -420478, -39393, 8783, 183041, -13118, -378889, -51287, 56208, -300419, 11878, 296274, 77310, 56941, 87029, -198501, 108648, 122792, -72692, -5594, -41991, -85860, 77252, 52990, 140616, -31487, 22246, 414850, 233250, 90486, -96293, -1581, 133976, -98349, -155309, -99220, -165904, -116789, 84414, 36683, 230218, -158751, 249307, -37007, -85509, -29741, 254245, 150357, 136927, 170141, 103636, -73920, -187310, 230953, -14282, 193271, 268326, 78870, -183410]
12358F8734P1467f2274j0698L3974j04726N5435j71382R5610A12882d9783J6388
12347c3395m49162a62164D631J19662E2137O3627f1541o9025C26303N8455E5476
12335A86753a17624A26635e9604B4649a11374m5916N8319C18867p4277j4748j02821
12324A27021p636K41934D3844K47219A08451j9196K74359j57754J42216j21249
12314B26827k5406n246b5622r448F0153R479b9870B38760Q908a80059D54672j87750
12302B66922E4277A3497N6260M18467f9770k8822j08162I1933L11031r7198f5728
12290b54566g4619K8023j90448b1175A12713C340c4919G3189N3617a00616E6295
12278a08547d9275d432C3127A050K86035p7351o3098a33372C17230B1555L09239
$$ y = [68734, 140201, -62274, -72972, -38998, -143724, -88289, -259671, -164061, 112882, -49783, -33395, -482557, -162164, 4631, 124293, 52137, 115764, -61541, -130566, 326303, 384758, 55476, 186753, -117624, 126635, -59604, 24649, -111374, -157290, -98971, 318867, 244590, 229842, 127021, 119385, 361319, 43844, 291063, 108451, 89255, 363614, 205860, 348076, 226827, 201421, 196175, -25622, -35070, 60153, 69632, -29870, 238760, 247668, -180059, 454672, 266922, 54277, 13497, 69757, 488224, -69770, -98592, -206754, 91933, 402964, 305766, -65728, -254566, -74619, -46596, -237044, -21175, 112713, 3340, -34919, 73189, 126806, -100616, 56295, -108547, -49275, -4432, 33127, 1050, 287085, 209734, 146636, -133372, 317230, 21555, 330794]
12267C30794A54561L8548K38905d1641k08330A76484n1435M7202N8282K08638
12257D39171B18484K5682n6642J17380d8257D32147j00481c74B42384f9110A40522
12245B58017L234q0617N0468H7312D3220K35381m2157I3447a87718d5907B29645
12233B69520a93171A65009M6266b5387A64324F9658d4219a0443I620J41312J39621
12222B90553A23675c1958A23884L70550a12213A54167J6185R5827i3462A49091
12211C25285j30420K1261i0155A32006e5160k6034C95750H2324L25255G1578e2586
12199A19737l9784e629H8336a2395C60030p5167A11684c6224C96046j65845J4503
12188B44704C5858A0753b42823i2762B18429J45838H4236J22321m0505L9924J96347
$$ y = [330794, 154561, 193109, 432014, -41641, -249971, 176484, 125049, 172251, 230533, 439171, 218484, 244166, 187524, 304904, -48257, 432147, 331666, -374, 242384, -69110, 140522, 258017, 261251, 180634, 231102, 87312, 43220, 278601, 236444, 93447, -187718, -45907, 229645, 269520, -193171, 165009, 211275, -25387, 164324, 69658, -44219, -10443, 9620, 150932, 290553, 123675, -31958, 123884, 494434, -112213, 154167, 170352, 266179, -93462, 149091, 325285, 194865, 216126, -90155, 132006, -55160, -81194, 395750, 82324, 407579, 71578, -52586, 119737, 79953, -5629, 88336, -12395, 360030, 284863, 111684, -36224, 396046, 230201, 244704, 35858, 10753, -242823, -92762, 218429, 364267, 84236, 206557, 166052, 205976, 402323]
12177D02323A26482N569F2950l0915J5625K07830O5309J59733a55800A09796J9923
12166A29719K11721A33245N9490R0844K79448k81135D5700q65B0091a5737C3961
12154c86336C02583d387C77172b82944c6139j17245D2245K07003a3928m8386A52694
12142A56909p2627a54505A23644n3906R6681E8017b1874k49034B29152a19062
12131i3091A61686b00456E3128E429a6755j89505C73649F337i4181I2446J88674
12120B81120j6223A31079J47697J35252L3693D1205j8154P5345J17294a29434
12109G9138O3979K82771a03789H2056L2200c0599j665C49533C2516j5502g1811
12097H3345O6831j0286i3346a4705p9653Q239A17659N6385M2072k4356N3680G3304
$$ y = [402323, 126482, 132051, 62950, 32035, 47660, 255490, 320799, 480532, -155800, 109796, 129719, 341440, 133245, 192735, 283579, 563027, 281892, 45700, 44835, 20091, -15737, 33961, -386336, 302583, -4387, 377172, -282944, -36139, -153384, 42245, 249248, -13928, -62314, 152694, 156909, 84282, -154505, 123644, 69738, 166419, 58017, -21874, -270908, 229152, -119062, -93091, 161686, -200456, 53128, 5429, -16755, -206260, 373649, 6337, -94181, 92446, 281120, 264897, 131079, 278776, 414028, 447721, 41205, 23051, 98396, 215690, -129434, 79138, 143117, 425888, -103789, 82056, 114256, -30599, -32264, 349533, 32516, 17014, -71811, 83345, 150176, 139890, -93346, -14705, -94358, -86119, 117659, 174044, 216116, 191760, 245440, 73304]
12084B87838e7629B74280E1912O2325E0088B0034a9046A60592b85508O6382c0214
12072B60553C9119d4869A37654L7650J66071b14038D00581j86128I6052C5071
12061b59255G3943a0402j3778A16110C1117L97256H4692a57486A66710k4452M56298
12050E98556a17054D7758b10965I1370g7900I2019b50252F9110O7092C3439c45048
12038A11301k4571L16250a7937n3703l19926A07559d8114A08926a09358J7746
12028i1612B00316a44159A18046g4544C18084p3032D1691N7888M3767K47421j92460
12017A98307a41987A18517l0313g270B92031G045K59876a85738G629K84076d4451
12005A23809C7632a41012A29176E3825J32444a36561G599R6262L02280b24642
$$ y = [287838, -57629, 274280, 51912, 114237, 50088, 20034, -19046, 160592, -285508, -219126, -30214, 260553, 39119, -44869, 137654, 175304, 341375, -214038, 400581, 214453, 96052, 35071, -259255, 73943, -10402, -24180, 116110, 31117, 428373, 84692, -157486, 166710, 142258, 598556, -117054, 47758, -210965, 91370, -77900, 92019, -250252, 69110, 136202, 33439, -345048, 111301, 86730, 402980, -17937, -71640, -391566, 107559, -48114, 108926, -109358, -91612, 200316, -144159, 118046, -74544, 318084, 245052, 41691, 99579, 143346, 390767, 198307, -141987, 118517, 88204, -7270, 292031, 7045, 266921, -185738, 7629, 291705, -44451, 123809, 37632, -141012, 129176, 53825, 186269, -136561, 7599, 103861, 406141, -224642]
11994F5750a05125A87001a8214C56044f5692A0981J27738b36064c2045o9877D9426
11982H2483k1962h8959A56577o1708A4030J08647b9862N507j77403A33045J04490
11971B37535e8954k74603a64857G8147a54975I9742c20438G2470C337i9229K465
11960i6764a9582B1088b5157k96471A64906l4221J06011a98210B86491a58763
11949E5091H380K34247b64017B81660c33389a03677k54283a74105B0165c9330
11938c73609I8798c0386j37833J4853f0732I498j552a26874OF0075K9387a09781
11925a21985j81190A80462K9876q7402g5422k46048e0145C4804a29844f964j13176
11914a20140A22085A7848J37109h5357j60737g3769A01873d486j44929K6472A13237
$$ y = [65750, -105125, 187001, -18214, 356044, -65692, 10981, 138719, -236064, -32045, -101922, 49426, 82483, 60521, -88959, 156577, 94869, 14030, 122677, -29862, -24355, -201758, 133045, 237535, -58954, -333557, -164857, 78147, -154975, 99742, -320438, 72470, 3337, -99229, -96764, -19582, 21088, -25157, -321628, 164906, 130685, 236696, -198210, 286491, -158763, 55091, 8380, 242627, -264017, 281660, -333389, -103677, -357960, -174105, 20165, -39330, -373609, 98798, -30386, -168219, -153366, -60732, 9498, 7946, -126874, -126868, 60075, 89462, -109781, -121985, -303175, 180462, 210338, 122936, -75422, -321470, -50145, 34804, -129844, -6964, -120140, 122085, 17848, 154957, -85357, -246094, -73769, 101873, -4486, -149415, -122943, 113237]
11902a37207E9982a448j38536N8132b3346k90941a37668j37164b1462j92072Q8382
11891a25152B28265a20783A51115M0668d01957A60361F9766Q0861g2362j26106
11881a98468H6045M9061b66106B1962J11705J5431J4382m1640e7933j8967G5045
11869a8283D2710J69054F9868O5635a89060A32368o522q650a41224m42618h6380
11857c90620a5838n7664A10551b77983G1614g1662E0111e223j93380K4986A88456
11845a71976O4260G106M5978J87705a87909A59487n1281b74123C5827J86194I5148
11833d1333r1196I914h8486k83098E8250d9054j54798p0663C52175b09065E5065
11821H1126d9492n3762A24895b99637a1452j22792m9995B53897a5714j0200j13665
$$ y = [-137207, 59982, -1448, -139984, -81852, -23346, -314287, -137668, -274832, -21462, -213534, -125152, 228265, -120783, 151115, 191783, -401957, 160361, 69766, 150627, -72362, -198468, 86045, 135106, -266106, 21962, 133667, 149098, 163480, 121840, -57933, -76900, 75045, -18283, 42710, 211764, 69868, 135503, -189060, 132368, 125846, 117196, -141224, -583842, -86380, -390620, -15838, -73502, 110551, -277983, 71614, -71662, 50111, -5223, -198603, -173617, 188456, -171976, -107716, 7106, 53084, 240789, -187909, 159487, 108206, -274123, 35827, 222021, 95148, -41333, -132529, 9914, -88486, -371584, 58250, -49054, -203852, -274515, 352175, -209065, 55065, 81126, -49492, -103254, 124895, -299637, -11452, -134244, -184239, 253897, -15714, -25914, -139579]
11810a39579j60699a01829o6823Q0757j25656C7540b50386R9716m8719p038F3740
11798b68312a33504j30186A91027a4208k08723J10750o4445B6820R2377K4105
11788A43302a73250C71072a35033C14207b38049R6981G8029i397A98067m7084
11778A50983d8701A85965C1613N4654j7528b14869A18947d8070B47334A07392
11767e1658I7735n368h2408A7437d0172j34249Q1882l540B16c19031e4744F1454
11754E809N0070b34151A68774a24932L9310q3434A52374a07774L6264C6916J43198
11743A80114a2971E5251K9929K86473E0047a35731A43331e3083J9156j84804B93962
11731a14785m7151A78414b67379c20G8595l4973a14666b8731j18594e0766B35388
$$ y = [-139579, -300278, -101829, -168652, -87895, -213551, 37540, -250386, -150670, -199389, -206427, 63740, -268312, -133504, -263690, 191027, -14208, -222931, -112181, -176626, 26820, 119197, 143302, -173250, 371072, -135033, 314207, -238049, -141068, 78029, -9397, 198067, 150983, -48701, 185965, 31613, 86267, 68739, -214869, 118947, -48070, 247334, 107392, -51658, 97735, 92367, -82408, 17437, -40172, -174421, -92539, -96079, 216, -319031, -54744, 61454, 5809, 55879, -234151, 168774, -124932, -85622, -169056, 152374, -107774, -71510, 36916, 180114, -12971, 55251, 85180, 371653, 50047, -135731, 143331, -53083, -33927, -218731, 293962, -114785, -161936, 178414, -267379, -320, 78595, 43622, -114666, -28731, -147325, -50766, 235388]
11719c84490Q4247A22608B9990Q0604j8646L5541a88820E9286B9537K49349a5444
11707C8680a05732l0829A42929a00285d86j70807P9051B64840a27604B21198I3981
11695a90174A73953O4481r3716b06062P2424A53357g0819L0504G0830a8598f583
11683D20520B2197J25428k2181O145N2880H9961B4891e2770B05564l1678a16243
11671f5358j82618a559k90577M287I3956e2971j00292g5234I3001J86211j26102
11660A53110o1602L1787b51861a19010b7779l8293j12977O8495M3767l413l8997
11649a09197B487i3049C1394L7967d4908m8326j27549P1694I741J39707a08244
11637B65550b67795a1998F9348A3593C4J80497m3794d2075A73408a23354d7557
$$ y = [-384490, -300243, 122608, 29990, 110594, 91948, 127489, -188820, 59286, 29537, 278886, -15444, 38680, -105732, -136561, 142929, -100285, -486, -171293, -92242, 264840, -127604, 221198, 93981, -190174, 173953, 238434, 144718, -206062, -133638, 153357, -70819, -40315, 70830, -18598, -6583, 420520, 22197, 147625, 125444, 131589, 184469, 89961, 24891, -52770, 205564, 173886, -116243, -65358, -247976, -1559, -292136, -287849, 93956, -52971, -153263, -75234, 93001, 279212, 153110, 91508, 123295, -251861, -119010, -27779, -66072, -179049, -110554, -66787, -70200, -109197, 2487, -93049, 31394, 69361, -44908, -93234, -220783, -149089, 9741, 149448, -108244, 265550, -267795, -11998, 69348, 13593, 34, 180531, 136737, -42075, 173408, -123354, -47557]
11625G2377g7I309M86453F1814a10161E1487R8328f7248C58084A65342o4393c5952
11612B71220e0916d30k3665B5563h1795C67280b13446j30015a1542n3441A11669
11600a87166J7883B41610n2701b47253j4735I4286f4452c782j26073H6302P5359
11589A61661n9664a68260e9563j02071A49439a83481A06004i7617L6110H8780
11578A90581a82430L2769I2801g4804B11037d3726j11159B98286a10543C25513
11567B83309c9651A90098b01795A4840h6244k1184E1617A3577b22906B45150j22452
11556A22698K81551h4581C57237A39574l4678F11c2107j27487a1996A24877k9661
11545I5216m5407J33655b4869B87096l4650A02620c53660h0081k53533A75230
$$ y = [72377, -77, 9309, 495762, 61814, -110161, 51487, 149815, -67248, 358084, 165342, 100949, -35952, 271220, -50916, -430, -24095, 25563, -81795, 367280, -213446, -343461, -11542, -64983, 111669, -187166, -169283, 241610, 188909, -247253, -261988, 94286, -64452, -3782, -129855, 86302, 161661, 101997, -168260, -59563, -161634, 149439, -183481, 106004, -97617, -61507, 88780, 190581, -182430, -149661, 92801, -74804, 211037, -43726, -154885, 298286, -110543, 325513, 283309, -39651, 190098, -201795, 14840, -86244, -107428, 51617, 13577, -222906, 245150, 122698, 404249, -84581, 357237, 139574, 104896, 611, -32107, -159594, -11996, 124877, 95216, 49809, 183464, -24869, 287096, 252446, 102620, -353660, -80081, -333614, 175230]
11534I9855j5221J739J08444c1844k99975B32995b5841A05852L2609J82970b2561
11522a73386q4964J16813J7697A66852b05486A12030L3920d5966A28251N0786
11512A79037m5110D6882L7060R7569j5886h4854G729J06368h9896C08718a33744
11500B21876i4921A28098f2224n0784B8932d7566F05869I5946K66141G5480o314
11489F9166a26875E12036A39241A7417a625j42234A05219J97418B6679L21911
11479C48590J6596d15484h177C18754I575J16124P7211d8727j2912H8122C2528
11467B31354g5927a7327B06449a21362N7632j4012B34460q4509Q9967f0104J8055
11456d2049B2200N5359e8829H1944J4567Q8974d23919a2387B60282N2492b9937
$$ y = [99855, 84634, 86373, 194817, -31844, -331819, 232995, -25841, 105852, 138461, 321431, -22561, -173386, -258350, -141537, -123840, 166852, -205486, 112030, 145950, -45966, 128251, 179037, 133927, 46882, 83942, 181511, 165625, -84854, 7729, 114097, -89896, 308718, -133744, 221876, -94921, 128098, -62224, -113008, 28932, -47566, 605869, 95946, 362087, 75480, 69166, -126875, 512036, 139241, 17417, -1625, -143859, 105219, 302637, 26679, 348590, 365186, -415484, -8177, 318754, 9575, 125699, 202910, -48727, -61639, 88122, 32528, 231354, -75927, -17327, 206449, -121362, -63730, -77742, 234460, 149951, 239918, -60104, -42049, 22200, 77559, -58829, 81944, 96511, 185485, -423919, -12387, 260282, 312774, -29937]
11444A53484a17167G3012c45991B05623J11638p4119a04375a0473k28936C18344
11433B62778a68756k4540C60734j19184p0628F8084A1785b04905C15827J00400
11423D16227p1761a4313B79312b57136B8924a41284L525j34831Q2319b8993A16678
11411C4649j6265N3800f7425B1988g5652j12638F8707a43420F3842J9529A200
11399f2493B88041b22671a9592j19411o4717b2411k52939C26311m8526h1316j3232
11388i4548n5552j47327j9679I2730b82295B1682J50135E6956a40169r7229e4015
11376g1250F0911a8442j07807m0077d2141l1496l88q3374A48709D0682J8786q667
11364E0801d0050k43088J25379k9064J6215A62887H1366L5537a3991p0225H7965
$$ y = [153484, -117167, 73012, -345991, 205623, 317261, 243142, -104375, -10473, -239409, 318344, 262778, -168756, -193296, 360734, 241550, 170922, 68084, 11785, -204905, 315827, 416227, 344466, -14313, 279312, -257136, 28924, -141284, -137759, -272590, -190271, -28993, 116678, 34649, 18384, 72184, -67425, 21988, -75652, -188290, 68707, -143420, 63842, 83371, 1200, -62493, 288041, -222671, -19592, -139003, -203720, -22411, -275350, 326311, 277785, -81316, -94548, -150100, -297427, -317106, 92730, -282295, 21682, 171817, 56956, -140169, -237398, -54015, -71250, 60911, -18442, -126249, -166326, -42141, -73637, -74025, -157399, 148709, 40682, 59468, 50801, -40050, -283138, -157759, -186823, -170608, 162887, 81366, 116903, -13991, -84216, 87965]
11352b01794i6363B91104I4736C3800b15081K9430E4810a61024B9793g267C4816
11340B65083j03620a1283G7272d2321p6425q0599e8918A28095e1899k6899l20300
11329c99098a76595Q6719J4241B337c34944a55916A6392i052A51134E8721a01867
11317C14828b04767A45929a75822j4757b9492j9694B85580a05276A82319b59047
11306a30495b9318A83372q1966c0900j35790E7803Q9946b22621B37756a82869
11295i9103m0401j56168k69088f7725A79523f0096k50925h8177E3609N0821h9939
11283a3729l30292g6237C11946c03664B55870g4192k2284l01553a37655A49988
11272g4044I9296d9959D2981J81570g1700m3417A77481a62664A33504F0651c968
$$ y = [-201794, -96363, 291104, 94736, 33800, -215081, -185651, 54810, -161024, 29793, -7267, 34816, 265083, 161463, -11283, 77272, -42321, -118746, -199345, -58918, 128095, -51899, -78798, -399098, -176595, -89876, -75635, 2337, -334944, -155916, 16392, -9052, 151134, 58721, -101867, 314828, -204767, 145929, -175822, -190579, -29492, -49186, 285580, -105276, 182319, -259047, -130495, -29318, 183372, 101406, -30900, -166690, 57803, 147749, -222621, 237756, -182869, -99103, -139504, -295672, -564760, -67725, 179523, -60096, -311021, -88177, 53609, 104430, -89939, -13729, -344021, -76237, 311946, -303664, 255870, -74192, -96476, -398029, -137655, 149988, -74044, 99296, -49959, 42981, 224551, -71700, -115117, 177481, -162664, 133504, 60651, -3968]
11260a41021c531j24869o9251b6870G4149J09915K00912c99248J34795A24541
11249a05120l1928K9406d6739m8371n6066A36349a47526n4708a6858I7868N6034
11238A53902a3525q2765H1802e7179J921E7842L2725h7612B27128C8235J69105
11227B07340d35696a272I8791j7799A0925a25294o7201A62981p2087i7725H2409
11215c41189J64473K3615m2047O4989J7161r429M6801r759G6417a88177D0988
11203D6310g4108L900H3222e73069C89659i6963a3535r8252o0439l0029e8792
11191b87610a04296j984L0939n544K1051F6667R0300a35293A43127N2712b489
11179a40618E6576a4161o6881j43163B22828g5722j11777I3160c11871J2614n8723
$$ y = [-141021, -3531, -128400, -197651, -26870, 74149, 184064, 384976, -399248, -264453, 124541, -105120, -137048, -107642, -46739, -95110, -151176, 136349, -147526, -202234, -16858, 97868, 153902, -13525, -96290, 81802, -57179, -55258, 57842, 90567, -87612, 227128, 38235, 207340, -435696, -1272, 98791, 80992, 10925, -125294, -192495, 162981, 90894, -97725, 82409, -341189, -176716, -153101, -195148, -130159, -112998, -122427, -75626, -85385, 76417, -188177, 40988, 46310, -74108, -70208, 83222, -573069, 389659, -96963, -13535, -111787, -172226, -202255, -58792, -287610, -104296, -106280, -75341, -80885, -59834, 66667, 156967, -135293, 143127, 195839, -2489, -140618, 56576, -14161, -81042, -224205, 222828, -75722, -187499, 93160, -311871, -299257, -357980]
11168c57980H1658a72965O6786q4560k42002M3106f3911b328m3028k91211a00561
11156a52150k75456B31273b17991A6123K14809a93551d2296A45145b1834m7317
11146f9151M359o0510H95O7742b34531B19394H7656B8204J28425a86182A26425
11134B71990C6030K94638e7727A66838a44707j55151M9452a10460A12507a16460
11123b1042J724C12762j43933e5202C9856J16855a6046A6480a38547r872k3140
11112a71559n0355F1503L6433a27576D0886J08784c2169D7137b36385B20496A04925
11100A14270m4772P7972Q373L01199j88247A32375b30378B39438G2010d4169A071
11088I1136J54486j16394J6408n170M35785G6053e608A18938P3360q8242J54450
$$ y = [-357980, 81658, -172965, -106179, -190739, -432741, -389635, -63911, -2328, -45356, -336567, -100561, -152150, -427606, 231273, -217991, 16123, 230932, -193551, -42296, 145145, -21834, -69151, -64792, -125302, 895, 68637, -234531, 219394, 87656, 28204, 156629, -186182, 126425, 271990, 36030, 330668, -57727, 166838, -144707, -299858, -250406, -110460, 112507, -116460, -21042, -19318, 312762, 168829, -55202, 39856, 156711, -16046, 16480, -138547, -148419, -171559, -221914, 61503, 97936, -127576, 40886, 149670, -32169, 47137, -236385, 220496, 104925, 114270, 69498, 147470, 155843, 457042, 268795, 132375, -230378, 239438, 72010, -44169, 1071, 91136, 245622, 129228, 145636, 140466, 576251, 76053, -5608, 118938, 192298, 104056, 258506]
11077B58506b34694I2927M2492O3183g8623E8891M39659A05866D8380L07442A37853
11065H2272O992P9020m1095R2742j6187P4520J23496J1963q6070r5393Q5751Q0575
11053C98586J10595l6754p0212q0563J76842j38201N87308l42921k28887L31720
11043G07513B20318K94043J51545A93951L4117M25971k85876L23589o9967j98787
11033D22998l1539j78320J91397O4222M16364C07002J18508J32878q6315j97110
11023B74963J90714J56264C02243N1346N6103K2076J99349J53476k87813p1170
11013D25610J44267B66843K54838k43877M2664G4737K50005J62919R9916m6066
11003E41511r7235A56235J55471O940J15094j76261M79757k20692n9801J76265
$$ y = [258506, -234694, 92927, 135419, 198602, -78623, 58891, 498550, 105866, 48380, 355822, 137853, 82272, 89264, 168284, 127189, 219931, 203744, 278264, 401760, 413723, 327653, 232260, 318011, 398586, 509181, 472427, 402215, 321652, 498494, 360293, 947601, 604680, 375793, 707513, 220318, 514361, 665906, 193951, 228068, 654039, 368163, 691752, 621785, 422998, 391459, 213139, 404536, 468758, 885122, 307002, 425510, 558388, 472073, 274963, 465677, 621941, 302243, 353589, 409692, 431768, 631117, 784593, 496780, 425610, 569877, 266843, 521681, 277804, 320468, 74737, 324742, 487661, 587577, 541511, 444276, 156235, 311706, 318646, 433740, 257479, 737236, 516544, 456743, 633008]
10993F33008R6683j49742k1835k19238n6843J65738K39286M8387L968k7736K46
10982G11922l00820L93410j36233n2584L51105R66k79017M18980k8368k98811
10972G80550N86006M17655l4548K05812J29454m0164n7766j68639k49295J57584
10962A726649O0427n56096j14884m4126K99265l91939J01894Q9704Q0869K3504
10952A275267J48678j26658j25055l39256P3610l16180N3265j19971m7271j37986
10942C38443o6191K1528j34779M1417N4882m2563H9555j9493L31682F6771j7880
10931D8891N4442a36065E25236b67791e7461I3316e1646C55198a29295d3652C1312
10919A11843a21977J6926A09745A9793a9159C903J65837a13794m483A93111F8909
$$ y = [633008, 729691, 579949, 558114, 338876, 282033, 447771, 687057, 735444, 739412, 711676, 711922, 411102, 804512, 668279, 615695, 966800, 967766, 688749, 1107729, 1079361, 780550, 1366556, 1784211, 1749663, 1955475, 2084929, 2044765, 1986999, 1818360, 1569065, 1726649, 1787076, 1230980, 1116096, 1071970, 1371235, 979296, 1081190, 1170894, 1251763, 1275267, 1423945, 1297287, 1172232, 832976, 906586, 590406, 643671, 523700, 476429, 338443, 272252, 293780, 159001, 200418, 255300, 212737, 89555, 70062, 401744, 66771, 48891, 103333, -136065, 525236, -267791, -57461, 93316, -51646, 355198, -129295, -43652, 31312, 111843, -121977, -105051, 109745, 19793, -19159, 3903, 169740, -113794, -118277, 193111, 68909]
10907A10037c4993D7588K79942h4423B28141e6718J718I5623c38212k3801A09579
10895e7596j78190Q9890B30780j08264E9049f988k6714o5531j27541K5235B8235
10883a32375k96609a75943h4836B15581E3597J41553F132b11451k8283P1983A75849
10871E7868L0644a56953d6270p3801G1082n330b37251P0447C3516L6977c7583
10859B23613a89626g4527C97260G1398D839a57743A8524R9557l3556P7115p7125
10848H4515b22102b3625j03464K8613A98287b78195d5187K1091A932K636J02778
10837A07346e2881m0878p900B39290b68593K5269n7365b2290n0878j81241a5340
10825a71294r9847J1085A11512J3942a71588A11856J18154c93652h0426G025J60340
$$ y = [110037, -34993, 47588, 327530, -84423, 228141, -56718, -55000, 95623, -338212, -362013, 109579, -57596, -235786, -145896, 230780, 122516, 59049, -6988, -33702, -99233, -226774, -201539, 28235, -132375, -428984, -175943, -84836, 215581, 53597, 195150, 6132, -211451, -239734, -167751, 175849, 57868, 88512, -156953, -46270, -120071, 71082, 65752, -237251, -166804, 33516, 70493, -37583, 223613, -189626, -74527, 397260, 71398, 4839, -157743, 18524, 118081, 84525, 161640, 84515, -222102, -23625, -127089, -98476, 198287, -278195, -45187, -24096, 1932, 4568, 107346, -52881, -93759, -101659, 239290, -268593, -243324, -300689, -22290, -73168, -254409, -15340, -171294, -271141, -260056, 111512, 125454, -171588, 111856, 230010, -393652, -80426, 7025, 167365]
10814A67365b38743c9175J4345N33j25467p3257p2446b9660j48860C07762E1497
10802e0489p3479k08437A71591f0323D1763b55328N6707N20a7137k43709J0008
10791b50838a11570E7246a77550p5509q6001B79903e6180J2689A1543a09432B0338
10779B04396a01421b840j36410o578D0712M1090e0699j81524b3059q27c083q9098
10767i2181A01940m6494D367O6789B427a29719d3661r5128N2691L6630A30640
10755G40b92262H4412j8808K2507J2643b77889J19634A13054J03747b85745e3973
10743E2576c20142J30375b8685k03669P0201O1464d6966D8151b3553l6641A21181
10731h7970B63310D9261K00430g1680J4605k0708B24273j8296i8574B7249c61770
$$ y = [167365, -238743, -39175, -24830, -24297, -149764, -223021, -295467, -29660, -178520, 307762, 51497, -50489, -123968, -332405, 171591, -60323, 41763, -255328, -198621, -198101, -17137, -260846, -250838, -111570, 57246, -177550, -253059, -339060, 279903, -56180, -43491, 11543, -109432, 20338, 204396, -101421, -2840, -139250, -145828, 40712, 81802, -50699, -232223, -23059, -23886, -3083, -92181, 101940, 55446, 4367, 71156, 2427, -129719, -43661, -138789, -86098, -49468, 130640, 740, -292262, 84412, 65604, 88111, 100754, -277889, -158255, 113054, 216801, -285745, -53973, 52576, -320142, -189767, -28685, -232354, -162153, -100689, -46966, 48151, -23553, -60194, 121181, -87970, 263310, 49261, 249691, -71680, -57075, -77783, 224273, 205977, -98574, 27249, -361770]
10719a6521j56953A24218A1092g7511j10995C925K67049G9203a80343j36020F603
10707B49254b00111B95452A7962b88280c4230C59147c5724j01777e5187l0702
10697h5889A3561d37460I090J62252B8048a8135m3610o7340c6921k50299A94732
10685a38889d5426r1924j12947i6564A41359g2723R891k03002D65813a10020j38861
10674b48881C29456A37061D3765i3412j9668D7723c9107J1043j95527C797N4466
10663E8263i336C8867J64395C2111d3640D25337a83072d4461B15914b54849B08298
10651b18098j41752a65195k866a707I8312b80224L4573A05124f8354B03025n7348
10640A45677e8002A93388o9502b60279b132k44794B01457C3699b62989B12979
$$ y = [-16521, -173474, 124218, 11092, -77511, -188506, 3925, 270974, 79203, -180343, -316363, 6603, 249254, -200111, 295452, 17962, -288280, -34230, 359147, -35724, -137501, -55187, -85889, 13561, -437460, 9090, 171342, 28048, -18135, -61745, -129085, -36921, -287220, 194732, -138889, -45426, -137350, -250297, -96564, 141359, -72723, -62832, -265834, 465813, -110020, -248881, 329456, 137061, 43765, -93412, -113080, 47723, -39107, -28064, -223591, 3797, 58263, -9336, 38867, 203262, 32111, -43640, 425337, -183072, -44461, 215914, -254849, 208298, -218098, -359850, -165195, -168061, -1707, 98312, -280224, -245651, 105124, -68354, 203025, 145677, -58002, 193388, 123886, -260279, -2132, -246926, 201457, 33699, -262989, 212979]
10629D0423b80529d6081r000K872j78067G0576J7627B9061a39913G3765b20941
10617b70952Q5801k26368D5988J66530d7601j48762B33926a50024j09786K1453
10607b38357h9559q7515j88869A88176o9678C0675b72642A98037a62117L9480
10597a22637G9593c87193J88597A37165a16075I5723N0123b6677j97136A59136
10586C5378b60962i7807k8404P207K6580l51752B84338a08560A68407r27b74083
10574A87439C8270Q7950J0186n0323J05654a24021k39136C30961a5048l0461j44957
10563a90466R5d0255C16899l51a98191k38960J61713A1957b71562j28546e3965
10551a77465G856a15354j63051A5222b98782A3887J0760a86012G9480a17706F1350
$$ y = [40423, -280529, -46081, -55081, -52209, -230276, 70576, 88203, 29061, -139913, 73765, -220941, -270952, -185151, -411519, 45988, 212518, -47601, -196363, 233926, -150024, -259810, -238357, -89559, -177074, -365943, 188176, 118498, 30675, -272642, 198037, -162117, -122637, 79593, -387193, -198596, 137165, -116075, 95723, 145846, -26677, -223813, 159136, 35378, -260962, -97807, -126211, -119004, -92424, -444176, 284338, -108560, 168407, 167480, -274083, 187439, 38270, 126220, 136406, 86083, 191737, -124021, -363157, 330961, -15048, -45509, -190466, -190371, -40255, 316899, 316548, -198191, -437151, -275438, 11957, -271562, -400108, -53965, -177465, 7856, -115354, -278405, 15222, -298782, 13887, 24647, -186012, 79480, -117706, 61350]
10539b38263i4584E8978c60839I8757d02691A50816N8645c9177a550r6256k42584
10528c40390H3721J81443a66824j22836A53414a07480d9045C0099j2949b45268
10517b86291C6968J37040d53963a95953b8824o6819a4870k46834B78103a11600
10506A38392f9322A66119f6125K8737n7499b2166A81208L7764c66583J33835P4442
10495a58306h096A60000o8751m3434J08342d4832j4551l0652k86521a24166D3462
10483B90055p4696G639g054q7923c6972E417a3970H8911c08119B76573l2562M1047
10471B85058Q287J215H3077K23237r4278b54332B37824a13549j6974G2679b28614
10459f2123j28179b7879p4182F0901J39988a92479f1726r251C0220m777c19483
$$ y = [-238263, -94584, 58978, -360839, 98757, -402691, 150816, 209461, -39177, -1550, -97806, -340390, 83721, 265164, -166824, -289660, 153414, -107480, -49045, 30099, 17150, -245268, -286291, 36968, 174008, -453963, -195953, -28824, -95643, -14870, -261704, 278103, -111600, 138392, -69322, 166119, -66125, -37388, -94887, -22166, 181208, 218972, -366583, -232748, -158306, -8096, 160000, 91249, 47815, 156157, -44832, -59383, -90035, -376556, -124166, 43462, 290055, 215359, 7639, -7054, -94977, -36972, 5417, -13970, 88911, -308119, 276573, 244011, 285058, 293345, 294560, 83077, 306314, 212036, -254332, 237824, -113549, -130523, 72679, -228614, -62123, -190302, -27879, -102061, 60901, 200889, -192479, -61726, -70977, 30220, 25443, -319483]
10447b41975g627r7891A82845J35813a69685C4622a08180j30214A58657D8887
10436g6274n1714g053j00234K7730I6736A2044h8604p7975E1316a67756A33771
10424b32415B08234b26517A3387b56193B37722h8323D519c93266E1366L6232b93928
10412a8050o4772l52230G9967k2815a93455A03754a41854k02307g2651n8784c5089
10400c58974a01447M3003A35147a67650e7445G0947a83715l1116j66164B02164
10389a09491F7475l1984C003a77125a9611A92845i9366A16607a27201A33603e8406
10377C444a25291A03096K28982I3308L0477a9148k36369B4589M08695I0376L25698
10366D16074A24752L39832j86915k7341p1930O3960r7743L8302q1516o207J36341
$$ y = [-241975, -7627, -105518, 182845, 318658, -169685, 34622, -108180, -238394, 158657, 48887, -76274, -127988, -7053, -107287, -79557, 96736, 12044, -88604, -166579, 51316, -167756, 133771, -232415, 208234, -226517, 13387, -256193, 237722, -88323, 4519, -393266, 51366, 87598, -293928, -18050, -82822, -435052, 79967, 57152, -193455, 103754, -141854, -344161, -72651, -131435, -35089, -358974, -101447, -58444, 135147, -167650, -57445, 70947, -183715, -214831, -380995, 202164, -109491, 67475, 35491, 3003, -177125, -19611, 192845, -99366, 116607, -127201, 133603, -58406, 3444, -125291, 103096, 332078, 93308, 123785, -19148, -255517, 24589, 433284, 90376, 416074, 124752, 464584, 277669, 250328, 178398, 242358, 144615, 182917, 101401, 95194, 231535]
10355B31535F6311d77B13875c3432A57512O4771I1480L29058J62083B64909J89185
10344D54094q5231A5990J4286M16354j98076r8451N9056N6673n1253M5646A08473
10332B83319r5243J03965g6845B93169a06136d9689H956l948P7024K00358A11283
10320A57881o7021a03264E9695j8784Q2003R6669D0250M03648b2117j15503B06361
10308a94823n5271J22932A3223b25897f954F1492J09824F8867f5200B14492g7528
10296d747j88764A12883d14772a15864k69214A19040d6276r6605A27307a39202
10285a36913j75093a49252B14868a6715C0259e0971l8449A3142Q7890b39855j49195
10274c89050I2954l6235a32827l222N3384A0943h5143I5107b6252l3594A00959
$$ y = [231535, 66311, -477, 213875, -33432, 157512, 222283, 91480, 420538, 582621, 264909, 454094, 368863, 15990, 30276, 446630, 248554, 150103, 209159, 265832, 214579, 260225, 108473, 283319, 188076, 292041, -76845, 293169, -106136, -49689, 8956, 5008, 82032, 282390, 111283, 157881, 90860, -103264, 59695, 40911, 122914, 219583, 40250, 443898, -22117, -137620, 206361, -194823, -250094, -127162, 13223, -225897, -6954, 61492, 171316, 68867, -65200, 214492, -77528, -4747, -193511, 112883, -414772, -115864, -385078, 119040, -46276, -142881, 127307, -139202, -136913, -312006, -149252, 214868, -16715, 30259, -50971, -89420, 13142, 101032, -239855, -389050, 92954, 56719, -132827, -136049, -82665, 10943, -85143, 95107, -26252, -59846, 100959]
10262a16171o6176d5400l1088j32816B10275a9877j02322a5816B31808K39098
10252D70906A73121L44766r9745a67780A41115k322a07858j7840c5777B1957a26337
10240B19480l0695o4763d5909o137j75105a10268j18407J09994A34546n5308b04133
10228A3312c37743m2605H4384a07634K7850r9272O8694c2274m4024L7174j05942
10217a45066j46262a2762l05989E0966J71650C7099J23991L585b47284A45683
10206a49956A08413a70016c3155l94927h7734B68202G6756b17161h8694J9202
10196f9492I5600a41145o916F1854e4068n01647A67451p2014b21378k12164I5156
10184D8215a87528j33541a57198B37579a06051m152M5782A77874b29730q8227
$$ y = [-116171, -182347, -45400, -76488, -209304, 210275, -19877, -122199, -15816, 231808, 470906, 173121, 517887, 418142, -167780, 141115, 138793, -107858, -125698, -35777, 21957, -126337, 219480, 188785, 124022, -45909, -52046, -227151, -110268, -228675, -118681, 134546, 79238, -204133, 13312, -337743, -380348, 84384, -107634, -79784, -179056, -110362, -32274, -76298, -39124, -145066, -291328, -12762, -318751, 50966, 222616, 37099, 161090, 164675, -247284, 145683, -149956, 108413, -170016, -33155, -428082, -87734, 268202, 76756, -217161, -88694, -69492, 95600, -141145, -148061, 61854, -54068, -555715, 167451, 95437, -221378, -433542, 95156, 48215, -187528, -321069, -157198, 237579, -106051, -110203, -64421, 177874, -229730, -317957]
10174c17957o5048a87652L1394a082k42802O2128A72516b14957m3950C9057j7962
10163B1095e3988k05969A10112k186n5D8148l85a6272r2287c3657A88864b30000
10150H9578j3187k6208i462k06681a5342k08228P7567j45403A75308a32890A9550
10138c29899J7889b9408k27624J07734A61527a66478d924j10873j42698A21476
10127c7524j80664e209j05121A11987e7428A22645a97281R7048b0771A95027c3448
10115a58030G7689B2951b12929a02636a0410q2417C23981a65386B7799A0711L229
10104A3940a79601B9919b68019g1661G2375d50103A95148F1565f7555j08380r0685
10093b66620O2328j0794a8365n7444q2461r2941a53C19781I7417b3497J0826A26113
$$ y = [-317957, -383005, -187652, -156258, -1082, -243884, -181756, 172516, -214957, -258907, 39057, 21095, -53988, -259957, 110112, 107926, 107871, 48148, 47763, -16272, -108559, -33657, 188864, -230000, 89578, 76391, 50183, -9462, -216143, -15342, -223570, -146003, -291406, 175308, -132890, 19550, -329899, -312010, -29408, -257032, -149298, 161527, -166478, -4924, -115797, -258495, 121476, -37524, -218188, -5209, -110330, 111987, -57428, 122645, -197281, -100233, -20771, 195027, -33448, -158030, 77689, 22951, -212929, -102636, -10410, -92827, 323981, -165386, 27799, 10711, 13940, -179601, 29919, -268019, -71661, 72375, -450103, 195148, 61565, -67555, -175935, -266620, -204292, -215086, -18365, -75809, -158270, -251211, -153, 319781, 97417, -23497, -12671, 126113]
10080G8180b97p9876p867L0036A24568b37527G0103a63904g9961p6185e1223j9874
10068g1097A75702d4245a2109o5257b6387A13034a21176j64984a28849A58716
10057a6131E9489b50068a07799H1961c41305J43215m2077d341A23011a51036E0720
10045E3708C338h086k06668i3000n2395c1688g288B60517b14951B11631c9809
10033a90968N6430i287A91643a18630E2183c9284F926d37886a08701H5044K71028
10022C56072a21783d6169k5680k41856p442G9243b82242O6441i4815i263j52100
10011a61363A883a52645m3729j2353f9704A4309J06521e0464C9875a65131a3598
9999H7430N6460B422a03175k02110G796g8464n1235l750B19842a23676b4580a866
$$ y = [78180, -297, -80173, -88040, -58004, 124568, -237527, 70103, -163904, -79961, -156146, -51223, -71097, 175702, -44245, -12109, -77366, -26387, 113034, -121176, -286160, -128849, 158716, -16131, 59489, -250068, -107799, 81961, -341305, -198090, -240167, -4341, 123011, -151036, 50720, 53708, 3338, -8086, -214754, -93000, -145395, -31688, -7288, 260517, -214951, 211631, -39809, -190968, -134538, -9287, 191643, -118630, 52183, -39284, 6926, -437886, -108701, 85044, 356072, -121783, -46169, -71849, -313705, -321147, 79243, -282242, -215801, -94815, -9263, -161363, 1883, -152645, -196374, -208727, -69704, 14309, 120830, -50464, 39875, -165131, -13598, 87430, 143890, 2422, -103175, -305285, 7796, -78464, -129699, -133449, 219842, -123676, -24580, -1866]
9986f5998j39757h0592n6388m716j11949J15548B64621I3872M1898a91931A08676
9974B2255d3730A01917h8321k47941J07252A4193Q8377b29628O7358d5687H6589
9962A7373L57897j34820d71145D4340b9168j97380J09929d1008j59959Q0947C29771
9950d6406k57719J19084k18824a60737A54346G0004N4056h814j46980B19652c14589
9938A64661F7702n408a2537A65389b21285b4529m00366j40013a54154E0200L3073
9927H3273d6666j15661b0814o1056j60411j15856j20809A21253d25277a82092
9916B31387b98817e0755l45615C48598I845b68584a04216O531C492O1876k0701
9905D4667k1886a73347n3851e3838E5774a56070G0675c34724e3695I4759a95105
$$ y = [-65998, -205755, -80592, -136980, -141696, -253645, -138097, 264621, 93872, 135770, -191931, 108676, 22255, -43730, 101917, -88321, -336262, -229010, 14193, 102570, -229628, -162270, -45687, 86589, 17373, 375270, 240450, -471145, 44340, -29168, -226548, -116619, -41008, -200967, -120020, 329771, -46406, -304125, -185041, -403865, -160737, 154346, 70004, 124060, -8814, -155794, 219652, -314589, 164661, 67702, 62294, -12537, 165389, -221285, -24529, -424895, -564908, -154154, 50200, 83273, -46666, -162327, -20814, -81870, -242281, -358137, -478946, 121253, -425277, -182092, 231387, -298817, -50755, -396370, 348598, 9845, -268584, -104216, -97685, 3492, 65368, 44667, 22781, -173347, -227198, -53838, 55774, -156070, 70675, -334724, -53695, 94759, -195105]
9893a45303D4382J89889A11243b01919A44806n1884b35064i0359B36513b91537
9882a79942l7764A31911a5284k474q2239o2127J0699A25068a59873q6635j30070
9871c76578a81262N2563H3980a38955k15178j1036A32968c01353D635b54596A58423
9859E6081g2173j43117b7087k5745N945j8199A14292f9027K8732j04534b366l10886
9847c13252A89182e3498B40093B3117K08920a94340f9381n1809j0839l2376M3975
9836a20430b1996a657q6806B38331c6547l98264F467a41973j01833C3082K5289
9825E8371b51508a16471l4121k91441A17748a97142N5578k4143B6442i7865k9722
9814a27587A15893c40554h0196l2981M6939E0149c33381F375b41156i9721j78143
$$ y = [-145303, 44382, 234271, 111243, -201919, 144806, 92922, -235064, -90359, 236513, -291537, -179942, -217706, 131911, -15284, -17758, -99997, -162124, -151425, 125068, -159873, -246508, -376578, -181262, -128699, 83980, -138955, -354133, -365169, 132968, -301353, 4635, -254596, 158423, 56081, -72173, -215290, -27087, -52832, -46887, -65086, 114292, -69027, -40295, -144829, -2366, -313252, 189182, -53498, 240093, 23117, 232037, -194340, -69381, -121190, -132029, -164405, -120430, -21996, -1657, -88463, 238331, -36547, -434811, 6467, -141973, -243806, 33082, 58371, -251508, -116471, -150592, -442033, 117748, -197142, -141564, -165707, 26442, -97865, -127587, 115893, -340554, -80196, -113177, -66238, 50149, -333381, 6375, -241156, -99721, -277864]
9803b77864A62891a42718j42116c161A13124a7166n9784A60174g0073n0827B0314
9791A38474L703a74759D3903g5747A60334o4906a10181l8470B93886c1983p0691
9780a02674r0191f416p6395C37755c24797i8922p5731P8379o4993m3203A24466
9768b83611f470n3495r1999j10190a29259k5401e5567I9143C0641e4662K57q5569
9756a39974f9916l2444Q944p0071j41028g3527B15565a45956k8237C7177L1458
9745F8635c8138B37625C6239b29492j74039o838a1263j90332d3877C7233b07491
9733B09889J04051a26138J2871o4110l4708g5874H0069P1191C7116e7480k12919
9722b70399F3003a99068C9206N645e5389j13147A13372b14682m2649P9804g8220
$$ y = [-277864, 162891, -142718, -284834, -3161, 113124, -17166, -76950, 160174, -70073, -120900, 20314, 138474, 142177, -174759, 43903, -75747, 160334, 95428, -110181, -148651, 293886, -31983, -102674, -192865, -6416, -82811, 337755, -324797, -98922, -174653, -96274, -161267, -204470, 124466, -283611, -6470, -59965, -151964, -262154, -129259, -154660, -55567, 99143, 30641, -54662, -54405, -139974, -69916, -102360, -93416, -163487, -304515, -73527, 215565, -145956, -174193, 37177, 68635, -38138, 237625, 36239, -229492, -403531, -410369, -11263, -201595, -43877, 37233, -207491, 209889, 313940, -126138, -113267, -177377, -212085, -75874, 80069, 151260, 37116, -57480, -270399, 63003, -199068, 39206, 44851, -55389, -168536, 113372, -214682, -257331, -177527, -78220]
9710b635j06406N4092k42057A00441b16345f1229o2378p2037E3502e9860I6325
9698d4301r6892m6430B5776a57251N02j13369C63609b6873l18065d3751F0873
9686E2309K351J52161b47171i4576G0511J87616i3902a0607A85551e541m60152
9675d65693K14905O3554k3050N0356j6201f0122j4608O877A74090c42229M788
9664c37441a18832A31254d27332A3393J64217a33676p5236c1408B2463f9455B75947
9652a50095j13880F7448P176O0970b00149R5912A48083a25925C26999b09071n6422
9641b65493H1931c29228D773a75410j6230j13E0275M9277b08213l32781G2927
9629A2400J19870a85641g7023j99691D9211B2408b15709E2557P9984a470l22160
$$ y = [-2635, -109041, -54949, -297006, 100441, -216345, -61229, -123607, -195644, 53502, -59860, 96325, -44301, -141193, -187623, 25776, -157251, -156749, -270118, 363609, -26873, -344938, -43751, 60873, 52309, 54660, 206821, -247171, -94576, 70511, 258127, -93902, -10607, 185551, -5541, -465693, -250788, -187234, -210284, -159928, -176129, -60122, -74730, -67853, 174090, -342229, -337441, -118832, 131254, -427332, 13393, 177610, -133676, -208912, -31408, 22463, -69455, 275947, -150095, -263975, 67448, 74624, 135594, -200149, -104237, 148083, -125925, 326999, -209071, -265493, 81931, -329228, 4773, -175410, -191640, -191753, 50275, 99552, -208213, -540994, 72927, 12400, 132270, -185641, -77023, -276714, 49211, 22408, -215709, 52557, 132541, -1470, -323630]
9618c23630i8306A74074b77295j81203H4232R9800a8085k6857M86C2276b89880
9606F5598b9478E80g0754J8685A40756l1348a31631G1389a55399l19418J95708
9595b79109C92288d890F0705b68236O1823j24128a47977N948G218b4055j90026
9584b14081b5239r6321k31984i0064c2059C6194J74749a82289c1558A21749b69242
9572A65106a05983a7146G6136a18933j21305J04775k20797a34977p0510k04044
9562d09531E3643J9402Q7923d36196e9951j69598c2482p0925F3921J01495i3943
9550B7484A1782c06260c6068o5597o3513O7902j88044A08875e0734C9907c59577
9538E7113a41059N9376j0615l1253c9807B43372a92659M1941A4764c31688a38771
$$ y = [-323630, -98306, 174074, -277295, -458498, 84232, 184032, -18085, -44942, -44456, 32276, -289880, 65598, -29478, 580, -70754, -52069, 140756, 109408, -131631, 71389, -155399, -474817, -279109, 392288, -4890, 60705, -268236, -206413, -330541, -147977, -142029, 7218, -24055, -214081, -25239, -121560, -353544, -90064, -32059, 36194, 210943, -182289, -31558, 121749, -269242, 165106, -105983, -17146, 76136, -118933, -240238, -135463, -356260, -134977, -205487, -409531, 53643, 73045, 160968, -436196, -59951, -229549, -32482, -103407, 63921, 165416, -93943, 27484, 11782, -306260, -36068, -101665, -165178, -97276, -285320, 108875, -50734, 39907, -359577, 57113, -141059, -81683, -92298, -123551, -39807, 243372, -192659, -150718, 14764, -331688, -138771]
9526G4126j6837a70868F2984k771f6175j2030C9834a02037q0991A36982b69207
9514C3687a22529N9826j693k70073P2848E8102A9214J6728f5529B42271a17798
9502H4458f831l34557D349Q732b63363C5140b42857P8929j14613D6075a07078
9490h0159q1977o7993i9716F6325A8364N2324b47232a03774j5072J8540q365b4689
9477F0854f2440A6071e2574k11854A45595D0259b02557F1444g6873k60060a66405
9465h9525m2969f5849K0542k00604e0969j19970I9971h1845k05399A80280f7443
9453d3945A77467b04075P9513C9884O6682Q9577b42723R5231a8426l58882c977
9441a26457r8453K5570R7684j2826C26454F9970Q7118o9404a75574P8918J9890
$$ y = [74126, 57289, -170868, 62984, 60213, -66175, -78205, 39834, -102037, -183028, 136982, -269207, 33687, -122529, -62703, -64396, -334469, -261621, 58102, 19214, 35942, -65529, 242271, -117798, 84458, -6831, -341388, 4349, 13081, -263363, 35140, -242857, -163928, -278541, 46075, -107078, -80159, -162136, -230129, -99716, 66325, 18364, 70688, -247232, -103774, -118846, -100306, -108671, -24689, 60854, -62440, 16071, -52574, -264428, 145595, 40259, -202557, 61444, -76873, -336933, -166405, -89525, -132494, -65849, -45307, -245911, -50969, -170939, 99971, -81845, -287244, 180280, -67443, -43945, 177467, -204075, -124562, 39884, 106566, 196143, -242723, -147492, -18426, -377308, -3977, -126457, -224910, -199340, -101656, -114482, 326454, 69970, 157088, 87684, -175574, -96656, -76766]
9430g6766A75300K9922a01611C16c05683a49650L3434A15682b04514P2609I0782
9418b89381p760B6931M6194j753a7685r9108M182k51926C0950i0218o8590d979
9405G9131A3795J80791E2460J48891c4183k30401Q495E2178L31295g6921n522
9394h2443J0156B00176c14573B16563A792K6690e4228l59789C69353a35967J6380
9383a19587A89885h1292D0153g7077c0340D6483a35177n2096e4533A9094a61140
9371c2730j15066l3735B5169d520B07562O2212a527j15631b3131n8761B02750
9359A23582b1243j60207P4685A57427b51106f6872j61883b5079j50046g9733a781
9347a86698o8536h8156B25035a27652o7330d887G7217a06955B00141h9318A16627
$$ y = [-76766, 175300, 205222, -101611, 316, -305683, -149650, -116216, 115682, -204514, -131905, 90782, -289381, -297141, 26931, 73125, 71372, -17685, -116793, -112611, -364537, 30950, -90218, -158808, -4979, 79131, 13795, 194586, 52460, 201351, -34183, -264584, -256089, 52178, 383473, -76921, -82443, -72287, 200176, -314573, 216563, 1792, 28482, -54228, -414017, 369353, -135967, -119587, 189885, -81292, 40153, -77077, -30340, 46483, -135177, -187273, -54533, 19094, -161140, -32730, -147796, -181531, 25169, -4520, 207562, 269774, -1527, -117158, -23131, -81892, 202750, 123582, -21243, -181450, -106765, 157427, -251106, -66872, -228755, -25079, -175125, -79733, -1781, -186698, -255234, -88156, 225035, -127652, -194982, -4887, 77217, -106955, 200141, -89318, 116627]
9335a64563O4534A29937d8617B73023A35969c8690C4435b42276e1764n3247n9465
9324a64476d540l17434a39968A61070o9562a25715e6209j14160B29097O1022e937
9312A8298Q5658Q3737F1832c5673j96667b2165A71862F9663b28362h7456o437
9301i3893k40757f9507B70552a38230k02960d1516A31057R1427b41214j39938
9291c81152N621b4280k8617A11102a71292m2751p9903d6804j85926J03740j35862
9280b64852a20944k95810f6567A86694c17032A4698J11814i1309G3226a04445
9269A35606i8728q1126A66348m6387c2328q7269I8994a85092d1031l3141j69682
9258b43854d3051j6235j02787L5573e8933j47561N0160A7187b97900A96966a87512
$$ y = [-164563, -100029, 129937, -48617, 273023, 135969, -38690, 34435, -242276, -51764, -105011, -164476, -4540, -321974, -139968, 161070, 91508, -125715, -56209, -170369, 229097, 290119, -5937, 18298, 103956, 187693, 61832, -35673, -232340, -22165, 171862, 69663, -228362, -87456, -93893, -334650, -69507, 270552, -138230, -341190, -41516, 131057, 222484, -241214, -381152, -375531, -24280, -52897, 111102, -171292, -214043, -293946, -46804, -232730, -128990, -264852, -120944, -416754, -66567, 186694, -317032, 14698, 126512, -91309, 73226, -104445, 135606, -98728, -179854, 166348, 119961, -32328, -119597, 98994, -185092, -41031, -74172, -243854, -43051, -59286, -162073, -126500, -58933, -206494, -156334, 17187, -297900, 196966, -187512]
9246a77563A31727b6513m9505k70767F3562a10825A36114a04991k35220J10749
9236b29462g6231E7688L644e3638b6607B79900c7279A212M087O6168c46052J53655
9224a92397A33769P448A5283P11c96737a59975c5801a3964j18353k97568a25638
9212B3276M5897a24087j3466e955m7780A03390a41964M1749p5335j40872J48211
9201a68211O2360k17705b3107k0824C47004h8244C32704g7281m9395M5122j52807
9190b34361J09604A2695M3339e4196A59794P4599a84501j00753C8634f6476A9931
9178a30627g941j85021c4202I9112a35293H5817g0205A2318O3491N2243c0101
9166h057k39376F5351a12523I6226g848B24546a53828k61809b9776C9190A3610
$$ y = [-177563, 131727, -26513, -76018, -346785, 63562, -110825, 136114, -104991, -340211, -229462, -76231, 57688, 61332, -53638, -26607, 279900, -37279, 1212, 5299, 71467, -346052, -192397, 133769, 141217, 15283, 15994, -396737, -159975, -35801, -13964, -132317, -429885, -125638, 23276, 69173, -124087, -137553, -5955, -53735, 103390, -141964, -100215, -175550, -316422, -168211, -105851, -323556, -23107, -43931, 347004, -88244, 332704, -77281, -126676, -81554, -234361, -124757, 12695, 56034, -54196, 159794, 234393, -184501, -285254, 38634, -66476, 19931, -130627, -7941, -192962, -34202, 99112, -135293, 85817, -70205, 12318, 75809, 128052, -30101, -8057, -247433, 65351, -112523, 96226, -7848, 224546, -153828, -415637, -29776, 39190, 13610]
9154b59968B65850i8324b0009A22759b26472j80400a26176j65707R5836A70202
9143a67432j6102n6475a04455j64914f8139r5415o4866A23225a17165k78019G5086
9131h1858m14462b26299O4292q991j20437A47577J98564b44538R6332K5401o4649
9120a87454A13831d5637B613P7824a25521f0554c587F0593a05236A71657m667
9109A66990a01124j208G538P1615A3803h6593j76678M4508A62978b35474f8275
9097g4300B20024k0482C4345a89218B75754b46249g620l02260g3334l12863a31284
9085a10644A12688b24704G0943l2176a03764d7211k1877A64832c10915D8382J66571
9074B14953g3779j78993Q1283r491C9258J06733a94545L0513a0877C4042a45354
$$ y = [-259968, 265850, -98324, -20009, 122759, -226472, -406872, -126176, -291883, -196047, 170202, -167432, -183534, -240009, -104455, -269369, -68139, -163554, -228420, 123225, -117165, -395184, 75086, -81858, -496320, -226299, -162007, -170998, -291435, 147577, 346141, -244538, -148206, -122805, -187454, 113831, -45637, 2613, 80437, -125521, -60554, -3587, 60593, -105236, 171657, 166990, -101124, -102332, 7538, 79153, 13803, -86593, -263271, -218763, 162978, -235474, -68275, -74300, 220024, 199542, 34345, -189218, 275754, -246249, -7620, -309880, -73334, -386197, -131284, -110644, 112688, -224704, 70943, 38767, -103764, -47211, -69088, 164832, -310915, 48382, 214953, -73779, -252772, -171489, -180980, 39258, 145991, -194545, -164032, -10877, 34042, -145354]
9062a38227A61475B48J05982d09047a44130A10053h8608F8567K2002f2558R282
9051e3276r6291q7206M398Q5139B1836D726b80124C5760a01B59755f7584k28424
9039b96008C2599J06519b38942O6522A52651a50164A08406F355L48064A02156
9028d5728B40040b20592B87451A6511b51965i5086j4015C999J7141N1682R1174
9017A63996J6752a92309d4891r2808N9394c5605A1082Q4084b6157n19801A91225
9005a69421O8766C5402L1123a49457l2771e1846J0738r8001C8308b40143M3613
8994a96530B81792A03851a80480D00104j45087a88872f9607q3852E4302b68495
8983A90772E5c49966c0319D4894a25623B4038J77067b37281R9121e681A09450
$$ y = [-138227, 161475, 248, 106230, -409047, -144130, 110053, -88608, 68567, 90569, -62558, -53276, -149567, -236773, -232375, -147236, 21836, 4726, -280124, 35760, -101, 259755, -67584, -296008, 32599, 139118, -238942, -172420, 152651, -150164, 108406, 6355, 354419, 102156, -45728, 240040, -220592, 287451, 16511, -251965, -95086, -109101, 3999, 21140, 72822, 163996, 180748, -192309, -44891, -137699, -78305, -35605, 11082, 95166, -26157, -545958, 191225, -169421, -100655, 35402, 66525, -149457, -182228, -51846, -41108, -139109, 38308, -240143, -196530, 281792, 103851, -180480, 400104, 255017, -188872, -69607, -153459, 54302, -268495, 190772, 55, -349966, -30319, 44894, -125623, 24038, 201105, -237281, -138160, -5681, 109450]
8971H5023c60502b2812c753a789j24364H3255g494k46290a07204q3058H5930i2088
8958H9529c39193i8433n7517H8745a36389e2279n8843e4857J5883c507I2056c2358
8945a39256B0506d744A32064b6864j33790r6279f2549k7207C18779b31407A57813
8933a40591q053C63780L741d029F5409J0724A6540d5623j1641B66692A04338L29983
8921D34321K64845J835559R429055J45463C180802A154498C66996l1073j13679
8912B22244E1586a9183F0605K34838a52116H2911J03730J40302j47199c05600
8901A05786J43890a72584c2555B38282i074m6625l44310D6594i0430o951L1317
8890f6064D1771h165j26451A4586P9759L3462Q0127c0425r1297A34124h3352A34502
$$ y = [85023, -360502, -22812, -3753, -1789, -126153, 83255, -7494, -253784, -107204, -190262, 85930, -92088, 89529, -339193, -98433, -155950, 88745, -136389, -52279, -111122, -54857, -38974, -3507, 92056, -32358, -139256, 20506, -4744, 132064, -26864, -160654, -256933, -62549, -89756, 318779, -231407, 157813, -140591, -148644, 363780, 367521, -4029, 65409, 76133, 16540, -45623, -57264, 266692, 104338, 434321, 699166, 2534725, 11963780, 12109243, 3180802, 1154498, 366996, 335923, 222244, 51586, -19183, 60605, 295443, -152116, 82911, 186641, 326943, 179744, -305600, 105786, 249676, -172584, -32555, 238282, -9074, -55699, -400009, 46594, -90430, -97381, -66064, 41771, -8165, -134616, 14586, 94345, 127807, 207934, -30425, -121722, 134124, -83352, 134502]
8877H821c75030a80568g7523l43743A23726c12195b2203k31867A54899k2426B883
8865a34737B25264A05405a67183A60786a70399n2228k97727A1778a62257I5493
8854a27176k5823f5546D2884i3894j83547a01317M5965C4703c6778j53277Q8416
8843a01639B78597h4589j533A023b76002A6630i46B8827g062G699J76433b61010
$$ y = [8821, -375030, -180568, -77523, -421266, 123726, -312195, -22203, -254070, 154899, 132473, 2883, -134737, 225264, 105405, -167183, 160786, -170399, -222627, -520354, 11778, -162257, 95493, -127176, -152999, -65546, 42884, -93894, -277441, -101317, -55352, 34703, -36778, -190055, -101639, 278597, -84589, -86122, 1023, -276002, 16630, -946, 28827, -7062, 7699, 184132, -261010]
$$ [...]
##END NTUPLES=NMR SPECTRUM
##END=
