
##TITLE=AC1347_GUAAH12165_6647600_VdxQAAQbsf
##JCAMPDX= 6.0         $$ Bruker NMR JCAMP-DX V2.0
##DATA TYPE= NMR SPECTRUM
##DATA CLASS= NTUPLES
##ORIGIN= BRUKER
##OWNER= Administrator
$$ 1.72 TOPSPIN		Version 2.1
$$ 2012-08-10 17:02:18.171 -0500  Administrator@TOPSPIN
$$ Compression mode = diff/dup
##.OBSERVE FREQUENCY= 400.02188249412
##.OBSERVE NUCLEUS= ^1H
##.ACQUISITION MODE= SIMULTANEOUS (DQD)
##.ACQUISITION SCHEME= undefined
##.AVERAGES= 4
##.DIGITISER RES= 22
##SPECTROMETER/DATA SYSTEM= spect
##.PULSE SEQUENCE= noesygpps1d.comp
##.SOLVENT NAME= COFFEE_meoh
##.SHIFT REFERENCE= INTERNAL, COFFEE_meoh, 1, 14.96277
##AUDIT TRAIL= $$ (NUMBER, WHEN, WHO, WHERE, PROCESS, VERSION, WHAT)
$$ ##TITLE= Audit trail, TOPSPIN		Version 2.1
$$ ##JCAMPDX= 5.01
$$ ##ORIGIN= Bruker BioSpin GmbH
$$ ##OWNER= Administrator
$$ $$ C:\Bruker\TOPSPIN/data/COFFEE/nmr/AC1347_GUAAH12165_6647600_VdxQAAQbsf/12/pdata/1/auditp.txt
$$ ##AUDIT TRAIL=  $$ (NUMBER, WHEN, WHO, WHERE, PROCESS, VERSION, WHAT)
(   1,<2012-08-10 17:00:36.421 -0500>,<Administrator>,<TOPSPIN>,<go>,<TOPSPIN 2.1>,
      <acquisition in progress>)
(   2,<2012-08-10 17:02:13.140 -0500>,<Administrator>,<TOPSPIN>,<proc1d>,<TOPSPIN 2.1>,
      <Start of raw data processing
       efp LB = 0.3 FT_mod = 6 PKNL = 1 PHC0 = 0 PHC1 = 0 SI = 128K 
       data hash MD5: 128K
       44 09 B6 E6 47 C9 1A 07 F7 3F 01 27 92 E3 05 0D>)
(   3,<2012-08-10 17:02:14.578 -0500>,<Administrator>,<TOPSPIN>,<proc1d>,<TOPSPIN 2.1>,
      <pk PHC0 = 0.8459473 PHC1 = 0 
       data hash MD5: 128K
       20 78 EA 3D 7B 6B D2 63 84 C2 A5 6C 97 EC 71 69>)
(   4,<2012-08-10 17:02:15.734 -0500>,<Administrator>,<TOPSPIN>,<proc1d>,<TOPSPIN 2.1>,
      <abs ABSG = 1 
       data hash MD5: 128K
       FA 29 46 D2 A2 9D 0E 87 93 03 A4 FC 48 66 36 DF>)
(   5,<2012-08-10 17:02:16.218 -0500>,<Administrator>,<TOPSPIN>,<proc1d>,<TOPSPIN 2.1>,
      <abs ABSG = 2 
       data hash MD5: 128K
       77 89 41 0D AB 82 F2 AC 83 BA 11 CD 60 C1 A5 53>)
(   6,<2012-08-10 17:02:16.703 -0500>,<Administrator>,<TOPSPIN>,<proc1d>,<TOPSPIN 2.1>,
      <abs ABSG = 3 
       data hash MD5: 128K
       CC FA E0 E7 3B FE AA 62 DC 65 AC AC 7D 1A 48 5A>)
(   7,<2012-08-10 17:02:17.203 -0500>,<Administrator>,<TOPSPIN>,<proc1d>,<TOPSPIN 2.1>,
      <abs ABSG = 4 
       data hash MD5: 128K
       22 8E 4A 64 56 42 3B CD 7D D5 88 74 E9 86 F8 6D>)
(   8,<2012-08-10 17:02:17.671 -0500>,<Administrator>,<TOPSPIN>,<proc1d>,<TOPSPIN 2.1>,
      <abs ABSG = 5 
       data hash MD5: 128K
       01 7E BA 9B 2C 9D 0F 33 E2 57 A1 2E 33 16 71 2A>)
$$ ##END=
$$ 
$$ $$ hash MD5
$$ $$ 12 08 36 B3 7B A9 F3 59 DB D8 11 1C 2F 1A BA E3
##$RELAX= 
##$RELAX= 
##$RELAX= 
##$RELAX= 
##$RELAX= 
##$RELAX= 
##$RELAX= 
##$RELAX= 
$$ Bruker specific parameters
$$ --------------------------
##$DU= <C:\Bruker\TOPSPIN>
##$EXPNO= 12
##$NAME= <AC1347_GUAAH12165_6647600_VdxQAAQbsf>
##$PROCNO= 1
##$TYPE= <nmr>
##$USER= <COFFEE>
##$ACQT0= -6.45039492598131
##$AMP= (0..31)
$$ [...]
150 150 150 150 150 150 150 150
##$TP07= 0
##$TPNAME0= <>
##$TPNAME1= <>
##$TPNAME2= <>
##$TPNAME3= <>
##$TPNAME4= <>
##$TPNAME5= <>
##$TPNAME6= <>
##$TPNAME7= <>
##$TPOAL= (0..7)
0.5 0.5 0.5 0.5 0.5 0.5 0.5 0.5
##$TPOFFS= (0..7)
0 0 0 0 0 0 0 0
##$TUNHIN= 0
##$TUNHOUT= 0
##$TUNXOUT= 0
##$USERA1= <user>
##$USERA2= <user>
##$USERA3= <user>
##$USERA4= <user>
##$USERA5= <user>
##$V9= 5
##$VALIST= <valist>
##$VCLIST= <CCCCCCCCCCCCCCC>
##$VD= 0
##$VDLIST= <DDDDDDDDDDDDDDD>
##$VPLIST= <PPPPPPPPPPPPPPP>
##$VTLIST= <TTTTTTTTTTTTTTT>
##$WBST= 1024
##$WBSW= 4
##$XGAIN= (0..3)
0 0 0 0
##$XL= 0
##$YL= 0
##$YMAX_a= 0
##$YMIN_a= 0
##$ZGOPTNS= <>
##$ZL1= 120
##$ZL2= 120
##$ZL3= 120
##$ZL4= 120
##$ABSF1= 14.96277
##$ABSF2= -5.595411
##$ABSG= 5
##$ABSL= 3
##$ALPHA= 0
##$AQORDER= 0
##$ASSFAC= 0
##$ASSFACI= 0
##$ASSFACX= 0
##$ASSWID= 0
##$AUNMP= <proc_prof1d_extract.lims>
##$AXLEFT= 0
##$AXNAME= <>
##$AXNUC= <1H>
##$AXRIGHT= 0
##$AXTYPE= 0
##$AXUNIT= <>
##$AZFE= 0.1
##$AZFW= 0.1
##$BCFW= 0
##$BC_mod= 0
##$BYTORDP= 0
##$COROFFS= 0
##$CY= 15
##$DATMOD= 1
##$DC= 0
##$DFILT= <>
##$DTYPP= 0
##$F1P= 0
##$F2P= 0
##$FCOR= 0.5
##$FTSIZE= 131072
##$FT_mod= 6
##$GAMMA= 0
##$GB= 0
##$INTBC= 1
##$INTSCL= 1
##$ISEN= 128
##$LB= 0.3
##$LEV0= 0
##$LPBIN= 0
##$MAXI= 10000
##$MC2= 0
##$MEAN= 0
##$ME_mod= 0
##$MI= 0
##$NCOEF= 0
##$NC_proc= -6
##$NLEV= 6
##$NOISF1= 0
##$NOISF2= 0
##$NSP= 0
##$NTH_PI= 0
##$NZP= 0
##$OFFSET= 14.96277
##$PC= 1
##$PHC0= 0.8459473
##$PHC1= 0
##$PH_mod= 1
##$PKNL= yes
##$PPARMOD= 0
##$PPDIAG= 0
##$PPIPTYP= 0
##$PPMPNUM= 2147483647
##$PPRESOL= 1
##$PSCAL= 4
##$PSIGN= 0
##$PYNMP= <proc.py>
##$REVERSE= no
##$SF= 400.020008930399
##$SI= 131072
##$SIGF1= 0
##$SIGF2= 0
##$SINO= 400
##$SIOLD= 131072
##$SPECTYP= <>
##$SREGLST= <1H.CDCl3>
##$SSB= 0
##$STSI= 131072
##$STSR= 0
##$SW_p= 8223.68421052631
##$SYMM= 0
##$S_DEV= 0
##$TDeff= 65536
##$TDoff= 0
##$TI= <>
##$TILT= no
##$TM1= 0
##$TM2= 0
##$TOPLEV= 0
##$USERP1= <user>
##$USERP2= <user>
##$USERP3= <user>
##$USERP4= <user>
##$USERP5= <user>
##$WDW= 1
##$XDIM= 131072
##$YMAX_p= 460802595
##$YMIN_p= -399059
##$CURPLOT= <Network HP LaserJet P1505>
##$CURPRIN= <$Network HP LaserJet P1505>
##$DFORMAT= <normdp>
##$LAYOUT= <+/1D_H.xwp>
##$LFORMAT= <normlp>
##$PFORMAT= <normpl>
##$SURQMSG= 1
$$ End of Bruker specific parameters
$$ ---------------------------------
##NTUPLES= NMR SPECTRUM
##VAR_NAME=  FREQUENCY,     SPECTRUM/REAL,   SPECTRUM/IMAG
##SYMBOL=    X,             R,               I
##VAR_TYPE=  INDEPENDENT,   DEPENDENT,       DEPENDENT
##VAR_FORM=  AFFN,          ASDF,            ASDF
##VAR_DIM=   131072,        131072,          131072
##UNITS=     HZ,            ARBITRARY UNITS, ARBITRARY UNITS
##FACTOR=    0.0627417313425164, 1,          1
##FIRST=     8223.62146879497, -2650,        -62473
##LAST=      0,             886,             -60749
##MIN=       0,             -399059,         0
##MAX=       8223.62146879497, 460802595,    0
$$ Real data points
##PAGE= N=1
##DATA TABLE= (X++(R..R)), XYDATA
$$ [...]
61010I93444J6107K0356K4478K8447L1816L3360L3355L4302L8187M4383N1084
$$ 993444 1009551 1029907 1054385 1082832 1114648 1148008 1181363 1215665 1253852 1298235 1349319
60999A349319N7243O2204O5186O6713O9188P4589Q2531R1815J02289J13612J23816
$$ 1349319 1406562 1468766 1533952 1600665 1669853 1744442 1826973 1918788 2021077 2134689 2258505
60988B258505J31361J37653J45721J57744J75875K03678K43720K95050L56365
$$ 2258505 2389866 2527519 2673240 2830984 3006859 3210537 3454257 3749307 4105672
60979D105672M30647N23913O42036P94151R96789J265830J600868J979012K355458
$$ 4105672 4536319 5060232 5702268 6496419 7493208 8759038 10359906 12338918 14694376
60970A4694376K652165K747283K514385J920704J101115L11479k18651m01710
$$ 14694376 17346541 20093824 22608209 24528913 25630028 25941507 25722856 25321146
60962B5321146k85475K3350L96861O71997O69718K88592m07119j208910j888185
$$ 25321146 25035671 25059021 25455882 26127879 26797597 27086189 26679070 25470160 23581975
60953B3581975k312439k468658k413663k221794j962188j689763j436218j210035
$$ 23581975 21269536 18800878 16387215 14165421 12203233 10513470 9077252 7867217
60945G867217j010001q37217o93771n76631m79356l98246l33002k82936k45853
$$ 7867217 6857216 6019999 5326228 4749597 4270241 3871995 3538993 3256057 3010204
60936C010204k19378k00138j83013j64594j46608j32705j22681j13074j02495
$$ 3010204 2790826 2590688 2407675 2243081 2096473 1963768 1841087 1728013 1625518
60927A625518r2483q3368p3462o3064n5436n2389n1811n0848m8888m6288m2965
$$ 1625518 1533035 1449667 1376205 1313141 1257705 1205316 1153505 1102657 1053769 1007481 964516
60916I64516l9492l7070l5130l1516k6214k2175k0828j9734j6729j3574j2873
$$ 964516 925024 887954 852824 821308 795094 772919 752091 732357 715628 702054 689181
60905F89181j3623j2845j0085p385n979n626o274p738q381o751m070k931l825
$$ 689181 675558 662713 652628 645243 639264 633638 627364 619626 611245 604494 600424 597493 593668
60892E93668n071n562n291l624K60M966P444O633M655L651L345K544J544J762
$$ 593668 588597 583035 577744 574120 574380 579346 586790 593423 598078 601729 605074 607618 609162 610924
60878F10924L793O723Q866Q837O562L564J682J272J286J092J255K228L260L288
$$ 610924 614717 621440 630306 639143 645705 649269 650951 652223 653509 654601 655856 658084 661344 664632
60864F64632K192M10k257o450j1600j5265j4982j0938o171l701l925n177o083
$$ 664632 666824 667234 664977 658527 646927 631662 616680 605742 599571 595870 591945 586768 580685
60851E80685o233n178k495R00L168L878M629O608R070J1045J3011J5360J6567
$$ 580685 574452 569274 566779 567679 570847 574725 579354 585962 595032 606077 619088 634448 651015
60838F51015J4870J1106P904O263M766K470Q13J839N633J0350J4247J6836J8284
$$ 651015 665885 676991 684895 691158 695924 698394 699207 701046 706679 717029 731276 748112 766396
60825G66396J8475J7127J4577J1778R160O138K508j68J7K528M538M387L475L879
$$ 766396 784871 801998 816575 828353 837513 843651 846159 845991 846008 848536 853074 857461 860936 864815
60811H64815N406O335O027N125L665P77l419p045q514q747j0259j3864j7137j7200
$$ 864815 870221 876556 882583 887708 891373 892150 888731 881686 873172 864425 854166 840302 823165 805965
60797H05965j4627j2860j3250j2857r025m185l029n730p653n912k553j82J785
$$ 805965 791338 778478 765228 752371 743346 739161 736132 730402 722749 716837 714284 714102 715887
60784G15887M547O854P299P253Q636J0706J1784J2351J3358J3067R191L403K02
$$ 715887 720434 727288 734587 741840 750476 761182 772966 785317 798675 811742 820933 824336 824538
60771H24538J391M619P339R143R803Q055L632j422m592n004l439j563j114k404
$$ 824538 825929 830548 837887 847030 856833 864888 868520 867098 862506 857502 854063 852500 851386 848982
60757H48982l461k058J511M927O697O948O002M227L067L969O156P389P042O532
$$ 848982 845521 843463 844974 849901 856598 863546 869548 873775 876842 880811 886967 894356 901398 907930
60743I07930O731P047P163P437P415O318N331O699R769J0563O714O95l314m021
$$ 907930 914661 921708 928871 936308 943723 950041 955372 962071 971840 982403 989117 989812 986498 982477
60729I82477l142k712l759o179q394q301n703k742j119n30p37k868o940j0145
$$ 982477 979335 976623 972864 966685 958291 949990 944287 941545 940426 939896 939159 936291 929351 919206
60715I19206j0110q496q678j0843j2241j1877j1927j4025j6659j7309j5287j1651
$$ 919206 909096 900600 891922 881079 868838 856961 845034 831009 814350 797041 781754 770103
60703G70103q013o267p648j0590j1092p094j423J628J942L236P196J0720J0421
$$ 770103 762090 755823 748175 737585 726493 719399 717976 719604 721546 724782 731978 742698 753119
60690G53119P423N407N293M696K443O56J403L359L386K62m478q647j1173j2303
$$ 753119 760542 765949 771242 775938 778381 779037 780440 783799 787185 787447 782969 774322 763149 750846
60676G50846j3029j4001j4566j3531j1221r547r259q539n666j814N54J149J587
$$ 750846 737817 723816 709250 695719 684498 674951 665692 657153 651487 649673 650227 651376 652963
60663F52963K073Q36k756o502p912p000n407l640p23L439O544N844J595k375k410
$$ 652963 655036 655872 653116 646614 638702 631702 626295 622655 621932 625371 631915 637759 639354 636979 634569
60648F34569R66L828L513J156n68o35J39O46L02n89m68K036N504O351L418O3n1
$$ 634569 635535 639363 642876 644032 643464 642829 642968 643614 643916 643327 642859 644895 650399 656750 660168 660231 660180
60631F60180K531M955O664R117J2113J3673J3468J3459J4792J6443J7293J7505
$$ 660180 662711 667666 674330 683447 695560 709233 722701 736160 750952 767395 784688 802193
60619H02193J7552J7686J8377J9469J9181J6071J1819R732J0401J1214J0195P862
$$ 802193 819745 837431 855808 875277 894458 910529 922348 932080 942481 953695 963890 971752
60607I71752M955J083l474o944q207q057p623p345q026j0901j5589j9570k0575
$$ 971752 976707 977790 974316 967372 959165 951108 943485 936140 928114 917213 901624 882054 861479
60594H61479j8438j4491j0656r010j0206j2092j1920r862q178p160m929j406J015
$$ 861479 843041 828550 817894 808884 798678 786586 774666 764804 756626 749466 744537 743131 744146
60581G44146J435J667K349J585p84j414J473M571M348K521K938N190N549L162
$$ 744146 745581 747248 749597 751182 750398 748984 750457 755028 759376 761897 764835 770025 775574 778736
60567G78736J179J756L609M975N983O977O806M238j13m317p085q593r643j0194
$$ 778736 779915 781671 785280 790255 796238 803215 810021 814259 814146 809829 802744 794151 784508 774314
60553G74314r050n542j375N12r11l871o089o251l177L726J1996J6952J7096J6515
$$ 774314 765264 759722 758347 758859 757948 754077 747988 741737 738560 742286 754282 771234 788330 804845
60539H04845J9547K5038K8728K9490K9696L0364K9686K6388K1105J3872L537r039
$$ 804845 824392 849430 878158 907648 937344 967708 997394 1023782 1044887 1058759 1062296 1053257
60527A053257j9840k5567k6975k6805k5873k2873j7301j0751n253j288K163O056
$$ 1053257 1033417 1007850 980875 954070 928197 905324 888023 877272 872019 870731 872894 878950
60515H78950R960J2403J2621J1609J0818J0118Q101M694K286L072N973P884Q374
$$ 878950 888910 901313 913934 925543 936361 946479 954580 959274 961560 964632 970605 978489 986863
60502I86863J1101J8917K9011L5996L9627M5907N8985P5453Q9789J02708J19725
$$ 986863 997964 1016881 1045892 1081888 1121515 1167422 1226407 1301860 1391649 1494357 1614082
60491A614082J42837J68637J94729K22932K54476K86189L13396L32617L38765
$$ 1614082 1756919 1925556 2120285 2343217 2597693 2883882 3197278 3529895 3868660
60482C868660L23555K80957K12993J27523L2380o5505j57391k33644k87929l18785
$$ 3868660 4192215 4473172 4686165 4813688 4846068 4780563 4623172 4389528 4101599 3782814
60472C782814l28188l20789l03170k80651k54755k25620j95811j69218j46964
$$ 3782814 3454626 3133837 2830667 2550016 2295261 2069641 1873830 1704612 1557648
60463A557648j27237j09005r3315q0810p0313o0349n0547m1506l4571l1150l0663
$$ 1557648 1430411 1321406 1228091 1147281 1076968 1016619 966072 924566 889995 858845 828182
60452H28182k9718k5347j8654j3527j2185j3640j5858j7316j6959j4767j2263
$$ 828182 798464 773117 754463 740936 728751 715111 699253 681937 664978 650211 637948
60441F37948j0886j0322r885j0235j1666j2057r298m742j388L53J874K556P13
$$ 637948 627062 616740 606855 596620 584954 572897 563599 558857 557469 557822 559696 562252 562965
60428E62965k170k669j191j825n371p245m330M45K962L505M187M336K459L92J112
$$ 562965 560795 558126 556935 555110 549739 542494 538164 538609 541571 545076 549263 553599 556058 556450 557562
60413E57562L716M626L361L225O077R667J1043J0071Q494P369O538N456L830K061
$$ 557562 561278 565904 569265 572490 578567 588234 599277 609348 617842 625211 631749 637205 641035 643096
60399F43096J189J531J740N31r04L1L470O178N514K873J643K717L774K903J103
$$ 643096 644285 645816 647556 648087 647183 647214 650684 656862 662376 665249 666892 669609 673383 676286 677389
60384F77389M23R96J215L73l88J29J646L254M616N382M427J146k783m489l090
$$ 677389 677812 678808 680023 680396 680008 680137 681783 685037 689653 695035 699462 700608 697825 693336 690246
60369F90246n10J189K108L425N038N647M783L516K816K137L30k390m184l519p82
$$ 690246 689736 690925 693033 696458 701496 707143 711926 715442 718258 720395 720725 718335 714151 710632 709850
60354G09850K315M401N035M429L667M696Q484J3012J4691J2471Q977O915O059
$$ 709850 712165 716566 721601 726030 729697 734393 742877 755889 770580 783051 792028 798943 805002
60341H05002N010M087M297M767L659J228l25P3J492L001M448N243M848M845P950
$$ 805002 810012 814099 818396 823163 826822 828050 827725 827798 829290 832291 836739 841982 846830 851675 859625
60326H59625J3890J8482J8342J4736J1190Q998O951M105N83l721q813j3056j4042
$$ 859625 873515 891997 910339 925075 936265 945263 952214 956319 956902 953181 944368 931312 917270
60313I17270j1711q918q055q275p145m182j382l99o53p80p79j502k393j459J946
$$ 917270 905559 896641 888586 880311 873166 868984 867602 867203 866550 865770 864991 863489 861096 859637 861583
60298H61583N619P072O857P719J0453J2218R843L926j483l132j727o39k000m609
$$ 861583 867202 874274 881131 888850 899303 911521 921364 925290 923807 920675 918948 918309 916309 911700
60284I11700n914n398n171p073j0099j1403r291m512Q44M742N859M170J331l40
$$ 911700 905786 900388 895217 888144 878045 866642 857351 852839 853683 858425 864284 868454 869785 869445
60270H69445K97K624N449Q081J0175J1409J1967J2847J5065J8598K2611K6687
$$ 869445 869742 872366 877815 885896 896071 907480 919447 932294 947359 965957 988568 1015255
60258A015255L1262L6385M0397M1058L8655L7136M0670M9013N7749O3573O7853
$$ 1015255 1046517 1082902 1123299 1164357 1203012 1240148 1280818 1329831 1387580 1451153 1519006
60247A519006P3966Q2663R2053J01479J12734J26363J38638J44263J42088J36500
$$ 1519006 1592972 1675635 1767688 1869167 1981901 2108264 2246902 2391165 2533253 2669753
60237B669753J32455J30092J25456J16049J03813R1996Q0866O8070N2297L4535
$$ 2669753 2802208 2932300 3057756 3173805 3277618 3369614 3450480 3518550 3570847 3605382
60227C605382J6146k270j9866l5154m7195n6059o2137o6253o9897p3083p2225
$$ 3605382 3621528 3619258 3599392 3564238 3517043 3460984 3398847 3332594 3262697 3189614 3117389
60216C117389o3120m6718k9114j4645j821J2544K8276M3415N8088P3678Q9786
$$ 3117389 3054269 3007551 2978437 2963792 2961971 2974515 3002791 3046206 3104294 3177972 3267758
60205C267758J04913J18907J31966J42462J48538J50918J51329J48991J41592
$$ 3267758 3372671 3491578 3623544 3766006 3914544 4065462 4216791 4365782 4507374
60196D507374J29220J14231R7438P7331N3384K7566J922k3174m7764p0995r1525
$$ 4507374 4636594 4750825 4848263 4925594 4978978 5006544 5008466 4985292 4937528 4866533 4775008
60185D775008j08046j19546j26108j29061j29155j25503j17593j06930r4614p8966
$$ 4775008 4666962 4547416 4421308 4292247 4163092 4037589 3919996 3813066 3718452 3639486
60175C639486n8424l5655j5319J919J9908M1251O3963Q4246R9979J10807J16964
$$ 3639486 3581062 3545407 3530088 3532007 3551915 3593166 3657129 3741375 3841354 3952161 4069125
60164D069125J18734J15701J06707R2011P4472N6676L8106J7726k215j8390l1071
$$ 4069125 4187859 4303560 4410267 4502278 4576750 4633426 4671532 4689258 4687043 4668653 4637582
60153D637582m2552n1734n4866n1423m4506l5254k2020n797R126K1734L6194N4684
$$ 4637582 4595030 4543296 4488430 4437007 4392501 4357247 4335227 4329430 4338556 4360290 4396484 4451168
60141D451168P3317Q8404J02241J18858J38179J58718J82589K12526K46028K77418
$$ 4451168 4524485 4612889 4715130 4833988 4972167 5130885 5313474 5526000 5772028 6049446
60131F049446L04863L31118L57880L83323M05132M22455M34169M37801M31162
$$ 6049446 6354309 6685427 7043307 7426630 7831762 8254217 8688386 9126187 9557349
60122I557349M13907L87498L54434L16767K74280K25166J69496J10337N0285j1088
$$ 9557349 9971256 10358754 10713188 11029955 11304235 11529401 11698897 11809234 11859519 11848431
60112A1848431p4284j36521j94161k47085k97295l43378l79339l99596m03661
$$ 11848431 11774147 11637626 11443465 11196380 10899085 10555707 10176368 9776772 9373111
60103I373111l95484l79347l56624l26169k87842k45146k02657j60976j16974
$$ 9373111 8977627 8598280 8241656 7915487 7627645 7382499 7179842 7018866 6901892
60094F901892o9914k4275J5512N0107Q2175J10839J32839J47565J56822J60153
$$ 6901892 6831978 6807703 6823215 6873322 6955497 7066336 7199175 7346740 7503562 7663715
60084G663715J54436J38685J16063R0217O2073L1282j061l2536o1467q8235j14583
$$ 7663715 7818151 7956836 8072899 8163116 8225189 8256471 8255410 8222874 8161407 8073172 7958589
60073G958589j41275j66098j85431j98536k08797k19257k28517k32936k31435
$$ 7958589 7817314 7651216 7465785 7267249 7058452 6839195 6610678 6377742 6146307
60064F146307k25714k16769k04050j87587j68308j46313j21424r5726p3031n4799
$$ 6146307 5920593 5703824 5499774 5312187 5143879 4997566 4876142 4780416 4707385 4652586
60054D652586l8157j8703N625L3346O0613Q3530J00947J15425J30290J45426J57003
$$ 4652586 4614429 4595726 4601351 4634697 4695310 4778840 4879787 4995212 5125502 5270928 5427931
60043E427931J61464J58593J50340J37690J19631R5163O5840L5555O950k1257
$$ 5427931 5589395 5747988 5898328 6036018 6155649 6250812 6316652 6352207 6359157 6337900
60033F337900n1777q3632j12055j34049j51287j65806j75667j77936j74069j68679
$$ 6337900 6286123 6202491 6090436 5956387 5805100 5639294 5463627 5285691 5111622 4942943
60023D942943j63485j55682j42437j24399j04403q4959o7356n1282l4643j5213
$$ 4942943 4779458 4623776 4481339 4356940 4252537 4167578 4100222 4048940 4014297 3999084
60013C999084P019L0015N2004P2866R3663J15899J40458J66019J89264K07752
$$ 3999084 4006103 4036118 4088122 4160988 4254651 4370550 4511008 4677027 4866291 5074043
60003E074043K21348K29643K30015K20715K04359J85262J64216J38977J09046
$$ 5074043 5295391 5525034 5755049 5975764 6180123 6365385 6529601 6668578 6777624
59994F777624P6344M1411L005l7594p5565j07358j33748j56444j74336j85309
$$ 6777624 6853968 6895379 6898384 6860790 6785225 6677867 6544119 6387675 6213339 6028030
59984F028030j89703j89402j84430j72693j53105j27582r9690p1930m4571j7044
$$ 6028030 5838327 5648925 5464495 5291802 5138697 5011115 4911425 4839495 4794924 4777880
59974D777880R784L3529N2941O9447Q4924R8997J10145J18280J23964J25826J21690
$$ 4777880 4787664 4821193 4874134 4943581 5028505 5127502 5237647 5355927 5479891 5605717 5727407
59963E727407J12446J02079R3146Q4501P4105O1713M7812L2461J6658K741q350
$$ 5727407 5839853 5941932 6035078 6119579 6193684 6255397 6303209 6335670 6352328 6355069 6346719
59952F346719j8475k9080l7990m1512l8703l1334k0224m225J6922M1200O7165
$$ 6346719 6328244 6299164 6261174 6219662 6180959 6149625 6129401 6125176 6142098 6183298 6250463
59941F250463R6662J32709J75119K20352K66012L13497L64670M17458M66998N10197
$$ 6250463 6347125 6479834 6654953 6875305 7141317 7454814 7819484 8236942 8703940 9214137
59931I214137N46222N72392N82951N73208N42161M89602M13932L15872K02046
$$ 9214137 9760359 10332751 10915702 11488910 12031071 12520673 12934605 13250477 13452523
59922A3452523Q1641l8970j55324k60922l48839m17019m67821n02110n17686n14229
$$ 13452523 13534164 13495194 13339870 13078948 12730109 12313090 11845269 11343159 10825473 10311244
59912A0311244m96062m68723m35626l98965l60423l19355k73400k22932j72532
$$ 10311244 9815182 9346459 8910833 8511868 8151445 7832090 7558690 7335758 7163226
59903G163226j26260q3687m2363j620L8351P8864J21011J62654J99806K30480
$$ 7163226 7036966 6953279 6910916 6909296 6947647 7026511 7147522 7310176 7509982 7740462
59893G740462K54978K72770K81032K76257K55963K19362J67963J05503L6132l7234
$$ 7740462 7995440 8268210 8549242 8825499 9081462 9300824 9468787 9574290 9610422 9573188
59883I573188j11970j83921k47992l00576l40550l67978l83086l86509l79726
$$ 9573188 9461218 9277297 9029305 8728729 8388179 8020201 7637115 7250606 6870880
59874F870880l64769l43760l18612k90843k61715k32604k04906j79277j55495
$$ 6870880 6506111 6162351 5843739 5552896 5291181 5058577 4853671 4674394 4518899
59865D518899j33548j14654j00686r2495q8989q7995q7932q8493q9420q9093q5308
$$ 4518899 4385351 4270697 4170011 4077516 3988527 3900532 3812600 3724107 3634687 3545594 3460286
59854C460286p7704o8404n9618n1417m2539l2332k1001r122J620Q165Q419L441
$$ 3460286 3382582 3314178 3254560 3203143 3160604 3128272 3107271 3098149 3099769 3107934 3116353 3119794
59842C119794m159j3370k4663l7199m8337n5962n9814o0461n8618n5404n1610
$$ 3119794 3115635 3102265 3077602 3040403 2992066 2936104 2876290 2815829 2757211 2701807 2650197
59831B650197m6625l9421l0391k0797j0993j009P774J4072J9505K7262L7827M8690
$$ 2650197 2603572 2564151 2533760 2512963 2501970 2500961 2508735 2522807 2542312 2569574 2607401 2656091
59819B656091N8393O7723P6106Q0386P9194P5849P4468P4948P3906O9156O0923
$$ 2656091 2714484 2782207 2858313 2938699 3017893 3093742 3168210 3243158 3317064 3386220 3447143
59808C447143M9758L5778K0014M712q234j8373k5974l0737l1531k7603j9878j0232
$$ 3447143 3496901 3532679 3552693 3557405 3549171 3530798 3504824 3474087 3442556 3414953 3395075 3384843
59796C384843Q20J4303K9805M4537N7533P2898R5349J23581J52098J79490K10544
$$ 3384843 3385663 3399966 3429771 3474308 3531841 3604739 3700088 3823669 3975767 4155257 4365801
59785D365801K49513K95602L46458M01254M57352N07071N40550N49184N24691
$$ 4365801 4615314 4910916 5257374 5658628 6115980 6623051 7163601 7712785 8237476
59776H237476M59667L54236K20341P5861o4082j87811k83780l43781l69604l71452
$$ 8237476 8697143 9051379 9271720 9347581 9283499 9095688 8811908 8468127 8098523 7727071
59766G727071l58585l34873l03266k69416k38346k10583j84179j58810j35970
$$ 7727071 7368486 7033613 6730347 6460931 6222585 6012002 5827823 5669013 5533043
59757E533043j16358r8775q1063o1509m0032j8612K65J6060L0575M6025O3595
$$ 5533043 5416685 5317910 5236847 5175338 5135306 5116694 5116959 5133019 5163594 5209619 5273214
59746E273214Q3408J04359J24017J40633J55925J74426J99096K28627K59839K91629
$$ 5273214 5356622 5460981 5584998 5725631 5881556 6055982 6255078 6483705 6743544 7035173
59736G035173L25406L62427M02223M43735M86863N32059N78520O23399O63073
$$ 7035173 7360579 7723006 8125229 8568964 9055827 9587886 10166406 10789805 11452878
59727A1452878O94703P15968P23546P13502O84228O38689N83041N23523M65469
$$ 11452878 12147581 12863549 13587095 14300597 14984825 15623514 16206555 16730078 17195547
59718A7195547M14504L76867L57634L58949L80212M19390M73671N39089O09974
$$ 17195547 17610051 17986918 18344552 18703501 19083713 19503103 19976774 20515863 21125837
59709B1125837O79223P39561P84970Q10947Q13489P88175P30798O39631N17856
$$ 21125837 21805060 22544621 23329591 24140538 24954027 25742202 26473000 27112631 27630487
59700B7630487L74358K21548P1278o7993j90583k91298l65038m08761m22958m10626
$$ 27630487 28004845 28226393 28297671 28229678 28039095 27747797 27382759 26973998 26551040 26140414
59690B6140414l75083l18911k44486j54974n4323N4333J70212K94067M25574N62739
$$ 26140414 25765331 25446420 25201934 25046960 24992637 25046970 25217182 25511249 25936823 26499562
59680B6499562P04189Q49994R98100J140754J266075J362279J418301J421536
$$ 26499562 27203751 28053745 29051845 30192599 31458674 32820953 34239254 35660790
59672C5660790J358557J219756J002977P14467L69735o418l84423p37042j042447
$$ 35660790 37019347 38239103 39242080 39956547 40326282 40319864 39935441 39198399 38155952
59663C8155952j283023j446796j532187j548383j508441j423723j306055j171936
$$ 38155952 36872929 35426133 33893946 32345563 30837122 29413399 28107344 26935408
59655B6935408j041207r31996q57905q27099q40175q88308r55155j021707j071402
$$ 26935408 25894201 24962205 24104300 23277201 22437026 21548718 20593563 19571856 18500454
59646A8500454j094531j090353j064057j020899r64332q98902q30507p61842o91319
$$ 18500454 17405923 16315570 15251513 14230614 13266282 12367380 11536873 10775031 10083712
59637A0083712o19328n52158m95915m49174m05812l63303l23868k89002k57863
$$ 10083712 9464384 8912226 8416311 7967137 7561325 7198022 6874154 6585152 6327289
59628F327289k30485k07498j86197j61910j34709j10487r3189p9590o4409m7781
$$ 6327289 6096804 5889306 5703109 5541199 5406490 5296003 5202814 5123224 5058815 5011034
59618E011034l4542k7922k6745k7995k9805l2369l7776m8550o4604q1767r4732
$$ 5011034 4976492 4948570 4921825 4893830 4864025 4831656 4793880 4745330 4680726 4598959 4504227
59607D504227j01732j05351j08931j13265j16815j17827j15448j09408r9717q6995
$$ 4504227 4402495 4297144 4188213 4074948 3958133 3840306 3724858 3615450 3515733 3428738
59597C428738p2867n9744m9859m3897m0096l5118k6848j6544p428q77M778J1050
$$ 3428738 3355871 3296127 3246268 3202371 3162275 3127157 3100309 3083765 3076337 3075460 3080238 3091288
59585C091288J6524J9051J9519K0955K4126K6600K6532K5045K4040K3819K3974
$$ 3091288 3107812 3126863 3146382 3167337 3191463 3218063 3244595 3269640 3293680 3317499 3341473
59574C341473K4796K6580K9102L2771L8611M6195N3618O0779P0511Q4525J00123
$$ 3341473 3366269 3392849 3421951 3454722 3493333 3539528 3593146 3653925 3724436 3808961 3909084
59563C909084J13284J23743J34779J49058J66800J87146K08902K30356K50436
$$ 3909084 4022368 4146111 4280890 4429948 4596748 4783894 4992796 5223152 5473588
59554E473588K70210K91747L15305L38488L57732L70156L75013L74182L70066
$$ 5473588 5743798 6035545 6350850 6689338 7047070 7417226 7792239 8166421 8536487
59545H536487L62292L48258L27976L05986K86519K68875K50058K29965K10755
$$ 8536487 8898779 9247037 9575013 9880999 10167518 10436393 10686451 10916416 11127171
59536A1127171J92391J72514J50839J30917J17327J12890J17941J29715J42627
$$ 11127171 11319562 11492076 11642915 11773832 11891159 12004049 12121990 12251705 12394332
59527A2394332J51399J53902J49300J34691J06481O4584J2184m8457j16975j91488
$$ 12394332 12545731 12699633 12848933 12983624 13090105 13154689 13166873 13118416 13001441 12809953
59517A2809953k67109l38436m01239m51854m88011n11006n24183n28421n21760
$$ 12809953 12542844 12204408 11803169 11351315 10863304 10352298 9828115 9299694 8777934
59508H777934n04336m80658m55262m28453l98209l64534l29996k97135k66838
$$ 8777934 8273598 7792940 7337678 6909225 6511016 6146482 5816486 5519351 5252513
59499E252513k38391k10202j81505j53970j30514j11985r6399q1670o7279n2653
$$ 5252513 5014122 4803920 4622415 4468445 4337931 4225946 4129547 4047877 3980598 3927945
59489C927945l6271j7833M63J6548L1223M6755O3927Q1985J00493J19528J38617
$$ 3927945 3891674 3873841 3874304 3890852 3922075 3968830 4032757 4114742 4215235 4334763 4473380
59478D473380J57211J76050J96806K20291K45669K71253K95211L15725L31149
$$ 4473380 4630591 4806641 5003447 5223738 5469407 5740660 6035871 6351596 6682745
59469F682745L40141L41326L33009L13350K80773K34575J76063J09130L8643l2170
$$ 6682745 7022886 7364212 7697221 8010571 8291344 8525919 8701982 8811112 8849755 8817585
59459H817585j01957j68796k28975k79139l18474l47368l64843l69328l62218
$$ 8817585 8715628 8546832 8317857 8038718 7720244 7372876 7008033 6638705 6276487
59450F276487l48778l34215l19430l01764k79489k54291k29368k06660j86753
$$ 6276487 5927709 5593494 5274064 4972300 4692811 4438520 4209152 4002492 3815739
59441C815739j69942j55625j41373j24777j06481q9701p6502o6142n7276m9561
$$ 3815739 3645797 3490172 3348799 3224022 3117541 3027840 2951338 2885196 2827920 2778359
59431B778359m2281l3689k3455j4056p831l908K19N280J0204J4407J8117K1333
$$ 2778359 2736078 2702389 2678934 2664878 2657047 2653139 2653358 2658638 2668842 2683249 2701366 2722699
59419B722699K4434K8882L5113M0629M2718M2546M3709M6769M8176M5299L9952
$$ 2722699 2747133 2776015 2811128 2851757 2894475 2937021 2980730 3027499 3075675 3120974 3160926
59408C160926L5740L4125L4794L8216M5714N7429P1930Q8159J06567J27467J48760
$$ 3160926 3196666 3230791 3265585 3303801 3349515 3406944 3478874 3567033 3673600 3801067 3949827
59397C949827J66763J80322J93290K11376K36832K68052L04085L46568L96082
$$ 3949827 4116590 4296912 4490202 4701578 4938410 5206462 5510547 5857115 6253197
59388F253197M49559N03373N56537O08092O53359O86038P03053P04491O90097
$$ 6253197 6702756 7206129 7762666 8370758 9024117 9710155 10413208 11117699 11807796
59379A1807796O59246O13926N58417M96130M29800L64475L06376K57748K15549
$$ 11807796 12467042 13080968 13639385 14135515 14565315 14929790 15236166 15493914 15709463
59370A5709463J76101J38194J00773O0694J4911l6976r3980j55860k22146k89737
$$ 15709463 15885564 16023758 16124531 16185225 16200136 16163160 16069180 15913320 15691174 15401437
59360A5401437l52651m04001m38347m53546m51222m34919m07908l73529l36921
$$ 15401437 15048786 14644785 14206438 13752892 13301670 12866751 12458843 12085314 11748393
59351A1748393l04452k80901k68273k66963k76351k94101l16536l40219l62416
$$ 11748393 11443941 11163040 10894767 10627804 10351453 10057352 9740816 9400597 9038181
59342I038181l80523l92661l98629l98650l91662l76802l56317l34613l13894
$$ 9038181 8657658 8264997 7866368 7467718 7076056 6699254 6342937 6008324 5694430
59333E694430k92638k68782k42679k16252j90841j66789j44227j23767j06605
$$ 5694430 5401792 5133010 4890331 4674079 4483238 4316449 4172222 4048455 3941850
59324C941850r3621q3893p5044o5730n6548m7730l8066k7511j8420j1796m872
$$ 3941850 3848229 3764336 3689292 3623562 3567014 3519284 3481218 3453707 3435287 3423491 3418619
59313C418619M528J3767J9556K4084L1973M2606N1243N7380O5936P9210R3454
$$ 3418619 3423147 3436914 3456470 3480554 3512527 3555133 3606376 3663756 3729692 3808902 3902356
59302C902356J05301J16328J28634J40287J48255J52452J54214J53752J51481
$$ 3902356 4007657 4123985 4252619 4392906 4541161 4693613 4847827 5001579 5153060
59293E153060J48746J44942J36980J24107J10315R9496R1032Q2822P5756P2122
$$ 5153060 5301806 5446748 5583728 5707835 5818150 5917646 6008678 6091500 6167256 6239378
59283F239378P2002P4280P9110Q6404R3857R9457J04115J08671J10056J03863
$$ 6239378 6311380 6385660 6464770 6551174 6645031 6744488 6848603 6957274 7067330 7171193
59273G171193Q9722P0899M9289K3888o246m0384p7147j14223j46951j70018j81677
$$ 7171193 7260915 7331814 7381103 7404991 7398745 7358361 7281214 7166991 7020040 6850022 6668345
59262F668345j84814j83208j78114j68863j55287j38336j18865r7087p3478m9463
$$ 6668345 6483531 6300323 6122209 5953346 5798059 5659723 5540858 5443771 5370293 5320830
59252E320830k6052k106K4276N1908P5989R3102J05081J15878J26610J36718J47997
$$ 5320830 5294778 5292672 5316948 5368856 5444845 5537947 5643028 5758906 5885516 6022234 6170231
59241F170231J62670J78025J88257J92795J98254K10552K29263K51662K77812
$$ 6170231 6332901 6510926 6699183 6891978 7090232 7300784 7530047 7781709 8059521
59232H059521L08413L40958L71337L96915M15256M22188M13899L89091L46749
$$ 8059521 8367934 8708892 9080229 9477144 9892400 10314588 10728487 11117578 11464327
59223A1464327K84450K01772J03548l033j12827k22006l25109m16022m90714n46797
$$ 11464327 11748777 11950549 12054097 12051064 11938237 11716231 11391122 10975100 10484386 9937589
59213I937589n82073n96182n92331n75054n47416n12262m73926m35834l97850
$$ 9937589 9355516 8759334 8167003 7591949 7044533 6532271 6058345 5622511 5224661
59204E224661l58775l20131k84868k53707k25456j99805j76996j55872j35243
$$ 5224661 4865886 4545755 4260887 4007180 3781724 3581919 3404923 3249051 3113808
59195C113808j16556j02495r3199q6262q0091p4966p1083o7756o4607o1806n9020
$$ 3113808 2997252 2894757 2801558 2715296 2635205 2560239 2489156 2421400 2356793 2294987 2235967
59184B235967n5387n0544m4988l9849l6484l5127l3712k9846k4345k0499j9161
$$ 2235967 2180580 2130036 2085048 2045199 2008715 1973588 1939876 1910030 1885685 1865186 1846025
59173A846025j7420j3445r349p226n424j493L858Q757J3676J9714K5429K8930
$$ 1846025 1828605 1815160 1805811 1798585 1793161 1791668 1795526 1804283 1817959 1837673 1863102 1892032
59161A892032L1450L5451M0524M4542M7802N2594N9293O5997P1601P6665Q1815
$$ 1892032 1923482 1958933 1999457 2043999 2091801 2144395 2203688 2269685 2341286 2417951 2499766
59150B499766Q7461R4255J01595J06961J09194J11155J16534J25107J33439J38788
$$ 2499766 2587227 2681482 2783077 2890038 2999232 3110387 3226921 3352028 3485467 3624255
59140C624255J39873J35856J27727J19016J11715J02993Q9457P2909N7759M4296
$$ 3624255 3764128 3899984 4027711 4146727 4258442 4361435 4450892 4523801 4581560 4625856
59130D625856K9452J3607J381m821p360q470p117k024O181J7668L4683N7856Q3873
$$ 4625856 4655308 4668915 4670296 4665475 4658115 4649645 4642528 4640504 4646685 4664353 4699036 4756892 4840765
59117D840765J09140J33710J59492J86331K12078K35411K56134K72539K80213
$$ 4840765 4949905 5083615 5243107 5429438 5641516 5876927 6133061 6405600 6685813
59108F685813K74429K53461K18822J72362J14591M7389k2695q6757j39709j81796
$$ 6685813 6960242 7213703 7432525 7604887 7719478 7766867 7744172 7657415 7517706 7335910
59098G335910k13546k32711k38004k32508k20344k02538j79202j53497j29874
$$ 7335910 7122364 6889653 6651649 6419141 6198797 5996259 5817057 5663560 5533686
59089E533686j09807r2615p9068p0715o6854o5596o7052p2263q0063q8471r8185
$$ 5533686 5423879 5331264 5252196 5181481 5114627 5049031 4981979 4909716 4829653 4741182 4642997
59078D642997j11045j25706j38433j47652j54035j56673j53442j45490j37290
$$ 4642997 4531952 4406246 4267813 4120161 3966126 3809453 3656011 3510521 3373231
59069C373231j31127j24739j15493j04161r3304q4045p5432o5814n4589m3572
$$ 3373231 3242104 3117365 3001872 2897711 2804407 2720362 2644930 2579116 2524527 2480955
59059B480955l5684l1094k6361j9506j3884j4317k1297l2386m6833o3964p8524
$$ 2480955 2445271 2414177 2387816 2368310 2354426 2340109 2318812 2286426 2239593 2175629 2097105
59048B097105q3643p9114p2041o8301o7335o5963o2828n7669n0170m1685l5132
$$ 2097105 2013462 1934348 1862307 1794006 1726671 1660708 1597880 1540211 1490041 1448356 1413224
59037A413224l1448k8354k3709j8003j2878r390q202r023r648p859m323j225J341
$$ 1413224 1381776 1353422 1329713 1311710 1298832 1289442 1281240 1272217 1262569 1254710 1250387 1249162 1250503
59024A250503M408O253L674k409o694o016k741o20m43q64n38J665N764R070Q356
$$ 1250503 1254911 1261164 1264838 1262429 1255735 1249719 1246978 1246358 1245915 1245051 1244513 1246178 1251942 1261012 1269368
59009A269368M426J699K688N718Q393R929R565O520K599J151K399L318L086M378
$$ 1269368 1273794 1275493 1278181 1283899 1292292 1302221 1311786 1318306 1320905 1322056 1324455 1327773 1330859 1335237
58995A335237P709R238O938M678O514J0273J0866P852N630P337J1994J6992K0383
$$ 1335237 1342946 1352184 1359122 1363800 1370314 1380587 1391453 1399305 1404935 1412272 1424266 1441258 1461641
58982A461641K0940J8771J6175J5922J8172K0387K0705K0441K2467K7425L2499
$$ 1461641 1482581 1501352 1517527 1533449 1551621 1572008 1592713 1613154 1635621 1663046 1695545
58971A695545L4814L5469L8399M4914N1593N4852N5233N5125N4560N2157M8327
$$ 1695545 1730359 1765828 1804227 1849141 1900734 1955586 2010819 2065944 2120504 2172661 2220988
58960B220988M4344L9836L4644L1387L2102L3882L2598K9888L1006L6322M0975
$$ 2220988 2265332 2305168 2339812 2371199 2403301 2437183 2469781 2499669 2530675 2566997 2607972
58949B607972M3555M8830N9713P2226Q1570Q8559R6549J05769J14561J23715J35892
$$ 2607972 2651527 2700357 2760070 2832296 2913866 3002425 3098974 3204743 3319304 3443019 3578911
58938C578911J51912J69989J87793K04146K20164K39245K63873K92191L20342
$$ 3578911 3730823 3900812 4088605 4292751 4512915 4752160 5016033 5308224 5628566
58929E628566L48467L80871M19627M61969N05648N52832O06225O64502P24485
$$ 5628566 5977033 6357904 6777531 7239500 7745148 8297980 8904205 9568707 10293192
58920A0293192P85170Q46556R05915R57588R95544J014520J009606R76032R09246
$$ 10293192 11078362 11924918 12830833 13788421 14783965 15798485 16808091 17784123 18693369
58911A8693369Q05944O66897M98382L09101J06636j00555k99857m78165o28918
$$ 18693369 19499313 20166210 20664592 20973693 21080329 20979774 20679917 20201752 19572834
58902A9572834p51401q43692r01995r27604r28617r12444q81475q38049p88335
$$ 19572834 18821433 17977741 17075746 16148142 15219525 14307081 13425606 12587557 11799222
58893A1799222p37617o85832o31187n74969n19813m66450m15236l68378l28163
$$ 11799222 11061605 10375773 9744586 9169617 8649804 8183354 7768118 7399740 7071577
58884G071577k95270k70291k53752k43070k33289k22898k15098k11170k06797
$$ 7071577 6776307 6506016 6252264 6009194 5775905 5553007 5337909 5126739 4919942
58875D919942j97825j85618j73410j61149j47553j34060j22750j12742j01953
$$ 4919942 4722117 4536499 4363089 4201940 4054387 3920327 3797577 3684835 3582882
58866C582882r0353p8982o8195n9020n3153m9273m2951l2934k3890j9751j8139
$$ 3582882 3492529 3413547 3345352 3286332 3233179 3183906 3140955 3108021 3084131 3064380 3046241
58855C046241j4898j0254o110p50Q582K0097K9227L4568L8160M1537M5330N1174
$$ 3046241 3031343 3021089 3014979 3014229 3022811 3042908 3072135 3106703 3144863 3186400 3231730 3282904
58843C282904O0017O9652P7245Q3405R0962J01129J13361J27215J41702J55017
$$ 3282904 3342921 3412573 3489818 3573223 3664185 3765314 3878675 4005890 4147592 4302609
58833D302609J67504J82442K01167K20231K36877K54356K77711L06789L37970
$$ 4302609 4470113 4652555 4853722 5073953 5310830 5565186 5842897 6149686 6487656
58824F487656L70892M08673M52673N01465N54238O11038O70125P28714P86008
$$ 6487656 6858548 7267221 7719894 8221359 8775597 9386635 10056760 10785474 11571482
58815A1571482Q42001Q93607R34867R60381R65611R44604Q90836Q00713O74593
$$ 11571482 12413483 13307090 14241957 15202338 16167949 17112553 18003389 18804102 19478695
58806A9478695N15759L31059J31557p0441k64928m43612n98113p22136q14624
$$ 19478695 19994454 20325513 20457070 20386629 20121701 19678089 19079976 18357840 17543216
58797A7543216q78035r14089r23544r09312q77350q34739p87978p41507o96021
$$ 17543216 16665181 15751092 14827548 13918236 13040886 12206147 11418169 10676662 9980641
58788I980641o49730o02999n59777n22518m88221m52420m15195l80146l48890
$$ 9980641 9330911 8727912 8168135 7645617 7157396 6704976 6289781 5909635 5560745
58779E560745l19862k91672k64880k40705k19944k02795j88366j75134j62715
$$ 5560745 5240883 4949211 4684331 4443626 4223682 4020887 3832521 3657387 3494672
58770C494672j51824j42088j32053j22044j14145j08353j01647r2131q1007o9521
$$ 3494672 3342848 3200760 3068707 2946663 2832518 2724165 2622518 2530387 2449380 2379859
58760B379859n7797m7953m3744m4759m5420m2259l7842l4876l1603k6593k2881
$$ 2379859 2322062 2274109 2230365 2185606 2140186 2097927 2060085 2025209 1993606 1967013 1944132
58749A944132k2651k2336j8169j2825j1313j3425j5313j5633j5292j4035j1936
$$ 1944132 1921481 1899145 1880976 1868151 1856838 1843413 1828100 1812467 1797175 1783140 1771204
58738A771204j1333j2671j1873o737k145l329p697r687j0257j4282k1214k6056
$$ 1771204 1759871 1747200 1735327 1728590 1726445 1723116 1715419 1705732 1695475 1681193 1659979 1633923
58726A633923k8097l0991l4842l5829l3856l3500l6252l8155l6396l2785k9481
$$ 1633923 1605826 1574835 1539993 1504164 1470308 1436808 1400556 1362401 1326005 1293220 1263739
58715A263739k6372k4052k4531k7237k8259k5471k1196j8578j7815j7142j5335
$$ 1263739 1237367 1213315 1188784 1161547 1133288 1107817 1086621 1068043 1050228 1033086 1017751
58704A017751j2558j0005q535p010l522Q00K076o10l269l168k777m180m230k96
$$ 1017751 1005193 995188 986653 979643 976121 976921 978997 978387 975118 971950 969173 964993 960763 960467
58690I60467L221K09p978j4653j6913j6860j5852j3653j2057j3350j5824j5861
$$ 960467 963688 963897 955919 941266 924353 907493 891641 877988 865931 852581 836757 820896
58678H20896j3478j1090q331l358K087M201K646j03l320p051q595n511o05J445
$$ 820896 807418 796328 787997 784639 786726 790927 793573 793470 790150 783099 774504 768993 768388 769833
58664G69833R70J666L943N211M918M038J564l057o480o027m858o721q871o913
$$ 769833 770803 772469 776412 781623 786541 790579 792143 789086 782606 776579 771721 765000 756129 749216
58650G49216k909p49K986J4169K9557L9854M3004M4729M6674M4425L7895L3618
$$ 749216 746307 745558 748544 762713 792270 832124 875128 919857 966531 1010956 1048851 1082469
58638A082469L4879L8125M0775M4379M8747N1141N2742N8140O7355P6207Q5161
$$ 1082469 1117348 1155473 1196248 1240627 1289374 1340515 1393257 1451397 1518752 1594959 1680120
58627A680120R9029J16993J32375J44012J58444J78570J99737K19748K42802K69476
$$ 1680120 1779149 1896142 2028517 2172529 2330973 2509543 2709280 2929028 3171830 3441306
58617C441306K92179L05358L11715L13088L03182K75018K29006J68805R6251J5697
$$ 3441306 3733485 4038843 4350558 4663646 4966828 5241846 5470852 5639657 5735908 5751605
58607E751605o2982j31478j88308k33140k62142k73966k74414k69684k59615k42431
$$ 5751605 5688623 5557145 5368837 5135697 4873555 4599589 4325175 4055491 3795876 3553445
58597C553445k21242k00719j81312j61573j42691j26639j12951j00729r0583q1926
$$ 3553445 3332203 3131484 2950172 2788599 2645908 2519269 2406318 2305589 2215006 2133080
58587B133080p2180o1196n2540m7921m4354l8902l2158k5478j9489j6632j9682
$$ 2133080 2060900 1999704 1947164 1899243 1854889 1815987 1783829 1758351 1738862 1722230 1702548
58576A702548k6059k9542k9435l1602l8162m3309m2628l9464l7849l5727l0307
$$ 1702548 1676489 1646947 1617512 1585910 1547748 1504439 1461811 1422347 1384498 1348771 1318464
58565A318464k4455k2227k2412k1504j9641j9186k0455k2180k3493k3212k0369
$$ 1318464 1294009 1271782 1249370 1227866 1208225 1189039 1168584 1146404 1122911 1099699 1079330
58554A079330j6859j5716j5839j3224q024m511l251k58M457N123k35n714o380
$$ 1079330 1062471 1046755 1030916 1017692 1009668 1005157 1001906 1001648 1006105 1011228 1010993 1005279 998899
58541I98899m303k497O0L642M986L440L315O013O555K224k135k303j516m147q617
$$ 998899 994596 992099 992159 995801 1000787 1004227 1007542 1013555 1020110 1022334 1020199 1017896 1016380 1012233 1003616
58526A003616j1814j4793j8971k1939k2036k1788k2573k1297j6775j3488j4348
$$ 1003616 991802 977009 958038 936099 914063 892275 869702 848405 831630 818142 803794
58515H03794j5447j2698q124n030k717l99l61k598k572R06K014k710p961q124
$$ 803794 788347 775649 767525 762495 759778 759379 759018 756420 753848 754754 756768 754058 746097 737973
58501G37973n653n027m655j447K109K124j60j789l424n783n861k167J192P86q44
$$ 737973 732320 727293 722638 721191 723300 725424 725264 723475 720051 714268 708407 706240 707432 708218 707374
58486G07374q97j424l630l415J610O652P429P363J0925J5489J6326J4367J2843
$$ 707374 706477 705053 701423 698008 699618 706270 713699 721062 731987 747476 763802 778169 791012
58473G91012J1392R487J0214J4642J7796J6005J2593J0817P661P91n208o453p099
$$ 791012 802404 811891 822105 836747 854543 870548 883141 893958 901619 902410 897202 890749 883650
58460H83650j1927j7922k0363k0970k2452k1428j5003q532q416j2226j3753j2718
$$ 883650 871723 853801 833438 812468 790016 768588 753585 745053 736637 724411 710658 697940
58448F97940j1913j0218o192l352m203m427l95L433K204m17R27L786L467J776
$$ 697940 686027 675809 669617 666265 662062 657635 657240 660673 662877 662460 663387 667173 670640 672416
58434F72416J709Q6n374q381l463L092K238l359m420L32N153Q276J1586J3390
$$ 672416 674125 674211 668837 660456 656993 660085 662323 658964 654544 654876 660029 668305 679891 693281
58420F93281J1694J0818J5214K0765K1257J8784J8399J7849J2746O647N476O819
$$ 693281 704975 715793 731007 751772 773029 791813 810212 828061 840807 847454 852930 859749
58408H59749N220K850M047M806m47o766n829p48r49o182q573p375q558j2031j2029
$$ 859749 864969 867819 871866 876672 876225 869459 863630 862882 861933 855751 847178 839803 831245 819214 807185
58393H07185q666p223p448m826o71N8j159P64M155L833J737L259O336N579L547
$$ 807185 798519 791296 783848 779022 778351 778409 777250 778014 782169 786002 787739 790998 797334 802913 806460
58378H06460N897R205O642K044M291J0549R981K461j395J473K926q56l994k642
$$ 806460 812357 821562 828204 830248 834539 845088 855069 857530 856135 857608 860534 859678 855684 853042
58364H53042J42K814P340J1741J1131O742M105L083k75l752j886K851L188k83
$$ 853042 853184 855998 863338 875079 886210 892952 897057 900140 899865 896113 894227 897078 900266 899983
58350H99983r22J406J368k61J680N215L800j026j910J057J576j22J819O827R025
$$ 899983 899061 900467 901835 901574 903254 908469 912269 911243 909333 910390 911966 911844 913663 920490 929515
58335I29515Q554R700J0442O335J742L939R120Q034K327R13L358J998k202j406
$$ 929515 938069 947769 958211 964546 966288 970227 979347 987381 989708 990621 993979 995977 993775 992369
58321I92369L778N935N376P879J0952Q100L670P057J5212J7697J5567J7691K1992
$$ 992369 996147 1002082 1007458 1015337 1026289 1034389 1038059 1045116 1060328 1078025 1093592 1111283 1133275
58308A133275J9282J2649J3223J9142J8820J3047J3143J8899J9638J5764J7384
$$ 1133275 1152557 1165206 1178429 1197571 1216391 1229438 1242581 1261480 1281118 1296882 1314266
58297A314266K2511J9524J0952J1433K1143K5075K0218J9419K5576K6445J8952
$$ 1314266 1336777 1356301 1367253 1378686 1399829 1424904 1445122 1464541 1490117 1516562 1535514
58286A535514J5047J8743K0067J6262J6525K1391J9929J1564Q270J1230Q354j221
$$ 1535514 1550561 1569304 1589371 1605633 1622158 1643549 1663478 1675042 1683312 1694542 1702896 1701675
58274A701675l669M638J2339J6659K7121M1975M6399L9090L5632M0846M2892L8775
$$ 1701675 1698006 1702644 1714983 1731642 1758763 1800738 1847137 1886227 1921859 1962705 2005597 2044372
58262B044372L9395M5363M5070M0758M7969O4784P1063O3030N8178O1253N7679
$$ 2044372 2083767 2129130 2174200 2214958 2262927 2327711 2398774 2461804 2519982 2581235 2638914
58251B638914M6480M5797N8098O3885N8184N8694O9177P0756N9491N6095O7511
$$ 2638914 2685394 2731191 2789289 2853174 2911358 2970052 3039229 3109985 3169476 3225571 3293082
58240C293082P5604P5038Q4325J07380J23004J25009J33458J53557J64743J63401
$$ 3293082 3368686 3443724 3528049 3635429 3758433 3883442 4016900 4170457 4335200 4498601
58230D498601J73081J98346K13474K11813K19532K44711K62344K66877K87263
$$ 4498601 4671682 4870028 5083502 5295315 5514847 5759558 6021902 6288779 6576042
58221F576042L30448L64109L76763L98923M42202M76541M92437N23648N81694
$$ 6576042 6906490 7270599 7647362 8046285 8488487 8965028 9457465 9981113 10562807
58212A0562807O33282O71112P36980Q43165R45678J030517J147015J317613J501331
$$ 10562807 11196089 11867201 12604181 13447346 14393024 15423541 16570556 17888169 19389500
58203A9389500J690338J949720K313047K740307L233543L879907M716762N685940
$$ 19389500 21079838 23029558 25342605 28082912 31316455 35196362 39913124 45599064
58195D5599064O805561Q250949J0181040J2664284J5901784K0296754K6048694
$$ 45599064 52404625 60655574 70836614 83500898 99402682 119699436 145748130
58188A45748130L2771951L9612606M5378187M8177971M5394715L5104234J8126181
$$ 145748130 178520081 218132687 263510874 311688845 357083560 392187794 410313975
58181D10313975j631522j9326571l1819443l8496508m0323965l8739242l5181044
$$ 410313975 408682453 389355882 357536439 319039931 278715966 239976724 204795680
58174B04795680l0861740k6520179k2435736j8725265j5510219j2825148j0578099
$$ 204795680 173933940 147413761 124978025 106252760 90742541 77917393 67339294
58167F7339294q683597p127226n873974m829835l928115l160234k499454j877250
$$ 67339294 58655697 51528471 45654497 40824662 36896547 33736313 31236859 29359609
58159B9359609j246595n91894J23674R40963J831138K692824L382352L669221
$$ 29359609 28113014 27521120 27644794 28585757 30416895 33109719 36492071 40161292
58151D0161292L243488J953629P1876j807415l190760l948379m192865m064255
$$ 40161292 43404780 45358409 45430285 43622870 40432110 36483731 32290866 28226611
58143B8226611l692777l228827k781795k366871j971344j624668j356561j143384
$$ 28226611 24533834 21305007 18523212 16156341 14184997 12560329 11203768 10060384
58135A0060384r51336p89096o72091n78196m83702m04289l58876l28882k91804
$$ 10060384 9109048 8319952 7647861 7069665 6585963 6181674 5822798 5493916 5202112
58126E202112k60567k52692k52734k40352k25237k21309k15668j94595j72194
$$ 5202112 4941545 4688853 4436119 4195767 3970530 3749221 3533553 3338958 3166764
58117C166764j63104j53965j30670j07068r8276r1949p4074n7836n8752o5292
$$ 3166764 3003660 2849695 2719025 2611957 2513681 2421732 2347658 2289822 2231070 2165778
58107B165778o1717n7025o3878p0882o3259n1183n0967n6373n3569m6957m6330
$$ 2165778 2104061 2047036 1983158 1912276 1849017 1797834 1746867 1690494 1636925 1589968 1543638
58096A543638m5561l7074l0761l6357m3320l9495l3346l6724m2191l8506l2515
$$ 1543638 1498077 1461003 1430242 1393885 1350565 1311070 1277724 1241000 1198809 1160303 1127788
58085A127788l4612l7987l3156k7969l2314l7417l1119k0186j7259j8648j4601
$$ 1127788 1093176 1055189 1022033 994064 961750 924333 893214 873028 855769 837121 822520
58074H22520q848q838r159l385K09o713j4781j2205n313n471q295m887j145n928
$$ 822520 813672 804834 795675 792290 792499 785786 771005 758800 753487 748016 739721 734834 733689 727761
58060G27761j1607o720K427L025j165J522P687N339l544o916l830l193o019o123
$$ 727761 716154 709434 711861 714886 713721 715243 722930 728269 724725 717809 713979 710786 704767 698644
58046F98644m283n841q344o052j958j841k223K287O350K615l603k623L143N105
$$ 698644 694361 688520 680176 674124 672166 670325 668102 670389 676739 679354 675751 673128 676271 681376
58032F81376M214O306Q199L323m395o663n424p422r887o044M36R09l114m273l897
$$ 681376 685590 691896 700095 703418 699023 692360 686936 679514 669627 663583 664019 664928 661814 657541 653644
58017F53644q094j3851j3417q814q175j0888r910n771n206q298r348p972p900
$$ 653644 645550 631699 618282 609468 601293 590405 580495 574724 569518 561220 551872 543900 536000
58004E36000p668l707O81J80k464j731j8k129m366q71M232L288j011p25L036L640
$$ 536000 528332 524625 525306 525486 523022 521291 521273 519144 514778 513907 518139 521427 520416 519691 522727 526367
57988E26367K368N056R224Q006L703M204Q662R680P098O706P848N327J147J200
$$ 526367 528735 533791 543015 551021 554724 558928 567590 577270 584368 591074 598922 604249 605396 606596
57974F06596K456k934j2335j5168r964n677o271p004o176p711j1042j0399n531
$$ 606596 609052 606118 593783 578615 568651 562974 556703 549699 543523 535812 524770 514371 508840
57961E08840k369k291j174P97p96m518l994N25K098q18k475o57P70P54K605N837
$$ 508840 506471 504180 503006 503803 503007 498489 494495 495020 497118 496300 493825 493168 493938 494692 497297 503134
57945E03134O049L655L538N793N912L934L849M394M50o415r041o497m703n183
$$ 503134 509183 512838 516376 522169 528081 532015 535864 540258 540708 534293 525252 518755 514052 508869
57931E08869l643k64o17n089p636o528o560r150r960p698n776m168N73O266O409
$$ 508869 505226 504962 504345 499256 491620 485092 478532 469382 459422 451724 445948 441780 442353 448619 455028
57916D55028J990J541P469J2665J2969J2611J4440J4965J2413J0144Q697L879
$$ 455028 457018 458559 466028 478693 491662 504273 518713 533678 546091 556235 564932 568811
57904E68811l890p708n413l363n258o495l863j772l625n359l104J39O79K81J239
$$ 568811 564921 557213 551800 548437 543179 536684 532821 531049 527424 522065 518961 519100 519779 520060 521299
57889E21299J582k53j970k754n941j2317j6557j4386q043j475M236P798O383R10
$$ 521299 522881 522628 520658 517904 511963 499646 483089 468703 460660 459185 463421 471219 477602 478512
57875D78512l151l272k415j933R96N922P000K614k80L466R206J0528Q970R496
$$ 478512 475361 472089 469674 467741 468737 474659 481659 484273 483993 487459 496665 507193 516163 525659
57861E25659J1488J0940P981N975N646N232M462M246M053K759L42l319q742j4302
$$ 525659 537147 548087 556068 562043 567689 572921 577383 581629 585682 588441 588783 585464 576722 562420
57847E62420j6680j5484j3926j3374j1321o676k743k549m841o715o797m575n40
$$ 562420 545740 530256 516330 502956 491635 484959 482216 479667 474826 468111 461314 456739 456199
57834D56199K079L11l114k537J489K034l523r311j0136q397q243q899q131p132
$$ 456199 458278 458589 455475 452938 454427 456461 452938 443627 433491 425094 416851 407952 399821 392689
57820C92689p530p733o302n053n399n601m654m604n877n097j042K054J008j187
$$ 392689 385159 377426 371124 366071 360672 355071 350417 345813 339936 334839 333797 335851 336859 335672
57806C35672r69k38j976m002k463J519L901M117M800O967R551J2131J4619J5728
$$ 335672 334703 334465 332489 328487 326024 327543 331444 335561 340361 347328 356879 369010 383629 399357
57792C99357J4707J3023J1916J0419Q034O664P368P885O052L157J205l03k129
$$ 399357 414064 427087 439003 449422 457456 464120 471488 479373 485425 488582 489787 489484 487355
57779D87355k578k72K520K349j269o330j0882j3089j1276o344j957j90Q30L070
$$ 487355 484777 484505 487025 489374 488105 481775 470893 457804 446528 440184 438227 438037 438867 441937
57765D41937N006M228J137k304n404p939q494n943j462K406L677J688k102m113
$$ 441937 446943 451171 452308 450004 444600 436661 428167 422224 420762 423168 426845 428533 426431 422318
57751D22318k246N59l36m442o773n461l845l950l175L59M073N355N564O890Q874
$$ 422318 420072 420631 420295 415853 409080 403619 399774 395824 392649 393008 397081 402436 408000 414890 423764
57736D23764J0480J2101J3221J1896Q793P731R811J1215R515P979J0420J5611
$$ 423764 434244 446345 459566 471462 480255 487986 497797 509012 518527 526506 536926 552537
57724E52537K0262K4125K8818L4339L9681M4237M6502M4377L8724L3266K9296
$$ 552537 572799 596924 625742 660081 699762 743999 790501 834878 873602 906868 936164
57713I36164K4484J8559J5307J6528J9148K1310K5986L4759M3235M7464N0593
$$ 936164 960648 979207 994514 1011042 1030190 1051500 1077486 1112245 1155480 1202944 1253537
57702A253537N8105O9932Q2194R3844J06948J22704J41062J62021J84032K03996
$$ 1253537 1311642 1381574 1463768 1557612 1664560 1787264 1928326 2090347 2274379 2478375
57692B478375K21876K41822K65374K86972K99460L00090K87872K60079K16287
$$ 2478375 2700251 2942073 3207447 3494419 3793879 4093969 4381841 4641920 4858207
57683D858207J61697J01489L5951l3552r8185j47702j80121j99556k07547k02856
$$ 4858207 5019904 5121393 5157344 5123792 5025607 4877905 4697784 4498228 4290681 4087825
57673D087825j87199j64239j34254r6122n3759j5268J3069K6767J9675j2104o2365
$$ 4087825 3900626 3736387 3602133 3506011 3452252 3436984 3450053 3476820 3496495 3484391 3422026
57662C422026j16423j61102j89645j99196j90600j71097j50861j34481j19253
$$ 3422026 3305603 3144501 2954856 2755660 2565060 2393963 2243102 2108621 1989368
57653A989368j02111q4115o7637n3142l9838k6643j2387K263J3938K0639K5514
$$ 1989368 1887257 1803142 1735505 1682363 1642525 1615882 1603495 1605758 1619696 1640335 1665849
57642A665849L3009M2737N1379N9297P0158Q4679J00178J16430J36329J59636
$$ 1665849 1698858 1741595 1792974 1852271 1922429 2007108 2107286 2223716 2360045 2519681
57632B519681J81475J99193K16115K35461K53782K63420K59447K41742K11859
$$ 2519681 2701156 2900349 3116464 3351925 3605707 3869127 4128574 4370316 4582175
57623D582175J70624J18822N8865m777o6762j22593j69147k04302k27572k41044
$$ 4582175 4752799 4871621 4930486 4925709 4858947 4736354 4567207 4362905 4135333 3894289
57613C894289k47492k46968k37780k21473k03645j88014j72965j56321j40100
$$ 3894289 3646797 3399829 3162049 2940576 2736931 2548917 2375952 2219631 2079531
57604B079531j27377j17212j06486r4618q3158p2717o3681n7771n5330n2953m7440
$$ 2079531 1952154 1834942 1728456 1633838 1550680 1477963 1414282 1356511 1301181 1248228 1200788
57593A200788m0248l4661l0682k6554k3066k2074k2521k2023k0817k0074j8298
$$ 1200788 1160540 1125879 1095197 1068643 1045577 1023503 1000982 978959 958142 938068 919770
57582I19770j3830r112p638q176o833l527j367r55n55q03l561o764o267k882j744
$$ 919770 905940 896828 889190 881014 874181 870654 869287 868332 867777 866974 863413 856649 850382 847500 845756
57567H45756m034m936j013N352J0369J3228J4545J4424J3775J4427J6632J8994
$$ 845756 841722 836786 835773 841125 851494 864722 879267 893691 907466 921893 938525 957519
57555I57519K1077K3437K5472K6448K8141L2728L8691M2739M5209M9305N5776
$$ 957519 978596 1002033 1027505 1053953 1082094 1114822 1153513 1196252 1241461 1290766 1346542
57544A346542O3031P1656Q3406R6223J06627J17005J33562J55691J74629J85249
$$ 1346542 1409573 1481229 1564635 1660858 1767485 1884490 2018052 2173743 2348372 2533621
57534B533621J92089J99685K03461J95783J76078J48916J15468P3563K4735k4814
$$ 2533621 2725710 2925395 3128856 3324639 3500717 3649633 3765101 3838664 3863399 3838585
57524C838585p0536j12145j49027j77080j92394j95969j92609j85894j76134j63399
$$ 3838585 3768049 3655904 3506877 3329797 3137403 2941434 2748825 2562931 2386797 2223398
57514B223398j50227j39171j28715j15127r8908q5663p8387p2722o3290n1550
$$ 2223398 2073171 1934000 1805285 1690158 1591250 1505587 1427200 1354478 1291188 1239638
57504A239638m2721l7358l1481k3840j7253j2984r219n531l590k614O38O124R699
$$ 1239638 1196917 1159559 1128078 1104238 1086985 1074001 1064782 1059251 1055661 1053047 1053685 1059809 1069508
57491A069508R702R614J2393J6732K1189K7527L6997M7139N5527O3597P3999Q6763
$$ 1069508 1079210 1088824 1101217 1117949 1139138 1166665 1203662 1250801 1306328 1369925 1443924 1530687
57479A530687J00914J17201J36143J55195J70693J81619J89439J95184J97861
$$ 1530687 1631601 1748802 1884945 2040140 2210833 2392452 2581891 2777075 2974936
57470B974936J94486J80805J53695J14002O5978J3987l8483q6973j26565j55240
$$ 2974936 3169422 3350227 3503922 3617924 3683902 3697889 3659406 3572433 3445868 3290628
57460C290628j74512j86299j91382j90955j86639j78633j66690j52880j39975
$$ 3290628 3116116 2929817 2738435 2547480 2360841 2182208 2015518 1862638 1722663
57451A722663j27213j11891r5542q3582p7439p1971o3081n3403m7428m4926m2708
$$ 1722663 1595450 1483559 1388017 1304435 1226996 1155025 1091944 1038541 991113 946187 903479
57440I03479l9744l6842l3583k9076k4234k0470j7418j4270j1915j1556j2522
$$ 903479 863735 826893 793310 764234 740000 719530 702112 687842 675927 664371 651849
57429F51849j3385j4007j4774j5007j3784j1464r263q169q665j0188j0792r096
$$ 651849 638464 624457 609683 594676 580892 569428 560165 551996 543331 533143 522351 513255
57417E13255o504n418n535m622k727k177l242l554k411j799k213j506P67K112
$$ 513255 506751 501333 495798 491176 488449 486272 483030 479476 477065 475266 473053 471547 472314 474426
57403D74426J747K194M101L924l00m733m729j030K252L189K602J557J164K655
$$ 474426 476173 478367 482468 486392 486092 481359 476630 475600 477852 481041 483643 485200 486364 489019
57389D89019N078N221K185n02K64K851M108M077M407M606L309J458R51J492J432
$$ 489019 494097 499318 501503 501001 501265 504116 508224 512301 516708 521314 524623 526081 527032 528524 529956
57374E29956M21j191l687o350o411k373L142O373O663N507L166r16n639q825r510
$$ 529956 530377 529186 525499 519149 512738 510365 513507 519880 526543 532050 535216 534300 528661 519836 510326
57359E10326q092n533l757m713p251p375l768o71k433p336r883p684l092P81K605
$$ 510326 502234 496701 492944 488231 480980 473605 469837 469166 466733 459397 449514 441830 438738 439519 442124
57344D42124K216K94j223l55L057P369J0422J0669Q355N835N052M714K257j607
$$ 442124 444340 444634 443411 443056 446113 453482 463904 474573 482928 488763 493815 498529 500786 499179
57330D99179l476k460j041l17J068K311P6n044p017k735K920M304K995M001P813
$$ 499179 495703 493243 492202 491885 492953 495264 495340 490296 483279 480544 483464 487768 490763 494764 502577
57315E02577J1182J2843J3614J3097J0992R626J0859J2465J1816J0959J3420J7845
$$ 502577 513759 526602 540216 553313 564305 573931 584790 597255 609071 620030 633450 651295
57303F51295J9813J8747J8300K0452K3486K5388K5639K4193K1999K1776K5139
$$ 651295 671108 689855 708155 728607 752093 777481 803120 827313 849312 871088 896227
57292H96227K9906L3028L4574L5831L5674L2743K9316K8735L0171L0201K8342
$$ 896227 926133 959161 993735 1029566 1065240 1097983 1127299 1156034 1186205 1216406 1244748
57281A244748K6685K4935K0271J1993K458o538j5000k2810k9596l5795m1050m2820
$$ 1244748 1271433 1296368 1316639 1328632 1331090 1324552 1309552 1286742 1257146 1221351 1180301 1137481
57269A137481l9765l4984l2358l1350k9081k5684k3241k1167j7606j4210j4055
$$ 1137481 1097716 1062732 1030374 999024 969943 944259 921018 899851 882245 868035 853980
57258H53980j5492j3499p310j570P07J358K446L126K556J856J602Q29j32Q86M064
$$ 853980 838488 824989 817679 816109 816816 818174 820620 823746 826302 828158 829760 830589 830457 831343 835407
57243H35407O045L865j429o205p830o497m728m844n978m819n94K953K708O51N6
$$ 835407 841452 845317 843888 837683 829853 823356 818628 813784 807806 802987 802393 805346 808054 808705 808761
57228H08761M6j985m921n672m508l622k062K183O249N047j27k039K298P764R107
$$ 808761 808807 806822 801901 796229 791721 788099 786037 788220 794469 799516 799389 797350 799648 807412 816519
57213H16519P308N724M880M180M955Q395J2673J4707J3360R777O145M872P042
$$ 816519 823827 829551 834431 838611 843566 851961 864634 879341 892701 902478 908623 913495 920537
57200I20537J0960J3668J3772J1444O797O72m102n172l512j230J906O467R833
$$ 920537 931497 945165 958937 970381 977178 977850 973748 968576 965064 963834 965740 972207 982040
57187I82040R093O240N866Q425J0415J0650J1335J2932J2921J0224O515K726j766
$$ 982040 991133 997373 1003239 1011664 1022079 1032729 1044064 1056996 1069917 1080141 1086656 1089382 1087616
57174A087616o350r598j2368j6493k0793k2527k2125k1992k1772j9921j8704k1445
$$ 1087616 1081266 1071668 1059300 1042807 1022014 999487 977362 955370 933598 913677 894973 873528
57162H73528k5502k4810j9516j6200j7875k0889k2936k6609l2638l6638l6020
$$ 873528 848026 823216 803700 787500 769625 748736 725800 699191 666553 629915 593895
57151E93895l4215l4817l6761l8180l9843m1757m1404l8345l5974l5951l5513
$$ 593895 559680 524863 488102 449922 410079 368322 326918 288573 252599 216648 181135
57140A81135l2872l0482l0178k9792k7649D114b3083k9711l1565l2945l3960l3730
$$ 181135 148263 117781 87603 57811 30162 4114 -23083 -52794 -84359 -117304 -151264 -184994
57128a84994l3430l5690l9101l8251l1231k1993j3068j301J6388L7918N9436P9115
$$ -184994 -218424 -254114 -293215 -331466 -362697 -384690 -397758 -399059 -382671 -344753 -285317 -206202
57116b06202R5147f073A03441J13802J21514J32717J48259J71163K02313K40187
$$ -206202 -111055 -6073 103441 217243 338757 471474 619733 790896 993209 1233396
57106A233396K85908L42759M09940M83562N65264O63604P86831R41776J139384
$$ 1233396 1519304 1862063 2272003 2755565 3320829 3984433 4771264 5713040 6852424
57097F852424J391842J703686K075260K514585L034253L636692M315074N066421
$$ 6852424 8244266 9947952 12023212 14537797 17572050 21208742 25523816 30590237
57089C0590237N884858O739699P579263Q357491R033730R549034R845861R927079
$$ 30590237 36475095 43214794 50794057 59151548 68185278 77734312 87580173 97507252
57081I7507252R843333R573373Q952448P795102O104239M115789K123232K88843
$$ 97507252 107350585 116923958 125876406 133671508 139775747 143891536 146014768 146303611
57073A46303611j376387k913111m340376n647155o797099p731820q396355q772269
$$ 146303611 144927224 142014113 137673737 132026582 125229483 117497663 109101308 100329039
57065A00329039q879328q751689q426885p952216p382244o764235o132808n515738
$$ 100329039 91449711 82698022 74271137 66318921 58936677 52172442 46039634 40523896
57057D0523896m933669m393833l893597l432110l013289k639065k306930k013544
$$ 40523896 35590227 31196394 27302797 23870687 20857398 18218333 15911403 13897859
57049A3897859j755014j524822j317674j134589r78901q48334p36259o39256n57671
$$ 13897859 12142845 10618023 9300349 8165760 7186859 6338525 5602266 4963010 4405339
57040D405339m89567m30095l76914l31127k92408k57586k24601j94233j67611
$$ 4405339 3915772 3485677 3108763 2777636 2485228 2227642 2003041 1808808 1641197
57031A641197j45062j27128j13610j01888q9188p6080o5048n6432m8857m2676
$$ 1641197 1496135 1369007 1255397 1153509 1064321 988241 923193 866761 817904 775228
57021G75228l9334l7686l4753l0372k7612k7885k8847k8336k7488k8187k9415
$$ 775228 735894 698208 663455 633083 605471 577586 548739 520403 492915 464728 435313
57010D35313k8243k3510j6924j0690n050J865J2710K9899N5306Q9859J33055J83047
$$ 435313 407070 383560 366636 355946 350896 352761 365471 395370 450676 540535 673590 856637
56998H56637K36083K83125L06562K85448K10671R6507k5865j27712j95545k28840
$$ 856637 1092720 1375845 1682407 1967855 2178526 2275033 2249168 2121456 1925911 1697071
56988A697071k32936k16738j91325j64629j37849j09695q2557o1774n0297m7073
$$ 1697071 1464135 1247397 1056072 891443 753594 643899 561342 499568 449271 402198
56978D02198m9764n5852o1345o1941n6853m9567B3364a4907l1568k3960j9348
$$ 402198 352434 296582 235237 173296 116443 66876 23364 -14907 -46475 -70435 -89783
56967h9783j9833k1893j9872j2869n449p56L889J2382K3495L2752L9067a3657
$$ -89783 -109616 -131509 -151381 -164250 -169699 -170455 -166566 -154184 -130689 -97937 -58870 -13657
56954C7958N3620M6338K9934R245r729k2663k8760l0700l1321B3373c895k2974
$$ 37958 91578 137916 167850 177095 167366 144703 115943 85243 53922 23373 -3895 -26869
56942b6869k0135j7551j1628k645M479P059Q209J1692J7054g822B1568M0063N3066
$$ -26869 -47004 -64555 -76183 -78828 -74349 -67290 -59081 -47389 -30335 -7822 21568 61631 114697
56929A14697O2973O4244N4124L3678P819j7151l7498n2544o1333o1878E2184F920
$$ 114697 177670 241914 296038 329716 337535 320384 282886 230342 169009 107131 52184 6920
56916b9752k8775k0355j3447j0865j1949j3766j4872j5087j3156q120k019J881
$$ -29752 -58527 -78882 -92329 -103194 -115143 -128909 -143781 -158868 -172024 -180144 -182163 -180282
56904a80282L114L616L864K571K73J64M149J0030J3871J4003J1800R495Q347Q783
$$ -180282 -177168 -173552 -169688 -167117 -166844 -166680 -162531 -152501 -138630 -124627 -112827 -103332 -94985 -86202
56890h6202J1299J6409K3695c190C5672M5314N0557N2091M6521L2888J3942n686
$$ -86202 -74903 -58494 -34799 -3190 35672 80986 131543 183634 230155 263043 276985 271299
56878B71299k1646l1009l3473l1830k9494k7207k3412j7613j1247n229R77P278
$$ 271299 249653 218644 185171 153341 123847 96640 73228 55615 44368 39139 40116 47394
56866D7394J2367J6408K2322L2994M8342O6126Q4199J00655J12429J14885J03247
$$ 47394 59761 76169 98491 131485 179827 245953 330152 430807 543236 658121 761368
56855G61368P5615L5961o467m2329o6924p9598q1110p4239o4798n7560n1339m1713
$$ 761368 836983 872944 866477 824148 757224 677626 596516 522277 457479 399919 348580 306867
56843C06867k8276j5051l755Q575K4287M2126O1026Q2490J07153J32725J56868
$$ 306867 278591 263540 259785 268360 292647 334773 395799 478289 585442 718167 875035
56832H75035J77453J87567J75666J35652P4612P447n3514j01203j31154j42374
$$ 875035 1052488 1240055 1415721 1551373 1625985 1633432 1579918 1478715 1347561 1205187
56822A205187j39589j29811j16660j00767q3940o8805n5103m0337k4161q754N406
$$ 1205187 1065598 935787 819127 718360 634420 565615 510512 470175 446014 437260 442666
56811D42666K1052M0453O2627Q5047J06121J24373J35560J32067J07050O1040
$$ 442666 463718 504171 566798 651845 757966 882339 1017899 1149966 1257016 1318056
56801A318056M500m7982q6831j10366j20312j18390j08010r4930q3139p2032n9784
$$ 1318056 1322556 1274574 1187743 1077377 957065 838675 730665 635735 552596 480564 420780
56790D20780m7332l6738k7657j8042p092M575J6363K7694L8039M8263N9587O9420
$$ 420780 373448 336710 309053 291011 283919 288494 304857 332551 370590 418853 478440 547860
56778E47860P0690N8157L4069N686k0887m2528n7514o5516o8124o6944o2207n4732
$$ 547860 618550 676707 710776 716462 695575 653047 595533 530017 461893 394949 332742 278010
56766B78010m7089m0659l3815k5542j8507j5604j5527j5025j3647j2897j2356
$$ 278010 230921 190262 156447 130905 112398 96794 81267 66242 52595 39698 27342
56755B7342j0523q277H28g264o574k753O71J637M37j912m284m899l019q51j230
$$ 27342 16819 8542 828 -7264 -13838 -16591 -15920 -14283 -13846 -15758 -20042 -24941 -27960 -28811 -30041
56740c0041l713n364m831k950j60L515O081M714O7l471l124j185j870o026j0221
$$ -30041 -33754 -39118 -43949 -46899 -47059 -43544 -37463 -32749 -32682 -36153 -39277 -40462 -42332 -48358 -58579
56725e8579j0585o849k511r94k113l114k552j157O94L238M649J860m178p802n796
$$ -58579 -69164 -76013 -78524 -79518 -81631 -84745 -87297 -88454 -87760 -84522 -79873 -78013 -82191 -89993 -95789
56710i5789j917j071k261j410J405K385K11k777m966o827q216q028o596n413m704
$$ -95789 -97706 -98777 -101038 -102448 -101043 -98658 -98447 -101224 -106190 -113017 -121233 -129261 -135857 -141270 -145974
56695a45974m076m497o528p709n501j817m67p97J458O847J0662R814O822N080
$$ -145974 -150050 -154547 -161075 -168784 -174285 -176102 -176569 -177366 -175908 -169061 -158399 -148585 -141763 -136683
56681a36683L935J024l271o382p100o545o427p517r219j0070r295p858p143p061
$$ -136683 -132748 -131724 -134995 -141377 -148477 -155022 -161449 -168966 -178185 -188255 -197550 -205408 -212551 -219612
56667b19612o681n921n073l202R59O623J1064J2142R913O471N016P553J2273J4832
$$ -219612 -226293 -232214 -237287 -240489 -239530 -232907 -221843 -209701 -199788 -193317 -188301 -180748 -168475 -153643
56653a53643J3754J2267J2981J3682J1462Q183P427Q006N489m94n359o098m363
$$ -153643 -139889 -127622 -114641 -100959 -89497 -81314 -73887 -65881 -60392 -60886 -66245 -72343 -76706
56640g6706k753k094l025o342j0582j2521j1109q214n170j648J674K762J503J97
$$ -76706 -79459 -81553 -84578 -90920 -101502 -114023 -125132 -133346 -138516 -140164 -138490 -135728 -134225 -134028
56626a34028p0n47j437p02K460N845P588Q799J1158J4061J5863J6390J6775J7747
$$ -134028 -134098 -134645 -136082 -136784 -134324 -128479 -120891 -112092 -100934 -86873 -71010 -54620 -37845 -20098
56612b0098a201A7623J6016J1009P150P189R341R099N002J19k376k522j855j045
$$ -20098 -1201 17623 33639 44648 51798 58987 68328 77427 82429 82548 80172 77650 75795 74750
56598G4750l53m52j467k533k962k812k144r40J86N49M31L34k27j557k397j696
$$ 74750 74397 73945 72478 69945 66983 64171 62027 61087 61273 61822 62253 62587 62360 60803 58406 56710
56582E6710j012k634n856p637o785m990l815l180k826k815k376m22K503M715N844
$$ 56710 55698 53064 47208 39571 32786 27796 23981 20801 17975 15160 12784 12362 14865 19580 25424
56567B5424O905Q189R025R394R789R812Q782P329O492N827M352K747K442L126
$$ 25424 32329 40518 49543 58937 68726 78538 87320 94649 101141 106968 111320 114067 116509 119635
56553A19635L220K262J041J01k20M50J096o65n100q821r023p163n936n118l485
$$ 119635 122855 125117 126158 126259 126039 126489 127585 126920 121820 112999 103976 96813 90877 85759 82274
56538H2274k258k899l755k828j756k936m836m569l011k720k813r43J435J173p57
$$ 82274 80016 77117 73362 70534 68778 65842 61006 56437 53426 50706 47893 46950 48385 49558 48801
56523D8801r87Q5n54k603l401l571n551p623n804j212R62n13k167k588l367l826
$$ 48801 47814 47899 47345 44742 41341 37770 32219 24596 18792 17580 18542 18029 15862 13274 9907 6081
56507F081j916l1A702e159o771k204J68j038N92g076E038R346L028n43j031n27
$$ 6081 4165 4134 1702 -5159 -11930 -14134 -13966 -15004 -14412 -7076 5038 14384 17412 16869 15838 15311
56491A5311J456M535M934J162k870m099m275m245p55O747J2401J1997R058P993
$$ 15311 16767 21302 26236 27398 24528 20429 16154 11909 11154 17901 30302 42299 51357 59350
56477E9350P080L723R84K337M498K196l301o368m941j164K937N714M819O48k051
$$ 59350 66430 70153 71137 73474 77972 80168 76867 70499 65558 64394 67331 73045 77864 78512 76461
56462G6461l42K309J810L8Q62L258L781K936L509M928M511K414O64q92l167m412
$$ 76461 76119 78428 80238 80276 81138 84396 88177 91113 94622 99550 104061 106475 107139 106247 103080 98668
56446I8668k647K43J064K16J87R57Q64K64N11O98j128m707q185j0427j0682q288
$$ 98668 96021 96264 97328 97544 97731 98688 99552 99816 100327 101025 99897 95190 87005 76578 65896 57608
56430E7608m736l043l214k044M87m67o712j2427j1851F496B796B32a468j805m448
$$ 57608 52872 49829 46615 44571 45058 44591 37879 25452 13601 6496 2796 232 -1468 -3273 -7721
56415g721p815r643j1665j5709j8363j5182p802j235L796J0219J8126K4414a1067
$$ -7721 -15536 -25179 -36844 -52553 -70916 -86098 -93900 -95135 -91339 -81120 -62994 -38580 -11067
56401A6639K4339J7626J1443R309R091O521K279N95K289M319N188N883O405O101
$$ 16639 40978 58604 70047 79356 88447 94968 97247 97842 100131 104450 109638 115521 121926 128027
56387A28027O580R676J3175J2972Q994N029L272K718K215J570K59j855l354l403
$$ 128027 134607 144283 157458 170430 179424 184453 187725 190443 192658 194228 194487 192632 189278 185875
56373A85875l454m398m379k443j526m230q228r746r113q790q430o157k653K22
$$ 185875 182421 178023 173644 171201 169675 165445 157217 147471 138358 129568 121138 114981 112328 112550
56359A12550K830N994Q127P885P176P702P393M294Q00m15j273m149o223l628J564
$$ 112550 115380 121374 129501 137386 144562 152264 159657 163951 164751 164336 163063 158914 152691 149063 150627
56344A50627M325M383N180P133P781P081P158P939P996Q211R939J1341J0175Q237
$$ 150627 154952 159335 164515 171648 179429 186510 193668 201607 209603 217814 227753 239094 249269 257506
56330B57506Q433R672R440Q803R835J0744R005O642O805P710N882K925K836M832
$$ 257506 265939 275611 285051 293854 303689 314433 323438 330080 336885 344595 350477 353402 356238 361070
56316C61070M987L070J741Q54j511m194m749m050l733k068J839L392j175p189
$$ 361070 366057 369127 370868 371722 370211 366017 361268 357218 353485 351417 353256 356648 355473 348284
56302C48284p730m166k633l221j554J456J052j677j200K157K860R53K371P757
$$ 348284 340554 336388 333755 330534 328980 330436 331488 329811 328611 330768 333628 334581 336952 344709
56288C44709J0567Q125N806P756J1255J2873J3300J3567J2839J2217J5002K1075
$$ 344709 355276 363401 369207 376963 388218 401091 414391 427958 440797 453014 468016 489091
56276D89091K6042K7440K7367K8365L1125L6002M2156M6229M6920M9139N7735
$$ 489091 515133 542573 569940 598305 629430 665432 707588 753817 800737 849876 907611
56265I07611O9370P7434Q2776R1494J03903J14697J23312J34736J49643J62799
$$ 907611 976981 1054415 1137191 1228685 1332588 1447285 1570597 1705333 1854976 2017775
56255B017775J72373J82166J93138K00839K02885K01261J95804J83038J63153
$$ 2017775 2190148 2372314 2565452 2766291 2969176 3170437 3366241 3549279 3712432
56246C712432J40828J17750R1214O1202L1710M312k2246m5776o1933p2457q3683
$$ 3712432 3853260 3971010 4062224 4123426 4155136 4159448 4137202 4091426 4029493 3957036 3873353
56235C873353r5855j02540j02051j00518j01505j01377r7854r5001r6422j00546
$$ 3873353 3777498 3674958 3572907 3472389 3370884 3269507 3171653 3076652 2980230 2879684
56225B879684j05295j10829j15610j16670j15373j16181j18538j17348j12226
$$ 2879684 2774389 2663560 2547950 2431280 2315907 2199726 2081188 1963840 1851614
56216A851614j08246j06620j03158r6914r1297q5419p4396o0349n2578n3445n4047
$$ 1851614 1743368 1636748 1533590 1436676 1345379 1259960 1185564 1125215 1072637 1019192 965145
56205I65145m7977l9718l4826l1302k6333k3045k4207k6023k4013j9418j5231
$$ 965145 917168 877450 842624 811322 784989 761944 737737 711714 687701 668283 653052
56194F53052j1383p775o530p703p976o273n292n590m187m72K849N726J0414J4595
$$ 653052 641669 633894 627364 619661 611685 605412 600120 594530 590343 589871 592720 598446 608860 623455
56180F23455J3028P227M702P002P696M071J222J878J830j214l383k538j754k051
$$ 623455 636483 643710 648412 655414 663110 667181 668403 670281 672111 670897 667514 664976 663222 661171
56166F61171n14J902Q4n114o337j919J387N62M80K995L280P01J543O690Q501M952
$$ 661171 660657 662559 662643 657529 651192 649273 650660 651222 651702 654697 657977 658678 660221 666911 675412 680364
56150F80364M701J2149J9354J9670J8181K1242K6131K8668L1424L7217M3549M9988
$$ 680364 685065 697214 716568 736238 754419 775661 801792 830460 861884 899101 942650 992638
56138I92638O1631P9346R6431J10651J28584J51655J69432J74402J72081J68298
$$ 992638 1054269 1133615 1230046 1340697 1469281 1620936 1790368 1964770 2136851 2305149
56128B305149J58036J36694J12162R5259Q6240P9751P4885P1446O4111M9221L1020
$$ 2305149 2463185 2599879 2712041 2807300 2893540 2973291 3048176 3119622 3183733 3232954 3263974
56117C263974J4447j160j5674k4525k7620l2884m5046o0206p6380r7998j23952
$$ 3263974 3278421 3277261 3261587 3237062 3209442 3176558 3131512 3071306 2994926 2896928 2772976
56106B772976j43527j51559j55569j60339j58373j44586j27495j15666j05088
$$ 2772976 2629449 2477890 2322321 2161982 2003609 1859023 1731528 1615862 1510774
56097A510774r0320p6389o8669o2060n1263m1390l7705l5232k8974k4019k5156
$$ 1510774 1420454 1344065 1275396 1213336 1162073 1120683 1082978 1047746 1018772 994753 969597
56086I69597k6775k3057j7781j4705r707j716J215l333m644L116R492O043J657
$$ 969597 942822 919765 901984 887279 877572 875856 877071 873738 869094 872210 881702 887745 889402
56073H89402O292J3619J4314J3316J8488K4350K2616J7772J7322J7510J3113J0074
$$ 889402 895694 909313 923627 936943 955431 979781 1002397 1020169 1037491 1055001 1068114 1078188
56061A078188J4089J8105J5312J2526J6446J9675J5237J1579J7151K3606K1064
$$ 1078188 1092277 1110382 1125694 1138220 1154666 1174341 1189578 1201157 1218308 1241914 1262978
56050A262978J6720K0697K6471K3519J7143J7548K1163K0456J9983K4948K6838
$$ 1262978 1279698 1300395 1326866 1350385 1367528 1385076 1406239 1426695 1446678 1471626 1498464
56039A498464J8515J0257J2419J6207J0821N019J1219K2699K7671L1376M2444
$$ 1498464 1516979 1527236 1539655 1555862 1566683 1571702 1582921 1605620 1633291 1664667 1707111
56028A707111N2001M9058M2390M4470M8350M3679L9845M8549N8990N6227M8883
$$ 1707111 1759112 1808170 1850560 1895030 1943380 1987059 2026904 2075453 2134443 2190670 2239553
56017B239553N2452O0663O0326N8295O5474P0665O0256M7567N1649O3051O2521
$$ 2239553 2292005 2352668 2412994 2471289 2536763 2607428 2667684 2715251 2766900 2829951 2892472
56006B892472N7120O4178P5700P4038O7554P4708Q7702Q8652Q6696J01347J24065
$$ 2892472 2949592 3013770 3089470 3163508 3231062 3305770 3393472 3482124 3568820 3670167 3794232
55995C794232J34887J41477J61913J85013J89497J86270J98789K18038K21423
$$ 3794232 3929119 4070596 4232509 4417522 4607019 4793289 4992078 5210116 5431539
55986E431539K18815K33510K56029K65347K76290L13865L60681L84717L98879
$$ 5431539 5650354 5883864 6139893 6405240 6681530 6995395 7356076 7740793 8139672
55977H139672M35357M82799N10869N34611N88036O56822P08090P62721Q61632
$$ 8139672 8575029 9057828 9568697 10103308 10691344 11348166 12056256 12818977 13680609
55968A3680609R85472J090651J198947J361431J561820J756166J980695K309851
$$ 13680609 14666081 15756732 16955679 18317110 19878930 21635096 23615791 25925642
55960B5925642K736672L218113L808021M603684N592139O717382Q080847R895999
$$ 25925642 28662314 31880427 35688448 40292132 45884271 52601653 60682500 70578499
55952G0578499J2280684J5333809J9398184K4913530L1877921L9639946M7128786
$$ 70578499 82859183 98192992 117591176 142504706 174382627 214022573 261151359
55945B61151359N2752201N3952346M7776524L3034519J2135646r731743k7608310
$$ 261151359 313903560 367855906 415632430 448666949 460802595 451070852 423462542
55938D23462542l9105300m4386152m4833935m2089468l7704507l2853288k8122689
$$ 423462542 384357242 339971090 295137155 253047687 215343180 182489892 154367203
55931A54367203k3703903j9740922j6373820j3586383j1249722r302911p750334
$$ 154367203 130663300 110922378 94548558 80962175 69712453 60409542 52659208
55924E2659208o526430n510832m655908l977769l443043k975920k559207k225967
$$ 52659208 46132778 40621946 35966038 31988269 28545226 25569306 23010099 20784132
55916B0784132j964303j722095j492964j311416j172701j036370r00204p96566
$$ 20784132 18819829 17097734 15604770 14293354 13120653 12084283 11184079 10387513
55908A0387513p23007o45307n62338n03153m66260m22952l74640l48036l38835
$$ 10387513 9664506 9019199 8456861 7953708 7487448 7064496 6689856 6341820 6002985
55899F002985l16410k79989k56630k47589k28482j99248j83802j82169j70867
$$ 6002985 5686575 5406586 5149956 4902367 4673885 4474637 4290835 4108666 3937799
55890C937799j49377j40405j45058j41919j29963j29400j39713j38467j23084
$$ 3937799 3788422 3648017 3502959 3361040 3231077 3101677 2961964 2823497 2700413
55881B700413j14242j16200j11554r7303q9625r0514q4335o9839o2384o2604n5124
$$ 2700413 2586171 2469971 2358417 2261114 2171489 2080975 1996640 1926801 1864417 1801813 1746689
55870A746689m0047l4066l8616l7770k9314k7447l3016l1360k1846j9813k6313
$$ 1746689 1706642 1672576 1633960 1596190 1566876 1539429 1506413 1475053 1453207 1433394 1407081
55859A407081k5059j2869m872n662k749O797R871K309m786q293j8232l5005m5240
$$ 1407081 1382022 1369153 1364281 1358619 1355870 1362667 1372538 1374847 1370061 1361768 1343536 1308531 1263291
55846A263291m5227m6170n1734n2491m6789m5122m9229m8217l9945l5447l7705
$$ 1263291 1218064 1171894 1120160 1067669 1020880 975758 926529 878312 838367 802920 765215
55835G65215l6468k8738k4264k5863k3813j4802p823o435l340K976M082j509m538
$$ 765215 728747 700009 675745 649882 626069 611267 603444 597009 593669 596645 600727 599218 594680
55822E94680k215k309o459o381m90K573O56J744P468R590O446O111R582P720q88
$$ 594680 592465 590156 583697 577316 576826 579399 580055 581799 589267 598857 605303 611414 620996 628716 627828
55807F27828n609j997J555j73k105k109n653j2554j4268r334p064j1354j5144
$$ 627828 622219 620222 621777 621604 619499 617390 611737 599183 584915 575581 568517 557163 542019
55794E42019j5036j6630k0953k0521j3953j0119j2683j4481j2180j2245j7037
$$ 542019 526983 510353 489400 468879 454926 444807 432124 417643 405463 393218 376181
55783C76181j8857j3815q417o722l838K075M003j656q722j2416j5597j9097j7849
$$ 376181 357324 343509 335092 328370 324532 326607 330610 328954 320232 307816 292219 273122 255273
55770B55273j1788q761j1363j2107o750j041O77K209N663O014J082l495m302n249
$$ 255273 243485 234724 223361 211254 204504 203463 204140 206349 212012 218026 219108 215613 211311 206062
55756B06062q155q427m451j373j670j816j393m683j0171j0062l866o65l989o569
$$ 206062 197907 189480 185029 183656 181986 180170 178777 174094 163923 153861 149995 149330 145341 138772
55742A38772m253k559m400m038Q99L583O08j428J383K740j484m679j392K702J053
$$ 138772 134519 131960 127560 123522 124421 128004 128612 127184 128567 131307 129823 125144 123752 126454 127507
55727A27507k931l531k676m130n498l677j368j517j770k36J73j796k199M95J976
$$ 127507 124576 121045 118369 114239 108741 105064 103696 102179 100409 100173 100346 98550 96351 96846 98822
55712I8822P16J561O083Q356N611M005P941J2576J3132J2911J5441J6985J3689
$$ 98822 99538 101099 107182 115538 121149 125154 133095 145671 158803 171714 187155 204140 217829
55699B17829Q649N372J674l770o383l705j204l820q518j0978j2301j3510j1152
$$ 217829 226478 231850 233524 229754 223371 219666 218462 214642 206124 195146 182845 169335 158183
55686A58183m683n18k302m541k130J456K190L610R164J3778J1491N430K178J504
$$ 158183 153500 152982 150680 146139 144009 145465 147655 151265 160429 174207 185698 191128 193306 194810
55672A94810o00l569m326l504l176k344l90l69l602n801l780p87q5J007N077Q210
$$ 194810 194210 190641 186315 182811 179635 177291 176901 176532 172930 167129 163349 162562 162477 163484 168561 176771
55656A76771N762j24m338n603m780j511K746L556J6k870k507l303q553j4137j5254
$$ 176771 182533 182409 178071 172468 167688 166177 168923 172479 172495 169625 167118 163815 155262 141125 125871
55641A25871j3144j0534p014l631m745j0022j2060p609l363m598o472l757p74
$$ 125871 112727 102193 95179 91548 86803 76781 64721 57112 53749 49151 42679 38922 38148
55628C8148l020o524m974j112j316m212m281k187k200l300j865K82p82a86j064
$$ 38148 35128 28604 23630 22518 21202 16990 12709 10522 8322 5022 3157 3439 2657 -186 -1250
55613a250A797M230K445J558J529o24l998A959a465j684K94B17L914P63B037g65
$$ -1250 1797 6027 8472 10030 11559 10935 6937 1959 -1465 -3149 -2855 217 4131 4894 2037 -765
55596a653q71j503R6J924O90j300K65A716N526M116K373M82k079k826k97J519
$$ -1653 -2524 -4027 -3931 -2007 -1317 -2617 -2352 1716 7242 11358 13731 14213 12134 9308 9011 10530
55580A0530j045D702e53m926q313j2637j1434n072R8J475J772K302J745O74J261
$$ 10530 9485 4702 -553 -5479 -13792 -26429 -37863 -42935 -42837 -41362 -39590 -37288 -35543 -34869 -33608
55565c3608L246M955O500P544N119j085n011j809M366c356A184L490L801K976
$$ -33608 -30362 -25407 -18907 -11363 -6244 -7329 -12340 -14149 -9783 -3356 1184 4674 8475 11451
55551A1451K398M957Q217P671M720M066N444N452N108P639J0843R947O511O222
$$ 11451 13849 18806 27023 34694 39414 43480 48924 54376 59484 67123 77966 87913 94424 100646
55537A00646R165J0513R692J0409J2083J0029M334K98o62k716p350j0874j1536
$$ 100646 109811 120324 130016 140425 152508 162537 166871 167169 166507 163791 156441 145567 134031
55524A34031j2174j4304j5709j5258j4506j3636j1111p828o221n293k172J494
$$ 134031 121857 107553 91844 76586 62080 48444 37333 29505 23284 17991 15819 17313
55512A7313Q98l962F474a429p079p436p777p650q597j0280j0304q663p642o984
$$ 17313 18211 14249 6474 -1429 -8508 -15944 -23721 -31371 -39968 -50248 -60552 -69215 -76857 -83841
55498h3841l914J612O309Q341Q394O535K874M66K133M882L251k019m486j163M549
$$ -83841 -87755 -86143 -79834 -71493 -63099 -56564 -53690 -53224 -51091 -46209 -42958 -44977 -49463 -50626 -46077
55483d6077R415J3967c894A8750K5109K6892K6582K1819J3639N414k157j0237
$$ -46077 -36662 -22695 -3894 18750 43859 70751 97333 119152 132791 138205 136048 125811
55471A25811j6857j8233j4850j1037q663o173l288j452k49J216N78m274r316q699
$$ 125811 108954 90721 75871 64834 56171 49998 46710 45258 45009 46225 46803 42529 33213 24514
55457B4514l989j877l324k948O53K407l1k698k974l269A952a346a20D184K942
$$ 24514 20525 18648 15324 12376 13029 15436 15405 12707 9733 6464 1952 -1346 -120 4184 7126
55442G126N45P32J910J473M21K31n36l167B831c976o211m614j896k3j979o229
$$ 7126 7671 8403 10313 11786 12207 12438 11902 8735 2831 -3976 -10187 -14801 -16697 -16720 -18699 -24928
55426b4928o926j828M202N939M051K338K566M179d669B31K69d780o613k826J704
$$ -24928 -31854 -33682 -29480 -23541 -19490 -17152 -14586 -10407 -4669 231 500 -4780 -11393 -14219 -12515
55411a2515L498L271K322J48k862m428l565j408J530N096b504c61n386r415p332
$$ -12515 -9017 -5746 -3424 -3276 -6138 -10566 -14131 -15539 -14009 -8913 -2504 -361 -5747 -15162 -22494
55396b2494l452k142k810k950j660J103M604O108L905J250K197M281J848l685
$$ -22494 -25946 -28088 -30898 -33848 -35508 -34405 -29801 -23693 -19788 -18538 -16341 -12060 -10212 -13897
55382a3897m878m68K040j515n541m299l82J021n1j005j653k015l36K655K607j431
$$ -13897 -18775 -19243 -17203 -18718 -24259 -28558 -28940 -27919 -27970 -28975 -30628 -32643 -32979 -30324 -27717 -29148
55366b9148m105j880J345J000j379k653l945o811q519o604l539j735J316P267
$$ -29148 -33253 -35133 -33788 -32788 -34167 -36820 -40765 -47576 -56095 -62699 -66238 -67973 -66657 -59390
55352e9390J1210Q412K741J374M197N409L319J492J601J657Q84N76M11j138l115
$$ -59390 -48180 -39768 -37027 -35653 -31456 -26047 -22728 -21236 -19635 -17978 -17094 -16518 -16107 -17245 -20360
55337b0360l192j804j042n71J053K175l3m060n265k558M68J235R08R32P85J90
$$ -20360 -23552 -25356 -26398 -26969 -25916 -23741 -23774 -27834 -33099 -35657 -35189 -33954 -33046 -32114 -31329 -31139
55321c1139M00J825K644J134j874l668k311J277L853L215R37J18O57k45k661k992
$$ -31139 -30739 -28914 -26270 -25136 -27010 -30678 -32989 -31712 -27859 -24644 -23707 -23589 -22932 -23177 -25838 -28830
55305b8830q9J888m69m567o105n317m919m604k134J856M502N059M804L825J674
$$ -28830 -28919 -27031 -27500 -32067 -38172 -43489 -48408 -53012 -55146 -53290 -48788 -43729 -38925 -35100 -33426
55290c3426J80J636M785O159M981L399K452J247j25m03Q0l20j347j102J55l12
$$ -33426 -33246 -31610 -26825 -20666 -15685 -12286 -9834 -8587 -8712 -9115 -9035 -9355 -10702 -11804 -11649 -11961
55274a1961l383o154n689k619M60K454M179O119P196c410h64j365l897m558l783
$$ -11961 -15344 -21498 -27187 -29806 -29346 -26892 -22713 -16594 -9398 -3410 -864 -2229 -6126 -10684 -14467
55259a4467j832P68K519K544K446c790B740N631Q64l850C85b983j771j553k869
$$ -14467 -16299 -15531 -13012 -10468 -8022 -3790 2740 8371 9235 5385 385 -2983 -4754 -6307 -9176
55244i176n676q454q272m361J21J833J026j19q78j573j480M75L708O237O368L638
$$ -9176 -14852 -23306 -31578 -35939 -35818 -33985 -32959 -33078 -33956 -35529 -37009 -36534 -32826 -26589 -20221 -16583
55228a6583m35k387M9M281N212J999r10q00p23l989q337r201o122k198R48L863
$$ -16583 -17018 -19405 -19356 -15075 -9863 -7864 -8774 -9574 -10297 -14286 -22623 -31824 -37946 -40144 -39196 -35333
55212c5333O128O048L359k76l226m804m897m131l502k864j022J909M161N003N526
$$ -35333 -29205 -23157 -19798 -20074 -23300 -28104 -33001 -37132 -40634 -43498 -44520 -42611 -38450 -33447 -27921
55197b7921N757L940Q8k657k287p49m63p60p0J037J312R89L43j261k866j667K381
$$ -27921 -22164 -18224 -18136 -20793 -23080 -23829 -24292 -25052 -25122 -24085 -22773 -21784 -21441 -22702 -25568 -27235 -24854
55180b4854M955L267K38k94P51N11n79o28o41k412m155k825O91K876K847K364
$$ -24854 -19899 -16632 -16394 -16688 -15937 -15426 -16005 -16633 -17274 -19686 -23841 -26666 -25975 -23099 -20252 -17888
55164a7888J982R87K0l0m83k562m131k683q0%j858j808Q10K818K699K315K709
$$ -17888 -15906 -14919 -14899 -14929 -15412 -17974 -22105 -24788 -24868 -24868 -26726 -28534 -27724 -24906 -22207 -19892 -17183
55147a7183K437R97L63J834M085b261B379K706K33j320j107o2N66Q21P30p93F37
$$ -17183 -14746 -13749 -13386 -11552 -7467 -2261 2379 5085 5318 3998 2891 2829 3395 4216 4946 4153 637
55129c863k085P85O00j192p44J752b031f45a03A163J597P99O52J557J355p03k220
$$ -3863 -5948 -5163 -4563 -5755 -6499 -4747 -2031 -645 -103 1163 2760 3559 4211 5768 7123 6420 4200
55112D200j328O75J796K116K775L896M485L445N56k583l506k158j658l810C197
$$ 4200 2872 3547 5343 7459 10234 14130 18615 22060 22616 20033 16527 14369 12711 8901 3197
55096f31R5H07b7k687k001m26O09J970A228M047J756j279B604a142l129o94b110
$$ -631 -536 807 -27 -2714 -4715 -5141 -4532 -2562 1228 5275 7031 5752 2604 -1142 -4271 -4965 -2110
55078B951M668L067K034J667J246M10j032k858l731k505k98N17n35j780A659d65
$$ 2951 7619 10686 12720 14387 15633 16043 15011 12153 8422 5917 5619 6136 5601 3821 1659 -465
55061b247n27J177B70J524J798L201L892K295m53j688k33K291K992P81k068k281
$$ -2247 -2774 -1597 270 1794 3592 6793 10685 12980 12527 10839 10606 12897 15889 16670 14602 12321
55045A2321K51K411K304J470J444R02j473l749l323r30Q21J489K462L894M761
$$ 12321 12572 14983 17287 18757 20201 21103 19630 15881 12558 11628 12449 13938 16400 20294 25055
55030B5055M835M173K028j370l764l993l974m947m637j452J645J766J378L835
$$ 25055 29890 34063 36091 34721 30957 26964 22990 18043 13406 11954 13599 15365 16743 20578
55016B0578O590N026P86p25K71j382n916p440l891o54j778m181C427A371b17j761
$$ 20578 27168 32194 32980 32255 32526 31144 25228 17788 13897 13243 11465 7284 3427 1371 -217 -1978
55000a978p81N52R31a71A344O22B37b205L45A877L913J192j262j899j588F40a755
$$ -1978 -2759 -2207 -1276 -171 1344 1966 237 -2205 -1860 1877 5790 6982 5720 3821 2233 640 -1755
54982d978k022K082A341O823M832M928P871Q761M694l96j510N78J821J340J435
$$ -4978 -7000 -4918 1341 8164 12996 17924 25795 34556 39250 38854 37344 37922 39743 41083 42518
54967D2518K971M255L859K207Q78J668N327J0274J3956J5983J7979K0078K0355
$$ 42518 45489 49744 53603 55810 56688 58356 63683 73957 87913 103896 121875 141953 162308
54954A62308J8463J6613J5682J3474Q487K438k657o984j0831j3102j3864j5329
$$ 162308 180771 197384 213066 226540 235027 237465 234808 227824 216993 203891 190027 174698
54942A74698j8086j9329j7132j3557j1193r616p787o705o651m997m57L175J701
$$ 174698 156612 137283 120151 106594 95401 85785 77998 71293 64642 59645 59188 62363 64064
54929F4064l070n718m410j765K85K049L058J871n33p88K333O242Q253Q673R125
$$ 64064 60994 55276 50866 49101 49386 51435 54493 56364 55831 55043 57376 63618 71871 80544 89669
54914H9669R923J0598J1487J3205J4943J4756J1786P385L343m97n677j1990j6690
$$ 89669 99592 110190 121677 134882 149825 164581 176367 183752 187095 186598 180921 168931 152241
54901A52241j7907j7117j6353j4654j0265n206l686n961p642n968l147k016j820
$$ 152241 134334 117217 100864 86210 75945 70739 67053 61092 53450 47482 44335 42319 40499
54888D0499l85K302M749N933M851N38n466q795o684j296L012M137K710K12j690
$$ 40499 40114 42416 47165 53098 57949 58487 53021 44226 37542 36246 39258 43395 46105 46317 44627
54873D4627j637j99L60j032k973l872l492j640J871N049M517R2m107m795l160
$$ 44627 42990 42791 43151 42119 39146 35274 31782 30142 32013 37062 41579 41671 37564 32769 29609
54858B9609j812j073k63J32k33n69r98k789m777l271J944N275K619k409l700j315
$$ 29609 27797 26724 26461 26593 26360 25791 24793 22004 17227 13956 15900 21175 23794 21385 17685 16370
54842A6370k11k205m223l925k509j573q07M10J645K186J819Q97N76J784L150K085
$$ 16370 16159 13954 9731 5806 3297 1724 917 1327 2972 5158 6977 7874 8450 10234 13384 15469
54826A5469p51r38L384P669O806K252o58n00l34j574k111n95J481K725L637M643
$$ 15469 14718 13780 17164 24833 31639 33891 33233 32733 32399 30825 28714 28119 29600 32325 35962 40605
54810D0605M981M325L515L355M213O474R681J1966J2203J2119J4072J7469J9505
$$ 40605 45586 49911 53426 56781 60994 67468 77149 89115 101318 113437 127509 144978 164483
54797A64483J8743J5860J1711O900K526r55m799r782j3957j4936j3354j1628j0468
$$ 164483 183226 199086 210797 217697 220223 219268 214469 204687 190730 175794 162440 150812 140344
54784A40344r360r084j0500j1684r823n487j788J68J597K328O60k642m109k322
$$ 140344 130984 121900 111400 99716 89893 84406 82618 82786 84383 86711 87371 84729 80620 78298
54770G8298P5K88j165j885m70K732O051P430O661O248Q184J0785J1509J1684J4522
$$ 78298 78373 78661 77496 75611 75141 77873 83924 91354 98015 104263 112447 123232 134741 146425 160947
54755A60947J8889J9761J5695J1134R462Q070L269l545q262j0187j1940j4396
$$ 160947 179836 199597 215292 226426 235888 243958 247227 243682 235420 225233 213293 198897
54743A98897j5360j3256r390o132m779n569q098j0946j2021j0305p007m427l825
$$ 198897 183537 170281 160891 154759 149980 144411 136313 125367 113346 103041 96034 91607 87782
54730H7782m593n497o016o121n341l298j051n08j989l660m033l565k952j676L70
$$ 87782 83189 77692 71676 65555 60214 56916 55865 55357 53368 49708 45675 42110 39158 37482 37852
54715C7852J510O25n26L74K521L246K216J606K232K447J354M02O63P63q78l342
$$ 37852 39362 39987 39461 39835 42356 45602 47818 49424 51656 54103 55457 55859 56522 57285 56407 53065
54699E3065m380l534k579k968l913l469j070J694L070L156L004K386L68j918j627
$$ 53065 48685 45151 42572 39604 35691 32222 31152 32846 35916 39072 42076 44462 44830 42912 41285
54684D1285J581M147L280J029J157L534M581K675Q9o43J02L25p93k159k126k99
$$ 41285 42866 47013 50293 51322 52479 56013 60594 63269 63358 62715 62817 63142 62349 60190 58064 57765
54668E7765J809K319J408J052K154L467M000M409M830L856J483O19L051O000N620
$$ 57765 59574 61893 63301 64353 66507 69974 73974 78383 83213 87069 88552 89171 92222 98222 103842
54653A03842K287o10j704k109k112r86N39R97J007K249M105M559M003M686O448
$$ 103842 106129 105519 103815 101706 99594 98608 99147 100144 101151 103400 107505 112064 116067 120753 127201
54638A27201O698N012M230O012Q302Q333N870K537j06j344j846l462o695r265
$$ 127201 133899 138911 143141 149153 157455 165788 171658 174195 174089 172745 170899 167437 160742 151477
54624A51477r393r306j2025j5582j4732q586k217K48J60M96J297R79p77l333n952
$$ 151477 142084 132778 120753 105171 90439 81853 79636 79884 80044 80540 81837 82816 82039 78706 72754
54609G2754o924m448J97K971K074J49P7J268J885J980K214J713k28j985j609J35
$$ 72754 65830 61382 61579 64550 66624 66773 66850 68118 70003 71983 74197 75910 75682 73697 72088 72223
54593G2223P28q95l581n569n599l389k28J679J331l16j968l115l299k009k3P43
$$ 72223 72951 72056 68475 62906 57307 53918 53690 55369 56700 56384 54416 51301 48002 45993 45970 46713
54577D6713m50k357l671m380m802m925m999n132m179j056K752M291L158J958K327
$$ 46713 46263 43906 40235 35855 31053 26128 21129 15997 11818 10762 13514 17805 20963 22921 25248
54562B5248L027K649J455j30k131l262j733J104J282j905l977j490K955M645K956
$$ 25248 28275 30924 32379 32249 30118 26856 25123 26227 27509 25604 21627 20137 23092 27737 30693
54547C0693N66j103k313k604j407N2L96O96K552M542L760M49j856j010J557L717
$$ 30693 31259 30156 27843 25239 23832 23884 24280 24976 27528 32070 35830 36279 34423 33413 34970 38687
54531C8687N276O896Q094P520M643O07k333k417L1K916M566N021M858L712J008
$$ 38687 43963 50859 58953 66473 71116 71723 69390 66973 67004 69920 74486 79507 84365 88077 89085
54516H9085k572n390o523o509o632p584q586p957n162j897k06O1N47J748K726
$$ 89085 86513 81123 74600 68091 61459 53875 45289 37332 32170 30273 30067 30128 30675 32423 35149
54501C5149L058L049K230J6k306k711j587r83q28P56L007K633l93j502J619M871
$$ 35149 38207 41256 43486 43502 41196 38485 36898 35915 35087 35843 38850 41483 41090 39588 41207 46078
54485D6078L742Nj544m62k00j783k483o89J642K079P35m44K06K737N372O158N614
$$ 46078 49820 49825 48281 47819 47619 45836 43353 42664 44306 46385 47120 46676 46882 49619 54991 61149 66763
54468F6763O237Q165P670K270m580p005l920K42J335o86l314m202k565n0J43k954
$$ 66763 73000 81165 88835 91105 86525 79520 75600 75842 77177 76491 73177 68975 66410 66360 66503 63549
54452F3549n936n136j910q63l239n420m338j266O87J47k496o223r043q374l520
$$ 63549 57613 52477 50567 49704 46465 41045 36707 35441 36128 36275 33779 27556 18513 10139 6619
54437F619K849O825O486K807j800n470p740A944e291k534L747C057N274J427O77
$$ 6619 9468 16293 22779 25586 23786 18316 10576 1944 -5291 -7825 -4078 3057 8331 9758 10435
54422A0435L456N791N469M614N393O402N041J433j873l011k297j352j581k714
$$ 10435 13891 19682 25151 29765 35158 41560 46601 48034 46161 43150 40853 39501 37920 35206
54408C5206k579N46N004O766M149Q9j327O24L372M701M725M722N191N370M137
$$ 35206 32627 33173 38177 44943 49092 49181 47854 48478 51850 56551 61276 65998 71189 76559 80696
54393H0696J473j020j680j013j217k837l195K24N663Q355O137J776j058k229l811
$$ 80696 82169 81149 79469 78456 77239 74402 71207 71431 77094 85449 91586 93362 92304 90075 86264
54378H6264n818o060m128k638l383m611l958k252k052l554m589m097l087k261
$$ 86264 80446 74386 70258 67620 64237 59626 55668 53416 51364 47810 43221 39124 36037 33776
54364C3776j251l66o15j537j532q61j620l843m553k186R02K269K976M907O721
$$ 33776 32525 32159 31544 30007 28475 27614 25994 22151 17598 15412 16314 18583 21559 26466 33187
54349C3187N655J885j882m050m622l004J262N915P233M518R94j45J367M085O598
$$ 33187 38842 40727 38845 34795 30173 27169 28431 34346 41579 46097 47091 46946 48313 52398 58996
54334E8996P501N796K353m16j105n13l1k20j279l357n612o346m924k650j139p44
$$ 58996 66497 72293 74646 74230 73125 72612 72581 72361 71082 67725 62113 55767 50843 48193 47054 46310
54318D6310j065j780k243j418M62R79k028p085r651o938j355J992Q82k161l617
$$ 46310 45245 43465 41222 39804 40266 41245 39217 32132 22481 15543 14188 16180 17062 14901 11284
54303A1284k943j842j044J10J516J986J362R61J356J569J170J389K943M388L951
$$ 11284 8341 6499 5455 5565 7081 9067 10429 11390 12746 14315 15485 16874 19817 24205 28156
54288B8156J920r1j121j039K7J233J222m2p66Q9J040L85j153j862j931k760m147
$$ 28156 30076 29985 28864 27825 27852 29085 30307 30265 29499 29588 30628 31013 29860 27998 26067 23307 19160
54271A9160m391k868o11J484L290M348L917K359J126J055J647K012J618J77k163
$$ 19160 14769 11901 11290 12774 16064 20412 24329 26688 27814 28869 30516 32528 34146 34323 32160
54256C2160m419n285m170j598J037K183J345p8l16L03p5j393r87K457O105O105
$$ 32160 27741 22456 18286 16688 17725 19908 21253 21175 20859 21162 21087 19694 18707 21164 27269 33374
54240C3374K380j388j895P71L513K916j275n083m576j466j451n832q609m541L236
$$ 33374 35754 34366 32471 33242 36755 39671 38396 33313 28737 27271 25820 19988 11379 6838 10074
54225A0074P287N041J8l948n436l891kK874J948o35n81J955K899J293P26K806
$$ 10074 17361 22402 22420 18472 13036 9145 9143 12017 13965 13330 12749 14704 17603 18896 19622 22428
54209B2428M008J288k972m371k112J204L490M659N453O387P151O493L769N04j308
$$ 22428 26436 27724 24752 20381 18269 19473 22963 27622 33075 39462 46613 53106 56875 57379 56071
54194E6071k140l825n791n373k272M39O55m69j569l180n080m814j301K375K538
$$ 56071 53931 50106 44315 38942 36670 37109 37764 37295 35726 32546 27466 22652 21351 23726 26264
54179B6264k88k394j579J086L216L082M68k887m289k592Q34L983N861N920L710
$$ 26264 25976 23582 22003 23089 26305 29387 29855 26968 22679 20087 20921 24904 30765 36685 40395
54164D0395J16k638l373l065k867k593k103k331l648m710m219k531n61J412K912
$$ 40395 40511 37873 34500 31435 28568 25975 23872 21541 17893 13183 8964 6433 5872 7284 10196
54149A0196L079K332K311K907J704j950m634l080J152L850L583K270J533J416
$$ 10196 13275 15607 17918 20825 22529 20579 15945 12865 14017 17867 21450 23720 25253 26669
54135B6669J990L236L685J996j45J92K268J790k838p361p095l319j415l485n820
$$ 26669 28659 31895 35580 37576 37431 37623 39891 41681 38843 31482 24387 21068 19653 16168 10348
54120A0348m225N63M301M748L666L412L670K637K86j319q65M42M55j418l674m182
$$ 10348 6123 6686 10987 15735 19401 22813 26483 29120 29406 28087 27222 27664 28119 26701 23027 18845
54104A8845k065J394L700L537K086J312J421J220O17Q92K153K451N74j821k433
$$ 18845 16780 18174 21874 25411 27497 28809 30230 31450 32067 32959 35112 37563 38137 36316 33883
54089C3883j623j726l349m264k457J026L170K380j07k027k404j789j003m62l81
$$ 33883 32260 30534 27185 22921 20464 21490 24660 27040 26933 24906 22502 20713 19710 19248 18867
54074A8867n82j2K296N395O787N237K231j47j576k780l741m098m201m170k864
$$ 18867 18285 18273 20569 25964 32751 37988 40219 40072 38496 35716 31975 27877 23676 19506 16642
54059A6642L17L312L287L94k335k790j704p47n58r03j165m44J481L254L264J769
$$ 16642 16959 20271 23558 23952 21617 18827 17123 16376 15818 14915 13750 13306 14787 18041 21305 23074
54043B3074L36m31r62r17N93L059M748M926M327L644L303M190O371P536N424J618
$$ 23074 23410 22979 22017 21100 21693 24752 29500 34426 38753 42397 45700 49890 56261 63797 69221 70839
54027G0839N5J580L119K733K268L729O022O990O296M642K276j26r93J83J913K889
$$ 70839 70894 72474 75593 78326 80594 84323 90345 97335 103631 108273 110549 110423 109430 109613 111526 114415
54011A14415L409L766L214J754R13J337J389m47l320n354n755m684k713j184j292
$$ 114415 117824 121590 124804 126558 127471 128808 130197 129750 126430 121076 115321 110637 107924 106740 105448
53996A05448k013r50K089M476M388K606K21k495m285l415j117p73k199j145L189
$$ 105448 103435 102485 104574 109050 113438 116044 116265 113770 109485 106070 104953 104180 101981 100836 104025
53981A04025N004Q2p104r343o400l545k916k345j424k515n460o739m882k301p74
$$ 104025 109029 109111 102007 92664 86264 82719 79803 77458 76034 73519 68059 61320 56438 54137 53363
53966E3363P84K827L508K191J048J180L85k732n089k578M247J0540J2582J0652
$$ 53363 54147 56974 60482 62673 63721 64901 65286 62554 57465 54887 59134 69674 82256 92908
53952I2908O941K933o01k564j988M82K581K593J329J135K956N352O598O485N615
$$ 92908 99849 102782 102181 99617 97629 98111 100692 103285 104614 105749 108705 114057 120655 127140 132755
53937A32755M296L013K826M298O971J0397J4112J5924J2583M098m362p384n066
$$ 132755 137051 140064 142890 147188 154159 164556 178668 194592 207175 211273 206911 199527 194461
53924A94461k013j672l863o711q283o897k544J886K955N41k161k357J80L882O387
$$ 194461 192448 190776 186913 180202 171919 165022 162478 164364 167319 167860 165699 163342 163522 167404 173791
53909A73791N304M86m517n487k259J427K819K710K822K980K097M57j93J436M518
$$ 173791 179095 179581 175064 169577 167318 168745 171564 174274 177096 180076 182173 182630 182437 183873 188391
53894A88391O256M334j3k444l67L504M136R2n411q730r132q152p647q462r457
$$ 188391 194647 198981 198968 196524 196157 199661 203797 203889 198478 189748 180616 172464 164817 156355 146898
53879A46898q233m412j381k430n804o458k702J850L488K495J002l83j966l111
$$ 146898 138665 134253 132872 130442 124638 118180 115478 117328 120816 123311 124313 123930 121964 118853
53865A18853l186l106m022n173m711k507p75j688m918p772p854n700m352n757
$$ 118853 115667 112561 108539 103366 98655 96148 95373 93685 88767 80995 73141 67441 63089 57332
53851E7332q068p570k997L046O824O742M075J450O66J253J385N24J88J227J788
$$ 57332 49264 41694 38697 41743 48567 55309 59384 60834 61500 62753 64138 64662 64850 66077 67865
53836F7865j65l272m132j930M06r3l348o921q115n533m21L481L357P03n86N27
$$ 67865 67700 64428 60296 58366 58772 58679 55331 48410 40295 34762 34341 37822 41179 41882 41296 41823
53820D1823J212n87l107l495j415J516M164O091O562N164K846J041j6j229l065
$$ 41823 43035 42448 39341 35846 34431 35947 40111 46202 52764 57928 60774 61815 61799 60570 57505
53805E7505m680m549j869K433O231Q110Q492Q346P413M861J353r58p31J190K731
$$ 57505 52825 48276 46407 48840 55071 63181 71673 80019 87432 92293 93646 92688 91957 93147 95878
53790I5878K340Q3k080j687J626N324O779O126N041L914K107K11l65J70K60m13
$$ 95878 98218 98301 96221 94534 96160 101484 108263 114389 119430 123344 125451 125662 125297 125467 125727 125314
53774A25314q18j117k797n804p850p498n922m687l476j114K328N276N776K989
$$ 125314 124496 123379 120582 114778 106928 99430 93508 88821 85345 84231 86559 91835 97611 100600
53760A00600j398l800k450J14K07j979l146k115q46m17J35L04k068n721n197J569
$$ 100600 99202 95402 92952 93066 93273 91294 88148 86033 85187 84770 84905 85209 83141 77420 72223 73792
53744G3792Q537Q493K353k720k868q03j94j272k625l593l521j490J563K753R83
$$ 73792 82329 90822 93175 90455 87587 86784 86590 85318 82693 79100 75579 74089 75652 78405 79388
53729G9388q60O32M742P269N463P34l487n222m790l343j622k7J042J414J405J549
$$ 79388 78528 79160 83902 91171 96634 97368 93881 88659 83869 80526 78904 78877 79919 81333 82738 84287
53713H4287K014K486K723L100M362O354P234M924P5l570l158m04N98j186k921
$$ 84287 86301 88787 91510 94610 98972 105326 112560 117484 117559 113989 110831 110427 111025 109839 106918
53698A06918k615j558j043J23K638M131K604L04O29K703K812M10j358r39k37n88
$$ 106918 104303 102745 101702 101825 104463 108594 111198 111502 112131 114834 117646 118056 116698 115759 115522 114934
53682A14934n97P04J680P66r21j329k25R34P34j214l752m645k926m56P23J656
$$ 114934 114337 115041 116721 117487 116566 115237 115012 115946 116680 115466 111714 107069 104143 103687 104410 106066
53666A06066M501Q028Q655N884K953J597J71j981k626r58J73j105k145M3L997
$$ 106066 110567 118595 127250 133134 136087 137684 137855 135874 133248 132290 132463 131358 129213 129256 133253
53651A33253O187N927M781L112M75j948k467j716j831l360m960n468m578k319
$$ 133253 139440 145367 150148 153260 153735 151787 149320 147604 145773 142413 137453 131985 127407 125088
53637A25088N04K293K343J495K65j845m215m717l058j904k732l128p99K548M295
$$ 125088 125592 127885 130228 131723 131988 130143 125928 121211 118153 116249 113517 110389 109590 112138 116433
53622A16433N291P388Q928P085L237J343J651P13k406m475l495j481n62N9J498
$$ 116433 121724 129112 138040 145125 148362 149705 151356 152069 149663 145188 141693 140212 139650 139709 141207
53607A41207K760K861K815L512L732K302M50MO47R49J140K711N643P800P282M362
$$ 141207 143967 146828 149643 153155 156887 159189 159639 159643 160290 161239 162379 165090 170733 178533 185815 190177
53591A90177R03j259j347K40K308L635L616K422P06o70p27J303N090Q518Q786
$$ 190177 191080 189821 188474 188714 191022 194657 198273 200695 201401 200731 200004 201307 206397 214915 223701
53576B23701N128J32k545j610J417M374N800M898K268M38J333L122K225j254l121
$$ 223701 228829 228961 226416 224806 226223 230597 236397 241295 243563 244001 245334 248456 250681 249427 246306
53561B46306j166J740K347J538J538J722O56l9K034N353O169M155K523K605K352
$$ 246306 245140 246880 249227 250765 252303 254025 254681 254642 256676 262029 268198 272353 274876 277481 279833
53546B79833P86K91L025P627J0922J1124Q555N020K919L386M759M637L421L597
$$ 279833 280619 280910 283935 291562 302484 313608 322163 327183 330102 333488 338247 342884 346305 349902
53532C49902N305N533K709o42j599q63q39j445n71J977L775L477K964M575P538
$$ 349902 355207 360740 363449 362807 361208 360345 359506 358061 357490 359467 363242 366719 369683 374258 381796
53517C81796Q903P710O540Q098J1515J3396J2066R149P140P095Q961J2126J4878
$$ 381796 390699 398409 404949 413047 424562 437958 450024 459173 466313 473408 482369 494495 509373
53504E09373J5150J3075J1237J1205J1656J1279J1500J4058J7556J9135J8749
$$ 509373 524523 537598 548835 560040 571696 582975 594475 608533 626089 645224 663973
53493F63973J9106K1662K4923K6640K5844K3137K0496K0069K1552K1817J9121
$$ 663973 683079 704741 729664 756304 782148 805285 825781 845850 867402 889219 908340
53482I08340J6307J7143K0819K3347K3486K3382K3549K1738J7732J5078J6075
$$ 908340 924647 941790 962609 985956 1009442 1032824 1056373 1078111 1095843 1110921 1126996
53471A126996J8302J8498J7310J7592J9867K1952K1958J9621J5512J0713O598
$$ 1126996 1145298 1163796 1181106 1198698 1218565 1240517 1262475 1282096 1297608 1308321 1314919
53460A314919L642J019j556k575o88K786M732L528M81k038l199m306o912j0740
$$ 1314919 1318561 1319580 1318024 1315449 1314761 1317547 1322279 1325807 1326288 1324250 1321051 1316745 1309833 1299093
53446A299093j3899j5299j5712j5937j5352j3795j3278j5396j8004j7571j4794
$$ 1299093 1285194 1269895 1254183 1238246 1222894 1209099 1195821 1180425 1162421 1144850 1130056
53435A130056j4432j8690k3894k5448k3468k1327k0644k0259j9125j7797j7195
$$ 1130056 1115624 1096934 1073040 1047592 1024124 1002797 982153 961894 942769 924972 907777
53424I07777j7523j8287j8355j6453j2640q915p295p471p210n087k186q45j836
$$ 907777 890254 871967 853612 837159 824519 815604 808309 800838 793628 788541 786355 785510 783674
53411G83674l026j431L118P289Q158O744O056O614O376M949M912Q001J2510J5964
$$ 783674 780648 779217 782335 789624 797782 804526 810582 817196 823572 828521 833433 841434 853944 869908
53397H69908J8298K0567K2091K1395J9332J9079K2475K7546L0328K9011K6014
$$ 869908 888206 908773 930864 952259 971591 990670 1013145 1040691 1071019 1100030 1126044
53386A126044K5595K9197L3881L6216L6709L8565M2557M5711M5598M3652M2945
$$ 1126044 1151639 1180836 1214717 1250933 1287642 1326207 1368764 1414475 1460073 1503725 1546670
53375A546670M4358M6223M6449M3967L9357L5130L4176L6691L9659M0211L8463
$$ 1546670 1591028 1637251 1683700 1727667 1767024 1802154 1836330 1873021 1912680 1952891 1991354
53364A991354L6145L3858L0978K7198K2958J8935J5968J4601J3913J1806P332
$$ 1991354 2027499 2061357 2092335 2119533 2142491 2161426 2177394 2191995 2205908 2217714 2225046
53353B225046J641m029r907j6374k2539k7440l1313l4380l5701l4797l3212l2759
$$ 2225046 2226687 2222658 2212751 2196377 2173838 2146398 2115085 2080705 2045004 2010207 1976995 1944236
53341A944236l3251l3683l4516l6783l9596m0801l9791l7720l5181l1838k8500
$$ 1944236 1910985 1877302 1842786 1806003 1766407 1725606 1685815 1648095 1612914 1581076 1552576
53330A552576k7347k9192l2045l3347l2632l1277l0591l0884l1745l2301l1426
$$ 1552576 1525229 1496037 1463992 1430645 1398013 1366736 1336145 1305261 1273516 1241215 1209789
53319A209789k8453k3877j9186j5791j4082j3391j2918j2511j2523j3065j3891
$$ 1209789 1181336 1157459 1138273 1122482 1108400 1095009 1082091 1069580 1057057 1043992 1030101
53308A030101j4651j4879j4016j2315j1378j2499j4340j3645q947k519K015L095
$$ 1030101 1015450 1000571 986555 974240 962862 950363 936023 922378 913431 910912 912927 916022
53296I16022J694m32j768j202J456N120Q436J1004J3085J4492J4602J3503J2472
$$ 916022 917716 917284 915516 914314 915770 920890 929326 940330 953415 967907 982509 996012 1008484
53283A008484J2926J5011J7387J8598J8595J8418J8495J8417J8759K1360K6217
$$ 1008484 1021410 1036421 1053808 1072406 1091001 1109419 1127914 1146331 1165090 1186450 1212667
53272A212667K9604K7768K1879J6747J5053J5543J6623J8093J8684J5740R371
$$ 1212667 1242271 1270039 1291918 1308665 1323718 1339261 1355884 1373977 1392661 1408401 1417772
53261A417772L783K154K738K453J653K216L068J432k634o602r801j3730j8034
$$ 1417772 1421555 1423709 1426447 1428900 1430553 1432769 1435837 1437269 1434635 1428033 1418232 1404502 1386468
53248A386468j9785j7811j4977j4731j7157j9673k0239j8937j7517j8056k1172
$$ 1386468 1366683 1348872 1333895 1319164 1302007 1282334 1262095 1243158 1225641 1207585 1186413
53237A186413k4842k5907k3161j8342j4013j1344j0193j0130j0763j1528j1784
$$ 1186413 1161571 1135664 1112503 1094161 1080148 1068804 1058611 1048481 1037718 1026190 1014406
53226A014406j1143r773q574q586r865j1311j2020j2225j2373j2048j0748r060
$$ 1014406 1003263 993490 984916 976330 966465 955154 943134 930909 918536 906488 895740 886680
53214H86680q168q444r296j0019j0146r514q602q248q502q511p973p452o878n476
$$ 886680 878512 870068 860772 850753 840607 831093 822491 814243 805741 797230 789257 781805 774927 769451
53200G69451m180n878j1304j6526j7089j3425r549p566o501n934p201j0574j4163
$$ 769451 765271 759393 748089 731563 714474 701049 691500 683934 677433 671499 664298 653724 639561
53187F39561j6426j7414j7026j4682j1537j0417j2192j4266j4007j1821r599q160
$$ 639561 623135 605721 588695 574013 562476 552059 539867 525601 511594 499773 490174 482014
53175D82014p672q860j1797j4696j5688j4968j3843j2665j1115r645r021r084
$$ 482014 474342 465482 453685 438989 423301 408333 394490 381825 370710 361065 352044 342960
53163C42960r322r925j0847j0631p999m183j866j843k502k733l498n818q731j0473
$$ 342960 333638 323713 312866 302235 294236 290053 288187 286344 283842 281109 277611 271793 263062 252589
53149B52589j0719j0359r646p813m649j268J155K644L725L997K432p76l591m036
$$ 252589 241870 231511 221865 214052 209403 208135 209290 211934 215659 219656 222088 221312 217721 213685
53135B13685k315m81k80j775l648m018j494L334P293O936K288k734m629m267n149
$$ 213685 211370 210889 210609 208834 205186 201168 199674 203008 210301 217237 219525 216791 212162 207895 202746
53120B02746q075r603o670j234J537o76m788o234l903k74J965J962J17k632m756
$$ 202746 194671 185068 178398 177164 178701 178025 173237 167003 163100 162826 164791 166753 166870 164238 159482
53105A59482m909l335j562n25ml4j342l890o348p774q424q222o079k065J340J909
$$ 159482 154573 151238 149676 149151 149147 149113 147771 143881 137533 129759 121335 113113 107034 104969 106309 108218
53089A08218M51q89j883l462m690l517o16M45k039n270n578k996n25j3n22m04
$$ 108218 108669 107780 105897 102435 97745 94228 93612 94057 92018 86748 81170 78174 77649 77636 77114 76710
53073G6710P09K170L488M642N553N758M704K480N3j444j650j253j487l331o560
$$ 76710 77419 79589 83077 87719 93272 99030 103734 106214 106267 104823 103173 101920 100433 97102 90542
53058I0542r260r072n664j407J189K112K901L700K887l40m429o871o265k908J468
$$ 90542 81282 72210 66546 65139 66328 68440 71341 75041 77928 77588 73159 66288 60023 57115 58583
53043E8583M405M530L095K668L774M164K135q32k124j704j924l708m818k862J077
$$ 58583 62988 67518 70613 73281 77055 81219 83354 82522 80398 78694 76770 73062 68244 65382 66459
53028F6459L292J778j469k910j353J394L068K849J088j388l280l472k315j225
$$ 66459 69751 71529 70060 67150 65797 67191 70259 73108 74196 72808 69528 66056 63741 62516
53014F2516m79J233M184O279N760L900L028K968J824l40j158M94K938M278M510
$$ 62516 62037 63270 67454 73733 79493 83393 86421 89389 91213 90873 89715 90209 93147 97425 101935
52999A01935M301L431J541p83k548l121k112K76K553L045K362L136O555J0532
$$ 101935 106236 109667 111208 110425 107877 104756 102644 102920 105473 108518 110880 114016 120571 131103
52985A31103J2202J0791P116J969l462o807o220k677P15J588q9k570l682k291
$$ 131103 143305 154096 161212 163181 159719 152912 146692 144015 144730 146318 146229 143659 139977 137686
52971A37686O31K985M065N012O153N588K014k485m725m506m129m332l503j048
$$ 137686 138317 141302 145367 150379 156532 162120 164134 161649 156924 152418 148289 143957 140454 139406
52957A39406J161J487L90j425m269p407q011m532L43K774K856L820O483P685N136
$$ 139406 140567 142054 142444 141019 136750 129343 121332 116800 117143 119917 122773 126593 133076 140761 145897
52942A45897R14j528j861k228l437m160l369j479Q82L466N654O672O809O935O668
$$ 145897 146811 145283 143422 141194 137757 133597 130228 128749 129631 133097 138751 145423 152232 159167 165835
52927A65835M593P78k425k928j058J326K638K028l59k802l230k077k274n009p238
$$ 165835 170428 171206 168781 165853 164795 166121 168759 170787 170428 167626 164396 162319 160045 155036 147798
52912A47798n254M78O054Q694Q479O423L264l0k604m497n489l884J071N964N664
$$ 147798 142544 143022 149076 157770 166249 172672 175936 175906 173302 168805 163316 159432 160503 166467 172131
52897A72131j67n719n663j109K777L345K513K944M324M074R72k752l467l69L234
$$ 172131 171964 166245 160582 159473 162250 165595 168108 171052 175376 179450 180422 177670 174203 173834 177068
52882A77068L585N95k877m680m520k577K71J290j730o433p482l355J549L150K920
$$ 177068 180653 181248 178371 173691 169171 166594 166865 168155 166425 159992 152510 149155 150704 153854 156774
52867A56774M455P598R313Q573O960N296L058P81jO46J043O89N60M33j322m520
$$ 156774 161229 168827 178140 186713 193673 198969 202027 202808 202807 203453 204496 205185 205745 206178 204856 200336
52851B00336o284m759j688K02O40Q79P83p98l304m382k957p55qp37j233n71N18
$$ 200336 194052 189293 187605 187807 188447 189326 190109 189311 186007 181625 178668 177913 177905 177168 175935 175364 175882
52834A75882J128J417J910K249J476n99k913m062l490j930j071k384n455p763
$$ 175882 177010 178427 180337 182586 184062 183463 180550 176488 172998 171068 169997 167613 162158 154395
52820A54395p073m062j481o00J58K427N046N159J705l092n506l391J819N819N086
$$ 154395 147322 143260 141779 141179 141337 143764 148810 153969 155674 152582 147076 143685 145504 151323 156409
52805A56409N23l414l866k579k828m841o092n092k718j07K382L962L441J257m03
$$ 156409 156932 153518 149652 147073 144245 139404 133312 128220 125502 125395 127777 131739 135180 136437 136034
52790A36034m93m22j270j514L02J950n85p140j1878r442j392N252N503Q75l698
$$ 136034 135541 135119 133849 132335 132637 134587 134002 126862 114984 105542 104150 109402 114905 115780 112082
52775A12082n553n692n646n202l660j796j118j673j808l41J949L379L229J919
$$ 112082 106529 100837 95191 89989 86329 84533 83415 81742 79934 79593 81542 84921 88150 90069
52761I0069j63k989n815o786m664q31J540Q71r74r21J663M378M643K220j191l943
$$ 90069 89906 86917 81102 74316 69652 68821 70361 71232 70258 69337 71000 75378 80021 82241 81050 77107
52745G7107n489o012n694m500k557n57N81O49M17N10N17j60q93l46J611L539M135
$$ 77107 71618 65606 59912 55412 52855 52298 52879 53528 53945 54455 54972 54812 53919 53573 55184 58723 62858
52728F2858L528K701K390K760L316K936Q68j952l454k714p59J097K660M085M905
$$ 62858 66386 69087 71477 74237 77553 80489 81357 79405 75951 73237 72478 73575 76235 80320 85225
52713H5225M806M329L747K111j245m793n918m060j499p09j804k964k752j295L67
$$ 85225 90031 94360 98107 100218 98973 94180 88262 84202 82703 81994 80190 77226 74474 73179 73546
52698G3546J426J484J37k712o034p977p831o911o538n751k630K213N436M841J949
$$ 73546 74972 76456 76593 73881 67847 59870 52039 45128 38590 32839 30209 32422 37858 42699 44648
52683D4648j48k01Q28J469P49j441l686l762j295J180J185n26j353o65k52j138
$$ 44648 44500 44299 45127 46596 47345 45904 42218 38456 37161 38341 39526 39000 37647 36982 36730 35592
52667C5592k025j374L90J563J197j77j301j284k34J113K397L823N038M777K581
$$ 35592 33567 32193 32583 34146 35343 35166 33865 32581 32347 33460 35857 39680 44718 49495 52076
52652E2076R3o72P9M19m24j222q91P1O30M95j71j191j906j332N09K026J585p32
$$ 52076 52169 51497 51576 51995 51571 50349 49458 49529 50159 50654 50483 49292 47386 46054 46563 48589 50174 49442
52634D9442l126l675j943L05M30k090m223k608J781M147J982j445j543J484L515
$$ 49442 46316 42641 40698 41003 41433 39343 35120 32512 34293 38440 40422 38977 37434 38918 42433
52619D2433K672J416J948K663J011k127l501k124l11n3o32o41n44j759m347o954
$$ 42433 45105 46521 48469 51132 52143 50016 46515 44391 44080 44027 43395 42754 42210 40451 36104 29150
52603B9150q443q202n534l87N265Q371P726M934K260N69k02P0J261K396K525J820
$$ 29150 20707 12505 6971 6584 11849 20220 27946 32880 35140 35709 35507 35577 36838 39234 41759 43579
52587D3579Q77l65k048l235k548k4K780M582N318N117L588Q87j382j511J87J564
$$ 43579 44456 44091 42043 38808 36260 36236 39016 43598 48916 54033 57621 58508 57126 55615 55802 57366
52571E7366J156k19p30L60K467M809O587O372L017k133n310l983J65L108K889
$$ 57366 58522 58303 57573 57933 60400 65209 71796 78168 81185 79052 73742 69759 69924 73032 75921
52556G5921R81k67n0J079K266K793K517K317L175M539M549K256j161l584l668
$$ 75921 76902 76635 76585 77664 79930 82723 85240 87557 90732 95271 99820 102076 100915 97331 93663
52541I3663j426J675L144J384k306m732m216j869O02K708M156L955J851n96j610
$$ 93663 92237 93912 97056 98440 96134 91402 87186 85317 85919 88627 92783 96738 98589 97993 96383
52526I6383r92N03K242L191J907j303l406j815K138M645L821J044j611l324l862
$$ 96383 95391 95894 98136 101327 103234 101931 98525 96710 98848 103493 107314 108358 106747 103423 99561
52511I9561k840m84J830K510J101j257k597j801J80J308R54M80R34J534J183K27
$$ 99561 96721 96237 98067 100577 101678 100421 97824 96023 96203 97511 98465 98945 99879 101413 102596 102823
52495A02823n60j341k161j904j85P96j265n014o474l879N83L887M996M319K470
$$ 102823 102263 100922 98761 96857 96672 97468 96203 91189 84715 80836 81419 85306 90302 94621 97091
52480I7091M37n80m53j32K1P14J992K404R06j397k470j825p17j14O33K652N573
$$ 97091 97528 96948 96495 96363 96384 97098 99090 101494 102400 101003 98533 96708 95991 95877 96510 99162 104735
52463A04735P378O605M226K464K007J530J22j403k195k746l383k926m53K676M314
$$ 104735 112113 118718 122944 125408 127415 128945 129067 127664 125469 122723 119340 116414 115961 118637 122951
52448A22951M226L646L049K229J845K584L290K174k34j562j086m92q74j218n46
$$ 122951 127177 130823 133872 136101 137946 140530 143820 145994 145760 144198 143112 142620 141746 140528 139982
52433A39982N85J585K910M564N188M031K532K493L361K696p72n380p957o863l738
$$ 139982 140567 142152 145062 149626 154814 158845 161377 163870 167231 169927 169155 163775 155818 148955 145217
52418A45217j939k980m977n270l688k145j703j740j667j660j584r04Oj88k015
$$ 145217 143278 140298 135321 130051 126363 124218 122515 120775 119108 117448 115864 114960 114966 114778 112763
52403A12763m442o042n918l735j85K659K899R52j076j986k189k088j422k17J155
$$ 112763 108321 102279 96361 92626 92441 95100 97999 98951 97875 95889 93700 91612 90190 89973 91128
52388I1128K646L921L633J209j329j660o67q09j544n5L227M086R81j901n42L268
$$ 91128 93774 97695 101328 102537 101208 99548 98881 98072 96528 96473 99700 103786 104767 102866 102324 105592
52372A05592M998L497Q47j753m343n625l699O34M122N001M487M125L567J748r37
$$ 105592 110590 114087 114934 113181 108838 103213 99514 100148 104270 109271 113758 117883 121450 123198 122261
52357A22261k468j133K395M938L718l16l170k331O53K749L082K826K930L496M380
$$ 122261 119793 118660 121055 125993 129711 129395 126225 123894 124547 127296 130378 133204 136134 139630 144010
52342A44010N158N259N144O125P938Q091N141J109j110j391j382j284j44J410
$$ 144010 149168 154427 159571 165696 173634 181725 186866 187975 186865 185474 184092 182808 182664 184074
52328A84074J429l05j685q73J999N553P941P463M292J300J233L325M628M182L481
$$ 184074 185503 185198 183513 182640 184639 190192 198133 205596 209888 211188 212421 215746 220374 224556 228037
52313B28037L095J873N8J35L242P041Q684P976O109L384K69j050J211N566Q844
$$ 228037 231132 233005 233063 233198 236440 243481 252165 260141 266250 269634 269903 268853 270064 275630 284474
52298B84474J0226J1350J2732J2634J0212P469O765P923R181R913J0817J2011
$$ 284474 294700 306050 318782 331416 341628 349097 355862 363785 372966 382879 393696 405707
52286D05707J2574J1945J0690R779R833J0849J1900J1659J0298J0259J3410J7777
$$ 405707 418281 430226 440916 450695 460528 471377 483277 494936 505234 515493 528903 546680
52274E46680J9227J6539J2592R985Q166O151N324P109R899J1090J0729J0336R476
$$ 546680 565907 582446 595038 605023 613189 619340 624664 631773 641672 652762 663491 673827 683303
52261F83303O824L834L466N285N512K676k92q97o83k069m194m336j848J385L347
$$ 683303 690127 693961 697427 702712 708224 710900 710608 709711 709028 706959 702765 698429 696581 697966 701313
52246G01313L437K535K417L975N633N131L045K219L277L710K507K378N279Q772
$$ 701313 704750 707285 709702 713677 719310 724441 727486 729705 732982 736692 739199 741577 746856 755628
52232G55628R652Q725Q734R606R247P719P018P433P539P505R021J1775J3118J1950
$$ 755628 765280 774005 782739 792345 801592 809311 816329 823762 831301 838806 847827 859602 872720 884670
52218H84670J0258R867R826Q166M721J153p70l51J624L235K974J237l08p54o40
$$ 884670 894928 904795 914621 922787 927508 928661 927891 927540 929164 932399 935373 936610 936302 935548 934908
52203I34908q24j468k152k392k280k820n002q231j0651j1371j0979r471n766o39
$$ 934908 934084 932616 930464 928072 925792 922972 917970 909739 899088 887717 876738 867267 861501 860862
52189H60862K106l17n612q607o865k389J250J795o42l503l694j194M96q82l015
$$ 860862 862968 862651 857039 848432 841567 839178 840428 842223 841581 838078 834384 833190 833686 832804 829789
52174H29789k858j516j957l600l491j977k460n291o516m015r10q74l307n229n406
$$ 829789 826931 825415 823458 819858 816367 814390 811930 806639 800123 796108 795198 794324 791017 785788 780382
52159G80382m405k759j167r88k507l914l400j262J075K652K590k13n303r690j0280
$$ 780382 775977 773218 772051 771063 768556 764642 761242 759980 761055 763707 766297 766084 760781 751091 740811
52144G40811o850j791K177L408J756j096k599j871p61j562m270o994q397q714
$$ 740811 733961 732170 734347 737755 739511 738415 735816 733945 733184 731622 727352 720358 711961 703247
52130G03247q560p780n893l375j889k681m908o465o647o616o884o291m683m301
$$ 703247 694687 686907 681014 677639 675750 673069 668161 661696 655049 648433 641549 635258 630575 626274
52116F26274o207p322m260J191M162L514K389K203Q60j847k002K517P666Q268
$$ 626274 620067 612745 608485 609676 613838 617352 619741 621944 622804 620957 618955 621472 629138 637406
52102F37406M870K135K324L845N287P223J0002J2502J3728J3889J3529J2839J2149
$$ 637406 642276 644411 646735 650580 655867 663090 673092 685594 699322 713211 726740 739579 751728
52089G51728J2050J2855J4528J6861J9237K0692K0900K0590K0423J9979J8417
$$ 751728 763778 776633 791161 808022 827259 847951 868851 889441 909864 929843 948260
52078I48260J5644J2437R949R246J0401J1746J1172Q532N654L573J379j536l796
$$ 948260 963904 976341 986290 995536 1005937 1017683 1028855 1037387 1043041 1046614 1047993 1046457 1042661
52065A042661l831k174o81m08j310k987m572m829l709l089m687p760j0016j0346
$$ 1042661 1038830 1036656 1035975 1035567 1034257 1031270 1026698 1021869 1018160 1015071 1010384 1002624 992608 982262
52051I82262r439p989n619k040J428K368k33m157n617l403l07N37m38p23J00L22
$$ 982262 972823 964834 959215 957175 958603 960971 960738 956581 950964 947561 947254 947791 947353 946630 946730 947052
52035I47052l08j26J030J182o9j42K569N772O137L246q30l995m834k814O69L022
$$ 947052 946744 946618 947648 948830 948761 948619 951188 956960 963097 966343 965513 961518 956684 953870 954539 957561
52019I57561L464L443L436K003p93k385j993k559n715q255p123m922o127j0044
$$ 957561 961025 964468 967904 969907 969114 966729 964736 962177 956462 948207 941084 936162 930035 919991
52005I19991j2241j1482j0470j0493j0247r820j1054j3327j3413j0697q578r288
$$ 919991 907750 896268 885798 875305 865058 855238 844184 830857 817444 806747 798169 788881
51993G88881j0991j1662j2413j4813j7706j9091j9081j8863j8522j7869j7934
$$ 788881 777890 766228 753815 739002 721296 702205 683124 664261 645739 627870 609936
51982F09936j9586k1665k2161k0606j8267j6618j6288j6609j5761j2661r082q227
$$ 609936 590350 568685 546524 525918 507651 491033 474745 458136 442375 429714 420632 412405
51970D12405j0459j2305j0822p264n142o080q951j1625j2069r225m613j981l377
$$ 412405 401946 389641 378819 371555 366413 360333 351382 339757 327688 318463 313850 311869 308492
51957C08492o328o797m270j859j745k782l027k320j452l61J196K176J059j900
$$ 308492 302164 295367 291097 289238 287493 284711 281684 279364 277912 277551 278747 280923 281982 280082
51943B80082m566n373m942m726m908m645l829l395l738m072l745l120k577j734
$$ 280082 275516 270143 265201 260475 255567 250922 247093 243698 239960 235888 232143 229023 226446 224712
51929B24712m79L12J91L23J851L734L801J642j014k413k081m60J129O86k327n238
$$ 224712 224233 224545 224736 225059 226910 230644 234445 236087 235073 232660 230579 230119 231248 231934 229607 224369
51913B24369m692j046J922K007Q84O36O88l61k008k987l484m178m315k971j286
$$ 224369 219677 218631 220553 222560 223444 224080 224768 224407 222399 219412 215928 211750 207435 204464 203178
51898B03178j121j997j861q57j785n817r819r643n108j99J513L12j016q13J34
$$ 203178 202057 200060 198199 197342 195557 189740 179921 170278 165170 164971 166484 166796 165780 164967 165101
51883A65101N15M38Q72J995L133L915M335L814J635j409l126k514j200j264k417
$$ 165101 165616 166054 166926 168921 172054 175969 180304 184118 185753 184344 181218 178704 177504 176240 173823
51868A73823k447o9L671O712P827P123N362L104O00j476j818K9K193J939r97l989
$$ 173823 171376 171307 174978 181690 189517 196640 202002 205106 205706 204230 202412 202441 204634 206573 205576 201587
51852B01587m998m749m380k984M18L947M766L309K694L969M867L946K934L465
$$ 201587 196589 191840 187460 184476 184894 188841 193607 196916 199610 203579 208446 212392 215326 218791
51838B18791M177L432K849N080R033J0545P968M342L092L818L840K318R02Q93
$$ 218791 222968 226400 229249 234329 243362 253907 261875 266217 269309 273127 276967 279285 280187 281080
51824B81080J534J460N52m76j780m578r141j3200j3551r626m449j249N8J702M102
$$ 281080 282614 284074 284626 284150 282370 277792 268651 255451 241900 232274 227825 226576 226634 228336 232438
51809B32438N070L336Q02J12J277K185J695N66k97j158k601m263m737k678J637
$$ 232438 237508 240844 241646 241758 243035 245220 246915 247481 247184 246026 243425 239162 234425 231747 233384
51794B33384N679O563M202J576J030J441N06j459k214j441j274k788m430m619
$$ 233384 239063 245626 249828 251404 252434 253875 254381 252922 250708 249267 247993 245205 240775 236156
51780B36156l675k217K71L780O384O194L646N08k362m893o397n946l692o93K076
$$ 236156 232481 230264 230535 234315 240699 246893 250539 251047 248685 243792 237395 231449 227757 227064 229140
51765B29140L689L107L68k767m450m548l956l114k236j793j396N70M386P291O676
$$ 229140 232829 235936 236304 233537 229087 224539 220583 217469 215233 213440 212044 212614 217000 224291 230967
51750B30967M017K859L333J951k658p088p810n851m564m431k816J537O092P409
$$ 230967 234984 237843 241176 243127 240469 233381 225571 219720 215156 210725 207909 209446 215538 222947
51736B22947N196K590K676N281P432O684L291p11l574m291k285J718N154N570
$$ 222947 228143 230733 233409 238690 246122 252806 256097 255386 251812 247521 245236 246954 252108 257678
51722B57678L095k26l060n142n639l682p92j01k138l690k307J36L26j686k879
$$ 257678 260773 260547 257487 252345 246706 243024 242232 242131 239993 236303 233996 234132 234458 232772 229893
51707B29893j557R62K597K650J649L99o81k044m378o836p038m098n27O60k51r06
$$ 229893 228336 229298 231895 234545 236194 236593 235912 233868 229490 222654 215616 211518 210991 211651 211400 210494
51691B10494r41j881l309k718j13P17k286n519m256P06M382M553L809M499N234
$$ 210494 209553 207672 204363 201645 201532 202249 199963 194444 190188 190894 195276 199829 203638 208137 213371
51676B13371L735M08k722m785n907n743m149k364j625j304j55J181R98m53r90
$$ 213371 217106 217514 214792 210007 204100 198357 194208 191844 190219 188915 188760 189941 190939 190486 189496
51661A89496L07K095L378M957P227Q594P639N523M556N329O701P789Q333P799
$$ 189496 189803 191898 195276 200233 207460 216054 223693 229216 233772 239101 245802 253591 261924 269723
51647B69723N807L212J309J60j011k087k283k003k735m655n865m836k591j668
$$ 269723 275530 278742 280051 280211 279200 277113 274830 272827 270092 265437 259572 254736 252145 250477
51633B50477l527p488j1513j3519j2668r965p375n967n103l622j367N81P81j533
$$ 250477 246950 239462 227949 214430 201762 191797 184422 178455 173352 169730 168363 168944 169725 168192
51619A68192n635r282j0044p289k773R69K855L881N523P446P201L027l071o441
$$ 168192 162557 153275 143231 135942 133169 134138 136993 140874 146397 153843 161044 164071 161000 154559
51605A54559m808j046L61j289k863k049R3J450J478P73k09q11p0J823L045K391
$$ 154559 149751 148705 149066 147777 144914 142865 142958 144408 145886 146659 146450 145639 145569 147392 150437 152828
51589A52828J040P20J044L16j371j779M70L958O206O258M959L414K140J391J425
$$ 152828 153868 154588 155632 155948 154577 152798 153268 157226 163432 169690 174649 178063 180203 181594 183019
51574A83019K285L691N356P166Q998J0694J2219J3461J3828J2651J0494R324J0268
$$ 183019 185304 188995 194351 201517 210515 221209 233428 246889 260717 273368 283862 293186 303454
51561C03454J1570J0159N516O05j783k193k935m600n872o181o560p701q781q708
$$ 303454 315024 325183 330699 331304 329521 327328 324393 319793 313921 307740 301180 293479 284698 275990
51547B75990p471n689l752j909n43J14J96P4L70J892M807Q006J0071J0777J0930
$$ 275990 268519 262830 259078 257169 256626 256740 256936 257010 257380 259272 264079 272085 282156 292933 303863
51532C03863J0990J0870J0896J1735J3164J3978J3326J1279Q090M028kk866m457
$$ 303863 314853 325723 336619 348354 361518 375496 388822 400101 408191 412219 412217 409351 404894
51519D04894n476o023n720n190n585o331n276j973J127J961J599K090L113K810
$$ 404894 399418 393395 387675 382485 376900 370569 365293 363320 364447 366408 368007 370097 373210 376020
51505C76020J089r9L41J420J823J388M33j208l642o096p361p048o182o355p999
$$ 376020 377109 377010 377351 378771 380594 381982 382415 381207 377565 371469 364108 357060 350878 344523 336524
51490C36524r657r369o908m004k428k796n163r239j3253j4099j0270m022P28K281
$$ 336524 326867 317498 310590 306586 304158 301362 296199 286960 273707 259608 249338 245316 246044 248325
51476B48325J826J018N58R33K615M900N894M569K022k3j263k323k767j070K775
$$ 248325 250151 251169 251727 252660 255275 260175 266069 270638 272660 272637 271374 269051 266284 265214 267989
51461B67989N823M868M93l116k967m66J378K389M459P244Q013O334N519P500R303
$$ 267989 273812 278680 279173 276057 273090 272624 274002 276391 280850 288094 296107 302441 307960 315460 324763
51446C24763P591M420M504P705Q835N419J449J421M163N527M629L716L186Q74
$$ 324763 332354 336774 341278 348983 357818 363237 364686 366107 370270 375797 380426 384142 387328 388202
51432C88202l420o336n469k750j494k013k418k225k436k698j279J775L983L904
$$ 388202 384782 378446 372977 370227 368733 366720 364302 362077 359641 356943 355664 357439 361422 365326
51418C65326L131L508M244L535J493o15l085p215j2168j4772j3176r220o415o531
$$ 365326 368457 371965 376209 379744 381237 380622 377537 370322 358154 343382 330206 320986 314571 308040
51404C08040q600j0266r833p732o111o176o305m279j037Nk080l917k498K50Ql775
$$ 308040 299440 289174 279341 271609 265498 259322 253017 248738 247701 247706 245626 241709 239211 239461 239469 235694
51388B35694o929n873j676K175M228N691P403Q230P018M759L556L985M765M885
$$ 235694 228765 222892 221216 223391 227619 233310 240713 248943 255961 260720 264276 268261 273026 277911
51374B77911M731M741M431L460K334J031j782o624j1433j3779j4059j4608j5990
$$ 277911 282642 287383 291814 295274 297608 298639 296857 290233 278800 265021 250962 236354 220364
51361B20364j6357j4338j0638o575k948n23N8p95k205m234o954q613p167l708
$$ 220364 204007 189669 179031 172456 169508 168985 169043 168248 166043 161809 154855 146242 139075 135367
51347A35367j673k177k841j899m74K62J202K799L142P47k802n106n938o123n244
$$ 135367 133694 131517 128676 126777 126303 126565 127767 130566 133708 134455 131653 126547 120609 114486 109242
51332A09242k755K46K253L009K492K52k526k711N96L818L450Q35n63l71l95l24
$$ 109242 106487 106733 108986 111995 114487 114739 112213 109502 110098 113916 117366 118201 117638 117267 116872 116548
51316A16548J471L885M055J978M50N85J098J845M215P548Q987P642N684M703M169
$$ 116548 118019 121904 125959 127937 128387 128972 130070 131915 136130 143678 152665 160307 165991 170694 174863
51301A74863M031N254P167P782P568R023J1566J1282P513N078P002R322O924R99
$$ 174863 178894 184148 191315 199097 206665 215688 227254 238536 246049 251127 258129 267451 274375 275374
51287B75374l721o242q772j0921r969o647n438q232j1769j2626j1160r040o303
$$ 275374 271653 265411 256639 245718 235749 229102 223664 215432 203663 191037 179877 170837 164534
51274A64534k977j002j976m498n938n774n405n523n454m585l052j395o67k090
$$ 164534 161557 160555 158579 154081 148143 142369 136964 131441 125987 121402 118350 116955 116288 114198
51260A14198n179p013n289j675k1j227k315j182K46o79k987l555j774nL93Q50
$$ 114198 109019 102006 96717 95042 95021 93794 91479 90297 90543 89864 86877 83322 81548 81543 81936 82786
51244H2786K778N132N830M242J418j017j642k22J433R84j292k402m44L085N730
$$ 82786 85564 90696 96526 100768 102186 101169 99527 99305 100738 101722 100430 98028 97584 100669 106399
51229A06399O862O668M434K83k948k361J021L324K507j74k783m323m121k304r30
$$ 106399 113261 119929 124363 124646 121698 119337 120358 123682 126189 126015 123232 118909 114788 112484 111554
51214A11554k041m337m504k185o82j675k505n24K650L876L355L553M284K349l342
$$ 111554 109513 105176 100672 98487 97805 96130 93625 93101 95751 99627 102982 106535 110819 113168 109826
51199A09826r059j0029n733j08L066L881N015P416Q482N376o77m977m512j001
$$ 109826 100767 90738 85005 84897 87963 91844 96859 104275 112757 118133 117456 112479 107967 106966
51185A06966J791K300J482J86j734l833m563l239j448j378l080m394l774k186
$$ 106966 108757 111057 112539 112725 110991 107158 102595 99356 97908 96530 93450 89056 85282 83096
51171H3096j449j417k67K319L973K744J17p72O22J679L84k149l630l633l441l546
$$ 83096 81647 80230 79963 82282 86255 88999 89116 88344 88966 90645 91029 88880 85250 81617 78176 74630
51155G4630k644N83N242Q439Q174N739M376N228N923M082R65l23M55J58l149p223
$$ 74630 71986 72569 77811 86250 94424 100163 104539 109767 115690 119772 120737 120414 120869 121027 117878 110655
51139A10655q346n643j663M17p27l991o757o828m424j968j381j936j478N91K434
$$ 110655 102309 96666 95003 95420 94693 90702 83945 77117 72693 70725 69344 67408 65930 66521 68955
51124F8955K134K98n16J007L167L528K255J686K596L071J800M87J212L030L521
$$ 68955 71089 71387 70871 71878 75045 78573 80828 82514 85110 88181 89981 90468 91680 94710 98231
51109I8231K620K325L046K868Q27j277j047J991O235Q994P810K566l627p222p967
$$ 98231 100851 103176 106222 109090 109917 108640 107593 109584 115819 124813 132623 135189 131562 124340 116373
51094A16373q066q098o296k232J485K424J196%n5Q38K001K373J206m90p24N87
$$ 116373 108307 100209 93913 91681 93166 95590 96786 96786 96731 97569 99570 101943 103149 102659 101935 102522
51078A02522J305M70o3J275K896K224n20k625k323m20J228J686J341Q85J76j470
$$ 102522 103827 104297 104234 105509 108405 110629 110109 107484 105161 104741 105969 107655 108996 109881 110057 108587
51062A08587l457l540q22K000J769l03j06L020M880K356k565o205p413o419k728
$$ 108587 105130 101590 100768 102768 104537 104234 104128 107148 112028 114384 111819 105614 98201 91782 89054
51047H9054K808O391N194J360q80p64o78j356q28J990N571P953Q515P341M720
$$ 89054 91862 98253 103447 104807 103927 103163 102485 101129 100301 102291 107862 115815 124330 131671 136391
51032A36391J680m04j014m65J029L180N003N434M341K207m17k524k879j638n74
$$ 136391 138071 137667 136653 136188 137217 140397 145400 150834 155175 157382 156965 154441 151562 149924 149350
51017A49350o24p54l98j027l338m812k890O98J854j04j680m70J600J239j789m467
$$ 149350 148726 147972 147574 146547 143209 138397 135507 136205 138059 137955 136275 135805 137405 138644 136855 132388
51001A32388l908k75L327M019K404J932M599Q443J0217R096O544L881J744P86
$$ 132388 128480 128205 131532 135551 137955 139887 144486 152929 163146 172242 178786 182667 184411 185197
50987A85197J202K341M033O978J0503J1965J0462R107J0971J4574J6570J7277
$$ 185197 186399 188740 192773 199751 210254 222219 232681 241788 252759 267333 283903 301180
50975C01180J9575K3215K4724K3335K2880K6531L2836L8323M1463M2726M2972
$$ 301180 320755 343970 368694 392029 414909 441440 474276 512599 554062 596788 639760
50964F39760M3273M4574M6454M7437M7107M6437M5943M5074M3499M0992L6339
$$ 639760 683033 727607 774061 821498 868605 915042 960985 1006059 1049558 1090550 1126889
50953A126889K8718K0274J4608J2318J0689Q264O592O451N747L115R02K030N890
$$ 1126889 1155607 1175881 1190489 1202807 1213496 1221760 1228352 1234803 1240550 1243665 1244567 1246597 1252487
50940A252487R612J1811J2667J1762Q420L692l69l426p114j2439j8388k3574k8290
$$ 1252487 1262099 1273910 1286577 1298339 1306759 1310451 1310082 1306656 1299542 1287103 1268715 1245141 1216851
50927A216851l4177m1979n0078n5796n8185n8588n8000n5324m9766m3599m0094
$$ 1216851 1182674 1140695 1090617 1034821 976636 918048 860048 804724 754958 711359 671265
50916F71265l9179l7827l4620l1009k7886k4276k0555j9382k1303k2420j9355
$$ 671265 632086 594259 559639 528630 500744 476468 455913 436531 415228 392808 373453
50905C73453j4368j2252j3424j3599r943m417n17O84L34m04j051j363j353j351
$$ 373453 359085 346833 333409 319810 309867 305450 304933 305617 305951 305547 304496 303133 301780 300429
50891C00429j347o11J404L856M834L331P07m30R38L251M557M866N343O063O061
$$ 300429 299082 298471 299875 303731 308565 311896 312603 312173 313111 316362 320919 325785 331128 337191 343252
50876C43252N241M619M767N474O929R523J2373J3794J3665J3524J4027J4327J4651
$$ 343252 348493 353112 357879 363353 370282 379805 392178 405972 419637 433161 447188 461515 476166
50863D76166J7107K2407K7801L0255L0549L2226L7154M3896N0192N5549O1102
$$ 476166 493273 515680 543481 573736 604285 636511 673665 717561 767753 823302 884404
50852H84404O7843P5259Q1675Q6183R0037R5367J02466J09341J13880J15324J13626
$$ 884404 952247 1027506 1109181 1195364 1285401 1380768 1483234 1592575 1706455 1821779 1935405
50841A935405J09043J02690R5661Q7056P4721N8805M2673K9143J7741P005k220
$$ 1935405 2044448 2147138 2242799 2329855 2404576 2463381 2506054 2535197 2552938 2559943 2557723
50830B557723p679q568n843p01N644J1727J6839K1441K5406K7163K5900K2939
$$ 2557723 2550044 2541476 2535633 2534932 2540576 2552303 2569142 2590583 2615989 2643152 2669052 2691991
50818B691991J9048J2070k57j6277l2072m6507o1597p7940r2897j04250j13115
$$ 2691991 2711039 2723109 2722852 2706575 2674503 2627996 2566399 2488459 2395562 2291312 2178197
50807B178197j21625j29271j33159j31340j24813j16417j08193r9921r0255p9360
$$ 2178197 2056572 1927301 1794142 1662802 1537989 1421572 1313379 1213458 1123203 1043843
50797A043843o9473o2210n6403m9861m2646l6802l3176l0328k6879k3267k0472
$$ 1043843 974370 912160 855757 805896 763250 726448 693272 662944 636065 612798 592326
50786E92326j8268j5695j2545r705q183q138q527p822n355j933J170L423M703
$$ 592326 574058 558363 545818 536113 527930 519792 511265 503443 498088 496155 497325 500748 505451
50773E05451M410J914k137n931p985q001o477m202k045n24M19P00l26k816n270
$$ 505451 509861 511775 509638 503707 495722 487721 481244 477042 474997 474473 474892 475592 475266 472450 467180
50758D67180n530l025P19L882N982P789J0123J2847J4641J4154J1765R732R997
$$ 467180 461650 458625 459344 463226 469208 476997 487120 499967 514608 528762 540527 550259 560256
50745E60256J2444J5952K0267K5481L0387L3212L4232L6157M1207M8643N5644
$$ 560256 572700 588652 608919 634400 664787 697999 732231 768388 809595 858238 913882
50734I13882O0201O2762O5470O9875P5180P8860P9214P6814P3243O9347O5183
$$ 913882 974083 1036845 1102315 1172190 1247370 1326230 1405444 1482258 1555501 1624848 1690031
50723A690031O0464N3900M3406K8737J2952n86j1758k2024l0155l3146l1474k9595
$$ 1690031 1750495 1804395 1847801 1876538 1889490 1888904 1877146 1855122 1824967 1791821 1760347 1730752
50711A730752k9708k8391k1887j2017l721J314N064Q256R122P173M455J785l229
$$ 1730752 1701044 1672653 1650766 1638749 1635028 1636342 1641406 1649662 1658784 1665957 1670412 1672197 1668968
50698A668968j2518k4175l4889m4099n3412o2884p0374p4410p5532p4688p2168
$$ 1668968 1656450 1632275 1597386 1553287 1499875 1436991 1366617 1292207 1216675 1141987 1069819
50687A069819o8447o4353n9748n3587m6131l9633l5579l2338k7101j9682j2983
$$ 1069819 1001372 937019 877271 823684 777553 737920 702341 670003 642902 623220 610237
50676F10237r660r314r312p743n119l163k278q80K201N604P106P012P799J0129
$$ 610237 600577 591263 581951 574208 569089 565926 563648 562768 564969 570573 577679 584691 592490 602619
50662F02619J1605J0650R149R402J0513J0330R397J0016J2350J4396J5379J6264
$$ 602619 614224 624874 634023 643425 653938 664268 673665 683681 696031 710427 725806 742070
50650G42070J7229J7596J8239K1036K5585K9457L1934L4582L7792M0144M1734
$$ 742070 759299 776895 795134 816170 841755 871212 903146 937728 975520 1015664 1057398
50639A057398M4328M7284M7642M5990M7442N3732N8732N6163M8280M1819L7863
$$ 1057398 1101726 1149010 1196652 1242642 1290084 1343816 1402548 1458711 1506991 1548810 1586673
50628A586673L1686K1662J2348P727O184L968K01l334m903l902j110J247J479
$$ 1586673 1618359 1640021 1652369 1660096 1666280 1670248 1670449 1667115 1662212 1658310 1657200 1658447 1659926
50615A659926Q97K275N538P409O060L608K800L507L913L451K746J894L32k291
$$ 1659926 1660823 1663098 1668636 1676045 1682105 1685713 1688513 1692020 1695933 1699384 1702130 1704024 1704356 1702065
50601A702065o104j1276j7538k4229l1255l9169m7778n5621o1339o4687o5857
$$ 1702065 1695961 1684685 1667147 1642918 1611663 1572494 1524716 1469095 1407756 1343069 1277212
50590A277212o4872o2241n9264n6880n4676n1556m6896m1033l5178l0863k8653
$$ 1277212 1212340 1150099 1090835 1033955 979279 927723 880827 839794 804616 773753 745100
50579G45100k7448k5656k2772j9096j4655r794o105m851m691l104KK405L567N692
$$ 745100 717652 691996 669224 650128 635473 625679 619574 614723 610032 606928 606930 609335 612902 618594
50565F18594R623J2414J1297Q372Q603J3668K0000K3093K2156K0024J9651K1530
$$ 618594 628217 640631 651928 660300 668903 682571 702571 725664 747820 767844 787495 809025
50553H09025K4046K5541K5628K4855K3918K3321K3198K2940K1868K0757K1568
$$ 809025 833071 858612 884240 909095 933013 956334 979532 1002472 1024340 1045097 1066665
50542A066665K4650K7536K8099K7579K8420L0306L1114L1064L2639L6443M0505
$$ 1066665 1091315 1118851 1146950 1174529 1202949 1233255 1264369 1295433 1328072 1364515 1405020
50531A405020M4100M8645N4017N7939O0686O6367P6671Q6856R1513R1725R2424
$$ 1405020 1449120 1497765 1551782 1609721 1670407 1736774 1813445 1900301 1991814 2083539 2175963
50520B175963R4790R5764R3995R1289Q8000Q1459P0232N6381M2000K6476R079
$$ 2175963 2270753 2366517 2460512 2551801 2639801 2721260 2791492 2847873 2889873 2916349 2925428
50509B925428q376k3716l7596n2310o8305q3404r4822j00731j00791r6508r0476
$$ 2925428 2917052 2893336 2855740 2803430 2735125 2651721 2556899 2456168 2355377 2258869 2168393
50498B168393q3771p4634o1049m4294k8280j5152l193J0004K3457L3573L8727
$$ 2168393 2084622 2009988 1948939 1904645 1876365 1861213 1858020 1868024 1891481 1925054 1963781
50487A963781M1078M2789M2088L5326K2489P956n289j9451l7708n7908p3826q2363
$$ 1963781 2004859 2047648 2089736 2125062 2147551 2155507 2150218 2130767 2093059 2035151 1961325 1878962
50475A878962q6296q9363r1712r1752q9712q6674q1807p3685o3960n6824n4109
$$ 1878962 1792666 1703303 1611591 1519839 1430127 1343453 1261646 1187961 1124001 1067177 1013068
50464A013068n3009m9557m2984l5603k9666k5592k2575j9623j6016j1607o984
$$ 1013068 960059 910502 867518 831915 802249 776657 754082 734459 718443 706836 699852
50453F99852l052k63J748L916O846R852J1243J0515R996J2943J9478K5821K8345
$$ 699852 696800 696537 698285 702201 709047 718899 730142 740657 750653 763596 783074 808895 837240
50440H37240K7194K4810K2641K1016K1008K3552K7019K8361K7261K6591K8037
$$ 837240 864434 889244 911885 932901 953909 977461 1004480 1032841 1060102 1086693 1114730
50429A114730K9573K8488K4720J9839J4920J1253J0763J3118J4327J1537P841
$$ 1114730 1144303 1172791 1197511 1217350 1232270 1243523 1254286 1267404 1281731 1293268 1301109
50418A301109Q545J3097J5247J2105Q837J1900K0656K8828L2266L2031L0853L0076
$$ 1301109 1309654 1322751 1337998 1350103 1358940 1370840 1391496 1420324 1452590 1484621 1515474 1545550
50406A545550L0334L2358L5827L8954M0212L9419L6545L0865K2334J2711L896
$$ 1545550 1575884 1608242 1644069 1683023 1723235 1762654 1799199 1830064 1852398 1865109 1869005
50395A869005m326j3612k4354l5127m4917n4176o2905o9237p1550p1051p0330
$$ 1869005 1864679 1851067 1826713 1791586 1746669 1692493 1629588 1560351 1488801 1417750 1347420
50384A347420o9747o7280o2078n5815m9699m2428l2771k2340j3696o731P03R027
$$ 1347420 1277673 1210393 1148315 1092500 1042801 1000373 967602 945262 931566 924835 925538 934565
50372I34565J6167K0614K3328K5923K8304K8551K4414J5105K698q591j5908k0352
$$ 934565 950732 971346 994674 1020597 1048901 1077452 1101866 1116971 1119669 1111078 1095170 1074818
50360A074818k4869l0078l4082l5923l6694l6919l5333l1452k7160k4385k2739
$$ 1074818 1049949 1019871 985789 949866 913172 876253 840920 809468 782308 757923 735184
50349G35184k0771j8168j5385j2507r800q252q203q558q585r135j0595j1068q748
$$ 735184 714413 696245 680860 668353 658553 650301 642098 633540 624955 615820 605225 594157 585409
50336E85409n146l427l887l540n00L592O269P395Q243R002R003Q759R891J2734
$$ 585409 580263 576836 572949 569409 568909 572501 578770 586165 594408 603410 612413 621172 631063 643797
50322F43797J5298J5379J3029J0343R228J0109J2435J5420J7979J8964J8190J6704
$$ 643797 659095 674474 687503 697846 707074 717183 729618 745038 763017 781981 800171 816875
50310H16875J5439J4196J2582J1207J0820J0737R448O769M252L293L752M415L978
$$ 816875 832314 846510 859092 870299 881119 891856 901304 908073 912325 915618 919370 923785 927763
50297I27763J699j777m281l955j362J099J795Q22j243l956o460p861q543r734
$$ 927763 929462 927685 923404 919449 918087 919186 920981 921803 920560 916604 910144 902283 893740 884006
50283H84006j1676j3649j5665j8226k0317k0019j7670j6049j6478j7136j6453
$$ 884006 872330 858681 843016 824790 804473 784454 766784 750735 734257 717121 700668
50272G00668j5707j6277j6592j4502j1214j0160j2422j5539j6624j4889j1260
$$ 700668 684961 668684 652092 637590 626376 616216 603794 588255 571631 556742 545482
50261E45482p130l713j547n36o70j891k930j830J366M039M393L824M326N374N523
$$ 545482 538352 534639 533092 532556 531886 529995 527065 525235 526601 530640 535033 538857 543183 548557 554080
50246E54080N499O781Q161O910L270O71J005K331K091K76j694l296m588m896l351
$$ 554080 559579 566360 574521 581431 584701 585372 586377 588708 590799 591075 589381 586085 581497 576601 573250
50231E73250l55K449L600K819P96j905n456r844j3339j3180q710k848P43J263
$$ 573250 572895 575344 578944 581763 582559 580654 575198 565354 552015 538835 530125 527277 528020 529283
50217E29283M73PM56K045M163M796K653l11o52K153M885M487J148k752n113n057
$$ 529283 529756 529763 530219 532264 536427 541223 543876 543565 542913 545066 549951 554438 555586 552834 547721 542664
50201E42664k938LK835N702Q380Q870N389m89m933o355o579p085o706m199j042
$$ 542664 539726 539729 542564 548266 556646 565516 570905 570416 565483 559128 552549 545464 538758 534559 533517
50186E33517J73j096l313n047n968o360o958q785j2091j5466j6637j4392r826
$$ 533517 533690 532594 529281 524234 518266 511906 504948 496163 484072 468606 451969 437577 427751
50173D27751n781m444m962m149m76L496M178J649p06p41M46R38R2k009m780o570
$$ 427751 421970 417526 412564 408415 407939 411435 415613 417262 416556 415815 416261 417199 417291 415282 410502 403932
50157D03932o225n551p300j0154r269l490J624P76l798n563k263K437M734M129
$$ 403932 397707 392156 384856 374702 365433 361943 363567 364343 360545 354982 352719 355156 359890 364019
50143C64019J387l039p479r041o873l648k229k252j347J202L518L602J713p4j53
$$ 364019 365406 362367 354888 345847 338974 335326 333097 330845 329498 330700 334218 337820 339533 339459 339306
50128C39306J012J808J658J678K866M514N191M797M623N475O682P086O408N336
$$ 339306 340318 342126 343784 345462 348328 352842 358033 362830 367453 372928 379610 386696 393104 398440
50114C98440M790N200O351P736Q934R549R238Q315Q080R412J1003J0197O122R68
$$ 398440 403230 408430 414781 422517 431451 441000 450238 458553 466633 476045 487048 497245 503367 504335
50100E04335k360k901j464P26K219J464j609m698n215k967P2K120K654J870M77
$$ 504335 501975 499074 497610 498336 500555 502019 500410 495712 490497 487530 487602 489722 492376 494246 494723
50085D94723k23P02K845N147P004P919P111M968M014O455J0931J3667J2839J0105
$$ 494723 494500 495202 498047 503194 510198 518117 525228 530196 534210 540665 551596 565263 578102 588207
50071E88207P688O101N308O063Q528J0868J0818Q429O163O294Q564J0337R095
$$ 588207 595895 601996 607304 613367 621895 632763 643581 652010 658173 664467 673031 683368 692463
50058F92463N279K435L624P693J0311Q884N270L133L965O535R074J0590J0637
$$ 692463 697742 700177 703801 711494 721805 730689 735959 739092 743057 749592 758666 769256 779893
50045G79893R139O592L784J346k15m89K53R02M54j140l372n851q150r669j0336
$$ 779893 789032 795624 799408 800754 800539 800050 800303 801205 801659 800519 797147 791296 783146 773477 763141
50030G63141j0813j1349j1089r532p987q315j0363j2077j2217j1592j1246j0732
$$ 763141 752328 740979 729890 720358 712371 704056 693693 681616 669399 657807 646561 635829
50018F35829r073o584m550l511k811j790n69M30J177J877K589L217L618L585L060
$$ 635829 626756 620172 615622 612111 609300 607510 606941 607371 608548 610425 613014 616231 619849 623434 626494
50003F26494K551K960M516O197O714N893M467K651j7l062m547l167k86J341N55
$$ 626494 629045 632005 636521 642718 649432 655325 659792 662443 662426 659364 654817 651650 651364 652705 653260
49988F53260j503l335m173l224K50N198Q739R147P886P400P891P711O222M429
$$ 653260 651757 648422 644249 641025 641275 646473 655212 664359 672245 679645 687536 695247 701469 705898
49974G05898L112K089J336J292J889K662L879N991P938P885O086M926N192M273
$$ 705898 709010 711099 712435 713727 715616 718278 722157 728148 736086 743971 750057 754983 760175 764448
49960G64448m37p929j5013k0018k3416k5842k7435k8407k8504k6587k2525j8759
$$ 764448 764011 756082 741069 721051 697635 671793 644358 615951 587447 560860 538335 519576
49948E19576j7871j8968j8774j6166j3331j2224j2412j3018j4240j5697j5344
$$ 519576 501705 482737 463963 447797 434466 422242 409830 396812 382572 366875 351531
49937C51531j1892o950l210j590j445k367l929m515k501J325L941L032r68n631
$$ 351531 339639 332689 329479 327889 326444 324077 320148 315633 313132 314457 318398 321430 320462 314831
49923C14831q453q137n138j378R97J112k32j440j538q84n41p03l23J178K517K237
$$ 314831 306378 298241 293103 291725 292722 293834 293602 292162 290624 289740 289199 288496 288173 289351 291868 294105
49907B94105J287K040M613O254N025K198r2j589k826l051j437P50J331L4j620
$$ 294105 295392 297432 302045 308299 313324 315522 315430 313841 311015 307964 306527 307277 308608 308642 307022
49892C07022k594k828j979L27L116M716M804M271L259J196j108j315J715O335
$$ 307022 304428 301600 299621 299948 303064 307780 312584 316855 320114 321310 320202 318887 320602 326937
49878C26937R916J1223J0618R044P537P064Q201J1005J5152J9755K3367K4957
$$ 326937 336853 348076 358694 367738 375275 382339 390540 401545 416697 436452 459819 484776
49866D84776K4807K3910K2816K1857K1821K3010K3795K1656J6237J0375P553Q702
$$ 484776 509583 533493 556309 578166 599987 622997 646792 668448 684685 695060 702613 711315
49854G11315J1900J4767J6764J9055K2178K4467K3675J9753J4481Q421N69q281
$$ 711315 723215 737982 754746 773801 795979 820446 844121 863874 878355 886776 887345 879064
49842H79064j4665j6960j8344k2411k7664k9860k8599k7596k8538k8781k6089
$$ 879064 864399 847439 829095 806684 779020 749160 720561 692965 664427 635646 609557
49831F09557k2084j9381j8164j7424j7251j7906j8303j7451j6099j5396j4860
$$ 609557 587473 568092 549928 532504 515253 497347 479044 461593 445494 430098 415238
49820D15238j3228j0560q152o832o323n999n578n262n248m961l398j109p49l859
$$ 415238 402010 391450 383298 376466 370143 364144 358566 353304 348056 343095 339697 338588 337839 333980
49806C33980p797q359n178j899p65j45J770L902M587M192L475J597j938n209o102
$$ 333980 326183 317824 312646 310747 309982 309837 311607 315509 320096 324288 327763 329360 327422 322213 316111
49791C16111n266m662m452l490k025j445j917k300k160k043j901r59Q17K432L214
$$ 316111 310845 306183 301731 298241 296216 294771 292854 290554 288394 286351 284450 283491 284308 286740 289954
49776B89954L375L197K454P98j742m586o656p033n768l700j527M05J715K443L466
$$ 289954 293329 296526 298980 299778 298036 293450 286794 279761 273993 270293 268766 269171 270886 273329 276795
49761B76795N220O437N888M833N441O931O154K434j081j641L86L863Q583J3336
$$ 276795 282015 288452 294340 299173 304614 311545 317699 320133 319052 317411 317797 321660 330243 343579
49747C43579J5591J5251J5510J7983K0221K0515K1300K4259K5585K1016J3217
$$ 343579 359170 374421 389931 407914 428135 448650 469950 494209 519794 540810 554027
49736E54027R057J0600J3557J4096J2704J1293J0672J1296J3126J4428J3696J2494
$$ 554027 563084 573684 587241 601337 614041 625334 636006 647302 660428 674856 688552 701046
49724G01046J2972J3099Q555m92q805j3085j5507j8978k2845k5162k5787k5008
$$ 701046 714018 727117 735672 735180 726375 713290 697783 678805 655960 630798 605011 580003
49712E80003k2131j7693j4699j5149j7202j7803j6588j5252j4554j3764j2052
$$ 580003 557872 540179 525480 510331 493129 475326 458738 443486 428932 415168 403116
49701D03116r097n272k129j327k262k293k85J833K123J361J217J405N56j139j905
$$ 403116 394019 388747 386618 385291 383029 380736 380451 382284 384407 385768 386985 388390 388946 387807 385902
$$ [...]
##END NTUPLES=NMR SPECTRUM
##END=
