
##TITLE=AC1347_GUAAH12165_6647600_VdxQAAQbsf
##JCAMPDX= 6.0         $$ Bruker NMR JCAMP-DX V2.0
##DATA TYPE= NMR SPECTRUM
##DATA CLASS= NTUPLES
##ORIGIN= BRUKER
##OWNER= Administrator
$$ 1.72 TOPSPIN		Version 2.1
$$ 2012-08-10 17:12:14.531 -0500  Administrator@TOPSPIN
$$ Compression mode = diff/dup
##.OBSERVE FREQUENCY= 400.02188249412
##.OBSERVE NUCLEUS= ^1H
##.ACQUISITION MODE= SIMULTANEOUS (DQD)
##.ACQUISITION SCHEME= undefined
##.AVERAGES= 64
##.DIGITISER RES= 22
##SPECTROMETER/DATA SYSTEM= spect
##.PULSE SEQUENCE= noesygpps1d.comp
##.SOLVENT NAME= COFFEE_meoh
##.SHIFT REFERENCE= INTERNAL, COFFEE_meoh, 1, 14.96276
##AUDIT TRAIL= $$ (NUMBER, WHEN, WHO, WHERE, PROCESS, VERSION, WHAT)
$$ ##TITLE= Audit trail, TOPSPIN		Version 2.1
$$ ##JCAMPDX= 5.01
$$ ##ORIGIN= Bruker BioSpin GmbH
$$ ##OWNER= Administrator
$$ $$ C:\Bruker\TOPSPIN/data/COFFEE/nmr/AC1347_GUAAH12165_6647600_VdxQAAQbsf/12/pdata/1/auditp.txt
$$ ##AUDIT TRAIL=  $$ (NUMBER, WHEN, WHO, WHERE, PROCESS, VERSION, WHAT)
(   1,<2012-08-10 17:12:06.734 -0500>,<Administrator>,<TOPSPIN>,<go>,<TOPSPIN 2.1>,
      <created by zg
	started at 2012-08-10 17:00:36.421 -0500,
	POWCHK enabled, PULCHK disabled,
       configuration hash MD5:
       6B 1B 68 BB D9 2E 58 E2 7F 35 AD 54 07 DF 0E 41
       data hash MD5: 64K
       73 C7 A3 AD 79 22 8B 98 59 60 A1 5B 6B A8 39 3B>)
(   2,<2012-08-10 17:12:09.468 -0500>,<Administrator>,<TOPSPIN>,<proc1d>,<TOPSPIN 2.1>,
      <Start of raw data processing
       efp LB = 0.3 FT_mod = 6 PKNL = 1 PHC0 = 0 PHC1 = 0 SI = 128K 
       data hash MD5: 128K
       F5 4C EB 3D 84 19 6F AD 59 20 43 CD 7F 5A 8A DF>)
(   3,<2012-08-10 17:12:11.093 -0500>,<Administrator>,<TOPSPIN>,<proc1d>,<TOPSPIN 2.1>,
      <pk PHC0 = 0.5657959 PHC1 = 0 
       data hash MD5: 128K
       29 3A 17 C7 C0 A8 A7 39 22 B3 24 BD D7 46 CD E3>)
(   4,<2012-08-10 17:12:12.109 -0500>,<Administrator>,<TOPSPIN>,<proc1d>,<TOPSPIN 2.1>,
      <abs ABSG = 1 
       data hash MD5: 128K
       33 30 B8 72 75 6C 75 AA 5F A2 00 3D D6 FB 66 18>)
(   5,<2012-08-10 17:12:12.562 -0500>,<Administrator>,<TOPSPIN>,<proc1d>,<TOPSPIN 2.1>,
      <abs ABSG = 2 
       data hash MD5: 128K
       6E F2 BD C2 65 60 0A 37 4E 2A FD CF 11 9F 2E 4B>)
(   6,<2012-08-10 17:12:13.031 -0500>,<Administrator>,<TOPSPIN>,<proc1d>,<TOPSPIN 2.1>,
      <abs ABSG = 3 
       data hash MD5: 128K
       CB 2F 94 5A EE A2 AA A7 47 61 CE 50 9F A2 00 95>)
(   7,<2012-08-10 17:12:13.593 -0500>,<Administrator>,<TOPSPIN>,<proc1d>,<TOPSPIN 2.1>,
      <abs ABSG = 4 
       data hash MD5: 128K
       27 F9 39 6E DA B6 0C 9C 99 55 23 23 D9 E5 62 B7>)
(   8,<2012-08-10 17:12:14.078 -0500>,<Administrator>,<TOPSPIN>,<proc1d>,<TOPSPIN 2.1>,
      <abs ABSG = 5 
       data hash MD5: 128K
       11 0F 5C 0D B8 EE F4 7B F7 56 14 A9 CC 3D F2 34>)
$$ ##END=
$$ 
$$ $$ hash MD5
$$ $$ B7 D1 4D 0E 4B DE 75 96 7C 78 87 98 A6 0A 88 B0
##$RELAX= 
##$RELAX= 
##$RELAX= 
##$RELAX= 
##$RELAX= 
##$RELAX= 
##$RELAX= 
##$RELAX= 
$$ Bruker specific parameters
$$ [...]
150 150 150 150 150 150 150 150
##$TP07= 0
##$TPNAME0= <>
##$TPNAME1= <>
##$TPNAME2= <>
##$TPNAME3= <>
##$TPNAME4= <>
##$TPNAME5= <>
##$TPNAME6= <>
##$TPNAME7= <>
##$TPOAL= (0..7)
0.5 0.5 0.5 0.5 0.5 0.5 0.5 0.5
##$TPOFFS= (0..7)
0 0 0 0 0 0 0 0
##$TUNHIN= 0
##$TUNHOUT= 0
##$TUNXOUT= 0
##$USERA1= <user>
##$USERA2= <user>
##$USERA3= <user>
##$USERA4= <user>
##$USERA5= <user>
##$V9= 5
##$VALIST= <valist>
##$VCLIST= <CCCCCCCCCCCCCCC>
##$VD= 0
##$VDLIST= <DDDDDDDDDDDDDDD>
##$VPLIST= <PPPPPPPPPPPPPPP>
##$VTLIST= <TTTTTTTTTTTTTTT>
##$WBST= 1024
##$WBSW= 4
##$XGAIN= (0..3)
0 0 0 0
##$XL= 0
##$YL= 0
##$YMAX_a= 15424442
##$YMIN_a= -8764305
##$ZGOPTNS= <>
##$ZL1= 120
##$ZL2= 120
##$ZL3= 120
##$ZL4= 120
##$ABSF1= 14.96276
##$ABSF2= -5.595422
##$ABSG= 5
##$ABSL= 3
##$ALPHA= 0
##$AQORDER= 0
##$ASSFAC= 0
##$ASSFACI= 0
##$ASSFACX= 0
##$ASSWID= 0
##$AUNMP= <proc_prof1d_extract.lims>
##$AXLEFT= 0
##$AXNAME= <>
##$AXNUC= <1H>
##$AXRIGHT= 0
##$AXTYPE= 0
##$AXUNIT= <>
##$AZFE= 0.1
##$AZFW= 0.1
##$BCFW= 0
##$BC_mod= 0
##$BYTORDP= 0
##$COROFFS= 0
##$CY= 15
##$DATMOD= 1
##$DC= 0
##$DFILT= <>
##$DTYPP= 0
##$F1P= 0
##$F2P= 0
##$FCOR= 0.5
##$FTSIZE= 131072
##$FT_mod= 6
##$GAMMA= 0
##$GB= 0
##$INTBC= 1
##$INTSCL= 1
##$ISEN= 128
##$LB= 0.3
##$LEV0= 0
##$LPBIN= 0
##$MAXI= 10000
##$MC2= 0
##$MEAN= 0
##$ME_mod= 0
##$MI= 0
##$NCOEF= 0
##$NC_proc= -2
##$NLEV= 6
##$NOISF1= 0
##$NOISF2= 0
##$NSP= 0
##$NTH_PI= 0
##$NZP= 0
##$OFFSET= 14.96276
##$PC= 1
##$PHC0= 0.5657959
##$PHC1= 0
##$PH_mod= 1
##$PKNL= yes
##$PPARMOD= 0
##$PPDIAG= 0
##$PPIPTYP= 0
##$PPMPNUM= 2147483647
##$PPRESOL= 1
##$PSCAL= 4
##$PSIGN= 0
##$PYNMP= <proc.py>
##$REVERSE= no
##$SF= 400.02000893285
##$SI= 131072
##$SIGF1= 0
##$SIGF2= 0
##$SINO= 400
##$SIOLD= 131072
##$SPECTYP= <>
##$SREGLST= <1H.CDCl3>
##$SSB= 0
##$STSI= 131072
##$STSR= 0
##$SW_p= 8223.68421052631
##$SYMM= 0
##$S_DEV= 0
##$TDeff= 65536
##$TDoff= 0
##$TI= <>
##$TILT= no
##$TM1= 0
##$TM2= 0
##$TOPLEV= 0
##$USERP1= <user>
##$USERP2= <user>
##$USERP3= <user>
##$USERP4= <user>
##$USERP5= <user>
##$WDW= 1
##$XDIM= 131072
##$YMAX_p= 438820204
##$YMIN_p= -14889
##$CURPLOT= <Network HP LaserJet P1505>
##$CURPRIN= <$Network HP LaserJet P1505>
##$DFORMAT= <normdp>
##$LAYOUT= <+/1D_H.xwp>
##$LFORMAT= <normlp>
##$PFORMAT= <normpl>
##$SURQMSG= 1
$$ End of Bruker specific parameters
$$ ---------------------------------
##NTUPLES= NMR SPECTRUM
##VAR_NAME=  FREQUENCY,     SPECTRUM/REAL,   SPECTRUM/IMAG
##SYMBOL=    X,             R,               I
##VAR_TYPE=  INDEPENDENT,   DEPENDENT,       DEPENDENT
##VAR_FORM=  AFFN,          ASDF,            ASDF
##VAR_DIM=   131072,        131072,          131072
##UNITS=     HZ,            ARBITRARY UNITS, ARBITRARY UNITS
##FACTOR=    0.0627417313425164, 1,          1
##FIRST=     8223.62146879497, 1987,         -53180
##LAST=      0,             3666,            -52889
##MIN=       0,             -14889,          0
##MAX=       8223.62146879497, 438820204,    0
$$ Real data points
##PAGE= N=1
##DATA TABLE= (X++(R..R)), XYDATA
$$ [...]
60968A9511287K474788J889834J095550L41678j59636l35084k31666N7087M16660
$$ 19511287 21986075 23875909 24971459 25313137 25153501 24818417 24586751 24643838 25060498
60959B5060498O89092O93412L25478l51006j129363j788478k206858k377562k352591
$$ 25060498 25749590 26443002 26768480 26417474 25288111 23499633 21292775 18915213 16562622
60950A6562622k194071j960461j702787j454442j227807j025529q50969p06068
$$ 16562622 14368551 12408090 10705303 9250861 8023054 6997525 6146556 5440488
60942E440488n86743m87024m05053l41069k92313k54199k24419k02124j84683
$$ 5440488 4853745 4366721 3961668 3620599 3328286 3074087 2849668 2647544 2462861
60933B462861j68889j54230j41734j30526j18593j05984r4309q3786p3655o4835
$$ 2462861 2293972 2139742 1998008 1867482 1748889 1642905 1548596 1464810 1391155 1326320
60923A326320n9279n6890n5617n4247n2694n0174m5770m0602l6771l4258l1269
$$ 1326320 1267041 1210151 1154534 1100287 1047593 997419 951649 911047 874276 840018 808749
60912H08749k7450k4218k2000j9787j7442j5905j4896j3020j0463r024r045q814
$$ 808749 781299 757081 735081 715294 697852 681947 667051 654031 643568 634544 625499 616685
60900F16685p566o570o525o360n572n303n959n906l963j296M98J596K923M360
$$ 616685 609119 602549 596024 589664 584092 578789 572830 566924 562961 561665 562163 563759 566682 571042
60886E71042N219N436N284M818M318M249M325L832L113L316M348M746M064L608
$$ 571042 576261 581697 586981 591799 596117 600366 604691 608523 611636 614952 619300 624046 628110 631718
60872F31718M200M965N073M911M649L441J079j134k265l023m207n365n989o519
$$ 631718 635918 640883 645956 650867 655516 658957 660036 658902 656637 653614 649407 644042 638053 631534
60858F31534p134p042o108n695o655p801p574o038m065j897L39J916K642L571
$$ 631534 624400 617358 611250 605555 598900 591099 583525 577487 573422 571525 571864 573780 576422 579993
60844E79993N418P283Q162Q578R474J0477J0657J0067R351Q528P397O445O396
$$ 579993 585411 592694 600856 609434 618908 629385 640042 650109 659460 667988 675385 681830 688226
60831F88226P346R038J1201J3049J3435J2261J0774R833R013P980P360P485P530
$$ 688226 695572 704610 715811 728860 742295 754556 765330 775163 784176 792156 799516 807001 814531
60818H14531O832N848N043M185L453L647M432M118K253O54N72O52p93l188n119
$$ 814531 821363 827211 832254 836439 839892 843539 847971 852089 854342 854996 855568 856220 855427 852239 847120
60803H47120o693q603j0216j0657j0652j1412j2595j3156j3176j3129j2380j0280
$$ 847120 840427 831824 821608 810951 800299 788887 776292 763136 749960 736831 724451 714171
60791G14171p784o118m773k639k26J288K318M099O286P492P704Q208R413J0599
$$ 714171 706387 700269 695496 692857 692631 693919 696237 700336 706622 714114 721818 730026 739439 750038
60777G50038J1464J2159J2163J0879Q969P543O380M683K970K348K373J600k8j268
$$ 750038 761502 773661 785824 796703 805672 813215 819595 824278 827248 829596 831969 833569 833541 832273
60763H32273j799k484l439l697k869j546r8J462K626K994L468N190P550Q963R393
$$ 832273 830474 827990 824551 820854 817985 816439 816341 817803 820429 823423 826891 832081 839631 848594 857987
60748H57987J0168J1452J1916J1062R966R328Q543P133N530M056K578J495J592
$$ 857987 868155 879607 891523 902585 912551 921879 930422 937555 943085 947141 949719 951214 952806
60735I52806K583L092K533J781J636J773J522O52p66k361l278l039k427k525l157
$$ 952806 955389 958481 961014 962795 964431 966204 967726 968378 967612 965251 961973 958934 956507 953982 950825
60720I50825l511l876n217p200q418q616r124j0788j2935j4685j5965j6866j7231
$$ 950825 947314 943438 938221 931021 922603 913987 904863 894075 881140 866455 850490 833624 816393
60707H16393j7196j7074j6603j5287j3425j1708r986p687n148l103j171J545M509
$$ 816393 799197 782123 765520 750233 736808 725100 715114 707427 702279 699176 698005 699550 704059
60694G04059O214O597P171Q529R587R649R346Q962P615M928K038J0j533l440n769
$$ 704059 710273 716870 724041 732570 742157 751806 761152 770114 777729 782657 784695 784705 783172 779732 773963
60679G73963q142j0312j1905j2485j2321j2169j2086j1426j0108q672p038m655
$$ 773963 765821 755509 743604 731119 718798 706629 694543 683117 673009 664337 657299 652644
60667F52644k106r29j373j884j452r73j402k071j945j403j490k169k487k022j252
$$ 652644 650538 649609 648236 646352 644900 643927 642525 640454 638509 637106 635616 633447 630960 628938 627686
60652F27686p18n12l71J24J225K669L757L914K976J197p06j834j984j840j821
$$ 627686 626968 626456 626085 626209 627434 630103 633860 637774 640750 641947 641241 639407 637423 635583 633762
60637F33762j397k08R81J516K188L997O287P738Q533R794J1290J1756J1345J1713
$$ 633762 632365 632157 633138 634654 636842 640839 647126 654864 663397 673191 684481 696237 707582 719295
60623G19295J3507J5622J7193J8460J9385J9328J8511J8000J7749J6365J3438
$$ 719295 732802 748424 765617 784077 803462 822790 841301 859301 877050 893415 906853
60612I06853J0346Q142O347M482L083K350J348m12k071k936l696n225p365r692
$$ 906853 917199 925341 931688 936170 939253 941603 942951 942539 940468 937532 933836 928611 921246 911554
60598I11554j2285j4990j6990j7752j7493j6316j4113j1577r908r013p566n331
$$ 911554 899269 884279 867289 849537 832044 815728 801615 790038 780130 771117 763551 758220
60586G58220l773l664l754k809j382n56k62k2j6l29k81M14R23P51P98J947L583
$$ 758220 754447 750783 747029 744220 742838 742282 742020 741998 741982 741653 741372 741786 742709 743460 744258 746205 749788
60569G49788M611M951N101N115M897M677M339L214J307k53q13j228k452m114n322
$$ 749788 754399 759350 764451 769566 774463 779140 783479 786693 788000 787747 786934 785706 783254 779140 773818
60554G73818n957o226n851m619l084j855r02QR31K221M375P025R217J1112J4074
$$ 773818 767861 761635 755784 751165 748081 746226 745324 745332 746263 748484 752859 759884 769101 780213 794287
60539G94287J8595K3465K7586L0971L3308L3282L0348K5630J9922J2443K885o904
$$ 794287 812882 836347 863933 894904 928212 961494 991842 1017472 1037394 1049837 1052722 1045818
60527A045818j4786k0534k4700k6667k5628k2435j8628j4423r336l994M02L881
$$ 1045818 1031032 1010498 985798 959131 933503 911068 892440 878017 868681 864687 865089 868970
60515H68970P276J0394J2178J2408J1767J0472Q227N496L536L074L846N467P974
$$ 868970 876246 886640 898818 911226 922993 933465 941692 947188 950724 953798 957644 963111 971085
60502I71085J1516J6151K1897K8692L6583M6171N8226P2594Q8203J04538J22233
$$ 971085 982601 998752 1020649 1049341 1085924 1132095 1190321 1262915 1351118 1455656 1577889
60491A577889J41956J63718J87720K14625K44135K74079L01083L20701L26511
$$ 1577889 1719845 1883563 2071283 2285908 2530043 2804122 3105205 3425906 3752417
60482C752417L11399K71604K08954J28643L6646n9565j50034k25031k78885l10436
$$ 3752417 4063816 4335420 4544374 4673017 4709663 4650098 4500064 4275033 3996148 3685712
60472C685712l21170l14594k96216k71623k44288k16106j89141j65163j44194
$$ 3685712 3364542 3049948 2753732 2482109 2237821 2021715 1832574 1667411 1523217
60463A523217j25198j08008r3235q0774o9869o0313n2260m5221l8575l2693k8296
$$ 1523217 1398019 1290011 1196776 1116002 1046133 985820 933560 888339 849764 817071 788775
60452G88775k5100k2282j9848j8259j7133j5663j4040j3136j3040j3045j2801
$$ 788775 763675 741393 721545 703286 686153 670490 656450 643314 630274 617229 604428
60441F04428j2375j1549j0196q931q333p906o901n551m428l207j471n7l2p91p74
$$ 604428 592053 580504 570308 561377 553044 545138 538237 532686 528258 525051 523580 523523 523491 522700 521926
60426E21926J67P70N75M78J011J641J942K152K345K258K198K907M273N216N188
$$ 521926 522093 522863 523438 523916 524927 526568 528510 530662 533007 535265 537463 540370 544643 549859 555047
60411E55047M844M923N301N451N191M701M209L832L470L010K822L467M562M754
$$ 555047 559891 564814 570115 575566 580757 585458 589667 593499 596969 599979 602801 606268 610830 615584
60397F15584L509K178K312L578M448M363L973L675L215K653K503K839L127L002
$$ 615584 619093 621271 623583 627161 631609 635972 639945 643620 646835 649488 651991 654830 657957 660959
60383F60959K508J695O86o9k61j72j59p7K23L97K83M16J089J636J406Q45O55O90
$$ 660959 663467 665162 665848 665779 665518 665346 665187 665110 665333 665730 666013 666429 667518 669154 670560 671405 672060 672750
60365F72750O13Q58J812K733K728K136J837J814J727K126L566N125N431M860N075
$$ 672750 673363 674221 676033 678766 681494 683630 685467 687281 689008 691134 694700 699825 705256 710116 715191
60350G15191O553Q111Q916R393J0011J0389J0022Q977P614O312N347M507L115
$$ 715191 721744 729855 738771 748164 758175 768564 778586 787563 795177 801489 806836 811343 814458
60337H14458J109m57p66m09k50J09J527L714N772P806J0428J3087J4402J4068
$$ 814458 815567 815110 814344 813935 813685 813794 815321 819035 824807 832613 843041 856128 870530 884598
60323H84598J2931J1418R225O438L502K02l994q466j1694j3023j3114j2602j1514
$$ 884598 897529 908947 918172 924610 928112 928314 924320 915854 904160 891137 878023 865421 853907
60310H53907r997q463o933n227l746l047k697j635L71K585M441N931P043P847
$$ 853907 843910 835447 828514 823287 819541 816494 813797 812162 812533 815118 819559 825490 832533 840380
60296H40380Q841J0224J1067J0323Q367O392M621K305o18l256n061o320p345q136
$$ 840380 849221 859445 870512 880835 889202 895594 900215 902520 901902 898646 893585 887265 879920 871784
60282H71784q744r080q597p040n087l415j679M89K204K448J922K316M005N947
$$ 871784 863040 853960 845363 838323 833236 829821 828142 828631 830835 833283 835205 837521 841526 847473
60268H47473P508Q888J0047J0795J1865J4317J7823K0817K2521K3671K5243K7632
$$ 847473 854981 863869 873916 884711 896576 910893 928716 949533 972054 995725 1020968 1048600
60256A048600L0941L4991L9100M2864M6909N1926N7542O3206O9533P7314Q5817
$$ 1048600 1079541 1114532 1153632 1196496 1243405 1295331 1352873 1416079 1485612 1562926 1648743
60245A648743R3713J01171J09332J17975J25446J30684J33765J34635J32925J28914
$$ 1648743 1742456 1843627 1952959 2070934 2196380 2327064 2460829 2595464 2728389 2857303
60235B857303J23131J15155J04350R1491P8041O4078M8625L1817J5035j033j6710
$$ 2857303 2980434 3095589 3199939 3291430 3369471 3433549 3482174 3513991 3529026 3527993 3511283
60224C511283l1728m4893n5296o2464o5752o5079o1857n7400n0952m1149k8842
$$ 3511283 3479555 3434662 3379366 3316902 3251150 3186071 3124214 3066814 3015862 2974713 2945871
60213B945871j6191l523J0438K5487L9845N3240O7334Q2693R7804J11606J24506
$$ 2945871 2929680 2926157 2936595 2962082 3001927 3055167 3122501 3205194 3302998 3414604 3539110
60202C539110J36158J44709J49030J49617J46533J38709J26120J10479R2895P2878
$$ 3539110 3675268 3819977 3969007 4118624 4265157 4403866 4529986 4640465 4733360 4806238
60192D806238N0545K7587N012j8001m1739o4379q4023j00459j13699j22552j26135
$$ 4806238 4856783 4884370 4889382 4871381 4829642 4765263 4681240 4580781 4467082 4344530 4218395
60181D218395j25366j21484j14300j03148q8513p1603n3291l4315j5452L380K3102
$$ 4218395 4093029 3971545 3857245 3754097 3665584 3593981 3540690 3506375 3490923 3494303 3517405
60170C517405M3741O3684Q1145R5345J05833J11859J13083J09775J02022Q9878
$$ 3517405 3561146 3624830 3705975 3801320 3907153 4019012 4132095 4241870 4343892 4433770
60160D433770P4489N7596L9788K0793J703j4995k8067l8298m6139n0511n0597
$$ 4433770 4508259 4565855 4605643 4626436 4628139 4613144 4585077 4546779 4500640 4450129 4399532
60149D399532m6842l9449k7887j2807L458J9376L5437N1983O7765Q1966R5993
$$ 4399532 4352690 4313241 4285354 4272547 4276005 4295381 4330818 4382801 4450566 4532532 4628525
60138D628525J11946J30646J52222J76990K04554K33396K62534K92324L22688
$$ 4628525 4740471 4871117 5023339 5200329 5404883 5638279 5900813 6193137 6515825
60129F515825L51816L77578L98892M14888M24134M25607M19184M04580L81297
$$ 6515825 6867641 7245219 7644111 8058999 8483133 8908740 9327924 9732504 10113801
60120A0113801L50156L13110K70806K22270J67715J09690N0394j0057p1573j32379
$$ 10113801 10463957 10777067 11047873 11270143 11437858 11547548 11597942 11587885 11516312 11383933
60110A1383933j90543k45168k94625l35523l65100l83089l90018l85640l70536
$$ 11383933 11193390 10948222 10653597 10318074 9952974 9569885 9179867 8794227 8423691
60101H423691l47263l18137k83509k43820k01473j58777j15736p1832k8521J1946
$$ 8423691 8076428 7758291 7474782 7230962 7029489 6870712 6754976 6683144 6654623 6666569
60091F666569M8711Q1394J08421J28306J41476J48936J50275J44726J32897J15638
$$ 6666569 6715280 6796674 6905095 7033401 7174877 7323813 7474088 7618814 7751711 7867349
60081G867349R2560O3735L1642o21l2043o2690r1343j16403j38292j58583j77368
$$ 7867349 7959909 8023644 8055286 8054665 8022622 7959932 7868589 7752186 7613894 7455311 7277943
60070G277943j93440k06461k16767k23584k25554k22838k16819k08034j96018
$$ 7277943 7084503 6878042 6661275 6437691 6212137 5989299 5772480 5564446 5368428
60061E368428j80976j63869j45049j24379j02524q0724n9375l7896j5774P166
$$ 5368428 5187452 5023583 4878534 4754155 4651631 4570907 4511532 4473636 4457862 4465028
60051D465028L0938N4822P7218R7167J15274J32094J46352J55922J59716J57531
$$ 4465028 4495966 4550788 4628006 4725173 4840447 4972541 5118893 5274815 5434531 5592062
60041E592062J49067J34459J15020R2149O6211L7547P608k2124n1337p9760j05967
$$ 5592062 5741129 5875588 5990608 6082757 6148968 6186515 6194123 6171999 6120662 6040902 5934935
60030E934935j28567j47441j62379j71804j74563j71980j66380j58439j47620
$$ 5934935 5806368 5658927 5496548 5324744 5150181 4978201 4811821 4653382 4505762
60021D505762j34209j19097j02397q4098o5375m7448k9696j0591R994L0962N1870
$$ 4505762 4371553 4252456 4150059 4065961 4000586 3953138 3923442 3912851 3922845 3953807 4005677
60010D005677P3145R4991J17424J40638J63962J85167K02172K14581K22298K23895
$$ 4005677 4078822 4173813 4291237 4431875 4595837 4781004 4983176 5197757 5420055 5643950
60000E643950K17990K05173J86854J63320J34765J03091P0532L7256K418l3163
$$ 5643950 5861940 6067113 6253967 6417287 6552052 6655143 6725675 6762931 6765349 6732186
59990F732186o7352r9022j27892j52674j71454j83592j89416j88589j80645j66682
$$ 6732186 6664834 6565812 6437920 6285246 6113792 5930200 5740784 5552195 5371550 5204868
59980E204868j48645j27321j02820p6359m9660k3133L446K8921N1427P0512Q6744
$$ 5204868 5056223 4928902 4826082 4749723 4700063 4676930 4680376 4709297 4760724 4831236 4917980
59969D917980R9692J08339J13055J15239J15421J13470J09984J05465R8737Q8475
$$ 4917980 5017672 5126011 5239066 5354305 5469726 5583196 5693180 5798645 5897382 5985857
59959E985857P5727O2719M9641L5139J9610N286o927j8082k8259l5515l8295l6805
$$ 5985857 6061584 6124303 6173944 6209083 6228693 6233979 6227052 6208970 6180711 6145196 6106901 6070096
59947F070096l1348k1193n791J4426L9012O7928J00798J36955J76319K19035K64361
$$ 6070096 6038748 6017555 6011764 6026190 6065202 6133130 6233928 6370883 6547202 6766237 7030598
59936G030598L11206L59357M08544M56605N00013N35783N61193N72264N64590
$$ 7030598 7341804 7701161 8109705 8566310 9066323 9602106 10163299 10735563 11300153
59927A1300153N35600M84487M10901L16091K05150Q5779l5091j51663k57280l45469
$$ 11300153 11835753 12320240 12731141 13047232 13252382 13338161 13303070 13151407 12894127 12548658
59917A2548658m13550m62773m94527n08791n06680m91708m67369m35435l97433
$$ 12548658 12135108 11672335 11177808 10669017 10162337 9670629 9203260 8767825 8370392
59908H370392l55764l12220k67099k20704j74403j29359q5522m2493k15M1460
$$ 8370392 8014628 7702408 7435309 7214605 7040202 6910843 6825321 6782828 6782613 6824073
59898F824073Q2612J22343J59275J92960K23372K48928K66572K73891K69591K52009
$$ 6824073 6906685 7029028 7188303 7381263 7604635 7853563 8120135 8394026 8663617 8915626
59888H915626K19266J71464J11334M2438l1745j06911j78129k41618k95146l36726
$$ 8915626 9134892 9306356 9417690 9460128 9428383 9321472 9143343 8901725 8606579 8269853
59878H269853l64628l78951l81657l74805l60001l39365l15199k88624k60127
$$ 8269853 7905225 7526274 7144617 6769812 6409811 6070446 5755247 5466623 5206496
59869E206496k31315k04272j79370j55773j34132j16612j04175r5863r0885q9175
$$ 5206496 4975181 4770909 4591539 4435766 4301634 4185022 4080847 3984984 3894099 3804924
59859C804924q9555q9748q8693q6805q3646p7680o8896n9221m9629l9110k7338
$$ 3804924 3715369 3625621 3536928 3450123 3366477 3288797 3219901 3160680 3111051 3071941 3044603
59848C044603j6078o951j0M426M689o4q365j8275k9054l9993m9350n5806n9522
$$ 3044603 3028525 3021574 3021564 3025990 3030679 3030615 3022250 3003975 2974921 2934928 2885578 2829772 2770250
59835B770250o0769n9002n4297m8165m1875l5217k7813k0175j2672m811L633J2111
$$ 2770250 2709481 2650479 2596182 2548017 2506142 2470925 2443112 2422937 2410265 2405454 2409087 2421198
59823B421198K0602K9889L9902M9303N7436O4931P1626P5867P6999P6716P6656
$$ 2421198 2441800 2471689 2511591 2560894 2618330 2683261 2754887 2830754 2907753 2984469 3061125
59812C061125P6113P3397O7979N9967M8952L4996J9760N335p315j7757k4941k7934
$$ 3061125 3137238 3210635 3278614 3338581 3387533 3422529 3442289 3447624 3440309 3422552 3397611 3369677
59800C369677k7100k3507j7729r907k97J0924K3853L8527N4962P3595R4855J18395
$$ 3369677 3342577 3319070 3301341 3291434 3291137 3302061 3325914 3364441 3419403 3492998 3587853 3706248
59788C706248J43912J72650K06651K46537K91360L40424L93082M46197M93236
$$ 3706248 3850160 4022810 4229461 4475998 4767358 5107782 5500864 5947061 6440297
59779F440297N25953N35407N12088M49064L47503K18217P7097n9993j78987k69138
$$ 6440297 6966250 7501657 8013745 8462809 8810312 9028529 9105626 9045633 8866646 8597508
59769H597508l26256l53675l58368l46749l24287k96391k67159k38108k09523
$$ 8597508 8271252 7917577 7559209 7212460 6888173 6591782 6324623 6086515 5876992
59760E876992j82274j57288j34472j13299r3588p4905n6352l7816k0247l978J2059
$$ 5876992 5694718 5537430 5402958 5289659 5196071 5121166 5064814 5026998 5006751 5002773 5014832
59749E014832K8735M5748O2852Q0562R8802J16463J33392J51472J72664J97145
$$ 5014832 5043567 5089315 5152167 5232729 5331531 5447994 5581386 5732858 5905522 6102667
59739F102667K24151K53272K84175L16560L51295L90123M33211M78443N23871
$$ 6102667 6326818 6580090 6864265 7180825 7532120 7922243 8355454 8833897 9357768
59730I357768N69165O13431O53237O84100P02734P06939O94958O66618O24287
$$ 9357768 9926933 10540364 11193601 11877701 12580435 13287374 13982332 14648950 15273237
59721A5273237N71894N14079M56942M07784L72573L54342L54480L73771M11117
$$ 15273237 15845131 16359210 16816152 17223936 17596509 17950851 18305331 18679102 19090219
59712A9090219M62748N24003N90633O57443P17306P63005P89063P91020P64574
$$ 19090219 19552967 20076970 20667603 21325046 22042352 22805357 23594420 24385440 25150014
59703B5150014P07065O19154N04609L69823K24045P8068n8904j80376k80593l53854
$$ 25150014 25857079 26476233 26980842 27350665 27574710 27652778 27593874 27413498 27132905 26779051
59693B6779051l97131m11621m00460l66355l12208k41852j58409o3273M2164J55506
$$ 26779051 26381920 25970299 25569839 25203484 24891276 24649424 24491015 24427742 24469906 24625412
59683B4625412K75289M02171N36624O76822Q19752R62219J098964J221082J317390
$$ 24625412 24900701 25302872 25839496 26516318 27336070 28298289 29397253 30618335 31935725
59674C1935725J375868J383033J325053J192652R85036P09297L79168J6156l51446
$$ 31935725 33311593 34694626 36019679 37212331 38197367 38906664 39285832 39301988 38950542
59665C8950542o94978r91942j227024j390849j481269j504323j470781j392073
$$ 38950542 38255564 37263622 36036598 34645749 33164480 31660157 30189376 28797303
59657B8797303j280935j153784j029121r23554q50158q17826q28016q71906r33219
$$ 28797303 27516368 26362584 25333463 24409909 23559751 22741925 21913909 21042003 20108784
59648B0108784r94722j042463j067127j065346j039947r96778r40972q76714q08615
$$ 20108784 19114062 18071599 17004472 15939126 14899179 13902401 12961429 12084715 11276100
59639A1276100p40665o74500o10582n50365m95498m45768l99937l57935l20426
$$ 11276100 10535435 9860935 9250353 8699988 8204490 7758722 7358785 7000850 6680424
59630F680424k86904k56077k27496k01201j76598j53248j31873j12964r5418p8345
$$ 6680424 6393520 6137443 5909947 5708746 5532148 5378900 5247027 5134063 5038645 4960300
59620D960300o2942n0701m0981l2613k6780k5739k9407l5717m3758n4151o6477
$$ 4960300 4897358 4846657 4805676 4773063 4746283 4720544 4691137 4655420 4611662 4557511 4491034
59609D491034p8760q9622r8989j06611j11588j13543j12874j09896j04898r8641
$$ 4491034 4412274 4322652 4223663 4117052 4005464 3891921 3779047 3669151 3564253 3465612
59599C465612r1691q3697p4476o5008n6212m7577l8363k9138k0802j3094n596
$$ 3465612 3373921 3290224 3215748 3150740 3094528 3046951 3008588 2979450 2958648 2945554 2939958
59588B939958R74O053J0633J5584J9740K1635K2008K2547K3098K2351K0531J9155
$$ 2939958 2940932 2946985 2957618 2973202 2992942 3014577 3036585 3059132 3082230 3104581 3125112 3144267
59576C144267J8768J8952K0099K3110K7738L3083L9274M6924N5532O4171P3175
$$ 3144267 3163035 3181987 3202086 3225196 3252934 3286017 3325291 3372215 3427747 3491918 3565093
59565C565093Q3437R4749J06452J18956J32958J48092J64065J82005K02671K24431
$$ 3565093 3648530 3743279 3849731 3968687 4101645 4249737 4413802 4595807 4798478 5022909
59555E022909K45201K65295K86059L06669L24827L39767L51935L60311L62830
$$ 5022909 5268110 5533405 5819464 6126133 6450960 6790727 7142662 7502973 7865803
59546G865803L59159L50726L38252L21615L01928K81338K60880K40530K20929
$$ 7865803 8224962 8575688 8913940 9235555 9537483 9818821 10079701 10320231 10541160
59537A0541160K02721J84576J64584J43856J26581J16230J13405J17105J25822
$$ 10541160 10743881 10928457 11093041 11236897 11363478 11479708 11593113 11710218 11836040
59528A1836040J37066J47520J53967J53083J41064J15360P6468K6505l3146j01120
$$ 11836040 11973106 12120626 12274593 12427676 12568740 12684100 12760568 12787073 12753927 12652807
59518A2652807j73939k46798l15887l78144m29902m68311m93567n07573n11093
$$ 12652807 12478868 12232070 11916183 11538039 11108137 10639826 10146259 9638686 9127593
59509I127593n04468m90010m70847m47917m20707l90421l59583l28938k97632
$$ 9127593 8623125 8133115 7662268 7214351 6793644 6403223 6043640 5714702 5417070
59500E417070k66185k36490k09000j82697j57794j35695j16266r7876q0181o4194
$$ 5417070 5150885 4914395 4705395 4522698 4364904 4229209 4112943 4015067 3934886 3870692
59490C870692m9514l4248j7948k045J2902K7922M3485N9170P5503R3589J12755
$$ 3870692 3821178 3786930 3768982 3766937 3779839 3807761 3851246 3910416 3985919 4079508 4192263
59479D192263J31247J49435J69708J92827K17000K40743K64075K86436L06003
$$ 4192263 4323510 4472945 4642653 4835480 5052480 5293223 5557298 5843734 6149737
59470F149737L21424L31773L34502L26101L05234K72901K29488J74618J10271
$$ 6149737 6471161 6802934 7137436 7463537 7768771 8041672 8271160 8445778 8556049
59461H556049M1106k9021r8212j63714k21136k67651l03545l29668l45734l52030
$$ 8556049 8597155 8568134 8469922 8306208 8085072 7817421 7513876 7184208 6838474 6486444
59451F486444l50396l42487l29007l11394k91936k71615k49934k27426k05996
$$ 6486444 6136048 5793561 5464554 5153160 4861224 4589609 4339675 4112249 3906253
59442C906253j86344j67457j49230j33015j18960j05453r1925p9728o9392n9598
$$ 3906253 3719909 3552452 3403222 3270207 3151247 3045794 2953869 2874141 2804749 2745151
59432B745151m9619m0322l2004k3744j5649r038l739K012Q179J2530J4603J6960
$$ 2745151 2695532 2655210 2623206 2599462 2583813 2574775 2571036 2573048 2581227 2593757 2608360 2625320
59420B625320K1091K5232K7824L0139L3600L7401M0704M4366M8190M9130M4977
$$ 2625320 2646411 2671643 2699467 2729606 2763206 2800607 2841311 2885677 2933867 2982997 3027974
59409C027974L7854L1739K8411K8145L2250M1892N5655P1029Q7541J06057J25651
$$ 3027974 3065828 3097567 3125978 3154123 3186373 3228265 3283920 3354949 3442490 3548547 3674198
59398C674198J43576J58311J71172J85100K03103K27351K58524K95915L38624
$$ 3674198 3817774 3976085 4147257 4332357 4535460 4762811 5021335 5317250 5655874
59389E655874L86097M37219M89897N41886N90877O33431O65240O83142O85922
$$ 5655874 6041971 6479190 6969087 7510973 8101850 8735281 9400521 10083663 10769585
59380A0769585O72993O44086O00949N47793M89232M28797L69671L14860K65675
$$ 10769585 11442578 12086664 12687613 13235406 13724638 14153435 14523106 14837966 15103641
59371A5103641K21302J80508J42378J05037O5333K0752k9552q5693j47265k11932
$$ 15103641 15324943 15505451 15647829 15752866 15818199 15838951 15809399 15723706 15576441 15364509
59361A5364509k75411l33308l81789m16714m34584m35208m21769l98013l67165
$$ 15364509 15089098 14755790 14374001 13957287 13522703 13087495 12665726 12267713 11900548
59352A1900548l33668l03316k80565k67327k64493k72256k88427l08887l30630
$$ 11900548 11566880 11263564 10982999 10715672 10451179 10178923 9890496 9581609 9250979
59343I250979l52365l71886l85635l91781l91235l84828l72056l53590l32211
$$ 9250979 8898614 8526728 8141093 7749312 7358077 6973249 6601193 6247603 5915392
59334E915392l09832k86023k60710k35852k12926j91082j69370j48642j29910
$$ 5915392 5605560 5319537 5058827 4822975 4610049 4418967 4249597 4100955 3971045
59325C971045j12818r7077q3360p1605o0532m9935m1247l4690k8311k1006j3975
$$ 3971045 3858227 3761150 3677790 3606185 3545653 3495718 3454471 3419781 3391470 3370464 3356489
59314C356489p941j510O211J4044K1364K9650L9641M9629N8504O7960P9522R1800
$$ 3356489 3348548 3347038 3353249 3367293 3388657 3418307 3457948 3507577 3566081 3634041 3713563 3805363
59302C805363J02896J13246J23779J33446J40983J47155J52794J56369J55818
$$ 3805363 3908259 4021505 4145284 4278730 4419713 4566868 4719662 4876031 5031849
59293E031849J51339J44268J34887J23406J11543J00892R1104Q1645P3961O9946
$$ 5031849 5183188 5327456 5462343 5585749 5697292 5798184 5889288 5970933 6044894 6114840
59283F114840O9654P2243P7650Q5518R3901J00835J05803J08227J06195R8407
$$ 6114840 6184494 6256737 6334387 6419905 6513806 6614641 6720444 6828671 6934866 7033273
59273G033273Q5723O9183M8186K2188p610l9854p4201j09014j39927j62964j77598
$$ 7033273 7118996 7188179 7236365 7258553 7250943 7211089 7136888 7027874 6887947 6724983 6547385
59262F547385j85046j85479j78933j67175j52323j34915j14964r3392p0861m7004
$$ 6547385 6362339 6176860 5997927 5830752 5678429 5543514 5428550 5335158 5264297 5217293
59252E217293k2367R19K1995M2593O3742Q3543J00257J15043J29281J41686J50820
$$ 5217293 5194926 5195845 5217840 5260433 5324175 5407718 5507975 5623018 5752299 5893985 6044805
59241F044805J58244J66337J74937J83092J92375K05475K22993K44289K69885
$$ 6044805 6203049 6369386 6544323 6727415 6919790 7125265 7348258 7592547 7862432
59232G862432L00027L32200L62614L88898M08779M17745M10936L86326L43784
$$ 7862432 8162459 8494659 8857273 9246171 9654950 10072695 10483631 10869957 11213741
59223A1213741K82618K02991J08567N029j02951k10980l12857m02214m75472n31006
$$ 11213741 11496359 11699350 11807917 11812946 11709995 11499015 11186158 10783944 10308472 9777466
59213I777466n66988n82807n81365n67128n42788n10122m72489m33547l94536
$$ 9777466 9210478 8627671 8046306 7479178 6936390 6426268 5953779 5520232 5125696
59204E125696l55432l17667k83078k51448k21802j95005j72361j52934j35042
$$ 5125696 4770264 4452597 4169519 3918071 3696269 3501264 3328903 3175969 3040927
59195C040927j19234j06937r7297q8337q0208p4302p0056o5628o1004n7559n5159
$$ 3040927 2921693 2814756 2717459 2629122 2548914 2474612 2404556 2338928 2277924 2220365 2165206
59184B165206n2448m9275m6301m3012l8687l4395l1487k9100k5725k2039j9366
$$ 2165206 2112758 2063483 2017182 1974170 1935483 1901088 1869601 1840501 1814776 1792737 1773371
59173A773371j6696j2304p208l656j125K801Q221J2983J6478K0055K3979K7183
$$ 1773371 1756675 1744371 1737163 1733507 1732382 1735183 1743404 1756387 1772865 1792920 1816899 1844082
59161A844082L0029L4194L9724M4879M8989N3056N7626O2354O7420P3149P8788
$$ 1844082 1874111 1908305 1948029 1992908 2041897 2094953 2152579 2214933 2282353 2355502 2434290
59150B434290Q3727Q9121R6016J02923J07883J11734J16514J21707J25194J26965
$$ 2434290 2518017 2607138 2703154 2806077 2913960 3025694 3142208 3263915 3389109 3516074
59140C516074J28493J29158J26715J20885J13197J03691R1073P6013O0913M6484
$$ 3516074 3644567 3773725 3900440 4021325 4134522 4238213 4329286 4405299 4466212 4512696
59130D512696L1677J6988M699m145j0071j2521r967k749P187J9526L5796N6218
$$ 4512696 4544373 4561361 4566060 4561915 4551844 4539323 4529356 4526607 4533794 4553320 4589116 4645334
59118D645334P9057J03227J28869J55332J81168K06139K30467K51998K66576K71300
$$ 4645334 4724391 4827618 4956487 5111819 5292987 5499126 5729593 5981591 6248167 6519467
59108F519467K65048K46306K13337J66819J10033M6727j9050q1726j35821j78713
$$ 6519467 6784515 7030821 7244158 7410977 7521010 7567737 7548687 7466961 7331140 7152427
59098G152427k09801k27909k32463k26324k14075j97806j77489j54794j32996
$$ 7152427 6942626 6714717 6482254 6255930 6041855 5844049 5666560 5511766 5378770
59089E378770j13444r5549q0149o9478o3815o1498o2245o7159p5520q4976r4957
$$ 5378770 5265326 5169777 5089628 5020150 4956335 4894837 4832592 4765433 4689913 4604937 4509980
59078D509980j06482j18564j28378j35227j40851j45417j46768j44215j39654
$$ 4509980 4403498 4284934 4156556 4021329 3880478 3735061 3588293 3444078 3304424
59069C304424j34199j26891j17479j07422r7369q6456p4663o3117n1859m0230
$$ 3304424 3170225 3043334 2925855 2818433 2721064 2634608 2559945 2496828 2444969 2404739
59059B404739k9620k2700j9644j8339j8500k2198k9888l9341m9035n9119o8444
$$ 2404739 2375119 2352419 2332775 2314436 2295936 2273738 2243850 2204509 2155474 2096355 2027911
59048B027911p4240p5800p5276p3871p0457o4819n8927n3851m8473m2390l7127
$$ 2027911 1953671 1877871 1802595 1728724 1658267 1593448 1534521 1480670 1432197 1389807 1352680
59037A352680l3280k9322k4396j9674j5916j2251q375n391l578j734N23K118K707
$$ 1352680 1319400 1290078 1265682 1246008 1230092 1217841 1209466 1204075 1200497 1198763 1199286 1201404 1204111
59024A204111L070L045J688k51q30j37j68j325j979j676j594j596j86K285L748
$$ 1204111 1207181 1210226 1211914 1211663 1210833 1210696 1210528 1209203 1207224 1205548 1203954 1202358 1202172 1204457 1208205
59009A208205M132N519Q131R728R562R293R414Q431O357N271N541N219M038M155
$$ 1208205 1212337 1217856 1225987 1235715 1245277 1254570 1263984 1272415 1278772 1284043 1289584 1294803 1298841 1302996
58995A302996N905O781N940N785P606R453R932J0466J2023J3169J3158J3540J4962
$$ 1302996 1308901 1315682 1321622 1327407 1335013 1344466 1354398 1364864 1376887 1390056 1403214 1416754 1431716
58982A431716J5726J5293J5801J8297K0669K1335K1795K3675K6182K8338L0918
$$ 1431716 1447442 1462735 1478536 1496833 1517502 1538837 1560632 1584307 1610489 1638827 1669745
58971A669745L4440L7973M1384M5899N1127N4552N5333N5402N5609N4187N0457
$$ 1669745 1704185 1742158 1783542 1829441 1880568 1935120 1990453 2045855 2101464 2155651 2206108
58960B206108M6410M2981L8474L2542K8063K6938K7458K8032L0110L5015M1222
$$ 2206108 2252518 2295499 2333973 2366515 2394578 2421516 2448974 2477006 2507116 2542131 2583353
58949B583353M7164N3815O2134P0835P8862Q7311R6880J06337J15405J26101J39221
$$ 2583353 2630517 2684332 2746466 2817301 2896163 2983474 3080354 3186691 3302096 3428197 3567418
58938C567418J52697J65485J79770J97164K16096K35359K56889K82422L10571
$$ 3567418 3720115 3885600 4065370 4262534 4478630 4713989 4970878 5253300 5563871
58929E563871L40017L72524M10006M51369M95086N42235N94260O50107P08062
$$ 5563871 5903888 6276412 6686418 7137787 7632873 8175108 8769368 9419475 10127537
58920A0127537P67845Q28228Q84905R32935R68832R88184R84072R50482Q84984
$$ 10127537 10895382 11723610 12608515 13541450 14510282 15498466 16482538 17433020 18318004
58911A8318004P86417O53498M88748L01153J02205r8371k91244m65696o13208
$$ 18318004 19104421 19757919 20246667 20547820 20650025 20551654 20260410 19794714 19181506
58902A9181506p30932q19141q77587r07013r11765q97717q69135q29473p82763
$$ 19181506 18450574 17631433 16753846 15846833 14935068 14037351 13168216 12338743 11555980
58893A1555980p31902o77607o21111n65525n12706m61622m11943l66419l27576
$$ 11555980 10824078 10146471 9525360 8959835 8447129 7985507 7573564 7207145 6879569
58884F879569k94952k67735k47040k33093k23269k15299k09406k05016j98879
$$ 6879569 6584617 6316882 6069842 5836749 5613480 5398181 5188775 4983759 4784880
58875D784880j89247j78480j68667j58029j44757j30927j19124j08349r6850q6002
$$ 4784880 4595633 4417153 4248486 4090457 3945700 3814773 3695649 3587300 3490450 3404448
58865C404448p7687p0582o2656n4811m8516m2461l5088k7926k2858j8510j2783
$$ 3404448 3326761 3256179 3193523 3138712 3090196 3047735 3012647 2984721 2961863 2943353 2930570
58854B930570o516j165M518J1939J9267K4375K8830L5279M3049M9983N6449O3900
$$ 2930570 2924054 2922889 2927407 2939346 2958613 2982988 3011818 3047097 3090146 3140129 3196578 3260478
58842C260478P1561P8194Q5149R4215J04422J14264J24914J37881J51822J65144
$$ 3260478 3332039 3410233 3495382 3589597 3694019 3808283 3933197 4071078 4222900 4388044
58832D388044J79375J96430K15016K33492K53777K78529L06750L36288L68474
$$ 4388044 4567419 4763849 4978865 5212357 5466134 5744663 6051413 6387701 6756175
58823F756175M06107M48819M94650N44175N98798O56648P14386P71383Q27688
$$ 6756175 7162282 7611101 8105751 8649926 9248724 9905372 10619758 11391141 12218829
58814A2218829Q79133R18539R40648R42078R17834Q62144P72428O49683M96580
$$ 12218829 13097962 14016501 14957149 15899227 16817061 17679205 18451633 19101316 19597896
58805A9597896L18625J25873p0098k59988m35605n87786p09569p99874q60882
$$ 19597896 19916521 20042394 19972296 19712308 19276703 18688917 17979348 17179474 16318592
58796A6318592q93824r00693q87451q61209q25665p82702p36179o90122o45088
$$ 16318592 15424768 14524075 13636624 12775415 11949750 11167048 10430869 9740747 9095659
58787I095659o00286n57397n18333m81394m43925m06971l73238l42391l12631
$$ 9095659 8495373 7937976 7419643 6938249 6494324 6087353 5714115 5371724 5059093
58778E059093k84946k61345k40591k20194k01044j85654j73360j61620j50555
$$ 5059093 4774147 4512802 4272211 4052017 3850973 3665319 3491959 3330339 3179784
58769C179784j41715j33930j24830j15154j07120r9920r1272q1932p4212o7398
$$ 3179784 3038069 2904139 2779309 2664155 2557035 2457115 2365843 2283911 2209699 2142301
58759B142301n9272n0860m4984m1272l7022l2000k8044k5064k1737j8916j8020
$$ 2142301 2083029 2032169 1987185 1945913 1908891 1876891 1848847 1823783 1802046 1783130 1765110
58748A765110j7439j4937j2149j2092j3664j3425j1440j0569j1005j0480q936
$$ 1765110 1747671 1732734 1720585 1708493 1694829 1681404 1669964 1659395 1648390 1637910 1628974
58737A628974q282q357p706p309r032j1547j2351j2570j5051j9092k1881k3811
$$ 1628974 1620692 1612335 1604629 1597320 1588288 1576741 1564390 1551820 1536769 1517677 1495796 1471985
58725A471985k7182l0996l2325l1873l2785l4851l5156l3680l2873l2500l0253
$$ 1471985 1444803 1413807 1381482 1349609 1316824 1281973 1246817 1213137 1180264 1147764 1117511
58714A117511k6882k5368k5394k3891k0622j8149j6800j4753j2435j1759j1602
$$ 1117511 1090629 1065261 1039867 1015976 995354 977205 960405 945652 933217 921458 909856
58703I09856r295n827m338m314k812n42p50k694k371M28J788M26j108k098m615
$$ 909856 900561 894734 890396 886082 883270 882728 881978 879284 876913 877341 879129 879555 878447 876349 871734
58688H71734q439j0728j1291j2749j5108j5525j3797j2741j2846j1743r242p588
$$ 871734 863295 852567 841276 828527 813419 797894 784097 771356 758510 746767 737525 729937
58676G29937o623m076p64o4j989l157k709k917l824l003p08K87J44J723M774O079
$$ 729937 723314 719238 718474 718410 716421 713264 710555 707638 703814 700811 700103 700390 700534 702257 707031 713110
58660G13110N335N243N783M402J811J450L127L470K771M789R522J2865J3987J6206
$$ 713110 718445 723688 729471 733873 735684 737134 740261 743731 746502 751291 760813 773678 787665 803871
58646H03871J9909K1554K0727K1277K4125K5739K5151K5817K9051L2146L4453
$$ 803871 823780 845334 866061 887338 911463 937202 962353 988170 1017221 1049367 1083820
58635A083820L8767M5104M9849N2696N7852O6579P5298Q2851R2866J06822J21591
$$ 1083820 1122587 1167691 1217540 1270236 1328088 1394667 1469965 1552816 1645682 1752504 1874095
58624A874095J36047J53471J74972J97129K18528K41944K67308K89060L03168
$$ 1874095 2010142 2163613 2338585 2535714 2754242 2996186 3263494 3552554 3855722
58615C855722L10423L09878K95688K63921K16923J58223Q9193J3820n9321j23448
$$ 3855722 4166145 4476023 4771711 5035632 5252555 5410778 5499971 5513791 5454470 5331022
58605E331022j77127k19316k46910k59945k63293k60125k49140k30730k09865
$$ 5331022 5153895 4934579 4687669 4427724 4164431 3904306 3655166 3424436 3214571
58596C214571j89894j69353j47877j29421j16399j06242r6740q9377q4418p8472
$$ 3214571 3024677 2855324 2707447 2578026 2461627 2355385 2258645 2169268 2084850 2006378
58586B006378p0076o2300n6907n1318m4082l7759l3688k9574k5000k3471k6170
$$ 2006378 1936302 1874002 1817095 1765777 1721695 1683936 1650248 1620674 1595674 1572203 1546033
58575A546033k9526l1566l4678l9424m1990m0793l9293l9175l7221l2205k8199
$$ 1546033 1516507 1484941 1450263 1410839 1368849 1328056 1288763 1249588 1212367 1180162 1151963
58564A151963k7395k6184k2169j8835j9087k0260j9523j8480j8537j7478j4382
$$ 1151963 1124568 1098384 1076215 1057380 1038293 1018033 998510 980030 961493 944015 929633
58553I29633j2241j2134j0736o938m609n303m812q81K344J755O21K097L889L848
$$ 929633 917392 905258 894522 887584 882975 877672 872860 871979 874323 876078 876699 878796 882685 886533
58539H86533M512P417R082P300N428N841N366J691j963l218n286j0458j5232j6782
$$ 886533 891045 898462 907544 914844 920272 926113 931479 933170 931207 927989 922703 912245 897013 880231
58525H80231j8030k1325k3455k2119k0919k2512k3120j9468j5039j3697j3136
$$ 880231 862201 840876 817421 795302 774383 751871 728751 709283 694244 680547 667411
58514F67411j0370p852q181q494n937l299l501m001k238r77k707m263k610m89
$$ 667411 657041 649189 641008 632514 626577 623278 619777 615776 613538 612561 609854 605591 602981 602492
58500F02492q18j202O25J760k3j398Q0Q51j690l552j388J082M1j423L09K416J587
$$ 602492 601674 600472 601097 602857 602834 601436 601516 602367 600677 597125 595737 596819 596860 595437 595746 598162 599749
58483E99749P28K992N247M297L505O437R852R957R561J2064J4439J3348J2170
$$ 599749 600477 603469 608716 613013 616518 622955 632807 642764 652325 664389 678828 692176 704346
58470G04346J4589J7109J5297J1644R925P748K128l506n515p262j2507j7640j8283
$$ 704346 718935 736044 751341 762985 772910 780658 782786 779280 773765 766503 753996 736356 718073
58457G18073j7468j9320k0765j7869j4250j4593j5653j2555q235p736q654o331
$$ 718073 700605 681285 660520 642651 628401 613808 598155 585600 577365 569629 560975 554644
58445E54644l154l610n200l402o65j521l591k271M56M97j90J547K576m13k991
$$ 554644 551490 547880 542680 539278 538613 537092 533501 531230 531686 532183 531993 533540 536116 535703 532712
58430E32712k40L848L505J829M457Q526Q222N918P279J0306R826Q067J0229J4100
$$ 532712 532472 536320 539825 541654 546111 554637 562859 568777 576056 586362 596188 604255 614484 628584
58416F28584J4444J3202J5034J7449J5705J2729J3614J5152J1555N768M058M129
$$ 628584 643028 656230 671264 688713 704418 717147 730761 745913 757468 763236 767294 771423
58404G71423m9o190p948o912q853j2171j1539r076j0328j3045j1357p247o534
$$ 771423 771374 765184 757236 750324 741471 729300 717761 708685 698357 685312 673955 666708 660174
58391F60174p450m676o14r96l373j659J944J355j289L0L150K169l51K100P465
$$ 660174 652724 648048 647434 646438 643065 641406 643350 644705 643416 643446 646596 648765 648414 650514 657979
58376F57979R499J0011J4156J8273J5765J0438J0375J3026J0385M591L711O124
$$ 657979 667478 677489 691645 709918 725683 736121 746496 759522 769907 774498 778209 784333
58364G84333M035j026j343J677M67l466k476J879J673j902j127K748K034j888
$$ 784333 788368 787342 785999 787676 788143 784677 782201 784080 785753 783851 782724 785472 787506 785618
58350G85618j160K779J765k811k195L130M770K573L688P289O222K258L723R403
$$ 785618 784458 787237 789002 786191 783996 787126 791896 794469 798157 805446 811668 813926 817649 827052
58336H27052J0652P862Q838J2685J1654P171P402J0813Q933L440L299P066N639
$$ 827052 837704 845566 854404 867089 878743 885914 893316 904129 913062 916502 919801 926867 932506
58323I32506O34J783P885Q882N214O277J1223J0549N534O350J1910J1576O004
$$ 932506 933140 934923 942808 951690 956904 963181 974404 984953 990487 996837 1008747 1020323 1026327
58310A026327O018J1317J1065N371N205J0931J2016Q229R736J5930J5860J0188
$$ 1026327 1032345 1043662 1054727 1060098 1065303 1076234 1088250 1096479 1106215 1122145 1138005 1148193
58298A148193J0647J7065J7411J1371J1018J7037J7623J2280J2975K0044K1004
$$ 1148193 1158840 1175905 1193316 1204687 1215705 1232742 1250365 1262645 1275620 1295664 1316668
58287A316668J5217J5226K1647K1605J4514J4039K1676K3938J8755J8760K5271
$$ 1316668 1331885 1347111 1368758 1390363 1404877 1418916 1440592 1464530 1483285 1502045 1527316
58276A527316K5422J8484J8212K5605K6624K0439K1783L1533L3831K6770K6367
$$ 1527316 1552738 1571222 1589434 1615039 1641663 1662102 1683885 1715418 1749249 1776019 1802386
58265A802386L5497L8981L4338L6614M7331N0265M3806M5236N6850O0882N4475
$$ 1802386 1837883 1876864 1911202 1947816 1995147 2045412 2089218 2134454 2191304 2252186 2306661
58254B306661N5535O6910O9874O0890N9078O8851P1738O3925O4307P6167P9536
$$ 2306661 2362196 2429106 2498980 2559870 2618948 2687799 2759537 2823462 2887769 2963936 3043472
58243C043472P1277P2877Q8250R5023Q8584R1970J10402J20285J15995J21813
$$ 3043472 3114749 3187626 3275876 3370899 3459483 3551453 3661855 3782140 3898135 4019948
58233D019948J43698J56552J54030J61975J86768K01256J98808K08372K37778
$$ 4019948 4163646 4320198 4474228 4636203 4822971 5024227 5223035 5431407 5669185
58224E669185K57293K58911K74260L12485L40615L48650L71037M18568M55181
$$ 5669185 5926478 6185389 6459649 6772134 7112749 7461399 7832436 8251004 8706185
58215H706185M69695N01291N64176O20026O57233P20066Q24023R24484J007937
$$ 8706185 9175880 9677171 10241347 10861373 11518606 12238672 13062695 13987179 14995116
58206A4995116J126749J301664J484735J666177J916083K268799K678579L147884
$$ 14995116 16121865 17423529 18908264 20574441 22490524 24759323 27437902 30585786
58198C0585786L773003M594462N547336O648631Q080801R997709J2447200J5625313
$$ 30585786 34358789 38953251 44500587 51149218 59230019 69227728 81674928 97300241
58190I7300241J9963635K5695420L2441942L9334799M5162190M8012955M5277339
$$ 97300241 117263876 142959296 175401238 214736037 259898227 307911182 353188521
58183C53188521L5120096J8499696o55153j7728940k9931244l6818958l9204998
$$ 353188521 388308617 406808313 406153160 388424220 358492976 321674018 282469020
58176B82469020l8217803l5095330l1034558k6835468k2818209j9122164j5896032
$$ 282469020 244251217 209155887 178121329 151285861 128467652 109345488 93449456
58169I3449456j3192758j0918675q985155p386560o095273n013579m071870l268422
$$ 93449456 80256698 69338023 60352868 52966308 46871035 41857456 37785586 34517164
58161C4517164k583505j947381j309647o54475N6627Q69057J753839K601794L262676
$$ 34517164 31933659 29986278 28676631 28022156 28078783 28947840 30701679 33303473 36566149
58152C6566149L511708L060384J786448k2319j793018l085606l813727m086135
$$ 36566149 40077857 43138241 44924689 44902370 43109352 40023746 36210019 32123884
58144C2123884m003687l665636l219893k784879k378640j988382j646437j382964
$$ 32123884 28120197 24454561 21234668 18449789 16071149 14082767 12436330 11053366
58136A1053366j169926r72859q07048o92133o01512n05989m22352l72962l39034
$$ 11053366 9883440 8910581 8103533 7411400 6809888 6303899 5881547 5508585 5169551
58127E169551k96707k59822k46418k39624k20083k02081k01258k00134j80358
$$ 5169551 4872844 4613022 4366604 4126980 3906897 3704816 3503558 3303424 3123066
58118C123066j57107j48324j40802j18824r6293q9144q4613o8347n4327n8066
$$ 3123066 2965959 2817635 2676833 2558009 2461716 2372572 2287959 2219612 2165285 2107219
58108B107219o6504o3265n8259o4351o9738o1258n1278n4136n8702n0823m0863
$$ 2107219 2040715 1977450 1919191 1854840 1785102 1723844 1672566 1618430 1559728 1508905 1468042
58097A468042m2844m7449m1513l3944l7185m2273l6917k9671l2330l6352l0142
$$ 1468042 1425198 1377749 1336236 1302292 1265107 1222834 1185917 1156246 1123916 1087564 1057422
58086A057422k2248k4507k9124k4790j8999k2440k7336k2952j6923j9937k4532
$$ 1057422 1035174 1010667 981543 956753 937754 915314 887978 865026 848103 828166 803634
58075H03634j9969j3221j4652j7508j2130n992r267j4372j0289l729n851j0854
$$ 803634 783665 770444 755792 738284 726154 720162 710895 696523 686234 682505 676654 665800
58063F65800q009k530m498q772n686n62l252q795p481l839p087j2554j0857o198
$$ 665800 657791 655261 650763 641991 636305 635743 632491 623696 616215 612376 605289 592735 581878 575680
58049E75680p636j1294q565l248l532n637j971L120J886j258J467N602L488mL282
$$ 575680 568044 556750 548185 544937 541405 535768 533797 536917 538803 537545 539012 544614 548102 548098 551380
58034E51380Q636P421L566N165Q082M197k152k196N22k454p733o930l257n112
$$ 551380 560016 567437 571003 576168 584250 588447 586295 584099 584621 582167 574434 567504 564247 559135
58020E59135r623q543m510n670r778r121n813p086j0434q449l622l763p373p645
$$ 559135 549512 540969 536459 530789 521011 511890 506077 498991 488557 480108 476486 472723 465350 457705
58006D57705o157q637j1952r401m309m509p815o631k426j993l741j380L068L435
$$ 457705 451548 442911 430959 421558 417249 412740 404925 398294 395868 393875 390134 388754 391822 395257
57992C95257K364O581J3253J4535J1827J2183J4398J2210P657P610J0120P760
$$ 395257 397621 404202 417455 431990 443817 456000 470398 482608 490265 497875 507995 515755
57980E15755J746m58J080K54k438j613J097m50m805n625m059o163j0444j0403
$$ 515755 517501 517043 518123 518377 515939 514326 515423 514973 510168 504543 500484 494321 483877 473474
57966D73474p268p672j0759j0015o111n406p346n701j083J02j954j192K102J820
$$ 473474 466206 458534 447775 437760 431649 426243 418897 413196 412113 412215 410261 409069 411171 412991
57952D12991j946l036q18k66j115J598O638P551M362L405N632N861L445K903M008
$$ 412991 411045 408009 407191 406925 405810 407408 414046 421597 425959 429364 434996 440857 444302 447205 451213
57937D51213J905k743m164k126k074m631n106l359m088p175p747n916o506r146
$$ 451213 453118 450375 446211 444085 442011 437380 432274 428915 424827 417652 409905 403989 397483 388337
57923C88337q583m960l725n126l824O06K859K041K835N871O707N152N906R025
$$ 388337 379754 374794 371069 365943 362119 362725 365584 367625 370460 376331 383038 388190 394096 403121
57909D03121R298O111M610N974N842L471L119N111M673J045j130p68j904n055
$$ 403121 412419 418530 423140 429114 434956 438427 441546 446657 451330 452375 451245 450477 448573 443518
57895D43518n852l688l113n167n848m428m876p616q414o754o892r164q845n081
$$ 443518 437666 433978 430865 425698 419850 415422 410546 402930 394516 387762 380870 371706 362861 357780
57881C57780k554k665j573J412K028l74r36J945M053L619M142O774P895O501O374
$$ 357780 355226 352561 350988 352400 354428 354054 353118 355063 359116 362735 366877 373651 381546 388047 394421
57866C94421Q615R559Q201Q243J0476J0698P446M587L962K601o21k662k688l822
$$ 394421 403036 412595 420796 429039 439515 450213 457659 462246 466208 468809 468188 465526 462838 459016
57852D59016o629p866p306q579j1642j2029r307q393j0460j0601o997m381n380
$$ 459016 452387 444521 437215 428636 416994 404965 395658 387265 376805 366204 359207 354826 349446
57839C49446o215m320k800l785m333k579j344k274k647j217j021l342m948m265
$$ 349446 343231 338911 336111 332326 327993 325414 324070 321796 319149 317932 316911 313569 308621 304356
57825C04356m245o348p762p216p431r212r314o853n475o626o864m628l103l734
$$ 304356 300111 293763 286001 278785 271354 262142 252828 245975 240500 233874 227010 222382 219279 215545
57811B15545l366p72N67q15j364O46J774K03n90J606L740L654M023O572Q450Q001
$$ 215545 212179 211407 211974 211159 209795 210441 212215 212418 211828 213434 217174 220828 224851 231423 239873 247874
57795B47874Q239J0787J2238J0297P861P235O034K749O18J796L055J500o66j083
$$ 247874 256113 266900 279138 289435 297296 304531 310565 313314 313932 315728 318783 320283 319617 318534
57781C18534j819m847p776q242p922q427p776m717j971j558j292O23K167J879
$$ 318534 316715 311868 304092 295850 287928 279501 271725 267008 265037 263479 262187 262810 264977 266856
57767B66856J910L379L629J497K62J866L240K083J152K901M855M447L642M532
$$ 266856 268766 272145 275774 277271 277533 279399 282639 284722 285874 288775 293630 298077 301719 306251
57753C06251N037L165J162J192J298l04j223O43K894K951K485L570M587L905L461
$$ 306251 311288 314453 315615 316807 318105 317801 316578 317221 320115 323066 325551 329121 333708 337613 341074
57738C41074M726N294L431J879L096M872M715M380N901P313O588N836P252Q822
$$ 341074 345800 351094 354525 356404 359500 364372 369087 373467 379368 386681 393269 399105 406357 415179
57724D15179Q381Q099J0537J3972J5845J7250J9770K1692K1539K1684K4109K6373
$$ 415179 423560 431659 442196 456168 472013 489263 509033 530725 552264 573948 598057 624430
57712F24430K6064K5521K7672L0949L2930L5295M0444M6680N1585N6940O5511
$$ 624430 650494 676015 703687 734636 767566 802861 843305 889985 941570 998510 1064021
57701A064021P6034Q6083R6848J10509J25798J40836J57476J78290K01888K25443
$$ 1064021 1140055 1226138 1322986 1433495 1559293 1700129 1857605 2035895 2237783 2463226
57691B463226K48853K72057K91189L01827L03152K94733K72536K33116J79069
$$ 2463226 2712079 2984136 3275325 3577152 3880304 4175037 4447573 4680689 4859758
57682D859758J16145M8040k1508q5095j35765j72553j97407k09414k06839j92000
$$ 4859758 4975903 5023943 5002435 4917340 4781575 4609022 4411615 4202201 3995362 3803362
57672C803362j68845j37967r9088n6443j7264J2620K7474J9861j3092o2883j14375
$$ 3803362 3634517 3496550 3397462 3341019 3323755 3336375 3363849 3383710 3370618 3307735 3193360
57661C193360j56488j84861j97605j94869j81349j63364j43525j21885j00514
$$ 3193360 3036872 2852011 2654406 2459537 2278188 2114824 1971299 1849414 1748900
57652A748900q2296o6775n1800l7923k6837j7193o541M209J2827K0630L0616M2254
$$ 1748900 1666604 1599829 1548029 1510106 1483269 1466076 1459535 1463744 1476571 1497201 1527817 1570071
57640A570071N2898O3070P5598R0592J05908J21685J39909J60269J80663K00894
$$ 1570071 1622969 1686039 1761637 1852229 1958137 2079822 2219731 2380000 2560663 2761557
57630B761557K21787K41385K55855K63022K61444K47576K18172J74546J20905
$$ 2761557 2983344 3224729 3480584 3743606 4005050 4252626 4470798 4645344 4766249
57621D766249O0022n571p0060j26695j72847k09034k34560k48256k52015k49247
$$ 4766249 4826271 4820700 4750640 4623945 4451098 4242064 4007504 3759248 3507233 3257986
57611C257986k40964k27253k10899j95275j80048j63279j46175j31494j18833
$$ 3257986 3017022 2789769 2578870 2383595 2203547 2040268 1894093 1762599 1643766
57602A643766j06062r3927q4693p7567p0120o2836n7629n3263m7133m0378l6250
$$ 1643766 1537704 1443777 1359084 1281517 1211397 1148561 1090932 1037669 990536 950158 913908
57591I13908l4471l2054k8741k6614k5227k2264j8384j6444j6326j5347j3371
$$ 913908 879437 847383 818642 792028 766801 744537 726153 709709 693383 678036 664665
57580F64665j2684j3191j2422j0076q069o522m160k050k291l539k558K34J590
$$ 664665 651981 638790 626368 616292 608223 601701 597541 595491 593200 589661 587103 587337 588927
57567E88927J257K045M439O158O969Q910J1723J2943J2702J3663J6047J7482J7914
$$ 588927 590184 592229 596668 602826 609795 618705 630428 643371 656073 669736 685783 703265 721179
57554G21179J9844K3426K6191K8006L1604L7626M3706M9062N5514O3521P1619
$$ 721179 741023 764449 790640 818646 850250 887876 931582 980644 1036158 1099679 1171298
57543A171298Q0110R0945J03596J15649J27642J42571J60141J76398J89593K01314
$$ 1171298 1251408 1342353 1445949 1561598 1689240 1831811 1991952 2168350 2357943 2559257
57533B559257K11018K14337K08177J92810J67944J31609Q4775L2872j8933o8267
$$ 2559257 2770275 2984612 3192789 3385599 3553543 3685152 3769927 3802799 3783866 3715599
57523C715599j12577j48031j73029j89129j97437j97649j91399j82404j72191
$$ 3715599 3603022 3454991 3281962 3092833 2895396 2697747 2506348 2323944 2151753
57514B151753j59480j44601j30398j17895j05260r2113q0671p1555o2633n3249
$$ 2151753 1992273 1847672 1717274 1599379 1494119 1402006 1321335 1249780 1187147 1133898
57504A133898m5377l9443l3192k5998k0047j5938j1274n062O96N202J0321J6403
$$ 1133898 1088521 1049078 1015886 989888 969841 953903 942629 937567 938263 943465 953786 970189
57492I70189K0953K3242K6010L0703L5283L8683M3211N0296N7872O4406P1744
$$ 970189 991142 1014384 1040394 1071097 1106380 1145063 1188274 1238570 1296442 1360848 1432592
57481A432592Q1531R2344J02930J14869J29477J45113J59883J74018J87225J96476
$$ 1432592 1514123 1606467 1709397 1824266 1953743 2098856 2258739 2432757 2619982 2816458
57471B816458J98510J92033J75775J47530J07297N8963P111m5281r4913j37231
$$ 2816458 3014968 3207001 3382776 3530306 3637603 3696566 3703677 3658396 3563483 3426252
57461C426252j69481j92170k06163k11182k08346k00965j91209j78806j64244
$$ 3426252 3256771 3064601 2858438 2647256 2438910 2237945 2046736 1867930 1703686
57452A703686j49915j36701j22923j08222r5142q5196p6785o8657o1912n6845
$$ 1703686 1553771 1417070 1294147 1185925 1090783 1005587 928802 860145 798233 741388
57442G41388n1435m4965l9604l6348l2900k7805k3198k1005j9759j7707j5943
$$ 741388 689953 644988 605384 569036 536136 508331 485133 464128 444369 426662 410719
57431D10719j5747j5774j4484j2793j1935j1112r600q643r112r666r229q781q966
$$ 410719 394972 379198 364714 351921 339986 328874 319274 310631 301519 291853 282624 273843 264877
57418B64877q578p216o652p678q395p487o356o199n897m612l552l317k613j255
$$ 264877 256299 249083 242431 234753 226358 218871 212515 206316 200419 195807 192255 188938 186325 185070
57404A85070j223k830l422j880p65j739k565j309J83p9o83K6N83n05j521o69M61
$$ 185070 183847 181017 177595 175715 174950 173211 170646 169337 169520 169441 168758 168784 169367 168862 167341 166672 167133
57387A67133j11j086n61L10k91j313j068n11j034j326J63J820J398j57n75o1n1
$$ 167133 167022 165936 165375 165685 165394 164081 163013 162502 161468 160142 160305 162125 163523 163366 162791 162730 162679
57370A62679j35O15J175M29l20L91J280N77p90j135j080j720j895l18J462J410
$$ 162679 162544 163159 164334 164763 164443 164834 166114 166691 165901 164766 163686 161966 160071 159753 161215 162625
57354A62625M52M81Q90K61m34L95J643J305O6j01N72O07L25Q54J500J042K70M60
$$ 162625 163077 163558 164448 164709 164275 164670 166313 167618 167684 167583 168155 168762 169087 169941 171441 172483 172753 173213
57336A73213Q25K77k1J227K514J888N58R43K596L330L001K877K655J445N39J790
$$ 173213 174038 174315 174294 175521 178035 179923 180481 181424 184020 187350 190351 193228 195883 197328 197867 199657
57320A99657M158N050M340M044M767N390N570N858O051N853O255P900R300R042
$$ 199657 203815 208865 213205 217249 222016 227406 232976 238834 244885 250738 256993 264893 274193 283235
57306B83235Q422R312J0840J0898R727R253J0009J1351J3396J6152J8076J8166
$$ 283235 291657 300969 311809 322707 332434 341687 351696 363047 376443 392595 410671 428837
57294D28837J8164K0070K2891K4528K5329K6887K8821K9779L0294L1608L2878
$$ 428837 447001 467071 489962 514490 539819 566706 595527 625306 655600 687208 720086
57283G20086L2444L0744K9092K6819K2454J6556J0590M251l326j0972j6864k1225
$$ 720086 752530 783274 812366 839185 861639 878195 888785 893036 889710 878738 861874 840649
57271H40649k5065k7820k8831k9439l0683l0848k8294k4898k3405k3136k1720
$$ 840649 815584 787764 758933 729494 698811 667963 639669 614771 591366 568230 546510
57260E46510j9299j7498j5910j3314j0833j0106r840p941n588n256o057n215l018
$$ 546510 527211 509713 493803 480489 469656 459550 449710 441769 436181 430925 424868 419653 416635
57247D16635k086k577k276q27J03L86J346K586K525J622J677K512K652K430L050
$$ 416635 414549 411972 409696 408869 408972 409358 410704 413290 415815 417437 419114 421626 424278 426708 429758
57232D29758L669K901K061L181M915M482K526J985L024L380K939L614N246N918
$$ 429758 433427 436328 438389 441570 446485 450967 453493 455478 458502 461882 464821 468435 473681 479599
57218D79599N946P276R387R904Q997R013J0096J0340R909J0766J2562J3084J2545
$$ 479599 485545 492821 502208 512112 521109 530122 540218 550558 560467 571233 583795 596879 609424
57205F09424J3143J4583J4424J2816J2427J3618J3992J3028J2747J3622J3910
$$ 609424 622567 637150 651574 664390 676817 690435 704427 717455 730202 743824 757734
57194G57734J3442J3993J5548J6231J6080J6912J8401J8409J7261J7481J9222
$$ 757734 771176 785169 800717 816948 833028 849940 868341 886750 904011 921492 940714
57183I40714K0130J9828K0148K0969K0320J8831J9369K1959K3569K3410K3782
$$ 940714 960844 980672 1000820 1021789 1042109 1060940 1080309 1102268 1125837 1149247 1173029
57172A173029K5289K5921K5510K6348K8550K9505K8783K9006L0908L2117L1875
$$ 1173029 1198318 1224239 1249749 1276097 1304647 1334152 1362935 1391941 1422849 1454966 1486841
57161A486841L2403L4456L5978L6258L7159L9087M0088L9933M0835M3097M4252
$$ 1486841 1519244 1553700 1589678 1625936 1663095 1702182 1742270 1782203 1823038 1866135 1910387
57150A910387M3602M3357M4397M5059M4926M5501M6494M5791M3867M3610M5180
$$ 1910387 1953989 1997346 2041743 2086802 2131728 2177229 2223723 2269514 2313381 2356991 2402171
57139B402171M5662M4501M4391M6167M7655M8338N0142N2910N4249N4537N6710
$$ 2402171 2447833 2492334 2536725 2582892 2630547 2678885 2729027 2781937 2836186 2890723 2947433
57128B947433O0578O2770O3033O4666O7899O9052O7357O6521O8190P0053P1697
$$ 2947433 3008011 3070781 3133814 3198480 3266379 3335431 3402788 3469309 3537499 3607552 3679249
57117C679249P5994Q3186Q9982R6009J04858J17269J29854J42030J57406J77104
$$ 3679249 3755243 3838429 3928411 4024420 4129278 4246547 4376401 4518431 4675837 4852941
57107D852941J98897K24211K58340L02311L52677M10960M85030N79960O96808
$$ 4852941 5051838 5276049 5534389 5836700 6189377 6600337 7085367 7665327 8362135
57098H362135Q42260J029864J269849J567641J933481K381580K917388L536523
$$ 8362135 9204395 10234259 11504108 13071749 15005230 17386810 20304198 23840721
57090B3840721M234835N001905N801943O579258P285586P881948Q315958Q536279
$$ 23840721 28075556 33077461 38879404 45458662 52744248 60626196 68942154 77478433
57082G7478433Q543486Q378754Q018771P317047O120947M460677K580307P65442
$$ 77478433 86021919 94400673 102419444 109736491 115857438 120318115 122898422 123663864
57074A23663864q35472k226601l465261m587823n599265o476876p171433p628965
$$ 123663864 122828392 120601791 117136530 112548707 106949442 100472566 93301133 85672168
57066H5672168p824524p771778p506465p073283o524387n913230n282639m662412
$$ 85672168 77847644 70075866 62569401 55496118 48971731 43058501 37775862 33113450
57058C3113450m075860l540597l063557k642790k275339j959257j689653j458989
$$ 33113450 29037590 25496993 22433436 19790646 17515307 15556050 13866397 12407408
57050A2407408j261641j094116r51536q28123p20794o28781n50187m82114m23405
$$ 12407408 11145767 10051651 9100115 8271992 7551198 6922417 6372230 5890116 5466711
57041E466711l74190l33221k98209k68104k42756k21057k01521j83928j68621
$$ 5466711 5092521 4759300 4461091 4192987 3950231 3729174 3527653 3343725 3175104
57032C175104j55037j42513j31423j22107j13746j05701r8565r2681q7021q0869
$$ 3175104 3020067 2877554 2746131 2624024 2510278 2404577 2306012 2213331 2126310 2045441
57022B045441p5138p0657o6532o1659n6573n2428m9235m6363m3791m1673l9426
$$ 2045441 1970303 1899646 1833114 1771455 1714882 1662454 1613219 1566856 1523065 1481392 1441966
57011A441966l6175l1555k5670j8838j1633m291M035J4790K9124M8099P3088J04791
$$ 1441966 1405791 1374236 1348566 1329728 1318095 1313804 1317839 1332629 1361753 1409852 1482940 1587731
56999A587731J42187J81924K15906K28676K02786J33349L7039n7790j30601j76690
$$ 1587731 1729918 1911842 2127748 2356424 2559210 2692559 2729598 2671808 2541207 2364517
56989B364517j99660k03439j92550j73335j50678j26025j00646p8018o1255n0740
$$ 2364517 2164857 1961418 1768868 1595533 1444855 1318830 1218184 1140166 1078911 1028171
56979A028171m5775m5876m8983n1156m9915m6072m1216l5632k9594k4292k0104
$$ 1028171 982396 936520 887537 836381 786466 740394 699178 663546 633952 609660 589556
56968E89556j6031j1760q254n630k728P00L767O866J1607J7806K3451K8146L3223
$$ 589556 573525 561765 553511 547881 545153 545853 549620 556486 568093 585899 609350 637496 670719
56955F70719L7442L6231K6999J2443l040j7321k9326l7070l9524l8367l5800l2233
$$ 670719 708161 744392 771391 783834 780794 763473 734147 697077 657553 619186 583386 551153
56943E51153k7639k3059j9108j4868r885n425k215J153O021J1834J7974K5481
$$ 551153 523514 500455 481347 466479 456594 451169 448954 450107 456128 467962 485936 511417
56931E11417L5053M4654N0622N0014M1233K4453K922j7799l3538m3636m8993n0004
$$ 511417 546470 591124 641746 691760 732993 757446 760368 742569 709031 665395 616402 566398
56919E66398m7342m2717l7427l1537k5397k0384j7208j5149j3757j3472j3854
$$ 566398 519056 476339 438912 407375 381978 361594 344386 329237 315480 302008 288154
56908B88154j3223j1070q966q116p855p410p152p133o339m501k781j706l17J809
$$ 288154 274931 263861 254895 246779 238924 231514 224362 217229 210890 206389 203608 201902 201585 203394
56894B03394L720N189P594J1757J6868K2466K9310L7304M4734N0451N4458N5431
$$ 203394 207114 212303 219897 231654 248522 270988 300298 337602 382336 432787 487245 542676
56882E42676N0436L8827K4156J0577o72r808j6057j8637j8451j6860j4234j0973
$$ 542676 593112 631939 656095 666672 666000 656192 640135 621498 603047 586187 571953 560980
56870E60980q218o089k964K076P748J2961J9034K7940L9858N3716O8473Q2286
$$ 560980 552762 546673 543709 545785 553533 566494 585528 613468 653326 707042 775515 857801
56858H57801R1514R2000Q0953N7824K5470r152l7987n7065o7469p1279o9126o2219
$$ 857801 949315 1041315 1122268 1180092 1205562 1196410 1158423 1101358 1033889 962610 893484 831265
56846H31265n3373m4295l4276k3020j2228k827O902J8647L1986M6650O4371Q6319
$$ 831265 777892 733597 699321 676301 664073 661246 668148 686795 718781 765431 829802 916121
56834I16121J10597J33624J51302J57175J43123J05973N2423m970n5658r3891
$$ 916121 1026718 1160342 1311644 1468819 1611942 1717915 1770338 1765368 1709710 1615819
56824A615819j17152j25924j24086j16283j04751r0191p4385n9608m6208l3035
$$ 1615819 1498667 1372743 1248657 1132374 1027623 937432 863047 803439 757231 724196
56814G24196j9789p088N354J8927L4651N2613P2219R1713J07587J15007J08970
$$ 724196 704407 697319 702673 721600 756251 808864 881083 972796 1080383 1195390 1304360
56803A304360Q6126M7918K372l9529p0695r0334j00159j01171r4979q5062p4361
$$ 1304360 1390486 1438404 1440776 1401247 1330552 1240218 1140059 1038888 943909 858847 784486
56792G84486o3389n1994m1061l1211k1883j3023n547J082R420K0582L2517M3049
$$ 784486 721097 669103 628042 596831 574948 561925 556378 557460 566880 587462 619979 663028
56780F63028N1921N7974N7146M6040K6065K077k1396m1058n4436o0987o2387o0182
$$ 663028 714949 772923 830069 876109 902174 904251 882855 841797 787361 726374 663987 603805
56768F03805n4676m7042m0013l4915l0375k5517k1748j9670j7247j3257r739q489
$$ 603805 549129 502087 462074 427159 396784 371267 349519 329849 312602 299345 289606 281117
56756B81117p911o070m204m191m910m327l143l184l957l888l348l562l981l558
$$ 281117 273206 267136 262932 258741 253831 249504 246361 243177 239220 235332 231984 228422 224441 220883
56742B20883l112l730m396l763k640k229j756m78O9j268k414j172P29J74k385
$$ 220883 217771 214041 209645 205882 203242 201013 199257 198779 198848 197580 195166 193994 194723 194897 192512
56727A92512l928l542k675j894p82o3o96j613j291n57j000j850j396l15m39j304
$$ 192512 188584 185042 182367 180473 179691 179628 178932 177319 176028 175471 174471 172621 171225 170910 170471 169167
56711A69167j139k81l81j087p84J22j25j310j698j271j563k692l340l217l019
$$ 169167 168028 167747 167366 166279 165495 165617 165492 164182 162484 161213 159650 156958 153618 150401 147382
56696A47382k544j356m52q27j285k37J477K095K025K591L147K503J849K952M558
$$ 147382 144838 143482 143030 142203 140918 140681 142158 144253 146278 148869 152016 154519 156368 159320 163878
56681A63878M104K115J329K197K772K524K760L578L756L466M003N025M967L870
$$ 163878 167982 170097 171426 173623 176395 178919 181679 185257 189013 192479 196482 201507 206474 210344
56667B10344L025K423J364P97K029L825L902K597J948J988J295L58Q09J890J395
$$ 210344 213369 215792 217156 217953 219982 223807 227709 230306 232254 234242 235537 235895 236704 238594 239989
56652B39989l39r14m1L93J05N79J613J336k05r93n82m81r70q68m06r85k149k084
$$ 239989 239650 238736 238695 239088 239193 239772 241385 242721 242516 241523 240941 240460 239490 238622 238216 237231 235082 232998
56634B32998j046q42j136J33K630L722K840K152K478K266J028K88L76k71j918
$$ 232998 231952 231110 229974 230107 232737 236459 239299 241451 243929 246195 247223 247511 247887 247616 245698
56619B45698k889k735l010m268n266n612o304p261p267o585o612o899n695l465
$$ 245698 242809 240074 237064 232796 227530 221918 215614 208353 201086 194501 187889 180990 175295 171830
56605A71830k542l027k612p92L82J91L99J755K728K567K394K590K136J149J065
$$ 171830 169288 166261 163649 162857 163239 163430 163829 165584 168312 170879 173273 175863 177999 179148 180213
56590A80213J745J563O60R12K258K542J388P77J199Q52n90j110m6P49M73O64J923
$$ 180213 181958 183521 184181 185093 187351 189893 191281 192058 193257 194109 193519 192409 192363 193112 193585 194249 196172
56573A96172K701K382K373L112L195K430K583M106N199N094N202O140O645O343
$$ 196172 198873 201255 203628 206740 209935 212365 214948 219054 224253 229347 234549 240689 247334 253677
56559B53677O479P184P074O202O237P056O539M392K818K626K225J085O24P88m47
$$ 253677 260156 267340 274414 280616 286853 293909 300448 304840 307658 310284 312509 313594 314218 315006 314559
56544C14559l152m698m056l283l634l822l264l357m332m412l372l391n018n898
$$ 314559 311407 306709 302653 299370 295736 291914 288650 285293 280961 276549 273177 269786 264768 258870
56530B58870m850l708l768l840l174k893l304l172k646l357m730m123j613m91
$$ 258870 254020 250312 246544 242704 239530 236637 233333 230161 227515 224158 219428 215305 213692 213201
56516B13201j781k638j595r63k125k919j890j029j924l002k820k470k647j913
$$ 213201 211420 208782 207187 206224 204099 201180 199290 198261 196337 193335 190515 188045 185398 183485
56502A83485O2J244J003J441L168L795K458J611K335K197J93p77R93K760K141
$$ 183485 183547 184791 185794 187235 190403 194198 196656 198267 200602 202799 202992 202215 203208 205968 208109
56487B08109R83J396J928R96L03J445K645K170J643K716L734K904J625J540J476
$$ 208109 209092 210488 212416 213412 213715 215160 217805 219975 221618 224334 228068 230972 232597 234137 235613
56472B35613K91l45Q57K047J594J073J881K216N69r99l81R00P48K12R17J719J140
$$ 235613 235904 235559 236416 238463 240057 241130 243011 245227 245796 244797 244416 245316 246064 246276 247193 248912 250052
56455B50052M00R02J453Q91O00J622K305J571J291K562L080J322j79R27K752K800
$$ 250052 250452 251354 252807 253698 254298 255920 258225 259796 261087 263649 266729 268051 267872 268799 271551 274351
56439B74351K201K701K826Q44j489k022k067l503m964m675m115n111o156n373
$$ 274351 276552 279253 282079 282923 281434 279412 277345 273842 268878 264203 260088 254977 248821 243448
56425B43448m238m571m827l203j526k043l174k487j152j347k020j267k77p14q62
$$ 243448 239210 234639 229812 226609 225083 223040 219866 217379 216227 214880 212860 211593 211316 210602 209740
56410B09740J364M073M279K870K514K943K425J645K038K386J082m05j22O22j45
$$ 209740 211104 215177 219456 222326 224840 227783 230208 231853 233891 236277 237359 236954 236832 237454 237309
56395B37309j135m01P64M06j32J081K502J984J106K326M235M057K626K497L253
$$ 237309 236174 235773 236537 236943 236811 237892 240394 242378 243484 245810 250045 254102 256728 259225 262478
56380B62478K965K155K163J789k93k143j621m52j102k230j508k28o70j515n47
$$ 262478 265443 267598 269761 271550 271257 269114 267493 267041 265939 263709 262201 261973 261303 259788 259241
56365B59241P60K3j260m52J225J267Q48K316M357M698M992P739J0912J0966Q841
$$ 259241 260001 260024 258764 258312 259537 260804 261652 263968 268325 273023 278015 285754 296666 307632 316473
56350C16473P583O492L305k05p28M84n9j607r14J355J941J215K081M089M446L697
$$ 316473 324056 330548 333853 333648 332920 333404 333345 331738 330824 332179 334120 335335 337416 341505 345951 349648
56334C49648M593O466O435N077N347O947P289O877Q122R952R265O720N556N741
$$ 349648 354241 360707 367142 372219 377566 384513 391802 398679 406801 416753 426018 432738 438294 444035
56320D44035M794L212L444M526L452R30J06N68p27l414m261k992k132j884n75
$$ 444035 448829 452041 455485 460011 463463 464393 464499 465067 464340 460926 456665 453673 451541 449657 449082
56305D49082P72k67k500k729j291q14q72O69K491J800M1P48L108L585K599L388
$$ 449082 449854 449587 447087 444358 443067 442253 441381 442050 444541 446341 446382 447130 450238 453823 456422 459810
56289D59810N541N985N306O708R668J0965J0992J2802J5800J6819J6467J8024
$$ 459810 465351 471336 476642 483350 493018 503983 514975 527777 543577 560396 576863 594887
56277E94887K0992K2193K2266K4500K8256L0156L0865L3948L9060M3025M6670
$$ 594887 615879 638072 660338 684838 713094 743250 774115 808063 847123 890148 936818
56266I36818N3446O2355O9414P5304Q4206R5918J06567J16298J28562J42493J53790
$$ 936818 990264 1052619 1122033 1197337 1281543 1377461 1484028 1600326 1728888 1871381 2025171
56255B025171J62684J72954J83499J89090J89325J88457J86185J77069J59783
$$ 2025171 2187855 2360809 2544308 2733398 2922723 3111180 3297365 3474434 3634217
56246C634217J38774J16152Q9816O0483L2522O977j8587m2833o1054p3301q4132
$$ 3634217 3772991 3889143 3978959 4039442 4071964 4078941 4060354 4017521 3956467 3883166 3799034
56235C799034r3850r8224r7511r7176r8758r8476r5934r5649r8589j00643j00898
$$ 3799034 3705184 3606960 3509449 3412273 3313515 3215039 3119105 3023456 2924867 2824224 2723326
56224B723326j03093j07478j09591j08711j09057j11153j10424j05951j02104
$$ 2723326 2620233 2512755 2403164 2294453 2185396 2074243 1963819 1857868 1755764
56215A755764r9938r5445q8029q2029p8154p2154o3766n7972n5529n1247m3851
$$ 1755764 1655826 1560381 1472352 1390323 1312169 1240015 1176249 1118277 1062748 1011501 967650
56204I67650l8372l6475l3630k8374k5134k5065k3317j8359j4951j4796j3333
$$ 967650 929278 892803 859173 830799 805665 780600 757283 738924 723973 709177 695844
56193F95844q924o160o728n978k040N80j09J44L212N072M255M992Q436R683P037
$$ 695844 686920 680760 674032 668054 666014 666594 666485 666629 669841 674913 679168 684160 692596 702279 709316
56178G09316N378O827P026M215K905M780N135K097K62J386P57l279n552l883l194
$$ 709316 714694 721521 728547 732762 735667 740447 745582 747679 747941 749327 750084 746805 741253 737370 734176
56163G34176n827p090m719l225m592m160j04K534J528J591M642N936M155N046
$$ 734176 728349 721259 716540 713315 708723 704563 704459 706993 708521 710112 714754 720690 724845 729891
56149G29891J0444J4063J3126J3538J8457K2505K2863K5322L3398M2170M9037
$$ 729891 740335 754398 767524 781062 799519 822024 844887 870209 903607 945777 994814
56138I94814N9961P8536R9132J17240J36161J57053J72731J78193J77154J71941
$$ 994814 1054775 1133311 1232443 1349683 1485844 1642897 1815628 1993821 2170975 2342916
56128B342916J57742J33882J10173R4553Q4144P4869O9086O6641N9494M3268K4389
$$ 2342916 2500658 2634540 2744713 2839266 2923410 2998279 3067365 3134006 3193500 3236768 3261157
56117C261157Q873n583k0027k8425k9088l0903m0551n4271o8899q8865j14439
$$ 3261157 3270030 3264447 3244420 3215995 3186907 3156004 3115453 3061182 2992283 2903418 2788979
56106B788979j35480j45473j50115j53980j51280j38686j24380j14679j04006
$$ 2788979 2653499 2508026 2357911 2203931 2052651 1913965 1789585 1674906 1570900
56097A570900q7837p3009o5126n8126m6818l7380l4798l2399k4661j8098j8314
$$ 1570900 1483063 1410054 1344928 1286802 1239984 1202604 1167806 1135407 1110746 1092648 1074334
56086A074334j8726j3405q562r696j0078l949J567p5k211J802N593K780M4M094
$$ 1074334 1055608 1042203 1033641 1023945 1013867 1009918 1011485 1011410 1009199 1011001 1016594 1019374 1019418 1023512
56072A023512Q334N915L242O966J0396O873L619Q028J3085J0932P931J1502J5212
$$ 1023512 1031846 1037761 1041003 1047969 1058365 1065238 1068857 1076885 1089970 1100902 1108833 1120335 1135547
56059A135547J1984Q818J3053J7352J3991J0424J4768J9614J6640J3188J7607
$$ 1135547 1147531 1156349 1169402 1186754 1200745 1211169 1225937 1245551 1262191 1275379 1292986
56048A292986K2393J9153J5727K0718K5842K1994J7750K2952K9148K6009K1780
$$ 1292986 1315379 1334532 1350259 1370977 1396819 1418813 1436563 1459515 1488663 1514672 1536452
56037A536452K6971L3168K9248K3269K6621L1872K8438K4585L0898L7826L3327
$$ 1536452 1563423 1596591 1625839 1649108 1675729 1707601 1736039 1760624 1791522 1829348 1862675
56026A862675K6998L2284M0772L9211L5726M3117N2432N0122M5229N1902O1267
$$ 1862675 1889673 1921957 1962729 2001940 2037666 2080783 2133215 2183337 2228566 2280468 2341735
56015B341735N9016N4230O1405P0754O6746N9244O4822P4304P1201O5043P2814
$$ 2341735 2400751 2454981 2516386 2587140 2653886 2713130 2777952 2852256 2923457 2988500 3061314
56004C061314Q4765Q3354P8516Q8308J02526J02615R9359J12223J30051J32335
$$ 3061314 3146079 3229433 3307949 3396257 3498783 3601398 3700757 3812980 3943031 4075366
55994D075366J30277J44944J64281J65672J61274J75251J96229K00072J99093
$$ 4075366 4205643 4350587 4514868 4680540 4841814 5017065 5213294 5413366 5612459
55985E612459K18631K46015K55359K60992K90939L30053L48020L60376L99603
$$ 5612459 5831090 6077105 6332464 6593456 6884395 7214448 7562468 7922844 8322447
55976H322447M49895M77028M98274N51946O22917O73854P24063Q16120R31461
$$ 8322447 8772342 9249370 9747644 10299590 10922507 11596361 12320424 13136544 14068005
55967A4068005J026894J127009J285369J483560J673201J888323K202352K606350
$$ 14068005 15094899 16221908 17507277 18990837 20664038 22552361 24754713 27361063
55959B7361063L057608L613920M373622N318902O390758P692236R430667J1703339
$$ 27361063 30418671 34032591 38406213 43725115 50115873 57808109 67238776 78942115
55951G8942115J4590343J8434027K3684189L0346380L7782534M4953974N0317575
$$ 78942115 93532458 111966485 135650674 165997054 203779588 248733562 299051137
55944B99051137N1396671M5393795L1320779J1657822q660944k5200396l6023790
$$ 299051137 350447808 395841603 427162382 438820204 430159260 404958864 368935074
55937C68935074m1360162m2298195m0122527l6202024l1696385k7226297k3004662
$$ 368935074 327574912 285276717 245154190 208952166 177255781 150029484 127024822
55930A27024822j9193604j5950516j3262935j0997842r098503p578801o375549
$$ 127024822 107831218 91880702 78617767 67619925 58521422 50942621 44567072
55923D4567072n367355m512968l837679l309243k848427k439545k119131j872769
$$ 44567072 39199717 34686749 30849070 27539827 24691400 22251855 20132724 18259955
55915A8259955j643651j426638j259811j136232j010719q81840p85971p20289
$$ 18259955 16616304 15189666 13929855 12793623 11782904 10901064 10115093 9394804
55907I394804o47474n67349n12241m79447m35884l82459l49575l35303l09131
$$ 9394804 8747330 8179981 7667740 7188293 6752409 6369950 6020375 5685072 5375941
55898E375941k71283k49811k43878k26047j96660j82059j82204j71660j49758
$$ 5375941 5104658 4854847 4610969 4384922 4188262 4006203 3823999 3652339 3502581
55889C502581j40241j43341j35977j17837j11205j16315j11265r5448r0216r6658
$$ 3502581 3362340 3218999 3083022 2965185 2853980 2737665 2626400 2530952 2440736 2344078
55879B344078r4147q0846p5674p9758p4757n9987n3706n6722n1184l6510l1003
$$ 2344078 2249931 2169085 2093411 2013653 1938896 1878909 1825203 1768481 1717297 1680787 1649784
55868A649784l6563l6247k8107k7695l5435l4721k4413k1013k6324k4416j3029
$$ 1649784 1613221 1576974 1548867 1521172 1485737 1451016 1426603 1405590 1379266 1354850 1341821
55857A341821p230r220m754P307J1250L715j626j673q317k2039k8567k5703k7093
$$ 1341821 1334591 1325371 1320617 1327924 1339174 1342889 1341263 1339590 1331273 1309234 1280667 1254964 1227871
55844A227871l5537l8453l3528l3198l9623m0341l3137l0550l5243l5039k7055
$$ 1227871 1192334 1153881 1120353 1087155 1047532 1007191 974054 943504 908261 873222 846167
55833H46167k3156k6554k6067j8684j5250j8609j8026j0598o842r868r919m612
$$ 846167 823011 796457 770390 751706 736456 717847 699821 689223 682381 672513 662594 657982
55821F57982l895r847j1820o835m754q269p675p11K175k146l621J314L222j475
$$ 657982 654087 644240 632420 625585 620831 612562 604887 604176 606351 604205 600584 601898 605120 603645
55807F03645l874o80n83o555r629o403n253r141r601m034j759o545r791p436p162
$$ 603645 599771 599091 598508 591953 582324 575921 570668 561527 551926 547892 546133 539588 529797 522361 515199
55792E15199j2289j4817j1272r601j3530j5412j1446q899j1401j1868o844l331
$$ 515199 502910 488093 476821 467220 453690 438278 426832 417933 406532 394664 387820 384489
55780C84489m666l916J803M466m15o033p554r869j5551j8386j5544j3421j4985
$$ 384489 379823 375907 377710 382176 381761 375728 368174 358305 342754 324368 308824 295403 280418
55767B80418j4022q133m532o619p626l958k029n282p212m029j812m230n385j721
$$ 280418 266396 258263 253731 247112 239486 235528 233499 228217 221005 216976 215164 210934 205549 203828
55753B03828J002n40n07M182P033M166J654L566M231j99l796k040j18k426m397
$$ 203828 204830 204290 203783 207965 214998 219164 220818 224384 228615 228416 224620 222580 222462 220036 215639
55738B15639k274p08l075m277p37K249N88q68J914M166J597j571j201r73m237
$$ 215639 213365 212657 209582 205305 204568 206817 207405 206537 208451 212617 214214 212643 211442 210469 206232
55723B06232o834n279l671n508o838m321j859k660l010k84J312o79j257K728O192
$$ 206232 199398 194119 190448 184940 178102 173781 171922 169262 166252 165968 167280 166601 165344 168072 174264
55708A74264N255M451P759J1111J0752J0558J3856J6150J3274Q969P225M918q14
$$ 174264 179519 183970 191729 202840 213592 224150 238006 254156 267430 276399 283624 288542 287728
55695B87728n600n545m531o753r124q069o622p830q310n189k450l419m058n98
$$ 287728 282128 276583 272052 265299 256175 248106 241484 233654 225344 220155 217705 214286 210228 209630
55681B09630L168L157K502M820O941N455L673M992N947L000k84N9J027r53k808
$$ 209630 212798 215955 218457 223277 230218 235673 239346 244338 250285 253285 253001 253060 254087 253134 250326
55666B50326j107P96q31k831j415M86o57j725Q36L572K216m19j22Q73r89l239
$$ 250326 249219 250015 249184 246353 244938 245424 244767 243042 243878 247450 249666 249247 249125 249998 249009 245770
55650B45770k595j944m745p855p338o089q218j1037j0255q098q669j0039q511
$$ 245770 243175 241231 236486 228631 221293 215204 206986 195949 185694 177596 168927 158888 150377
55637A50377o110o382p271n491l475m593o061m023j252k238m803m248j915k028
$$ 150377 144267 137885 130614 125123 121648 117055 110994 106971 105719 103481 98678 94430 92515 90487
55623I0487l699l407k009k202k510n45J232k06k151q17J530Q04j392j378n48j903
$$ 90487 86788 83381 81372 79170 76660 76115 77347 77141 74990 74173 75703 76507 75115 73737 73189 71286
55607G1286l330j566Q13l20k853k358l05q90k858k075M42O22r60o77J033J023
$$ 71286 67956 66390 67203 66883 64030 61672 61367 60477 57619 55544 55986 56608 55648 54971 56004 57027
55591E7027k12o3N24p30j984l36K158J798J1M78K175J655k70n94k69j926l855
$$ 57027 56815 56752 57276 56546 54562 54226 56384 58182 58193 58671 60846 62501 62231 61637 61368 59442 55587
55574E5587k671K67J261O98J108J550N7j107R87L805L213O78L03J449R88LJ370
$$ 55587 52916 53183 54444 55142 56250 57800 57857 56750 57737 61542 64755 65433 65736 67185 68173 68176 69546
55557F9546L301K306P5M41J966P38j867j671K52l92k831k683j58O31n34k83J206
$$ 69546 72847 75153 75228 75669 77635 78373 76506 74835 75087 74695 71864 69181 69023 69654 69120 68837 70043
55540G0043O18j740k463j686k401l921k704R34L380M294O218Q449P862N155L962
$$ 70043 70661 68921 66458 64772 62371 58450 55746 56680 60060 64354 70572 79021 86883 92038 96000
55525I6000M263K999M95j28P00l77l108m019k910k849m099m134l242m031n816
$$ 96000 100263 103262 103757 103629 104329 103952 100844 96825 93915 91066 86967 82833 79591 75560 69744
55510F9744n559l826l853n182m452j919r86j698r89R12P18j396j809m1P36j91
$$ 69744 64185 60359 56506 51324 46872 44953 43967 42269 41280 42192 42910 41514 39705 39664 40400 40209
55494D0209m07K16n59k089j476N20J61k598m074l456l517m608m016j609k13k0
$$ 40209 39802 40018 39459 37370 35894 36414 36575 33977 29903 26447 22930 18322 14306 12697 12484 12464
55478A2464J611M493N478M289L767M160K878J56r35l25j006k951k955q06K73k52
$$ 12464 14075 18568 24046 28335 32102 36262 39140 39296 38361 38036 37030 34079 31124 30318 30591 30339
55462C0339L00J876J361j244k400j464j457k734k194K75R15j090k054m87O69J9
$$ 30339 30639 32515 33876 32632 30232 28768 27311 24577 22383 22658 23573 22483 20429 19942 20611 20630
55446B0630m7J268J331n56j448k54L62o87r81L45P84n51j176j22L92l47k02J038
$$ 20630 20583 21851 23182 22626 21178 20924 21286 20599 19618 19963 20747 20196 19020 18898 19290 18943 18741 19779
55428A9779P04j382j892N5J128j65r76L79J457N26n66m45n68j457j067J033K256
$$ 19779 20483 19101 17209 17264 18392 18227 17251 17630 19087 19613 19047 18602 18034 16577 15510 16543 18799
55411A8799J589J211J899J391q64k016q10K42l62o71M52J013rn90K73N97n87j315
$$ 18799 20388 21599 23498 24889 24025 22009 21199 21441 21079 20408 20860 21873 21864 21274 21547 22144 21557 20242
55393B0242o18k98j093j152N7M63m46m75P64O68j382k428j137p9q92j600o92L69
$$ 20242 19624 19326 18233 17081 17138 17601 17155 16680 17444 18112 16730 14302 13165 13086 12194 10594 9902 10271
55375A0271N08Q07J269K47j538j045J491K058l92j907k66J640J540J449K769L059
$$ 10271 10779 11586 12855 13102 11564 10519 12010 14068 13676 11769 11503 13143 14683 16132 18901 21960
55359B1960R08p98P3J206M12m77L17Q74n01j762j021j14q80j580m74O76L3q20
$$ 21960 22868 22070 22143 23349 23761 23284 23601 24475 23974 22212 21191 21077 20197 18617 18143 18819 18852 18032
55341A8032p0R72Q27P70J735J767k92k008j379k88q35j624r08j09q24j451k36
$$ 18032 17962 18934 19761 20531 22266 24033 23741 21733 20354 20066 19231 17607 16699 16590 15766 14315 14079
55324A4079J304J180M06N54P78J33nJ189J716K76r69j43R70L11p79m76L6p30j327
$$ 14079 15383 16563 16969 17523 18301 18434 18429 19618 21334 21610 20641 20498 21468 21779 21000 20524 20560 19830 18503
55305A8503k30Q91J56r77m85N24K31l50L34J063J95r43l83R84J358J315K061K587
$$ 18503 18273 19164 19320 18343 17858 18382 18613 18263 18597 19660 19855 18912 18529 19513 20871 22186 24247 26834
55287B6834J698P21J178J832J035j42j1O11K20n02m92p21k037k803j588n0k40
$$ 26834 28532 29253 30431 32263 33298 33156 33145 33756 33976 33474 32982 32261 30224 27421 25833 25783 25543
55270B5543j206j121n80r16j331o99j24r00j839j393m78m86n87L29J236J108J206
$$ 25543 24337 23216 22636 21720 20389 19690 19566 18666 16827 15434 14956 14470 13883 14212 15448 16556 17762
55253A7762K562L485K333N42P3K58j01L5J570K625J453l32n33j20r84k174j811
$$ 17762 20324 23809 26142 26684 26757 27015 26914 26949 28519 31144 32597 32265 31732 31612 30628 28454 26643
55236B6643o95o19r22K0J491J772J220J124J128N15K11Q64R40n74j775r18L95
$$ 26643 25948 25329 24407 24427 25918 27690 28910 30034 31162 31677 31888 32752 33692 33118 31343 30425 30820
55219C0820P5q50n05K90L0l13N60J231J52j021k78Q31j11j879j766k95J36l47
$$ 30820 30895 30045 29540 29830 29860 29547 30107 31338 31490 30469 30191 31022 30911 29032 27266 26971 27107 26760
55201B6760m6N90O9p17m0J103O77m91k93N80J3j332j144K72O96O0J16Q68R07M85
$$ 26760 26714 27304 27373 26656 26616 27719 28396 27905 27612 28192 28205 26873 25729 26001 26697 26757 26873 27741 28648 29133
55181B9133P71R74l39j947j521M01J338R68Q63J094M83n26o51n17j384k143j017
$$ 29133 29904 30878 30539 28592 27071 27472 28810 29778 30641 31735 32218 31692 31041 30524 29140 26997 25980
55164B5980Q61J055k9k13K99k94j425r66N64P09m34m50Q37J066k95j146o14j58
$$ 25980 26841 27896 27867 27654 27953 27659 26234 25268 25832 26541 26107 25657 26494 27560 27265 26119 25505 25347
55146B5347l61NJ141J570Q27J54L9l30r86r97m65l99o41j73P47J021R10J473K318
$$ 25347 24986 24991 26132 27702 28529 28683 28722 28392 27406 26409 25944 25545 24904 24731 25478 26499 27409 28882 31200
55127C1200K235J531J430J805J780J750K370K557J055r33j392p57p35j053l09
$$ 31200 33435 34966 36396 38201 39981 41731 44101 46658 47713 46780 45388 44631 43896 42843 42534
55112D2534R50J030J62k29l27j029j417k23J249J004o4J40R04J41j290q69Q73
$$ 42534 43484 44514 44676 44447 44120 43091 41674 41451 42700 43704 43640 43780 44684 44825 43535 42666 43539
55095D3539J076m25j075k85j0o51m86O17Q64J84L93J463J400K08J56J590K193
$$ 43539 44615 44190 43115 42830 42820 42169 41683 42300 43164 43348 43741 45204 46604 46812 46968 48558 50751
55078E0751J129L16P71J101M77q9k13q48j829j687n04j7m57k25Q92J292P80J048
$$ 50751 51880 52196 52967 54068 54545 54456 54243 53395 51566 49879 49375 49358 48901 48676 49568 50860 51640 52688
55060E2688K345K825J852J034J189J206N56K19M23J71n05m13L01K44m20r0J165
$$ 52688 55033 57858 59710 60744 61933 63139 63695 63914 64337 64508 64003 63590 63891 64135 63715 63625 64790
55043F4790J515O53K30O70O41k2P6R74J102L47K89J041Q95l82j062o49m39n41
$$ 64790 66305 66958 67188 67858 68499 68477 68553 69527 70629 70976 71265 72306 73201 72819 71757 71108 70669 70128
55025G0128L94J981K085O24o0P54J153L86R1Q07P75o09j518j192j367k844l816
$$ 70128 70522 72503 74588 75212 75152 75906 77059 77445 77536 78343 79118 78509 76991 75799 74432 71588 67772
55008F7772l138k205k223k310j818j706k243k068p67J90K43O96J798J832L84m75
$$ 67772 64634 62429 60206 57896 56078 54372 52129 50061 49294 49484 49727 50423 52221 54053 54437 53962
54992E3962L52J190P26J37N19Q76L02k77j11M8j02M93J833K133Q94J21J043K082
$$ 53962 54314 55504 56230 56367 56886 57762 58064 57787 57676 57724 57622 58115 59948 62081 62975 63096 64139 66221
54974F6221J700Q80J062J854K392K941L689L848L294L177L905M437M553N576P894
$$ 66221 67921 68801 69863 71717 74109 77050 80739 84587 87881 91058 94963 99400 103953 109529 117423
54959A17423J0097J1529J3334J5904J7775J8059J7669J6981J4785J0608N752R99
$$ 117423 127520 139049 152383 168287 186062 204121 221790 238771 253556 264164 269916 270915
54947B70915m186r374j2809j4295j5660j7302j7249j4884j2483j1552j0691q711
$$ 270915 266729 257355 244546 230251 214591 197289 180040 165156 152673 141121 130430 121719
54935A21719o836o012m966k953j718k521l728l434k256j528r46J2N95N27J153
$$ 121719 114883 108871 103905 100952 99234 96713 92985 89551 87295 85767 84821 84833 85428 85955 87108
54920H7108L099M921N653O464Q170R569R932J0717J2881J4876J5136J4334J3282
$$ 87108 90207 95128 100781 107245 115415 124984 134916 145633 158514 173390 188526 202860 216142
54907B16142J0989O711J743k676p001j1278j3880j4210j4118j4756j4521j2205
$$ 216142 227131 233842 235585 232909 225908 214630 200750 186540 172422 157666 143145 130940
54895A30940r584q553q157o876n467n087m787l387j830j252p93M20J162L88m77
$$ 130940 121356 112803 104646 97770 92303 87216 82429 79042 77212 75960 75167 75587 76749 77137 76660
54880G6660PO95J69n21L3P16l0j204j130n55j095k169k237j632j424j050K12R39
$$ 76660 76667 77362 77531 77010 77043 77759 77729 76525 75395 74840 73745 71576 69339 67707 66283 65233 65445 66384
54862F6384m18k479k792j591r51j290j448j278j533j906j613j147j275j228j21
$$ 66384 65966 63487 60695 59104 58153 56863 55415 54137 52604 50698 49085 47938 46663 45435 45314
54847D5314Q77J95j316j581n66L0k80m20J66R83J613J861J366M31K34J027J439
$$ 45314 46191 46386 45070 43489 42923 42953 42673 42253 42419 43402 45015 46876 48242 48673 48907 49934 51373
54830E1373P74L01Q32R86k33j223l69J074J112K96K86P82O32N31J758L458L886
$$ 51373 52147 52448 53280 54266 54033 52810 52441 53515 54627 54923 55209 55991 56623 57154 58912 62370 66256
54813F6256L419L658M542M936N036N712O447O446O798Q874J1519J2596J2507J3444
$$ 66256 69675 73333 77875 82811 87847 93559 100006 106452 113250 122124 133643 146239 158746 172190
54799A72190J5677J7225J6786J4575J0778N622N26l054n623q494j1302j2709j2733
$$ 172190 187867 205092 221878 236453 247231 252853 253379 250325 244702 236208 224906 212197 199464
54786A99464j2293j1319r504p976p836p911o388l895k510k456k328j902k122k783
$$ 199464 187171 175852 166348 158372 150536 142625 136237 132342 129832 127376 125048 123146 121024 118241
54772A18241k766k238k199k252j174P83K370L611N280O787P056P007Q536J1381
$$ 118241 115475 113237 111038 108786 107612 108395 110765 114376 119656 126443 133499 140506 149042 160423
54758A60423J3529J4422J5151J5790J5086J2876J0310P615L929n36m333o880q786
$$ 160423 173952 188374 203525 219315 234401 247277 257587 265202 269131 268595 264262 257382 248596
54745B48596j0105j0274r682r341r155q362p411p450q209q361p781p432p376o842
$$ 248596 238491 228217 218535 209194 200039 191677 184266 176816 168607 160246 152465 145033 137657 130815
54731A30815n991n620n462m690l728l517l482k361o29N5m88j045j280j774k169
$$ 130815 124824 119204 113742 109052 105324 101807 98325 95964 95335 95390 94902 93857 92577 90803 88634
54716H8634j642q12r31j465r25K85L77o15q84o6K74l80o18K36J041R78O80N83
$$ 88634 86992 86180 85249 83784 82859 83144 83521 82906 82022 81956 82230 81850 81232 81468 82509 83487 84167 84750
54698H4750J13q70j433j049k98K26N08O35Q57J742L013L030J053r24p03P77R62
$$ 84750 84863 83993 82560 81511 81213 81439 81947 82582 83439 85181 88194 91224 92277 91353 90650 91427 92389
54681I2389k12n65M38J053N37J21M13M80N8J84J065J587J492J844K828L308L002
$$ 92389 92177 91612 92050 93103 93640 93761 94174 94654 94712 94896 95961 97548 99040 100884 103712 107020 110022
54664A10022L037L671L693K699K003K467L291L614L714L899L770L176K557J983
$$ 110022 113059 116730 120423 123122 125125 127592 130883 134497 138211 142110 145880 149056 151613 153596
54650A53596J147M58O79J439J631J214J074J250J068Q76J656L011L594L553M445
$$ 153596 154743 155201 155880 157319 158950 160164 161238 162488 163556 164432 166088 169099 172693 176246 180691
54635A80691O455P809P358N837M166K225j60k611m987p387r287r989r847r668
$$ 180691 187146 194955 202313 208150 212316 214541 214381 211770 206783 199396 190109 180120 170273 160605
54621A60605r190p799o236n763n989n445m008k736j790n94L56J89k67N19K003
$$ 160605 151415 143616 137380 131617 125628 120183 116175 113439 111649 111055 111411 111600 111333 111852 113855
54606A13855K302J447J189J752J587M29k51n0j37o73n01K18j03j506k205j746
$$ 113855 116157 117604 118793 120545 122132 122561 122310 122260 122123 121450 120949 121167 121064 119558 117353 115607
54590A15607j650k334k313j294j115k547l892l880l407l218k501r95r8n05r99
$$ 115607 113957 111623 109310 108016 106901 104354 100462 96582 93175 89957 87456 86461 86363 85858 84859
54575H4859p97r13j915k577k026j260j216j247p70m68p42q12l99m45j170j320
$$ 84859 84062 83149 81234 78657 76631 75371 74155 72908 72138 71670 70928 70116 69717 69272 68102 66782
54559F6782l82L60K3n34n16m52o57m06M16P42K68N9L65M8r88j042N12J906J752
$$ 66782 66400 66760 66783 66249 65733 65281 64624 64218 64634 65376 65644 65703 66068 66116 65128 64086 64598 66504 68256
54540F8256R94Q17P42K39J56R93J650J304Q85J283J885K111K626L690M195L642
$$ 68256 69250 70067 70809 71048 71204 72197 73847 75151 76036 77319 79204 81315 83941 87631 91826 95468
54524I5468L268L888M393L708K475J467J39j842l481m124m542n083m680l060j927
$$ 95468 98736 102624 107017 110725 113200 114667 114806 112964 109483 105359 100817 95734 91054 87994 86067
54509H6067k394l183k912k253k186j940o20Q09R76J91n24j070j419q03P79J728
$$ 86067 83673 80490 77578 75325 73139 71199 70579 71388 72364 72555 72031 70961 69542 68739 69518 71246
54493G1246J134K95M28O55j1m90N57K293L100L049L070K901J964J036J113J526
$$ 71246 72380 72675 73103 73758 73747 73257 73814 76107 79207 82256 85326 88227 90191 91227 92340 93866
54477I3866J168N89J042K191K587J826O90k47q02o99j72k52j373k495k657k361
$$ 93866 95034 95623 96665 98856 101443 103269 103959 103712 102910 102211 102039 101787 100414 97919 95262 92901
54461I2901k404k475k033j410j000n44j46o41j927k492j716j019j493k092j601
$$ 92901 90497 88022 85989 84579 83579 83035 82889 82248 80321 77829 76113 75094 73601 71509 69908
54446F9908o90m14l33J91L59n92j658j591r05p14q71q01q95j476j697j037m43
$$ 69908 69218 68804 68471 68662 69021 68429 66771 65180 64275 63561 62690 61889 60994 59518 57821 56784 56341
54429E6341m89q7J264J852M46j140o33J044J356J64n51j41K53K14N63J450K023
$$ 56341 55852 55765 57029 58881 59327 58187 57554 58598 59954 60118 59567 59426 59679 59893 60456 61906 63929
54412F3929J962J693J365J040J304K294K802J947Q88J216K453K886K187J367Q74
$$ 63929 65891 67584 68949 69989 71293 73587 76389 78336 79224 80440 82893 85779 87966 89333 90207
54397I0207N26P49J994L436L887L596L567L744L394K730K515K538K043J160M64
$$ 90207 90733 91482 93476 96912 100799 104395 107962 111706 115100 117830 120345 122883 124926 126086 126550
54382A26550l15j715l246m043m218m294l988k974j950j626j464p72k06o95j776
$$ 126550 126235 124520 121274 117231 113013 108719 104731 101757 99807 98181 96717 95945 95739 95044 93268
54367I3268k424k623k732k337j263n35p81q85P0P59l44k158k373q38O27J128J232
$$ 93268 90844 88221 85489 83152 81889 81354 80573 79688 79758 80517 80173 78015 75642 74804 75431 76559 77791
54350G7791J197P18J30L0J30M4M40J814K976K667J800K033K986L062K352K363
$$ 77791 78988 79706 79836 79866 79996 80040 80480 82294 85270 87937 89737 91770 94756 97818 100170 102533
54334A02533L285L750L168K244J320Q9j184j891k278k863l169k575j899k258l025
$$ 102533 105818 109568 112736 114980 116300 116389 115205 113314 111036 108173 105004 102429 100530 98272 95247
54319I5247k754j668j225j710k193k492l164l853l600k610j977j878j676j409
$$ 95247 92493 90825 89600 87890 85697 83205 80041 76188 72588 69978 68001 66123 64447 63038
54305F3038j531j615j019l34m56q37n10m5n16j256q22L70O32j47n09k5L58K70
$$ 63038 61507 59892 58873 58539 58083 57246 56736 56691 56175 54919 54097 54467 55099 54952 54443 54418 54776 55046
54287E5046K24J37m47r09l29O64P25J23J03N28L01k87m0O62L43q34j219m95J62
$$ 55046 55270 55407 54960 54051 53722 54386 55111 55234 55337 55865 56166 55879 55839 56501 56844 56010 54791 54296 54458
54268E4458N85J751L288L414J746n9q28r29o77J45R70Q10J83N50J688J839O28
$$ 54458 55043 56794 60082 63496 65242 65183 64355 63426 62749 62894 63864 64674 64857 65407 67095 68934 69562
54251F9562m40n93o48r17o36R0L3r05j294n96O8O2R4L54q3j324k045j482m52K04
$$ 69562 69122 68529 67881 66964 66328 66418 66451 65546 64252 63656 63724 63786 63880 64234 64151 62827 60782 59300 58848 59052
54231E9052N71O85K69k70j80J85p8n45j04P36L59j070j620p01K68N33Q26J216
$$ 59052 59623 60308 60577 60307 60127 60312 60234 59689 59585 60321 60680 59610 57990 57289 57557 58090 58916 60132
54213F0132O92m75n35Q01J611Q52j73l37l24o93n33P01J925K143J701J067J30
$$ 60132 60824 60349 59814 60615 62226 63078 62905 62568 62244 61551 61018 61719 63644 65787 67488 68555 68685
54196F8685o15j90Q46O61q40j512m11O90L54l49q0M84K73k55l80o27j446j970
$$ 68685 68070 67880 68726 69387 68547 67035 66624 67314 67668 67319 67239 67723 67996 67741 67361 66734 65288 63318
54178F3318j505q51q14q83n48m48r50j115l42M74N87O58J173J149j16j474j558
$$ 63318 61813 60962 60148 59265 58717 58269 57319 56204 55862 56336 56923 57581 58754 59903 59787 58313 56755
54161E6755p46j40J59M75M46j96p06m18J91N14P64J039O69m44j092m47O09R07
$$ 56755 56009 55869 56028 56503 56949 56753 56047 55629 55820 56334 57098 58137 58806 58362 57270 56823 57432 58339
54143E8339N78K99M8l27l83O5L62J12j67j89m85j146j249m48K13p6o67p19n04
$$ 58339 58917 59216 59264 58937 58554 58619 58981 59093 58926 58737 58252 57106 55857 55409 55622 55546 54879 54160 53656
54124E3656n62p09o95p07o14J01J106J319P18N00Q90O13p17j617j090j39J65L14
$$ 53656 53094 52385 51690 50983 50369 50470 51576 52895 53613 54113 55003 55616 54899 53282 52192 52053 52218 52532
54106E2532Q67J131O43L04O23N23o77j700j317m00l61q43o23L00J086J491J541
$$ 52532 53399 54530 55173 55477 56100 56623 55946 54246 52929 52529 52168 51325 50702 51002 52088 53579 55120
54089E5120Q22o03j599j470r90q90o49P1L20m71j085l62Q60J185Q04O48O38K93
$$ 55120 55942 55339 53740 52270 51280 50390 49741 49812 50132 49661 48576 48214 49074 50259 51063 51711 52349 52642
54071E2642N5L32L18o83j721j518m55K41M23P00J052J155J296J668J634Q83L74
$$ 52642 52697 53029 53347 52664 50943 49425 48970 49211 49634 50334 51386 52541 53837 55505 57139 58022 58396
54054E8396Q88J703J866J690J716J448N59Q6Q38J727J345K02k27K43P97J242J809
$$ 58396 59284 60987 62853 64543 66259 67707 68266 68352 69190 70917 72262 72464 72237 72480 73277 74519 76328
54037G6328K133J976K147L247M382M487M016L854L698L048K764L773N175N406
$$ 76328 78461 80437 82584 85831 90213 94700 98716 102570 106268 109316 112080 115853 121028 126434
54023A26434M534L765L374K850K326K218K130J627J334J767J952R50k45j70O52
$$ 126434 130968 134733 138107 140957 143283 145501 147631 149258 150592 152359 154311 155261 155016 154846 155498
54008A55498O76l6k52k0n24j747k397k066j648j632j638j603j843k018j431k96
$$ 155498 156174 156138 155886 155866 155342 153595 151198 149132 147484 145852 144214 142611 140768 138750 137319 137023
53992A37023N42R61J372J627J343R13R19R82M62k78o25j010k006k843k481j527
$$ 137023 137565 138526 139898 141525 142868 143781 144700 145682 146144 145866 145241 144231 142225 139382 136901 135374
53976A35374j353j919k209k308l044l962l612j881k46L02J8o99j614j942j084
$$ 135374 134021 132102 129893 127585 124541 120579 116967 115086 114840 115142 115160 114461 112847 110905 109821
53961A09821J0k04j524k156j247K27J180J620J907K148K451K767K534J491N84
$$ 109821 109831 109627 108103 105947 104700 104927 106107 107727 109634 111782 114233 117000 119534 121025 121609
53946A21609R01K016K676K805L367M598N719O387O992P684Q281R029J0191J1100
$$ 121609 122510 124526 127202 130007 133374 137972 143691 150078 157070 164754 173035 182064 192255 203355
53932B03355J0811R429P639N444K675J73j065j555k529l872m518m512m873n524
$$ 203355 214166 223595 231234 236678 239353 239526 238461 236906 234377 230505 225987 221475 216602 211078
53918B11078n266l856k410j567q24O5O45R05J521K590L407L689L873M069L914
$$ 211078 205812 201956 199546 197979 197155 197220 197865 198770 200291 202881 206288 209977 213850 217919 221833
53903B21833L520L395L421K974J987Q93k89j597k287j674n32k25p43j066j138
$$ 221833 225353 228748 232169 235143 237130 238023 237734 236137 233850 232176 231644 231419 230676 229610 228472
53888B28472j778k874l443l458l880m752n077m764m873n592n754m843l849l499
$$ 228472 226694 223820 220377 216919 213039 208287 203210 198446 193573 187981 182227 177384 173535 170036
53874A70036l176k345j715k088l062l681l600l112k653k606l068l610l799l784
$$ 170036 166860 164515 162800 160712 157650 153969 150369 147257 144604 141998 138930 135320 131521 127737
53860A27737l807l487k501j552j593k401k967k994k900k708k235j958k343k643
$$ 127737 123930 120443 117942 116390 114797 112396 109429 106435 103535 100827 98592 96634 94291 91648
53846I1648j798k54O31O03M69K96n59j729j946j060k81k25k66J8K15J45J55K19
$$ 91648 89850 89596 90227 90830 91299 91595 91036 89307 87361 86301 86020 85795 85529 85547 85762 85907 86062 86281
53828H6281oj42M45J236J059Jp41q86j251j924j927j018j39K17N41R80R90O37
$$ 86281 86275 86133 86578 87814 88873 88874 88133 87247 85996 84072 82145 81127 80988 81205 81746 82726 83716 84353
53810H4353O40R58P93K30K84J081J628J655J919K531K661K336K643L710M280L875
$$ 84353 84993 85951 86744 86974 87258 88339 89967 91622 93541 96072 98733 101069 103712 107422 111702 115577
53794A15577L599M091M433L886L146K942K843K321J767J627J632J543J553J503
$$ 115577 119176 123267 127700 131586 134732 137674 140517 142838 144605 146232 147864 149407 150960 152463
53780A52463R05R8J25R94J447Q56k7n98j166j826k075k065k663l783m163l366
$$ 152463 153368 153466 153591 154585 156032 156888 156861 156263 155097 153271 151196 149131 146468 142685 138522 135156
53764A35156k414j949j422p43q36j801k231j382m10l94o63k12O14R75Q89P07L61
$$ 135156 132742 130793 129371 128628 127792 125991 123760 122378 121968 121574 120911 120699 121313 122288 123177 123884 124245
53747A24245j2J75P68O79l83j218r56k25J53K08j33j410l139l618k362j146j376
$$ 124245 124233 124408 125176 125855 125472 124254 123298 123073 123226 123434 123301 121891 118752 115134 112772 111626 110250
53730A10250j986j401j18L17j51l38J92Q21J105J043O91M24R71K308L334L408
$$ 110250 108264 106863 106745 107062 106911 106573 106765 107586 108691 109734 110425 110849 111820 114128 117462 120870
53714A20870L274L564L539K448J101P81J291J433Q55K70J66L46M22L4r93k171
$$ 120870 124144 127708 131247 133695 134796 135577 136868 138301 139156 139426 139592 139938 140360 140394 139401 137230
53698A37230k570j977j179p00j41P55J442J540J464J430R34q4o47j66O09R27J215
$$ 137230 134660 132683 131504 130804 130663 131418 132860 134400 135864 137294 138228 138144 137497 137331 137940 138867 140082
53681A40082K018K765K676J957J224N39q4j12N87J141R20N14O12Q26N77L11P46
$$ 140082 142100 144865 147541 149498 150722 151261 151177 151065 151652 152793 153713 154227 154839 155665 156242 156553 157299
53664A57299J609K113K094J911J779J818K119K258J518J22p91p87o10o37k65N48
$$ 157299 158908 161021 163115 165026 166805 168623 170742 173000 174518 174640 173849 173062 172452 171815 171550 172098
53648A72098O78k27q13j57N87Kj396k219k313k314k112j284l53j95p41j375j979
$$ 172098 172776 172549 171736 171579 172166 172168 170772 168553 166240 163926 161814 160530 160177 159982 159241 157866 155887
53631A55887k541k558j848j133q17j93J131K150K032J612J959K522K247J537J471
$$ 155887 153346 150788 148940 147807 146990 146797 147928 150078 152110 153722 155681 158203 160450 161987 163458
53616A63458J853J711J104Q23Q50O42N13J207K364K853K399J723J334J286J763
$$ 163458 165311 167022 168126 168949 169799 170441 170954 172161 174525 177378 179777 181500 182834 184120 185883
53601A85883K753L549L583L336L548M005M067L796L539L155K576K408K938L388
$$ 185883 188636 192185 195768 199104 202652 206657 210724 214520 218059 221214 223790 226198 229136 232524
53587B32524L162K938L390L816L465K984L139L128K017Q48J281K770L205K070
$$ 232524 235686 238624 242014 245830 249295 252279 255418 258546 260563 261411 262692 265462 268667 270737
53573B70737R18Q12J215J471J653J701J270O33M96Q05R24Q96J293J904J924J416
$$ 270737 271655 272467 273682 275153 276806 278507 279777 280410 280906 281711 282635 283531 284824 286728 288652 290068
53557B90068J239J563J745J680J996K831L608M017M171L855K856J934K173L306
$$ 290068 291307 292870 294615 296295 298291 301122 304730 308747 312918 316773 319629 321563 323736 327042
53543C27042L977L690L324L553M019M253M276M020L150J901J125J276J964K674
$$ 327042 331019 334709 338033 341586 345605 349858 354134 358154 361304 363205 364330 365606 367570 370244
53529C70244L247L593L619L486L374L130K756K909M087N625O303N891N288N298
$$ 370244 373491 377084 380703 384189 387563 390693 393449 396358 400445 406070 412373 418264 423552 428850
53515D28850N994P055Q014Q369Q160Q146Q804R604R958J0240J1072J2192J2998
$$ 428850 434844 441899 449913 458282 466442 474588 483392 492996 502954 513194 524266 536458 549456
53502E49456J3653J4631J5702J6439J7197J8455J9660J9936J9544J9459J9869
$$ 549456 563109 577740 593442 609881 627078 645533 665193 685129 704673 724132 744001
53491G44001K0198K0310K0494K0671K0637K0786K1410K1837K1364K0572K0463
$$ 744001 764199 784509 805003 825674 846311 867097 888507 910344 931708 952280 972743
53480I72743K0767K0500J9711J9238J9158J8904J8643J8907J9188J8430J6931
$$ 972743 993510 1014010 1033721 1052959 1072117 1091021 1109664 1128571 1147759 1166189 1183120
53469A183120J6129J6489J7066J7162J6943J6378J5103J3491J2474J1953J0795
$$ 1183120 1199249 1215738 1232804 1249966 1266909 1283287 1298390 1311881 1324355 1336308 1347103
53458A347103Q620O371M737L275J465l77j739k673l678n353q108j1480j4026j4755
$$ 1347103 1355723 1362094 1366831 1370106 1371571 1371194 1369455 1366782 1363104 1357751 1349643 1338163 1324137 1309382
53444A309382j4422j4514j5373j6303j7044j7844j8462j8480j8424j9200k0570
$$ 1309382 1294960 1280446 1265073 1248770 1231726 1213882 1195420 1176940 1158516 1139316 1118746
53433A118746k1444k1448k1063k0494j9733j9397k0000k0670k0043j8252j6497
$$ 1118746 1097302 1075854 1054791 1034297 1014564 995167 975167 954497 934454 916202 899705
53422H99705j4958j2881j0490q953q335p450n913m615l922l124j958j035l96O99
$$ 899705 884747 871866 861376 852423 844088 836638 830725 826110 822188 819064 817106 816071 815675 816374
53408H16374K178L070L328M107N750P156P694Q197R450J1164J3033J5290J7651
$$ 816374 818552 821622 824950 829057 834807 841963 849657 857854 867304 878468 891501 906791 924442
53395I24442J9119J9589K0240K1806K3673K5296K7047K9078L0716L1702L2772
$$ 924442 943561 963150 983390 1005196 1028869 1054165 1081212 1110290 1141006 1172708 1205480
53384A205480L4315L5689L6496L7287L8478L9736M0931M2394M3753M3943M2965
$$ 1205480 1239795 1275484 1311980 1349267 1387745 1427481 1468412 1510806 1554559 1598502 1641467
53373A641467M2145M2052M1708M0609L9849M0202M0548L9474L7229L4882L2676
$$ 1641467 1683612 1725664 1767372 1807981 1847830 1888032 1928580 1968054 2005283 2040165 2072841
53362B072841L0297K7836K5322K2176J8167J4081J0564P115L070j337n721j0362
$$ 2072841 2103138 2130974 2156296 2178472 2196639 2210720 2221284 2228399 2231469 2230132 2224411 2214049
53350B214049j5319j9668k2672k4922k7318k9693l1462l2865l4419l5812l6425
$$ 2214049 2198730 2179062 2156390 2131468 2104150 2074457 2042995 2010130 1975711 1939899 1903474
53339A903474l6536l6965l7771l8187l7666l6351l4790l3598l3120l3026l2625
$$ 1903474 1866938 1829973 1792202 1754015 1716349 1679998 1645208 1611610 1578490 1545464 1512839
53328A512839l1908l1605l2004l2397l2064l1095k9863k8524k7290k6334k5076
$$ 1512839 1480931 1449326 1417322 1384925 1352861 1321766 1291903 1263379 1236089 1209755 1184679
53317A184679k2605j9230j6489j5094j4032j2403j0904j0497j0755j0675j0279
$$ 1184679 1162074 1142844 1126355 1111261 1097229 1084826 1073922 1063425 1052670 1041995 1031716
53306A031716j0176j0190r685q799q159p671o657n082l648k696j834o33Q54K406
$$ 1031716 1021540 1011350 1001665 992866 984707 977036 970379 965297 961649 958953 957119 956486 957340 959746
53292I59746L934N405O760P974R072J0135J1191J2008J2251J2152J2715J4657
$$ 959746 963680 969085 975845 983819 992891 1003026 1014217 1026225 1038476 1050628 1063343 1078000
53280A078000J7414J9845K1597K2993K3947K4100K3822K3840K3893K3020K1201
$$ 1078000 1095414 1115259 1136856 1159849 1183796 1207896 1231718 1255558 1279451 1302471 1323672
53269A323672J9468J8240J6918J5262J3789J2532J0823Q626O700N122L192J166
$$ 1323672 1343140 1361380 1378298 1393560 1407349 1419881 1430704 1439330 1446030 1451152 1454344 1455510
53257A455510K90N04q7k481n278o993q224j0185j2556j4315j5495j6623j7409
$$ 1455510 1455800 1456304 1456217 1453736 1448458 1441465 1433241 1423056 1410500 1396185 1380690 1364067 1346658
53244A346658j7505j7610j8389j9080j8677j7800j7875j8949j9679j9206j7885
$$ 1346658 1329153 1311543 1293154 1274074 1255397 1237597 1219722 1200773 1181094 1161888 1144003
53233A144003j6431j5422j5271j5767j6000j5531j5118j5415j5722j5035j3731
$$ 1144003 1127572 1112150 1096879 1081112 1065112 1049581 1034463 1019048 1003326 988291 974560
53222I74560j2927j2673j2069j0936j0143j0199j0538j0296r212p725o642o495
$$ 974560 961633 948960 936891 925955 915812 905613 895075 884779 875567 867842 861200 854705
53210H54705o855o730n934n415n808o472o654o754p474q481r034r379j0415j2134
$$ 854705 847850 841120 835186 829771 823963 817491 810837 804083 796609 788128 779094 769715 759300 747166
53196G47166j3418j3372j2177j0751j0028j0328j1081j1366j0998j0592j0483
$$ 747166 733748 720376 708199 697448 687420 677092 666011 654645 643647 633055 622572
53185F22572j0409j0481j1340j2822j3661j3239j2561j2618j2846j2391j1779
$$ 622572 612163 601682 590342 577520 563859 550620 538059 525441 512595 500204 488425
53174D88425j1990j2706j2846j2320j1836j1424j0570r465q854q747q502q033
$$ 488425 476435 463729 450883 438563 426727 415303 404733 395268 386414 377667 369165 361132
53162C61132p834p834p321o155n113m891n404o159o666o580n897n089m582m281
$$ 361132 353298 345464 338143 331988 326875 321984 316580 310421 303755 297175 291278 286189 281607 277326
53148B77326l874l308k685k074j748k102k893l184k517j540j032r46q83q00o56
$$ 277326 273452 270144 267459 265385 263637 261535 258642 255458 252941 251401 250369 249423 248540 247740 247084
53133B47084j68N07O32J12n9O95J368P03j059k673l502l762l711l569l676l982
$$ 247084 246916 247423 248055 248167 248108 248803 250171 250874 249815 247142 243640 239878 236167 232598 228922 224940
53117B24940l931l447l294l678l545k243r34j130k544l644l776l480l251l165
$$ 224940 221009 217562 214268 210590 207045 204802 203868 202738 200194 196550 192774 189294 186043 182878
53103A82878l364l817l955l396k642k220j846j300j260k135k925k578j691j461
$$ 182878 179514 175697 171742 168346 165704 163484 161638 160338 159078 156943 154018 151440 149749 148288
53089A48288j658j233l82l15j257k234k742l018k863j725p6P38K75n59j011j236
$$ 148288 146630 145397 145015 144700 143443 141209 138467 135449 132586 130861 130785 131523 131798 131239 130228 128992
53073A28992j460j467j210j005r00n83n1L72N62N15j8j113k134k442k249k028
$$ 128992 127532 126065 124855 123850 122950 122367 122316 122688 123250 123765 123747 122634 120500 118058 115809 113781
53057A13781j590o82O0r9o54n75%K2o69j163j014p35o59m51R3O73R86Q91K38p06
$$ 113781 112191 111509 111569 111470 110816 110241 110241 110263 109594 108431 107417 106682 106023 105572 105665 106338 107324 108215 108453 107747
53037A07747j047l41N38N04j34l00P0J37k91o12o57p12n61J94R93Q59K5l02J56
$$ 107747 106700 106359 106897 107401 107267 106967 107037 107174 106883 106271 105614 104902 104341 104535 105528 106387 106412 106110 106266
53018A06266N01L96O05J543K464K536J775O55k95m33M78J615J855J219O27M23
$$ 106266 106767 107163 107768 109311 111775 114311 116086 116741 116446 116013 116491 118106 119961 121180 121807 122230
53002A22230K35J73Q12J932K505K217J866K005K304K415K447K383K074J951K672
$$ 122230 122465 122638 123450 125382 127887 130104 131970 133975 136279 138694 141141 143524 145598 147549 150221
52987A50221L882M395L846L104K857K827K674K615K766K740K252J395K53r43j404
$$ 150221 154103 158498 162344 165448 168305 171132 173806 176421 179187 181927 184179 185574 185827 184884 183480
52972A83480n96N27L65j155k389k252j457j113j279j498j693j875j745j302j061
$$ 183480 182884 183411 183776 182621 180232 177980 176523 175410 174131 172633 170940 169065 167320 166018 164957
52957A64957j245j279o82J39M37J36j68M7P08J255J240Q93Q27J031P46k57j021
$$ 164957 163712 162433 161751 161890 162327 162463 162295 162342 163050 164305 165545 166438 167265 168296 169042 168785 167764
52940A67764p39l7K6m07m26O8M85Q07J430K030J915J367J318J737J650P61j21
$$ 167764 167025 166988 167014 166607 166181 166249 166734 167541 168971 171001 172916 174283 175601 177338 178988 179749 179628
52923A79628l79k18L7K42J84n7K12J254J954J230r0l09N33Q66J92l50r4L01M30
$$ 179628 179249 179031 179068 179310 179494 179437 179649 180903 182857 184087 183997 183688 184221 185087 185279 184929 184835 185136 185566
52904A85566Q54J785K534K693K546K059Q63n06q62j82K52p7k45L24R09Q34L98
$$ 185566 186420 188205 190739 193432 195978 198037 198900 198394 197532 197350 197602 197525 197280 197604 198513 199347 199745
52887A99745Ll25k30P62J981K021Q63K8K19M72J22q6L28N34n8o52m25J47L59M24
$$ 199745 199748 199423 199193 199955 201936 203957 204820 204848 205067 205539 205661 205575 205903 206437 206379 205727 205302 205449 205808 206232
52867B06232P69J251J805K736L771L946L139K412K309K104J348P17N52O7j141
$$ 206232 207001 208252 210057 212793 216564 220510 223649 226061 228370 230474 231822 232539 233091 233158 232017
52852B32017k165k260j977j909j703j164r85j439j683j391j588k739l595l103
$$ 232017 229852 227592 225615 223706 222003 220839 219854 218415 216732 215341 213753 211014 207419 204316
52838B04316k106j707j365k35Q70O90k68n06N3J85n20j234j394j321j351j380
$$ 204316 202210 200503 199138 198903 199773 200463 200195 199689 199742 199927 199407 198173 196779 195458 194107 192727
52822A92727j286j064p58o89j264k117k167j133j99m21j334j820j613j096n24
$$ 192727 191441 190377 189619 188930 187666 185549 183382 182249 182050 181629 180295 178475 176862 175766 175242
52807A75242k03o48j754k490k245j604j202p85k27k93j356k371k334j783j723
$$ 175242 175039 174391 172637 170147 167902 166298 165096 164311 164084 163791 162435 160064 157730 155947 154224
52792A54224j962j767j390j570k089k098j513j013r60j225j632j886j547p42k68
$$ 154224 152262 150495 149105 147535 145446 143348 141835 140822 139862 138637 137005 135119 133572 132830 132562
52777A32562m08n35m01p12j639k005j058J58L68j06l90p38j641k271j650o18p91
$$ 132562 132154 131619 131218 130506 128867 126862 125804 125962 126330 126224 125834 125096 123455 121184 119534 118916 118125
52760A18125k030k712k237j610j564j672j456j075p61n59p03j369k098k278j991
$$ 118125 116095 113383 111146 109536 107972 106300 104844 103769 103008 102449 101746 100377 98279 96001 94010
52745I4010j672j308p87n62j010j555j400p96n67p32o02J8O29Q85Q50O72O24J083
$$ 94010 92338 91030 90243 89681 88671 87116 85716 84920 84353 83621 83019 83037 83666 84551 85401 86073 86697 87780
52727H7780J814J906J034J55J61O00O13K99K07K36J90N84J755K823K814K168J913
$$ 87780 89594 91500 92534 92689 92850 93450 94063 94362 94569 94805 94995 95579 97334 100157 102971 105139 107052
52710A07052J939J420L70m92j037j573j913j787j726k263k785k419j544j142j184
$$ 107052 108991 110411 110781 110289 109252 107679 105766 103979 102253 99990 97205 94786 93242 92100 90916
52695I0916j056r97j618k424k394j633j075q93p11q04j519j924r83L89L57q99
$$ 90916 89860 88863 87245 84821 82427 80794 79719 78826 78115 77311 75792 73868 72885 73274 73631 72732
52679G2732j438p80n30j459k141j408k05J37q3P4M18J57o24j113r67m70N9M56
$$ 72732 71294 70514 69984 68525 66384 64976 64771 64908 64825 64899 65317 65474 64850 63737 62770 62300 62359 62815
52661F2815N39L05Mj89k46n4M40Q37O14r9o05n62k72r5n9q6r4M7K74K37j01k01
$$ 62815 63354 63659 63663 63474 63228 63174 63614 64451 65065 64966 64361 63799 63527 63432 63373 63287 63193 63240 63514 63751 63650 63449
52639F3449J86M45O1l23K39J582K704L145L058K366R22o96j633j839j842j743
$$ 63449 63635 64080 64141 63818 64057 65639 68343 71488 74546 76912 77834 77138 75505 73666 71824 70081
52623G0081j330r14r12r37l50N32R00Q16R47J190Q31j24r05j156j028m22O41J221
$$ 70081 68751 67837 66925 65988 65638 66170 67070 67886 68833 70023 70854 70730 69825 68669 67641 67219 67860 69081
52605F9081M41r08j240m64J09K9J57P42Q93L35J01Q03J626J725J340R24L10n41
$$ 69081 69522 68614 67374 66910 67019 67048 67205 67947 68840 69175 69276 70079 71705 73430 74770 75694 76004 75463
52587G5463j019p82l33j37K5L75O28O41Q04J354J973K368K627K711K405J863J502
$$ 75463 74444 73662 73329 73192 73217 73592 74220 74861 75665 77019 78992 81360 83987 86698 89103 90966 92468
52570I2468J224N87j72k46M50J080J110Q77O78L59j0M3N23Q72R38J190J714J959
$$ 92468 93692 94279 94107 93861 94311 95391 96501 97378 98056 98415 98405 98448 98971 99843 100781 101971 103685 105644
52552A05644J740J578J743J799J445R67O18L09J83O67J693K577K848K556J777
$$ 105644 107384 108962 110705 112504 113949 114916 115534 115843 116026 116693 118386 120963 123811 126367 128144
52537A28144N88n06r43q89p73k95R93K303K200O55p69j035o78m64k57K91J037
$$ 128144 128732 128226 127283 126394 125621 125326 126319 128622 130822 131477 130708 129673 128995 128531 128274 128565 129602
52520A29602J791K512K769J998N65l94m53j84P2N37R01L73q51j432q00L3J07k70
$$ 129602 131393 133905 136674 138672 139237 138843 138390 138206 138278 138815 139716 140089 139238 137806 137006 137039 137146 136876
52502A36876n33q73j450j676j175n47m79p77q98p72n73l36k31n16r13p85j70K34
$$ 136876 136343 135470 134020 132344 131169 130622 130143 129366 128468 127696 127123 126787 126556 126040 125127 124342 124172 124406
52484A24406K11K52M90M84K70M27Q83R09O13J002K092K450J303k18p32k93L61
$$ 124406 124617 124869 125359 125843 126113 126540 127423 128332 128945 129947 132039 134489 135792 135574 134842 134549 134910
52467A34910R88J460J292N30J07M80Q61N64J86N11J221J602J667J729J532P48
$$ 134910 135898 137358 138650 139180 139287 139767 140628 141192 141378 141889 143110 144712 146379 148108 149640 150388
52451A50388k77r88j268j144n11L35P24N65M32M73K59R0R93K814L752K723R04
$$ 150388 150111 149123 147855 146711 146200 146535 147259 147824 148256 148729 148988 149078 150071 152885 156637 159360 160264
52434A60264l9qK07M99J009J199O23o6o4L96P47J124J692J832J086J04m38r62
$$ 160264 160225 160217 160424 160923 161932 163131 163754 163688 163624 164020 164767 165891 167583 169415 170501 170605 170167 169205
52416A69205j929k625k345j889k412l470l737l152k769k845k639k002j670j877
$$ 169205 167276 164651 162306 160417 158005 154535 150798 147646 144877 142032 139393 137391 135721 133844
52402A33844j954j524j020q20p43o21n80n98m37j30l9k46l97j87K44M60J50m28
$$ 133844 131890 130366 129346 128526 127783 127162 126582 125984 125547 125417 125378 125132 124735 124548 124792 125252 125402 124974
52384A24974n52R6P17K66r88j620r74R4O81R77J389J670J592J507J521J094J53
$$ 124974 124422 124518 125235 125501 124513 122893 121919 122013 122694 123671 125060 126730 128322 129829 131350 132444 132597
52367A32597l41J13O17L60J4N15J386J547J055P85R80J377K146L440M436M213
$$ 132597 132256 132369 132986 133346 133360 133875 135261 136808 137863 138648 139628 141005 143151 146591 151027 155240
52351A55240L188K591K730K890K642K221J839J582J757K468L141L239L020K883
$$ 155240 158428 161019 163749 166639 169281 171502 173341 174923 176680 179148 182289 185528 188548 191431
52337A91431K530J751J260J699K358K145J315R53J154J103P03P09J357K106K753
$$ 191431 193961 195712 196972 198671 201029 203174 204489 205442 206596 207699 208402 209111 210468 212574 215327
52322B15327L586M389M484L849L214K923K654K333K330K677K959L128L558M219
$$ 215327 218913 223302 227786 231635 234849 237772 240426 242759 245089 247766 250725 253853 257411 261630
52308B61630M584M546M639N239O101O786P050O858O565O869Q003R197R556R273
$$ 261630 266214 270760 275399 280638 286739 293525 300575 307433 313998 320867 328870 338067 347623 356896
52294C56896R197R509R640R419R380R862J0553J1058J1367J1617J1911J2385J3075
$$ 356896 366093 375602 385242 394661 404041 413903 424456 435514 446881 458498 470409 482794 495869
52281D95869J3656J3744J3353J2846J2582J2767J3359J3905J3913J3497J3127
$$ 495869 509525 523269 536622 549468 562050 574817 588176 602081 615994 629491 642618
52270F42618J2581J1078Q817P325P577Q629Q902Q023O643N278M230L799L668K822
$$ 642618 655199 666277 675094 682419 689996 698625 707527 715550 722193 727471 731701 735500 739168 741990
52256G41990J054l73o00o69j827l325l513k436j529j211o32L88J009J037J300
$$ 741990 743044 742671 742071 741402 739575 736250 732737 730301 728772 727561 726929 727317 728326 729363 730663
52241G30663K117K877L418M413O002P275P624P570P856Q522R245R844J0218J0427
$$ 730663 732780 735657 739075 743488 749490 756765 764389 771959 779815 788337 797582 807426 817644 828071
52227H28071J0866J1729J2431J2261J1458J0795J0322R476Q325P578P388P165
$$ 828071 838937 850666 863097 875358 886816 897611 907933 917409 925734 933312 940700 947865
52215I47865O605N949N236M204L024K188J596O53o84j829k534l064l503l685l900
$$ 947865 954470 960419 965655 969859 972883 975071 976667 977320 976636 974807 972273 969209 965706 962021 958121
52200I58121m686n897o761o893o497n748m799m232m517n119n107m510m099l974
$$ 958121 953435 947538 940777 933884 927387 921639 916840 912608 908091 902972 897865 893355 889256 885282
52186H85282l479k514j815j819k180k563k976l288l250l017k870k574j880j364
$$ 885282 881803 879289 877474 875655 873475 870912 867936 864648 861398 858381 855511 852937 851057 849693
52172H49693j726k515k694k294k198k457k284j695j698k587l448l667l640l689
$$ 849693 847967 845452 842758 840464 838266 835809 833525 831830 830132 827545 824097 820430 816790 813101
52158H13101l486k999k808l022k982k459k072k089j878j054k01O3j32n14j189
$$ 813101 809615 806616 803808 800786 797804 795345 793273 791184 789306 788252 788051 788114 787982 787468 786279
52143G86279k102k775k991l054l117l029l039l747n050o004o089n818n823o005
$$ 786279 784177 781402 778411 775357 772240 769211 766172 762425 757375 751371 745282 739464 733641 727636
52129G27636n981n612m921m053l435l354l460l291l122l413l799l644l250l272
$$ 727636 721655 716043 711122 707069 703634 700280 696820 693529 690407 686994 683195 679551 676301 673029
52115F73029l287k423j155p92j161p09Q88K105K118J995K597L125K867K718L664
$$ 673029 669742 667319 666164 665372 664211 663502 664390 666495 668613 670608 673205 676330 679197 681915 685579
52100F85579N082N873O260P152Q596J0020J1289J2431J3031J2921J2871J3721
$$ 685579 690661 696534 702794 709946 718542 728562 739851 752282 765313 778234 791105 804826
52088H04826J5328J6969J8179J8590J7880J6569J5994J6536J6868J5948J4736
$$ 804826 820154 837123 855302 873892 891772 908341 924335 940871 957739 973687 988423
52077I88423J4710J5416J5019J2887J0279Q476P431O408N010L311J608L09l53
$$ 988423 1003133 1018549 1033568 1046455 1056734 1065210 1072641 1079049 1084059 1087370 1088978 1089287 1088934
52064A088934o11r58j654k590l550m417n277o285p262p565o832n722n277n624
$$ 1088934 1088323 1087365 1085711 1083121 1079571 1075154 1069877 1063592 1056330 1048765 1041933 1036211 1030934 1025310
52050A025310n947n779n486n394n267m909m523m206l798l324k927k284j046J95
$$ 1025310 1019363 1013584 1008098 1002704 997437 992528 988005 983799 980001 976677 973750 971466 970420 970615
52036I70615L90l35o78k2R09J480J944K352K078J118N75J070J734J670J307J342
$$ 970615 971005 970670 969992 969970 970879 972359 974303 976655 978733 979851 980426 981496 983230 984900 986207 987549
52020I87549J360O36n59j440j873k135k220k183k528l410m134m222m245m845n701
$$ 987549 988909 989545 988986 987546 985673 983538 981318 979135 976607 973197 969063 964841 960596 955751 950050
52005I50050o324p085q482j0124j1334j2173j2935j3381j3383j3600j4471j5248
$$ 950050 943726 936641 928159 918035 906701 894528 881593 868212 854829 841229 826758 811510
51993H11510j5155j4825j5345j6406j6764j6244j5900j6331j7007j7336j7394
$$ 811510 796355 781530 766185 749779 733015 716771 700871 684540 667533 650197 632803
51982F32803j7473j7719j8267j9044j9465j8944j7635j6150j4730j3354j2312
$$ 632803 615330 597611 579344 560300 540835 521891 504256 488106 473376 460022 447710
51971D47710j1953j1970j1644j0768r781r050q570q163p590o616n441m759m930
$$ 447710 435757 423787 412143 401375 391594 382544 373974 365811 358221 351605 346164 341405 336475
51958C36475n370n247m452l501k766k366k421k855l183l019k568k241k074j922
$$ 336475 331105 325858 321406 317905 315139 312773 310352 307497 304314 301295 298727 296486 294412 292490
51944B92490j812j758j586j360j519k194k865l080l023k961k695k083j461j078
$$ 292490 290678 288920 287334 285974 284455 282261 279396 276316 273293 270332 267637 265554 264093 263015
51930B63015o55o2J85k34p59p26l05jJ89M45N90N12O31J107J232L96q21j418j311
$$ 263015 262360 262298 262483 262249 261490 260764 260459 260458 260647 261092 261682 262194 262825 263932 265164 265560 264739 263321 262010
51911B62010j147j123r55o96p42j166j746k370k913l043k767k667l017l145k459
$$ 262010 260863 259740 258785 258089 257347 256181 254435 252065 249152 246109 243342 240675 237658 234513 232054
51896B32054j553j405j934k263k131k120k536k972k898k172j020J5L61M8k41j66
$$ 232054 230501 229096 227162 224899 222768 220648 218112 215140 212242 210070 209050 209065 209426 209474 209233 209067
51880B09067j91o24q52k67O32R19N75L25M36N22K86j73o02o22Q3J209J923J937
$$ 209067 208876 208252 207400 207133 207765 208684 209259 209584 210020 210542 210828 210655 210053 209431 209514 210723 212646 214583
51862B14583J788J686J064j03p04q5P80Q50O94J261J963J668Q87J149K509L460
$$ 214583 216371 218057 219121 219018 218314 218229 219009 219859 220553 221814 223777 225445 226332 227481 229990 233450
51846B33450L235K557K080J629J265J531K334K812K694K725L341M024M335M577
$$ 233450 236685 239242 241322 242951 244216 245747 248081 250893 253587 256312 259653 263677 268012 272589
51832B72589N048N419N271M547L304J682K53l84m61p65j476k103k563l284m078
$$ 272589 277637 283056 288327 292874 296178 297860 298113 297729 297268 296503 295027 292924 290361 287077 282999
51817B82999m033k951j933j920k413k268j273k73Jk55l09J60O26M13k08j24J116
$$ 282999 278966 276015 274082 272162 269749 267481 266208 265935 265936 265681 265372 265532 266158 266571 266363 266239 267355
51800B67355K434K517J592J025J451K162K318J880J213M91k13p82j208j582j878
$$ 267355 269789 272306 273898 274923 276374 278536 280854 282734 283947 284438 284225 283443 282235 280653 278775
51785B78775k019k071k042j731j119o22n68p03p18q37j279j588j208n29m85j238
$$ 278775 276756 274685 272643 270912 269793 269171 268603 267900 267182 266345 265066 263478 262270 261741 261256 260018
51769B60018j945j809q21M94J484J691J162L64l95j157j743j672r72l59q8M44
$$ 260018 258073 256264 255443 255937 257421 259112 260274 260638 260243 259086 257343 255671 254699 254340 254252 254696
51753B54696J387J722Q70n2J64Q29M67o93j107m62q1p07j470j398o56J04O33R50
$$ 254696 256083 257805 258675 258623 258787 259616 260083 259390 258283 257821 257740 257033 255563 254165 253509 253613 254246 255196
51735B55196J133J470K144K743K811K726L166L878L936L161K279J697J048J2j230
$$ 255196 256329 257799 259943 262686 265497 268223 271389 275267 279203 282364 284643 286340 287388 287400 286170
51720B86170k387l126k970j914r23q72j296j143m66j66m15n31l16k70n64r54j582
$$ 286170 283783 280657 277687 275773 274850 273978 272682 271539 271073 270907 270492 269961 269645 269375 268811 267857 266275
51703B66275k677l618l618l160l382m181m432l987l815m067l811k926k513k835
$$ 266275 263598 259980 256362 253202 249820 245639 241207 237220 233405 229338 225527 222601 220088 217253
51689B17253k585j033N91Q58J12k94K24J334K649L856M563M524L737K171J3j866
$$ 217253 214668 213635 214226 215084 215196 214902 215126 216460 219109 222965 227528 232052 235789 237960 237973 236107
51673B36107k671k840l402m237m209l130k103j713j282m00L49P40J535L017M216
$$ 236107 233436 230596 227194 222957 218748 215618 213515 211802 210520 210120 210469 211209 212744 215761 219977
51658B19977M422M280M524M862M923N230O212P281P791Q052Q452Q509P685O350
$$ 219977 224399 228679 233203 238065 242988 248218 254430 261711 269502 277554 286006 294515 302200 308550
51644C08550M992L348J198p78j969k885m234n632o306o507p094q108q794q827
$$ 308550 313542 316890 318088 317310 315341 312456 308222 302590 296284 289777 282683 274575 265781 256954
51630B56954q572q236p640o793o029n476m878m000k962k133j792j853j946j927
$$ 256954 248382 240146 232506 225713 219684 214208 209330 205330 202368 200235 198443 196590 194644 192717
51616A92717k104k554k635j851q70p16j189j161m01J92K23L76R28J033J19j096
$$ 192717 190613 188059 185424 183573 182703 181987 180798 179637 179236 179428 179651 180027 180955 181988 182107 181011
51600A81011j638j447r73m77k03l37m26K67J481K134K035K136K693K655J587O94
$$ 181011 179373 177926 176953 176476 176273 175936 175510 175777 177258 179392 181427 183563 186256 188911 190498 191192
51584A91192R68J705J921J985K586L216L155K981L656M792N273N135N398O376
$$ 191192 192160 193865 195786 197771 200357 203573 206728 209709 213365 218157 223430 228565 233963 240339
51570B40339P434Q233R069R973J0558J0735J0804J0837J0579R860Q604O687M193
$$ 240339 247773 256006 265075 275048 285606 296341 307145 317982 328561 338421 347025 353712 357905
51557C57905J599p21k791m536n590n962o273o819p071o619n835n129m223k847
$$ 357905 359504 358783 355992 351456 345866 339904 333631 326812 319741 313122 307287 302158 297935 295088
51543B95088j443n01J54Q45J493K176L431N364P179Q334R340J0668J1752J1909
$$ 295088 293645 293144 293298 294143 295636 297812 301243 306607 313786 322120 331460 342128 353880 365789
51529C65789J1471J1047J0423R135P448N825M083K017J79r37j773k850l685l699
$$ 365789 377260 388307 398730 407865 415313 421138 425221 427238 427417 426480 424707 421857 418172 414473
51515D14473l426l653l979l458k210j110l13O30J536J748J409J322J648J801J611
$$ 414473 411047 407394 403415 399957 397747 396637 396324 396954 398490 400238 401647 402969 404617 406418 408029
51500D08029J527J582J103l46k447m576o217p070p280p418p768p925p535o951
$$ 408029 409556 411138 412241 411895 409448 404872 398655 391585 384305 376887 369119 361194 353659 346708
51486C46708o630o437o230o412p072p245o102m279l036k487j864j108q98j350
$$ 346708 340078 333641 327411 320999 313927 306682 300580 296301 293265 290778 288914 287806 286908 285558
51472B85558j762j731j507j227o70J11P02R27R64R82J093J470J976K119J836J909
$$ 285558 283796 282065 280558 279331 278661 278772 279474 280401 281365 282347 283440 284910 286886 289005 290841 292750
51456B92750K895M250N153N573N790N634N168N301O564P916Q104P636P913Q856
$$ 292750 295645 299895 305048 310621 316411 322045 327213 332514 339078 346994 355098 362734 370647 379503
51442C79503Q982P742O178N124M200K918J539L88p03j869k890l593m004l988l474
$$ 379503 388485 396227 402405 407529 411729 414647 416186 416574 415871 414002 411112 407519 403515 399527 396053
51427C96053k921k821k793k038n24J061K359L437L982L520K381J433P19o41k966
$$ 396053 393132 390311 387518 385480 384956 386017 388376 391813 395795 399315 401696 403129 403848 403207 400241
51412D00241n416p080p873q168q223q201q208q137p906p750p805p694p041o155
$$ 400241 394825 387745 379872 371704 363481 355280 347072 338935 331029 323279 315474 307780 300739 294584
51398B94584n483m833l934l299l489l902l493k444j901k066j865o74Q32J867K542
$$ 294584 289101 284268 280334 277035 273546 269644 266151 263707 261806 259740 257875 257201 258033 259900 262442
51383B62442L277M114M972N897O771P327P568P615P197N925L995J943j75k587
$$ 262442 265719 269833 274805 280702 287473 294800 302368 309983 317180 323105 327100 329043 328868 326281
51369C26281n042p045q631j0055j0964j0926j0507j0709j1386j1378j0181q492
$$ 326281 321239 314194 305563 295508 284544 273618 263111 252402 241016 229638 219457 210965
51357B10965p019n925n377n466n535m743l465k945l432l913l829l679l672l190
$$ 210965 203946 198021 192644 187178 181643 176900 173435 170490 167058 163145 159316 155637 151965 148775
51343A48775k125j441j725k294k367k072j654p42P12J776J623O84j14n31p78p23
$$ 148775 146650 145209 143484 141190 138823 136751 135097 134355 135067 136843 138466 139150 139036 138505 137727 137004
51327A37004j88M14M93J15j52M1N81J170J496J422J153R88Q40N20L57R41K115
$$ 137004 136816 137230 137723 137838 137686 137727 138308 139478 140974 142396 143549 144537 145377 145897 146254 147195 149310
51310A49310K976L091K993L319M063M998O078P162P936Q359Q727R033Q987Q703
$$ 149310 152286 155377 158370 161689 165752 170750 176828 183990 191926 200285 209012 218045 227032 235735
51296B35735Q671Q814Q439P342O215N518M769L415J631k58k460n150p676r110
$$ 235735 244406 253220 261659 269001 275216 280734 285503 288918 290549 290291 287831 282681 275005 265895
51282B65895r313q949q643q518q427q275q094p917p575o775n625m783m739n132
$$ 265895 256582 247633 238990 230472 222045 213770 205676 197759 190184 183409 177784 173001 168262 163130
51268A63130n225m827m215l457k523j847j960k622l051k918k457j816j098q10
$$ 163130 157905 153078 148863 145406 142883 141036 139076 136454 133403 130485 128028 126212 125114 124304
51254A24304j306j879j513m52J20j13k86L8K72J32K27Q74J406J288R84J109J580
$$ 124304 122998 121119 119606 119154 119274 119161 118875 118913 119185 119317 119544 120418 121824 123112 124096 125205 126785
51237A26785K126K730L167K944K188J751J915J889J143K74m5j37o08j328j846
$$ 126785 128911 131641 134808 137752 139940 141691 143606 145495 146638 146912 146867 146730 146122 144794 142948
51222A42948k186k500k504j960j243q11n75l15j63j79l6L52M39j04p17p45m05
$$ 142948 140762 138262 135758 133798 132555 131744 131169 130854 130691 130512 130476 130828 131267 131163 130446 129701 129296
51205A29296l06m21l19r5l10j065j701j548o03N60J336J513J313J019P24M19J82
$$ 129296 128990 128569 128250 128155 127845 126780 125079 123531 122928 123488 124824 126337 127650 128669 129393 129812 129994
51188A29994Lk39l73O0R70J378O33n18r23o80q13j576k196k215j929j571j123
$$ 129994 129997 129758 129385 129445 130415 131793 132426 131908 130985 130305 129492 127916 125720 123505 121576 120005 118882
51171A18882q88j186j481r81m6K70j1R9O52N87k86p80k65M88R47J637K621K783
$$ 118882 117994 116808 115327 114346 114300 114570 114559 114658 115310 115897 115611 114831 114566 115054 116001 117638 120259 123042
51153A23042J675N72O49J329J589J572J734J591O24m82r07j137k023l098l219
$$ 123042 124717 125289 125938 127267 128856 130428 132162 133753 134377 133895 132988 131851 129828 126730 123511
51138A23511k439j909k166k578k379j451l00K57k56j234j408m47O13R22Q79J011
$$ 123511 121072 119163 116997 114419 112040 110589 110289 110546 110290 109056 107648 107201 107814 108736 109615 110626
51122A10626R11J57o12n23L56J490K714L739L811K872K169K602L367L414L268
$$ 110626 111537 111694 111082 110559 110915 112405 115119 118858 122669 125541 127710 130312 133679 137093 140361
51107A40361L983N030M877L350J817J189J037P14N9j001k479l824m262l750k886
$$ 140361 144344 149374 154251 157601 159418 160607 161644 162358 162417 161416 158937 155113 150851 147101 144215
51092A44215k027j189n95n58q97j185j397j627j510p67j3j42j023j616j364o98
$$ 144215 142188 140999 140404 139846 138949 137764 136367 134740 133230 132463 132450 132308 131285 129669 128305 127607
51076A27607j98K3P8J2o9M8N35J383K254K488J731N79m1j39m81j119j240q31j040
$$ 127607 127409 127432 127510 127522 127453 127501 128036 129419 131673 134161 135892 136471 136430 136291 135810 134691 133451 132620 131580
51057A31580k168k660j304P31J402M60o26q01j62Q62J707J576L62p31n89K20M41
$$ 131580 129412 126752 125448 126179 127581 128041 127415 126614 126452 127314 129021 130597 130959 130228 129639 129859 130300
51040A30300J62N07J654K592K734K470K147J669J233J363K097K930L570M015M086
$$ 130300 130462 130969 132623 135215 137949 140419 142566 144235 145468 146831 148928 151858 155428 159443 163529
51025A63529L642L069K773K404J437K53k89j04N9l36j238k285k817k141n49N13
$$ 163529 167171 170240 173013 175417 176854 177107 176818 176714 176773 176437 175199 172914 170097 167956 167407 167920
51009A67920J92n34l23N53Q98O17N55Q56J013J243K244L684M473M489M618N002
$$ 167920 168112 167578 167255 167808 168706 169323 169878 170734 171747 172990 175234 178918 183391 187880 192498 197500
50993A97500M759L686K817K922L654M493N461O493P184P558Q215R336J0354J0875
$$ 197500 202259 205945 208762 211684 215338 219831 225292 231785 238969 246527 254742 264078 274432 285307
50979B85307J1214J1863J3007J4726J6979J9354K1493K3662K6302K9295L2277
$$ 285307 296521 308384 321391 336117 353096 372450 393943 417605 443907 473202 505479
50968E05479L5330L8522M1276M3160M4851M7111M9279N0078M9556M8745M7705
$$ 505479 540809 579331 620607 663767 708618 755729 805008 855086 904642 953387 1001092
50957A001092M5518M2122L8427L4538K9609K3803J8727J5322J2719R909P180N180
$$ 1001092 1046610 1088732 1127159 1161697 1191306 1215109 1233836 1249158 1261877 1271786 1278966 1284146
50945A284146L836L002L090M206N521O307O814P408P527O248L339p80n668j0938
$$ 1284146 1287982 1290984 1294074 1298280 1303801 1310108 1316922 1324330 1331857 1338105 1341444 1340664 1334996 1324058
50931A324058j6136k1043k5856l0813l5885m0848m5313m8775n1079n2613n3569
$$ 1324058 1307922 1286879 1261023 1230210 1194325 1153477 1108164 1059389 1008310 955697 902128
50920I02128n3355n1434m8427m5483m2840l9889l6396l2677k8932k5471k3129
$$ 902128 848773 797339 748912 703429 660589 620700 584304 551627 522695 497224 474095
50909D74095k2194k1174j8288j4005j0548q939q204p542p297p320o412m279k440
$$ 474095 451901 430727 412439 398434 387886 378947 370743 363201 355904 348584 342172 337893 335453
50896C35453k057k231j526o2J056J420J413J334J344J718K425L001L209L270L192
$$ 335453 333396 331165 329639 329577 330633 332053 333466 334800 336144 337862 340287 343288 346497 349767 352959
50881C52959K747K386L077M798O214O406N913N690O108P432R909J2717J4166J3856
$$ 352959 355706 358092 361169 365967 372181 378587 384500 390190 396298 403730 413639 426356 440522 454378
50867D54378J3473J4487J6231J7378J8204K0005K3060K6494K9771L3157L7033
$$ 454378 467851 482338 498569 515947 534151 554156 577216 603710 633481 666638 703671
50856G03671M1627M7180N3647O0584O7750P5273Q2763Q9180R4244R9124J04768
$$ 703671 745298 792478 846125 906709 974459 1049732 1132495 1221675 1315919 1415043 1519811
50845A519811J10273J13877J14880J13648J10222J04083R5124Q3920P1244N7891
$$ 1519811 1630084 1743961 1858841 1972489 2082711 2186794 2281918 2365838 2437082 2494973
50835B494973M4684L2132K0330R688J193m447p377p857n686j014N102J1666J8498
$$ 2494973 2539657 2571789 2592119 2601807 2603000 2598553 2591176 2583319 2577633 2576619 2581721 2593387 2611885
50822B611885K5170K9922L0787K7377K0621J1208p20j4751l0109m6250o2664p8375
$$ 2611885 2637055 2666977 2697764 2725141 2745762 2756970 2756250 2741499 2711390 2665140 2602476 2524101
50810B524101r2392j04449j14546j22051j26117j26788j24968j21353j16144j09555
$$ 2524101 2431709 2327260 2212714 2090663 1964546 1837758 1712790 1591437 1475293 1365738
50800A365738j01917r3370q4131p4933o6574n9146n2256m5792l9952l4737l0019
$$ 1365738 1263821 1170451 1086320 1011387 944813 885667 833411 787619 747667 712930 682911
50789F82911k5852k2173j8527j4679j1259r029p800o756n641m834m387l907l380
$$ 682911 657059 634886 616359 601680 590421 581392 573592 566836 561195 556361 551974 548067 544687
50776E44687l389m134m914m892m106l388l445m167m766m590l757k928k483k236
$$ 544687 541298 537164 532250 527358 523252 519864 516419 512252 507486 502896 499139 496211 493728 491492
50762D91492j928j561j128l94P60K064L141L866M379N083O546Q931J1495J3298
$$ 491492 489564 488003 486875 486481 487241 489305 492446 496312 500691 505774 512320 521251 532746 546044
50748E46044J4364J5543J7150J8684J9964K1609K3973K6616K9305L2590L6785
$$ 546044 560408 575951 593101 611785 631749 653358 677331 703947 733252 765842 802627
50737H02627M1254M5490N0021N5421O1067O5877O9767P3389P6741P8894P8923
$$ 802627 843881 889371 939392 994813 1055880 1121757 1191524 1264913 1341654 1420548 1499471
50726A499471P6555P2105O6241N9481N1469M1271K8815J5501K939q232j7777k5030
$$ 1499471 1576026 1648131 1714372 1773853 1825322 1866593 1895408 1910909 1913848 1905616 1887839 1862809
50714A862809k9506l1588l1643k9191k4000j7408j1296o072q34M634R221J1758
$$ 1862809 1833303 1801715 1770072 1740881 1716881 1699473 1688177 1682105 1681271 1685905 1695126 1706884
50702A706884J1888R548M519l211j3212k4826l7066m8523n8031o5420p1043p4766
$$ 1706884 1718772 1728320 1732839 1729628 1716416 1691590 1654524 1606001 1547970 1482550 1411507 1336741
50690A336741p6130p5303p3069o9845o5420n9732n3346m7061m1500l6989l3336
$$ 1336741 1260611 1185308 1112239 1042394 976974 917242 863896 816835 775335 738346 705010
50679G05010k9768k5619k1092j6904j3320j0006o704l571r24R81K065K728L805
$$ 705010 675242 649623 628531 611627 598307 588301 581597 578026 577102 578083 580148 582876 586681
50666E86681N729P885R258R540R291R170R496J0294J1333J2262J3030J3931J5011
$$ 586681 592410 600295 609553 619093 628384 637554 647050 657344 668677 680939 693969 707900 722911
50653G22911J5864J6375J7145J8662K0521K2050K3332K4884K6887K9235L2047
$$ 722911 738775 755150 772295 790957 811478 833528 856860 881744 908631 937866 969913
50642I69913L5381L8811M1855M4553M7031M8966N0149N1004N1745N1452M9052
$$ 969913 1005294 1044105 1085960 1130513 1177544 1226510 1276659 1327663 1379408 1430860 1479912
50631A479912M4876M0255L5733L0726K4917J8936J3474Q589M155L53k501m223
$$ 1479912 1524788 1565043 1600776 1631502 1656419 1675355 1688829 1697418 1701573 1701926 1699425 1695202
50619A695202m775m386l578k657j315P97L338N582P248Q449R038Q670P419N733
$$ 1695202 1690427 1686041 1682463 1679806 1678491 1679288 1682626 1688208 1695456 1703905 1712943 1721613 1729032 1734765
50605A734765L857J771n33l251p026j2382j9051k6349l3959m1796m9321n5670
$$ 1734765 1738622 1740393 1739860 1736609 1729583 1717201 1698150 1671801 1637842 1596046 1546725 1491055
50593A491055o0296o3022o3753o2702o0619n8104n5040n1297m7596m4787m2511
$$ 1491055 1430759 1367737 1303984 1241282 1180663 1122559 1067519 1016222 968626 923839 881328
50582H81328l9523l5258l0453k6214k3177k1329j9866j7507j3698r477o369m606
$$ 881328 841805 806547 776094 749880 726703 705374 685508 668001 654303 644826 638457 633851
50570F33851l182j459K41J674L322N640Q328J0651J2212J3250J4368J5855J7223
$$ 633851 630669 629210 629451 631125 634447 640087 648415 659066 671278 684528 698896 714751 731974
50557G31974J7796J7948J9021K1509K4102K5339K5387K5363K5566K5558K5424
$$ 731974 749770 767718 786739 808248 832350 857689 883076 908439 934005 959563 984987
50546I84987K5608K5797K5266K4178K3420K3260K3324K3764K5169K7406K9734
$$ 984987 1010595 1036392 1061658 1085836 1109256 1132516 1155840 1179604 1204773 1232179 1261913
50535A261913L2072L5060L8768M2580M6372N0604N5264N9903O4817P0756P7320
$$ 1261913 1293985 1329045 1367813 1410393 1456765 1507369 1562633 1622536 1687353 1758109 1835429
50524A835429Q3010Q7303R1238R5361R8449R9037R7131R3463Q8042Q0330P0140
$$ 1835429 1918439 2005742 2096980 2192341 2290790 2389827 2486958 2580421 2668463 2748793 2818933
50513B818933N7645M3048K6888J0154o455k2911l9100n4318o7822p9276q8173
$$ 2818933 2876578 2919626 2946514 2956668 2950213 2927302 2888202 2833884 2766062 2686786 2598613
50502B598613r3598r5120r3268q8598q0963p0335n7782m4808l2025j9100n873
$$ 2598613 2505015 2409895 2316627 2228029 2147066 2076731 2018949 1974141 1942116 1923016 1917143
50491A917143O967J8257K7106L3367L7498L9749L9470L5400K6724J3598l008k1509
$$ 1917143 1924110 1942367 1969473 2002840 2040338 2080087 2119557 2154957 2181681 2195279 2192271 2170762
50479B170762l9847n6346p0492q2325r1240r6207r7263r5789r2973q8768q2736
$$ 2170762 2130915 2074569 2004077 1921752 1830512 1734305 1637042 1541253 1448280 1359512 1276776
50468A276776p5290o7626o0905n5622n1281m6544m0424l3527k7535k3266j9972
$$ 1276776 1201486 1133860 1072955 1017333 966052 919508 879084 845557 818022 794756 774784
50457G74784j6638j3120r715o494l583j292N32K667N477Q321J0492J2158J3868
$$ 774784 758146 745026 735311 728817 725234 723942 724474 727141 732618 740939 751431 763589 777457
50444G77457J5674J7374J9144K1224K3205K4337K4523K4582K5368K6807K7931
$$ 777457 793131 810505 829649 850873 874078 898415 922938 947520 972888 999695 1027626
50433A027626K7953K7198K6700K6736K6419K5045K3160K1563J9936J7522J4741
$$ 1027626 1055579 1082777 1109477 1136213 1162632 1187677 1210837 1232400 1252336 1269858 1284599
50422A284599J2769J1752J0779R653R272R971J0943J1783J3315J6263K0201K4365
$$ 1284599 1297368 1309120 1319899 1329552 1338824 1348795 1359738 1371521 1384836 1401099 1421300 1445665
50410A445665K8426L1903L4095L5261L6677L8661L9709L8616L6273L4101L1669
$$ 1445665 1474091 1505994 1540089 1575350 1612027 1650688 1690397 1729013 1765286 1799387 1831056
50399A831056K7414K1055J3752O059k677j2847k3706l4336m4426n3757o1648o7451
$$ 1831056 1858470 1879525 1893277 1899336 1896659 1883812 1860106 1825770 1781344 1727587 1665939 1598488
50387A598488p1133p3011p3076p0984o6667o0785n4320m7675m0448l2377k4100
$$ 1598488 1527355 1454344 1381268 1310284 1243617 1182832 1128512 1080837 1040389 1008012 983912
50376I83912j6420r084j271O747J3553J8456K2244K5480K7056K5380K0381J3400
$$ 983912 967492 958408 957137 963884 977437 995893 1018137 1043617 1070673 1096053 1116434 1129834
50364A129834N671k313j0278j7854k4654l0102l3488l4739l4751l4394l3547l1732
$$ 1129834 1135505 1133192 1122914 1105060 1080406 1050304 1016816 982077 947326 912932 879385 847653
50352H47653k9250k6907k4888k2739k0322j8018j5999j3966j1845j0136r344r300
$$ 847653 818403 791496 766608 743869 723547 705529 689530 675564 663719 653583 644239 634939
50340F34939r234q404o780n147m362m369m141k801n15J905L971N789P593R365
$$ 634939 625705 617301 610521 605374 601012 596643 592502 589701 589186 591091 595062 600851 608444 617809
50326F17809J0822J1644J1801J1663J1697J2059J2674J3513J4418J4892J4735
$$ 617809 628631 640275 652076 663739 675436 687495 700169 713682 728100 742992 757727
50315G57727J4658J5560J7162J8222J8184J7645J7100J6142J4360J2182J0289
$$ 757727 772385 787945 805107 823329 841513 859158 876258 892400 906760 918942 929231
50304I29231Q897P991P483O784N063K549O70K22K28o05k034k846k672k268k384
$$ 929231 938128 946119 953602 960386 965449 967998 968668 968890 969118 968513 966479 963633 960961 958693 956309
50289I56309l243m823o851q675r861j0775j2071j3750j5271j6210j6418j5897
$$ 956309 953066 948243 941392 932717 922856 912081 900010 886260 870989 854779 838361 822464
50277H22464j5152j5111j6119j7342j7849j7819j7980j8302j8133j7342j6363
$$ 822464 807312 792201 776082 758740 740891 723072 705092 686790 668657 651315 634952
50266F34952j5241j3547j1327r276p832o701n515m454l885l702l314k224o21O81
$$ 634952 619711 606164 594837 585561 577729 571028 565513 561059 557174 553472 550158 547934 547313 547994
50252E47994J063Q74J111K195L551M535N208N867O318O186N636N264N359N571
$$ 547994 549057 549931 551042 553237 556788 561323 566531 572398 578716 584902 590538 595802 601161 606732
50238F06732N252L934J784l63j693k234k580k931l034l000l304l804l819l453
$$ 606732 611984 615918 617702 617339 615646 613412 610832 607901 604867 601867 598563 594759 590940 587487
50224E87487l792n179o328n991m598l338k418j313j06N00L28r9k92n2P17J816
$$ 587487 583695 578516 572188 566197 561599 558261 555843 554530 554424 554924 555252 555153 554861 554809 555526 557342
50208E57342K663K994L193L489L445K882K550K999L472K989J951J506J745J687
$$ 557342 560005 562999 566192 569681 573126 576008 578558 581557 585029 588018 589969 591475 593220 594907
50194E94907P84o48k303m053n309n404m654m097m226m785n667o994q296q803q662
$$ 594907 595691 595043 592740 588687 583378 577974 573320 569223 564997 560212 554545 547551 539255 530452 521790
50179E21790q880r774j0421r987q774p548o531n543m565l691k819j797o45M43
$$ 521790 512910 503136 492715 482728 473954 466406 459875 454332 449767 446076 443257 441460 440815 441258
50165D41258J187J253M70r23k430l626m259m374m466n082n899n751m133k151j350
$$ 441258 442445 443698 444168 443245 440815 437189 432930 428556 424090 419008 413109 407358 403225 401074 399724
50150C99724j955k959l553l647l308k615k053k157k776l262l368l296l038k377
$$ 399724 397769 394810 391257 387610 384302 381687 379634 377477 374701 371439 368071 364775 361737 359360
50136C59360j545j073r45n53M03J486K069J913J296R39J601L262M925N659N607
$$ 359360 357815 356742 355797 355244 355647 357133 359202 361115 362411 363350 364951 368213 373138 378797 384404
50121C84404N512N698O086O698P427P711P332P104P836Q941R190Q521P904P586
$$ 384404 389916 395614 401700 408398 415825 423536 430868 437972 445808 454749 463939 472460 480364 487950
50107D87950O822N489M564M552M608L836K498J353M98l46j028j176q96o69o30
$$ 487950 494772 500261 504825 509377 513985 517821 520319 521672 522170 521824 520796 519620 518724 518055 517425
50092E17425m16K68J183J767J748J503J608K058K361K457K949M073N095N370N460
$$ 517425 517009 517277 518460 520227 521975 523478 525086 527144 529505 531962 534911 538984 544079 549449 554909
50077E54909O355P975R300R743R515Q914Q159P846Q541R837J0629J0394R555Q657
$$ 554909 561264 569239 578539 588282 597797 606711 614870 622716 631257 641094 651723 662117 671672 680329
50063F80329P923P640Q071Q838R099Q594P942P740P956Q236Q337Q216Q064Q169
$$ 680329 688252 695892 703963 712801 721900 730494 738436 746176 754132 762368 770705 778921 786985 795154
50049G95154Q390Q097P101O130N765N440M361K897J928J283L7j801l254l996m695
$$ 795154 803544 811641 818742 824872 830637 836077 840438 843335 845263 846546 846583 844782 841528 837532 832837
50034H32837n657o438o965p791q932r638r706r851j0438j0888j0863j0901j1319
$$ 832837 827180 820742 813777 805986 797054 787416 777710 767859 757421 746533 735670 724769 713450
50021G13450j1438j0666r450q508p843p070o137n141l995k760j724q39L13J692
$$ 713450 702012 691346 681896 673388 665545 658475 652338 647197 643202 640442 638718 637879 638192 639884
50007F39884K658L026L458M336N034M881M150L496K999K344J517P48J59j20J18
$$ 639884 642542 645568 649026 653362 658396 663277 667427 670923 673922 676266 677783 678531 678690 678570 678688
49992F78688P07J016O77ln93r85r91r3J912M400O456P609P848P381O610N851M853
$$ 678688 679395 680411 681088 681085 680492 679507 678516 678423 680335 684735 691191 698800 706648 714029 720639 726490 731343
49975G31343L100Q38p69q28M13K146L935N637P011P771P773O860M854J907j559
$$ 731343 734443 735281 734512 733684 734097 736243 740178 745815 752826 760597 768370 775230 780084 781991 780432
49960G80432n361r627j4155j8271k1444k3693k5183k5917k5945k5411k4299k2637
$$ 780432 775071 765444 751289 733018 711574 687881 662698 636781 610836 585425 561126 538489
49948E38489k0875j9489j8219j6428j4267j2607j1756j1070j0099r199q639p945
$$ 538489 517614 498125 479906 463478 449211 436604 424848 413778 403679 394480 385841 377896
49936C77896o715n347m479m181m179m256m065l194j887j111j439k227k454j921
$$ 377896 371181 365834 361355 357174 352995 348739 344674 341480 339593 338482 337043 334816 332362 330441
49922C30441j230q86q90r13o53j09L87O49R94J649K137J804Q19j11q63j750k397
$$ 330441 329211 328325 327435 326522 325869 325760 326147 326796 327790 329439 331576 333380 334199 334088 333225 331475 329078
49905C29078j937m82O78P03J8p36j433j716q52R55K161J753P08O33J692K742L001
$$ 329078 327141 326659 327337 328040 328058 327322 325889 324173 323321 324276 326437 328190 328898 329531 331223 333965 336966
49888C36966K666K200J844J727J888K225K745L594M694N636O168O400O489O611
$$ 336966 339632 341832 343676 345403 347291 349516 352261 355855 360549 366185 372353 378753 385242 391853
49874C91853P186Q526J0193J1559J2972J5379J8690K1618K3482K4920K6279K6647
$$ 391853 399039 407565 417758 429317 442289 457668 476358 497976 521458 546378 572657 599304
49862E99304K5325K3210K1608K0489J8933J6830J5064J4392J4955J6593J8896
$$ 599304 624629 647839 669447 689936 708869 725699 740763 755155 770110 786703 805599
49851H05599K1043K2213K2016K0291J6886J1974O181J48n734j1067j5531j9317
$$ 805599 826642 848855 870871 891162 908048 920022 926203 926351 920617 909550 894019 874702
49839H74702k2807k5667k7126k7204k6809k6408k5687k4652k3956k3731k3305
$$ 874702 851895 826228 799102 771898 745089 718681 692994 668342 644386 620655 597350
49828E97350k2532k2090k1946k0962j8794j6784j5961j5387j3734j1313r327q019
$$ 597350 574818 552728 530782 509820 491026 474242 458281 442894 429160 417847 408520 400501
49816D00501o864n810n072m402l620l147l058k545j353p57j720l085l108k009
$$ 400501 393637 387827 382755 378353 374733 371586 368528 365983 364630 363873 362153 359068 355960 353951
49802C53951j312j292r23LM83L7p24j334j858k009j313k77j54j223k460l124l502
$$ 353951 352639 351347 350424 350427 350910 350947 350223 348889 347031 345022 343709 343432 343278 342055 339595 336471 332969
49785C32969l871l833l221k662k704k966k739j959j158p67p36p38n86m67o72j095
$$ 332969 329098 325265 322044 319382 316678 313712 310973 309014 307856 307089 306353 305615 305029 304562 303890 302795
49769C02795j315j218j054p51J68J673K881L125K721K278J944J831K383L605M633
$$ 302795 301480 300262 299208 298457 298625 300298 303179 306304 309025 311303 313247 315078 317461 321066 325699
49754C25699M816M695N215O509Q145R861J1473J2722J3789J5318J7381J9321K1020
$$ 325699 330515 335210 340425 346934 355079 364940 376413 389135 402924 418242 435623 454944 475964
49741D75964K3067K5013K4975K2187J8468J5802J3819J1348R086Q566R458J0144
$$ 475964 499031 524044 549019 571206 589674 605476 619295 630643 639729 648295 657753 667897
49729F67897J0434J1455J3139J3986J3322J1801R547N777N41m971j0162j5396
$$ 667897 678331 689786 702925 716911 730233 742034 751581 757358 757899 752928 742766 727370
49717G27370k0390k3897k5432k5800k5474k4012k1520j9163j7574j6049j4036
$$ 727370 706980 683083 657651 631851 606377 582365 560845 541682 524108 508059 494023
49706D94023j2118j0871r851q461o926n668m537l248j985j063n08k88l83m53o0
$$ 494023 481905 471034 461183 452722 445796 440128 435591 432343 430358 429295 428787 428499 428116 427663 427603
49691D27603O82J248J482J585J492J044N85N76Q18R50J334K342L149K668J411
$$ 427603 428285 429533 431015 432600 434092 435136 435721 436297 437115 438065 439399 441741 444890 447558 448969
49676D48969R92J740K425K402K371K687K556J570O35O41J322K003K499K712K417
$$ 448969 449961 451701 454126 456528 458899 461586 464142 465712 466347 466988 468310 470313 472812 475524 477941
49661D77941J934K014K560K548J615O96N47P43O65M36K38k68j175j820j767j574
$$ 477941 479875 481889 484449 486997 488612 489308 489855 490598 491263 491699 491937 491669 490494 488674 486907 485333
49645D85333j891k441k516j938j156p29r75j635j895j291m00P2N10J587K648K407
$$ 485333 483442 481001 478485 476547 475391 474662 473687 472052 470157 468866 468466 468538 469048 470635 473283 475690
49629D75690J129L96O69Q18M64Q02K373L807L836L079K700K598K109J376Q93O55
$$ 475690 476819 477215 477884 478702 479166 479968 482341 486148 489984 493063 495763 498361 500470 501846 502739 503394
49613E03394P47J782L698N163N269M909N362O396O929O815O812P293Q089R148
$$ 503394 504141 505923 509621 514784 520053 524962 530324 536720 543649 550464 557276 564569 572658 581806
49599E81806J0377J1276J1526J1515J1613J1609J1470J1851J3027J4147J4526
$$ 581806 592183 603459 614985 626500 638113 649722 661192 673043 686070 700217 714743
49588G14743J4898J6284J8319J9900K1062K2876K5717K8692L0812L2032L3073
$$ 714743 729641 745925 764244 784144 805206 828082 853799 882491 913303 945335 978408
49577I78408L4766L7374M0214M2255M3415M4709M6765M8953N0519N1778N3385
$$ 978408 1013174 1050548 1090762 1133017 1176432 1221141 1267906 1316859 1367378 1419156 1472541
49566A472541N5190N6664N7882N9218O0506O1317O1605O1355O0155N7804N4807
$$ 1472541 1527731 1584395 1642277 1701495 1762001 1823318 1884923 1946278 2006433 2064237 2119044
$$ [...]
##END NTUPLES=NMR SPECTRUM
##END=
