
##TITLE=AC1348_GUAAH12166_7433218_aV7fpcD0CK
##JCAMPDX= 6.0         $$ Bruker NMR JCAMP-DX V2.0
##DATA TYPE= NMR SPECTRUM
##DATA CLASS= NTUPLES
##ORIGIN= BRUKER
##OWNER= Administrator
$$ 1.72 TOPSPIN		Version 2.1
$$ 2013-01-30 04:06:28.320 -0500  Administrator@X
$$ Compression mode = diff/dup
##.OBSERVE FREQUENCY= 400.02188249412
##.OBSERVE NUCLEUS= ^1H
##.ACQUISITION MODE= SIMULTANEOUS (DQD)
##.ACQUISITION SCHEME= undefined
##.AVERAGES= 8
##.DIGITISER RES= 22
##SPECTROMETER/DATA SYSTEM= spect
##.PULSE SEQUENCE= zg30
##.SOLVENT NAME= COFFEE_meoh
##.SHIFT REFERENCE= INTERNAL, COFFEE_meoh, 1, 14.98509
##AUDIT TRAIL= $$ (NUMBER, WHEN, WHO, WHERE, PROCESS, VERSION, WHAT)
$$ ##TITLE= Audit trail, TOPSPIN		Version 2.1
$$ ##JCAMPDX= 5.01
$$ ##ORIGIN= Bruker BioSpin GmbH
$$ ##OWNER= Administrator
$$ $$ E:\/data/COFFEE/nmr/AC1348_GUAAH12166_7433218_aV7fpcD0CK/10/pdata/1/auditp.txt
$$ ##AUDIT TRAIL=  $$ (NUMBER, WHEN, WHO, WHERE, PROCESS, VERSION, WHAT)
(   1,<2013-01-30 04:06:19.914 -0500>,<Administrator>,<X>,<go>,<TOPSPIN 2.1>,
      <created by zg
	started at 2013-01-30 04:05:13.836 -0500,
	POWCHK enabled, PULCHK disabled,
       configuration hash MD5:
       86 BA 57 50 F2 9D 5C 9B 26 00 A9 28 5F 66 2E 89
       data hash MD5: 64K
       4A AB 1E 5B 14 48 33 42 7D 2A 13 21 97 E8 7F 6C>)
(   2,<2013-01-30 04:06:23.195 -0500>,<Administrator>,<X>,<proc1d>,<TOPSPIN 2.1>,
      <Start of raw data processing
       efp LB = 0 FT_mod = 6 PKNL = 1 PHC0 = 0 PHC1 = 0 SI = 32K 
       data hash MD5: 32K
       B4 84 56 CF 76 A2 F1 26 BB B8 AA 32 CF 95 40 ED>)
(   3,<2013-01-30 04:06:23.664 -0500>,<Administrator>,<X>,<proc1d>,<TOPSPIN 2.1>,
      <pk PHC0 = 98.78357 PHC1 = 0 
       data hash MD5: 32K
       DF 44 33 7F 9C 62 F3 4C 62 79 3F DF AB B8 10 32>)
(   4,<2013-01-30 04:06:23.899 -0500>,<Administrator>,<X>,<proc1d>,<TOPSPIN 2.1>,
      <abs ABSG = 1 
       data hash MD5: 32K
       05 D4 75 58 20 9C 91 07 51 2A D0 74 25 B6 02 0A>)
(   5,<2013-01-30 04:06:24.055 -0500>,<Administrator>,<X>,<proc1d>,<TOPSPIN 2.1>,
      <abs ABSG = 2 
       data hash MD5: 32K
       4F B7 B5 E5 9D 36 49 7E A8 00 B7 AF BB 93 59 21>)
(   6,<2013-01-30 04:06:24.211 -0500>,<Administrator>,<X>,<proc1d>,<TOPSPIN 2.1>,
      <abs ABSG = 3 
       data hash MD5: 32K
       A8 8E 77 0D 06 08 3D 20 7C 34 CA 57 98 CC 6D F4>)
(   7,<2013-01-30 04:06:24.352 -0500>,<Administrator>,<X>,<proc1d>,<TOPSPIN 2.1>,
      <abs ABSG = 4 
       data hash MD5: 32K
       77 03 D9 1C 02 ED 0A CD 62 71 FD 62 27 0C 65 E5>)
(   8,<2013-01-30 04:06:24.508 -0500>,<Administrator>,<X>,<proc1d>,<TOPSPIN 2.1>,
      <abs ABSG = 5 
       data hash MD5: 32K
       7B D2 B4 4D D5 C8 6E C6 DC D9 7A AA 58 ED 9C 85>)
$$ ##END=
$$ 
$$ $$ hash MD5
$$ $$ 0A 10 67 77 1A 35 5D 92 9D A5 3C 32 87 E2 37 8B
##$RELAX= 
##$RELAX= 
##$RELAX= 
##$RELAX= 
##$RELAX= 
##$RELAX= 
##$RELAX= 
$$ Bruker specific parameters
$$ --------------------------
##$DU= <E:\>
##$EXPNO= 10
##$NAME= <AC1348_GUAAH12166_7433218_aV7fpcD0CK>
$$ [...]
##$TP= (0..7)
150 150 150 150 150 150 150 150
##$TP07= 0
##$TPNAME0= <>
##$TPNAME1= <>
##$TPNAME2= <>
##$TPNAME3= <>
##$TPNAME4= <>
##$TPNAME5= <>
##$TPNAME6= <>
##$TPNAME7= <>
##$TPOAL= (0..7)
0.5 0.5 0.5 0.5 0.5 0.5 0.5 0.5
##$TPOFFS= (0..7)
0 0 0 0 0 0 0 0
##$TUNHIN= 0
##$TUNHOUT= 0
##$TUNXOUT= 0
##$USERA1= <user>
##$USERA2= <user>
##$USERA3= <user>
##$USERA4= <user>
##$USERA5= <user>
##$V9= 5
##$VALIST= <valist>
##$VCLIST= <CCCCCCCCCCCCCCC>
##$VD= 0
##$VDLIST= <DDDDDDDDDDDDDDD>
##$VPLIST= <PPPPPPPPPPPPPPP>
##$VTLIST= <TTTTTTTTTTTTTTT>
##$WBST= 1024
##$WBSW= 4
##$XGAIN= (0..3)
0 0 0 0
##$XL= 0
##$YL= 0
##$YMAX_a= 661719
##$YMIN_a= -563213
##$ZGOPTNS= <>
##$ZL1= 120
##$ZL2= 120
##$ZL3= 120
##$ZL4= 120
##$ABSF1= 14.98509
##$ABSF2= -5.573092
##$ABSG= 5
##$ABSL= 3
##$ALPHA= 0
##$AQORDER= 0
##$ASSFAC= 0
##$ASSFACI= 0
##$ASSFACX= 0
##$ASSWID= 0
##$AUNMP= <proc_prof1d_extract_pilot.lims>
##$AXLEFT= 0
##$AXNAME= <>
##$AXNUC= <1H>
##$AXRIGHT= 0
##$AXTYPE= 0
##$AXUNIT= <>
##$AZFE= 0.1
##$AZFW= 0.1
##$BCFW= 0
##$BC_mod= 0
##$BYTORDP= 0
##$COROFFS= 0
##$CY= 15
##$DATMOD= 1
##$DC= 0
##$DFILT= <>
##$DTYPP= 0
##$F1P= 0
##$F2P= 0
##$FCOR= 0.5
##$FTSIZE= 32768
##$FT_mod= 6
##$GAMMA= 0
##$GB= 0
##$INTBC= 1
##$INTSCL= 1
##$ISEN= 128
##$LB= 0
##$LEV0= 0
##$LPBIN= 0
##$MAXI= 10000
##$MC2= 0
##$MEAN= 0
##$ME_mod= 0
##$MI= 0
##$NCOEF= 0
##$NC_proc= -8
##$NLEV= 6
##$NOISF1= 0
##$NOISF2= 0
##$NSP= 0
##$NTH_PI= 0
##$NZP= 0
##$OFFSET= 14.98509
##$PC= 1
##$PHC0= 98.78357
##$PHC1= 0
##$PH_mod= 1
##$PKNL= yes
##$PPARMOD= 0
##$PPDIAG= 0
##$PPIPTYP= 0
##$PPMPNUM= 2147483647
##$PPRESOL= 1
##$PSCAL= 4
##$PSIGN= 0
##$PYNMP= <proc.py>
##$REVERSE= no
##$SF= 400.02
##$SI= 32768
##$SIGF1= 0
##$SIGF2= 0
##$SINO= 400
##$SIOLD= 32768
##$SPECTYP= <>
##$SREGLST= <1H.CDCl3>
##$SSB= 0
##$STSI= 32768
##$STSR= 0
##$SW_p= 8223.68421052631
##$SYMM= 0
##$S_DEV= 0
##$TDeff= 65536
##$TDoff= 0
##$TI= <>
##$TILT= no
##$TM1= 0
##$TM2= 0
##$TOPLEV= 0
##$USERP1= <user>
##$USERP2= <user>
##$USERP3= <user>
##$USERP4= <user>
##$USERP5= <user>
##$WDW= 1
##$XDIM= 32768
##$YMAX_p= 460036419
##$YMIN_p= -642561
##$CURPLOT= <Network HP LaserJet P1505>
##$CURPRIN= <$Network HP LaserJet P1505>
##$DFORMAT= <normdp>
##$LAYOUT= <+/1D_H.xwp>
##$LFORMAT= <normlp>
##$PFORMAT= <normpl>
##$SURQMSG= 1
$$ End of Bruker specific parameters
$$ ---------------------------------
##NTUPLES= NMR SPECTRUM
##VAR_NAME=  FREQUENCY,     SPECTRUM/REAL,   SPECTRUM/IMAG
##SYMBOL=    X,             R,               I
##VAR_TYPE=  INDEPENDENT,   DEPENDENT,       DEPENDENT
##VAR_FORM=  AFFN,          ASDF,            ASDF
##VAR_DIM=   32768,         32768,           32768
##UNITS=     HZ,            ARBITRARY UNITS, ARBITRARY UNITS
##FACTOR=    0.250966925370066, 1,           1
##FIRST=     8223.43324360094, -218635,      -162011
##LAST=      0,             147549,          -1615
##MIN=       0,             -642561,         0
##MAX=       8223.43324360094, 460036419,    0
$$ Real data points
##PAGE= N=1
##DATA TABLE= (X++(R..R)), XYDATA
$$ [...]
19536a00727j94911a32504j26413R4636A15770e3349a3237m6194p1738I7867a85565
19524a88268A63268a39038j58328H5054a30862o6442m0288L8402g498j04556f132
19512b0718m40015a99404P7440R124l5986b0260o5839c6290B307N8073b15355
19500A84739k8603l9098b22162N3822d465H9065d0999j04982p8803k749N687B94133
19487f5949F3865K62283g3985j83406H0632b19511H6006a49292f3558B2890a4524
19475b47787I8431h6185k16537k1602J34543B03983D1703N803p254L17361i2606
19463A0020b50578E3854c37941J64016h1385r5431B8754K71537j48350D5804d8558
19451G6372I262a38658C22442A26427a56534f9813A16108c8678l3852J8097q8663
$$ plain form
19536 -100727 -295638 -132504 -258917 -164281 115770 -53349 -13237 -59431 -131169 97867 -185565
19524 -188268 163268 -139038 -297366 85054 -130862 -197304 -237592 -199190 -7498 -112054 -6132
19512 -20718 -460733 -199404 -121964 -112840 -148826 -20260 -86099 -36290 2307 60380 -215355
19500 184739 156136 117038 -222162 -168340 -4465 89065 -40999 -145981 -224784 -227533 -221846 294133
19487 -65949 63865 326148 -73985 -257391 80632 -219511 86006 -149292 -63558 22890 -14524
19475 -247787 98431 -86185 -302722 -324324 -189781 203983 41703 47506 40252 357613 -92606
19463 10020 -250578 53854 -337941 -173925 -81385 -176816 28754 300291 151941 45804 -48558
19451 76372 9262 -138658 322442 126427 -156534 -69813 116108 -38678 -72530 -54433 -143096
19440a43096D15833E6975j2807b846I4907a55382K5540A25360l5399m1225a00289
19428F2417d25536f9517B6236b22089D2070a56848K3835A7079Q8283a16121o2656
19417a78777B41031a46693K4179A46326o8669C5405b33118M7638D4260a65643
19406B19363H8302a28000A74546a85603r5216A23267a51392k10893B77272c013
19395d6702q473j07449L1540a1677M591q8454d4972j22426A9424f5841B15197
19383b0188j07702q4885k8850J00543a6273l6434j02437f9758a2902j52011J0971
19372a53942A32596I005J4328b7821A54957f9978j74817b3792A4207J66633c99864
19360d7590k58253R0519C2751e1927n2965L7080k01965O2368P608E0769b00312
$$ plain form
19440 -143096 415833 56975 44168 -2846 94907 -155382 -129842 125360 89961 48736 -100289
19428 62417 -425536 -69517 26236 -222089 42070 -156848 -133013 17079 105362 -116121 -178777
19417 -178777 241031 -146693 -122514 146326 77657 35405 -233118 -185480 44260 -165643
19406 219363 88302 -128000 174546 -185603 -280819 123267 -151392 -362285 277272 -3013
19395 -46702 -55175 -162624 -131084 -11677 -7086 -95540 -44972 -167398 19424 -65841 215197
19383 -20188 -127890 -212775 -241625 -141082 -16273 -52707 -155144 -69758 -12902 -164913 -153942
19372 -153942 132596 9005 23333 -27821 154957 -69978 -244795 -23792 14207 180840 -399864
19360 -47590 -305843 -215324 32751 -51927 -104892 -67812 -269777 -207409 -199801 50769 -200312
19348b81342P1387g6396l62843J82060a1418C3288i5178A66710a11482k29354
19338c40836g6814B00095d1275B51142e5443o1206G6360a01737b2642l81452a64810
19326D3665J2217k5559L0260a10499B45841f6547A2749a04689r6029H5890b43201
19314c271j48338j65815d8818j17816P7957A25111d3831A70565a70636b8507D49896
19302B03646K9403b32232j10980E8543b31610D3906a11122j3336d4056B15888
19291A00417K5363a78923j03862A3480J53729j1008b12239O0073B7752a93146
19280A55118l11a84578b1478B78613a93987A34640g2514m0868r893J1705k41466
19269c53036B35474a08868k74265a50836B5803J27038c41980O8736G9346a03335
$$ plain form
19348 -281342 -209955 -76396 -439239 -257179 -11418 33288 -95178 166710 -111482 -340836
19338 -340836 -76814 200095 -41275 251142 -55443 -116649 76360 -101737 -22642 -404094 -164810
19326 43665 55882 30323 60583 -110499 245841 -66547 12749 -104689 -200718 85890 -243201
19314 -3271 -151609 -317424 -48818 -166634 -88677 125111 -43831 170565 -170636 -28507 449896
19302 203646 233049 -232232 -343212 58543 -231610 43906 -111122 -124458 -44056 215888
19291 100417 125780 -178923 -282785 13480 167209 156201 -212239 -152166 27752 -193146
19280 155118 154807 -184578 -21478 278613 -193987 134640 -72514 -113382 -123275 -111570 -353036
19269 -353036 235474 -108868 -383133 -150836 25803 152841 -341980 -273244 79346 -103335
19258b2008A73946g5271b0823j99632L6776L9399A83528r669a46617C812g6361
19246I4975i4364a4062j25259j39338i9455j45839i6665B2312K71973a99585r758
19235b09343Q1281k7989j8281F7801c20337A23016B0929J50856a61845c1558d051
19223I5743j2030a76775j9398B15647c24890a994F6280a73428A79134b30861h7190
19211f0260A91688b14884C3466d29258a12198o8446k19322c3554F4057k5080L1724
19200G0701B8089a3118A78878J61927a10843A81791a08401F6595b45073J05733
19190a39340f4935k15272g2054j32246c5703F1170P963h4995g820k72785b1254
19178B2230a66000r3642C22642e9792h193B21803H7251J47336B9500b62162A14806
$$ plain form
19258 -22008 173946 -75271 -20823 -220455 -183679 -144280 183528 173859 -146617 3812 -76361
19246 94975 -94364 -14062 -139321 -278659 -99455 -245294 -96665 22312 294285 -199585 -209343
19235 -209343 -128062 -156051 -174332 67801 -320337 123016 20929 171785 -161845 -31558 -4051
19223 95743 83713 -176775 -196173 215647 -324890 -1994 66280 -173428 179134 -230861 -87190
19211 -60260 191688 -214884 33466 -429258 -112198 -180644 -399966 -33554 64057 38977 70701
19200 70701 28089 -13118 178878 340805 -110843 181791 -108401 66595 -245073 -139340
19190 -139340 -64935 -280207 -72054 -204300 -35703 61170 69133 -84995 -7820 -280605 -21254
19178 22230 -166000 -259642 322642 -59792 -8193 221803 87251 234587 29500 -262162 114806
19166B24325a53282O7181j08314j54535k233A14698i8690j02152G9698J04620
19156A84318a96204A48960c64055H1804B4241O3887a40079A10577e820n0312C69349
19144d09483F5891c3209m4368m4352j75983b9339A08684f3030l27664J45795P2280
19133a72619A40431b29694A99409i1340j2516L3158K9734B09252c706j8701I9738
19121b16919j06966C1617R1334i5980A7988b04051i5633j59938j01037R0657a13594
19109a94193g6151k65744A72707E6309G331Q2187l2594c9011B88883i7393A43897
19097a95804Q9647j82137g4129A39475c62951A16061b53688f9872j81994a22203
19086i9066A42337B9448m959K24078b26109O8216A1133l783h15l7450I9172a60781
$$ plain form
19166 224325 -153282 -86101 -194415 -348950 -351183 114698 -98690 -200842 79698 184318
19156 184318 -196204 148960 -364055 81804 24241 88128 -140079 110577 -5820 -56132 369349
19144 -409483 65891 -33209 -77577 -121929 -297912 -29339 108684 -63030 -390694 -244899 -172619
19133 -172619 140431 -229694 199409 -91340 -103856 -70698 -40964 209252 -3706 -22407 99738
19121 -216919 -323885 31617 122951 -95980 17988 -204051 -95633 -255571 -356608 -265951 -113594
19109 -194193 -76151 -341895 172707 56309 7331 89518 56924 -39011 288883 -97393 143897
19097 -195804 -106157 -288294 -74129 139475 -362951 116061 -253688 -69872 -251866 -122203
19086 -99066 142337 29448 24489 248567 -226109 -157893 11133 7350 -815 -38265 99172 -160781
19073A522b91893J36825j465O6718r8404k74514g2484j83152O5223c8043m1596
19062g9639r1369E5599a68051a1588j55052C1508J44193g6205m31668A44687a00203
19050f326k79967a35861E5316b63380k593N4953H5361i2662A27949J13486a89140
19038c07985A74798q2730k4600a83505L5903O0180j32737b5337j6028B01241l7090
19027A64151M3574q420p9036a86030A84312e6250o5941A01929M148d0117j07753
19016a47870N5904C18325a21262A82999a70044M6167A51016d5896l0920k3820
19006a00636j06767g4219j15692g3550p6165O4204j52283a5297l03957f7635O375
18995f1260j43295K6326B1336P2307l969K17391j48616a47907k38278A76512b05989
$$ plain form
19073 1522 -291893 -155068 -156533 -89815 -188219 -462733 -72484 -255636 -190413 -38043 -79639
19062 -79639 -171008 55599 -168051 -11588 -166640 31508 175701 -76205 -507873 144687 -100203
19050 -6326 -286293 -135861 55316 -263380 -265973 -211020 85361 -92662 127949 241435 -189140
19038 -307985 174798 92068 67468 -183505 -147602 -87422 -220159 -25337 -41365 201241 164151
19027 164151 207725 199305 120269 -186030 184312 -56250 -122191 101929 106077 -40117 -147870
19016 -147870 -91966 318325 -121262 182999 -170044 -123877 151016 -45896 -76816 -100636
19006 -100636 -207403 -74219 -189911 -73550 -149715 -85511 -237794 -15297 -319254 -67635 -61260
18995 -61260 -204555 -178229 21336 93643 89674 307065 158449 -147907 -386185 176512 -205989
18983b77280G3537J53041o2475b82417f2887A10965a24583B12389L8262o6514
18973A84137P9593g7900j9538A41086d5607j20793D6509f6984p2061H2873J44630
18962B27503d0134D8878Q1747K59027c0936k52930A34752D7417h0327k43092D1491
18950B16595b41039A82880B9481d8465f261l6236r9517A0809h3076B0060b07904
18938b18532N3683A06074B1175h2283m1132M1418C0312J52170J41072C6716a61788
18926i7939A7896J85001a92598F0713N5724f08287A46567E5991a55377k3924B71224
18914g6765d008C15599b07136e7991E8374b4680C6336i0850b88j73545A71359
18902A68783c0764a4136A26439b01368f3139C6611J00415c9327k74574a51980
$$ plain form
18983 -277280 73537 226578 164103 -282417 -62887 110965 -124583 212389 250651 184137
18973 184137 263730 -77900 -97438 141086 -45607 -166400 46509 -66984 -139045 82873 227503
18962 227503 -40134 48878 130625 389652 -30936 -283866 134752 47417 -80327 -323419 41491
18950 216595 -241039 182880 29481 -48465 -6261 -42497 -142014 10809 -83076 20060 -207904
18938 -218532 -164849 106074 21175 -82283 -123415 -81997 30312 182482 323554 36716 -161788
18926 -97939 17896 202897 -192598 60713 116437 -608287 146567 55991 -155377 -179301 271224
18914 -76765 -4008 315599 -207136 -57991 58374 -24680 36336 -90850 -288 -173833 171359
18902 168783 -30764 -14136 126439 -201368 -63139 36611 137026 -39327 -313901 -151980
18891b91229J13802l8311r261e6247B31521B68J85363c21561g3362k6095k53153
18880c52610a26564L9407J9080k5442j91956A94701b85480E3505a07769D3280
18869d28433A03801E0794J93589b54615j427C56080F5474N2998P7295p9406E5227
18857A97125J4069n8055g7622N604A06746b34141B78012j00947g8497F4031a96028
18845B24143A04719B7058a61330b2388A01980P2207b46888A4572M6125c9581k5944
18834f5525I9104b7214a0662q952k39k75790A04892K67723D0452R0587a86494
18822B6369b03549G4655O7302F1452M8485F837a14054p6085C78671I7380J74579
18811B71959Q1748i7071K9312I5241a02966j32490A37729a5065k75668A93569
$$ plain form
18891 -291229 -177427 -215738 -224999 -56247 231521 268 185631 -321561 -73362 -99457 -352610
18880 -352610 -126564 -87157 -68077 -93519 -285475 194701 -285480 53505 -107769 43280
18869 -428433 103801 50794 244383 -254615 -256042 356080 65474 118472 195767 116361 55227
18857 197125 211194 153139 -77622 -72018 106746 -234141 278012 177065 -78497 64031 -196028
18845 224143 104719 27058 -161330 -22388 101980 174187 -246888 14572 60697 -39581 -65525
18834 -65525 99104 -27214 -10662 -19614 -19853 -295643 104892 372615 40452 131039 -186494
18822 26369 -203549 74655 141957 61452 109937 6837 -114054 -190139 378671 97380 271959
18811 271959 353707 -97071 -67759 95241 -102966 -235456 137729 -15065 -290733 193569
18800d040o3604j73933K2813e3589A04374c42242g0610p6540r5276F4158a12290
18788a52430D7935f875A14664J18541e6383j53158J01626a4148k72452A66159
18777e3789B39068f8230A11251b27231P7242B07503c56513g1530j5405j17058
18767b03993B1388g5195k70448a29731F997K86901c07060a29216c0865M002A01313
18755A68641f7354C74649F5157i9027I8339l8741d5670j8603n8934f0164j45288
18744b05452k6081A09496D0441Q8419b21192h6623C71732b46075P6158k5127H3498
18732c78203A5168Q1225b04148k31627a93054c8441A59793b88394D2825b34033
18721a55489G4727d2539L773k29629D1337i6750k9134p4545C6127c33789B5503
$$ plain form
18800 -4040 -67644 -241577 -218764 -53589 104374 -342242 -70610 -147150 -242426 64158 -112290
18788 -152430 47935 -6875 114664 233205 -56383 -209541 -107915 -14148 -286600 166159
18777 -53789 239068 -68230 111251 -227231 -149989 207503 -356513 -71530 -86935 -203993
18767 -203993 21388 -75195 -345643 -129731 6997 293898 -307060 -129216 -30865 -26863 101313
18755 168641 -67354 374649 65157 -99027 98339 59598 -45670 -64273 -123207 -60164 -205452
18744 -205452 -231533 109496 40441 128860 -221192 -86623 371732 -246075 -169917 -195044 83498
18732 -378203 15168 96393 -204148 -435775 -193054 -38441 159793 -288394 42825 -234033
18721 -155489 74727 -42539 -38766 -268395 41337 -96750 -125884 -200429 36127 -333789 25503
18709c22218B36419a10603d3496A98301e9757B66971b01621A64028J3006O0069
18699B37103a86696A70458p4311b7090o754r965g230j91518c1182A91747a4399
18687C3841a21038m2847B34274E6863R9159E3581b07653D3951N8043K1021d91117
18675a39617C6242b54004E3589a25292f0664B36561c27778C033L5204J34480a82024
18663A71846a5092m2469p383C61988f32j6456A82233a67641A13572E953K48224
18652B54177b10232d6642j47950H576b56144A49005h0734n4597M7941A13714b08289
18640a98795G2566a92301O0803N7868j34306C6145a57897P3576A19507a15613
18629A64174b12088O1812F6223i6720E2604e7566p9755l4500g3775A40188b94807
$$ plain form
18709 -322218 236419 -110603 -43496 198301 -59757 266971 -201621 164028 177034 237103
18699 237103 -186696 170458 96147 -27090 -33844 -43809 -7230 -198748 -31182 191747 -14399
18687 33841 -121038 -163885 234274 56863 156022 53581 -207653 43951 101994 123015 -491117
18675 -139617 36242 -254004 53589 -125292 -60664 236561 -327778 3033 38237 172717 -182024
18663 171846 -15092 -57561 -64944 361988 -632 -17088 182233 -167641 113572 5953 254177
18652 254177 -210232 -46642 -194592 8576 -256144 149005 -80734 -135331 -87390 113714 -208289
18640 -198795 72566 -192301 -131498 -73630 -207936 36145 -157897 -84321 119507 -115613
18629 164174 -212088 -150276 66223 -96720 52604 -57566 -137321 -171821 -73775 140188 -294807
18617c87243a9413A37719i3980j11040J5973A62749a74958j16955J12787f9468
18606a52826p0153g6135k90207C1517L7274g1182j53650C3530b73385i9941A6332
18594d02987a81706P3397j69192h3595K7899A20436D3877L73080b3149A44627
18583a06614o9420r3014b7645j34819M6104E2895b21280g8348C76920C7911B123
18571b24529N6125A76156M2765a82397H2254P7456a39114A90890a6985j37597
18561a54582C25277G1143R5493A0590a13746p9015O4343B11252a08966A76446
18550a2906k4314m93123J98387i2241a6153I4768c6827j52257q1536M3176j9853
18539b47297g9685j18347a6531O161k70287h5604E0577a22469A64355J16812b52910
$$ plain form
18617 -387243 -19413 137719 -93980 -205020 -189047 162749 -174958 -291913 -179126 -69468
18606 -152826 -222979 -76135 -366342 31517 68791 -71182 -224832 33530 -273385 -99941 16332
18594 -402987 -181706 -108309 -277501 -83595 -55696 120436 43877 416957 -23149 144627
18583 -106614 -176034 -269048 -27645 -162464 -116360 52895 -221280 -78348 376920 37911 2123
18571 -224529 -168404 176156 218921 -182397 82254 159710 -139114 190890 -16985 -154582
18561 -154582 325277 71143 166636 10590 -113746 -192761 -128418 211252 -108966 176446
18550 -12906 -37220 -530343 -331956 -92241 -16153 94768 -36827 -189084 -270620 -227444 -247297
18539 -247297 -79685 -198032 -16531 -10370 -280657 -85604 50577 -122469 164355 281167 -252910
18527A50636k1323b99358n0625a34378j84112c0649F4275K6019b86677K9799E7028
18515c4421I1959a92394d2000h170D083b10907M5478o013A82020a8462F7279J48709
18503B15988p7102f2445p2966A8039b13008o350Q8980n74B69905c9258k47092
18492b86350I4171a00144j01269k9961j31073H6084b01143e1714H5598a71785
18481G6210g6462L4246k67411B22070b93647P4330B3163d4865j79992D8298a73632
18469D7592a96161f634I0941a69830J425a3j9205A42384Q1516a2644k37883a13316
18456D8412J10225a83114A15559J16158H8034a9876A53319a02936j47015E169
18445d25204a30141A98704b0054A66242F394J71317J11169A2215a05441A51051
$$ plain form
18527 150636 129313 -299358 -349983 -134378 -318490 -30649 64275 90294 -286677 -256878 57028
18515 -34421 91959 -192394 -42000 -8170 4083 -210907 -165429 -171442 182020 -18462 67279 215988
18503 215988 138886 -62445 -135411 18039 -213008 -219358 -130378 -130952 269905 -39258 -286350
18492 -286350 94171 -100144 -201413 -231374 -362447 86084 -201143 -51714 85598 -171785
18481 76210 -76462 -42216 -309627 222070 -293647 -219317 23163 -44865 -224857 48298 -173632
18469 47592 -196161 -6634 90941 -169830 -168405 -13 -19218 142384 223900 -12644 -250527 -113316
18456 48412 158637 -183114 115559 231717 88034 -19876 153319 -102936 -249951 5169
18445 -425204 -130141 198704 -20054 166242 6394 177711 288880 12215 -105441 151051
18434b23875A56532b03865i6061E6283b30235B63547a49355J7789e1567A95454
18423B6316J51375F3198R3076d15829h1455a1987D7882a78288A5389J79548d19766
18411A43806a855m9509L023k50961D0994d4865B27257f3322b1421j01552d5409
18399b69549J19095A57420b27400N3865A21852h0733j11739c7192H6723a35372
18388G3047d30052j4511c7794B60976B791J47346C2834a6800A09310F810K03182
18377B09992e869H979c85376A1840J40896d34440A71310a11769k32925a15249
18366A46319D7853J32420E1074a19492A81609g9319l6907d8634j45021e1137J5896
18355c5241F4690O8068e7662G4004d88501a68086l1112d1015h444n405j99338
$$ plain form
18434 -223875 156532 -203865 -96061 56283 -230235 263547 -149355 -131566 -51567 195454
18423 26316 177691 63198 156274 -415829 -81455 -11987 47882 -178288 15389 194937 -419766
18411 143806 -1855 -51364 -48341 -299302 40994 -44865 227257 -63322 -21421 -122973 -45409
18399 -269549 -150454 157420 -227400 -173535 121852 -80733 -192472 -37192 86723 -135372
18388 73047 -430052 -444563 -37794 260976 2791 150137 32834 -16800 109310 6810 209992
18377 209992 -5869 8979 -385376 11840 152736 -434440 171310 -111769 -344694 -115249
18366 146319 47853 180273 51074 -119492 181609 -79319 -116226 -48634 -193655 -51137 -35241
18355 -35241 64690 132758 -57662 74004 -488501 -168086 -199198 -41015 -8444 -13849 -213187
18344b13187B45270b73022f3945q2911A84457h8189j3047K7533A40001a26927
18333b61047H5366a05437H7873a45830j40684f4115K8946O976k44179e6869k57381
18322c14250A31823k7875Q1212g2909H5802b64585E276K77281a79232j4820j5582
18311b09634A21436Q887a71415B28657c4847H2807K3883J59857G7687b58643I0679
18299c06887q1012d1587k3639A24716D0562M46270k28786j04873o2703M682d5955
18287C2341e2306B33479H8858d4319o1558n4470j13328I355a45199p2392R8220
18276a19371B1665h2934B57458d09947A7170c21050f8301B51222J7313a26232
18265b90126D2514P9950A9108J20101a54600b4286B25372a85365q9141b4980A17912
$$ plain form
18344 -213187 245270 -273022 -63945 -146856 184457 -88189 -101236 -73703 140001 -126927
18333 -261047 85366 -105437 87873 -145830 -286514 -64115 -35169 -28193 -272372 -56869 -314250
18322 -314250 131823 103948 185160 -72909 85802 -264585 5276 282557 -179232 -194052 -209634
18311 -209634 121436 130323 -171415 228657 -34847 82807 106690 266547 77687 -258643 90679
18299 -306887 -387899 -41587 -65226 124716 40562 486832 258046 153173 90470 95152 -45955
18287 32341 -52306 233479 88858 -44319 -105877 -160347 -273675 9355 -145199 -217591 -119371
18276 -119371 21665 -82934 257458 -409947 17170 -321050 -68301 251222 268535 -126232
18265 -290126 42514 122464 19108 139209 -154600 -24286 225372 -185365 -274506 -24980 117912
18253A15195e9472j62807B7106a48350e4303E1154k879I711b36005E6201a78280
18241A63076h1985A8940c18568H0397A9910O7499a59226J6561a8411k988A8829
18229G9903J06880a13942j9209A0253f19677B42304D9424c9488J3164A5919b81477
18217G979a16692b2447M539B08527l8052K4349H766a08976E1573b24177F3577
18205d79315a99742j0745k2091C40427A6745J68095c348j85427j30519J09713
18195b09581j2286N5694l3152F1220J8948a2672B66944a56383k0064I6695J91586
18184B88281j41496b2854o9048M1629k04079a03439D54172A56468A484d0286l68184
18173d08470c9814m00258a89383R1593A62898a07745A53169a09906M1176k34855
$$ plain form
18253 115195 -59472 -222279 27106 -148350 -54303 51154 48275 9711 -236005 56201 -178280
18241 163076 -81985 18940 -318568 80397 19910 87409 -159226 -142665 -18411 -21399 18829
18229 79903 186783 -113942 -133151 10253 -619677 242304 49424 -39488 -26324 15919 -281477
18217 7979 -116692 -22447 -17908 208527 170475 194824 8766 -108976 51573 -224177 63577
18205 -479315 -199742 -210487 -232578 340427 16745 184840 -3348 -188775 -319294 -209581
18195 -209581 -221867 -166173 -199325 61220 80168 -12672 266944 -156383 -176447 96695 288281
18184 288281 146785 -22854 -91902 -50273 -254352 -103439 454172 156468 1484 -40286 -408470
18173 -408470 -39814 -440072 -189383 -97790 162898 -107745 153169 -109906 -68730 -303585
18163c03585A47305a3059m1580F1537J03871D699J50196a92251P2787l0477c5834
18151h2314A494c5681p840n4041C58153E7790K4508C5511c19333E1129a37744
18139a07699A20622n2146d1726A2468a53064c8319A00258c2721j0664j28852d2363
18127c0327D2462A9600g9282A01128a33807N476d4285C7705c4158k72407B12401
18115G5044A8743a08986B11059b19260C26207a87548R3445j8789F8139o52a62735
18103e9899j77807A62280A3162J80443a20837j51831g2951A12214O7083f1006
18092D2268J454a38214j86360B48607M9871i6592J649j37824a4875F5788L62593
18081D28381A71484o5318b87914C09828B4051c0069a4375l9216j00929N5161L3716
$$ plain form
18163 -303585 147305 -13059 -54639 61537 165408 4699 154895 -192251 -119464 -149941 -35834
18151 -82314 1494 -35681 -43521 -97562 358153 57790 82298 35511 -319333 51129 -137744
18139 -107699 120622 68476 -41726 12468 -153064 -38319 100258 -32721 -43385 -172237 -42363
18127 -30327 42462 19600 -79282 101128 -133807 -128331 -44285 37705 -34158 -306565 212401
18115 75044 18743 -108986 211059 -219260 326207 -187548 -94103 -112892 68139 67487 -162735
18103 -59899 -237706 162280 13162 193605 -120837 -272668 -72951 112214 179297 -61006
18092 42268 43722 -138214 -324574 248607 298478 -96592 -94943 -232767 -14875 65788 428381
18081 428381 171484 106166 -287914 309828 24051 -30069 -14375 -53591 -154520 -99359 -65643
18070f5643B60388a68693i22l6614K619a3037D3970b60369b0635j68786Q7055
18059a02366C55989j39323a15139b0845p1042q7402a4584m9038j88400h2618j68661
18048b51279N3454C6093a95574N404l0911j40607a12058b1895q8311A01680h0811
18036A19702G320b6595o3462j05332j09633B06576p9473a48135j25574J11556
18026a62153j26479A57144g2253j67072B33762e8466I7490c205j28605F494R7791
18015A04285d29796a51654O0373A58105F5395a63985A61352K0018B0584L23366
18005C43950l9957c2743j06464C5186M6347h3048d0430F1714a44745B28232a75897
17993A1389g4437j80758b323m7443A89893J14944o3869C1671g5256E13469e5310
$$ plain form
18070 -65643 260388 -168693 -922 -37536 -34917 -13037 43970 -260369 -20635 -189421 -102366
18059 -102366 355989 216666 -115139 -20845 -91887 -179289 -14584 -63622 -252022 -82618 -251279
18048 -251279 -197825 36093 -195574 -190170 -221081 -361688 -112058 -21895 -110206 101680 -80811
18036 119702 7320 -26595 -90057 -195389 -305022 206576 127103 -148135 -273709 -162153
18026 -162153 -288632 157144 -72253 -239325 233762 -58466 97490 -3205 -131810 6494 104285
18015 104285 -429796 -151654 -91281 158105 65395 -163985 161352 181370 20584 343950
18005 343950 303993 -32743 -139207 35186 81533 -83048 -40430 61714 -144745 228232 -175897
17993 11389 -74437 -255195 -2323 -49766 189893 304837 240968 31671 -75256 513469 -55310
17981h0669j69443a12246A21341a97870m3510B19799a0885k40480I3684a79165
17970c04823d8977j51645g0137B19258a15756b6294j10728J3044f0858G9389P9244
17959A58633c20693J00563C23460a56802C516a81865N9808A51039a24542G6944
17948B41510b44643A84746b04673D56262b06801N0160G8950b29205B36606d46437
17937H4236b96106a08671d0624A91514H3736e3303B6073b53833C8652a60113j15238
17926b75351N6840B5844j2645J20809C8722A6800g2796j49225d0659l96431a51417
17914B7408b33194e5923F7311B396K19050n5849e2745A44293n0826a17104B16482
17902a89838G9056K23699C4064b23487F1727c303j30933P104A89364d34966h4714
$$ plain form
17981 -80669 -250112 -112246 121341 -197870 -241380 219799 -10885 -251365 93684 -179165
17970 -304823 -48977 -200622 -70137 219258 -115756 -26294 -137022 -123978 -60858 79389 158633
17959 158633 -320693 -220130 323460 -156802 3516 -181865 -122057 151039 -124542 76944
17948 241510 -244643 184746 -204673 456262 -206801 -156641 78950 -229205 236606 -446437
17937 84236 -296106 -108671 -40624 191514 83736 -53303 26073 -253833 38652 -160113 -275351
17926 -275351 -218511 25844 13199 134008 38722 16800 -72796 -222021 -40659 -437090 -151417
17914 27408 -233194 -55923 67311 2396 221446 165597 -52745 144293 93467 -117104 216482
17902 -189838 79056 302755 34064 -223487 61727 -3303 -134236 -127132 189364 -434966 -84714
17890A2676M3759k2168f628o4699B27300j06419b33496h1375J1010B72155i0934
17878C44053f0668C33817c73763A42042i7453A88570l580b77545B43159c81677
17867d6833E3340a47108B08781l4440k9690m5264C3711J2592a76489A17353f1234
17855A04691g4887j48269I0113f1183j93621B06638m3005c28065A24378a13537
17844c45711J498N8671a3982A27772O2946F7842J58343D5259B1074b14044A99953
17832B19250l0012F76P0821a50254a8173A80859o2504d2071P537E8460c397A94659
17819I7214a22389K0300k34123R7224J4833B41924A6989a76050C14937E5493J94438
17808B49931c68071b8627j19382B64036h1670H9752l0494d5334j35539A33184
$$ plain form
17890 12676 56435 34267 -6628 -71327 227300 120881 -233496 -81375 -70365 272155 -90934
17878 344053 -60668 333817 -373763 142042 -97453 188570 184990 -277545 243159 -381677
17867 -46833 53340 -147108 208781 174341 144651 99387 33711 46303 -176489 117353 -61234
17855 104691 -74887 -223156 90113 -61183 -254804 206638 163633 -328065 124378 -113537
17844 -345711 -344213 -285542 -13982 127772 190718 67842 226185 45259 21074 -214044 199953
17832 219250 189238 676 71497 -150254 -18173 180859 118355 -42071 -34534 58460 -3397 194659
17819 97214 -122389 -102089 -336212 -238988 -224155 241924 16989 -176050 314937 55493 249931
17808 249931 -368071 -28627 -148009 264036 -81670 89752 59258 -45334 -180873 133184
17797C0103c10857c4820k54803j4300A79767J623F6780P363a91115i1714b6210
17785c25679a10849A42124R910p2505N5409b96116K1587F8401C2225J43776f812
17773i410D1085a56981H621J61668c31321h1355F7711a39367o9116m9388B46265
17761A58753G8563J7124b6093B93164j24998d9604k21480G244a34346g156B3949
17749F9494L0639b93375a40641f9784A40354k5673b68961h562B06470A9481E873
17737e7691C36437a57758A1502J06371d2237j37487G9232a41835n6547M5560m9704
17726b02526C47753q2154N2617a59383A70236q2098c0322j18177j16300m1060
17716c05859E796J74219p9964a18759e4588C2471c10028a19093A27956J48936
$$ plain form
17797 30103 -310857 -34820 -289623 -303923 179767 181390 66780 74143 -191115 -91714 -26210
17785 -325679 -110849 142124 152034 79529 134938 -296116 -274529 68401 32225 176001 -6812
17773 -9410 41085 -156981 8621 170289 -331321 -81355 67711 -139367 -208483 -257871 246265
17761 158753 78563 95687 -26093 293164 168166 -49604 -271084 7244 -134346 -7156 23949
17749 69494 100133 -293375 -140641 -69784 140354 114681 -268961 -8562 206470 19481 5873
17737 -57691 336437 -157758 11502 117873 -42237 -179724 79232 -141835 -198382 -152822 -202526
17726 -202526 347753 265599 318216 -159383 170236 88138 -30322 -148499 -264799 -305859
17716 -305859 5796 180015 100051 -118759 -54588 32471 -310028 -119093 127956 276892
17706B76892g5420j02048A77229L6379k5452a0806C29870A4235a06072m3502H031
17694B9057e6995A63659k6169i9189B15033f8084L545j08988M0889E2190r167
17683D3023a34969c1944m3417K7280D916i3677B26540a11482m4154A64423o4123
17672A00300J39742a512A08864J76369c31344a05678l5729l17791j83363B20552
17661a01005A67701G5296a24945b6994k21986B40071n3710K1747p177f3399j00899
17650a64298L4166h744C2462M9326A9558J24573L4932E0641b2788A1597a4883
17638E9909A4626K98575e3088G7756f4151A52075J81284E2818K66373G949K18415
17627B26364k9806N4376q6787c28623h3151A69387n9721a03906I9216g9228j3076
$$ plain form
17706 276892 -75420 -177468 177229 213608 188156 -10806 329870 14235 -106072 -149574 8031
17694 29057 -56995 163659 137490 -99189 215033 -68084 -64539 -173527 -132638 52190 43023
17683 43023 -134969 -31944 -75361 -48081 4916 -93677 226540 -111482 -155636 164423 100300
17672 100300 240042 -1512 108864 285233 -331344 -105678 -141407 -459198 -642561 220552
17661 -101005 167701 75296 -124945 -26994 -248980 240071 186361 208108 200931 -63399 -164298
17650 -164298 -130132 -8744 32462 81788 19558 144131 179063 50641 -22788 11597 -14883
17638 59909 14626 313201 -53088 77756 -64151 152075 333359 52818 319191 7949 226364
17627 226364 196558 250934 164147 -328623 -83151 169387 109666 -103906 99216 -79228 -92304
17616i2304C2092a8784B61081i6223d3493I3010L3445e12482A8089d80322A11672
17604h1645j71404H6176A1186a57809J0926j2283O2227D6968b12320C08630M3346
17593C51976E762P4405J92538c29473c4545J730B03359b3536A35118J22061B5614
17581G1530J26097c00443A90509h9672a4285o4683C99834A48262J8437b7578j24226
17570a51804B08438O8365C3495B641M6567g0167j43116f0551C6123d2459j57537
17559a99996O1168B3783a09612H2506f3730E0349Q6894J25358A07937j3716j3328
17548H0893K95417j85616P8870m9662G1871a21949A34137e5624l205a1328B24346
17536A78506g2571L0532C44731a33398j27678H4064K56926i4413I872a9295D6052
$$ plain form
17616 -92304 32092 -18784 261081 -96223 -43493 93010 126455 -512482 18089 -480322 111672
17604 -81645 -253049 86176 11186 -157809 -146883 -159166 -96939 46968 -212320 308630 351976
17593 351976 5762 80167 272705 -329473 -34545 -32815 203359 -23536 135118 257179 25614
17581 71530 197627 -300443 190509 -89672 -14285 -78968 399834 148262 166699 -27578 -151804
17570 -151804 208438 276803 33495 2641 49208 -70167 -213283 -60551 36123 -42459 -199996
17559 -199996 -138828 23783 -109612 82506 -63730 50349 137243 262601 107937 94221 80893
17548 80893 376310 190694 269564 219902 71871 -121949 134137 -55624 -58829 -11328 224346
17536 178506 -72571 -42039 344731 -133398 -261076 84064 340990 -94413 9872 -19295 46052
17524A90950E9867P234Q8182A5451L51432d7909E18K43592I1279R4079J25287
17513C10645G7088J54298H3926a13384C9471h2744B2349a17636J0762I6316L2526
17502A28842i8817D5812K37060b6846P556D52091A78850M8597m3851b30B77166
17490A06194J78890G596c64243B32255b44684B53508l1161r566E9874O2529D605
17478F7259a37174B78991C7180L1327C3868L26688c38539D45562B04133F6069
17467A10766J10454H3309A2455K3504a41679A50996J07046D5224e5713C11886
17456B29564J40826f508D73233d9826C16650m9565A14556K2478B0080J88072J04425
17445C12577B187a65474h0207C83730A23399J27567J88738j19412m5402E8841
$$ plain form
17524 190950 59867 67101 155283 15451 366883 -47909 518 244110 91279 185358 310645
17513 310645 77088 231386 83926 -113384 39471 -82744 22349 -117636 -106874 96316 128842
17502 128842 -98817 45812 282872 -26846 -19290 452091 178850 227447 183596 -230 277166
17490 106194 285084 7596 -364243 232255 -244684 253508 222347 212781 59874 122403 4605
17478 67259 -137174 278991 37180 68507 33868 360556 -338539 445562 204133 66069
17467 110766 221220 83309 12455 35959 -141679 150996 258042 45224 -55713 311886
17456 229564 370390 -6508 473233 -49826 316650 267085 114556 137034 20080 208152 312577
17445 312577 2187 -165474 -80207 383730 123399 250966 439704 320292 274890 58841
17434C94499j34616l093Q032d917F0801J77700L9844G998N03085l3806j06304
17423C70973A15633M0124K2038L5503J6021H9190J49373J57932j0476j59417D9041
17411b5926B24623R0448A50750o0576P0952a36002A65388k8368B316b60856E8365
17399A68303B8004b8898Q988B6496f8531A74332l2493D0510J74292J845o7579
17388A49068j2490J65773a02811G9416O04901k22971G811K42191R9697j59393
17378A90306N1338O3080A19680J91546a91945g688B21224B3187R2629P578c69393
17366A91978a19275j3490A32387K02122K382a25455D4224K53984A18450D293K33021
17355B37314C2890a30438B16310f0428j90643A03407J780O2166M0664J59658l6486
$$ plain form
17434 394499 259883 256790 264822 -4917 60801 238501 278345 7998 511083 477277 370973
17423 370973 115633 155757 177795 213298 229319 89190 238563 396495 386019 226602 49041
17411 -25926 224623 315071 150750 90174 161126 -136002 165388 137020 2316 -260856 58365
17399 168303 28004 -28898 -19910 26496 -68531 174332 141839 40510 214802 216647 149068
17388 149068 136578 302351 -102811 79416 684317 461346 7811 250002 349699 190306
17378 190306 241644 304724 119680 311226 -191945 -7688 221224 23187 115816 123394 -369393
17366 191978 -119275 -132765 132387 334509 336891 -125455 44224 298208 118450 4293 237314
17355 237314 32890 -130438 216310 -60428 -251071 103407 105187 167353 208017 367675 331189
17344C31189A05551J28326j15429h978A66787N9418I8509a4493D6390O8394L94948
17333E09732r2017o4833p7517C0769K65967a20954B74311A5963G713L12522j04690
17322B15545C5710K17456P0434J48393j04718F5275a43921F7407J77536L06214
17312E51157A81118R7201j18024K48387C8567J47380Q7490J0061A34957D3982
17301B91045a85583B00638C5656K07924A05617M44685a19684D1220P5902J19349
17291B36471k7897K62438j87202l7429J67188A21291M8271a7189n6392J7235B50847
17279A00032J36186m1255b08182A60656g7875A02886h4021D39615j80403a6948
17268a76161D24217I5904J38145j15327D0870J96334M5150K7383J32010N1507
$$ plain form
17344 331189 105551 233877 118448 -8978 166787 226205 98509 -14493 46390 114784 509732
17333 509732 417715 352882 275365 30769 296736 -120954 274311 15963 7713 320235 215545
17322 215545 35710 253166 323600 471993 367275 65275 -143921 67407 244943 551157
17312 551157 181118 278319 160295 408682 38567 185947 273437 283498 134957 43982
17301 291045 -185583 200638 35656 243580 105617 550302 -119684 41220 117122 236471
17291 236471 208574 471012 283810 246381 413569 121291 169562 -17189 -73581 -56346 250847
17279 100032 236218 194963 -208182 160656 -77875 102886 -84021 439615 259212 -16948
17268 -176161 424217 95904 234049 118722 40870 237204 282354 309737 441747 493254
17258D93254j39757q5039k0187K22997k33330m9859K01407J57972A14228K81316
17248C95544m5306n1144i0512I9181J42295H6102N4578a09731E4687R8891d1581
17236b1075j21950N0777A51677j7218J40489K6490L1137I5431b80882B32647b7297
17224B9242N76985j21916H850N6819R6143K37473A82749Q1964J60883J25697A74686
17212B45521k912K5566j18486m4544M8789n8497J24375J59958d9781E57822A91249
17200D48095j81827Q7979q0912A09831J72903O9619L88784C7443R5430o3706K03171
17189B72338j14287p0237j3235P061J68684Q8010F1751K37435N967r4050b3085
17177A83974K66902A58071O4517L7446q2072R6713Q1969L38715C26603k5791q3044
$$ plain form
17258 493254 353497 268458 248271 471268 237938 188079 389486 547458 114228 395544
17248 395544 350238 299094 -90512 99181 241476 86102 140680 -109731 54687 153578 -41581
17236 -21075 -143025 -92248 151677 134459 274948 301438 332575 95431 -280882 232647 -27297
17224 29242 606227 484311 8850 65669 161812 399285 182749 264713 425596 551293 174686
17212 245521 242609 268175 149689 105145 153934 95437 219812 379770 -49781 557822 191249
17200 448095 266268 354247 273335 109831 282734 352353 741137 37443 132873 69167 272338
17189 272338 158051 87814 74579 81640 250324 338334 61751 299186 305153 211103 -23085
17177 183974 450876 158071 222588 260034 177962 274675 356644 695359 326603 300812 217768
17166B17768q9893m4284c9567E45523o8381A43739L42121D8640M31527j5912J7874
17155D82129k16838J76154A88977N0345L73800j18512N4236f8019C49222j49315
17145A99907a54833B53407L88531k91367J25453A85824J84950r0291K76516B12981
17134A80412J14832k5178J68291k02210Q9317J00166j12993Q8647K17612N0601
17124F69497B46701N5733L35564B07917K24302j24727J05434q3633K25336A6075
17113A83798J48198o6322A16389L11498K9008j16182j21574L09787A39536K43381
17103C82917j36281O8991J3130j5509K05313j89823Q9888j50228K46453j64111
17093C50740J13099J05732l0858J9454p5563J03087B01822K45193j20212p3009
$$ plain form
17166 217768 127875 83591 -39567 545523 477142 143739 485860 48640 480167 464255 482129
17155 482129 265291 441445 188977 239322 613122 494610 548846 -68019 349222 199907
17145 199907 -154833 253407 641938 350571 476024 185824 370774 280483 556999 212981
17134 180412 295244 270066 438357 236147 325464 425630 312637 401284 618896 669497
17124 669497 246701 302434 637998 207917 432219 307492 412926 329293 554629 16075
17113 183798 331996 265674 116389 427887 456895 340713 219139 528926 139536 382917
17103 382917 246636 315627 328757 313248 518561 328738 418626 268398 514851 350740
17093 350740 463839 569571 538713 558167 482604 585691 201822 447015 326803 253794
17083B53794M61896p7195A94561L39085B41515J68209K9263j31801K9104M7346
17073C83636o4770J04456L9515n5414m0088j845r8065L84827K06138C96649J84877
17062E81526J72049k49590q3033j30797M19134C10519L15875j39869K07909N2462
17052G46896k42408K11252B66764M13899r3476k0410q8727K43517j26527k82348
17042C12692L05282p9925K78482l85275K62108L4217P668B48807O06776C50223
17031B23991L26029K01589j68176L0828J17469N7514K15661r1298l78360K01628
17021G36875o0922R4538P0822l72276J31825l3874L49284m51585K94436K30499
17011I89622m00642Q7521R3207k40118J67207j81258M60872k34306J00961j64434
$$ plain form
17083 253794 715690 638495 194561 533646 241515 409724 438987 307186 336290 383636
17073 383636 318866 423322 462837 407423 367335 365490 267425 652252 858390 396649 581526
17062 581526 753575 503985 420952 290155 709289 310519 626394 486525 694434 746896
17052 746896 504488 715740 266764 680663 587187 566777 478050 721567 595040 312692
17042 312692 617974 538049 816531 431256 693364 727581 735249 248807 855583 350223
17031 223991 550020 751609 583433 614261 731730 789244 1004905 913607 535247 736875
17021 736875 675953 770491 841313 469037 600862 566988 916272 464687 759123 989622
17011 989622 588980 676501 769708 529590 696797 515539 976411 742105 843066 678632
17001F78632J43124j7008j1876q154J85192k37826K99612j48999J13003D74386
16990A156437J2992m19727j43831J74852J23245O8403M42109o58256J8038r650
16980G64612L32085j23763P705q9497o1417Q6930R3250r4967K25981j17181j21828
16969I01910k4333k3107K33662l8315R0574m19019N18350n9880k90974j63282
16959G25586N92998j54717j83677R0028J61892o8834l72574J883N89373l87909
16949I94049L1665M78554j85787j37701J70893n67929K59996K33233L43880n07409
16939A113444K4326K66809L2749l75977K72605k24615L00674k34111J93808j3994
16929A355718J21603m9995j12309K61604j19457k40690K3146N5983M27875k50612
$$ plain form
17001 678632 821756 804748 792872 784718 969910 732084 1031696 882697 995700 474386
16990 1156437 1169429 749702 605871 780723 903968 972371 1414480 756224 774262 764612
16980 764612 1096697 972934 980639 891142 829725 916655 1009905 914938 1140919 1023738 901910
16969 901910 877577 854470 1088132 1049817 1140391 721372 1239722 1179842 888868 725586
16959 725586 1318584 1163867 980190 1070218 1232110 1163276 790702 792585 1381958 994049
16949 994049 1025714 1504268 1318481 1180780 1351673 783744 1043740 1276973 1620853 1113444
16939 1113444 1137770 1404579 1437328 1061351 1333956 1109341 1410015 1175904 1369712 1355718
16929 1355718 1477321 1427326 1315017 1576621 1457164 1216474 1239620 1295603 1723478 1472866
16919A472866j57408L85960q8594Q623j03428o4711j73610M69473j01523j01414
16909A546234K36794M9526j77125L33345K09245j26250p9044k0923p8170q7551
16899A806081K8229K38707m28529K24851K66477j50391j52232K67262L8994j32304
16889B007145J16606P4826l13027J80366r279J54056P0109k20690M28751j09054
16879B379809K94075k57362J47610j47791K02472O1041l87907K24347p9665J95039
16869B631668L7753K3120K04480J47923k18013k2348L57894j83104J61027k1973
16859C118427L3185k50441K66250p813K49591J6323r4305J83647K90232k91761
16849C513335K274j28106K03203L49828l91779O04857j27161J9097j69451M67910
$$ plain form
16919 1472866 1315458 1701418 1612824 1621447 1518019 1453308 1279698 1749171 1647648 1546234
16909 1546234 1783028 1832554 1655429 1988774 2198019 2071769 1992725 1971802 1893632 1806081
16899 1806081 1834310 2073017 1644488 1869339 2135816 1985425 1833193 2100455 2139449 2007145
16889 2007145 2123751 2198577 1885550 2065916 2056637 2210693 2280802 2060112 2488863 2379809
16879 2379809 2673884 2416522 2564132 2416341 2618813 2679854 2291947 2516294 2436629 2631668
16869 2631668 2669421 2692541 2897021 3044944 2826931 2804583 3162477 2979373 3140400 3118427
16859 3118427 3151612 2901171 3167421 3159608 3409199 3425522 3331217 3514864 3805096 3513335
16849 3513335 3515609 3387503 3590706 3940534 3548755 4153612 4026451 4045548 3876097 4344007
16839D344007J43934l28687J47002l578N7344K24082J52257O2578L9459M0305
16829D878703J17414j62342N48144M2295j49535r6604L94665j5209K13082l9215
16819E731398K05684J87297R7994j47107O98198k78423M71320p552j14342K73748
16809G118215L4775J06658M38687j77311N39157K22890J6141L20664J44972L53717
16799I118565K1592K21564o004L45534M75767L08501N6666K48O74365j57433P39086
16788A1798451J97195L11718J27973N37696K54581M42321K82934L80518P13758
16779A5047145O00297M16518K67387P39851L99807O32718K68225Q20589Q91689
16770B0084226L87185N62170Q53640N03355J297465O46647Q54340R71600J085897
$$ plain form
16839 4344007 4487941 4159254 4306256 4302678 4360022 4584104 4736361 4798939 4838398 4878703
16829 4878703 4996117 4833775 5381919 5424214 5274679 5178075 5572740 5557531 5770613 5731398
16819 5731398 5937082 6124379 6222373 6075266 6773464 6495041 6966361 6958809 6844467 7118215
16809 7118215 7152990 7259648 7698335 7521024 8060181 8283071 8299212 8619876 8764848 9118565
16799 9118565 9140157 9361721 9355717 9701251 10177018 10485519 10542185 10542433 11216798 11059365 11798451
16788 11798451 11995646 12307364 12435337 12973033 13227614 13669935 13952869 14333387 15047145
16779 15047145 15647442 16063960 16331347 17071198 17471005 18103723 18371948 19192537 20084226
16770 20084226 20471411 21033581 21887221 22390576 23688041 24334688 25189028 26160628 27246525
16761B7246525J059288J318554J288079J231859J344243J093471J611411J524796
16753C7718226K048498J427890J880472K217239K135355K402338K352506K418661
16745E4601185K740259L008008L527240K920595L850207L587843M171252M306305
16737H2712894M584823M956982N176167N104864N229624O326233O211425N825772
16729A26128784O044232O389180O320935O266709N902663N559397N211541M356207
16721A72179648L346423L296657J704780P92121J79523j083864k362355k740161
16713A75312772l664574m554806n388613n841943n711767o310477n963587o306936
16705A31570069o636005o172184o275356n831248n515392n621038n010019m648304
$$ plain form
16761 27246525 28305813 29624367 30912446 32144305 33488548 34582019 36193430 37718226
16753 37718226 39766724 41194614 43075086 45292325 47427680 49830018 52182524 54601185
16745 54601185 57341444 60349452 63876692 66797287 70647494 74235337 78406589 82712894
16737 82712894 87297717 92254699 97430866 102535730 107765354 114091587 120303012 126128784
16729 126128784 132173016 138562196 144883131 151149840 157052503 162611900 167823441 172179648
16721 172179648 175526071 178822728 180527508 181319629 181499152 180415288 178052933 175312772
16713 175312772 171648198 167093392 161704779 155862836 150151069 143840592 137877005 131570069
16705 131570069 124934064 118761880 112486524 106655276 101139884 95518846 90508827 85860523
16697H5860523m794047m309416l674428m180720l768626l065888l188765l197957
16689E5680676k215348k749932k664916k121821k569568j461999j953786k146687
16681C7796619j289051j703932j487180j459153j153045j333253j513479q46699
16673B7010827r05410q09676j428894n61336j255175n83059o64519l26587r19367
16664A9556804r84661l11081p44281p13698q14797l87256l93761m47332m24779
16655A4335158l87512p06292j5763m30228k05279p17453n47043J42273k45968
16646A1221893l31087k13652k23210l58843m33137l85538k77002q2309m01506
16637H515609m248j88541J49185n02968n91167J09126L3155o20820l17977M28875
$$ plain form
16697 85860523 81066476 76757060 73082632 68901912 65133286 62067398 58878633 55680676
16689 55680676 53465328 50715396 48050480 45928659 43359091 41897092 39943306 37796619
16681 37796619 36507568 34803636 33316456 31857303 30704258 29371005 27857526 27010827
16673 27010827 26105417 25295741 23866847 23305511 22050336 21467277 20802758 20476171 19556804
16664 19556804 18572143 18261062 17516781 16803083 15988286 15601030 15207269 14759937 14335158
16655 14335158 13947646 13241354 13225591 12795363 12590084 11872631 11325588 11467861 11221893
16646 11221893 10890806 10677154 10453944 10095101 9661964 9276426 8999424 8917115 8515609
16637 8515609 8511361 8322820 8472005 7969037 7377870 7486996 7520151 6899331 6581354 7010229
16627G010229m67952J14244m8796k9239k26534l35063j20627L20727n82405R6248
16617E730832o8752p6432l12080j03209k56354K14177l18242K60627k66026j66537
16607D638004l10249J35149K09925l90982L2248n26511M62588r4673J79144m5595
16597D289048k64815j31152m62549M58690n71493L91783k38591l05143j44751
16588C021027L04369k2479J01982m46273J66882J52006q2084n79940M50362k57071
16578B808781J84168l20185j1551J92789j86442J59850n08529R6961J32056j83358
16568B364540j05494J23725K3402J87876k37262k9797j45936o6954p1081J34088
16558B177107K7459J24228j74226j41211k98349K82451R3571r3701p3330J45767
$$ plain form
16627 7010229 6542277 6656521 6607725 6578486 6351952 6016889 5896262 6216989 5634584 5730832
16617 5730832 5662080 5585648 5273568 5170359 4914005 5128182 4809940 5070567 4804541 4638004
16607 4638004 4327755 4462904 4672829 4281847 4314095 3787584 4250172 4155499 4334643 4289048
16597 4289048 4024233 3893081 3430532 3889222 3317729 3709512 3470921 3165778 3021027
16588 3021027 3325396 3302917 3404899 2958626 3125508 3277514 3195430 2615490 3065852 2808781
16578 2808781 2992949 2672764 2661213 2854002 2667560 2827410 2318881 2415842 2547898 2364540
16568 2364540 2259046 2382771 2406173 2594049 2356787 2326990 2181054 2114100 2043019 2177107
16558 2177107 2204566 2328794 2154568 2013357 1715008 1997459 2091030 1997329 1923999 2069766
16548B069766m71589J49371K065J34077r2049J49069l28166J78243j93864j71520
16538A425403N78919m17441j87033J47853l8810l07672N82635l0679k55495P3816
16528A571496m0878j2980k12241J12577K25344k03489N8314k71806M21611k44730
16518A403218L00548n46278J14121j54539m9586K5381j11641M21463l66865J80220
16508A216042j1688Q9781k58381K66655l58249J16545K5422L3941Q0317l57745
16498H42640q2848O54724l15209R6558J14453l49985K07854k23044n4684j554
16488H88905J96066N1641m26982K97916L99329l72023k72965M92708m68852K06740
16478I92483K59268j77735k39527K9942j02210n6782K35626l98401L02907N00128
$$ plain form
16548 2069766 1598177 1747548 1749613 1883690 1791641 1940710 1612544 1790787 1596923 1425403
16538 1425403 2004322 1586881 1399848 1547701 1508891 1201219 1783854 1753175 1497680 1571496
16528 1571496 1530618 1517638 1305397 1417974 1643318 1439829 1498143 1226337 1647948 1403218
16518 1403218 1703766 1157488 1271609 1117070 1067484 1092865 981224 1402687 1035822 1216042
16508 1216042 1204354 1294135 1035754 1302409 944160 1060705 1086127 1120068 1200385 842640
16498 842640 759792 1414516 1099307 1195865 1310318 960333 1168187 945143 890459 888905
16488 888905 1084971 1136612 709630 1007546 1406875 1034852 761887 1254595 785743 992483
16478 992483 1251751 1074016 834489 864431 762221 705439 941065 542664 845571 1345699
16468A345699m85249l62619K53864K289J80673m55725L02980J50591j52786M1778
16458H21495j71906j77755Q42061E89072K60348k29547J61150k6722j61304J93367
16448G86364l00971J8739K67764r3391J06483k31698Q4489k38850K65518l27886
16438C36561j1036K57237K9693J32571C39258N7124J28914p1935A78768L86423
16428E65191J71669J6727P3356j10779j89097A24405M82589n8949k59391J29790
16418D18444n6609L6562N0510J05789j4281B27531M24850B65192J36750l5952
16408C65990J82996r2528l3621j35226n0210K05654N8708K6658A77368J93342
16398C70710P6836r4323L81222o3527j8703l07785K28337o4247M8692j14793L1325
$$ plain form
16468 1345699 860450 497831 751695 753984 934657 478932 781912 932503 779717 821495
16458 821495 649589 471834 1313895 589072 849420 619873 781023 754301 592997 786364
16448 786364 485393 504132 771896 678505 784988 553290 637779 398929 664447 336561
16438 336561 325525 582762 612455 745026 339258 396382 525296 453361 178768 565191
16428 565191 736860 753587 826943 716164 527067 124405 606994 548045 288654 418444
16418 418444 361835 398397 448907 554696 540415 227531 652381 265192 401942 365990
16408 365990 548986 456458 422837 287611 237401 443055 501763 528421 177368 370710
16398 370710 447546 353223 734445 670918 652215 344430 572767 508520 557212 442419 473744
16387D73744P2751J65390k44339A66895K51831j2144j28237K17107K207j13361
16377C84298H3377J26246P6513J75246p8038k7855A08818K85050j06047a23817
16366B83927G4908J51534L17425B63080R4718r3553J23192j12680n0828P4079
16356B98008F2243K15524J52969n9942C0258K10986L88884B05016J12971A24632
16345C48357j4450j08098J06449A62135K88868j50168j09197L13695B03609O1678
16335B65287L2823R003F0812L40285j18780P1449Q3733I2593J11758k7513C8104
16323B90193J83864A08478J66801J37778I6372K617E13K99019M1102n144H8981
16311C90533A39986a18231B65453M4704D0714J16880O4601A0154K13163j02444
$$ plain form
16387 473744 546495 711885 467546 166895 418726 406582 278345 495452 497659 384298
16377 384298 83377 209623 286136 461382 383344 355489 108818 393868 287821 -123817
16366 283927 74908 226442 543867 263080 357798 264245 387437 274757 223929 298008
16356 298008 62243 277767 430736 370794 30258 241244 630128 205016 317987 124632
16345 348357 333907 225809 332258 162135 451003 300835 191638 505333 203609 265287
16335 265287 298110 307113 60812 401097 282317 353766 437499 92593 204351 176838 38104
16323 290193 474057 108478 275279 413057 96372 98989 513 299532 340634 335490 88981
16311 390533 139986 -118231 265453 310157 40714 157594 222195 10154 223317 120873
16301A20873O7355q6680K34630A06405J35482J42888j68573M0477j05153J79297
16291C30823F6302J61662B4928Q1625A5324J33521R7103l5265L48590I1031J06863
16280A97894P5448N2185A51336K84661A88665J55965A10752K27292j14530P2760
16270B96274J51596P0513q6916B4263a85793A53252J74002M6864J01892B04183
16259A22009d7581B55386b20678B9167J30129M65699G6911J27930A3501L047J22738
16248A39286m9255B1604K42381n4310a77114h6646e724A37183e652D32948A71520
16236A68824L35470J20055B67389c67849F195f8119I3283J77764a1087B47703
16225c28962Q8202A00323C7219J57210Q5966H4728J18666A5294i1938H8785Q847
$$ plain form
16301 120873 188228 101548 336178 106405 241887 384775 216202 256679 151526 330823
16291 330823 66302 227964 24928 106553 15324 148845 245948 210683 559273 91031 197894
16280 197894 273342 325527 151336 435997 188665 344630 110752 338044 223514 296274
16270 296274 447870 518383 431467 24263 -185793 153252 327254 374118 476010 204183
16259 122009 -47581 255386 -220678 29167 159296 624995 76911 204841 13501 16548 139286
16248 139286 90031 21604 263985 209675 -177114 -86646 -5724 137183 -5652 432948 171520
16236 168824 504294 624349 267389 -367849 6195 -68119 93283 271047 -11087 247703
16225 -328962 -240760 100323 37219 194429 280395 84728 203394 15294 -91938 88785 97632
16214I7632L1336l0758a08591D83817b34156g4952A07516J17984h6144r8556a1078
16202a16816C695K19107F8831h2063F3944J09202J3986a57649C2001a20206c8079
16190c164A1476K01556k0226J4020H6720N4989k292C6697a4200p2662B31520k7607
16178B03913k8171o4315C5716J48425J20307k7061o3728G2120a26055d8781B0489
16166A15905a3159C3069A4276a22467j59324B92578i488j63241C65674A11745
16155B67539J6371d10805I1070b64142k19827A44391p940L1853A3843J47401N3738
16144B14982j8999K037J4457B0119a01441M0485m0153k7401H0066Q841f7515C1857
16131b5164A40724a62200N8641B81649G0876B405a20440A20623D7701K4387b07401
$$ plain form
16214 97632 128968 98210 -108591 483817 -234156 -74952 107516 225500 -86144 -184700 -11078
16202 -116816 3695 222802 68831 -82063 63944 173146 187132 -157649 32001 -120206 -38079
16190 -3164 11476 213032 192806 206826 86720 141709 139417 36697 -14200 -86862 231520 203913
16178 203913 175742 111427 35716 184141 304448 277387 213659 72120 -126055 -48781 20489
16166 115905 -13159 33069 14276 -122467 -281791 292578 -9488 -172729 365674 111745
16155 267539 283910 -410805 91070 -264142 -483969 144391 136451 168304 13843 161244 214982
16144 214982 195983 198020 212477 20119 -101441 -60956 -101109 -128510 80066 88907 -67515 31857
16131 -25164 140724 -162200 -103559 281649 70876 2405 -120440 120623 47701 72088 -207401
16119H6358O7645a08335e4107A6446J21710b96640d5026B48113q6756j3367C5281
16107A1043b05576B60172a78405B95836A24547a86101b9193B28562O801H7550
16096a20441M4934i308B37349A10052b10564g1337o0558A94405a26009l12773
16086d38782a72406A07150a8847k39825D1662L54814a30237M6473A40372i8208
16075B36167c9j02895c0455j18461f9601A3310K99315e9288J3546j71627B14345
16063H7461b70195F7470J73966b7946A6353K75322c3350H5833L784l3305a54016
16051B29575c5879B56613b4352A32477b28226g6330a1847k01954K3323K9558j49269
16040c10189A48046i5680j12795g6627k8961A47726K8813q6169N10775A74081
$$ plain form
16119 86358 154003 -108335 -54107 16446 138156 -296640 -45026 248113 161357 147990 35281
16107 11043 -205576 260172 -178405 295836 124547 -186101 -29193 228562 235363 87550
16096 -120441 -75507 -9308 237349 110052 -210564 -71337 -131895 194405 -126009 -438782
16086 -438782 -172406 107150 -18847 -258672 41662 396476 -130237 -83764 140372 -98208
16075 236167 -39 -102934 -30455 -148916 -69601 13310 312625 -59288 -45742 -217369 214345
16063 87461 -270195 67470 241436 -27946 16353 291675 -33350 85833 89617 56312 -154016
16051 229575 -35879 256613 -24352 132477 -228226 -76330 -11847 -213801 -190478 -160920 -310189
16040 -310189 148046 -95680 -208475 -76627 -105588 147726 176539 90370 601145 174081
16029A26935a02049A59674b49513J5776B00937C874a08664b8994B45836a62301
16018A72876F0558Q6579K02143a13569K4434B00686d3178j30609A64374p4837
16008H9537a07398C7528a05613j66703G6041C329J33611b62259C22443A50813
15997a33928j14998A6229R0510a06946B63403j17376f9842B33590a23985B20207
15986a62847G1188L06540A04943a99197B59539R762F0956i1180A09489R1547r3130
15975A07906n2845a87923B96059d5472p6107K5996j29557a10386o467B21170g1929
15963H8461e60l1046j34576H9577a97927E382Q7052b24331a00070D0887b21350
15951a04710n8870A39807N8089a28546A48925b87551B5378K23657f187D0980b46235
$$ plain form
16029 126935 -102049 159674 -249513 -233737 200937 3874 -108664 -28994 245836 -162301
16018 172876 60558 147137 349280 -113569 -89135 200686 -43178 -173787 164374 89537
16008 89537 -107398 37528 -105613 -272316 76041 3329 136940 -262259 322443 150813
15997 -133928 -248926 16229 106739 -106946 263403 146027 -69842 233590 -123985 220207
15986 -162847 71188 377728 104943 -199197 259539 269301 60956 -91180 109489 201036 107906
15975 107906 55061 -187923 296059 -45472 -121579 -95583 -225140 -110386 -116853 221170 -71929
15963 88461 -560 -31606 -166182 89577 -197927 5382 92434 -224331 -100070 40887 -221350
15951 -104710 -163580 139807 197896 -128546 148925 -287551 25378 249035 -6187 40980 -246235
15939i1048A42489J88155D6343a37067D3176f2831q430q9084B71430k1224a74197
15927I3137J20303e7404k59323e9114k58249c850k13961P3378h517k1691F4070
15915a11024A05114b2003k9828A18996l828E1474A3720a29045L0433m2836A4052
15903A53688J42128C6629a55469e637j26087d1690E26a62080j54512K5336M2870
15892b48386a14241E6665a94865H6843C1938J5625g3985C25057H4790c13143a38920
15880D5405b70427A14534A5718a29273N3424E51305a67837F9277a37920L5081
15870a02839H2887P0498E1696a15015I0133C1889K27430d7333A71549a32158C12336
15858D851h2644c0344m1219h988B9305e9369A53907N6220f6704k40537A91452
$$ plain form
15939 -91048 142489 330644 46343 -137067 43176 -62831 -71261 -160345 271430 250206 -174197
15927 93137 213440 -57404 -316727 -59114 -317363 -3850 -217811 -144433 -8517 -30208 64070
15915 -111024 105114 -22003 -51831 118996 115168 51474 13720 -129045 -98612 -141448 14052
15903 153688 295816 36629 -155469 -5637 -131724 -41690 526 -162080 -316592 -291256 -248386
15892 -248386 -114241 56665 -194865 86843 31938 47563 -73985 325057 84790 -313143 -138920
15880 45405 -270427 114534 15718 -129273 -75849 551305 -167837 69277 -137920 -102839
15870 -102839 82887 153385 51696 -115015 90133 31889 259319 -47333 171549 -132158 312336
15858 4851 -82644 -30344 -71563 -8988 29305 -59369 153907 210127 -66704 -307241 191452
15846a82093M3465k55183J94441f9397A83630g2919q9558j90608C9283h8035C5055
15834D9978J44460M7882a92333B22143I3463L31171b50595A78277b98739d0298
15823c11373a48317A09953J47032d93157a48945B99214j15891a35426c3913B4326
15812B05375d0066j88057h3412k05524c0159j0524j6301e450n750k30792P7956
15801a64036c6486E241b55752A51936a56439j40599C26133A14827d2724A17544
15790c68134J44994A05475j0699J22696c36644a48533G448J06796K788b17544
15779c51844a9279r0486l587B32296b01536N0277m6132M1869c2910K478q7492
15768a17924k25807e1775B6547j1012a53052n8303Q6833k80220a38150O5207l0714
$$ plain form
15846 -182093 -138628 -393811 -199370 -69397 183630 -72919 -162477 -353085 39283 -88035 35055
15834 49978 194438 242320 -192333 222143 93463 424634 -250595 178277 -298739 -40298
15823 -311373 -148317 109953 256985 -493157 -148945 299214 183323 -135426 -33913 24326
15812 205375 -40066 -228123 -83412 -288936 -30159 -40683 -56984 -5450 -11200 -241992 -164036
15801 -164036 -36486 5241 -255752 151936 -156439 -297038 326133 114827 -42724 117544
15790 -368134 -223140 105475 94776 217472 -336644 -148533 7448 114244 117032 -217544
15779 -351844 -19279 -109765 -113352 232296 -201536 -151259 -197391 -155522 -32910 -30432 -117924
15768 -117924 -343731 -51775 26547 15535 -153052 -211355 -124522 -404742 -138150 -72943 -103657
15757a03657A11847a64032H1239l3142O5521K7782A2256h4150a8767I2932b2967
15745B23517J49504G3252b31497G2122J79348A8994c04897E88K29173B7494a30651
15733b22292J8804h7782F1528B4109R713N1264g1410j101B61543i2635A14978
15721C7189K1193a71030f2120b6814A65055a26377l0244N5652j83506a00087b3049
15709A92548D2375c05613J40124D3239b4948A12392e8053C9860a07468B02945
15698b46476A4124a52929j10200R1442A24430b66240A99897J8151F986J69159
15688A76145E4951J94073c24743N6021k0593H8641b19000i870A77717A1746b29415
15676i3526C26297g2462p9034f2695D9734J25741C8406J42400B4428l946K09275
$$ plain form
15757 -103657 111847 -164032 81239 48097 113618 141400 12256 -84150 -18767 92932 -22967
15745 223517 373021 73252 -231497 72122 251470 18994 -304897 588 229761 27494 -130651
15733 -222292 -203488 -87782 61528 24109 33822 85086 -71410 -72511 261543 -92635 114978
15721 37189 58382 -171030 -62120 -26814 165055 -126377 -156621 -100969 -284475 -100087 -23049
15709 192548 42375 -305613 -165489 43239 -24948 112392 -58053 39860 -107468 202945
15698 -246476 14124 -152929 -263129 -171687 124430 -266240 199897 218048 6986 176145
15688 176145 54951 249024 -324743 -268722 -289315 88641 -219000 -9870 177717 11746 -229415
15676 -93526 326297 -72462 -151496 -62695 49734 175475 38406 180806 24428 20482 229757
15665B29757j12912a77711c6757o4363k90897e747C39091F3445d9208B9702J92009
15654B21711a07197A01197A8590i2894n0001f6231j72120h9317c8565B59263a0983
15642a40754p1444q2647J07761B49036b81335B26468b02762A53530J09978h2882
15631F0147b31667A63695l4725a93308A41491f6680C77443G1816P4442c23909
15620B10692e5657o0967A6695a71240B61803a01796C1064K87545f6927A28129
15609b18222d8543A16185j3695k4187d55338d0179l4858k06237a0126I815a77544
15597A7085O7586O2673j258d4445l364j16918L7179B08626a20403l3535j9167
15586a73105F1137j6907K03038j17317a05047j84410D8841a82605C55031i1234
$$ plain form
15665 229757 116845 -177711 -36757 -101120 -392017 -5747 339091 63445 -49208 29702 221711
15654 221711 -107197 101197 18590 -92894 -142895 -66231 -238351 -89317 -38565 259263 -10983
15642 -140754 -212198 -294845 -187084 249036 -281335 226468 -202762 153530 263508 -82882
15631 60147 -231667 163695 128970 -193308 141491 -66680 377443 71816 146258 -323909
15620 210692 -55657 -116624 16695 -171240 261803 -101796 31064 318609 -66927 128129
15609 -218222 -48543 116185 102490 78303 -455338 -40179 -75037 -281274 -10126 9815 -177544
15597 17085 84671 147344 146086 -44445 -47809 -164727 -127548 208626 -120403 -153938 -173105
15586 -173105 61137 44230 247268 129951 -105047 -289457 48841 -182605 355031 -91234
15575b81323A47112d05509a76226C7554L6010K79111c2590k19018J17483L6555
15565i7570J734j51057H3471J22562a31786f959A44857k3621a92079G5230b5510
15553A643L9205Q2651i802A74957a53479B0887a25029A8561a14805j50080J06511
15542a58374P4876p1647c2692E3522b27560I2001h2068l37581B3833a89769a9508
15530C4211M3737b84199J19719R060G5169N5738D8804j4081a34075f4950A7176
15518F4376a40973A7954a01990A47679b61389j25345b5377K327j80623j87182
15508c90855A22691b13192f4818n567A62153c6253A55596a88800A83281b06410
15497H1889a81863A59404a3989k22749B05800o8084A5236F068c80819B31968b05895
$$ plain form
15575 -281323 147112 -405509 -176226 37554 73564 352675 -32590 -251608 -134125 -97570
15565 -97570 -95836 -246893 83471 206033 -131786 -6959 144857 121236 -192079 75230 -25510
15553 1643 40848 123499 -9802 174957 -153479 20887 -125029 18561 -114805 -264885 -158374
15542 -158374 -83498 -155145 -32692 53522 -227560 92001 -82068 -419649 23833 -189769 -19508
15530 34211 77948 -284199 -164480 -155420 75169 130907 48804 34723 -134075 -64950 17176
15518 64376 -140973 17954 -101990 147679 -261389 -386734 -25377 -23050 -203673 -390855
15508 -390855 122691 -213192 -64818 -70385 162153 -36253 155596 -188800 183281 -206410
15497 81889 -181863 159404 -13989 -236738 205800 137716 15236 6068 -380819 231968 -205895
15485b46311J08791l2541C0569L18341A70719C3993d55834A08092c89534C2972
15474a45351J3436j3108m1765A31743c73010H3455b11480I4409a5656k67608B6248
15462a42143l6943D9144J5405f8538k9167A01304N328a80207A79295m4244c37252
15450I427f6218q5256C62867a23956c694F3824h2542E2774L94908A8241J58508
15439A76749i1377l519M3383j27735k794B9985b30240A44984N2537b25824i6745
15427A38072b0070j80972R0204H6699f0215o0324D2910L49622j91509c58501O9650
15416b88851A55660a3524C5137K35213E2778c7491C03195b70042a4536F6262K36575
15405C02837q9333a50261C1528M2681H051J37084b54665A56096h1968A75706p6715
$$ plain form
15485 -246311 -137520 -170061 30569 348910 170719 33993 -455834 108092 -389534 32972
15474 -145351 -131915 -145023 -186788 131743 -373010 83455 -211480 94409 -15656 -283264 26248
15462 -142143 -179086 49144 64549 -68538 -97705 101304 106632 -180207 179295 135051 -337252
15450 9427 -66218 -151474 362867 -123956 -3694 63824 -82542 52774 447682 18241 176749
15439 176749 -91377 -94896 -51513 -179248 -182042 29985 -230240 144984 197521 -225824 -96745
15427 138072 -20070 -201042 -110838 86699 -60215 -120539 42910 392532 201023 -358501 -288851
15416 -288851 155660 -13524 35137 270350 52778 -37491 303195 -270042 -14536 66262 302837
15405 302837 213504 -150261 31528 74209 8051 145135 -254665 156096 -81968 175706 98991
15394I8991R0702a47867b575l68392A51951F8264g3768A26512C9071J13939d8223
15382C25565E2153a24969K1938L5846k46092j7857B12043a96626C38267B2984
15371a17251j59785B17825D4590j2983g0024D9297J65147f3765A87374g5689r4462
15360a70151d0574E49599B34443I7878i7813A3864g3286i224j09712j26212O6944
15349a78204A50291p1383d1495j12100j11004P0055a7763D6319j7922e1986B18919
15337A20587n2878J41165c66373O6721J46796N2124R390C7463J46008j2927L5013
15326B05557n8363f807o4876c2744j69180G6900J02689e9585D6925K27116H5472
15314A17931O7823F5102A9741J82614i495j7104G5432k6929D584a82488A24922
$$ plain form
15394 98991 189693 -147867 -2575 -370967 151951 68264 -73768 126512 39071 153010 -48223
15382 325565 52153 -124969 -103031 -67185 -313277 -331134 212043 -196626 338267 22984
15371 -117251 -277036 217825 44590 31607 -70024 49297 214444 -63765 187374 -75689 -170151
15360 -170151 -40574 549599 234443 97878 -97813 13864 -73286 -9224 -118936 -245148 -178204
15349 -178204 150291 78908 -41495 -153595 -264599 -194544 -17763 46319 28397 -51986 218919
15337 120587 67709 208874 -366373 -299652 -152856 -100732 -91342 37463 183471 170544 205557
15326 205557 147194 -6807 -71683 -32744 -201924 76900 179589 -59585 46925 274041 85472
15314 117931 185754 65102 19741 202355 -9495 -26599 75432 48503 4584 -182488 124922
15302b75954G3824g1399A65083j1891a37695m6258B99407b82792D9934N7594e573
15290B9767d1502C15584H5599C2575G153L03648a48940B60172F3649K39793Q9076
15279C92518J2365b18121A67040G2391k8295R2955j792a11920H9093b37666c5216
15267C10591j47505a55903A48199J63194N943a75205G8122a63037E4656R8107
15257A52763P6484K21925A49213J8732J50159F4491J18806N45837J36074P62000
15247A627208n24203L34714n88350b0272k40636D90360b24714M7534B1789K3708
15237D5497L10494I0820b06933D75102F3143d7745A44846G1220i2177I7926c9563
15225A18399l6752N2335b4942j0180B15M7419J4718A8165i5808H7677O8002o3468
$$ plain form
15302 -275954 73824 -71399 165083 153192 -137695 -183953 299407 -282792 49934 107528 -5573
15290 29767 -41502 315584 85599 32575 7153 310801 -148940 260172 63649 303442 392518
15279 392518 404883 -218121 167040 72391 44096 137051 135259 -111920 89093 -237666 -35216
15267 310591 163086 -155903 148199 311393 317336 -175205 78122 -163037 54656 152763
15257 152763 229247 451172 149213 167945 318104 64491 183297 729134 865208 1627208
15247 1627208 1103005 1437719 849369 -20272 -260908 490360 -224714 -177180 21789 45497
15237 45497 355991 90820 -206933 475102 63143 -47745 144846 71220 -92177 97926 -39563
15225 118399 81647 133982 -24942 -35122 215 47634 62352 18165 -95808 87677 155679 92211
15213I2211a31574A50396m9167q141a9499A59131A6432K23022a40174A11082J37256
15202B48338b14891r5883B2174a22936A53473p4744a2293F9129a78328A06710
15191C6990K45962E4602J12241n9835L1447J39418H1180b96406b0432A42782l8668
15180A04114a05224A33027a0342r5953A14315K35517D2164a52153b1953D5970
15169A1000Q3310a29561C75695j65252C0962i533D35575a31390A28983a52410
15158C30828A16862d9830J6138k2679B05343a42528D2227p891N0260i7491p3249
15147a70740H5144a16474D3852c55588G7384Q8542J985J7778q5640J33098J51317
15136C84464A56966J04446a4787H1902J61801K3297q3102H427K5797K61949j7601
$$ plain form
15213 92211 -131574 150396 101229 93088 -19499 159131 16432 239454 -140174 111082 248338
15202 248338 -214891 -310774 22174 -122936 153473 78729 -12293 69129 -178328 106710
15191 36990 282952 54602 166843 107008 138455 277873 81180 -296406 -20432 142782 104114
15180 104114 -105224 133027 -10342 -106295 114315 349832 42164 -152153 -21953 45970
15169 11000 94310 -129561 375695 210443 30962 -9533 435575 -131390 128983 -152410
15158 330828 116862 -49830 -33692 -56371 205343 -142528 42227 34336 84596 -97491 -170740
15147 -170740 85144 -116474 43852 -355588 77384 165926 167911 185689 100049 233147 384464
15136 384464 156966 261412 -14787 81902 243703 267000 183898 8427 34224 296173 278572
15125B78572I1606R3610n6915M23903B02433O9706j14996L1031G6940b8356j1199
15114c9555j66771k77255H2200K61438M9230B2175O9657L1168M6681p9930J90913
15103B80664e246H3441J46638L14423c3587D3785K79821j34147M957J90358f2266
15091A06265K33442a6576B59930A10219M0596j5228L0671p0292P5263o1671n3373
15080E6185K12328b09299i9324B04009J68335A75311C3238J67872H5195B3417
15069B07537n9902J19818H4105J13222m8810p582l2894l736Q4201R7788a18075
15057A81652M9919R8506f7657H1839J61942J38513C4502J15274p1502K57559b17561
15045C5834a722l08908B13592E2393Q6239a91810H4674M8866Q5161c9662A56397
$$ plain form
15125 278572 91606 185216 128301 552204 202433 272139 157143 188174 76940 -28356 -39555
15114 -39555 -206326 -483581 82200 343638 392868 22175 91832 123000 169681 89751 280664
15103 280664 -5246 83441 230079 544502 -33587 43785 323606 189459 194416 384774 -62266
15091 106265 339707 -16576 259930 110219 150815 135587 166258 95966 171229 109558 56185
15080 56185 268513 -209299 -99324 204009 372344 175311 33238 201110 85195 23417
15069 207537 147635 267453 84105 197327 148517 140935 108041 104305 188506 286294 -118075
15057 181652 231571 330077 -67657 81839 243781 382294 34502 149776 78274 335833 -217561
15045 35834 -1722 -310630 213592 52393 138632 -191810 84674 133540 218701 -39662 156397
15033C36593a99562D49755A23838J97014I969a79352Q2839B09355J38130E1636
15022A10505L60641j31531m3125L4572j22230p5832L30394C7391L9439R4011A9156
15010a39929I1378K30389J61632A37987K91664A68298d808B22431K39318B29916
14999A2788L89796B9592m249i9309C06663j29252m2626L1942r034J10625k4180
14988B44138O1548p5482a54491C27680q5726Q5879F6901J15905O3770K28216R770
14977D84562I8132K06497j14605a68791F25751B17850h1016m4190G4226P6783
14967A51009E8694M55649B50709k4791g6949C53319J61823A41988Q9900O7361
14957B99249o5716A6902i4039B30288j4323L8035e6011K1337D0904K39945p6042
$$ plain form
15033 336593 -199562 449755 123838 320852 9969 -179352 -96513 209355 347485 51636
15022 110505 471146 339615 296490 331062 208832 133000 463394 37391 76830 170841 19156
15010 -139929 91378 321767 483399 137987 429651 168298 -4808 222431 461749 229916
14999 12788 402584 29592 25343 -99309 306663 177411 134785 166727 157693 268318 244138
14988 244138 305686 230204 -154491 327680 241954 327833 66901 182806 246576 474792 484562
14977 484562 98132 304629 190024 -168791 625751 217850 -81016 -125206 74226 151009
14967 151009 58694 514343 250709 225918 -76949 353319 515142 141988 231888 299249
14957 299249 233533 16902 -94039 230288 215965 254000 -56011 -34674 40904 280849 204807
14946B04807k9936L04247k20201a80055A62200M5211J84715A19971L19885G2527
14935E5949O41770k32216k31646K85961A50187Q9442L14278A39237C5056K77237
14925C12293K37880j72224A69829L26653B24696J591J38542A52709K40363j66804
14915B26268K99068A25563K23085l0230K3370L18429B81667E0994L70156C6190
14904B40952J78490A21657K20703j58662L32091j11239j42630J36005j02790N9056
14894C54191A69325L30782k04643j09388L37674A29550K68424p8733m5134M020
14884B78127l9365L59755k36082r5861a01392E16403K77289B43474J46912J44855
14874E35241R4530B02049L31131k24654j2734J2725J28140j62095Q4692J09454
$$ plain form
14946 204807 174871 479118 258917 -180055 162200 207411 392126 119971 439856 72527
14935 55949 697719 465503 233857 519818 150187 239629 553907 139237 35056 312293
14925 312293 550173 377949 169829 496482 224696 226287 364829 152709 393072 226268
14915 226268 525336 125563 348648 318418 341788 660217 281667 50994 421150 36190
14904 240952 419442 121657 342360 183698 515789 404550 261920 397925 295135 354191
14894 354191 169325 500107 295464 186076 523750 129550 397974 319241 274107 278127
14884 278127 238762 598517 362435 266574 -101392 516403 793692 243474 390386 535241
14874 535241 629771 202049 533180 308526 295792 308517 436657 274562 359254 468708
14864D68708A85353L07051b9798I7784J75776J20685p8710M09271l12286N525
14854D18045A01478L85551K64972I3120K96365K18628A75383K43071K84608J7913
14844G20975p6823J07986k75041j18623J23808k22531L61595J57829C70378O3159
14834D33537n9528J96889j94028O0477k6652n630j67974L15538k15973K77352
14824F14008j00967Q3319j20996N4273q8298J58891k10978N1527j93976L28188
14814E74991A99006K78628j23891K19889j8935q0103L31760B1543O82123j26558
14804E77108j38650N0473n2336M6733L16824j46330L0146j86908B14002L63531
14794E77533k30214L49590J62685j4535l08399n1329o4529Q7365J14937n9242
$$ plain form
14864 468708 185353 492404 -29798 97784 273560 394245 315535 724806 412520 418045
14854 418045 101478 487029 752001 93120 389485 608113 175383 418454 703062 720975
14844 720975 644152 752138 477097 358474 482282 259751 621346 779175 370378 433537
14834 433537 374009 570898 376870 437347 410695 405065 237091 552629 336656 614008
14824 614008 513041 596360 475364 529637 441339 600230 389252 440779 246803 574991
14814 574991 199006 477634 353743 573632 554697 474594 806354 21543 703666 577108
14804 577108 438458 488931 436595 483328 800152 653822 683968 497060 214002 577533
14794 577533 347319 696909 859594 845059 536660 485331 420802 508167 623104 563862
14784E63862B48073L20645p8340A77836K88721L70893l31794j1246k7852M11566
14774H78124C78705L31113k17962n6508J62609k4165J19945k35848K96352Q5883
14764H40124m03276J65444r0072n5104j0189J64815K27781l32535M9596K142Q525
14753E67251L1195M46309k20461N2387l32667N7586R7610k38525L00127K40994
14743A001806m75614M1499K39534j96897l8969Q9428k47461P7070L15509C86940
14732I39616j09769q4225K71844j21542j97500O2461j12946K13034j17155l0740
14722G13078n2388M0310j41342M40988j68860Q9201k2287l36214N38761l55015
14712G46232j52913K14654j28103j31307K57095J77679k16112J68210j66210k7619
$$ plain form
14784 563862 248073 568718 490378 177836 466557 837450 505656 494410 466558 878124
14774 878124 378705 709818 491856 435348 597957 573792 693737 457889 754241 840124
14764 840124 436848 602292 512220 457116 446927 611742 839523 506988 556584 558726 567251
14753 567251 598446 1044755 824294 876681 544014 601600 699210 460685 760812 1001806
14743 1001806 526192 567691 807225 610328 571359 660787 413326 490396 805905 386940
14732 939616 829847 745622 1017466 895924 698424 760885 647939 860973 743818 713078
14722 713078 660690 701000 559658 1000646 831786 920987 898700 562486 1101247 746232
14712 746232 593319 807973 679870 548563 805658 983337 767225 935435 769225 741606
14702G41606J30326l30712K63898L92665m01647J46436j82686j55353M74139l39898
14692G38774M02303l18072M0166J68898J02841k57123j13526P6261R9819o3141
14682H77200J65962m36532R12253m84970j72629K87813l2744j15544j81045K22994
14672A042758q2846L35410l76206M9982J55186Q801j25741J74796J25207j40576
14662A166771j98293J06551k25169J70221M57774k90336J72644j78521K25007
14653A406649p2214k16043J30678n3870k02510L33731k15630Q1124N2439K7878
14643A272232J29112j75674J59952j51821k16725J91705L6804m6959J001j08127
14633A091500K2822J94812j02581n4633L42863k84161k1911K1906K84774l5770
$$ plain form
14702 741606 871932 541220 805118 1197783 796136 942572 759886 604533 1078672 738774
14692 738774 1141077 823005 863171 1032069 1134910 877787 764261 840522 940341 877200
14682 877200 1043162 606630 1518883 1033913 861284 1149097 1116353 1000809 819764 1042758
14672 1042758 959912 1295322 919116 969098 1124284 1133085 1007344 1182140 1307347 1166771
14662 1166771 968478 1075029 849860 1020081 1477855 1187519 1360163 1181642 1406649
14653 1406649 1334435 1118392 1249070 1195200 992690 1326421 1110791 1191915 1244354 1272232
14643 1272232 1401344 1225670 1385622 1233801 1017076 1208781 1245585 1198626 1199627 1091500
14633 1091500 1114322 1309134 1206553 1151920 1494783 1210622 1188711 1210617 1495391 1459621
14623A459621l33587N34448l86348J59419J49584j97721J69689L7344L007J69
14613A595625K45034k36257J10536K85126m84334Q0220j0927o1731j38729K18617
14603A603180j33673J89345k41941L73884k83913K82160m81093L98047l4802M31959
14593B103153k83777j3807J06136j35442J84820j57061L32935l76460J00051R4666
14583A955214k98767J96826j19860L23678k9805J29195Q8526L3921r9212k8868
14573B150848K70907q2876K9585l85771L65713j04837P316K51039k3197K55644
14563B734371m67861M82071J84046l66601J55743J92030J8085J48339J15922M53517
14553C649662M07447K30908O79329R57810J745588M289360J0146226J7686064
$$ plain form
14623 1459621 1126034 1660482 1274134 1433553 1583137 1385416 1555105 1592449 1595456 1595625
14613 1595625 1840659 1604402 1714938 2000064 1515730 1595950 1585023 1523292 1384563 1603180
14603 1603180 1469507 1658852 1416911 1790795 1506882 1789042 1307949 1705996 1671194 2103153
14593 2103153 1819376 1805569 1911705 1776263 1961083 1804022 2136957 1760497 1860548 1955214
14583 1955214 1656447 1853273 1733413 2057091 2027286 2156481 2245007 2278928 2179716 2150848
14573 2150848 2421755 2338879 2368464 1982693 2348406 2243569 2250885 2501924 2478727 2734371
14563 2734371 2266510 2748581 2932627 2566026 2721769 2913799 2931884 3080223 3196145 3649662
14553 3649662 4057109 4288017 4967346 5925156 7670744 11960104 22106330 39792394
14545C9792394O866572B3312402H980475m441966j665225l04707o15727K68420
14537B221270j51761l52245J01872p3536M23502k3859p8701R0201L0289L44845
14527B531877j36638l09332J94977L74049m08451L90398j50664R7565q3598n1948
14517B448235J39092K11460k64002k2398L90454j68603J10519J41938k77812L20837
14507C029720K29178l60751Q2473k96858M15194o1714K06950p1895k80945K77387
14497C168739k35847M78921p2623K69361j85149K91547j54543k27116J06524M96078
14487C935892m16761J49718K439n6287M72764K5401k52876J28838q9725J33111
14477D032514J49302j13211K67046j60881Q3864r9278k6958K65646Q3738N5959
$$ plain form
14545 39792394 46658966 23312402 8980475 4538509 2873284 2568577 1952850 2221270
14537 2221270 2069509 1717264 1819136 1745600 2169102 2145243 2066542 2156743 2187032 2531877
14527 2531877 2395239 2085907 2280884 2654933 2246482 2636880 2486216 2583781 2500183 2448235
14517 2448235 2587327 2798787 2534785 2512387 2902841 2734238 2844757 2986695 2708883 3029720
14507 3029720 3258898 2898147 2980620 2683762 3098956 3037242 3244192 3172297 2891352 3168739
14497 3168739 2932892 3411813 3339190 3608551 3423402 3714949 3560406 3333290 3439814 3935892
14487 3935892 3519131 3668849 3671288 3615001 4087765 4113166 3860290 3989128 3899403 4032514
14477 4032514 4181816 4068605 4335651 4174770 4258634 4159356 4132398 4398044 4481782 4537741
14467D537741O5118l67670L20786j9058J58401l1973k18434P03926K28419l68388
14457E008868P4435j65428K90994n9001L12716J05406j77313L41168m6514l38423
14447E346908M97030k01458J33569L11441M3621R542M28126m19064K13211j2467
14437F350459j42070K11919J03590M76204j39940J57822j08081K56968J09981
14428G276852M0883J38604m8089j66850K75858J84255p4106K54977L08718J76591
14418H367693J76761k56995J81472L37691K90274k6167n7298l7600L95792Q8761
14408I460384R3250J8625J78191L22000K10548O3645j73720O79599J48688J07761
14398A1108971K89576J39983N7315M3594M02042k24224N50609O8687J62045J95244
$$ plain form
14467 4537741 4602859 4235189 4555975 4536917 4695318 4663345 4444911 5148837 5377256 5008868
14457 5008868 5083303 4917875 5208869 5149868 5462584 5567990 5390677 5731845 5685331 5346908
14447 5346908 5843938 5642480 5776049 6087490 6131111 6140653 6568779 6149715 6362926 6350459
14437 6350459 6208389 6420308 6523898 7000102 6860162 7017984 6909903 7166871 7276852
14428 7276852 7317735 7456339 7408250 7241400 7517258 7701513 7627407 7882384 8191102 8367693
14418 8367693 8544454 8287459 8468931 8806622 9096896 9070729 9013431 8975831 9371623 9460384
14408 9460384 9553634 9572259 9750450 10072450 10282998 10346643 10172923 10852522 11001210 11108971
14398 11108971 11398547 11538530 11595845 11639439 12041481 11817257 12367866 12436553 12598598 12793842
14388A2793842L88172L7769L93697J63141M70068j37960L62922L29259P0370L73338
14378A5244618O07930L88836R5601r8373M40944L65091L14802N47300N35123J29549
14368A8571421K15832M41109N35447N56588O36633K0972O75691M72522L94644
14359B2520859K20608P66588O00299O55318L17542Q32547P10410M92299Q96285
14350B8012755M90749P46268L78449Q13287R50942O63919P77599Q90755Q41398
14341C4566121R89783J092452P52177J268672R48156J377138P78588J619801J401679
14332D4794567J187813J332839J709993J157768J791486J565771J664108J665287
14324E6869632K105968J849856J870936K345685K618824K009465K557262K727078
$$ plain form
14388 12793842 13182014 13219783 13613480 13776621 14246689 14108729 14471651 14800910 14871280 15244618
14378 15244618 15852548 16241384 16336985 16238612 16679556 17044647 17359449 17906749 18441872 18571421
14368 18571421 18787253 19228362 19763809 20320397 20957030 20978002 21653693 22126215 22520859
14359 22520859 22741467 23508055 24108354 24763672 25081214 25913761 26624171 27116470 28012755
14350 28012755 28503504 29249772 29628221 30441508 31392450 32056369 32833968 33724723 34566121
14341 34566121 35555904 36648356 37400533 38669205 39617361 40994499 41773087 43392888 44794567
14332 44794567 45982380 47315219 49025212 50182980 51974466 53540237 55204345 56869632
14324 56869632 58975600 60825456 62696392 65042077 67660901 69670366 72227628 74954706
14316G4954706K514492L211082L061919L346236L055436M007209L669113M265791
14308A02085984M215935M464473M802098N086163N254242N725622N894662O425279
14300A43954458O721980P274488P678468P699531Q894625R155063R259707J0112067
14292B10750387J0662677J1327857J1558734J2507533J2448768J3325435J4008549
14285B96589940J4396489J4503092J4362640J4975890J4986585J4158554J4350228
14278C98323418J3652262J2280236J1002006J0020372P566333N312169J879623
14271D60036419j269200k722367L12330k518219l087974o054496q603675r710053
14263D26382765j1647138j2806328j4125995j4451824j4896790j5438644j5027863
$$ plain form
14316 74954706 77469198 80680280 83742199 87088435 90143871 94151080 97820193 102085984
14308 102085984 106301919 110766392 115568490 120654653 125908895 131634517 137529179 143954458
14300 143954458 150676438 157950926 165629394 173328925 182223550 191378613 200638320 210750387
14292 210750387 221413064 232740921 244299655 256807188 269255956 282581391 296589940
14285 296589940 310986429 325489521 339852161 354828051 369814636 383973190 398323418
14278 398323418 411975680 424255916 435257922 445278294 452844627 458156796 460036419
14271 460036419 458767219 456044852 456357182 453838963 450750989 444696493 436092818 426382765
14263 426382765 414735627 401929299 387803304 373351480 358454690 343016046 327988183
14256C27988183j4572696j3870356j4100253j3652924j2845021j2664251j2010272
14249B34272410j1255485j0597532j0511745r714444q978915q270451p886800
14242A67057038p801590p547552o930854o248903n986643n473808n668850n418206
14234A15980632m301372m999663l929034m018037l655954l738791l590097l353104
14226H4394580l303500k872956k858877k599983k592337k455053k319947k045035
14218F3346892k244781j718441k128345j761947j678752j214722j821266k017259
14210D8761379j288319j442676q39471q27608j415229j345781j639459j017533
14202C8945303j002037r37881m76896j262159j203741p31821q66101j061676m85177
$$ plain form
14256 327988183 313415487 299545131 285444878 271791954 258946933 246282682 234272410
14249 234272410 223016925 212419393 201907648 192193204 183214289 174943838 167057038
14242 167057038 159255448 151707896 144777042 138528139 132541496 127067688 121398838 115980632
14234 115980632 111679260 106679597 102750563 98732526 95076572 91337781 87747684 84394580
14226 84394580 81091080 78218124 75359247 72759264 70166927 67711874 65391927 63346892
14218 63346892 61102111 59383670 57255325 55493378 53814626 52599904 50778638 48761379
14210 48761379 47473060 46030384 45190913 44363305 42948076 41602295 39962836 38945303
14202 38945303 37943266 37005385 36528489 35266330 34062589 33330768 32464667 31402991 30917814
14193C0917814n77670p91688q91855p13964l72611p87003q18065k76507m50960
14184B5237491j184499p42754j52813k51967k09430q11850l98936r1711l33346
14175B1060185p09489m47417n06005m16442l24268m19733q4122o34214k96880
14166A7221615l68051k26435L1969l96347k83746m61251j35712J03443p33698
14157A4751787O7025n45403K58499p96316k58817j42924j81306k7116m90780k22851
14147A2411798j77273j78478J70851j84926j49730m07778l14962k76945l47674
14138A0544883k39293J63709K3888l48854j00865k21350k835q3293j75630J59402
14128I719762q27802R4048K50720k81796J90658m55057j53052o9409M5562n33795
$$ plain form
14193 30917814 30340144 29548456 28656601 27942637 27570026 26783023 25964958 25688451 25237491
14184 25237491 24052992 23310238 23157425 22905458 22696028 21884178 21485242 21393531 21060185
14175 21060185 20350696 19903279 19397274 18980832 18656564 18236831 18152709 17518495 17221615
14166 17221615 16853564 16627129 16659098 16262751 15979005 15517754 15382042 15485485 14751787
14157 14751787 14818812 14273409 14531908 13735592 13476775 13333851 13152545 13125429 12634649 12411798
14147 12411798 12234525 12056047 12226898 12041972 11892242 11484464 11169502 10892557 10544883
14138 10544883 10305590 10469299 10493187 10144333 10043468 9822118 9819283 9735990 9560360 9719762
14128 9719762 8891960 8986008 9236728 8954932 9145590 8690533 8537481 8468072 8513634 7979839
14118G979839L8186n6427M521q522k34022k32134l23275K61937K5736m51311P9480
14107G084008k48756M14033o59947K13868l53479M14149j53637k11927k94144
14098F204168K38955k63263j57095j67342K53332m3040m5275n10306L62783l13239
14088E559678K03868m06179J56984k13326R6865j64106J82360j78570K49395l61184
14078E125785k8006K45393l88262j16078K4128r9182L5656k69577n2766K15760
14068D692851j61123j221N749m14633M14056k36185L05884j39805K70063k86202
14058D449434J67358q3416r6261J195l71613p7265j75333J84116j39440K3498
14048C882273K75424q54829K56882K84162j07951k54204L09356n65559J18202
$$ plain form
14118 7979839 8018025 7961598 7966119 7957597 7723575 7491441 7168166 7430103 7455839 7004528 7084008
14107 7084008 6835252 7249285 6589338 6803206 6449727 6863876 6710239 6498312 6204168
14098 6204168 6443123 6179860 6022765 5855423 6108755 6065715 6020440 5510134 5872917 5559678
14088 5559678 5763546 5357367 5514351 5301025 5397890 5233784 5416144 5237574 5486969 5125785
14078 5125785 5097779 5343172 4954910 4838832 4862960 4763778 4799434 4529857 4477091 4692851
14068 4692851 4531728 4530507 4536256 4121623 4535679 4299494 4605378 4465573 4735636 4449434
14058 4449434 4616792 4533376 4437115 4438310 4066697 3989432 3814099 3998215 3858775 3882273
14048 3882273 4157697 3302868 3559750 3843912 3735961 3481757 3791113 3225554 3343756
14039C343756Q9629o7877M2552j09646j27744K30514j66415N1295o3981m4842
14029C177241J34242j54305J53473j17757n02746M53954n43008K66276J35107
14020C002477l36182O03292l47862m75379L18010M96134n71664j34444J54145
14011B708527k09148J50884l86128N06227k03211k95767l7866J23542j23622L48739
14001B582177l52784K00895k71591l12778L16355L13865m27876J86608O3045j0483
13991B287433k3813M84307Q53880K580113Q474411J7421226J3961978j6602979
13983B9436556A4488929n752767k385083j396181n21234o59147n58240K52291
13975C468568l95070j47721L9545Q4232m03336L62879o24173K76630j19875j66443
$$ plain form
14039 3343756 3433385 3365508 3408060 3298414 3170670 3401184 3234769 3286064 3222083 3177241
14029 3177241 3311483 3157178 3310651 3192894 2690148 3144102 2601094 2867370 3002477
14020 3002477 2666295 3269587 2921725 2446346 2764356 3260490 2688826 2554382 2708527
14011 2708527 2499379 2650263 2264135 2770362 2567151 2271384 2233518 2357060 2233438 2582177
14001 2582177 2229393 2430288 2158697 1845919 2162274 2476139 2048263 2234871 2297916 2287433
13991 2287433 2263620 2747927 3601807 6181920 14656331 32077557 46039535 29436556
13983 29436556 14488929 8736162 6351079 4954898 4433664 3774517 3216277 3468568
13975 3468568 3073498 2925777 2965322 3049554 2646218 3009097 2384924 2661554 2541679 2375236
13965B375236j98235J21594m5518R700J21449k78982K36099O2866m02355J63509
13955B165363M11449n81625k938N4182j21881J67614j25245O8659j7419k51153
13945A767006K82992q376j35102J2907j71605Q5627K69839l73358j66429K17668
13935A781169p316k6173J13477l29183M73324j96952k5456k44504K4897L3786
13925A597069L47945j81937K04906l67038j01730L8622k28127M90986j83383q4002
13915A533311J51015Q4758l04734R6545n5282J06847l89400M63935k28447L04112
13905A762660l0223j29241m5463J1534j96505K50918k76899N0072Q8471J26556
13895A611880k78679M30700o08531K1929P7299K86396l91190l3141N17355l48848
$$ plain form
13965 2375236 2177001 2298595 2253077 2262777 2384226 2105244 2341343 2404209 2001854 2165363
13955 2165363 2576812 1995187 1992249 2046431 1924550 2092164 1966919 2035578 2018159 1767006
13945 1767006 2049998 2041622 1906520 1919427 1747822 1833449 2103288 1729930 1563501 1781169
13935 1781169 1773853 1747680 1861157 1531974 2005298 1808346 1782890 1538386 1563283 1597069
13925 1597069 1945014 1763077 1967983 1600945 1499215 1537837 1309710 1800696 1617313 1533311
13915 1533311 1684326 1769084 1464350 1560895 1505613 1612460 1223060 1686995 1458548 1762660
13905 1762660 1732437 1603196 1557733 1569267 1372762 1623680 1346781 1396853 1485324 1611880
13895 1611880 1333201 1763901 1155370 1177299 1254598 1540994 1149804 1116663 1634018 1285170
13885A285170J51804m20989J96086k39313M83374l24796K85861q8859p0728j8441
13875A239169p94k07149L40714l63794L55007k26998j77943O1875J27725j969
13865A145843p6535o1429N38752j56327j34384j61336K59772j64608q7036K17412
13855A320124k12261L5324k8890j48853K28604O0581k31322l50412J86847M61966
13845A321708n00392L56476k78281J48187K33004j32640o0015j4592K15637k58724
13835A030368q4492M8338j34579k3256J68664j35656p4040N58812n89898N44M28544
13824A193349o6696l09296n283M62718m33887J88899k5758J27664j46763Q4810
13814A069757m22151k169K75306J36554k16782j97570M39126j47620k0657L11623
$$ plain form
13885 1285170 1436974 1015985 1212071 972758 1456132 1131336 1417197 1328338 1257610 1239169
13875 1239169 1238375 1031226 1371940 1008146 1363153 1136155 958212 1020087 1147812 1145843
13865 1145843 1069308 1007879 1546631 1390304 1255920 1094584 1354356 1189748 1102712 1320124
13855 1320124 1107863 1143187 1114297 965444 1194048 1254629 1023307 672895 859742 1321708
13845 1321708 821316 1177792 899511 1047698 1280702 1148062 1088047 1073455 1289092 1030368
13835 1030368 945876 994214 859635 836379 1005043 869387 795347 1354159 764261 764805 1193349
13824 1193349 1126653 817357 812074 1274792 840905 1029804 1004046 1131710 984947 1069757
13814 1069757 647606 645437 920743 1057297 840515 642945 1082071 934451 913794 1225417
13804A225417k87029j47394l22743N58046j41503j07066M6612N0467J10789j88473
13794G97123N28142m11287k45126J17805j36753N70626F05981M5647J12955J74049
13784I38632p0645k45967K19515p5085r7279J1348M65462n01864j07248j7697
13774E19172K42945J53090j93087J76862J63342k61860J28431K06919k54090J74073
13764A055797l56212P4509j9641m7704J49746K37949l45261j61959K19892j73244
13754F33872A97870N22331n1586k09785C2287P72166o4207j6298J74658q7214
13744H11392k24457J15615O7806C69271J31746K46214L53463D68413J90598K9450
13734F88461M724P1086o1887o0326k39744L40141j21835N2506J28190C83077K90660
$$ plain form
13804 1225417 938388 790994 468251 1026297 884794 777728 824340 874807 985596 797123
13794 797123 1325265 913978 668852 786657 649904 1220530 605981 651628 764583 938632
13784 938632 867987 622020 841535 766450 669171 680519 1145981 644117 536869 519172
13774 519172 762117 915207 722120 898982 1062324 800464 928895 1135814 881724 1055797
13764 1055797 699585 774094 754453 706749 856495 1094444 749183 587224 807116 633872
13754 633872 197870 720201 668615 458830 32287 804453 740246 723948 898606 811392
13744 811392 586935 702550 770356 369271 501017 747231 1100694 468413 659011 688461
13734 688461 693185 764271 702384 642058 402314 742455 620620 673126 801316 383077 673737
13723F73737p9886L59371k22524J78768D46011J19416O4186N2938k35854O3733
13713E10430M07741B79664N66292j23359j7519k66990N8187J09101j49196M30004
13703H86184C88930K7273J20500R2610j68933L38308j55606k95498j8791l098
13693C25695J10990J56034l1762R6697j20804J20783K44425C40190M7123N2141
13683D39454J49853q4054L27336l09322k59998D8970P84854k77593L4783J23051
13673G14065k75219j01566l7807K21005N75729D30596j69777J77940K47251l16201
13663C69809J14500J47826n8767O6731B74451L45228J06818k80864o4297L00066
13653F81402j85104o5695Q6197r8229l6383K6968K29001J08741k81256m1077q6276
$$ plain form
13723 673737 593851 953222 730698 909466 446011 565427 629613 682551 446697 510430
13713 510430 918171 279664 845956 722597 705078 438088 496275 605376 456180 886184
13703 886184 388930 416203 536703 629313 460380 798688 643082 347584 328793 325695
13693 325695 436685 592719 560957 657654 536850 657633 902058 340190 387313 439454
13683 439454 589307 505253 832589 523267 263269 48970 833824 556231 591014 714065
13673 714065 438846 337280 299473 520478 1096207 430596 260819 438759 686010 369809
13663 369809 484309 632135 573368 640099 274451 619679 726497 445633 381336 681402
13653 681402 496298 430603 516800 418571 382188 409156 638157 746898 465642 424565 338289
13642C38289M63367l00424P9973j40326j16810J22815q2820J01518r5337P2250
13632D42495J12510B40935L30840J37587J389A93551M13339j79933J14468J2501
13622E53926k53476J65743q1603K57805k72124n7746L10679k13532j97160R317
13612B21829K09178m8288L28983j94868K7428k18850r1051J48218J73896A83549
13601D22225K03523g6727A68282L01842Q450j49925l0595E4290N27041A98035
13590D36982p6120l5117I2497J74028p7737J87069j17077A3853M07010J30333
13580E51196q0133K4998k20682J55038A95754K50822j38193J24277o5556j40444
13570B26660j0689P1701Q0773P6656A01088K62564o0318j40810N1192j1509L3783
$$ plain form
13642 338289 801656 501232 581205 440879 324069 446884 364064 465582 370245 442495
13632 442495 555005 240935 571775 709362 710751 193551 606890 426957 541425 553926
13622 553926 300450 466193 384590 642395 370271 312525 623204 409672 212512 221829
13612 221829 431007 382719 711702 516834 544262 325412 234361 382579 556475 183549
13601 422225 625748 -76727 168282 470124 478574 328649 298054 54290 581331 198035
13590 436982 360862 325745 92497 266525 188788 375857 258780 13853 420863 551196
13580 551196 471063 496061 275379 430417 195754 446576 308383 432660 367104 226660
13570 226660 215971 287672 368445 445101 101088 363652 303334 162524 213716 202207 235990
13559B35990R6484M7748j44801L22288B41291L7044k6971J67517j93039J33733
13549C59575L39978I0114J48050a3223B32333J39940j07934L05078j34101n1452
13539C83864j71040I0869J99298j23840J84932A63791O2254M5339l1536K06906
13529D46754o6694j04873A17246J77645A03248M27611k326A23077J39550P2731
13519C35358P6271o6756J20024j45320A12416J08694O317r187K42622j93519J77617
13508D44960B09750m3047J12451R5410l7672J46269B14456L02902e4647F00300
13497B98834O5856A1309L55838c0156j74917B36437J73721N3742j20758j41572
13487B01570A1605Q9803J22219m7265O3757J68250j65325J34028K44838A30073
$$ plain form
13559 235990 332474 380222 235421 557709 241291 278335 251364 418881 225842 359575
13549 359575 699553 90114 238164 -13223 232333 372273 264339 569417 435316 383864
13539 383864 212824 90869 290167 166327 351259 163791 226045 271384 239848 446754
13529 446754 380060 275187 117246 294891 103248 530859 528533 123077 262627 335358
13519 335358 411629 344873 464897 319577 112416 221110 227427 218240 460862 267343 444960
13508 444960 209750 166703 279154 374564 336892 483161 214456 517358 -54647 600300
13497 298834 364690 11309 367147 -30156 -205073 236437 410158 463900 343142 201570
13487 201570 11605 101408 223627 176362 240119 408369 243044 377072 621910 130073
13476D39643I5370J16122K25589j47149r3831j4674F3905O2157L15386j24206
13466C17242O2036j31087E3222J38259d8821A40478J78573j25245M2785J02669
13456C39260F4065K54656K42532a77261C08850p0597J8924I6994k1493J64218
13446B39719A10799M02780o6164k22556g2692A46989p61B7454L90302B02013J65878
13435C67891A78218L30067B33233n1981A9102M935M70493D6672L8295J05158l344
13424A86781A5821J80353g6929D43680C3472R3383q240M3334M45260g1738B07959
13412B35095L268J03404l0039o8528a31673D48140B09512J295J26201K792P0872
13401D10672j84738r6990N42642B00753Q7634n4026n4777L4793H9078L14091j88341
$$ plain form
13476 439643 95370 211492 437081 289932 196101 181427 63905 126062 441448 317242
13466 317242 379278 248191 53222 191481 -48821 140478 319051 193806 236591 339260
13456 339260 64065 318721 561253 -177261 308850 238253 257177 96994 75501 239719
13446 239719 110799 513579 447415 224859 -72692 146989 146228 27454 417756 202013 367891
13435 367891 178218 508285 233233 181252 19102 24037 494530 46672 84967 190125 186781
13424 186781 15821 196174 -76929 443680 33472 126855 118615 161949 607209 -71738 207959
13412 235095 238363 341767 311728 243200 -131673 448140 209512 210807 337008 339800 410672
13401 410672 225934 128944 671586 200753 288387 234361 179584 214377 89078 403169 214828
13390B14828i3727D07919A43165r78A4212K14505K34060L7398A68090q555P3704
13379B33239o9183J8781p2962L3121J58509I4828m3688L31687j46972r6730Q6227
13368B25352J18971J09920C7426J29806P9054A21508J80437j1329K6235q8090
13358B28761J99075o8891o845F2214K11758B0328J79925d7501A73377G6206B4963
13346H0744J76221K7314N2189j0860K08746B21882J94776J48677a3086C15669
13335A67110N4604j8937C8526J78254C0634J80322C0053K72111G7181O4385k5536
13324A16030J93586f9465A81658R875p9507R7212J18705K03338G8225J59927j3172
13313B24980p2213J89056N0528A6631Q961J73082R8177a16674D13353d2546A72856
$$ plain form
13390 214828 -93727 407919 143165 142187 14212 228717 462777 500175 168090 159535 233239
13379 233239 164056 182837 109875 142996 301505 94828 51140 382827 235855 139125 225352
13368 225352 344323 454243 37426 167232 246286 121508 301945 290616 316851 228761
13358 228761 427836 358945 352100 62214 273972 20328 200253 -47501 173377 76206 24963
13346 80744 256965 284279 336468 325608 534354 221882 416658 565335 -13086 315669
13335 167110 221714 202777 38526 216780 30634 210956 30053 302164 77181 141566 116030
13324 116030 309616 -69465 181658 191533 112026 209238 327943 531281 78225 238152 224980
13313 224980 152767 341823 392351 16631 25592 198674 296851 -116674 413353 -42546 172856
13301H6956K02985j04974d7879I7419J1940l7104L07144p9641B657J56586J05987
13290B65230n9095b12376B40517K5170I7287f4335A63951m7494j6007d203j35990
13279a40193A96158q8483P2626a5498B57800p1700A2085K5146L27453o8709a98044
13267B26988K8340a15506A75561L8851g4576A52722n5868K5305J69131a61853
13256A59190m0078h994A042L00621E6298K41531A02190R3392P5928K00207H9642
13244D145L14576A19775K04771a43155A22072A974N0763L40440b76460e479B8565
13232B49511I9943O9750c100k3123j10093b6940B07407K4660E1416N3191K14444
13221C19051D1097J90616F5986J57873Q1475o2716D1588K85470o7753C0209K58508
$$ plain form
13301 86956 289941 184967 -47879 97419 109359 72255 379399 299758 2657 159243 265230
13290 265230 206135 -212376 240517 265687 97287 -64335 163951 116457 100450 -4203 -140193
13279 -140193 196158 107675 180301 -15498 257800 186100 12085 37231 364684 295975 -198044
13267 226988 255328 -115506 175561 214412 -74576 152722 96854 122159 291290 -161853
13256 159190 119112 -8994 1042 301663 56298 297829 102190 195582 271510 471717 89642
13244 4145 318721 119775 324546 -143155 122072 1974 52737 393177 -276460 -5479 28565
13232 249511 99943 169693 -3100 -26223 -136316 -26940 207407 232067 51416 104607 319051
13221 319051 41097 231713 65986 223859 305334 242618 41588 327058 259305 30209 288717
13210B88717k3517e6298A18032a07968A48301n8161R2244K12678o0236r6266j09414
13199A29146c87729I1217c3234F4874J71354n2556J13408j05522a90684A10090
13188C33271n5691j08135j4520L2715H1953J31463Q3123n1095b18534A12034J67542
13177B79576d7958A54147O3385i8665G8356f5957k55088c5504j26590H2461m1139
13166D1322a95518E11750B06802a38112A29228J36489f0050A59350e1325A08180
13155A14364J85972G3625A5844J3772b6707l6060A36803L32599b6813F28239B62128
13143e8956A68027N3482f2930k08090D19224j98730j02702r084a97337B40792
13132d69321d6450G0333L9610Q1688E8974b10508H965N4648J34886p0033J53851
$$ plain form
13210 288717 265200 -56298 118032 -107968 148301 90140 182384 395062 334826 238560 129146
13199 129146 -387729 91217 -33234 64874 236228 183672 297080 191558 -190684 110090
13188 333271 277580 169445 154925 187640 81953 213416 296539 245444 -218534 112034 279576
13177 279576 -47958 154147 217532 -98665 78356 -65957 -321045 -35504 -162094 82461 41322
13166 41322 -195518 511750 206802 -138112 129228 265717 -60050 159350 -51325 108180
13155 114364 300336 73625 15844 29616 -26707 -62767 136803 469402 -26813 628239 262128
13143 -58956 168027 221509 -62930 -271020 419224 220494 117792 108708 -197337 240792
13132 -469321 -46450 70333 109943 191631 58974 -210508 8965 63613 198499 128466 282317
13121B82317G3093K20592R172a01667A59255J16746j05190G4315d3181j21298
13111a64479C78486H0540l7153g8121B54916A12790M4162o0770K05874h1393A92869
13099A5188J20338K082b30662D04503e8549A3206J68569n9300O0653C8029L0632
13088F8661e3476A02567b71196C09997G8558h2769A61737F9819K51984C2662J48125
13077A80787a74310A14353R2627O8232J41863A36302o057J10757J55487F5392
13066d6002b0487B97949a1501E7944L52787c2888B44036a87187E1338K30224G6948
13054B21916j3742a16011C43388j12703f9217b8587C31410a296B0689b75122F6705
13042E64706k66079d7222k9135E8666a6562B25692bj5380I582J57344J8134C8048
$$ plain form
13121 282317 73093 293685 302857 -101667 159255 276001 170811 74315 -43181 -164479
13111 -164479 378486 80540 43387 -78121 254916 112790 156952 96182 302056 -81393 192869
13099 15188 135526 137608 -230662 404503 -58549 13206 181775 122475 183128 38029 68661
13088 68661 -53476 102567 -271196 309997 78558 -82769 161737 69819 321803 32662 180787
13077 180787 -174310 114353 206980 275212 417075 136302 130245 241002 396489 65392
13066 -46002 -20487 297949 -11501 57944 410731 -32888 244036 -187187 51338 281562 76948
13054 221916 208174 -116011 343388 230685 -69217 -28587 331410 -1296 20689 -275122 66705
13042 564706 298627 -47222 -76357 58666 -16562 225692 -2 -15382 9582 166926 185060 38048
13029D0713j0053O9763a41701B59825j02260b69721B25932H0549K65206l928A40754
13017a0497E922N178a47721B47339J57736g9430A9754M353i3637B51527J14516
13006C66043F7229Q1254m3783K95089A21325m0124K7993J12179a8425A8722g0776
12994A68243P0281a0900k9439B13543C6186n584g0507G924J6600a36080D06668
12982a84935K2797D56762a69650H3875e63898B91362c6011o0514B26271N7558
12972B83829A14860D0778g1592A97769j4591P9116B1650h4035L2302E19812b93280
12960A0628c8658A01820c56332m5124A43426P165L68321k15583o9690J53290a35836
12948E7626a00595F2264J74746o2149a00133b76B06142i8246c2824C95562a50909
$$ plain form
13029 40713 30660 100423 -141701 259825 157565 -269721 225932 80549 345755 341827 140754
13017 -10497 5922 11100 -147721 247339 405075 -79430 19754 24107 -93637 251527 366043
13006 366043 67229 148483 104700 399789 121325 81201 109194 221373 -18425 18722 -70776
12994 168243 238524 -10900 -40339 213543 36186 30602 -70507 7924 24524 -136080 406668
12982 -184935 -162138 456762 -169650 83875 -563898 291362 -36011 -96525 226271 283829
12972 283829 114860 40778 -71592 197769 183178 262294 21650 -84035 -51733 519812 -293280
12960 10628 -38658 101820 -356332 -401456 143426 150591 518912 303329 233639 386929 -135836
12948 57626 -100595 62264 237010 174861 -100133 -276 206142 -98246 -32824 395562 -150909
12936a67666A45146O7023A04789B3397K16897a24584A88006K4282O796a57743
12925i3987j5672B42938i5268E2165g4609p7342c1179l3448G0135L19440j03527
12914B86048J43464a53314C6092J97259a36476k1040B9058a56380B96788E6280
12903b64631P6024G2737e8687A03997c59582F19a15534j00167m9519a5039j24245
12892a39284K7295H656J64648b8760A90280I3830J35872c6541F1050L15280c5169
12880A1541K2944f3868l41221a00163p2438j83996H3622a46281B09569b05237
12869B91598D3516e2517A26323l0956a91672E2289a21305C4257j4888J13034h1389
12857a25376B1409b7254B70804C0646b63017f5207C3290J5113a33957H8569a01633
$$ plain form
12936 -167666 145146 212169 104789 23397 240294 -124584 188006 212288 219084 -157743
12925 -93987 -109659 242938 -95268 52165 -74609 -151951 -31179 -64627 70135 389575 286048
12914 286048 429512 -153314 36092 233351 -136476 -157516 29058 -156380 296788 56280
12903 -264631 -188607 72737 -58687 103997 -359582 619 -115534 -215701 -265220 -15039 -139284
12892 -139284 -111989 8656 173304 -28760 190280 93830 229702 -36541 61050 376330 -35169
12880 11541 34485 -63868 -405089 -100163 -172601 -356597 83622 -146281 209569 -205237
12869 291598 43516 -52517 126323 95367 -191672 52289 -121305 34257 19369 132403 -81389
12857 -125376 21409 -27254 270804 30646 -263017 -65207 33290 48403 -133957 88569 -101633
12845d2571A17204j4604K03860p2874a60668j1200A00726N6491J20775f202E2984
12833B39392a27622j31176C90539A05765D7218L03514f029j64697k7010A6855
12822a04456j750A87004H9764a11823A04208L74291A43798a34363C9259h4935
12811g6526C72798j26662g409B81322C333J37940M31J71258A00483J99940H8460
12799D59099A96069G0148a01739B80569K7397C5904a7107j35722C78890A43939
12788C5556J21428e6348J2011D6990N0088g8404k24567M1871c5863j01458a1456
12776a4663j35250i062C1507j1812R7713b33111B01713q3368f7393n0704F1454
12764b25571c0242B62418j01171C8612P816b88287J03906c2849A7870P197J46592
$$ plain form
12845 -42571 117204 102600 306460 233586 -160668 -171868 100726 157217 277992 -6202 52984
12833 239392 -127622 -258798 390539 105765 47218 350732 -6029 -170726 -197736 16855
12822 -104456 -106206 187004 89764 -111823 104208 478499 143798 -134363 39259 -84935
12811 -76526 372798 246136 -7409 281322 3333 141273 141704 312962 100483 300423 88460
12799 459099 196069 70148 -101739 280569 307966 35904 -17107 -152829 378890 143939
12788 35556 156984 -56348 -44337 46990 97078 -78404 -302971 -261100 -35863 -137321 -11456
12776 -14663 -149913 -9062 31507 19695 117408 -233111 201713 118345 -67393 -118097 61454
12764 -225571 -30242 262418 161247 38612 46428 -288287 -184381 -32849 17870 25067 171659
12753A71659j0940h5268E3958b52547B29542G2669K8530b11027C58831i514F6829
12741B20102G5278M69238a43635E7012b23944C4270N2532R1234O9624A9341J89993
12730B09334D7926l640a33805k1094q2165C39512a84302a0995C9198h8312j5812
12719a04124D6947M6954J47681f1626k25135d0114I235L24215b05571G7617c1719
12707A67545c0640q0571E8797L52795j83015J6079j2641O7256A01022j0140J48273
12696B39155A9718J75795q2783R6516G1297J56050D4297a176j0205A98125J34891
12685C33016b78032e3296C57483C8809a78537m1851G8807J42721r6411h178D191
12673a49129B38758F698e0344B22230i912D0613M7168k1057c4808j44375h056
$$ plain form
12753 171659 160719 -85268 53958 -252547 229542 72669 101199 -211027 358831 -9514 66829
12741 220102 75278 544516 -143635 57012 -223944 34270 86802 178036 247660 19341 209334
12730 209334 47926 44286 -133805 -154899 -237064 339512 -184302 -10995 39198 -88312 -104124
12719 -104124 46947 93901 241582 -61626 -286761 -40114 9235 333450 -205571 77617 -31719
12707 167545 -30640 -111211 58797 411592 228577 244656 232015 299271 101022 90882 239155
12696 239155 19718 195513 112730 209246 71297 227347 44297 -1176 -11381 198125 333016
12685 333016 -278032 -53296 357483 38809 -178537 -220388 78807 221528 125117 -8178 4191
12673 -149129 238758 6698 -50344 222230 -9912 40613 87781 66724 -34808 -179183 -8056
12661a9899j19850G5193k9316c9649l45140e8294B97550I693J83395n1231F8380
12649E01534B11557J6415F6870K13888a37662A7355a37924e41k3057p1017B20718
12637b09630C6919J32641b25962R5331D99909B1569Q8712a07508F98641C29928
12626A59948N3224J961k0753J89239I6935J71642c1942j4132D09105H0680J36855
12615B17535I2187h5467D48361K3723A41112a92938b41A93005a29136O0362o0904
12604a29678A56404J07467O10g676C64820H9849a38374A82100d091A09205D8687
12592h185I7764N4976c761l8855B97451c374A23727a30496b6547j3780k1787j03044
12580a65158A13673c27132d2109j32077C86987i6786A08410a4555B51636G0568
$$ plain form
12661 -19899 -139749 75193 45877 -39649 -384789 -58294 297550 9693 193088 141857 68380
12649 501534 211557 227972 66870 280758 -137662 17355 -137924 -541 -23598 -94615 220718
12637 -209630 36919 169560 -225962 -130631 499909 21569 110281 -107508 698641 329928
12626 159948 213172 215133 194380 383619 96935 268577 -31942 -46074 409105 80680 217535
12615 217535 92187 -85467 448361 472084 141112 -192938 -241 193005 -129136 -68774 -129678
12604 -129678 156404 263871 264481 -7676 364820 89849 -138374 182100 -4091 109205 48687
12592 -8185 97764 152740 -3761 -42616 297451 -3374 123727 -130496 -26547 -40327 -62114 -165158
12580 -165158 113673 -327132 -42109 -174186 386987 -96786 108410 -14555 251636 70568
12569E9153J7675a84203A59218p9606h2721B37362m8979f8063m2231B25764r2622
12558A33142b2193E0820a5212G8947J1621K65715h4492F1098B1595J75846L794
12547B01235C3948M056b22045C5418K60460J32253a33501P951D9765b60777C26966
12535B39692b77570d4613A801b1012j75936m3295c7568D6124b28793i610H5499
12523D3551j9301K46218D7767a26214B94991J03660b31636B0315J91615a97226
12512b29700A99551C9725N7336O2874R6007A00508c0994I9037a80942e810o5314
12501g1124j89508A8527L0555J63552e0509j84323o475c2124A7354J93597C6381
12489B5205J2876m421f9056j58971J04236K8158a3293B89889c3763B04084a52854
$$ plain form
12569 59153 76828 -184203 159218 79612 -82721 237362 188383 -68063 -110294 225764 133142
12558 133142 -22193 50820 -15212 78947 90568 356283 -84492 61098 21595 197441 201235
12547 201235 33948 38004 -222045 35418 295878 428131 -133501 -125550 49765 -260777 326966
12535 239692 -277570 -44613 1801 -21012 -196948 -240243 -37568 46124 -228793 -9610 85499
12523 43551 24250 270468 47767 -126214 294991 398651 -231636 20315 211930 -197226
12512 -229700 199551 39725 97061 159935 255942 100508 -30994 99037 -180942 -5810 -71124
12501 -71124 -260632 18527 49082 212634 -50509 -234832 -241307 -32124 17354 210951 36381
12489 25205 38081 33660 -69056 -228027 -123791 -95633 -13293 289889 -33763 204084 -152854
12477c6156B13913A01032O8975J26715A42007N4833K3805c79476a2836l3288F6058
12465a9716l01783E7852L6047a13488B04528r142b5799F3177c14181E12367F3733
12453a0065j84014A86868e7722j3977A71841J61462B2083h8526C82281a57529
12442a71337P6463J3099k20866a42108f3682k89112i5513B32104k4442J20399
12432C28061C991a4355B71795a01125A22967J06401d44770c6861j30187h0972
12421a247A6748f6655n2877A16520A9280c7789B93053a16241l4794B378b3604
12409A31152h1898j26093i6519a005n0460n4822M7544k26401i5077A11483C3723
12397a5614C48529a17751a086k97899e4875k01079J01256K7270b6602o817D4663
$$ plain form
12477 -36156 213913 101032 170007 296722 142007 196840 220645 -379476 -12836 -46124 66058
12465 -19716 -321499 57852 93899 -113488 204528 195386 -25799 63177 -314181 512367 63733
12453 -10065 -194079 186868 -57722 -71699 171841 333303 22083 -88526 382281 -157529
12442 -171337 -94874 -81775 -302641 -142108 -63682 -352794 -95513 232104 207662 328061
12432 328061 3991 -14355 271795 -101125 122967 229368 -444770 -36861 -167048 -80972
12421 -1247 16748 -66655 -119532 116520 19280 -37789 293053 -116241 -151035 2378 -23604
12409 131152 -81898 -207991 -96519 -1005 -51465 -106287 -58743 -285144 -95077 111483 33723
12397 -15614 348529 -117751 -1086 -298985 -54875 -255954 -154698 -127428 -26602 -33419 44663
12385B35843I0939J18117n2118B9148N5912M4925a13487C1619K7803h4375j42938
12374b27313i2508j10267D4211a47022J3078L3762k20590B83243c0058F0625F297
12362A6464J06819A8925P0188n62i8342I4365a00935m5669H2366k9010f7237C26483
12349A8542M6947k3860j986J71778D5968L3921k1439a38870O1481j99291c3195
12337c5087A93929a07948C11896a34167d3137o8992A38557h3750A28324a36420
12326a70013e2646R536j77793A00668K38116G2184a90856C9009a58188A37847
12315C4829b19191j75879a01661A4279O591L27305j19776D420J99497F2683N0772
12304A13455a73312d3181r5931f6524q0969B02722O5650c00920J48035A82944
$$ plain form
12385 235843 90939 209056 156938 29148 85060 129985 -113487 31619 59422 -84375 -227313
12374 -227313 -92508 -202775 44211 -147022 -133944 -100182 -320772 283243 -30058 60625 6297
12362 16464 123283 18925 89113 88551 -98342 94365 -100935 -146604 82366 53356 -67237 326483
12349 18542 65489 41629 39643 211421 45968 79889 58450 -138870 -77389 -276680 -33195
12337 -35087 193929 -107948 311896 -134167 -43137 -112129 138557 -83750 128324 -136420
12326 -170013 -52646 -43110 -220903 100668 338784 72184 -190856 39009 -158188 137847
12315 34829 -219191 -395070 -101661 14279 20870 348175 228399 4420 203917 62683 113455
12304 113455 -173312 -43181 -139112 -66524 -147493 202722 268372 -300920 -152885 182944
12293D72207I0392K44719a4006A32558A8855J70423m9689A9171a71355B33517
12282A07217J26102b0889A23224B4628J57260a79763C73757A65402n1185c53006
12271f6856b9733j91228A28955A1716P5764g6375C70562K313A05465a7187B10241
12259B63092A442J06055M8811J91061A934Q7154a23137A30775a87297E4760J80310
12248B35070O5216E3589j4196K20398n2967O831E536J42770J91807a10073A46512
12236A2577L33771a78324A05051K55684b8996E74024e4184A39667J60429p3762
12226B26334K9544G1105J33013l0492Q0437J30153L7568r0454I5515K66457l9885
12215C22087j16917B6241j397O1005B1000K7021J47566E6983J8004i9739H4776
$$ plain form
12293 472207 90392 335111 -14006 132558 18855 189278 139589 19171 -171355 233517
12282 107217 233319 -20889 123224 24628 181888 -179763 373757 165402 114217 -353006
12271 -66856 -29733 -220961 128955 11716 87480 -76375 370562 372875 105465 -17187 210241
12259 263092 1442 107497 156308 347369 1934 89088 -123137 130775 -187297 54760 235070
12248 235070 300286 53589 39393 259791 206824 213655 5536 148306 340113 -110073 146512
12236 12577 346348 -178324 105051 360735 -28996 574024 -54184 139667 300096 226334
12226 226334 255878 71105 204118 173626 254063 384216 421784 331330 95515 361972 322087
12215 322087 205170 26241 24844 85849 21000 48021 195587 56983 74987 -99739 84776
12203c1873A48754M53804A20707b63879e5529A7955J54570J53399Q9056A80219
12192A8167K14702i9339A92680L1186p9792b46466E4932Q3974J68740A01433a78226
12180A06703k6502J0875a68926D02684j17869c30288A487f3996A67038J01357
12170B68395K9689A18806l1670K45854j38998F2832O4678e0676l7080B56731I510
12158a53918A73614J28566b98055a17368A34162b15350B40831j11143J11353c5832
12147F0080a61662J960C62026B6899M7604a20999j49686R0255n836a6575j94157
12136b10732N5802j71877C6730a33011C62758a82354B93825d7204C30983I4346
12125f8005k62481J2770A39271M7811i8388A59731h4513K3443J8017I5747i1805
$$ plain form
12203 -31873 148754 602558 120707 -263879 -55529 17955 172525 325924 414980 180219
12192 18167 232869 -99339 192680 223866 144074 -246466 54932 138906 307646 101433 -178226
12180 106703 80201 91076 -168926 402684 284815 -330288 1487 -63996 167038 268395
12170 268395 298084 118806 87136 332990 193992 62832 127510 -50676 -87756 256731 9510
12158 -153918 173614 302180 -298055 -117368 134162 -215350 240831 129688 241041 -35832
12147 60080 -161662 -159702 362026 26899 74503 -120999 -270685 -180430 -186266 -16575 -210732
12136 -210732 -154930 -326807 36730 -133011 362758 -182354 293825 -47204 330983 94346
12125 -68005 -330486 -317716 139271 187082 -98388 159731 -84513 -61070 -43053 95747 -91805
12113a23911A81028C8148a12H8999c02838a23190I668b02801A31785K8515a22312
12101b25755f0588G3033N0991a16517J3431N526j53044b9529G0884J88446J74408
12090D33738b8118A48442a58661r6429B63998c5624J7030n5722B06147l156I0757
12078G29169Q03601G16545B24064g4031N329A5115J25666e2650K1617k11613P6993
12067a65653C8673M61136G0059dj99705A85439q8916O7618c52426a10110I6507
12055A43284m2525A3864d715j04186r1806F1928d7977B4688a92199c9950k63937
12044c03887A11262g5030E094b64842A09482b18007P126g6806R074j96869A42191
12032a38956A81543E4076c32173Q6512e4599j5894B5879Q1683O831l1620b39826
$$ plain form
12113 -123911 181028 38148 -112 88999 -302838 -123190 9668 -202801 131785 160300 -122312
12101 -225755 -60588 73033 124024 -116517 -103086 -97560 -250604 -29529 70884 259330 433738
12090 433738 -28118 148442 -158661 -255090 263998 -35624 -18594 -74316 206147 202991 90757
12078 729169 1532770 716545 224064 -74031 -68702 15115 140781 -52650 -31033 -242646 -165653
12067 -165653 38673 499809 70059 -4 -199709 185439 96523 164141 -352426 -110110 96507
12055 143284 100759 13864 -4715 -108901 -200707 61928 -47977 24688 -192199 -39950 -303887
12044 -303887 111262 -75030 5094 -264842 109482 -218007 -210881 -76806 -67732 -264601 142191
12032 -138956 181543 54076 -332173 -245661 -54599 -70493 25879 107562 114393 82773 -239826
12020B72519a699C28381g2085B86573h4071E088c8619C5956R2701b6159E1520
12008a84122B57436b90601D14556b25798A76660a18920A51400F0914j5990d13936
11997B0215i0690d0750A89209a38584A90907a51156L8428a8756j86027F793d268
11985A38049L3437L29309b75663A21951a7072m2271J3503q3600C9889R6576a58621
11973H275b3875k6740B04449J90769E4774d6021A78921J40824b25402G6630h7321
11961a01497q7126j95762G9582e46j68568o4928l14249c5898k12275F4984a6051
11949A6594J73213g9108C4223a12649A52310a93672m94K5379p8198B86955a92287
11937b00830d1854F9343b3266j29358a1674D640a48658B79959q6209b00199A39461
$$ plain form
12020 272519 -1699 328381 -72085 286573 -84071 5088 -38619 35956 128657 -26159 51520
12008 -184122 257436 -290601 414556 -225798 176660 -118920 151400 60914 44924 -413936
11997 20215 -90690 -40750 189209 -138584 190907 -151156 -112728 -18756 -204783 6793 -4268
11985 138049 171486 500795 -275663 121951 -17072 -59343 -45840 -129440 39889 136465 -158621
11973 8275 -23875 -50615 204449 395218 54774 -46021 178921 319745 -225402 76630 -87321
11961 -101497 -188623 -384385 79582 -546 -169114 -234042 -548291 -35898 -248173 64984 -16051
11949 16594 189807 -79108 34223 -112649 152310 -193672 -194166 -168787 -246985 286955 -192287
11937 -200830 -41854 69343 -23266 -152624 -11674 4640 -148658 279959 193750 -200199 139461
11925b7930o1094q664B50356b65198K3228A48937a56925a8875A21672m0293B1670
11913a05630B4444d6769A50389D2957J10260l4082a74734E9512g3335A29478b34706
11901a7130A45819E9647b24420l856i2232D4305a70089I4688a88146B35683J53773
11890C89456A9718d9892A59119h4287L388L6531k91272C79016a72848o3549J12990
11879a23407A69075F0364d00026a74188N4732k4771j15123C33464B0488a20497
11868A43763c28170D0075N3318l1116G053i7950j49742g7019k08912d4439D5171
11856G08549I7316a92663O4695B48040b6839A22808J5510h9562J4481j31698A80725
11844B66183G3506J6343b13882B54109i3529l93434C4635K11525j07792Q5012
$$ plain form
11925 -27930 -89024 -97688 250356 -265198 -241970 148937 -156925 -18875 121672 81379 21670
11913 -105630 24444 -46769 150389 42957 153217 119135 -174734 59512 -73335 129478 -234706
11901 -17130 145819 59647 -224420 -228276 -92232 44305 -170089 94688 -188146 235683 389456
11890 389456 19718 -49892 159119 -84287 -80899 -44368 -335640 379016 -172848 -236397 -123407
11879 -123407 169075 60364 -400026 -174188 -119456 -144227 -259350 333464 20488 -120497
11868 143763 -328170 40075 93393 62277 7053 -97950 -247692 -77019 -285931 -44439 45171
11856 708549 97316 -192663 -127968 248040 -26839 122808 138318 -89562 -75081 -206779 180725
11844 266183 73506 89849 -213882 254109 -93529 -486963 34635 246160 138368 223380
11834B23380a8185o6037j1605r4663b0823B3543a08784A8327d95869K11911i5831
11822I1126a94342A7933c0131A93231B7235b16371E6787e8431b736l41915D5337
11810B8607e6104k65058f0090j46965M5338A40975Q1631B1462a8528l43874i2197
11798c40104a16356B41230f3515j76197c4260j53373P9767H8837a51700c6739
11787a19237A75733D1671b693k66056B8015Q5047O8391b8147F2284k4539P4995
11776A12740a32869j11616f8842j06725p6580A64613A5101K18079B784J10584
11766A13368M1619b30732b1562j0840B71461a06054D5522c40035J30165H5050
11755e24920a31048j8811j0235A4455B128R0821L780R6102H30b2289G4013j3658
$$ plain form
11834 223380 -18185 -84222 -95827 -190490 -20823 23543 -108784 18327 -495869 -283958 -95831
11822 91126 -194342 17933 -30131 193231 27235 -216371 56787 -58431 -2736 -344651 45337
11810 28607 -56104 -321162 -60090 -207055 -161717 140975 222606 21462 -18528 -362402 -92197
11798 -340104 -116356 241230 -63515 -239712 -34260 -187633 -107866 88837 -151700 -36739
11787 -119237 175733 41671 -2693 -268749 28015 113062 181453 -28147 62284 37745 112740
11776 112740 -132869 -244485 -68842 -175567 -252147 164613 15101 233180 2784 113368
11766 113368 154987 -230732 -21562 -32402 271461 -106054 45522 -340035 -209870 85050
11755 -524920 -131048 -149859 -160094 14455 2128 92949 96729 192831 830 -22289 74013 60355
11743F0355H458h175j19928D30418A92472B8272J69445I7537K26580a24390e1887
11731I1698B7678J5549Q9116J727C5753M5187B7736J04660j1301j9217d6514k33646
11719b80160g9689C47530D4860a46419c7126j42613A18044a51859N1692A0237
11708b18586j7765d9221A72847a81141B57652a7333A01454K88771a7843C9298
11697A38755K58623g7276j72141j23757E717O9891a1407A3619b6015A17727J96188
11686C13915b27202a8543l7766B36263J7488i5077Q431B58839F226J96919p5693
11675A27452K08433l7726q0689D9796b68882C30034A32908b56430A03002a33781
11664B11201b04840C07695b0594A36123K2495h3515A65179L7251r9483C7304J27994
$$ plain form
11743 60355 8458 -8175 -128103 430418 192472 28272 197717 97537 324117 -124390 -51887
11731 91698 27678 43227 132343 134070 35753 80940 27736 132396 121095 101878 -46514 -280160
11719 -280160 -79689 347530 44860 -146419 -37126 -179739 118044 -151859 -100167 10237
11708 -218586 -236351 -49221 172847 -181141 257652 -17333 101454 390225 -17843 39298
11697 138755 397378 -77276 -249417 -373174 5717 75608 -11407 13619 -26015 117727 313915
11686 313915 -227202 -18543 -56309 236263 253751 -95077 -86646 258839 6226 203145 127452
11675 127452 335885 298159 217470 49796 -268882 330034 132908 -256430 103002 -133781
11664 211201 -204840 307695 -20594 136123 158618 -83515 165179 202430 102947 37304 165298
11653A65298J15432A14776b41265B75283G772a76278h1348D7943e4539F2828J23198
11642A86026D2616b23403L4524E562a2488F4702h1560a8608j22327L6743A30702
11630D84823a74346A4356e74837K84668C6078a95090A05907M16658A0985K23963
11620B34948p5200l2203a75137b4873j71515I4616J00499G9038a1453o5027C38793
11608C26230j32917p3744a2169k15423A72568J88965a29789A18219i4268L7065
11598e7203G0638J47859f7208A59124b822j42662A2765J59892o2176e079j72834
11587a77913A09396g139A42100N4669J16655j35818j2461J26079A30600d5568
11576A25495C5313J20231a05923b068k7354E7730i018C15404c8522A72381J38921
$$ plain form
11653 165298 280730 114776 -241265 275283 7772 -176278 -81348 47943 -54539 62828 186026
11642 186026 42616 -223403 -188879 5562 -12488 64702 -81560 -18608 -140935 -104192 130702
11630 484823 -174346 14356 -574837 -290169 36078 -195090 105907 522565 10985 234948
11620 234948 159748 127545 -175137 -24873 -196388 94616 195115 79038 -11453 -76480 338793
11608 326230 193313 119569 -12169 -227592 172568 361533 -129789 118219 -94268 -57203
11598 -57203 70638 218497 -67208 159124 -2822 -145484 12765 172657 110481 -5079 -177913
11587 -177913 109396 -7139 142100 196769 313424 177606 165145 291224 130600 -45568
11576 125495 35313 155544 -105923 -2068 -29422 57730 -9018 315404 -38522 172381 311302
11565C11302a90845D9547N5074m819f4574B60220d0241B82546h978r8813A50752
11553C33891C079a59440A87062c471C8166Q4577N1852B1045a44197E9938c469
11541H8365B2340d2489A69688J3241C4739J23859J51597o8017I8328l8392B0518
11529A33074J57148m9783k0058l0935b78882a17170N6384A74735N0526n8222d3897
11517D81683k20769B2720N5714k3773J6894j5456a09053C4021J10713K05201A72411
11505B17379f4141j71687C66894A40965K76083C4784K65232E5573j3294O8774
11495A11053C4989P0961K97197c76532A367K00648m6087L6404G9444j4400J25746
11484A90790f9136F7098d6936B60219o0555K17379A40792a09155B89999o9038
$$ plain form
11565 311302 -190845 49547 104621 99802 -64574 260220 -40241 282546 -8978 -107791 150752
11553 333891 3079 -159440 187062 -3471 38166 122743 174595 21045 -144197 59938 -3469
11541 88365 22340 -42489 169688 182929 34739 158598 310195 242178 98328 59936 20518
11529 133074 290222 240439 220381 189446 -278882 -117170 -60786 174735 225261 167039 -43897
11517 481683 260914 22720 78434 54661 71555 56099 -109053 34021 144734 349935 172411
11505 217379 -64141 -235828 366894 140965 417048 34784 300016 55573 42279 111053
11495 111053 34989 105950 403147 -376532 1367 202015 155928 192332 79444 65044 190790
11484 190790 -69136 67098 -46936 260219 199664 417043 140792 -109155 289999 220961
11474B20961m3187c6062B42410a430C41272I0624K27789E4097Q415g8136j1061
11463h9197A49398q514l5026B1798R0074J40245g3794C89141j47999b9895C95868
11451C08455F9502J23680B7684a01021C54142n3175a59056G3361a99976A26252
11440I3751J09303a98609f1257B7357a20873N0971L0290A25409A3181J99298a13259
11428A52156K15331b4682p3737C14262D9627b88369P7268a02536A64654o9667
11418I4987e8285a3122j22129C2357R1522a95682e0269k29145g6882p9712J7380
11407a39214A51536J45510c8371k33318h4461A39268o8260j0682K17054I1612
11396a44303F029J11372f3015k58742a6162j91923d8343E3534g6263c6290B149
$$ plain form
11474 220961 177774 -36062 242410 -1430 341272 90624 318413 54097 62512 -78136 -89197
11463 -89197 149398 140884 105858 21798 111872 252117 -73794 389141 241142 -29895 395868
11451 308455 69502 193182 27684 -101021 354142 300967 -159056 73361 -199976 126252
11440 93751 203054 -198609 -61257 27357 -120873 -69902 -39612 125409 13181 212479 -113259
11428 152156 367487 -24682 -98419 314262 49627 -288369 -211101 -102536 164654 94987
11418 94987 -58285 -13122 -135251 32357 123879 -195682 -50269 -279414 -76882 -156594 -139214
11407 -139214 151536 297046 -38371 -271689 -84461 139268 71008 60326 277380 91612
11396 -144303 6029 117401 -63015 -321757 -16162 -208085 -48343 53534 -76263 -36290 2149
11384E136J66590a39278a6238D32328b4941c519m76034a467D69295a12787A83551
11372C39608a21073G2282n568f6540A69508R4379b72345R3781h9205A03267c80203
11360A30360F1688a7386A57021n9403b21544A49031b51864n7955i3453A8902b00539
11348d3050B61578a02496C8927b78588C75528A47764b81172A28051a41794A77059
11337a12619A38166i8047H4334e1268D89611F3972J79600a55801N7570k05126
11327c03357D7878a98827b1516l43092H8786J15164q9337H322Q6816L4250J66227
11316B95615n2702l2779B9715b33273C3048b3465q3082A61423b25541A7315J9463
11305C6778b17979M1644N9172B27323j05419b99636I5402b30136A43969Q7080
$$ plain form
11384 5136 171726 -139278 -16238 432328 -24941 -3519 -479553 -1467 469295 -112787 183551
11372 339608 -121073 72282 66714 -66540 169508 263887 -272345 -178564 -89205 103267 -380203
11360 130360 61688 -17386 157021 97618 -221544 149031 -251864 -309819 -93453 18902 -200539
11348 -43050 261578 -102496 38927 -278588 375528 147764 -281172 128051 -141794 177059
11337 -112619 138166 -98047 84334 -51268 489611 63972 243572 -155801 -98231 -303357
11327 -303357 47878 -198827 -21516 -364608 88786 203950 114613 8322 95138 129388 295615
11316 295615 242913 210134 29715 -233273 33048 -23465 -106547 161423 -225541 17315 36778
11305 36778 -217979 -176335 -117163 227323 121904 -299636 95402 -230136 143969 231049
11295B31049d2799k838H7455b34336K7906A22181K3083n4748a3110l52925i1984
11283a85869G3072B7357f9108E3502i8587G9301J58189a08955j35969P1232B62762
11271h4165k74712a63631O5397a4346k0461m07576H326K6683M8262H837J59187
11260A68024d864j32294C82546A58065C8826e1856k56476f6897q8599A32115b52293
11248f7085j96707c8553F9507e54867d0753a8366j40980H0403o951a8518B13139
11236A1948K67748A0389b47906F3078H709a78174d3393A16883D930d6262A04759
11224A0620a05107A73082a48588D9793b70424M0554b731q9145j79609e1874l07454
11213c59328F0926b1838l61290B90146a33197k4657c6131p9231K6679A11030a86632
$$ plain form
11295 231049 -42799 -45637 87455 -234336 -206430 122181 145264 90516 -13110 -366035 -91984
11283 -185869 73072 27357 -69108 53502 -98587 79301 237490 -108955 -244924 -173692 262762
11271 -84165 -358877 -163631 -98234 -14346 -34807 -442383 8326 35009 83271 8837 168024
11260 168024 -4864 -137158 382546 158065 38826 -51856 -308332 -66897 -155496 132115 -252293
11248 -67085 -263792 -38553 69507 -554867 -40753 -18366 -159346 80403 73452 -18518 213139
11236 11948 279696 10389 -247906 63078 8709 -178174 -43393 116883 4930 -46262 104759
11224 10620 -105107 173082 -148588 49793 -270424 -229870 -2731 -91876 -271485 -51874 -359328
11213 -359328 60926 -21838 -383128 290146 -133197 -157854 -36131 -115362 -88683 111030 -186632
11201a55115r4129l798A40100b55471M7222m9338I8022c15883g2390L4847k21294
11190b58837A09558j360R7617a53904l0766D73876I6337Q4007b68652a15205h546
11178a8719k68187d4613j10694j10844A2901K7258a29714i975k08004j36933a32703
11166a42489f4111l03050g1124B35011k4336l6046b18701r530C3533l235J7183
11155D7481i8120k06265A05607l4807R8321N4114I6031a60010G858J12138b22456
11143g7033B79833b30189B87011j00697b45605i1880A36725f3273r4844L0914
11133a27203j87326B52790A02469b38741B8724n038K52329a80951c5828j28834
11123a64662A23177J4636E0772A1012O7567J81765e3199H6635a30430A07774b28880
$$ plain form
11201 -155115 -249244 -253042 140100 -255471 -208249 -257587 98022 -315883 -72390 -37543 -258837
11190 -258837 109558 108198 205815 -153904 -184670 473876 96337 180344 -268652 -115205 -8546
11178 -18719 -286906 -44613 -155307 -266151 12901 40159 -129714 -9975 -217979 -354912 -132703
11166 -142489 -64111 -367161 -71124 235011 210675 174629 -218701 -228231 33533 30298 47481
11155 47481 -98120 -304385 105607 70800 169121 223235 96031 -160010 7858 119996 -222456
11143 -77033 279833 -230189 287011 186314 -245605 -91880 136725 -63273 -158117 -127203
11133 -127203 -314529 252790 102469 -238741 28724 23686 276015 -180951 -35828 -164662
11123 -164662 123177 137813 50772 11012 78579 260344 -53199 86635 -130430 107774 -228880
11111D5528J11148r917K9471O0780o5259O6368J511a6299C8464J84962D6039K81771
11099C27810A10327O5032J51552R1569H2808j1294R130P3585K10679E7164P4336
11088A31500b1900B73237j30942j8674m1019K16909B3626K24582k8343E760P6748
11077H2508J46206J20953a55195b8635B74364P7027j62138K5083n6031R9010j6964
11066B40351J14454J51753j24628J56611B31535L02832J63312k01117j65195J63955
11056D95322l4099K39177N2816k45958N8174J93453n8258K82769j21132j46641
11046G15623l7194K63435k34087J00040r0337k2224j30351J72017j91532L37011
11036H82401l67043L39824k05721r750m0268j72414K17811P8644j61590j4444
$$ plain form
11111 45528 156676 146759 176230 237010 171751 238119 239630 -16299 38464 223426 46039 327810
11099 327810 110327 175359 326911 418480 82808 71514 80644 154229 364908 57164 131500
11088 131500 -21900 273237 142295 123621 82602 299511 23626 248208 219865 5760 82508
11077 82508 228714 349667 -155195 -28635 274364 351391 189253 214336 158305 257315 240351
11066 240351 354805 506558 381930 538541 231535 534367 697679 496562 331367 495322
11056 495322 461223 700400 753216 507258 565432 758885 700627 983396 862264 715623
11046 715623 678429 941864 707777 807817 717480 695256 564905 736922 545390 882401
11036 882401 515358 855182 649461 639711 599443 427029 644840 723484 561894 547450
11026E47450j22194M96934l16952j51924Q8207k4756J8091j42554k3871O57230
11016A025661D83889K06718C40476N23587j99440B56176R9773K67438N0307r7986
11006E75708P3691j91384N4048p2859K24475j79325K10516K0753p6987J9964k14822
10995D43778L99873D21455L08564P0534L2695j77775j29665M32247m0650O2339
10985I79744j17723K97586j87207L7738m2506K45109K80815k41372K22018L58864
10975A833066J55530J79545N22651K19546j37515J69504m10839O6248m80490l65322
10965A751924J00278j09100J0888j3526j91204K77060l80596K91394k98480J01270
10955A539908J91976j86061R7497m52278q6537k18708K0352j23717l37967j06998
$$ plain form
11026 547450 425256 922190 605238 453314 541521 516765 534856 392302 368431 1025661
11016 1025661 483889 690607 340476 864063 664623 256176 355949 623387 673694 575708
11006 575708 649399 458015 512063 439204 663679 484354 694870 715623 638636 658600 443778
10995 443778 843651 421455 730019 800553 833248 655473 525808 958055 917405 979744
10985 979744 862021 1159607 972400 1010138 967632 1212741 1493556 1252184 1474202 1833066
10975 1833066 1988596 2168141 2690792 2910338 2772823 2942327 2531488 2597736 2117246 1751924
10965 1751924 1852202 1743102 1753990 1740464 1549260 1826320 1445724 1737118 1438638 1539908
10955 1539908 1731884 1545823 1643320 1191042 1104505 885797 906149 782432 444465 337467
10945C37467j51624K77701j67588p8228I9319K45367f197B39435p3598A5085a90545
10933A70243E287P9521L7878K9860J21663k6568a52341C73925a40303B62923m2558
10922B20365E2802K06184c607B25855e6820A77581f9366H8861c8708j39771A19039
10910b87710A43236a27757H618J03123b68835B88985Q899b5350l08390A07504
10899A87920J8695H2116f5598I6701b31729C40591a68886A23499m3501J32520
10889B12518f1050j25328h0938B03257H2741h9049k4644A45909a44815k02845
10879c47660B85117r8469a1544n9024G0412Q7452i5037B97130a16624j6332B74968
10867a13014C62257p4964A34613d6046k64935J33683M3393A04089a96142i2538
$$ plain form
10945 337467 185843 463544 295956 217728 99319 344686 -6197 239435 165837 15085 -190545
10933 170243 5287 84808 122686 152546 274209 247641 -152341 373925 -140303 262923 220365
10922 220365 52802 258986 -3607 225855 -56820 177581 -69366 88861 -38708 -178479 119039
10910 -287710 143236 -127757 8618 111741 -268835 288985 297884 -25350 -333740 107504
10899 187920 206615 82116 -65598 96701 -231729 340591 -168886 123499 79998 212518
10889 212518 -61050 -186378 -80938 203257 82741 -89049 -113693 145909 -144815 -347660
10879 -347660 285117 186648 -11544 -70568 70412 157864 -95037 297130 -116624 -132956 274968
10867 -113014 362257 287293 134613 -46046 -310981 -177298 -133905 104089 -196142 -92538
10856A79128g6879F6476B5401b8641D9638a12380j18986q107C13412c99369i4609
10844A98711A9840a36132A20838a58007A03330b8582A20912g2941k7912j90205
10834b91058Q0961j13370A26660g3533j67787A7761a64703B9472F675a27255I0909
10822B08837I7356d27596C4216a46007k76658C217L6615P7273J51888b91171A50513
10810f804j74193D8442a57169k0768E22J27904J63743b37981d7251A17219a46200
10798d37444i5839B55552C111L8056a19181g000n502j96130G7000L1931g6193
10786a77214H9780h782H3132c45910C3654J6294a05254N1873B96990E6095L8420
10775I4515M0413a43572a3316k2221E1520a0163k08006A31401i4630A90533B1344
$$ plain form
10856 179128 -76879 66476 25401 -28641 49638 -112380 -231366 -239473 313412 -399369 -94609
10844 198711 19840 -136132 120838 -158007 103330 -28582 120912 -72941 -100853 -291058
10834 -291058 -210097 -323467 126660 -73533 -241320 17761 -164703 29472 6675 -127255 90909
10822 208837 97356 -427596 34216 -146007 -422665 3217 39832 117105 268993 -291171 150513
10810 -6804 -180997 48442 -157169 -177937 522 128426 292169 -237981 -47251 117219 -146200
10798 -437444 -95839 255552 3111 41167 -119181 -7000 -12502 -208632 77000 108931 -76193
10786 -177214 89780 -8782 83132 -345910 33654 49948 -105254 -53381 296990 56095 94515
10775 94515 134928 -143572 -13316 -35537 51520 -10163 -218169 131401 -94630 190533 21344
10763A25127h1290B35606f2067m20305I9515a16852b8521g434l19431i5107l46255
10752d41362F6204l1932K64005G0252b01539d0738J0696D4917P8015P8306b75934
10740c66223a5806A55284c8192j23009d5938A2176J73628e9117D3369a43356A66353
10728A28162o0210k6270J63473c0517p8678F5831j6801J93534a14390b0643l18353
10717c38996a6765A21778R0685c1352j94786j121A33483A6525J75942h1793j03665
10706a85458L4165p4069B5555d4434I6336J8943O2370B6534c8068H5583g4096
10694B05342d3552A29018h977l13473i8198A56399f8656p2459N7332A0203a14554
10682h3813A8726b48857A27567K1715b68973I9574a61141G5811f4216l04739a626
$$ plain form
10763 125127 -81290 235606 -62067 -482372 99515 -116852 -28521 -7434 -326865 -95107 -441362
10752 -441362 66204 34272 298277 70252 -201539 -40738 -30042 44917 122932 201238 -275934
10740 -366223 -15806 155284 -38192 -161201 -45938 12176 185804 -59117 43369 -143356 166353
10728 128162 67952 41682 205155 -30517 -109195 65831 49030 242564 -114390 -20643 -338996
10717 -338996 -16765 121778 212463 -31352 -226138 -227259 133483 16525 192467 -81793 -185458
10706 -185458 -151293 -225362 25555 -44434 96336 115279 177649 26534 -38068 85583 -74096
10694 205342 -43552 129018 -8977 -322450 -98198 156399 -68656 -141115 -83783 10203 -114554
10682 -83813 18726 -248857 127567 149282 -268973 99574 -161141 75811 -64216 -368955 -1626
10670D6583e3076A2106i732j24114M2306A42839k614J96555i0421D4724N5K33632
10658B78411A23256a19849K4972A9881J03262g479j67918M4214B71780c0362j65878
10647a96240p3746A44977a39235o9347j2877B210J31651C7700a58362A36624a07068
10635a22384A16782B0322J3674n143J34514b43108M9269B476i6936A86747M022
10624A90769O240b0256n9805r2701M9855l74714A06952h5109j60851M4458G662
10612C5885b23304A48905P7720b71878a04461L6498j67777l9425m0457J15505
10602b00117j06073b9319n9196F0598b95259D1777c6075k99352A18498b1056A04017
10590a48572K5505A14404J27988i0642C29893c5695j93751J03441q5336D9472
$$ plain form
10670 46583 -53076 12106 -9732 -133846 -91540 142839 140225 336780 -90421 44724 44779 278411
10658 278411 123256 -119849 -94877 19881 123143 -7479 -175397 -131183 271780 -30362 -196240
10647 -196240 -269986 144977 -139235 -208582 -221459 2210 133861 37700 -158362 136624 -107068
10635 -122384 116782 20322 33996 28853 163367 -243108 -193839 2476 -96936 186747 190769
10624 190769 197009 -20256 -80061 -172762 -122907 -497621 106952 -85109 -245960 -201502 7662
10612 35885 -223304 148905 226625 -271878 -104461 -67963 -235740 -275165 -315622 -200117
10602 -200117 -306190 -29319 -88515 60598 -295259 41777 -36075 -335427 118498 -21056 104017
10590 -148572 -123067 114404 242392 -90642 329893 -35695 -229446 -126005 -211341 49472
10579F311N0285b4050k16293C9586c103A4195b1691n7808L5208p3806K4887r6362
10567a89572A69117G4553f4512h383F6848a38352M9661j1538J1901B38048D4469
10555c12817A18889g1895n5065f1943p7363R864J3704B65945A2976h6045k24410
10544c10455O8056G3681K72519a92188c9457d454A36573L4867E2858a12565j29927
10533b42492d081o0351i745C1910b26073A54668a14180A50910o2397a56276A74525
10521e3892f685B31021f8644A67614e0180H6868b12077E0439J57347E918a21302
10509G8897J4942N2722b54279J643h0750r3645k2902A42947K5268B8836a01683
10497d0933q3114B62272q275c72987A34255O9945c85028a64148g0143j0507B7813
$$ plain form
10579 6311 56596 -24050 -240343 39586 -3103 14195 -21691 -79499 -44291 -118097 -93210 -189572
10567 -189572 169117 74553 -64512 -8383 66848 -138352 -88691 -100229 -88328 238048 44469
10555 -312817 118889 -71895 -126960 -61943 -139306 -129442 -115738 265945 12976 -86045 -310455
10544 -310455 -242399 73681 346200 -192188 -39457 -4454 136573 171440 52858 -112565 -242492
10533 -242492 -4081 -64432 -9745 31910 -226073 154668 -114180 150910 88513 -156276 174525
10521 -53892 -6685 231021 -68644 167614 -50180 86868 -212077 50439 207786 5918 -121302
10509 78897 93839 146561 -254279 -252636 -80750 -174395 -197297 142947 168215 28836 -101683
10497 -40933 -124047 262272 253997 -372987 134255 204200 -385028 -164148 -70143 -80650 27813
10485E3652J71931i8284D40306A49743N2562L69618B38867K61771j47981e9176
10474E6869K00425a20969j56627A38404r466A2564L9812Q7924J04615A21830E595
10462A88976f6286n7383b5827I535a15970J6330d7602A11532h6640k36268F5717
10450a78872A36891b60142A21952a62365l0789e4718G6394a1845j36327a9728
10439b4475B65092b05859M3216J9859k89070i279j02321j60918C70597A00791
10428a0289p2297G5939q757N9276d1764A9171J71367d33360c8300F9350a87782
10416a05769E7734k655O028c45160A4128b04619B1606a55773g1290p002p461a9018
10403b63737H4372J51769A16937b93985F0633A8023P7099e0866b132C4010K15384
$$ plain form
10485 53652 225583 -98284 440306 149743 202305 571923 238867 500638 352657 -59176
10474 56869 257294 -120969 -277596 138404 128938 12564 52376 140300 244915 121830 5595
10462 188976 -66286 -123669 -25827 9535 -115970 -99640 -47602 111532 -86640 -322908 65717
10450 -178872 136891 -260142 121952 -162365 -193154 -54718 76394 -11845 -148172 -19728
10439 -24475 265092 -205859 -162643 -142784 -431854 -9279 -111600 -272518 370597 100791
10428 -10289 -82586 75939 67182 126458 -41764 19171 190538 -433360 -38300 69350 -187782
10416 -105769 57734 55079 61107 -345160 14128 -204619 21606 -155773 -71290 -78292 -85753 -19018
10403 -263737 84372 236141 116937 -293985 60633 18023 95122 -50866 -2132 34010 249394
10392B49394o8041R9487D5682a48772A29377C8781J18556R948B6594i0481A80222
10380i720A7149K98040d2314D04199l9771j70948J42843j30384O3194O2414P2080
10369D03627j648j62144o4803K74322j02016K07256m3630j7634J9369B27141O4215
10358B91356A35603k7933a36475D46745k19586A01408J82499J35426P9703Q3455
10348E82491B73902j01076L8184K0916J78853A35125J59477j9700j29739B5465
10337D22510d16872B1511K10502o3540M4757L5493a8871A13136a44270H2942P4293
10326A57235J56933A17031p993K51214n3830L6324R6366C8700r628K98491I1997
10314A66966b16857C68466f8211K186Q040B33153q6352c79160g4346B13339D9030
$$ plain form
10392 249394 181353 280840 45682 -148772 129377 38781 157337 167285 26594 -90481 180222
10380 -9720 17149 315189 -42314 404199 364428 193480 336323 205939 269133 331547 403627
10369 403627 401979 239835 175032 449354 347338 554594 510964 493330 512699 227141 291356
10358 291356 135603 107670 -136475 446745 227159 101408 283907 419333 499036 582491
10348 582491 273902 172826 211010 231926 410779 135125 294602 274902 145163 25465
10337 422510 -416872 21511 232013 168473 213230 248723 -18871 113136 -144270 82942 157235
10326 157235 314168 117031 109038 360252 306422 342746 439112 38700 29072 327563 91997
10314 166966 -216857 368466 -68211 -66025 -57985 233153 146801 -379160 -74346 213339 49030
10302f1589j9832Q405j48473l37310E9172J10937n3051D915M0913a484l9036A65437
10289H8019J81433a75199A6103h1919B9165b06567d4151j01877A29054f9107D91
10277B60101k8392m6757a9370d776B78527n0039I1659j7118k1036A5128J71767
10266A86895a6849k53025B77511j32929K30408m6191j25676o5654J98398q730
10256C27137k5152b83024a03096I3419a48786k90633B16153r3482M2022a9147
10245H4798a8329m8184B75899a95385r8900H66J00862f2o3770l5639B07541l0909
10233A76632K2735c3169D9228J68375A07000L9581d55035a28989c2763k74774
10223c07537J09737J8761J2260A29969E0298a39970l1339j25378I0509c70325
$$ plain form
10302 -61589 -81421 -73016 -221489 -558799 59172 170109 117058 4915 45828 -1484 -40520 165437
10289 88019 269452 -175199 16103 -81919 29165 -206567 -44151 -146028 129054 -69107 491
10277 260101 231709 184952 -19370 -4776 278527 228488 91659 74541 53505 15128 186895
10266 186895 -16849 -269874 277511 144582 374990 328799 203123 137469 335867 327137
10256 327137 301985 -283024 -103096 93419 -148786 -439419 216153 122671 164693 -19147
10245 84798 -18329 -66513 275899 -195385 -294285 866 101728 -62 -63832 -99471 207541 176632
10233 176632 199367 -33169 49228 217603 107000 146581 -455035 -128989 -32763 -307537
10223 -307537 -197800 -179039 -166779 129969 50298 -139970 -171309 -296687 90509 -370325
10212B2741J6277J49502K0004h4894q8613J7926m7680A03675a71878a7880j58992
10201a76872F1401f764j67954k72269a58462J7771k609A6837g1735A05731a61936
10189a22693M9222K5533A17034b19432c3724k1461a9661B48869O9319D8260c57595
10177E1904h9637A76642b82163K3968a03083M8669A7355M5582b76697A42343a19131
10165I1714a84212Q733j48236b3570j85198P7916A85546D3807F759O9058c7514
10153A2613D422a50065n2756r0030A68293a84279g9015j9121n2514L5466k48573
10142c63757C6155a53326l01786a96521B4638R9263b10747f5166j0236C0243J11297
10131A41540F0419L33680c96144F406a75252j7507c1180A96260o4647C2229j4798
$$ plain form
10212 22741 39018 188520 208524 -84894 -173507 -155581 -203261 103675 -171878 -17880 -176872
10201 -176872 61401 -6764 -174718 -446987 -158462 -140691 -143300 16837 -71735 105731 -161936
10189 -122693 -73471 -47938 117034 -219432 -33724 -55185 -19661 248869 318188 48260 -357595
10177 51904 -89637 176642 -282163 -258195 -103083 -54414 17355 62937 -276697 142343 -119131
10165 91714 -184212 -175479 -323715 -23570 -208768 -130852 185546 43807 6759 75817 -37514
10153 12613 4422 -150065 -202821 -292851 168293 -184279 -79015 -98136 -150650 -115184 -363757
10142 -363757 36155 -153326 -455112 -196521 24638 123901 -210747 -65166 -75402 30243 141540
10131 141540 60419 394099 -396144 6406 -175252 -192759 -31180 196260 131613 32229 17431
10120A7431a09815D00030g7659B2209a15187B97186a08682B273N293d5255D9422
10108b44985B82228a68620q0230B5483i2940M2274p9336N9643A68797A5795A685
10096A06338c09359A24105P7944k4792m8397b37700D8575K9549l4274b28143k20582
10085d48725f8375j97343f9203B52183c34573R4207H5916M9087a12643j82830
10075b95473B11817a86457j60636R9362A05725i5640l2399k7206j33840g3354
10064d58485A92295b78326a21654C7425a81901A38239F5097M9959j7362G968a64073
10052b9516b4k0793B55889a04762N062C4252i0522E9920j8829a70574H0322c046
10039A22790L45599g5361A132P2084f9918A27627a6799n63022D009a7889r9918
$$ plain form
10120 17431 -109815 400030 -77659 22209 -115187 297186 -108682 2273 7566 -45255 49422
10108 -244985 282228 -168620 -248850 25483 -92940 -50666 -130002 -70359 168797 15795 1685
10096 106338 -309359 124105 202049 177257 128860 -237700 48575 78124 43850 -228143 -448725
10085 -448725 -68375 -265718 -69203 252183 -334573 -240366 85916 135003 -112643 -295473
10075 -295473 211817 -186457 -347093 -247731 105725 -95640 -128039 -155245 -289085 -73354
10064 -458485 192295 -278326 -121654 37425 -181901 138239 65097 115056 97694 7968 -164073
10052 -29516 -24 -20817 255889 -104762 -99700 34252 -90522 59920 41091 -170574 80322 -3046
10039 122790 468389 -75361 1132 73216 -69918 127627 -16799 -579821 4009 -17889 -117807
10028a17807K8201c7780j99726B01253a54053E1654d6749k96579r0914a6945k31216
10017b48161a15344j41244k30469a84267P5282c2491j36877k00243a01181K7808
10007g3373D7663K2617B8969a71343c0871k23921A2082a23603i261j62448j30913
9996c02622A11924J82897b98265c6848j96525f6163O368F8469a24321I4781J5169
9985A09950a96679B19205a22215d7543P736A03995a27893k16099B72454p2015
9975B00439a28747k97A7684a02450K3554I6193b46081o3520A0553R288J24641
9964A44482n3594N8456c11920B20936A01597J65154b11594m1969a02095m4125
9954a46220A16463N38a23744A25936b0027h585c277A2350b3523m10470i9605m44466
$$ plain form
10028 -117807 -89606 -37780 -237506 201253 -154053 51654 -46749 -343328 -434242 -16945 -248161
10017 -248161 -115344 -256588 -487057 -184267 -108985 -32491 -169368 -369611 -101181 -73373
10007 -73373 47663 70280 28969 -171343 -30871 -254792 12082 -123603 -9261 -171709 -302622
9996 -302622 111924 294821 -298265 -36848 -233373 -66163 -59795 68469 -124321 94781 109950
9985 109950 -196679 219205 -122215 -47543 -39807 103995 -127893 -343992 272454 200439
9975 200439 -128747 -129044 17684 -102450 -78896 96193 -246081 -309601 10553 19841 144482
9964 144482 90888 149344 -311920 220936 101597 266751 -211594 -253563 -102095 -146220
9954 -146220 116463 117001 -123744 125936 -20027 -8585 -3277 12350 -23523 -433993 -99605 -544071
9942e44071D4632J9437c45906A24969O1228c2665c992j94859M8078N2626q7697
9931a85844Q7366H4168d67472J86308A92383a34321a7317A48050L7709d3838l21892
9920c65730c1188g326A8877a49855N7403D9298c99362a53524J4641A55069a32215
9908E5984b50030A46336a63821c2909j76223A15613a51936B0817b65187C6663
9897a2039B10312F4671a96114e98k98392J18240A44784J1651d2368A7473h2125
9885b45309F687a41220A59336a59278K9779b8311k47986L440J31324H7203g285
9873f537F2035B1099f273m7357j09560j4388I7431l0566c30829J06075r038J05811
9861a27981A34334l3814b33311e7477m57235D4705b73723D5041J27011a99045
$$ plain form
9942 -544071 44632 64069 -345906 124969 186197 -32665 -3992 -198851 -150773 -98147 -185844
9931 -185844 -98478 84168 -467472 -281164 192383 -134321 -17317 148050 185759 -43838 -365730
9920 -365730 -31188 -7326 18877 -149855 -92452 49298 -399362 -153524 -138883 155069 -132215
9908 55984 -250030 146336 -163821 -32909 -209132 115613 -151936 20817 -265187 36663
9897 -12039 210312 64671 -196114 -598 -298990 -180750 144784 156435 -42368 17473 -82125
9885 -245309 6687 -141220 159336 -159278 -129499 -28311 -276297 -272857 -141533 87203 -7285
9873 -6537 62035 21099 -6273 -53630 -163190 -177578 97431 66865 -330829 -224754 -233792 -127981
9861 -127981 134334 100520 -233311 -57477 -514712 44705 -273723 45041 172052 -199045
9850a63158A89615a7422B16425c16538d8204j56114Q5519j76590O0316O4508c4581
9838C7724d1805j48386A51363L1054D2297i5609A31044C9642a02926o3239b4619
9826H4594h5490j19013q5714d3424m0142b5637l13427a59452I1443k7594A5547
9814h3620j98518b7408J0452l12069a07120M2925A50783c19477J53535A07351
9803b16806D016L14303q2555B1141a24645M471D2482c97555i1408I3518i0494
9791A21930a80644B07955a53075A53529d11605A5370c89279A71483d5653A44454
9780A60730c82517a2286B58878a4529A19676J02949I3610N9189a6299j04899H6095
9768B09250G8484k8966M7783K9265a19215J34L7403c086B09880j4994c21470J18578
$$ plain form
9850 -163158 189615 -17422 216425 -316538 -48204 -204318 -118799 -295389 -235073 -170565 -34581
9838 37724 -41805 -190191 151363 182417 42297 -95609 131044 39642 -102926 -166165 -24619
9826 84594 -85490 -204503 -290217 -43424 -83566 -25637 -339064 -159452 91443 63849 15547
9814 -83620 -282138 -27408 -16956 -329025 -107120 -64195 150783 -319477 -165942 107351
9803 -216806 4016 318319 235764 21141 -124645 -120174 42482 -397555 -91408 93518 -90494
9791 121930 -180644 207955 -153075 153529 -411605 15370 -389279 171483 -45653 144454
9780 160730 -382517 -12286 258878 -14529 119676 222625 93610 152799 -16299 -121198 86095
9768 209250 78484 49518 97301 126566 -119215 -119081 -81678 -3086 209880 194886 -321470 -202892
9756b02892K6567a238E0500h9207k21211F858c47325a18139m2626b7551l04428
9745c31979c3135D9219i456k57661L83b9377j63849o6679g3300r306n962N678
9733h2890A87078g0734j41427k8742D2381b0862A46345f8773n4214b4593j393
9722b5986o9448D7819c68219A05315a06290j87937b2195A17534E4942b02644P5130
9711a27514d8501A16365c6288j93440d8603q9024B53715d17539J96864c5474n7024
9700i2498j28429B06004F3507O9387B0721N9545b72250J16937k8996K7509A64403
9688c03250a21579L1837b5889A86848a88205f1691n6284n498A9516a06542C9579
9676A15879A5762a78640j42502A6896J97463K72286a30446j45725j28083E1489
$$ plain form
9756 -202892 -176325 -1238 50500 -89207 -310418 6858 -347325 -118139 -160765 -27551 -331979
9745 -331979 -33135 49219 -9456 -267117 -266734 -29377 -193226 -259905 -73300 -82606 -88568 -82890
9733 -82890 187078 -70734 -212161 -240903 42381 -20862 146345 -68773 -122987 -24593 -25986
9722 -25986 -95434 47819 -368219 105315 -106290 -294227 -22195 117534 54942 -202644 -127514
9711 -127514 -48501 116365 -36288 -229728 -48603 -137627 253715 -417539 -220675 -35474 -92498
9700 -92498 -220927 206004 63507 132894 20721 80266 -272250 -155313 -184309 -156800 164403
9688 -303250 -121579 -89742 -25889 186848 -188205 -61691 -117975 -123473 19516 -106542 39579
9676 115879 15762 -178640 -321142 16896 214359 486645 -130446 -276171 -404254 51489
9665f1200q6687f6526r4925C7508b67505b3516j42181q4943a07256a534F7128
9653e4879J2208j29267k5149A05131a07723H6389J86337l6220c9159l4797p8028
9642a51984A58329e9963B61025a59768N5617D8433K8731a04302m6760e5902E6070
9630F9812c05865B8699c13347e0838F4449a55452J8480E4580h5546K7385j85347
9619b43508j86541b07683B77338c36347a20708B14530b25947h8438j4106F2010
9608B10935a06803N0780j42211l9485I9328B6574J6586d9050A09008a01013K1015
9597g9998j31076h5679l91486A14355k0405b19306E8576a22730G1626a22026j55211
9586b77237j89O5092k4803J0101C9757J90543b13060J04790C5031a0436j97934
$$ plain form
9665 -61200 -147887 -66526 -161451 37508 -267505 -23516 -165697 -250640 -107256 -1534 67128
9653 -54879 -42671 -171938 -197087 105131 -107723 86389 272726 236506 -39159 -73956 -151984
9642 -151984 158329 -59963 261025 -159768 -104151 48433 77164 -104302 -151062 -55902 56070
9630 69812 -305865 28699 -313347 -50838 64449 -155452 -136972 54580 -85546 -58161 -243508
9619 -243508 -430049 -207683 277338 -336347 -120708 214530 -225947 -88438 -102544 62010
9608 210935 -106803 -56023 -198234 -237719 99328 26574 43160 -49050 109008 -101013 -79998
9597 -79998 -211074 -85679 -477165 114355 93950 -219306 58576 -122730 71626 -122026 -277237
9586 -277237 -277426 -212334 -237137 -227036 39757 230300 -213060 -108270 35031 -10436 -208370
9575b08370H9907a7069B20584I7852A1133O0724d4654f900b739q1470j39993k05937
9563d30139E783L46890I8336e5926j09031B25b78419a01873d6061q2988j47894
9552b76943a25776H9916N7535g2671D06922A40041h1549k93039a42505A8444a72418
9540b05917A13927a74744o0623l0206B8839f3398D3686a43953D3575J27671b60917
9528a64799c9360j2167C2310a30346H4444g728k66882P2056B04171d08110g2243
9516b6919A05689e9760j40442N7679O1718j68147a572k85963A16647f3158I050
9504c80171d7817o848B4986P7340D1080L76621I9860C1406K81149a5798C8457
9492a61871C720c27565J50543E0411a50848f2366l9810k16906f4059A98046F5702
$$ plain form
9575 -208370 89907 -17069 220584 97852 11133 71857 -44654 -6900 -2739 -84209 -224202 -430139
9563 -430139 5783 352673 98336 -55926 -164957 225 -278419 -101873 -46061 -129049 -276943
9552 -276943 -125776 89916 147451 -72671 406922 140041 -81549 -374588 -142505 18444 -172418
9540 -205917 113927 -174744 -235367 -265573 28839 -63398 43686 -143953 43575 171246 -260917
9528 -164799 -39360 -51527 32310 -130346 84444 -7728 -274610 -202554 204171 -408110 -72243
9516 -26919 105689 -59760 -200202 -142523 -80805 -248952 -1572 -287535 116647 -63158 9050
9504 -380171 -47817 -54665 24986 102326 41080 417701 99860 31406 312555 -15798 38457
9492 -161871 3720 -327565 -177022 50411 -150848 -62366 -102176 -319082 -64059 198046 65702
9480A15531b00177A4521c2537G2052j9925M7432K5309m3767l7248a92699O4746
9469a27953q191M5703H786J45322a76885r745k46141A50215D6076c091q9818B36170
9456C05641h9072D0126b69384g9463j29515b3614E218K8569b47246c0573b969
9444a55938j04015k24674b15397J01849B59026b73738L3866G4167k882h2818F1989
9432B02533L8718g4264H140a23004F0070a4937q0436j37693j51045b9699j53948
9421a83647K5170j16928A17783C7041c10295D4351a78316A64810a61000B8189
9410A5723a33049A61301a04338b9283B62338a42744A21022a47664o6922d6498
9399A03537j8195e6274C5917c7864A39098c50773A81315E8883b08375g3868a0686
$$ plain form
9480 115531 -200177 14521 -32537 72052 52127 99559 124868 81101 43853 -192699 -127953
9469 -127953 -136144 -90441 8786 154108 -176885 -186630 -432771 150215 46076 -3091 -92909 236170
9456 305641 -89072 40126 -269384 -79463 -208978 -23614 5218 33787 -247246 -30573 -2969
9444 -155938 -259953 -484627 -215397 -113548 259026 -273738 -239872 74167 71285 -82818 61989
9432 202533 241251 -74264 8140 -123004 60070 -14937 -95373 -233066 -384111 -29699 -183647
9421 -183647 -158477 -275405 117783 37041 -310295 44351 -178316 164810 -161000 28189
9410 15723 -133049 161301 -104338 -29283 262338 -142744 121022 -147664 -214586 -46498
9399 103537 85342 -56274 35917 -37864 139098 -350773 181315 58883 -208375 -73868 -10686
9387A59883a05546c5983a2586B34607c46763J62264C6876c30444B45740g1224
9376e4314j67353b5606A03236i1627D8072b64477B05381B2810a48884A50304b15102
9364b31722A88354l4977d45800F8015b54495N2872b1034A09890g4290j55215n637
9353b35142j12851k5779d5623A62481C0154d8732B42842b03989i2099c948j15518
9342a19466P822E0145g0544j76321C6631Q0265a29948n8454H7953h4277k65011
9331c49288A55871J79457j59093b65363j10469d8695l02330A06766l5703Q9827
9321A60890e42699C3042a2189o0811J1680l9201A90128a69960A24006f3150C462
9309c6321j13392j69892l7362A0016b33018A66738N3143c1970J740k37977O0013
$$ plain form
9387 159883 -105546 -35983 -12586 234607 -346763 -184499 36876 -330444 245740 -71224
9376 -54314 -221667 -25606 103236 -91627 48072 -264477 205381 22810 -148884 150304 -215102
9364 -231722 188354 153377 -445800 68015 -254495 -201623 -21034 109890 -74290 -229505 -235142
9353 -235142 -347993 -373772 -45623 162481 30154 -48732 242842 -203989 -92099 -3948 -119466
9342 -119466 -111644 50145 -70544 -246865 36631 116896 -129948 -188402 87953 -84277 -349288
9331 -349288 155871 335328 176235 -265363 -375832 -48695 -351025 106766 71063 160890
9321 160890 -542699 33042 -12189 -73000 -61320 -100521 190128 -169960 124006 -63150 3462
9309 -36321 -149713 -319605 -356967 10016 -233018 166738 219881 -31970 -30230 -268207 -208194
9298b08194j8427R6969b5755l35832L3738P7193B59011d0940o9068n7757A23069
9286b47299B95820b17777a9076q7512l49192c9711G341b41500f2598B10083b28547
9274A69594g9876j09363A7143a51451n2844l1031Q9270B14522a02726A83642p2538
9263A11104c6291F1353a33676D21563I0243N6108a10049R6D8783r033L69320D4760
9250b62337g5940I9349D7743d61150a3409l13565e4808C3947b93155A4285e8169
9238b26576c1553k59004L2310i3329k64506B5263a02214B38427b79251A15407
9227f1300a0479j28291N40o7066O4706e2298j6010H8239e0991B4683L1385g516
9214d3935l7450r356k13894B04082b05308c9368B10609a96852C6557a23558c5142
$$ plain form
9298 -208194 -226621 -129652 -25755 -361587 -327849 -250656 259011 -40940 -110008 -167765 123069
9286 -247299 295820 -217777 -19076 -106588 -455780 -39711 7341 -241500 -62598 210083 -228547
9274 169594 -79876 -189239 17143 -151451 -204295 -235326 -146056 214522 -102726 183642 111104
9263 111104 -36291 61353 -133676 421563 90243 146351 -110049 -109953 48783 39750 409070 44760
9250 -262337 -75940 99349 47743 -461150 -13409 -326974 -54808 33947 -293155 14285 -58169
9238 -226576 -31553 -290557 -258247 -93329 -357835 25263 -102214 238427 -279251 115407
9227 -61300 -10479 -138770 -138230 -205296 -140590 -52298 -68308 88239 -50991 24683 56068 -7516
9214 -43935 -81385 -90741 -304635 204082 -205308 -39368 210609 -196852 36557 -123558 -35142
9202a56748b4857p3285B86999a32620H4151f4111F3345i6623j26813B4843d01311
9190g0294A35306K01852A08883a93886M7704m5618f9215j11548B1283f6806B8068
9178a70712H6198P7482a20996j11433B9181a58134k35338G7915Q8231d37510E9200
9166F8180a50301C48508c0926A99389e762A91515B2184a81724A46043c0431B553
9154D6816k1107J01937m4038b61552a16024j76250J10837Q9467j09938j2990A11425
9142B27299b86561a04278F5395e9797q111a5353I6861a12314l7790d8353o7032
9131a15385m5078j098K7255l42802b29242d3574B71132A958d43388J89592H6192
9119a49103j13154N6915A95569c3489j94818k7996N9919b5960k72905a1930l34305
$$ plain form
9202 -156748 -24857 -98142 286999 -132620 84151 -64111 63345 -96623 -223436 24843 -401311
9190 -70294 135306 337158 108883 -193886 -146182 -191800 -69215 -180763 21283 -66806 28068
9178 -170712 86198 163680 -120996 -232429 29181 -158134 -393472 77915 166146 -437510 59200
9166 68180 -150301 348508 -30926 199389 -5762 191515 22184 -181724 146043 -30431 2553
9154 46816 25709 127646 83608 -261552 -116024 -292274 -181437 -91970 -201908 -214898 111425
9142 227299 -286561 -104278 65395 -59797 -67908 -15353 96861 -112314 -150104 -48353 -115385
9131 -115385 -160463 -161561 -134306 -477108 -229242 -43574 271132 1958 -443388 -253796 86192
9119 -149103 -262257 -205342 195569 -33489 -228307 -256303 -196384 -25960 -298865 -11930 -346235
9108c46235A36575a51060J2407A62503b1615k4611D213a96080k9897g9657A22557
9096g0297L1088B70102D6573K10055b86075G6109a53781B45989m9791d8332A15732
9084d2687g703C0231J1084a57715P5847B71863i5081F0570k4812d9413j36413
9073a85826a2213a647A7761K0603b42873c1435l1077j4270I878M4291b1600j9830
9061d1430N219l69531i6151L1693p6828A14236a51247d6049k7501K5170k3280
9050g1660F9317h4098J4813o293j71413g7619k11974G4747a48852m6568k02100
9039c97520J64278a8166l83126Q5075O5037e9753j4433A981L07716q8565D4933
9027e42171g6549q5126e1651B1386P7848a85907C11111a03656E2509a5174j88420
$$ plain form
9108 -346235 136575 -151060 -138653 162503 -21615 -46226 4213 -196080 -225977 -79657 122557
9096 -70297 -39209 270102 46573 256628 -286075 76109 -153781 245989 196198 -48332 115732
9084 -42687 -7703 30231 41315 -157715 -81868 271863 -95081 60570 35758 -49413 -185826
9073 -185826 -12213 -1647 17761 38364 -242873 -31435 -62512 -76782 9878 54169 -21600 -41430
9061 -41430 -36211 -405742 -96151 -64458 -141286 114236 -151247 -46049 -73550 -48380 -71660
9050 -71660 69317 -84098 -69285 -75578 -246991 -77619 -289593 74747 -148852 -195420 -397520
9039 -397520 -233242 -18166 -401292 -316217 -251180 -59753 -74186 1981 309697 221132 44933
9027 -542171 -76549 -161675 -51651 21386 99234 -185907 311111 -103656 52509 -15174 -203594
9016b03594J01032l6467C51523a6293j42858B10130o6424a15031j60976h1827
9005b99210J48927j18763P5150C4370c33734j54279G5855a00437I494F35a44085
8993a74774A80162J04081j01774b44716e6225B69273j23500C5085L98077d6073
8982E6130i9771k63686B19050a93877A86495b5033F7222f0048l0807m2575G416
8970c22735A42201a19048a789j36913I8652e44772c9004q2167L4135J522k13104
8959b98618A8408R3226b23529M6119K4461o1468G3917Q7815C4900a19060B9176
8947I3676M2822p222a76017P3371r3853f8588j51479O6097d5978b2379r7428I796
8934A4657M05333j10831a26582K0053P455B76123g8831B17946k1682J65771K74917
$$ plain form
9016 -203594 -102562 -139029 351523 -16293 -159151 210130 143706 -115031 -276007 -81827
9005 -299210 -150283 -269046 -193896 34370 -333734 -488013 75855 -100437 9494 635 -144085
8993 -174774 180162 284243 182469 -244716 -56225 269273 145773 35085 433162 -46073
8982 56130 -99771 -363457 219050 -193877 186495 -25033 67222 -60048 -90855 -133430 7416
8970 -322735 142201 -119048 -1789 -138702 98652 -544772 -39004 -121171 -87036 -85514 -298618
8959 -298618 18408 111634 -223529 -177410 -152949 -214417 73917 161732 34900 -119060 29176
8947 93676 136498 129276 -176017 -102646 -196499 -68588 -220067 -153970 -45978 -22379 -119807 9796
8934 14657 419990 309159 -126582 -106529 -99074 276123 -78831 217946 196264 362035 636952
8923F36952K006223N970205O693847E968312A661903G61172r0783l31460A29334
8913C21721c28378A15517a97744j5845A36569m1117L6317b24540J10881j37482
8903b51141P9028r517A30171l5116g6527j41713N2658A56255i4431k2895F9504
8891b9286E0331h6087K8501n2373j54087j47399N8895A0472g5865a2614j58243
8880a70857L8462C41465H3977J46776a51718C85391a32219j13445j205j30373
8870c77242k0722D59082b04499C6189O8458a42649A51475O1820A01645b27674
$$ plain form
8923 636952 2643175 8613380 15307227 5968312 1661903 761172 670389 338929 129334
8913 321721 -328378 115517 -197744 -213589 136569 95452 131769 -224540 -113659 -251141
8903 -251141 -172113 -181630 130171 95055 -76527 -218240 -165582 156255 -94431 -117326 69504
8891 -29286 50331 -86087 -57586 -109959 -264046 -411445 -352550 10472 -75865 -12614 -170857
8880 -170857 -132395 341465 83977 230753 -151718 385391 -132219 -245664 -246869 -377242
8870 -377242 -397964 459082 -204499 36189 104647 -142649 151475 213295 101645 -227674
$$ [...]
##END NTUPLES=NMR SPECTRUM
##END=
