
##TITLE=AC1348_GUAAH12166_7433218_aV7fpcD0CK
##JCAMPDX= 6.0         $$ Bruker NMR JCAMP-DX V2.0
##DATA TYPE= NMR SPECTRUM
##DATA CLASS= NTUPLES
##ORIGIN= BRUKER
##OWNER= Administrator
$$ 1.72 TOPSPIN		Version 2.1
$$ 2013-01-30 04:19:32.228 -0500  Administrator@X
$$ Compression mode = diff/dup
##.OBSERVE FREQUENCY= 400.02188249412
##.OBSERVE NUCLEUS= ^1H
##.ACQUISITION MODE= SIMULTANEOUS (DQD)
##.ACQUISITION SCHEME= undefined
##.AVERAGES= 64
##.DIGITISER RES= 22
##SPECTROMETER/DATA SYSTEM= spect
##.PULSE SEQUENCE= noesygpps1d.comp
##.SOLVENT NAME= COFFEE_meoh
##.SHIFT REFERENCE= INTERNAL, COFFEE_meoh, 1, 14.96115
##AUDIT TRAIL= $$ (NUMBER, WHEN, WHO, WHERE, PROCESS, VERSION, WHAT)
$$ ##TITLE= Audit trail, TOPSPIN		Version 2.1
$$ ##JCAMPDX= 5.01
$$ ##ORIGIN= Bruker BioSpin GmbH
$$ ##OWNER= Administrator
$$ $$ E:\/data/COFFEE/nmr/AC1348_GUAAH12166_7433218_aV7fpcD0CK/12/pdata/1/auditp.txt
$$ ##AUDIT TRAIL=  $$ (NUMBER, WHEN, WHO, WHERE, PROCESS, VERSION, WHAT)
(   1,<2013-01-30 04:19:26.322 -0500>,<Administrator>,<X>,<go>,<TOPSPIN 2.1>,
      <created by zg
	started at 2013-01-30 04:07:56.102 -0500,
	POWCHK enabled, PULCHK disabled,
       configuration hash MD5:
       86 BA 57 50 F2 9D 5C 9B 26 00 A9 28 5F 66 2E 89
       data hash MD5: 64K
       03 E9 7D 6F 24 CD E1 CA 9C 17 FE 86 17 B0 0D DC>)
(   2,<2013-01-30 04:19:29.416 -0500>,<Administrator>,<X>,<proc1d>,<TOPSPIN 2.1>,
      <Start of raw data processing
       efp LB = 0.3 FT_mod = 6 PKNL = 1 PHC0 = 0 PHC1 = 0 SI = 128K 
       data hash MD5: 128K
       B0 A0 2C 8D 2D E2 0E 98 16 77 F6 D2 B8 32 6B F8>)
(   3,<2013-01-30 04:19:30.447 -0500>,<Administrator>,<X>,<proc1d>,<TOPSPIN 2.1>,
      <pk PHC0 = -79.18945 PHC1 = 0 
       data hash MD5: 128K
       40 FC C0 BC 0B B8 BF A3 DF AE 83 72 99 1C CC E7>)
(   4,<2013-01-30 04:19:31.150 -0500>,<Administrator>,<X>,<proc1d>,<TOPSPIN 2.1>,
      <abs ABSG = 1 
       data hash MD5: 128K
       6B 4F 66 B6 EE 67 E2 D0 33 6F FE C2 D5 B0 DD 5E>)
(   5,<2013-01-30 04:19:31.353 -0500>,<Administrator>,<X>,<proc1d>,<TOPSPIN 2.1>,
      <abs ABSG = 2 
       data hash MD5: 128K
       F5 76 B0 A1 27 32 E7 55 CA B4 DE A1 7A 1A 8D B6>)
(   6,<2013-01-30 04:19:31.525 -0500>,<Administrator>,<X>,<proc1d>,<TOPSPIN 2.1>,
      <abs ABSG = 3 
       data hash MD5: 128K
       DD 7B 0F C5 24 21 5A A4 EA D3 DD 3C 29 0A 98 5A>)
(   7,<2013-01-30 04:19:31.697 -0500>,<Administrator>,<X>,<proc1d>,<TOPSPIN 2.1>,
      <abs ABSG = 4 
       data hash MD5: 128K
       6E 00 6C 75 76 9E 97 E8 53 6B 47 89 31 C4 D8 F1>)
(   8,<2013-01-30 04:19:31.885 -0500>,<Administrator>,<X>,<proc1d>,<TOPSPIN 2.1>,
      <abs ABSG = 5 
       data hash MD5: 128K
       CD CF CB FB 01 4C 79 BA 7F 09 40 40 7C 4B 87 C3>)
$$ ##END=
$$ 
$$ $$ hash MD5
$$ $$ 2C F0 B8 96 91 81 37 18 36 D9 A7 8F 13 D4 95 DE
##$RELAX= 
##$RELAX= 
##$RELAX= 
##$RELAX= 
##$RELAX= 
##$RELAX= 
##$RELAX= 
##$RELAX= 
$$ Bruker specific parameters
$$ --------------------------
##$DU= <E:\>
##$EXPNO= 12
$$ [...]
##$TP07= 0
##$TPNAME0= <>
##$TPNAME1= <>
##$TPNAME2= <>
##$TPNAME3= <>
##$TPNAME4= <>
##$TPNAME5= <>
##$TPNAME6= <>
##$TPNAME7= <>
##$TPOAL= (0..7)
0.5 0.5 0.5 0.5 0.5 0.5 0.5 0.5
##$TPOFFS= (0..7)
0 0 0 0 0 0 0 0
##$TUNHIN= 0
##$TUNHOUT= 0
##$TUNXOUT= 0
##$USERA1= <user>
##$USERA2= <user>
##$USERA3= <user>
##$USERA4= <user>
##$USERA5= <user>
##$V9= 5
##$VALIST= <valist>
##$VCLIST= <CCCCCCCCCCCCCCC>
##$VD= 0
##$VDLIST= <DDDDDDDDDDDDDDD>
##$VPLIST= <PPPPPPPPPPPPPPP>
##$VTLIST= <TTTTTTTTTTTTTTT>
##$WBST= 1024
##$WBSW= 4
##$XGAIN= (0..3)
0 0 0 0
##$XL= 0
##$YL= 0
##$YMAX_a= 6106713
##$YMIN_a= -12554667
##$ZGOPTNS= <>
##$ZL1= 120
##$ZL2= 120
##$ZL3= 120
##$ZL4= 120
##$ABSF1= 14.96115
##$ABSF2= -5.597032
##$ABSG= 5
##$ABSL= 3
##$ALPHA= 0
##$AQORDER= 0
##$ASSFAC= 0
##$ASSFACI= 0
##$ASSFACX= 0
##$ASSWID= 0
##$AUNMP= <proc_prof1d_extract.lims>
##$AXLEFT= 0
##$AXNAME= <>
##$AXNUC= <1H>
##$AXRIGHT= 0
##$AXTYPE= 0
##$AXUNIT= <>
##$AZFE= 0.1
##$AZFW= 0.1
##$BCFW= 0
##$BC_mod= 0
##$BYTORDP= 0
##$COROFFS= 0
##$CY= 15
##$DATMOD= 1
##$DC= 0
##$DFILT= <>
##$DTYPP= 0
##$F1P= 0
##$F2P= 0
##$FCOR= 0.5
##$FTSIZE= 131072
##$FT_mod= 6
##$GAMMA= 0
##$GB= 0
##$INTBC= 1
##$INTSCL= 1
##$ISEN= 128
##$LB= 0.3
##$LEV0= 0
##$LPBIN= 0
##$MAXI= 10000
##$MC2= 0
##$MEAN= 0
##$ME_mod= 0
##$MI= 0
##$NCOEF= 0
##$NC_proc= -2
##$NLEV= 6
##$NOISF1= 0
##$NOISF2= 0
##$NSP= 0
##$NTH_PI= 0
##$NZP= 0
##$OFFSET= 14.96115
##$PC= 1
##$PHC0= -79.18945
##$PHC1= 0
##$PH_mod= 1
##$PKNL= yes
##$PPARMOD= 0
##$PPDIAG= 0
##$PPIPTYP= 0
##$PPMPNUM= 2147483647
##$PPRESOL= 1
##$PSCAL= 4
##$PSIGN= 0
##$PYNMP= <proc.py>
##$REVERSE= no
##$SF= 400.020009576933
##$SI= 131072
##$SIGF1= 0
##$SIGF2= 0
##$SINO= 400
##$SIOLD= 131072
##$SPECTYP= <>
##$SREGLST= <1H.CDCl3>
##$SSB= 0
##$STSI= 131072
##$STSR= 0
##$SW_p= 8223.68421052631
##$SYMM= 0
##$S_DEV= 0
##$TDeff= 65536
##$TDoff= 0
##$TI= <>
##$TILT= no
##$TM1= 0
##$TM2= 0
##$TOPLEV= 0
##$USERP1= <user>
##$USERP2= <user>
##$USERP3= <user>
##$USERP4= <user>
##$USERP5= <user>
##$WDW= 1
##$XDIM= 131072
##$YMAX_p= 415541229
##$YMIN_p= -12738
##$CURPLOT= <Network HP LaserJet P1505>
##$CURPRIN= <$Network HP LaserJet P1505>
##$DFORMAT= <normdp>
##$LAYOUT= <+/1D_H.xwp>
##$LFORMAT= <normlp>
##$PFORMAT= <normpl>
##$SURQMSG= 1
$$ End of Bruker specific parameters
$$ ---------------------------------
##NTUPLES= NMR SPECTRUM
##VAR_NAME=  FREQUENCY,     SPECTRUM/REAL,   SPECTRUM/IMAG
##SYMBOL=    X,             R,               I
##VAR_TYPE=  INDEPENDENT,   DEPENDENT,       DEPENDENT
##VAR_FORM=  AFFN,          ASDF,            ASDF
##VAR_DIM=   131072,        131072,          131072
##UNITS=     HZ,            ARBITRARY UNITS, ARBITRARY UNITS
##FACTOR=    0.0627417313425164, 1,          1
##FIRST=     8223.62146879497, 630,          -62149
##LAST=      0,             1847,            -62953
##MIN=       0,             -12738,          0
##MAX=       8223.62146879497, 415541229,    0
$$ Real data points
##PAGE= N=1
##DATA TABLE= (X++(R..R)), XYDATA
$$ [...]
61777D59258l407k725k006j604j514j299p53m51j031k066k399j677p26l05l03
61762D36992l98o13q56o14L53J539K278K297J557K31r03r05M1N40k46j477j864
61745D37952j405j097j396j854k012j939j887j891j720j069M7R50Q14k04r50o53
61729D21686J74O94R44J374J804J656J039O99R90J551K007K252K114J348K12n02
61713D40042l23L92R09Q38K96m18j088j665k213k739l170l478l767m049m184m147
61697D11236m164m332m331l803k925k316k351k816l210l215k923k683k736k941
61683C66490k952k684k378k181j959j622j293j021o12j03J9n49j337j602j270
61668C44946r03q00o56k17J83L6o27j173r70M1J309K105K030J274M30O5L21Q18
$$ plain form
61777 459258 455851 453126 451120 449516 448002 446703 445950 445499 444468 442402 440003 438326 437600 437295 436992
61762 436992 436594 435981 435125 434511 434864 436403 438681 440978 442535 442766 441863 440958 440999 441539 441293 439816 437952
61745 437952 436547 435450 434054 432200 430188 428249 426362 424471 422751 421682 421729 422679 423493 423289 422339 421686
61729 421686 421860 422554 423498 424872 426676 428332 429371 430070 431060 432611 434618 436870 438984 440332 440544 440042
61713 440042 439719 440111 441020 441858 442154 441736 440648 438983 436770 434031 430861 427383 423616 419567 415383 411236
61697 411236 407072 402740 398409 394606 391681 389365 387014 384198 380988 377773 374850 372167 369431 366490
61683 366490 363538 360854 358476 356295 354336 352714 351421 350400 349788 349685 349704 349155 347818 346216 344946
61668 344946 344043 343243 342587 342370 342553 342589 341962 340789 339819 339860 341169 343274 345304 346578 347008 347073 347394 348212
61650C48212J009P26L48L60Q66J650K499L156L216K566J836J825K453K819K437
61635C75978J772J270N98n64j642j820j306j128j754k623l086l157l137l070k884
61620C53447k650k396j911j053p3O26R11Q88O06J9p45j389j782k112k577k993
61604C36816k985k515k072k164k745l285l357l033k700k636k801k952k897k609
61590B98065k164j634j163r99j267j599j430p67l44p17j532k017j949j686j443
61575B77354j090o07k16j0J74M77Q76J252J303O85l53p72J11J524K030J353N14
61558B84605K62L10L01M21O76O17K63L79J173J661J092J94M4M43M51Oj79K5R7
61539B92841L1M11J227J669J353R08R26J149J055O99M98N73P05O97M63k0o51j154
$$ plain form
61650 348212 349221 349947 350295 350655 351521 353171 355670 358826 362042 364608 366444 368269 370722 373541 375978
61635 375978 377750 379020 379618 379054 377412 375592 374286 373158 371404 368781 365695 362538 359401 356331 353447
61620 353447 350797 348401 346490 345437 345364 345990 346901 347789 348395 348414 347669 346280 344498 342386 339809 336816
61604 336816 333831 331316 329244 327080 324335 321050 317693 314660 311960 309324 306523 303571 300674 298065
61590 298065 295901 294267 293104 292105 290838 289239 287809 287042 286698 285981 284449 282432 280483 278797 277354
61575 277354 276264 275657 275441 275431 275605 276082 276958 278210 279513 280198 279845 279073 279184 280708 282738 284091 284605
61558 284605 284867 285177 285478 285899 286575 287192 287455 287834 289007 290668 291760 291954 291998 292441 292892 292898 292719 292744 292841
61539 292841 292872 293283 294510 296179 297532 298440 299366 300515 301570 302269 302767 303340 304045 304742 305205 305185 304534 303380
61521C03380j241q05m6M65R5j154k363k491j363L25J750K372J931P15l08k62N86
61504C01586J108P26n8n91q92j219j421j180o08j76j81n51r75j033m21O72J597
61487B96383J867J607J188P08R1m94p21n61l31k71l07l13l59n66q56j039j057
61470B94969r77p52k43M88J099J333J313J273J162P86K28k07m62o95p89l17P42
61453B98951J663J748J176O76N95O90P47R53J502K148K323J744Q27M19R60J942
61437C19064K503K492K568L120L680L703L435L409L478L018J989J086P67P59P35
61422C55806R20J660K634L026K464J535J203J776K619K952K781K756L156L415
61408C88703K868J603K88o44j326k023k705l043k780k106j662j964k744l177k850
$$ plain form
61521 303380 302139 301334 301288 301753 301848 300694 298331 295840 294477 294802 296552 298924 300855 301570 301262 301000 301586
61504 301586 302694 303420 303362 302771 301879 300660 299239 298059 297451 297275 297094 296543 295568 294535 294114 294786 296383
61487 296383 298250 299857 301045 301753 301844 301350 300629 300068 299737 299466 299159 298846 298487 297921 297065 296026 294969
61470 294969 293992 293240 292997 293485 294584 295917 297230 298503 299665 300451 300679 300472 300010 299315 298526 298209 298951
61453 298951 300614 302362 303538 304214 304809 305499 306246 307199 308701 310849 313172 314916 315743 316162 317122 319064
61437 319064 321567 324059 326627 329747 333427 337130 340565 343974 347452 350470 352459 353545 354312 355071 355806
61422 355806 356726 358386 361020 364046 366510 368045 369248 371024 373643 376595 379376 382132 385288 388703
61408 388703 391571 393174 393462 392818 391492 389469 386764 383721 380941 378835 377173 375209 372465 369288 366438
61393C66438k161j647j317r87p86r48j325j534j441j213j028j020j239j508j532
61378C46752j317j141r65m40L08N46N0l45Q9Q86J196J100J231J530J426R93Q92
61361C52791J297J705J860J968K069K100K478L678N217O025N991O067O689P103
61347D07038O688N933N549N424N076M539M145L936L808L819L956L961L716L397
61333D70985K997K209J086K21r6l43r74j689k011k096k458l144l669l601k864
61318D54553j733p25k02J15Q26J965K971L700M704O171P366P750P982R033J0746
61303E15222J2018J2126J1233R870Q567P716P169O107L948J184j151k683l760
61290E87566m609n135n452n900o495o936p179p484p822p800p263o560o048n678
$$ plain form
61393 366438 364277 362630 361313 360326 359540 358592 357267 355733 354292 353079 352051 351031 349792 348284 346752
61378 346752 345435 344294 343329 342889 343197 343743 343793 343448 343537 344423 345619 346719 347950 349480 350906 351899 352791
61361 352791 354088 355793 357653 359621 361690 363790 366268 369946 375163 381188 387179 393246 399935 407038
61347 407038 413726 419659 425208 430632 435708 440247 444392 448328 452136 455955 459911 463872 467588 470985
61333 470985 473982 476191 477277 477498 477402 477059 476085 474396 472385 470289 467831 464687 461018 457417 454553
61318 454553 452820 452095 451893 452008 452834 454799 457770 461470 466174 472345 479711 487461 495443 504476 515222
61303 515222 527240 539366 550599 560469 569036 576752 583921 590028 593976 595160 594009 591326 587566
61290 587566 582957 577822 572370 566470 559975 553039 545860 538376 530554 522754 515491 508931 502883 497205
61276D97205n155m204k753j150j15q2o02p80k34P17J649K357K658K500K314K674
61260D96999L548M399N101O042P096P292O069M250L142K957K814K127J253P45
61246E53834N85L84q5q22j724k510k811k544k043j599j105m70j08n63j629k344
61230E34446j985q16L62J092J579K253L251M279M874M903M766M944N425N866O242
61215E81481O833P549P892P749P541P299O386M684L273L044L341L062K539K972
61201F55645M311N228N356N979P899J0018J0980J1082J1422J1951J1647J0220
61189G61738Q505P173O090M996L975K980J579l90k289l247l221l201m187o027
61175G74474p598q195q381r020r840r748q471o993o220o083o283o948p980q609
$$ plain form
61276 497205 492050 487846 485093 483943 483828 483746 483144 482364 482130 482847 484496 486853 489511 492011 494325 496999
61260 496999 500547 504946 510047 516089 523185 530477 536546 540796 543938 546895 549709 551836 553089 553834
61246 553834 554419 554803 554718 553896 552172 549662 546851 544307 542264 540665 539560 539090 538982 538419 536790 534446
61230 534446 532461 531645 532007 533099 534678 536931 540182 544461 549335 554238 559004 563948 569373 575239 581481
61215 581481 588314 595863 603755 611504 619045 626344 632730 637414 640687 643731 647072 650134 652673 655645
61201 655645 659956 665184 670540 676519 684418 694436 705416 716498 727920 739871 751518 761738
61189 761738 770243 777416 783506 788502 792477 795457 797036 796646 794357 791110 787889 784688 780501 774474
61175 774474 766876 758681 750300 741280 731440 721692 713221 706228 700008 693925 687642 680694 672714 664105
61161F64105q334p752p604p622p100o121n279m556l511k300j460p28P73K932M272
61146F09715L652J684n7p99j042j529k205k286j204O05K054K595K850L786N549
61131F23368P456Q915R933J0799J1781J3066J4658J6344J8008J9858K2059K4289
61119H00534K6059K7363K8671L0337L2214L3822L4711L4903L5033L5686L6486
61108A155819L6397L5152L3585L2169L0160K6956K3377K0408J7388J2929P217
61097A431557J855k422o365j0434j4055j7051k0255k4001k7277k9305l0710l2198
61085A219339l3127l2598l1147l0029k9365k8252k6462k4752k3535k2349k0867
61074I16856j9460j8462j7538j6210j4533j2875j1406j0094q956q012p130o107
$$ plain form
61161 664105 655771 648019 640415 632793 625693 619572 614293 609737 606226 603926 602466 601738 602511 605443 609715
61146 609715 613367 615051 614994 614195 613153 611624 609419 607133 605929 606534 608588 611183 614033 617819 623368
61131 623368 630824 639739 649672 660471 672252 685318 699976 716320 734328 754186 776245 800534
61119 800534 826593 853956 882627 912964 945178 979000 1013711 1048614 1083647 1119333 1155819
61108 1155819 1192216 1227368 1260953 1293122 1323282 1350238 1373615 1394023 1411411 1424340 1431557
61097 1431557 1433412 1430990 1424625 1414191 1400136 1383085 1362830 1338829 1311552 1282247 1251537 1219339
61085 1219339 1186212 1153614 1122467 1092438 1063073 1034821 1008359 983607 960072 937723 916856
61074 916856 897396 878934 861396 845186 830653 817778 806372 796278 787322 779310 772180 766073
61062G66073m944l914l297l078k913k461j677p48K26J277K440L728N167O589P574
61047G70042P985Q419R552J1162J2450J3385J4873J7285J9752K1422K2674K4342
61035I53343K6319K7859K8865L0049L1879L4104L6236L7903L8921L9567M0658
61024A325703M2764M5607M8857N3161N9431O7291P5452Q3644R3076J04786J18791
61013B118563J35413J56372J83847K19535K65503L24787M00132M93479O07942
61004D905573P47768R12064J088976J261552J421648J570810J697633J754881
60996A5360905J673192J413329J011047N67562J92357m8687j41972j07477R512
60987A9929768J31342J57232P101l28122p75288j218501j556565j738850j767402
$$ plain form
61062 766073 761129 757215 753918 750840 747927 745466 743789 743041 743267 744544 746984 750712 755879 762468 770042
61047 770042 778027 786446 795998 807160 819610 832995 847868 865153 884905 906327 929001 953343
61035 953343 979662 1007521 1036386 1066435 1098314 1132418 1168654 1206557 1245478 1285045 1325703
61024 1325703 1368467 1414074 1462931 1516092 1575523 1642814 1718266 1801910 1894986 1999772 2118563
61013 2118563 2253976 2410348 2594195 2813730 3079233 3404020 3804152 4297631 4905573
61004 4905573 5653341 6565405 7654381 8915933 10337581 11908391 13606024 15360905
60996 15360905 17034097 18447426 19458473 20026035 20218392 20169705 20027733 19920256 19929768
60987 19929768 20061110 20218342 20225443 19897321 19122033 17903532 16346967 14608117 12840715
60978A2840715j678324j519169j331599j143178r68160q12668o78565n64875m69138
60969C675039l89274l24032k71751k29865j96034j68991j47789j30911j16644
60960A699748j03946r2516q2350p3517o5891n8824n1465m3800l6952l2124k9546
60949A028817k8652k8693k8777k7901k5672k2790k0251j8285j6533j4937j3822
60938G82504j3239j2923j2845j3224j3933j4436j4396j3911j3190j2366j1598
60927F36443j0891r903q462p182o906p475p805p365o794o707o663o014n168n097
60913E34011n834o310n845n019m789n197n422m903l946l249l067l070k831k332
60899D72197j928j918k211k445k432k420k789l492l990l926l604l499l449k837
$$ plain form
60978 12840715 11162391 9643222 8311623 7168445 6200285 5387617 4709052 4144177 3675039
60969 3675039 3285765 2961733 2689982 2460117 2264083 2095092 1947303 1816392 1699748
60960 1699748 1595802 1503286 1420936 1347419 1281528 1222704 1171239 1127439 1090487 1058363 1028817
60949 1028817 1000165 971472 942695 914794 889122 866332 846081 827796 811263 796326 782504
60938 782504 769265 756342 743497 730273 716340 701904 687508 673597 660407 648041 636443
60927 636443 625552 615649 607187 600005 593099 585624 577819 570454 563660 556953 550290 544276 539108 534011
60913 534011 528177 521867 516022 511003 506214 501017 495595 490692 486746 483497 480430 477360 474529 472197
60899 472197 470269 468351 466140 463695 461263 458843 456054 452562 448572 444646 441042 437543 434094 431257
60885D31257j629o80o99j304j597j301r22r26j265j705k140k489k523j997q86
60870D09194N02J608K061K132K513L430M257M320L776L306L201L219L149K910
60856D49578K267J088j37o32k70K92N40N88O11L90l12j309k215k792k914k567
60840D42206k123k257l232m578n696o518p226p567p018n636m343m069m687n142
60826C72114m756m078m116m819n008l898k143r14n62p14j169j905k531k573k254
60811C30674k134k117j621p03q1J13N03J225J492R15L04M91J109J358J337J761
60795C34626K709L458L463K819J904J063N60L75J27m07q57p50k94k18q57j786
60779C45935k296k031j213n50p65j909l138l481k785j758j209j384j932k254j988
$$ plain form
60885 431257 429628 428948 428249 426945 425348 424047 423125 422199 420934 419229 417089 414600 412077 410080 409194
60870 409194 409696 411304 413365 415497 418010 421440 425697 430017 433793 437099 440300 443519 446668 449578
60856 449578 451845 452933 452796 452164 451894 452186 452726 453314 453925 454315 454003 452694 450479 447687 444773 442206
60840 442206 440083 437826 434594 430016 424320 417802 410576 403009 395991 390355 386012 381943 377256 372114
60826 372114 367358 363280 359164 354345 349337 345439 343296 342382 341820 341106 339937 338032 335501 332928 330674
60811 330674 328540 326423 324802 324099 324018 324131 324634 325859 327351 328266 328570 329061 330170 331528 332865 334626
60795 334626 337335 340793 344256 347075 348979 350042 350602 350977 351104 350697 349840 349090 348796 348578 347721 345935
60779 345935 343639 341608 340395 339845 339080 337171 334033 330552 327767 326009 324800 323416 321484 319230 317242
60764C17242j219l15M55R73J108Q49N59N89O67K46m61n42K14P95M03k84o6J089
60746C22302K209K863L526M355M650L802K157M66r91k281l222l460l096k742k842
60731C27696l119k944k158j267p80n64q8Q39J841K453K520K172J649J180P95L70
60715C30595mL0M20L42p44j968j876m46P30N22n06j305j795k381k853k701k035
60698C14025j436j180j214j505j853j839j466j339j614j503m97O07Q51O11Q35
60683C01483J357J313Q35R24J689K168K059K237L142L923L823L302L044K799K005
60668C36103Q63p2q19j692k464k599k134j626j376j200r62p75o49l08M18J230
60652C21938J553J089K08k80J23J148K126K721L011K996K440J337Q9r32j787k704
$$ plain form
60764 317242 316023 315708 316163 317136 318244 319093 319652 320241 320908 321154 320693 320151 320365 321160 321563 321279 321213 322302
60746 322302 324511 327374 330900 335255 339905 343707 345864 346330 345339 343058 339836 336376 333280 330538 327696
60731 327696 324577 321633 319475 318208 317428 316864 316776 317615 319456 321909 324429 326601 328250 329430 330225 330595
60715 330595 330591 330621 331041 331383 330639 328671 326795 326349 327079 327601 327095 325790 323995 321614 318761 316060 314025
60698 314025 312589 311409 310195 308690 306837 304998 303532 302193 300579 299076 298579 299186 300037 300648 301483
60683 301483 302840 304153 304988 305912 307601 309769 311828 314065 317207 321130 324953 328255 331299 334098 336103
60668 336103 336966 336894 336075 334383 331919 329320 327186 325560 324184 322984 322022 321247 320598 320290 320708 321938
60652 321938 323491 324580 324788 324508 324631 325779 327905 330626 333637 336633 339073 340410 340499 339567 337780 335076
60636C35076l575l936l486k551j906j989k309j982r49j66l07p63m77N89J510J682
60620C14461J313Q05L60K17N23R74J108R91R39P11j81j316j526n25N89Q64O42
60603C20949O67R16J015J155J711K337K297J477M90r3j14L80J205J970K376K408
60587C41146K056J167q9r95j034n69k71k41j63n2j17j47K54R24J375J722K649
60570C47615M239N592N955N691N710O341P198P857Q168P999P155N691M005K447
60556D31663R49p37k511l820m260m045l655l145k104m12J362K521K981L211L647
60541D21645M411N485O817Q300R856J1552J3416J5243J6725J7678J7914J7028
60529E66070J4677J1158P341L943J051j530l776n547o904q009q673q470p361n960
$$ plain form
60636 335076 331501 327565 324079 321528 319622 317633 315324 313342 312393 312227 311920 311157 310680 311269 312779 314461
60620 314461 315774 316579 316939 317156 317679 318653 319761 320752 321691 322402 322221 320905 319379 318854 319443 320307 320949
60603 320949 321616 322532 323547 324702 326413 328750 331047 332524 333014 332921 332807 333187 334392 336362 338738 341146
60587 341146 343202 344369 344280 343285 342251 341682 341411 341170 341007 340955 340838 340691 340945 341869 343244 344966 347615
60570 347615 351854 357446 363401 369092 374802 381143 388341 396198 404366 412365 419520 425211 429216 431663
60556 431663 432612 431875 429364 425544 421284 417239 413584 410439 408335 407923 409285 411806 414787 417998 421645
60541 421645 426056 431541 438358 446658 456514 468066 481482 496725 513450 531128 549042 566070
60529 566070 580747 591905 599246 603189 604240 602710 598934 593387 586483 578474 569801 561331 553970 548010
60515E48010m902m190l428k609k177k275k384j939r52K92J784L675N819P959J0246
60500E52929J3062J6353J9650K2744K5844K9020L1975L4462L6408L7444L6883
60489H56774L4490L0801K6390K1268J5326Q821J968n477j3594k1585k8348l3568
60477H93266l7618m0561m1927m1452l9454l6407l2773k9245k6533k4612k2702
60466E19982k0250j7547j5102j2951j0873q990p611o682n822m847m004l660l925
60453C97718m499m776m293l262k438k266k380k240j989k161k655k642j658l51
60439C60108K17k74j167j603j311p28m90o97o47L27J710K046O88j134j657p32
60423C54656K22L09K27Q92J887K003R27m27j065p55K26J507K565K761J887N24
$$ plain form
60515 548010 543108 538918 535490 532881 530704 528429 526045 524106 523154 523446 525230 528905 534724 542683 552929
60500 552929 565991 582344 601994 624738 650582 679602 711577 746039 782447 819891 856774
60489 856774 891264 922065 948455 969723 985049 993870 995838 990361 976767 955182 926834 893266
60477 893266 855648 815087 773160 731708 692254 655847 623074 593829 567296 542684 519982
60466 519982 499732 482185 467083 454132 443259 434269 426658 419976 414154 409307 405303 401643 397718
60453 397718 393219 388443 384150 380888 378450 376184 373804 371564 369575 367414 364759 362117 360459 360108
60439 360108 360325 360051 358884 357281 355970 355242 354752 354055 353408 353735 355445 357491 358179 357045 355388 354656
60423 354656 354878 355187 355414 356306 358193 360196 361123 360696 359631 358876 359102 360609 363174 365935 367822 368346
60407C68346l68k79M58J085J189J061J184J478J408Q78N48R51J715K088J982J900
60391C85624K011J983J758J824K450L183L467L339L166K960K429J558P76N18P96
60376D17842J288J704K007K292K527K587K509K490K502K137J229L61L43J163J965
60361D44946K153J996K011K241K530L116M359O040P407Q008Q096Q096P984P422
60347E16405O295M792L054J018j256l407n057o172o853p002o528n750n133m647
60333D79759l883k901k332k438k694k666k685l123l554l389k842k518k275j428
60319D41031K0J230J691J803K215L195M700O396P561P659P113O816O812O270M969
60304E09481L883L803M196M065L317K597K222J885J237J14j621m003o716r145
$$ plain form
60407 368346 367978 367699 368157 369242 370431 371492 372676 374154 375562 376440 376988 377939 379654 381742 383724 385624
60391 385624 387635 389618 391376 393200 395650 398833 402300 405639 408805 411765 414194 415752 416528 417046 417842
60376 417842 419130 420834 422841 425133 427660 430247 432756 435246 437748 439885 441114 441475 441818 442981 444946
60361 444946 447099 449095 451106 453347 455877 458993 463352 469392 476799 484807 492903 500999 508983 516405
60347 516405 522700 527492 530546 531564 530308 526901 521844 515672 508819 501817 495289 489539 484406 479759
60333 479759 475876 472975 470643 468205 465511 462845 460160 457037 453483 450094 447252 444734 442459 441031
60319 441031 441051 442281 443972 445775 447990 451185 455885 462281 469842 477501 484614 491430 498242 504512 509481
60304 509481 513364 517167 521363 525428 528745 531342 533564 535449 536686 536800 535179 531176 524460 515315
60290E15315j0719j1163j0654r741q771p502n693l948l230l449l365k289j064
60277D33727q49j616k504l083l465l607l292k695k299k265k297k121j738j331
60263D00565j128j203j242q40j61J34j54m49l12OK22N81J166J390R39N32Q60J374
60245D02280J136M53M12J014J058N3r54r00j21L54K16RJ68N76Q80R52J036J482
60227D10104K331L105L277K826K148J544J089Q61R58J324J780K235K640L013L587
60212D42822M606N683N861M876L840L979N013N591N107M198L605L470L769M462
60198E06882M992M580L371K426K261K153J398M21n3k40q85j966k720k767k461
60183E17392k164j865j618j766k425l210l715l925l948l610k717j616j043j288
$$ plain form
60290 515315 504596 493433 482779 473038 464267 456765 451072 447124 443894 440445 437080 434791 433727
60277 433727 432878 431262 428758 425675 422210 418603 415311 412616 410317 408052 405755 403634 401896 400565
60263 400565 399437 398234 396992 396152 395991 396125 395971 395522 395210 395216 395438 396019 397185 398575 399514 400046 400906 402280
60245 402280 403416 403869 404281 405295 406353 406406 405452 404552 404431 404785 405001 405010 405178 405754 406634 407586 408622 410104
60227 410104 412435 415540 418817 421643 423791 425335 426424 427285 428243 429567 431347 433582 436222 439235 442822
60212 442822 447428 453111 458972 463848 467688 471667 476680 482271 487378 491576 495181 498651 502420 506882
60198 506882 511874 516454 519825 522251 524512 526665 528063 528484 528431 528191 527306 525340 522620 519853 517392
60183 517392 515228 513363 511745 509979 507554 504344 500629 496704 492756 489146 486429 484813 483770 482482
60169D82482j859k085j815j322p68j58L38M17M3n12j030j383j310n92M54J152
60153D72052J275J227J338J454J413J279R13J8j068j394p06N8J74K45J053K166
60137D81497K665K697L030L524L376K699K528L153L679L487K957K488J857J029
60123E20666N50O29O42J42m31n32l15j00K64Q64J173O75l13j101j555j995k435
60106E16828k483j963j220p78r13j426j834j893j860j989j954j336n01k79p05
60091D95694q88l68K18J55l51o37m91j26J97K07k24o89o20k18l07r81j391j270
60073D87910j596k933m198m191l464l389l973m061l366k808k844k894k673k756
60059D42764l318l466k558j396j212j986k530k028q84k5J89K13O83J653K516K790
$$ plain form
60169 482482 480623 478538 476723 475401 474633 474475 474813 475230 475273 474761 473731 472348 471038 470446 470900 472052
60153 472052 473327 474554 475892 477346 478759 480038 480951 480969 479901 478507 477801 477859 478033 478278 479331 481497
60137 481497 484162 486859 489889 493413 496789 499488 502016 505169 508848 512335 515292 517780 519637 520666
60123 520666 521216 521845 522487 522629 522198 521666 521351 521251 521515 522379 523552 524227 523914 522813 521258 519263 516828
60106 516828 514345 512382 511162 510384 509471 508045 506211 504318 502458 500469 498515 497179 496678 496399 495694
60091 495694 494806 494438 494656 494811 494460 493823 493332 493206 493403 493610 493386 492697 492077 491859 491552 490571 489180 487910
60073 487910 486314 483381 479183 474992 471528 468139 464166 460105 456739 453931 451087 448193 445520 442764
60059 442764 439446 435980 433422 432026 430814 428828 426298 424270 423386 423361 423550 423763 424446 426099 428615 431405
60043D31405K735K933L437L724L514L132K954K917K762K443K085J739J371R00
60029D68051J79q73k015k834l310l938n141o676p866q240p791o795n648m796m544
60014C97763m741m792m167k927j727j194j328j560j389q59m19m68j039j772k078
59999C67303j539l72O41Q80M67Rj09M4K99O59J162J735K269K689K846K627K180
59982C83790J884J848J623P05o67j560j395p22o53j520k468k502j630p11l70m64
59966C75188n09k65K24Q55J595K363K926K907K115R26J66K75Q10J101J128J232
59950C93037J194L88j015j866j479n83l33q01j156r57n87m92o47q06p93m70K08
59933C82842R79J496J799K252K969L666M147M521M733M257K672L54j737k928l266
$$ plain form
60043 431405 434140 437073 440510 444234 447748 450880 453834 456751 459513 461956 464041 465780 467151 468051
60029 468051 468230 467357 465342 462508 459198 455260 450119 443443 435577 427337 419546 412751 407103 402307 397763
60014 397763 393022 388230 384063 381136 379409 378215 376887 375327 373938 373079 372660 372192 371153 369381 367303
59999 367303 365764 365392 366033 366913 367380 367389 367280 367324 367623 368282 369444 371179 373448 376137 378983 381610 383790
59982 383790 385674 387522 389145 389850 389183 387623 386228 385506 384853 383333 380865 378363 376733 376022 375652 375188
59966 375188 374679 374414 374638 375493 377088 379451 382377 385284 387399 388325 388491 388766 389576 390677 391805 393037
59950 393037 394231 394619 393604 391738 390259 389676 389343 388542 387386 386429 385842 385350 384703 383897 383104 382634 382842
59933 382842 383821 385317 387116 389368 392337 396003 400150 404671 409404 413661 416333 416687 414950 412022 408756
59918D08756l133k795k390k066j896j726j354p76j31N24J205J801K110K044J691
59903D01864J108M09k3J97Q54J193Q27K64J79N36Q50J000J319K040L074M169M915
59886D24775M832L986L238L325L917M182M003L870L832L526L141L265L655L311
59872D76858K027P83N4r63k744m133l821k347j439j710k215k061j364n66K34J026
59856D57619J704K384L336M499N459O074O672P582Q708R621R763Q672O432L934
59842E42459K262J750J827J805J562J457J810K397K448J363m52j840k224k215
59828E54409k550k955k742k094j945k700l846m831n606o161o264n912n534n417
59814D95852n384n188m894m609m198l509k695k067j781j761j819j827j830j956
$$ plain form
59918 408756 405623 402828 400438 398372 396476 394750 393396 392620 392489 393013 394218 396019 398129 400173 401864
59903 401864 402972 403381 403358 403555 404409 405602 406429 406693 406872 407408 408258 409258 410577 412617 415691 419860 424775
59886 424775 429607 433593 436831 440156 444073 448255 452258 456128 459960 463486 466627 469892 473547 476858
59872 476858 478885 479668 479722 478759 476015 471882 468061 465714 464275 462565 460350 458289 456925 456359 456593 457619
59856 457619 459323 461707 465043 469542 475001 481075 487747 495329 504037 513658 523421 532093 538525 542459
59842 542459 544721 546471 548298 550103 551665 553122 554932 557329 559777 561140 560688 558848 556624 554409
59828 554409 551859 548904 546162 544068 542123 539423 535577 530746 525140 518979 512715 506803 501269 495852
59814 495852 490468 485280 480386 475777 471579 468070 465375 463308 461527 459766 457947 456120 454290 452334
59800D52334k122j967j302l97L41P97R74P96L85K35N49P32K25m46k90O03J109
59783D52556P24K60M75R42Q63K96j18j76j27l0K30M58L47O0N2L52N61N81P25J110
59763D60141J405J469J677K269K815K725K082J527J467J855K630L768M840N121
59749D95791M482L749L729M178M276L852L527L684L949L888L701L892M577N362
59735E52637N723N297M115K660J532R09O11N41P34R58Q77P19J082J858K031J025
59719E83309m20j289j614k018k503k533k080j684j547j378j090r33q51m68J87
59704E63088N86N19L99N15N96M14K86O22J298J900K295K614K831K732K228J452
59688E84375N67l19j098j588j647j355j046j056j385j710j780j689j733k141k962
$$ plain form
59800 452334 450212 448245 446943 446546 446887 447684 448658 449454 449839 450074 450623 451355 451580 451134 450844 451447 452556
59783 452556 453280 453540 454015 454957 455820 456116 455998 455822 455695 455665 455895 456353 456700 456760 456812 457164 457725 458306 459031 460141
59763 460141 461546 463015 464692 466961 469776 472501 474583 476110 477577 479432 482062 485830 490670 495791
59749 495791 500273 504022 507751 511929 516205 520057 523584 527268 531217 535105 538806 542698 547275 552637
59735 552637 558360 563657 567772 570432 571964 572873 573484 574025 574759 575717 576594 577313 578395 580253 582284 583309
59719 583309 582889 581600 579986 577968 575465 572932 570852 569168 567621 566243 565153 564220 563369 562901 563088
59704 563088 563674 564193 564592 565107 565703 566117 566403 567025 568323 570223 572518 575132 577963 580695 582923 584375
59688 584375 584942 584623 583525 581937 580290 578935 577889 576833 575448 573738 571958 570269 568536 566395 563433
59673E63433l997m809n074m982n015n193n060m491m044m123m331m091l463k845
59659E01915k269j583j056j074j432j511j130o77m50l87l67l79m09n17q46j283
59643D86545j424j264j478k413l291l199k455k120k342k230j276K1J046J627J585
59628D67332O93o59j555j772k101l066m013m008l095k114j658j673j854k053k319
59613D36085k689k885k344r34N27R52J66j011j741j719r09M72J639J720Q38J51
59597D28318M99J512K223K113J427Q65J045J858K417K086J418J380J895J989J348
59582D52393O31K00l44j073j319r36q22j572k450k499j912j515j521j605j669
59567D33987j767j635j108o29p02j076j133p87m61l37k03J06N22Q92R89O81K62
$$ plain form
59673 563433 559436 554627 549553 544571 539556 534363 529303 524812 520768 516645 512314 508223 504760 501915
59659 501915 499646 498063 497007 495933 494501 492990 491860 491183 490733 490346 489979 489600 489191 488674 487828 486545
59643 486545 485121 483857 482379 479966 476675 473476 471021 468901 466559 464329 463053 463074 464120 465747 467332
59628 467332 468025 467366 465811 464039 461938 458872 454859 450851 447756 445642 443984 442311 440457 438404 436085
59613 436085 433396 430511 428167 427233 427760 428712 428878 427867 426126 424407 423498 423970 425609 427329 428167 428318
59597 428318 428817 430329 432552 434665 436092 436957 438002 439860 442277 444363 445781 447161 449056 451045 452393
59582 452393 453024 453224 452880 451807 450488 449552 448730 447158 444708 442209 440297 438782 437261 435656 433987
59567 433987 432220 430585 429477 428848 428146 427070 425937 425150 424689 424352 424149 424255 424777 425669 426658 427339 427601
59550D27601L13R24J546J883K375L340M216M333M077M606O521R287J1901J3778
59536D96701J5089J6324J7293J6600J2752O055j122o356q910r410q586o986n176
59523E34268l460j687Q3J199J129K01q66j730k314k489k435k696l398l960m134
59508E07711m611n880p131p243o319n350m802m429m059l645k946k020j665k342
59494D45269l043k442q89n1n79j334j116p1Q84J144O55j27l05O87K152K768K325
59477D45927J987K570L479L752L402L126L224L475L731M028M242M019L155J860
59463D91977P35L40O67J158J420J706K362L110L389L256L321L854M534N005N149
59448E31983M872M274L929M272M712M110K277K38j166k102k906l312l069k645
$$ plain form
59550 427601 427914 428838 430384 432267 434642 437982 442198 446531 450608 455214 461735 471022 482923 496701
59536 496701 511790 528114 545407 562007 574759 580814 579692 573336 564426 555016 546430 539444 534268
59523 534268 530808 529121 529204 530403 531532 531733 530867 529137 526823 524334 521899 519203 515805 511845 507711
59508 507711 503100 497220 490089 482846 476527 471177 466375 461946 457887 454242 451296 449276 447611 445269
59494 445269 442226 439784 438895 438844 438265 436931 435815 435744 436628 437772 438427 438300 437995 438682 440834 443602 445927
59477 445927 447914 450484 453963 457715 461117 464243 467467 470942 474673 478701 482943 486962 490117 491977
59463 491977 492712 493052 493719 494877 496297 498003 500365 503475 506864 510120 513441 517295 521829 526834 531983
59448 531983 536855 541129 545058 549330 554042 558152 560429 560667 559501 557399 554493 551181 548112 545467
59434E45467k536k375j474o7P85N26k27m96N2J133K517M229O129P762Q866R852
59418E80143J1356J3406J5390J6909J8232J9732K1429K3206K4851K5343K2745
59407G92742J5900O217k898q624j0489r859q255o178l077J534O670R746Q372K341
59393G94142o326j4924k1348k4523k4604k2871k0725j8677j6579j4495j2627j0714
59381E85729q343n809l830k529j523q96j056j621j617r42n71r30j157n61K56M54
59365E55054K97N80J384K278L185M256N199N591N602N729O053O405P034Q305R815
59350F26767J0569J0198R481R445J0277J1288J1660J1058R782Q456P503O792N746
59337G49022L739N67l260o643q600r059q857q966r805j1187j2542j3197j2831
$$ plain form
59434 545467 542931 540556 539082 539015 539800 540326 540099 539603 539655 540788 543305 547534 553663 561425 570291 580143
59418 580143 591499 604905 620295 637204 655436 675168 696597 719803 744654 769997 792742
59407 792742 808642 814859 811961 803337 792848 782989 774734 768556 765479 767013 773683 783429 791801 794142
59393 794142 787816 772892 751544 727021 702417 679546 658821 640144 623565 609070 596443 585729
59381 585729 577386 571577 567747 565218 563695 562799 561743 560122 558505 557563 556992 556062 554905 554344 554600 555054
59365 555054 555351 555931 557315 559593 562778 567034 572233 577824 583426 589155 595208 601613 608647 616952 626767
59350 626767 637336 647534 657015 666460 676737 688025 699685 710743 720525 728981 736484 743276 749022
59337 749022 752761 753328 750068 743425 734825 725766 716909 707943 698138 686951 674409 661212 648381
59324F48381j1892j1202j0998j0664r648q287p388p244p395p291o802o067n122
59311E38381l885k432j072M3J261L101N465P537Q722R359J0063J0613R990P440
59297F04586L168j936o766j0350j2277j2827j2493j1489j0024q518p046n048k385
59284E06595j77N03L95J156K841L866L641L482M294N121N133N498P623J0607J2292
59269E72870J2213J1746J1572J0897R324P821P134O574N248L471K138J378O94
59256F63080p2p22j349k211l047l253k789k311k278k404k281k094k253k581k455
59241F30980j797j356j715k532l101l304l447l466l001k240j889k152k479k554
59227E95947k826l630m483m883n232o137p171p220n958m220k909k239k092k381
$$ plain form
59324 648381 636489 625287 614289 603625 593977 585690 578302 571058 563663 556372 549570 543503 538381
59311 538381 534496 532064 530992 531035 532296 535397 540862 548399 557121 566480 576543 587156 597146 604586
59297 604586 607754 605818 599052 588702 576425 563598 551105 539616 529592 521074 514028 508980 506595
59284 506595 506418 506921 507316 508472 511313 515179 518820 522302 526596 531717 536850 542348 549971 560578 572870
59269 572870 585083 596829 608401 619298 628622 636443 643577 650151 655399 658870 661008 662386 663080
59256 663080 663008 662286 660937 658726 655679 652426 649637 647326 645048 642644 640363 638269 636016 633435 630980
59241 630980 629183 627827 626112 623580 620479 617175 613728 610262 607261 605021 603132 600980 598501 595947
59227 595947 593121 589491 585008 580125 574893 568756 561585 554365 548407 544187 541278 539039 536947 534566
59213E34566k706k413j447o89r03j706k071j650r88n01P5R76J727J646Q20N3j50
59196E24639j05l07o50o44k13J21j20p76j241j139p61p44j336k015k060j434p65
59179E10450m81l91l00m33q46r81l80N12R92J176J636K213K198J705J762K707
59163E21539L542L435K940K950L160K518Q59r12k134l040l972m693m779m308l778
59148E13327l603l846m351m839m990m635m009l663l935m522m771m455l931l438
59134D54339k731j765j216j617k326k214j239m07j37L12J461K712L409L908M862
59119D57351O087P010P709Q622R553R816R320Q702Q421Q341Q233Q050P700P068
59105E71983O390O075O071N847N117M187L378K529J279l73k002l078l277k653
$$ plain form
59213 534566 531860 529447 528000 527311 526408 524702 522631 520981 519993 519492 519567 520543 522270 523916 524736 524789 524639
59196 524639 524534 524227 523577 522933 522720 522841 522721 521945 520704 519565 518804 518060 516724 514709 512649 511215 510450
59179 510450 509969 509578 509278 508845 507999 507018 506638 507150 508142 509318 510954 513167 515365 517070 518832 521539
59163 521539 525081 528516 531456 534406 537566 540084 540943 540031 537897 534857 530885 526192 521413 517105 513327
59148 513327 509724 505878 501527 496688 491698 487063 483054 479391 475456 470934 466163 461708 457777 454339
59134 454339 451608 449843 448627 447010 444684 442470 441231 440824 440687 440999 442460 445172 448581 452489 457351
59119 457351 463438 470448 478157 486779 496332 506148 515468 524170 532591 540932 549165 557215 564915 571983
59105 571983 578373 584448 590519 596366 601483 605670 609048 611577 612856 612483 610481 607403 604126 601473
59091F01473j605o43r3r7o93j670k415k292j410p72j366l113m970o030o273o155
59075E61876n816n138m363m056m281m403l988l461l399l626l580l235l007k919
59061E06604k623k161j926j920j738j429j624k504l383l551l005k128j219n92
59047D76801n33q44r53p41o13o41l60K88O49M13J83L93N66K62J7M80J294J833
59029D78494K443L834N645O760O947P061P575P977P909P919Q568R435R636Q934
59015E79137P807O598N095L075Q86q07j873k864m053m666l697j361R49K306L044
59000E89576L685L914L267K213J781K340L318L914L639K460R14j84n35o06q47
58985F18849j088j150j407k083k532j909l57J236K344L112L843M798O230P957
$$ plain form
59091 601473 599868 599225 599132 599035 598342 596672 594257 591965 590555 589783 588417 585304 580334 574304 568031 561876
59075 561876 556060 550922 546559 542503 538222 533819 529831 526370 522971 519345 515765 512530 509523 506604
59061 506604 503981 501820 499894 497974 496236 494807 493183 490679 487296 483745 480740 478612 477393 476801
59047 476801 476268 475424 474471 473730 473117 472476 472116 472404 473053 473466 473649 474042 474608 474870 474887 475367 476661 478494
59029 478494 480937 484771 490416 497176 504123 511184 518759 526736 534645 542564 551132 560567 570203 579137
59015 579137 586944 593542 598637 601712 602598 601791 599918 597054 593001 588335 584638 583277 584226 586532 589576
59000 589576 593261 597175 600442 602655 604436 606776 610094 614008 617647 620107 621021 620837 620302 619696 618849
58985 618849 617761 616611 615204 613121 610589 608680 608323 609559 611903 615015 618858 623656 629886 637843
58971F37843R192R501R580J0343J1514J2039J1682J1298J1466J1735J1440J0514
58959G68147R291P978O560M850K630k0k637n000p439j0090j2231j3195j3486j4116
58945G21242j5001j5122j4200j3088j2263j1076r073p082o204o234n908m578k976
58932E98437k198k367k531j883p18O9K68N21J113J342O20m46q32m91k12l89p42
58915E89561j057j346j385q53J2O56J020J473K114K857L960N618P162P771P881
58900F25444Q783J0631J2073J2174J1650J1576J1872J1810J1365J1157J1537J2342
58888G62414J3367J4486J5482J6127J6300J5849J4507J2218R309O262L467J112
58876I00900r71l311o226r238j1486j2655j3084j3082j2683j2016j1277j0298
$$ plain form
58971 637843 647035 656536 666116 676459 687973 700012 711694 722992 734458 746193 757633 768147
58959 768147 777438 785416 791976 796826 799456 799436 796799 791799 784360 774270 762039 748844 735358 721242
58945 721242 706241 691119 676919 663831 651568 640492 631419 624337 618133 611899 605991 601413 598437
58932 598437 596239 593872 591341 589458 588740 588809 589077 589598 590711 592053 592673 592227 591395 590904 590692 590303 589561
58915 589561 588504 587158 585773 584920 584932 585588 586608 588081 590195 593052 597012 602630 609792 617563 625444
58900 625444 634227 644858 656931 669105 680755 692331 704203 716013 727378 738535 750072 762414
58888 762414 775781 790267 805749 821876 838176 854025 868532 880750 890059 896321 899788 900900
58876 900900 899929 896618 890392 881154 869668 857013 843929 830847 818164 806148 794871 784573
58864G84573q828p209o138n692n303m792m690n339o380p330q030q325q064p645
58850F90808p764q340q427p566o499o067o166o275o382o700o985o835o319n828
58836E94655n543n464n665o035o081n389m121k757j593o96r2L34Q17J430K015
58821E55815K549L149L660L710L421L498M313N314N709N350M606L789L056K555
58807F10494K241J823J129L28l97j103j848k582l435m694o235p416p805p656p398
58792E65446p128o857o795o985o980o318n054l581k208j154o12m71k87K10Q19
58777E12045J272J625J973K160K016J581Q35l92j993l388m086m193m058l759l287
58762D98351k954l131l645l740k867j362l01m30j219j234K70K384L564L324K431
$$ plain form
58864 784573 775745 768536 762398 756706 751403 746611 741921 736582 730202 722872 714842 706517 698453 690808
58850 690808 683044 674704 666277 658711 652212 646145 639979 633704 627322 620622 613637 606802 600483 594655
58836 594655 589112 583648 577983 571948 565867 560478 556357 553600 552007 551311 551219 551553 552370 553800 555815
58821 555815 558364 561513 565173 568883 572304 575802 580115 585429 591138 596488 601094 604883 607939 610494
58807 610494 612735 614558 615687 616015 615618 614515 612667 610085 606650 601956 595721 588305 580500 572844 565446
58792 565446 558318 551461 544666 537681 530701 524383 519329 515748 513540 512386 511774 511303 511016 511226 512045
58777 512045 513317 514942 516915 519075 521091 522672 523507 523115 521122 517734 513648 509455 505397 501638 498351
58762 498351 495397 492266 488621 484881 482014 480652 480351 479921 478702 477468 477738 480122 483686 487010 489441
58747D89441J682J233J026J107J367J671K253L379M521M718L974L469L988M888
58733E28717N120M627M189M337M904N384N365M800M052L454K832J945J287J705
58719E82718L146M499N019N116N367N565N317M883M723M655M112K977J625K57
58705F39979j288l141n079o693p843q909j0432j2271j3483j3425j2561j1707j0902
58692E22245r853q895q446p876o362m622m182m853m699l050j680k128l430l766
58678D48403l042k383k024j292j12Q01J151J398J998L042M418N748O537O854P428
58663D78925Q543R440R376Q554P381N638L222R50l88j199k317l561m143m073m097
58648E12251m429m558m223l675l030k187j411j274j924k807l166k584j271j16
$$ plain form
58747 489441 491123 492356 493382 494489 495856 497527 499780 503159 507680 512398 516372 519841 523829 528717
58733 528717 533837 538464 542653 546990 551894 557278 562643 567443 571495 574949 577781 579726 581013 582718
58719 582718 585864 590363 595382 600498 605865 611430 616747 621630 626353 631008 635120 638097 639722 639979
58705 639979 638691 635550 630471 623778 615935 607026 596594 584323 570840 557415 544854 533147 522245
58692 522245 512392 503497 495051 487175 480813 476191 472009 467156 462457 459407 457727 455599 452169 448403
58678 448403 445361 442978 440954 439662 439550 440351 441502 442900 444898 447940 452358 458106 464643 471497 478925
58663 478925 487468 496908 506284 514838 522219 527857 531079 532029 531641 530442 528125 524564 520421 516348 512251
58648 512251 507822 503264 499041 495366 492336 490149 488738 487464 485540 482733 479567 476983 475712 475596
58634D75596k2q82j617j518j022q17r31j102j360j611j371n93p0k91n63n6R63
58617D62733J705K123K644L276L797M375N063N265M531L496L062L044K598J603
58603E09315O73J06k67m19j66K54L81J34k54o95j140j461j837k583l160k240M63
58586D97104L344M838N353O211P528Q396Q493Q187P493O322N346N273N492M761
58572E84141L128K003K386M053O326Q647J0496J1845J3450J5879J8344J9523J9259
58559G19480J8555J8143J7966J7714J6864J4577J0635O197K706L90j229k113k185
58546H37700k359l491m830n083m689n352p353r272j0369j1506j3211j4566j4670
58533G30949j3928j3128j2292j1157r900q823p859o910o084n449m883m247l388
$$ plain form
58634 475596 475574 474692 473075 471557 470535 469718 468787 467685 466325 464714 463343 462750 462680 462389 461826 461770 462733
58617 462733 464438 466561 469205 472481 476278 480653 485716 490981 495512 499008 502070 505114 507712 509315
58603 509315 509988 510094 509827 509408 509242 509496 509877 510011 509757 509062 507922 506461 504624 502041 498881 496641 497104
58586 497104 500448 505286 510639 516850 524378 532774 541267 549454 556947 563269 568615 573888 579380 584141
58572 584141 587269 589272 591658 595711 602037 610684 621180 633025 646475 662354 680698 700221 719480
58559 719480 738035 756178 774144 791858 808722 823299 833934 840131 842837 843227 841998 839885 837700
58546 837700 835341 831850 827020 821937 817248 811896 804543 795271 784902 773396 760185 745619 730949
58533 730949 717021 703893 691601 680444 670544 661721 653862 646952 640868 635419 630536 626289 622901
58520F22901k171r96p57j661k659k813k583k768k973k424j621j632k180k088j287
58505E92288p99q43o66j68p3m24m69j49j39l53nP29Q29M02Q04K393L772L884L373
58486F04386L226L482L865M519N475O402P393Q935J0813J2060J2289J1964J1233
58473G06042R717P652N878M371K185q26l551n249o330p100p091o133m862l715
58459F90988k481j209k88N95K299M720O673P623Q149Q489Q038O635M874K798j44
58444G47759l481n706o356o496o647n974m269k821k445k240j338l39J04O10J812
58429G02173L039L513L734M527N665O500P012P323P021N855M313K771R55j090
58415G63311k520k864k791l049l558m052m647n202n191m666m287m055l195j764
$$ plain form
58520 622901 620730 619734 618977 617316 614657 611844 609261 606493 603520 601096 599475 597843 595663 593575 592288
58505 592288 591489 590646 589980 589812 589739 589315 588846 588697 588558 588205 588200 588929 589758 590160 590964 593357 597129 601013 604386
58486 604386 607612 611094 614959 619478 624953 631355 638748 647683 658496 670556 682845 694809 706042
58473 706042 715759 723411 729289 733660 735845 735019 731468 726219 719889 712789 705698 699565 694703 690988
58459 690988 688507 687298 687010 687605 689904 694624 701297 708920 717069 725558 733596 740231 745105 747903 747759
58444 747759 744278 738572 732216 725720 719073 713099 708830 706009 703564 701324 699986 699647 699751 700361 702173
58429 702173 705212 708725 712459 716986 722651 729151 736163 743486 750507 756362 760675 763446 764401 763311
58415 763311 760791 757927 755136 752087 748529 744477 739830 734628 729437 724771 720484 716429 713234 711470
58401G11470r07j031j082k63Q95J806K748L833M459M525M825N451N304L991K737
58386G48761K463K413J674P55O03J172J956K945M200N406O424P295P502O517N235
58371H05321N267O514P262O960O805P183O961O100O340Q056R000P806O382O911
58357I02868Q585R372R199R101Q803P401N408M065L450K979K909L741M917N593
58343I88391N866O154O271O195O602P703Q692R260J0214J1724J2653J2629J3046
58330A105400J4728J6384J6609J5658J4050J1382Q002N791N616N817M910L862
58318A228209M012M762N131N719P106Q175Q083Q105R524J1363J2210J2549J3318
58305A338266J3876J3574J3595J5070J6920J7618J7574J7823J7989J7542J7320
$$ plain form
58401 711470 710563 709532 708450 708187 709082 710888 713636 717469 721928 726453 731278 736729 742033 746024 748761
58386 748761 751224 753637 755311 756066 756669 757841 759797 762742 766942 772348 778772 786067 793569 800086 805321
58371 805321 810588 817102 824364 831324 838129 845312 852273 858373 864713 872769 881769 889575 895957 902868
58357 902868 911453 920825 930024 939125 947928 955329 960737 964802 968252 971231 974140 977881 982798 988391
58343 988391 994257 1000411 1006682 1012877 1019479 1027182 1035874 1045134 1055348 1067072 1079725 1092354 1105400
58330 1105400 1120128 1136512 1153121 1168779 1182829 1194211 1202213 1208004 1213620 1219437 1224347 1228209
58318 1228209 1232221 1236983 1242114 1247833 1254939 1263114 1271197 1279302 1288826 1300189 1312399 1324948 1338266
58305 1338266 1352142 1365716 1379311 1394381 1411301 1428919 1446493 1464316 1482305 1499847 1517167
58294A517167J7903J8200J7564J7352J8526J9702J9610J9356K0254K1600K2615
58283A729849K4175K6460K7556K6752K6451K8308L0323L0515L0430L1935L3566
58272B046320L3463L3124L4578L6584L7374L8455M1772M5703M7908M9601N2824
58261B497706N6060N6911N6732N8133O0204O0762O1054O3517O6953O8741O9780
58250C176553P2578P6414P9231Q2176Q7482R3879R8987J04041J11294J19066J24492
58239D226193J28935J35424J43147J49868J57070J67182J78414J88146J98491
58230E672870K12437K27715K40974K54681K72994K94244L14824L36972L64833
58221H192544L96487M28115M62284N03488N49496N96590O48944P12701P85301
$$ plain form
58294 1517167 1535070 1553270 1570834 1588186 1606712 1626414 1646024 1665380 1685634 1707234 1729849
58283 1729849 1754024 1780484 1808040 1834792 1861243 1889551 1919874 1950389 1980819 2012754 2046320
58272 2046320 2079783 2112907 2147485 2184069 2221443 2259898 2301670 2347373 2395281 2444882 2497706
58261 2497706 2553766 2610677 2667409 2725542 2785746 2846508 2907562 2971079 3038032 3106773 3176553
58250 3176553 3249131 3325545 3404776 3486952 3574434 3668313 3767300 3871341 3982635 4101701 4226193
58239 4226193 4355128 4490552 4633699 4783567 4940637 5107819 5286233 5474379 5672870
58230 5672870 5885307 6113022 6353996 6608677 6881671 7175915 7490739 7827711 8192544
58221 8192544 8589031 9017146 9479430 9982918 10532414 11129004 11777948 12490649 13275950
58212A3275950Q61761R46969J049755J169660J302727J455561J639464J856034
58204B3557881K104644K399495K762859L207925L747991M416801N259036O309110
58196E3765742P605898R222106J1250939J3769399J6830896K0441553K4454677
58189A57341210K8498813L2123104L5037641L7045991L7586634L5448675K9267584
58182C92349652J8593159M598418j0235793k3204216l2428527l7311361l8362084
58175B73999248l6679314l3418358k9473441k5421412k1601141j8187439j5234566
58168I3983577j2727401j0631404q905456p492747o330485n371572m584012l935085
58160C4005415l392368k936788k559256k246019j979686j751601j560069j397983
$$ plain form
58212 13275950 14137711 15084680 16134435 17304095 18606822 20062383 21701847 23557881
58204 23557881 25662525 28062020 30824879 34032804 37780795 42197596 47456632 53765742
58196 53765742 61371640 70593746 81844685 95614084 112444980 132886533 157341210
58189 157341210 185840023 217963127 253000768 290046759 327633393 363082068 392349652
58182 392349652 410942811 415541229 405305436 382101220 349672693 312361332 273999248
58175 273999248 237319934 203901576 174428135 149006723 127405582 109218143 93983577
58168 93983577 81256176 70624772 61719316 54226569 47896084 42524512 37940500 34005415
58160 34005415 30613047 27676259 25117003 22870984 20891298 19139697 17579628 16181645
58152A6181645j253910j123767j010055r10689q19118p34409o60932n98362n41332
58143H529071m88580m43745m07198l75210l47021l24939l07571k90209k71871
58134E272727k55181k39849k22999k05525j91237j79960j67985j55199j45145
58125C509647j38028j30191j20866j13236j08127j02529r5260q8685q3969p9529
58115B449227p4994p1907o9932o6881o3014o0741n9730n6922n2034m8400m7525
58104A777147m7096m5371m3451m2132m0324l7807l6191l6051l5984l5270l4632
58093A342838l4024l2452l0313k9022k8208k6125k2856k0194j8482j6597j4871
58082A069694j4845j6176j7004j7307j8600k0440k0614j8991j7794j7829j7690
$$ plain form
58152 16181645 14927735 13803968 12793913 11883224 11064106 10329697 9668765 9070403 8529071
58143 8529071 8040491 7596746 7189548 6814338 6467317 6142378 5834807 5544598 5272727
58134 5272727 5017546 4777697 4554698 4349173 4157936 3977976 3809991 3654792 3509647
58125 3509647 3371619 3241428 3120562 3007326 2899199 2796670 2701410 2612725 2528756 2449227
58115 2449227 2374233 2302326 2232394 2165513 2102499 2041758 1982028 1925106 1873072 1824672 1777147
58104 1777147 1730051 1684680 1641229 1599097 1558773 1520966 1484775 1448724 1412740 1377470 1342838
58093 1342838 1308814 1276362 1246049 1217027 1188819 1162694 1139838 1119644 1101162 1084565 1069694
58082 1069694 1054849 1038673 1021669 1004362 985762 965322 944708 925717 907923 890094 872404
58071H72404j6923j6636j6690j5563j3513j2591j3060j2979j1741j0873j0791
58060G21044j0076q627q215r128r425q432p858q494q800p951p309p640p641o564
58046F04884n693n916o180n673n258n573n845n650n758o244n925m708m241n253
58032E26967o323o324o020o176o253n952o128p036p614p449p485p943p595o082
58018D32587m842m650m311k948j593j288j493j594k059k917l004k041j566k418
58004C95863l158k460j306j163j586j358o68m23m95k57J14J73K49O63Q16J33q74
57987C84263j502j841k083j820j052p97j690k811l035k633k638l288m004m264
57973C50805l859k914k095k051k377j997q04K00N06N76N14j90j193j241j50P05
$$ plain form
58071 872404 855481 838845 822155 806592 793079 780488 767428 754449 742708 731835 721044
58060 721044 710968 702341 694126 684998 675573 667141 659283 650789 641989 634038 626729 619089 611448 604884
58046 604884 599191 593275 587095 581422 576164 570591 564746 559096 553338 547094 541169 536461 532220 526967
58032 526967 520644 514320 508300 502124 495871 489919 483791 476755 469141 461692 454207 446264 438669 432587
58018 432587 427745 423095 418784 415836 414243 412955 411462 409868 407809 404892 401888 399847 398281 395863
58004 395863 392705 390245 388939 387776 386190 384832 384164 383741 383246 382989 383103 383276 383525 384188 385004 385137 384263
57987 384263 382761 380920 378837 377017 375965 375168 373478 370667 367632 364999 362361 359073 355069 350805
57973 350805 346946 344032 341937 339886 337509 335512 334708 334908 335414 335990 336504 336314 335121 333880 333730 334435
57957C34435N27J47K64K64l98j225j901k868l873l707k347j570k179k534j247
57942C11788M60P74J62K95J394K578L869N790P699Q351P828P280P012O260M631
57927C76171K555M36j604l363m724n994p337q302q471q083p487o739o090n978
57913C04990n988m979k925j423j455j929j494o03m39q32q09l79l59q98j417j648
57897B77413j665j394j027j243k160k753k252j283p47m56O3M10J87O8P15J447
57881B65323J346Q08O31M58l06q52o3J353J603M13p95j054o17K41J524K670K909
57864B75592K568K673L338L793L929M406N271N853O051O337O483N715M271L351
57850C39631L236K893J784O59L7p19k074l291l562l336l550m185m480m185l831
$$ plain form
57957 334435 334962 335109 335373 335637 335239 334014 332113 329245 325372 321665 319318 317748 315569 313035 311788
57942 311788 312248 313022 313184 313479 314873 317451 321320 327110 334809 343160 350988 358268 365280 371540 376171
57927 376171 378726 379162 377558 374195 369471 363477 356140 347838 339367 331284 323797 317058 310968 304990
57913 304990 299002 294023 291098 289675 288220 286291 284797 284194 283755 282923 282114 281735 281376 280478 279061 277413
57897 277413 275748 274354 273327 272084 269924 267171 264919 263636 262889 262433 262496 262906 263093 263161 263876 265323
57881 265323 266669 267477 268108 268566 268260 267408 267345 268698 270301 270714 269919 268865 268248 268489 270013 272683 275592
57864 275592 278160 280833 284171 287964 291893 296299 301570 307423 313474 319811 326294 332009 336280 339631
57850 339631 342867 345760 347544 348203 348240 347521 345447 342156 338594 335258 331708 327523 323043 318858 315027
57835C15027l885m156m090l424k479j803j458r27O6J001J308J298J754K723L411
57820C04366L297K771K583L058L846M166L437J895L42q69k123l497m175l624k654
57805C12819k375k642k554k151k412l579m648m679l884l153l158l961m957n240
57791B63426m568l785l703l876l298k047j210j216j223m34Q63J819J976J501R82
57776B45207J151K227L461L847L293K566K079J477N13m02q10q79j121j741k526
57761B58342l154l507l731l981m125l912l433l018k587j616o2J365K198K770L320
57746B34869L340K533J653J575K041K303K386K742L116K933K428K260K316K008
57732B68503J535J643K253K538K321K239K497K519K009J367R20O19M61M19K3j057
$$ plain form
57835 315027 311142 306986 302896 299472 296993 295190 293732 292805 292871 293872 295180 296478 298232 300955 304366
57820 304366 307663 310434 313017 316075 319921 324087 327524 329419 329761 328892 326769 323272 319097 315473 312819
57805 312819 310444 307802 305248 303097 300685 297106 292458 287779 283895 280742 277584 273623 268666 263426
57791 263426 258858 255073 251370 247494 244196 242149 240939 239723 238500 238066 238929 240748 242724 244225 245207
57776 245207 246358 248585 252046 255893 259186 261752 263831 265308 265821 265419 264609 263730 262609 260868 258342
57761 258342 255188 251681 247950 243969 239844 235932 232499 229481 226894 225278 225216 226581 228779 231549 234869
57746 234869 238209 240742 242395 243970 246011 248314 250700 253442 256558 259491 261919 264179 266495 268503
57732 268503 270038 271681 273934 276472 278793 281032 283529 286048 288057 289424 290344 290963 291424 291843 291866 290809
57716B90809k165k410k042j928j951j314l61m38j771l035l429l627m076l946k694
57701B55622j331r79j252j123n80k53j05L90J108J329P95mm47k63M17J088J271
57684B55683J128J253J687J776J340J206K059L457M650N738P352R622J2253J5256
57670C24460J8844K2854K6844L0683L4371L7377L8583L6827L1229K1262P285q850
57658F21769k4101l5577m1856m3352m1674l8497l4721l0480k5778k0980j6727
57647B68026j3572j1599j0276q788o786m671k998j845j015m83k36j7K82L22q0
57632B06264m14k04J91K19J67O02J133Q60k16j263j986k699l156k707j719j417
57616A93655j993k263j701j295j730k109j477m47j54n51q58r34j040q85q1Q30
$$ plain form
57716 290809 288644 286234 284192 282264 280313 278999 278638 278200 276429 273394 269965 266338 262262 258316 255622
57701 255622 254291 253312 252060 250937 250357 250104 249999 250389 251497 252826 253621 253617 253170 252907 253324 254412 255683
57684 255683 256811 258064 259751 261527 262867 264073 266132 269589 274239 279977 287329 296951 309204 324460
57670 324460 343304 366158 393002 423685 458056 495433 534016 570843 602072 623334 630619 621769
57658 621769 597668 562091 520235 476883 435209 396712 361991 331511 305733 284753 268026
57647 268026 254454 242855 232579 223791 217005 212334 209336 207491 206476 205993 205757 205740 206022 206344 206264
57632 206264 205850 205646 205837 206056 206223 206825 207958 208818 208602 207339 205353 202654 199498 196791 195072 193655
57616 193655 191662 189399 187698 186403 184673 182564 181087 180640 180486 179935 179077 178143 177103 176218 176137 176967
57600A76967R65M60K58O00P08j7j189j997k094j774j636j995k551k683k166j357
57584A60499o71k93m21j166k070k329j756r81o02o60j104j919k591k389j467q41
57568A39239r50j204j262j525j865j171Q42K559K411R72r5l70o44j167j422j298
57552A33050j140q49o5Q68J197R32O61M34j04o40m11N30J353J801K428L379L972
57535A47396L777L133K363J368K99k46j21J6l35p97q01m56k69l82n28m79k62o3
57517A53613o6k33k70j6K35J57PL20J062J586J490J061P31N40K50k70q80j260
57499A58057j144o26j47j3p5j92o17j516k398k597k204j947k155k448k438k235
57483A35305k108k040j834j399q59m71m22n66n11j25K94N13P06R95J091P56K91
$$ plain form
57600 176967 177932 178392 178650 179250 179958 179941 178752 176755 174661 172887 171251 169256 166705 164022 161856 160499
57584 160499 159828 159535 159114 157948 155878 153549 151793 150812 150210 149550 148446 146527 143936 141547 140080 139239
57568 139239 138289 137085 135823 134298 132433 131262 132104 134663 137074 138046 137951 137581 136937 135770 134348 133050
57552 133050 131910 131061 130996 131864 133061 133993 134654 135088 134984 134344 133933 134463 135816 137617 140045 143424 147396
57535 147396 151173 154306 156669 158037 158336 158090 157969 157985 157650 156853 156052 155596 155327 154945 154417 153938 153676 153613
57517 153613 153547 153314 153044 153028 153263 153420 153427 153747 154809 156395 157885 158946 159677 160217 160467 160197 159317 158057
57499 158057 156913 156287 156140 156127 156052 155860 155243 153727 151329 148732 146528 144581 142426 139978 137540 135305
57483 135305 133197 131157 129323 127924 127065 126594 126172 125606 125095 124970 125264 125777 126483 127478 128569 129325 129616
57466A29616J6k92q64j260r58l25k00o21q30n26k77m61o31k60M35Q42P71N37M59
57447A25171N21M95K93J28K08L14L8m07j80J021K285K532J835J081O87L83N6q7
57429A36374j13l49p12p33l79k10n51j027j038m01N62J206R51o9r18q10k4N92
57411A32351P89R03J022Q78N16L36M20N08N92Q74J180J088O53L38K15j9l11l15
57393A42018j93m81r97q78N3Q20O45Pj08N53J443J967J921J545J332J494J539
57376A52680Q97j26n97k17L92P37R62J143R45L43p0R5N27Q27R82R30L77n31j042
57357A59254p89k93q1J1K15K79Q3Q1M65N82p3q57q22p2N44P85J100J561J613R94
57337A64580J61l31l99k36J2K47L56K82l3o24j257j421q70q0K11j27n29m51LK74
$$ plain form
57466 129616 129632 129340 128476 127216 126258 125933 125733 125112 124282 123756 123479 123018 122387 122127 122562 123404 124175 124712 125171
57447 125171 125692 126187 126480 126608 126816 127130 127168 126761 126581 127602 129887 132419 134254 135335 136022 136405 136461 136374
57429 136374 136261 135912 135200 134467 134088 133878 133327 132300 131262 130861 131423 132629 133580 133511 132593 131783 131759 132351
57411 132351 133140 134043 135065 135943 136459 136795 137215 137723 138315 139189 140369 141457 142110 142448 142663 142644 142333 142018
57393 142018 141825 141344 140347 139469 139522 140342 140987 140994 140886 141439 142882 144849 146770 148315 149647 151141 152680
57376 152680 153577 153451 152854 152637 153029 153766 154728 155871 156816 157159 157089 157184 157711 158538 159520 160450 160827 160296 159254
57357 159254 158465 158172 158091 158102 158317 158596 158679 158760 159225 159807 159734 158877 158055 157983 158527 159312 160412 161973 163586 164580
57337 164580 164741 164410 164011 163775 163787 164034 164390 164672 164639 164015 162758 161337 160467 160387 160598 160471 159942 159491 159494 159768
57317A59768R6j11L53J471K256J878Q06K48N04O94K50k14j0M64L54l53r41r81
57299A66532n55K76J390K200K101J328P77Q90J269J490J604J760J894K156L011
57284A88123M463N515N118L554K343K561L700M487M434M090M017M177M378M609
57270B45569M608L797K158P32N22J204J614J286Q02O72O83M63L0m01o65n63m5
57253B62466N35P66Q66J357K113K372J823J039O73Q43J448K399L271L431K776
57238B88178J876J195P48N89R28J533J801J615J486J598J556J303J355J776J877
57223C09414J440J282J956K789K923K592K586L118L908M712N162M778L862L578
57209C54100M459N497N584N041M766M724M413M221M984O550P936Q653Q853Q483
$$ plain form
57317 159768 159864 159753 160106 161577 163833 165711 166517 166765 167269 167963 168213 167999 167989 168453 168807 168454 167513 166532
57299 166532 165977 166253 167643 169843 171944 173272 174049 174939 176208 177698 179302 181062 182956 185112 188123
57284 188123 192586 198101 203219 206773 209116 211677 215377 219864 224298 228388 232405 236582 240960 245569
57270 245569 250177 253974 256132 256864 257386 258590 260204 261490 262292 262964 263647 264110 264140 263739 263074 262511 262466
57253 262466 263001 263767 264633 265990 268103 270475 272298 273337 274010 274853 276301 278700 281971 285402 288178
57238 288178 290054 291249 291997 292586 293514 295047 296848 298463 299949 301547 303103 304406 305761 307537 309414
57223 309414 310854 312136 314092 316881 319804 322396 324982 328100 332008 336720 341882 346660 350522 354100
57209 354100 358559 364056 369640 374681 379447 384171 388584 392805 397789 404339 412275 420928 429781 438264
57195D38264P527O785P200Q466R387R588R743J0202J0588J0828J1439J2475J3242
57182E65734J3370J3320J3490J3565J3178J2523J1990J1727J1810J2346J3176
57171G06229J3984J4782J5895J7454J9246K1066K2722K3898K4477K4873K5429
57160I30055K5872K5924K6096K6915K7737K7473K6313K5481K5371K5230K4864
57149A217331K5209K6691K8325K9201K9729L0623L1666L2355L3004L4185L5591
57138A553910L6430L6573L6592L6960L7882L9570M1973M4513M6728M8937N1728
57127B011796N5018N8262O1350O4644O8282P2064P6021Q0538Q5870R1943R8561
57116B824349J05441J12144J18475J25006J32692J41946J52471J64188J77965
$$ plain form
57195 438264 445791 452576 459776 468242 477629 487217 496960 507162 517750 528578 540017 552492 565734
57182 565734 579104 592424 605914 619479 632657 645180 657170 668897 680707 693053 706229
57171 706229 720213 734995 750890 768344 787590 808656 831378 855276 879753 904626 930055
57160 930055 955927 981851 1007947 1034862 1062599 1090072 1116385 1141866 1167237 1192467 1217331
57149 1217331 1242540 1269231 1297556 1326757 1356486 1387109 1418775 1451130 1484134 1518319 1553910
57138 1553910 1590340 1626913 1663505 1700465 1738347 1777917 1819890 1864403 1911131 1960068 2011796
57127 2011796 2066814 2125076 2186426 2251070 2319352 2391416 2467437 2547975 2633845 2725788 2824349
57116 2824349 2929790 3041934 3160409 3285415 3418107 3560053 3712524 3876712 4054677
57107D054677J95198K16884K43501K75724L15086L63758M23835M97127N85898
57098G171688O93728Q25356R85487J177727J404349J666314J962555K288716K636300
57089B0812220K992874L343070L669909L956556M188848M357689M458522M485511
57081E2265199M422815M241005L905782L396734K723336J925354J056610J64723
57073G4101558p18407j571272k371523l090451l696829m164696m478846m636495
57065D9373039m646758m528759m308410m014523l675442l316306k957006k611710
57057A9314125k289945j997671j737363j508410j308898j137093r90768q66005
57049G477972p58208o64415n83526n14264m54211m01259l54767l14567k79651
$$ plain form
57107 4054677 4249875 4466759 4710260 4985984 5301070 5664828 6088663 6585790 7171688
57098 7171688 7865416 8690772 9676259 10853986 12258335 13924649 15887204 18175920 20812220
57089 20812220 23805094 27148164 30818073 34774629 38963477 43321166 47779688 52265199
57081 52265199 56688014 60929019 64834801 68231535 70954871 72880225 73936835 74101558
57073 74101558 73383151 71811879 69440356 66349905 62653076 58488380 54009534 49373039
57065 49373039 44726281 40197522 35889112 31874589 28199147 24882841 21925835 19314125
57057 19314125 17024180 15026509 13289146 11780736 10471838 9334745 8343977 7477972
57049 7477972 6719764 6055349 5471823 4957559 4503348 4102089 3747322 3432755 3153104
57040C153104k48561k20486j95154j72048j50390j29626j09430q9535p0128n2054
57030A715692l5936k1184o813O248J3987J1177m746l0957o0106q4320r9131j04454
57018A299457j02702r6462q7662p7765o7972n9110n1515m5068l9446l4487l0275
57007F06993k6781k3636k0552j7772j5740j4467j3672j3310j3415j3586j3308
56996D20754j2682j2166j1556j0099p719n378l805k625j133P18K657M805P348
56983C69119R872J1588J1988J0836P839L006k873q644j3583j7406j9673j9906
56971C42163j8366j6051j3693j1153q083m819k116j18J925M820Q584J2603J6302
56958C11998J9375K1624K2967K3372K2301J8415J0775N03r561j7246k2376k5475
$$ plain form
57040 3153104 2904543 2684057 2488903 2316855 2166465 2036839 1927409 1837874 1767746 1715692
57030 1715692 1679756 1658572 1651759 1658007 1671994 1683171 1678425 1647468 1587362 1503042 1403911 1299457
57018 1299457 1196755 1100293 1012631 934866 866894 807784 756269 711201 671755 637268 606993
57007 606993 580212 556576 536024 518252 502512 488045 474373 461063 447648 434062 420754
56996 420754 408072 395906 384350 374251 366532 361154 357349 354724 353591 354309 356966 361771 369119
56983 369119 378991 390579 402567 413403 421242 424248 421375 412731 399148 381742 362069 342163
56971 342163 323797 307746 294053 282900 274817 269998 267882 267764 269689 274509 283093 295696 311998
56958 311998 331373 352997 375964 399336 421637 440052 450827 451330 441769 424523 402147 376672
56946C76672k6250k4342k0719j7007j3695j0179o394l118n62K189N952J0563J5462
56933B88572K0385K5082K9047L1749L2536L0257K3862J3782J965r666k0111k8540
56921D38920l3776l5270l3889l1091k7781k4324k1043j8051j5130j2322j0195
56910A76048r086q423p370n797m247l207k739k544k175j501j080j451k067j580
56896A22781M84L086N056O395P804R678J2139J5312J8822K1623K3064K3656K4025
56883B93925K3523K0754J5325Q293J032n650j1192j4853j5991j4710j1944q800
56871B79712n699k289J665N701R400J3327J8450K4727L1181L7298M3254M8663
56859E05390N2314N3477N2109M7273L6844K0165J53j8394l2190m0486m3827m3151
$$ plain form
56946 376672 350422 326080 305361 288354 274659 264480 258086 254968 254406 256595 262547 273110 288572
56933 288572 308957 334039 363086 394835 427371 457628 481490 495272 497237 487571 467460 438920
56921 438920 405144 369874 335985 304894 277113 252789 231746 213695 198565 186243 176048
56910 176048 166962 158539 151169 145372 141125 137918 135179 132635 130460 128959 127879 126428 124361 122781
56896 122781 123265 126351 131407 137802 145606 155284 167423 182735 201557 223180 246244 269900 293925
56883 293925 317448 338202 353527 361820 362852 357202 346010 331157 315166 300456 288512 279712
56871 279712 274013 271724 273389 279090 288490 301817 320267 344994 376175 413473 456727 505390
56859 505390 557704 611181 663290 710563 747407 767572 767725 749331 717141 676655 632828 589677
56847E89677l9653l4246k7126j8594r843j958N441J3632K3148L3628M4872N6823
56835F35801O8583P8601Q5839Q9704Q8616P9852O1522L4477K332k9813n6841p5163
56823A063510q3938q4832q0343p2358o2097n0753l9623k9476k0070j0490j30J0766
56811E40166K1636L2219M2261N0884N7080O0520O0823N6195M4226K4765R71k2938
56799I68808m3909n9741o8436o9610o5633n9738n3297m5952l7704k9387k1467
56788D13934j3789o473J19O200J2291J8158K3013K6617K9155L0115K8262K2731
56776E90333J3488J093j2938k5871l5195m0414m2640m2588m0181l5854l0911k6284
56764B72038k2064j8370j5564j3430j1233q908p209o381n687m609l695l653m314
$$ plain form
56847 589677 550024 515778 488652 470058 460215 458257 463698 477330 500478 534106 578978 635801
56835 635801 704384 782985 868824 958528 1047144 1126996 1188518 1222995 1225327 1195514 1138673 1063510
56823 1063510 979572 894740 814397 742039 679942 629189 589566 560090 540020 529530 529400 540166
56811 540166 561802 594021 636282 687166 744246 804766 865589 921784 966010 990775 991746 968808
56799 968808 924899 865158 796722 727112 661479 601741 548444 502492 464788 435401 413934
56788 413934 400145 393672 393791 399991 412282 430440 453453 480070 509225 539340 567602 590333
56776 590333 603821 604914 591976 566105 530910 490496 447856 405268 365087 329233 298322 272038
56764 272038 249974 231604 216040 202610 191377 182469 175260 168879 163192 158583 154888 151235 146921
56751A46921m881m803m125l310k822k537j860q01m71j636l291l707k655j434r11
56736A07677p95p21p73p89m25k2k42p12l32Q42J491J056N11N86O96L24J47Q03
56718A09322J630J645R36K52r5p9N07J585K433K506K112J776J539J383J552J925
56702A30929J811J110P86J480K414K532J983J546J242O18m5o7L89M36q8l97o2
56685A46617L15P5m65m87J49O45J85j069k140k312j869j570j658j711j266k18
56669A33221J177K245K125P71n36n06M83R46M23q2R9L47R8j60P8K94j57q89j163
56650A38814j067j153j382j290q51l65J72Q83J449J410R15N17M03L21J37m2k08
56633A38663m13n10l10P7K98J66k07n24m83j23R4k03o51n29J98P80P46M39K61
$$ plain form
56751 146921 142040 137237 133112 129802 126980 124443 122583 121782 121311 119675 116384 112677 110022 108588 107677
56736 107677 106882 106161 105388 104599 104174 104152 103910 103198 102866 103708 105199 106255 106766 107352 108048 108372 108519 109322
56718 109322 110952 112597 113533 113785 113690 113611 114118 115703 118136 120642 122754 124530 126069 127452 129004 130929
56702 130929 132740 133850 134636 136116 138530 141062 143045 144591 145833 146451 146406 146339 146728 147164 147076 146679 146617
56685 146617 146932 147007 146542 146055 146204 146849 147034 145965 143825 141513 139644 138074 136416 134705 133439 133221
56669 133221 134398 136643 138768 139539 139003 138497 138980 139926 140349 140267 140366 140713 140811 140651 140729 141023 140866 139977 138814
56650 138814 137747 136594 135212 133922 133071 132706 132878 133761 135210 136620 137535 138052 138455 138776 138913 138871 138663
56633 138663 138250 137740 137430 137507 137805 137971 137764 137240 136757 136634 136728 136525 135874 135345 135543 136323 137069 137508 137769
56614A37769P7k59m30j26M06P15O89M62J98J16L02L37l03j308j641q43L29R01
56596A37391P08J82k43k46K48P60P15L60N04J150J379Q65L96M60M45o3l28K22
56578A44905P89M61j85K3R23J289P09m4l02q1N06J421K217K319J833J419J336
56561A59538J330J452K186L605M966N400M638L020J172k01n95rJ028J782J727
56546A91039R08r7p28r86j170j281j154j023j252j572j381p65l40k8Q60K087K342
56529A85459J181j12l69m7lP4Q13J654J646J046Q03Q85M63n05j287j724k312k873
56511A84792k493j020M38R04O19L14J38k22p75j087q08j63J69k72j135j639j530
56494A76230j291j284j237q80m49j80J64P94J406J622J465J020K19o18p05J67
$$ plain form
56614 137769 137846 137587 137157 137031 137437 138152 138841 139303 139501 139617 139919 140256 139953 138645 137004 136161 136490 137391
56596 137391 138099 138281 138038 137792 138040 138800 139515 139875 140379 141529 142908 143773 144169 144629 145074 145011 144683 144905
56578 144905 145694 146155 145970 145993 146916 148205 148914 148870 148568 148487 148993 150414 152631 154950 156783 158202 159538
56561 159538 160868 162320 164506 168111 173077 178477 183115 186135 187307 187106 186511 186502 187530 189312 191039
56546 191039 191947 191850 191122 190136 188966 187685 186531 185508 184256 182684 181303 180538 180198 180170 181030 183117 185459
56529 185459 186640 186528 186159 186112 186109 186183 186996 188650 190296 191342 192145 193030 193493 192988 191701 189977 187665 184792
56511 184792 182299 181279 181717 182621 183240 183554 183692 183470 182695 181608 180800 180637 180806 180534 179399 177760 176230
56494 176230 174939 173655 172418 171538 171089 170909 171073 171867 173273 174895 176360 177380 177599 176981 176276 176443
56478A76443J129J333R29L98l25j311j955j739j136q28n95O6P29N36l29p32q9
56461A72524R87J622J553J117Q30R48J183J047O02L99M80K61k72k67N57J214R74
56444A85759N98R83J538J117r1r04q77m84nO12J082J056Q55R94J257J077N17L0
56426A95114l17n98n80k84l42r03r84M0J211J383R76R51R50J26r38r63j40K61
56408A94963J18L72R78Q77P0k21K85M50k72r54q57m21j27K46P12P66M27M30R10
56389A98752J135Q90Q74J268J275N77P5M44J053J085P69P76J170J638K118K580
56373B16479K706K252J417O10K00M49J181J584J130M62N85J343J678J309R90J056
56357B35431R02K34k49J44J212K253K711K327J300M17K82N46N43M34P35J099P86
$$ plain form
56478 176443 177572 178905 179834 180232 179907 178596 176641 174902 173766 172938 172343 172409 173138 173674 173345 172613 172524
56461 172524 173511 175133 176686 177803 178633 179581 180764 181811 182413 182812 183292 183553 183281 183014 183571 184785 185759
56444 185759 186357 187340 188878 189995 189904 189000 188123 187639 187634 188246 189328 190384 191239 192233 193490 194567 195084 195114
56426 195114 194797 194199 193619 193335 192993 192090 191106 191146 192357 193740 194716 195667 196617 196743 195805 194842 194702 194963
56408 194963 195081 195453 196431 197308 197378 197157 197442 197892 197620 196666 195809 195388 195261 195507 196219 196985 197412 197842 198752
56389 198752 199887 200777 201651 202919 204194 204771 204846 205290 206343 207428 208197 208973 210143 211781 213899 216479
56373 216479 219185 221437 222854 223464 223664 224113 225294 226878 228008 228470 229055 230398 232076 233385 234375 235431
56357 235431 236333 236567 236318 236462 237674 239927 242638 244965 246265 246682 246964 247510 248053 248487 249222 250321 251107
56340B51107J37K01R05J033K07m42l1R34J605J898K020J866J452J204J407J874
56324B67377K297K452K132J529J431K219L023K836K033J683J751J432R22J236
56310B94353K344L104L133L231L758M168M298M582M744L925K473K010L210M893
56296C44226N814N941N568M665L680L595M498N307N448N538O031O443O476O586
56282D19816O947P058O866P080P917Q716R167R695J0376J0798J1227J2385J3880
56269E41928J4482J4325J5018J7116J9278K0654K2227K4922K8081L0832L3489
56258G82352L6620M0195M4548N0641N8434O6472P4060Q2330R2149J02550J12427
56247A542778J22300J32973J43661J52839J59977J65226J68220J68334J65261
$$ plain form
56340 251107 251244 251445 252350 253383 253590 253148 253117 254051 255656 257554 259574 261440 262892 264096 265503 267377
56324 267377 269674 272126 274258 275787 277218 279437 282460 285296 287329 289012 290763 292195 293117 294353
56310 294353 296697 299801 302934 306165 309923 314091 318389 322971 327715 331640 334113 336123 339333 344226
56296 344226 350040 355981 361549 366214 369894 373489 377987 383294 388742 394280 400311 406754 413230 419816
56282 419816 426763 433821 440687 447767 455684 464400 473567 483262 493638 504436 515663 528048 541928
56269 541928 556410 570735 585753 602869 622147 642801 665028 689950 718031 748863 782352
56258 782352 818972 859167 903715 954356 1012790 1079262 1153322 1235652 1327801 1430351 1542778
56247 1542778 1665078 1798051 1941712 2094551 2254528 2419754 2587974 2756308 2921569
56238B921569J58513J47261J31450J12137R0102O5227L7968J0119j6756m2400
56228C615190o6600q8180j06206j21027j33126j42068j47444j49712j49315j46196
56218B365316j40929j34941j28803j21691j13381j05220r8148r1352q3990p6701
56208A270160p0248o4114n7853n2325m8176m4383l9845l5241l1842k9456k7004
56197G69673k4200k1438j8892j6789j5728j5575j4999j3126j0701q813p510o532
56185E95370o074n935n194l765k956l466m147l794k845k185j687r72l77p6M78
56170E52375J262J376Q46J104K630L894L830L516M105M880M874M742N404O384
56156F01222O996P705Q913R925J0454J1469J3343J4993J6179J8567K2937K7567
$$ plain form
56238 2921569 3080082 3227343 3358793 3470930 3561032 3626259 3664227 3674346 3657590 3615190
56228 3615190 3548590 3460410 3354204 3233177 3100051 2957983 2810539 2660827 2511512 2365316
56218 2365316 2224387 2089446 1960643 1838952 1725571 1620351 1522203 1430851 1346861 1270160
56208 1270160 1199912 1135798 1077945 1025620 977444 933061 893216 857975 826133 796677 769673
56197 769673 745473 724035 705143 688354 672626 657051 642052 628926 618225 609412 601902 595370
56185 595370 589296 583361 578167 574402 571446 567980 563833 560039 557194 555009 553322 552350 551973 551897 552375
56170 552375 553637 555013 555859 556963 559593 563487 567317 570833 574938 579818 584692 589434 594838 601222
56156 601222 608218 615923 624836 634761 645215 656684 670027 685020 701199 719766 742703 770270
56144G70270L1185L5319M1601M8831N5089O0806O7273P3640P7862P9321P8276
56133A419473P4167O6773N7814M9398M2017L5751L1647K9776K7609K2679J5543
56122A872647Q160J033n987j1872j5881j9401k4189l0276l7447m6583n7239o6082
56110A566883p0461p1607p1717p0019o4779n7153m9674m2611l5062k8062k3204
56099I82534j9532j5121j0487p320n165k582k43M15L62J481L160L609L378M258
56085I38747N846O510O559P216P776P096O534P902R903J0191R612J0540J2370
56072A046802J2671J1718J1776J2856J3197J3142J4503J6731J7659J7417J7798
56061A206270J8594J8310J7639J8314J9436J8892J7429J7237J7622J6367J4398
$$ plain form
56144 770270 801455 836774 878375 927206 982295 1043101 1110374 1184014 1261876 1341197 1419473
56133 1419473 1493640 1560413 1618227 1667625 1709642 1745393 1777040 1806816 1834425 1857104 1872647
56122 1872647 1880807 1881840 1875853 1863981 1848100 1828699 1804510 1774234 1736787 1690204 1632965 1566883
56110 1566883 1496422 1424815 1353098 1283079 1218300 1161147 1111473 1068862 1033800 1005738 982534
56099 982534 963002 947881 937394 930074 924909 922327 922084 922499 922861 924342 927502 931111 934489 938747
56085 938747 944593 951103 957662 964878 972654 979750 986284 994186 1004089 1014280 1023892 1034432 1046802
56072 1046802 1059473 1071191 1082967 1095823 1109020 1122162 1136665 1153396 1171055 1188472 1206270
56061 1206270 1224864 1243174 1260813 1279127 1298563 1317455 1334884 1352121 1369743 1386110 1400508
56050A400508J4519J6377J7250J7024J7871J9619K0196K0049K1477K4036K5249
56039A614175K5311K6489K8471K9009K8506K9224L0648L0554K9903L1532L4712
56028A938534L6307L6590L8541M1972M3974M4631M6629M9574N0565N0060N1406
56017B428783N4839N7575N9467O2736O6684O8712O9968P3781P9338Q3199Q6115
56006C191197R1530R8443J03003J06182J12198J20253J26000J30298J37935J48205
55996D365244J55785J60744J68357J79069J88087J95234K05486K19329K32479
55987F069814K45506K63519K85919L07054L27446L53308L84600M15230M45615
55978I098011M82723N27108N72799O20712O78477P46416Q18280Q96597R91755
$$ plain form
56050 1400508 1415027 1431404 1448654 1465678 1483549 1503168 1523364 1543413 1564890 1588926 1614175
56039 1614175 1639486 1665975 1694446 1723455 1751961 1781185 1811833 1842387 1872290 1903822 1938534
56028 1938534 1974841 2011431 2049972 2091944 2135918 2180549 2227178 2276752 2327317 2377377 2428783
56017 2428783 2483622 2541197 2600664 2663400 2730084 2798796 2868764 2942545 3021883 3105082 3191197
56006 3191197 3282727 3381170 3484173 3590355 3702553 3822806 3948806 4079104 4217039 4365244
55996 4365244 4521029 4681773 4850130 5029199 5217286 5412520 5618006 5837335 6069814
55987 6069814 6315320 6578839 6864758 7171812 7499258 7852566 8237166 8652396 9098011
55978 9098011 9580734 10107842 10680641 11301353 11979830 12726246 13544526 14441123 15432878
55969A5432878J105332J231318J374621J549899J761489K005145K291171K643726
55961B9395579L076556L595331M226777N018166O006991P225039Q736807J0637605
55953G7918851J3008688J5905315J9356053K3268452K7312571L1019325L4062182
55946B41851437L6285782L7253506L5835165L0582875K0825631P505342p046972
55939D03092766k0173906k9937769l5578436l7399390l6348750l3534390k9870546
55932A80249579k5968060k2199450j8777194j5786875j3227311j1069647r282392
55925F3938650p817093o609945n610206m788262m114126l550767l073079k673136
55917B5702036k341281k059032j814240j606134j430776j276546j137760j018407
$$ plain form
55969 15432878 16538210 17769528 19144149 20694048 22455537 24460682 26751853 29395579
55961 29395579 32472135 36067466 40294243 45312409 51319400 58544439 67281246 77918851
55953 77918851 90927539 106832854 126188907 149457359 176769930 207789255 241851437
55946 241851437 278137219 315390725 351225890 381808765 402634396 410139738 403092766
55939 403092766 382918860 352981091 317402655 280003265 243654515 210120125 180249579
55932 180249579 154281519 132082069 113304875 97518000 84290689 73221042 63938650
55925 63938650 56121557 49511612 43901406 39113144 34999018 31448251 28375172 25702036
55917 25702036 23360755 21301723 19487483 17881349 16450573 15174027 14036267 13017860
55909A3017860r18275q28610p45089o72368o12011n57855n06909m63457m28585
55900G284701l96403l64216l36284l14002k92154k68449k47445k31309k15536
55891D618903j97520j81065j68716j57335j44807j33852j25920j18287j10295
55882C281106j05653j05482j05470j02894j00153r8646r5481q9272q3242p9522
55872B315291p5932p1145o7586o6400o4769o1039n7514n5586n2935m8195m3755
55861A650435m1408l9625l7495l6863l8294l9149l8002l6835l6794l5935l3238
55850A236797l0762k9657k8162k5595k4281k5234k5871k4328k2439k2162k2480
55839I55826k2066k1648k1661k0719j8393j6531j6017j5284j3502j2137j1849
$$ plain form
55909 13017860 12099585 11270975 10525886 9853518 9241507 8683652 8176743 7713286 7284701
55900 7284701 6888298 6524082 6187798 5873796 5581642 5313193 5065748 4834439 4618903
55891 4618903 4421383 4240318 4071602 3914267 3769460 3635608 3509688 3391401 3281106
55882 3281106 3175453 3069971 2964501 2861607 2761454 2662808 2567327 2478055 2394813 2315291
55872 2315291 2239359 2168214 2100628 2034228 1969459 1908420 1850906 1795320 1742385 1694190 1650435
55861 1650435 1609027 1569402 1531907 1495044 1456750 1417601 1379599 1342764 1305970 1270035 1236797
55850 1236797 1206035 1176378 1148216 1122621 1098340 1073106 1047235 1022907 1000468 978306 955826
55839 955826 933760 912112 890451 869732 851339 834808 818791 803507 790005 777868 766019
55828G66019j1075r205p972q162q197p441p615r365j0751j0707j0769j1788j2253
55815F40719j1521j1326j2251j2088r630o976o029n696m557l364k853j848L80
55802E52960K396L109L522M351M537L700L352L905L352O59k189l452m177n594
55788E70431o677o331n527n259m729l498l052m330n999o868p545p983o117j041
55774D95475M935R559J3502J7880K1393K2234K0461J6185P871m673j7584k6130
55762E81108k9338k9369k7899k5497k2948k0745j8152j4676j1397r332p914o621
55750C57220o276p131p520o350n053n095n374m245k328j087k54R79J761R83m75
55735C09755j225j841l436n058n013l789l214l455l225k427k274l073l912m364
$$ plain form
55828 766019 754944 745739 737767 729605 721408 713967 706352 696987 686236 675529 664760 652972 640719
55815 640719 629198 617872 605621 593533 583903 576927 570898 565202 560645 557281 554428 552580 552960
55802 552960 555356 558465 561987 566338 570875 574575 577927 581832 585184 585843 583654 580202 576025 570431
55788 570431 563754 557423 551896 546637 541908 538410 535358 531028 525029 518161 510616 502633 496516 495475
55774 495475 500410 509969 523471 541351 562744 584978 605439 621624 629495 624822 607238 581108
55762 581108 551770 522401 494502 469005 446057 425312 407160 392484 381087 371755 363841 357220
55750 357220 350944 343813 336293 329943 324890 319795 314421 310176 307848 306761 306507 307486 309247 310230 309755
55735 309755 308530 306689 303253 298195 293182 289393 286179 282724 279499 277072 274798 271725 267813 263449
55721B63449m738m847m092k592j002M76J912L065L966N270P118Q470Q433P237
55707B92125N145J819k178m894n325m796m767m903m671n053o784q465q491p511
55693B31251o968o543n178l433k611k454j786p02n6L81J322K249K248J852K101
55678B11673K590K367K009K697L813L588J836j4j180j995k446k174j739k090k911
55663B16024l047k329j461n10Q60K041K052J222P51Q44Q24P56J309K253K650K353
55647B26592J907J260O6j094j331j010j226k041k763l516m913o455p016o672o377
55632A85411o101n048l617l201l911m264l468k407j981j902j592j033l86K42M46
55617A47188q6q11r36o58q03j372j628j444j392j560j502j256j277j477j433j346
$$ plain form
55721 263449 258711 253864 249772 247180 246178 246654 248566 251631 255597 260867 267985 276455 284888 292125
55707 292125 297270 299089 296911 292017 286692 281896 277129 272226 267555 262502 255718 247253 238762 231251
55693 231251 224283 217740 212562 209129 206518 204064 202278 201576 201520 201901 203223 205472 207720 209572 211673
55678 211673 214263 216630 218639 221336 225149 228737 230573 230559 229379 227384 224938 222764 221025 218935 216024
55663 216024 212977 210648 209187 208677 209537 211578 213630 214852 215603 216447 217271 218027 219336 221589 224239 226592
55647 226592 228499 229759 229825 228731 227400 226390 225164 223123 220360 216844 211931 205476 198460 191788 185411
55632 185411 179310 174262 170645 167444 163533 159269 155801 153394 151413 149511 147919 146886 146500 146742 147188
55617 147188 147102 146291 145355 144697 143894 142522 140894 139450 138058 136498 134996 133740 132463 130986 129553 128207
55601A28207j630j862j396p16q11j420j423q09o50j128j192l99L82M11q4p03j258
55584A13519j224j66J160J429O86L24R41J589J511J270J577K237K835L468M243
55569A35399M882N216N318M968L876K520J797J650J054m14j973k883l237l356
55555A54817l297l236l417l521l038k305k182k575k492j676r73q26o59r1M11O21
55539A25561J002J584J595Q96O27J544K748K884J856M37r37k138k734k471j965
55524A30489k022k507k674k384k215k451k637k337j778j528j694j794j409p17
55510A02342j77J30M13M48k66j449j930j185k46k59q47q91l65j55m62o69p06j106
55492I2620j716j683r68n93r99j332q58m3M05N90Q79J079R19O41N29L10l62j224
$$ plain form
55601 128207 126577 124715 123319 122603 121792 120372 118949 118140 117490 116362 115170 114771 115153 115564 115480 114777 113519
55584 113519 112295 112129 113289 114718 115404 115728 116669 118258 119769 121039 122616 124853 127688 131156 135399
55569 135399 140281 145497 150815 155783 159659 162179 163976 165626 166680 166266 164293 161410 158173 154817
55555 154817 151520 148284 144867 141346 138308 136003 133821 131246 128754 127078 126105 125279 124620 124529 124940 125561
55539 125561 126563 128147 129742 130638 131265 132809 135557 138441 140297 140734 139797 137659 134925 132454 130489
55524 130489 128467 125960 123286 120902 118687 116236 113599 111262 109484 107956 106262 104468 103059 102342
55510 102342 102165 102295 102708 103156 102890 101441 99511 98326 98080 97821 96974 96083 95718 95563 95101 94432 93726 92620
55492 92620 90904 89221 88253 87660 86661 85329 84471 84428 84833 85423 86302 87381 88300 88941 89470 89780 89418 88194
55474H8194j730j683j188l51N54R93O37k05r20j142r28n57l38l34k62J01N60P55
55456H2156O79N67N48P77J498K451K576J238n84j201l31N91L23q41j806j933j315
55439H5393m95j46n29j089j008k35N88J064J333J464J299R38P13N92K59j94k78
55422H9669J35O89J109J358J367J227J451K280L019K910K340K189K188J293m30
55407A12794j649j719j482j734k151k198k027j932j778j523j476j596j390q63
55393H9276o52q46p00J0L97j41q94j028p83p40o91j85M68O70N32N39N89K42l69
55374H5694o70n19k92j60P4M73P60O54J95k45k31K80P43N93Ll69l32l13m91n18
55354H5329k77k09n48q10n18J11N54O44N13K99K24N16J034J257Q72N7q74j585
$$ plain form
55474 88194 86464 84781 83593 83242 83796 84789 85426 85221 84301 83159 82231 81674 81336 81002 80740 80841 81401 82156
55456 82156 82835 83402 83950 84727 86225 88676 91252 92490 91906 90705 90374 90965 91288 90447 88641 86708 85393
55439 85393 84898 84752 84223 83134 82126 81891 82479 83543 84876 86340 87639 88577 89290 89882 90141 89947 89669
55422 89669 89804 90493 91602 92960 94327 95554 97005 99285 102304 105214 107554 109743 111931 113224 112794
55407 112794 111145 109426 107944 106210 104059 101861 99834 97902 96124 94601 93125 91529 90139 89276
55393 89276 88624 87778 87078 87088 87485 87344 86450 85422 84639 83899 83208 83023 83491 84161 84693 85232 85821 86063 85694
55374 85694 85024 84505 84213 84053 84127 84600 85360 86014 86209 85964 85733 86013 86756 87349 87352 86983 86651 86338 85847 85329
55354 85329 85052 84843 84295 83485 82967 83078 83632 84276 84789 85088 85312 85828 86862 88119 88991 89048 88174 86589
55336H6589j616q57j03l23j174j212J02J538J728Q93K63M21R40J207R51K87l29
55319H9305m58k85n06j271j787j366m01J55p6o97j135j060n26K3J24j19j16M08
55301H0212J033J231R40M44K5j20m7m1j56O7Q89J599J307K76l60j48L32O25P97
55282H8905P06O7n84l05O36Q54l4p79n42j15k91m68Q1P28N76J2q6J03j03m59k30
55261H8672M00N68O5o10j165j527j305l20O13N38k61o67l64J6J56M51R86J140
55243H7386N43l03o56l71N0L5n08j034r05k15K47M5m22o65p67q38n77P9M88J98
55223H1810k69k02J97L41L51P45J386J618J266O82M7n91q70m86J10J66l40p95
55205H5166q86q03o74n20n32p24n25N34J887K449J935R88J91l33m76j65K35K27
$$ plain form
55336 86589 84973 84116 84013 83690 82516 81304 81406 82944 84672 85565 85828 86249 87189 88396 89347 89634 89305
55319 89305 88847 88562 88056 86785 84998 83632 83231 83386 83310 82613 81478 80418 79892 79915 80039 79920 79804 80212
55301 80212 81245 82476 83416 83860 83885 83765 83718 83677 83521 83588 84477 86076 87383 87659 87299 87151 87483 88108 88905
55282 88905 89611 89678 89094 88789 89425 90279 90245 89466 88924 88809 88518 88050 88131 88859 89435 89447 89361 89464 89361 88902 88672
55261 88672 89072 89640 89705 89095 87930 86403 85098 84778 85391 85929 85668 85001 84637 84653 84809 85260 86246 87386
55243 87386 87929 87626 86970 86599 86649 86684 86176 85142 84237 84022 84269 84314 83892 83227 82460 81622 81045 81124 81612 81810
55223 81810 81541 81339 81536 81877 82228 82973 84359 85977 87243 87925 87972 87381 86511 86025 86135 86301 85961 85166
55205 85166 84280 83477 82803 82283 81751 81027 80502 81036 82923 85372 87307 88295 88486 88153 87677 87512 87747 87974
55187H7974r8k92l22m62n88l13K12M44L54L88N44L26k95o57l74J55L99K84o4n15
55167H7100p26k39Q35J714J719R36j7n70n26j29J49J46K03N51P26J58q43j337
55149H9850r88m29k19j57J86O38O16p9r54j239o01N14J275J288R30P87R67J129
55131I3514R66M23l44r54r65l39M01O59K47o25j509j813j264l40K41N88J355K248
55113I2489J987L34r88n45O87P87k50p14M7Q27P13M04P29J170Q20k9k46N03J314
55094A00039J246L70m10l48M78J325J501Q98n0o91o02K9M29R6l83L6J313K188
55076A07464J864R66L52j27q64j374r61l3L64O5k02p1J09Q1o6l60q75j217r19
55057A04196k09K62L63M65O72P58O98N36oj039j907j911j337r48p64l86n0k88
$$ plain form
55187 87974 87876 87584 87262 86800 86212 85899 86111 86555 86909 87297 87841 88167 87872 87215 86841 86996 87395 87679 87615 87100
55167 87100 86374 86135 86970 88684 90403 91339 91322 90752 90226 90097 90246 90392 90595 91146 91872 92030 91187 89850
55149 89850 88862 88433 88214 88057 88243 88881 89497 89418 88464 87225 86624 87138 88413 89701 90631 91418 92385 93514
55131 93514 94480 94903 94559 93605 92640 92301 92702 93361 93608 92983 91474 89661 88397 88057 88298 88886 90241 92489
55113 92489 94476 94810 93822 93277 93964 94751 94501 93787 93834 94661 95374 95778 96507 97677 98497 98468 98222 98725 100039
55094 100039 101285 101655 101245 100897 101375 102700 104201 105099 105049 104358 103756 103785 104214 104310 103927 103963 105276 107464
55076 107464 109328 110294 110646 110519 109655 108281 107320 107287 107651 107716 107514 107443 107552 107633 107567 107207 106332 105115 104196
55057 104196 103987 104249 104612 105077 105749 106507 107205 107741 107735 106696 104789 102878 101541 100593 99829 99443 99393 99105
55039I9105p23m58M35J033J077J102J129N99k57m25J97M74j44p82p12m71o79q74
55021I9626l98M13Q07P52P03P37O34L61lm91r73j117r00o68m72O1R18J467J357
55002A02814J005Q65Q44P11N11K38k16n76l65J98L36jQ6R81J788J610P20j89j031
54983A10329j861k164j545n94j60j65R4P34J184J075O31K35Q9K11L88L50J79K34
54965A09244N77P87N64J17k04k18K28J048J556J031j96r69q15l43QN50J196J078
54947A15239lq57o07n3k93q65n81M49J004O23J6k84n00q17r63p37k31M29J020
54928A11989J158Q27P35J410K312K631K596L106M234N090N155M780M317L648K729
54913A56717J848J082J81q93j853k631l444m188m386l911l302l124l391l690l541
$$ plain form
55039 99105 98382 97924 98359 99392 100469 101571 102700 103299 103042 102617 102814 103288 103144 102362 101650 101179 100500 99626
55021 99626 99228 99641 100448 101200 101903 102640 103274 103635 103632 103141 102168 101051 100151 99483 99011 99072 99990 101457 102814
55002 102814 103819 104684 105528 106239 106750 106988 106772 106196 105831 106029 106365 106364 106450 107431 109219 110829 111549 111360 110329
54983 110329 108468 106304 104759 104165 104005 103840 103934 104668 105852 106927 107558 107793 107882 108093 108481 108831 109010 109244
54965 109244 109821 110608 111172 111289 111085 110867 111095 112143 113699 114730 114534 113565 112750 112407 112415 112965 114161 115239
54947 115239 115236 114379 113772 113719 113426 112561 111980 112429 113433 114056 114072 113788 113288 112471 111508 110771 110540 110969 111989
54928 111989 113147 113974 114709 116119 118431 121062 123658 126764 130998 136088 141243 146023 150340 153988 156717
54913 156717 158565 159647 159828 158935 157082 154451 151007 146819 142433 138522 135220 132096 128705 125015 121474
54898A21474k701j483p56j080j902k079j224j4P75J025R94Q53P88R89J413J772
54882A18844J927K014K126K266K588L303M244M878M885M486M055L690L197K354
54868A64857J132j52j055j595k332l553m602m602l713l018l081l315l019k465
54854A29487k438l061l629l546k951k310j779j217o98n44p53p54k02L38Q7o42
54838A05388o91K17Q50J50j189j622p82K61N72K97nj19r4M6K72N46R52J475J709
54819A08233J245L26l64n43n05m20j02M39P75O60L54J76Q6KN1K92M89M52K99J80
54799A12125N7l2J37N48P57N18K75N53J108J166M94k84m97j90R4K2k45l31l3N03
54779A16745Q56P15K20j14K5M30P46J038J651K561L252L446L531L992M659M973
$$ plain form
54898 121474 118773 117290 116534 115454 113552 111473 110249 110235 111010 112035 113029 113882 114670 115659 117072 118844
54882 118844 120771 122785 124911 127177 129765 133068 137312 142190 147075 151561 155616 159306 162503 164857
54868 164857 165989 165837 164782 163187 160855 157302 152700 148098 144385 141367 138286 134971 131952 129487
54854 129487 127049 123988 120359 116813 113862 111552 109773 108556 107858 107314 106561 105807 105605 105943 106030 105388
54838 105388 104697 104914 105764 105914 104725 103103 102321 102582 103154 103451 103446 103327 103233 103279 103551 104097 105049 106524 108233
54819 108233 109478 109804 109440 108897 108392 107972 107870 108309 109084 109744 110098 110274 110360 110362 110413 110705 111194 111646 111945 112125
54799 112125 112182 112150 112287 112835 113592 114110 114385 114938 116046 117212 117706 117422 116925 116735 116829 116851 116606 116275 116242 116745
54779 116745 117601 118316 118536 118422 118447 118877 119623 120661 122312 124873 128125 131571 135102 139094 143753 148726
54763A48726M801M511M285L887L176K375J606O10p72k197l197l765m230m665m753
54748A50398m186l089j999j443j415j348q23j94j61p69j291j185o70j93J39K93
54732A32064Q4m13o07r4P10J114J008P96P13P59J080J884L019M010M552M629M267
54715A59575L489K397J056n39k205l515m263m668m860m565l722k975k888k983
54701A29334k288p23P63J384J233P36M3q38j750k400k436j538P8J375J334K34
54685A24541n01j5R29R30l30j816k420k073j554j477j677j578r53j18N59J011
54669A13458J204Q94l8j182j844j661q16J67P09N51J23K04R06J367Q55j79o95
54652A14023m23k7oj54j32OK2j17k60k31JK00N0k26J40J370K398J981L91q34q63
$$ plain form
54763 148726 153527 158038 162323 166210 169386 171761 173367 173977 173205 171008 167811 164046 159816 155151 150398
54748 150398 146212 143123 141124 139681 138266 136918 136095 135901 135740 134971 133680 132495 131825 131632 131771 132064
54732 132064 132148 131735 131128 131034 131744 132858 133866 134662 135375 136134 137214 139098 142117 146127 150679 155308 159575
54715 159575 163064 165461 166517 165978 163773 160258 155995 151327 146467 141902 138180 135205 132317 129334
54701 129334 127046 126323 127086 128470 129703 130439 130482 129644 127894 125494 123058 121520 121598 122973 124307 124541
54685 124541 124040 124025 124954 125884 125554 123738 121318 119245 117691 116214 114537 112959 112006 111888 112447 113458
54669 113458 114662 115556 115518 114336 112492 110831 110015 110182 110891 111442 111565 111769 112675 114042 114897 114718 114023
54652 114023 113600 113573 113567 113413 113281 113287 113309 113192 112932 112701 112702 112902 112952 112726 112866 114236 116634 118615 119006 118172 117309
54631A17309l59j83k02R3M99L63l58r96j005m98nR6p2k8M77R64O42o11j952k444
54611A11730j990j162m11K30Q07J155J113Q68Q82J334J747J359P9j170j395o36
54595A14540J04O2n14q39n01K25P87Q96O84M33J89j59m89m30J34Q33J203J082
54577A18240N43k26p31m90J93K68o62j545j180J04R50Q70O52R58J452J546J139
54560A22081M43l00o62k96M52P92N79M28O02N51n4n95l96K83P00O83N97O55P74
54541A27317R09R65O49q0o39m26L36P99N40o0m95p52j078j450j552j163m29K77
54523A23668O85P44N07M0m69p16n65k48m4J04M13Q06J004R45P96N12j44j097j807
54504A25134j806j119j20P97J307J250P77K10k59n89o60l31K50P13Q35N96j2q64
$$ plain form
54631 117309 116950 116767 116565 116658 117157 117520 117162 116166 115161 114663 114658 114754 114682 114654 115131 116095 116737 116126 114174 111730
54611 111730 109740 108578 108167 108397 109204 110359 111472 112340 113222 114556 116303 117662 117741 116571 115176 114540
54595 114540 114644 114706 114192 113353 112852 113077 113864 114760 115444 115877 116066 115907 115418 114988 115122 115955 117158 118240
54577 118240 118783 118557 117826 117336 117529 117797 117135 115590 114410 114514 115464 116334 116986 117944 119396 120942 122081
54560 122081 122524 122224 121562 121266 121718 122510 123089 123517 124119 124670 124616 124021 123625 123908 124608 125291 125888 126543 127317
54541 127317 128226 129191 129840 129760 129121 128695 129031 129830 130370 130310 129815 129063 127985 126535 124983 123820 123391 123668
54523 123668 124353 125097 125604 125644 125175 124459 123894 123646 123602 123706 124119 124925 125929 126874 127670 128182 128038 126941 125134
54504 125134 123328 122209 122089 122886 124193 125443 126220 126430 126171 125582 124922 124591 124841 125554 126389 126985 126973 126109
54486A26109j498j457r06m05j27K19O75Q19M67R1K47R06J643K097K121J741J207
54469A33949P88M62O3k67j74K63M59J16l83n63m61l48k15R3M81O27L44k39p08
54450A34287o39k7N36M08l94j298j832j855j238k7J148J374N15n79j015p33k66
54433A28365q9l20o41m67M29J431J672J120N51M88P37R32R11N32r2k34O47J708
54415A37680J440j44j206n49P71J071K96m22o19p54j047j169r86o62j64O46J477
54398A35659J812J556J058O20M74Q53J571J800R73l38r97o31J85Q35J102Q82J47
54381A47561p54j220r49o4J154K359L147L358L220K976K551J940J527J610J973
54366A70389K240K435K665K621J936Q07j83p40r27q87q47j124j704k132k162k151
$$ plain form
54486 126109 124611 123154 122248 121843 121716 121935 122610 123429 123896 123987 124234 125140 126783 128880 131001 132742 133949
54469 133949 134737 135199 135262 134995 134821 135084 135543 135659 135276 134713 134252 133904 133689 133782 134263 134890 135234 134995 134287
54450 134287 133648 133621 134157 134565 134171 132873 131041 129186 127948 127921 129069 130443 130958 130379 129364 128631 128365
54433 128365 128276 127956 127315 126848 127277 128708 130380 131500 132051 132539 133276 134208 135119 135651 135559 135325 135972 137680
54415 137680 139120 138976 137770 137221 137992 139063 139359 138937 138318 137564 136517 135348 134362 133700 133536 134182 135659
54398 135659 137471 139027 140085 140705 141179 142032 143603 145403 146376 146038 145041 144410 144595 145430 146532 147414 147561
54381 147561 146807 145587 144638 144574 145728 148087 151234 154592 157812 160788 163339 165279 166806 168416 170389
54366 170389 172629 175064 177729 180350 182286 183093 182910 182170 181243 180356 179509 178385 176681 174549 172387 170236
54350A70236k449k816k918k852k761k392j657j062r39q56m07n8l38q13p85m90
54334A46643n26o41k39L16K01l22k24M58N78k32r50p75j44K68M64N75M01K6k3
54315A45854L03L22k68q28p84l65P2N73R64O16n11j413j284n20J65Q13J629K024
54297A47362J290j65j206j351r86m79R3M83L90j6k47k33k94m92n56m47m48n99
54279A42099n68j89K62M73M29L17L23N85J092J548J560J047L23j63n8P21J800
54262A51601K439K135J169L31J06L47O60Q60R73J053J116J131J015O89K26j98
54246A65653m66n64m85k28Q9K30N4l69q81j363j629j417o98J5M7o42j328j393
54228A54625j061q92q51m44L17P39L78l52p91p67m93j86j30n48j142j203o13j40
$$ plain form
54350 170236 167787 164971 162053 159201 156440 154048 152391 151329 150390 149534 149127 149069 148731 147918 147133 146643
54334 146643 146117 145476 145237 145553 145754 145432 145208 145666 146244 146012 145062 144287 144143 144411 144875 145450 145851 145877 145854
54315 145854 146157 146479 146211 145383 144599 144234 144306 144879 145843 146459 145948 144535 143251 142731 142896 143709 145338 147362
54297 147362 148652 148487 147281 145930 144944 144465 144558 145041 145431 145415 145168 144935 144641 144149 143593 143146 142698 142099
54279 142099 141531 141342 141604 142077 142506 142823 143146 143731 144823 146371 147931 148978 149301 149138 149080 149801 151601
54262 151601 154040 156175 157344 157675 157781 158128 158788 159648 160621 161674 162790 163921 164936 165625 165851 165653
54246 165653 165187 164623 164138 163910 163999 164229 164283 163914 163033 161670 160041 158624 157926 157941 157988 157346 156018 154625
54228 154625 153564 152672 151821 151377 151694 152433 152811 152459 151668 150901 150408 150222 150092 149544 148402 147199 146586 146446
54210A46446k61l82J19O74L28o79j179p86k44j00m9K36M86L87J8m81r94j048j86
54191A42305J074J457N37o39r11l14L62P18Q53Q94R10R64Q90L77m09q36o34k72
54173A47326k20l56m45n44o07l40J77L56P3L6O42J181Q52j9n63n85m64l19j34
54154A46047k60q58j160l54J075J786J315L91k95p31q91n19J89N48M16M72J140
54137A48311J892K069J792J580J513J311R48P39Q87J227J384J069L66k26k28L82
54121A65016J269K212L087L627L696L750M435N604O363O256N794N494N013L769
54107B25385J874j51k208m473o537p482o958n683m652m208m105m044l830l248
54093A69680k229j155o18p29r97j041j115j562j971j484q7J054R34l0o19m18j64
$$ plain form
54210 146446 146185 145803 145922 146596 146924 146245 145066 144280 144036 143936 143887 144123 144609 144996 145014 144533 143539 142491 142305
54191 142305 143379 144836 145373 144734 143823 143509 143871 144589 145442 146336 147246 148210 149100 149477 149068 148232 147598 147326
54173 147326 147106 146750 146305 145761 145154 144814 144991 145347 145420 145456 146098 147279 148131 148112 147549 146964 146500 146181 146047
54154 146047 145787 144929 143769 143415 144490 146276 147591 147982 147687 146956 146065 145546 145735 146283 146699 147171 148311
54137 148311 150203 152272 154064 155644 157157 158468 159416 160155 161042 162269 163653 164722 165088 164862 164634 165016
54121 165016 166285 168497 171584 175211 178907 182657 187092 192696 199059 205315 211109 216603 221616 225385
54107 225385 227259 227108 224900 220427 213890 206408 199450 193767 189115 184907 180802 176758 172928 169680
54093 169680 167451 166296 165678 164949 163952 162911 161796 160234 158263 156779 156692 157746 158680 158650 158031 157613 157449
54076A57449m63q74n86M13J316J480J101Q65J069J274Q69k8n15J5R86J252N16
54059A66139l81o68n26n22o46n05q6K20L19N77J246K077K712L076L281L367L377
54042A83057L484L809M176M262M014L778L895M307M571M390M001L911M244M571
54028B40470M452L945L336K661J831J103Q98J119J170Q23N74P73R12L30p62j593
54012B62042j987k491l329m044m322m456m601m309l364k509k544l080k995k038
53998B15973j154j138j661j898j600j128q12o58n28l57k23l12o00n71M26K369
53982B06128M334N342N259M759M513M526M189K848M36k292m315n195n307n226
53968B19999n133m897m486m007l513k948k277j522o95J67R08J301J196O49r3p26
$$ plain form
54076 157449 156986 156112 155526 155939 157255 158735 159836 160701 161770 163044 163913 163885 163370 163385 164371 165623 166139
54059 166139 165758 165090 164564 164042 163396 162891 162805 163025 163344 163921 165167 167244 169956 173032 176313 179680 183057
54042 183057 186541 190350 194526 198788 202802 206580 210475 214782 219353 223743 227744 231655 235899 240470
54028 240470 244922 248867 252203 254864 256695 257798 258696 259815 260985 261808 262382 263155 264067 264397 263635 262042
54012 262042 260055 257564 254235 250191 245869 241413 236812 232503 229139 226630 224086 221006 218011 215973
53998 215973 214819 213681 212020 210122 208522 207394 206582 205924 205396 205039 204816 204504 203904 203333 203759 206128
53982 206128 210462 215804 221063 225822 230335 234861 239050 241898 242334 240042 235727 230532 225225 219999
53968 219999 214866 209969 205483 201476 197963 195015 192738 191216 190521 190688 191596 192897 194093 194742 194649 193923
53952A93923r91o66M05K032L416L641K664J538J284J816K356K677L175L912M320
53937B25502M053L456K979K710K717L223M052M468M071L386L068K952K495J819
53923B70951J589J986K457K557K541K923L813M816N412N420N189N275N786O251
53909C26966O210N709M972L946K550J122J30m15q74j367j707j817j880j999k138
53894C39408k379k884l643m472n301o113o720o909o752o432n813m681l435k958
53880B70916l566m516m836m387l799l531l380k900k058j376j394k086k833l021
53866B27233k556j826j301j271j730k356k713k710k622k597k356j715j038q13
53852A99629r34r00n95l57l34k78n2J42J32qj76l30l77l48o03j329j852j236K61
$$ plain form
53952 193923 192932 192266 192671 194703 198119 201760 204424 205962 207246 209062 211418 214095 217270 221182 225502
53937 225502 229555 233011 235990 238700 241417 244640 248692 253160 257231 260617 263685 266637 269132 270951
53923 270951 272540 274526 276983 279540 282081 285004 288817 293633 299045 304465 309654 314929 320715 326966
53909 326966 333176 338885 343857 347803 350353 351475 351605 351190 350316 348949 347242 345425 343545 341546 339408
53894 339408 337029 334145 330502 326030 320729 314616 307896 300987 294235 287803 281990 277309 273874 270916
53880 270916 267350 262834 257998 253611 249812 246281 242901 240001 237943 236567 235173 233087 230254 227233
53866 227233 224677 222851 221550 220279 218549 216193 213480 210770 208148 205551 203195 201480 200442 199629
53852 199629 198695 197795 197200 196843 196509 196231 196179 196321 196453 196445 196269 195939 195562 195214 194611 193282 191430 190194 190455
53833A90455J170O14n22q71l87n8j91k4R39K053K367J778R38L73J03oM7K90O42
53814A99710R88J357J813K259K441K317K238K570L122L264K756K186K292L043
53800B32356L692L696L288L108L512M306M925M825L927K819K323K681L314L474
53786B82246K984K162J331O38J60k47j122k826m716n469m542k941k115k413l079
53771B60051l442l472l285k873k439k390k724k927k753k617k871l148k891k190
53757B20029j600j377j404j625k046k364k173j592j182j157j129q43n92o63p32
53742A99550k48P34J547J741J539J376J251R07M69M22Q16R53L22m50k47R51J878
53725B13511J645Q79P43J280J539J028L35K36Q16J604K127K130J604Q50L52M77
$$ plain form
53833 190455 191625 192239 191717 190846 190459 190401 190210 190186 191125 193178 195545 197323 198261 198634 198737 198731 198778 199068 199710
53814 199710 200698 202055 203868 206127 208568 210885 213123 215693 218815 222079 224835 227021 229313 232356
53800 232356 236048 239744 243032 246140 249652 253958 258883 263708 267635 270454 272777 275458 278772 282246
53786 282246 285230 287392 288723 289361 289521 289274 288152 285326 280610 275141 270599 267658 265543 263130 260051
53771 260051 256609 253137 249852 246979 244540 242150 239426 236499 233746 231129 228258 225110 222219 220029
53757 220029 218429 217052 215648 214023 211977 209613 207440 205848 204666 203509 202380 201537 200945 200282 199550
53742 199550 199302 200036 201583 203324 204863 206239 207490 208397 208866 209288 210104 211057 211379 210929 210682 211633 213511
53725 213511 215156 216035 216778 218058 219597 220625 220960 221196 222012 223616 225743 227873 229477 230327 230679 231156
53709B31156J243K326L158L269K756K277K275K451K307J919J706J701J667J778
53695B61989K485L606M331M292M032M092M186L703K560J209O1o77r34p99n35l92
53679B93209n08r59j554j663q32L47O76q4q30o83j86k51o49n71j86m35j355j752
53661B81734r15L49Q48M48j29l93l76k05K6K03M09R74J883K453K127J443J524
53644B92403K613L688L720K817J905J741K424L449L927L173J565M51O82J491J378
53629C27427j2j498j850r53M95J813K494K281J534J097J345J711J627J422J807
53614C40740K740L527L835L879L735L225K553K320K609K771K447K218K741L640
53600C82980L939L360K626K404K472K166J281K35n07q30q18n73l17l87q00j091
$$ plain form
53709 231156 232399 234725 237883 241152 243908 246185 248460 250911 253218 255137 256843 258544 260211 261989
53695 261989 264474 268080 272411 276703 280735 284827 289013 292716 295276 296485 296546 295869 294935 294136 293601 293209
53679 293209 292701 291742 290188 288525 287693 288040 288716 288632 287802 287119 286933 286682 286033 285462 285276 284841 283486 281734
53661 281734 280819 281168 282016 282464 282335 281942 281566 281361 281387 281590 281999 282973 284856 287309 289436 290879 292403
53644 292403 295016 298704 302424 305241 307146 308887 311311 314760 318687 321860 323425 323876 324558 326049 327427
53629 327427 327415 325917 324067 323114 323609 325422 327916 330197 331731 332828 334173 335884 337511 338933 340740
53614 340740 343480 347007 350842 354721 358456 361681 364234 366554 369163 371934 374381 376599 379340 382980
53600 382980 386919 390279 392905 395309 397781 399947 401228 401463 400956 400126 399308 398735 398418 398031 397231 396140
53584C96140r58q94j598k742l115k192r23m79q43j267j541j963k424k460k087
53569C70654j729j418r03n16r00j775j994j157k00R0J37N48Q82M52k81k04P97
53552C62483J626J469P61M57Q97J571J771J288O20M46Q69J427J909K692L939M925
53536C89150M825L924L423M006N186O113O534O776P198P905Q853R976J1172J2234
53522D87275J2842J2886J2771J3114J3914J4407J4096J3668J4320J6313J8652
53511F44258K0255K1005K1550K2504K3972K5553K6590K6655K5944K5096K4515
53500I07897K4057K3487K2945K2774K2924K2832K2067K0911K0113K0008K0149
53489A150164J9966J9526J9275J9229J8970J8504J8448J9053J9617J9409J8729
$$ plain form
53584 396140 395182 394288 392690 389948 386833 384641 383718 383239 382396 381129 379588 377625 375201 372741 370654
53569 370654 368925 367507 366604 366088 365188 363413 361419 360262 360062 360152 360289 360837 361719 362171 361890 361686 362483
53552 362483 364109 365578 366339 366796 367693 369264 371035 372323 372943 373389 374258 375685 377594 380286 384225 389150
53536 389150 393975 397899 401322 405328 410514 416627 423161 429937 437135 445040 453893 463869 475041 487275
53522 487275 500117 513003 525774 538888 552802 567209 581305 594973 609293 625606 644258
53511 644258 664513 685518 707068 729572 753544 779097 805687 832342 858286 883382 907897
53500 907897 931954 955441 978386 1001160 1024084 1046916 1068983 1089894 1110007 1130015 1150164
53489 1150164 1170130 1189656 1208931 1228160 1247130 1265634 1284082 1303135 1322752 1342161 1360890
53478A360890J8373J8327J7782J6435J4947J3848J2635J0517P617M863K775R17
53466A499926j363m115o856r248j1278j2961j4173j4896j5348j5733j6074j6467
53454A361414j7210j8420j9722k0652k1209k1664k1975k1891k1540k1336k1235
53443A134560k0662j9367j7838j6571j5399j3822j1641q991o180l807k570k549
53431I95163k965k938k195q01J170L347N013N948O842Q259R699J0461J0969J2320
53417A060292J4704J7222J9195K0731K1960K2691K3083K3871K5478K7474K9208
53406A305909L0574L1870L3344L5117L7138L9079M0710M2376M4626M7279M9511
53395A737533N1026N2441N4248N6085N7425N8333N9010N9140N8401N7183N6174
$$ plain form
53478 1360890 1379263 1397590 1415372 1431807 1446754 1460602 1473237 1483754 1491371 1496234 1499009 1499926
53466 1499926 1498563 1494448 1487592 1478344 1467066 1454105 1439932 1425036 1409688 1393955 1377881 1361414
53454 1361414 1344204 1325784 1306062 1285410 1264201 1242537 1220562 1198671 1177131 1155795 1134560
53443 1134560 1113898 1094531 1076693 1060122 1044723 1030901 1019260 1010269 1004089 1000282 997712 995163
53431 995163 992198 989260 987065 986264 987434 990781 995794 1001742 1008584 1016843 1026542 1037003 1047972 1060292
53417 1060292 1074996 1092218 1111413 1132144 1154104 1176795 1199878 1223749 1249227 1276701 1305909
53406 1305909 1336483 1368353 1401697 1436814 1473952 1513031 1553741 1596117 1640743 1688022 1737533
53395 1737533 1788559 1841000 1895248 1951333 2008758 2067091 2126101 2185241 2243642 2300825 2356999
53384B356999N5450N4549N3210N1519M9475M6995M4231M1395L8270L4440K9933
53373B856466K5163K0275J5054R571M353l34n010j0447j6807k3556l0101l6233
53361B808394m1972m7162n1326n3994n5136n5283n5153n5186n5390n5474n5018
53350B227300n3706n1596m9138m6882m5130m3998m3535m3599m3678m3217m2166
53339A720655m0928l9726l8262l6149l3492l0767k8288k6020k3877k1891k0060
53328A381195j8271j6515j5051j4181j3910j3991j4223j4563j4967j5268j5237
53317A215018j4650j3371j1579r896q964q737q444p364n476l180p61J535L182
53304A127313L742L605L855N189P263R321J1161J3182J5652J8304K0584K2148
$$ plain form
53384 2356999 2412449 2466998 2520208 2571727 2621202 2668197 2712428 2753823 2792093 2826533 2856466
53373 2856466 2881629 2901904 2916958 2926529 2930882 2930548 2925538 2915091 2898284 2874728 2844627 2808394
53361 2808394 2766422 2719260 2667934 2613940 2558804 2503521 2448368 2393182 2337792 2282318 2227300
53350 2227300 2173594 2121998 2072860 2025978 1980848 1936850 1893315 1849716 1806038 1762821 1720655
53339 1720655 1679727 1640001 1601739 1565590 1532098 1501331 1473043 1447023 1423146 1401255 1381195
53328 1381195 1362924 1346409 1331358 1317177 1303267 1289276 1275053 1260490 1245523 1230255 1215018
53317 1215018 1200368 1186997 1175418 1165522 1156558 1147821 1139377 1132013 1126537 1123357 1122596 1124131 1127313
53304 1127313 1131055 1134660 1138515 1143704 1150967 1160288 1171449 1184631 1200283 1218587 1239171 1261319
53292A261319K3049K3712K4666K6136K7742K8773K8851K8229K7318K6105K4272
53281A550172K1888J9584J7843J6290J4089J0953P488M387J623j334m672p949
53269A650362j0679j2986j5433j8217k0778k2450k3385k4429k5944k7244k7592
53258A421225k7411k7835k9214l0693l1366l1175l0528k9664k8789k8231k8022
53247A098297k7671k6776k5541k4418k3668k3521k4175k5142k5217k3852k2096
53236H26220k1391k1679k1508j9912j7303j4634j2468j0942j0011r416q944q701
53224F49311q812q967q843q796r393j0441j1260j1833j2753j3993j4666j4309
53212E15245j3421j2491j1449j0407r883r768r130p767o953p669q919r009p917
$$ plain form
53292 1261319 1284368 1308080 1332746 1358882 1386624 1415397 1444248 1472477 1499795 1525900 1550172
53281 1550172 1572060 1591644 1609487 1625777 1639866 1650819 1658307 1662694 1664317 1662983 1658311 1650362
53269 1650362 1639683 1626697 1611264 1593047 1572269 1549819 1526434 1502005 1476061 1448817 1421225
53258 1421225 1393814 1365979 1336765 1306072 1274706 1243531 1213003 1183339 1154550 1126319 1098297
53247 1098297 1070626 1043850 1018309 993891 970223 946702 922527 897385 872168 848316 826220
53236 826220 804829 783150 761642 741730 724427 709793 697325 686383 676372 666956 658012 649311
53224 649311 640499 631532 622689 613893 604500 594059 582799 570966 558213 544220 529554 515245
53212 515245 501824 489333 477884 467477 457594 447826 438696 430929 423976 416307 407388 398379 390462
53199C90462p052p045p131o692o220o310o743p034p161p242p092o583o006n619
53185B96532n167m353l510l294l766m173l783k660j521r87j084j349j258o63O0
53170B59024K46m19j478k138k184k146k391k510k001j122n03j32M47J031P49n74
53154B43899j880k135j540r68p77o52l06J91N47L90m49j500j963j635j072n23
53138B29627M55J868K616J844L51l68k0N05P16R00J063P23m6m36p9M83P53R15
53120B41870J200J404J434J591J913J878J236N30L18M36M54L10qp67j919k709
53104B49171k526j767j218r74o54l73o06j230j448q95j35R0l47j019j417j169
53088B33483k68O83Q09j40j393j890j350m21Q3k7k98k52J04L73K78m8l52n48o97
$$ plain form
53199 390462 383410 376365 369234 362542 356322 350012 343269 336235 329074 321832 314740 308157 302151 296532
53185 296532 291365 287012 283502 280208 276442 272269 268486 265826 264305 263318 262234 260885 259627 258964 259024
53170 259024 259270 258851 257373 255235 253051 250905 248514 246004 244003 242881 242378 242246 242693 243724 244473 243899
53154 243899 242019 239884 238344 237376 236599 235947 235641 235832 236379 236769 236320 234820 232857 231222 230150 229627
53138 229627 230082 231950 234566 236410 236761 236393 236373 236878 237594 238494 239557 240280 240234 239798 239719 240202 240955 241870
53120 241870 243070 244474 245908 247499 249412 251290 252526 253056 253374 253810 254264 254574 254566 253799 251880 249171
53104 249171 246645 244878 243660 242686 242032 241659 241053 239823 238375 237480 237345 237435 237088 236069 234652 233483
53088 233483 233215 233898 234707 234567 233174 231284 229934 229513 229596 229569 229271 229019 229123 229496 229774 229726 229374 228826 228129
53069B28129p84p78p21o75o35n93n41l72N2N45O30J65l64m73l16l11l79j73J66
53050B22572J83j1K01P88Q04k33j396j439m14N08O37L68K64L21K99J99O6j53l07
53031B23257L3R41J781J832J128K72l45p47r27p09j50K97K76k4r1L26R08J047
53013B29105M58m85j079j016o15k57J45P83J306J083J65n44l27M96J026Q83M26
52996B31553J83L68Q37J245J225P18J00j94j46l2N0K20M49M92K77O0N9J81K22
52977B37867J99K49L92N05N21M84N31Q59J528K170K096J018l95j038n40L58P60
52960B47564O40O07Q92J027O13m3l65k95l17p38j356j829j985j718r32J25Q06
52943B42696O90J58p2O7o3q20j647j744j092m19k58m73p38r98j291j401j081m94
$$ plain form
53069 228129 227345 226567 225846 225171 224536 223943 223402 223030 223082 223627 224257 224422 224058 223585 223269 222958 222579 222406 222572
53050 222572 222755 222744 222945 223733 224537 224304 222908 221469 221055 221563 222200 222568 222832 223153 223452 223651 223717 223564 223257
53031 223257 223290 224231 226012 227844 228972 229244 228899 228152 227225 226516 226366 226663 226939 226915 226824 227150 228058 229105
53013 229105 229563 229078 227999 226983 226368 226111 226256 227039 228345 229428 229593 229049 228722 229218 230244 231127 231553
52996 231553 231736 232104 232941 234186 235411 236129 236229 236035 235889 235857 235907 236127 236576 237068 237345 237405 237464 237645 237867
52977 237867 238066 238315 238707 239212 239733 240217 240748 241607 243135 245305 247401 248419 248024 246986 246446 246804 247564
52960 247564 248204 248811 249703 250730 251343 251300 250935 250640 250323 249585 248229 246400 244415 242697 241765 241890 242696
52943 242696 243386 243544 243472 243539 243476 242656 241009 239265 238173 237754 237496 237023 236285 235287 233996 232595 231514 231020
52925B31020j25k07m63l95K28J159J799J680R69L76L07K99k61j049j085k05N09
52908B34556J46p24q25R8J000Q91q7r80j024l14K73n4j041j545j001j94o5k13
52890B28897M56J943L012K906K146J380N82k48n57j26L47K68N7L16P17N31j57
52873B42470n96m14J92R91J726J916J388P15M13Q2q09j652j392k51M16R3l61l95
52855B44532p26j901l033k942j884j181j485k194k442j945j005k02j28r00j948
52840B20616k517k335j633p86j69q2l60l31M27J412J736J234N53K20J45R3Q9J56
52822B18468O2l89j045j587j807j522n14J067K477K965K638K357K696L267L250
52807B32383K339R32m54j620k553l199l441l195k423j263k00J56l97j361j965
$$ plain form
52925 231020 230895 230688 230225 229830 230058 231217 233016 234696 235665 236041 236348 236647 236386 235337 234252 234047 234556
52908 234556 234702 233978 233153 233251 234251 235142 235055 234075 233051 232737 233010 232956 231915 230370 229369 229175 229110 228897
52890 228897 229353 231296 234308 237214 239360 240740 241322 241074 240517 240391 240738 241006 241063 241379 242096 242627 242470
52873 242470 241874 241460 241652 242643 244369 246285 247673 248388 248801 248883 248074 246422 245030 244779 245195 245288 244927 244532
52855 244532 243806 241905 238872 235930 234046 232865 231380 229186 226744 224799 223794 223592 223464 222564 220616
52840 220616 218099 215764 214131 213345 213176 213094 212734 212403 212830 214242 215978 217212 217765 217985 218130 218223 218312 218468
52822 218468 218530 218141 217096 215509 213702 212180 211666 212733 215210 218175 220813 223170 225866 229133 232383
52807 232383 234722 235654 235200 233580 231027 227828 224387 221192 218769 217506 217306 217462 217065 215704 213739
52792B13739j798j048k26J89O6k86l73j0N32R01J021J032J058J141J212J078O76
52775B18904L61N22Q18L41j096k351k245j072k26n23j506k259k240j352P8J327
52759B07481J851J905K036K082J369K1q59o34M6L30L66P64J452J833J763J639
52743B23445J661J683J768K246L042L453K889J625O22N36J076J311P10k66p26
52728B45075m10J70M66M04O7n74j348j783j659j311j078q16l55m9l30r87j363
52711B34119j150o20j67L8N6J72O33J152J025R9p35o28KJ26k84k41O06J252P43
52692B36198m36j004m85M21Q62O83K74o1l80q55j349j434r18k05J09p0l99o92
52674B30259j009j199r32l33m4l08n50k31L77P51J050J763K647K845K143J423
$$ plain form
52792 213739 211941 210893 210667 210856 210922 210636 210263 210253 210785 211686 212707 213739 214797 215938 217150 218228 218904
52775 218904 219265 219787 220605 220946 219850 217499 215254 214182 213956 213433 211927 209668 207428 206076 206154 207481
52759 207481 209332 211237 213273 215355 216724 216745 215886 215252 215298 215628 215994 216758 218210 220043 221806 223445
52743 223445 225106 226789 228557 230803 233845 237298 240187 241812 242434 242970 244046 245357 246067 245801 245075
52728 245075 244665 244835 245301 245705 245772 245198 243850 242067 240408 239097 238019 237203 236848 236799 236469 235482 234119
52711 234119 232969 232349 232182 232220 232276 232448 233081 234233 235258 235357 234622 233994 233996 234122 233838 233597 234203 235455 236198
52692 236198 235762 234758 234273 234694 235556 236239 236513 236452 236072 235217 233868 232434 231516 231311 231420 231350 230951 230259
52674 230259 229250 228051 227119 226786 226742 226434 225884 225653 226030 226781 227831 229594 232241 235086 237229 238652
52658B38652J531K201K533K209J755J722K019K124J705Q62p5q91j596k283k857
52643B49611l019k610j843j111n86j96M8k4l64n43k96J7j75p08p37J49J214J443
52625B40270Q52M27P69J363J383P10j79r14j366j297n36L97N20m09j362j177p
52608B39444R21Q79M07M01R62J507J622J414J134R45R66J229J478J351P70J4o60
52591B54784j200j511j305m70N69J088P46o5o21n09J10Q61J549K054K039J179
52575B59298k52j411j732j431q86k0J199J990J399l11j688j813j253j029j254
52560B50806j366j197j058j015p73k72J20J28j65n70r61j102p52o2M57N49N03
52543B43270O82R85J014O40J08k66l42r8L61P19O61K98J91O40J152R69J42m35
$$ plain form
52658 238652 240183 242384 244917 247126 248881 250603 252622 254746 256451 257313 257238 256347 254751 252468 249611
52643 249611 246592 243982 242139 241028 240442 240246 240294 240270 239906 239363 239067 239084 238909 238201 237464 237613 238827 240270
52625 240270 241122 241549 242318 243681 245064 245774 245595 244681 243315 242018 241482 241879 242399 241990 240628 239451 239444
52608 239444 240365 241244 241651 242052 243014 244521 246143 247557 248691 249636 250602 251831 253309 254660 255430 255444 254784
52591 254784 253584 252073 250768 250298 250867 251955 252701 252636 252015 251506 251616 252477 254026 256080 258119 259298
52575 259298 259046 257635 255903 254472 253586 253566 254765 256755 258154 257843 256155 254342 253089 252060 250806
52560 250806 249440 248243 247185 246170 245397 245125 245245 245373 245208 244638 243677 242575 241823 241761 242218 242767 243270
52543 243270 243952 244937 245951 246591 246699 246433 246091 245993 246354 247073 247734 248032 248223 248863 250015 250984 251126 250691
52525B50691k12K60J72l99p34n94l91l45k16N3J36L3L28J292K296K556K060J373
52507B58359R46J030J715K537K458J000r18j946j885j629j730j922j952k052k297
52492B51714k295j861j388j183r68m20K46O49Q68J147J318J002L63J04O00J356
52476B51252J515Q31o0l64j8L27K02l9K37J005J571J450Q66L48K49O91J590K520
52458B64173K935K733K303J855J084k15j625k547k907k974k759k095j238p81q92
52443B57050j088r24n36k89k50l49o81j270j674j380o04j73m30p02k36P08J195
52426B48367Q99M17L20M26L64K49M34Q64J181J287J410J678K009K341K686K997
52410B67929L314L927N002O150O767O864P083P729Q189P451N075J520k202n117
$$ plain form
52525 250691 250479 250739 250911 250512 249778 249184 248793 248448 248232 248285 248421 248454 248782 250074 252370 254926 256986 258359
52507 258359 259305 260335 262050 264587 267045 268045 267127 265181 263296 261667 259937 258015 256063 254011 251714
52492 251714 249419 247558 246170 244987 244019 243599 243845 244494 245362 246509 247827 248829 249192 249296 249896 251252
52476 251252 252767 253598 253538 253174 253156 253483 253685 253646 253883 254888 256459 257909 258775 259123 259372 260063 261653 264173
52458 264173 267108 269841 272144 273999 275083 274868 273243 270696 267789 264815 262056 259961 258723 257942 257050
52443 257050 255962 255038 254502 254213 253963 253614 252933 251663 249989 248609 248005 247832 247402 246700 246464 247172 248367
52426 248367 249266 249683 250003 250429 250793 251042 251476 252340 253521 254808 256218 257896 259905 262246 264932 267929
52410 267929 271243 275170 280172 286322 293089 299953 307036 314765 322954 330405 335480 337000 334798 329681
52396C29681o801p472p497o913n681m205l174k799k625k211j584r02j65N14P96
52381B78962O15M27O68J177J505J552J572J755K073K420K703K912L221L800M368
52366C09730M296L441K501K150K128J693P55M3J48Q35J357J178L78l43k21P58
52350C30827J712J873J525J484J882K055J667J245J402K034K631K981L257L715
52336C60290M581N946P481Q544Q858Q839Q997R248R250R230R890J1519J3567J5304
52322D91544J6574J7686J8762J9459J9406J8777J8254J8292J8528J8202J7198
52311F92682J6318J6311J6940J7354J7200J6852J6618J6267J5471J4311J3043
52300H69367J1696J0185Q604P148N858M705L702K762J624J86j287k621m122o064
$$ plain form
52396 329681 322880 315408 307911 300998 295317 291112 287938 285139 282514 280303 278719 277817 277652 278166 278962
52381 278962 279577 280004 280672 281849 283354 284906 286478 288233 290306 292726 295429 298341 301562 305362 309730
52366 309730 314026 317467 319968 322118 324246 325939 326694 326737 326885 327720 329077 330255 330633 330290 330069 330827
52350 330827 332539 334412 335937 337421 339303 341358 343025 344270 345672 347706 350337 353318 356575 360290
52336 360290 364871 370817 378298 386842 395700 404539 413536 422784 432034 441264 451154 462673 476240 491544
52322 491544 508118 525804 544566 564025 583431 602208 620462 638754 657282 675484 692682
52311 692682 709000 725311 742251 759605 776805 793657 810275 826542 842013 856324 869367
52300 869367 881063 891248 899852 907000 912858 917563 921265 924027 925651 925837 924550 921929 917807 911743
52286I11743p951q882q723q282q120p694o154l610j093O03J639K657L978N360
52272H65471O362O921P543Q836J0731J2356J2873J2335J1525J1093J1153J1498
52260I88697J1901J2163J2219J2269J2502J2686J2316J1305J0198R461Q813P615
52248A122145N770L840K217N79j514l745n320o090o886q376j0077j1004j1057
52235A070482j1011j1188j0966r901q584p884p825p826p592p155o407n295m298
52222I64550l894l720k945j494j20P78J621K694L539L709L470L297L204L073L159
52207I80921L770M669N342N598N549N180M436L646L391L965N147O366O995O668
52193A051643N642M636M081L734L220K626K186J717Q51l73j653l007m708o629
$$ plain form
52286 911743 903792 894910 886187 877905 869785 862091 855937 852327 851234 851837 853476 856133 860111 865471
52272 865471 871833 878754 886297 895133 905864 918220 931093 943428 954953 966046 977199 988697
52260 988697 1000598 1012761 1024980 1037249 1049751 1062437 1074753 1086058 1096256 1105717 1114530 1122145
52248 1122145 1127915 1131755 1133972 1134551 1133037 1129292 1123972 1117882 1110996 1102620 1092543 1081539 1070482
52235 1070482 1059471 1048283 1037317 1027416 1018832 1010948 1003123 995297 987705 980550 974143 968848 964550
52222 964550 960656 956936 953991 952497 952377 953155 954776 957470 961009 964718 968188 971485 974689 977762 980921
52207 980921 984691 989360 994702 1000300 1005849 1011029 1015465 1019111 1022502 1026467 1031614 1037980 1044975 1051643
52193 1051643 1057285 1061921 1066002 1069736 1072956 1075582 1077768 1079485 1080336 1079963 1078310 1075303 1070595 1063966
52179A063966q120q642q237p349o505o115o223o380o086n377m674m062l138j709
52165I81349k32P00J024J084J111J100J105J302J665J809J318L08n46o01M3O20
52149I93159N03j28n13q1J012K062K437K078J462R59L80n95j597j727p66L35O98
52132I99678Q17J982M508P283R165J0200J1266J2978J5316J7919K0342K2246K3636
52119A157336K4845K5997K6679K6426K5437K4457K3869K3206K1756J9549J7461
52108A417018J6214J5474J4208J1919R227P106N874N167M594L917K761P49j884
52095A512344m278n885p155q988j1644j4446j6413j7058j6642j5909j5469j5258
52083A363199j4593j2918j0439p931n977m591l422k101l62J860M257O247P539
$$ plain form
52179 1063966 1055846 1047204 1038967 1031618 1025113 1018998 1012775 1006395 1000309 994932 990258 986196 983058 981349
52165 981349 981117 981817 982841 983925 985036 986136 987241 988543 990208 992017 993335 993643 993097 992496 992539 993159
52149 993159 993662 993534 993021 992940 993952 996014 998451 1000529 1001991 1002950 1003330 1002735 1001138 999411 998645 998980 999678
52132 999678 1000495 1002477 1006985 1014268 1023433 1033633 1044899 1057877 1073193 1091112 1111454 1133700 1157336
52119 1157336 1182181 1208178 1234857 1261283 1286720 1311177 1335046 1358252 1380008 1399557 1417018
52108 1417018 1433232 1448706 1462914 1474833 1484060 1491166 1497040 1502207 1506801 1510718 1513479 1514228 1512344
52095 1512344 1508066 1502181 1495026 1486038 1474394 1459948 1443535 1426477 1409835 1393926 1378457 1363199
52083 1363199 1348606 1335688 1325249 1317318 1311341 1306750 1303328 1301227 1300865 1302725 1306982 1313229 1320768
52070A320768Q529R907J1830J3721J4995J5665J5994J5834J4850J3372J2404J2430
52058A480299J2697J2109J0566Q871P518O203M532K551L89k048m696p123r140
52045A522728j1232j3826j6454j8247j9169j9955k0842k1092k0197j8880j8243
52034A324591j8211j7696j6202j4591j3951j4302j4860j5145j5279j5390j5301
52023A153663j4915j4427j3988j3449j2674j1872j1375j1179j0917j0330r629
52012A018908r322r680j0385j0902j1233j1967j3387j4838j5470j5422j5623j6427
52000H64252j7170j7250j6912j6489j5611j3824j1603r938r208r102r449j0297
51988G07399j1255j1608j1229j0722j0466j0237r972j0158j1030j2025j2514j2617
$$ plain form
52070 1320768 1329297 1339204 1351034 1364755 1379750 1395415 1411409 1427243 1442093 1455465 1467869 1480299
52058 1480299 1492996 1505105 1515671 1524542 1532060 1538263 1542795 1545346 1545735 1543687 1538991 1531868 1522728
52045 1522728 1511496 1497670 1481216 1462969 1443800 1423845 1403003 1381911 1361714 1342834 1324591
52034 1324591 1306380 1288684 1272482 1257891 1243940 1229638 1214778 1199633 1184354 1168964 1153663
52023 1153663 1138748 1124321 1110333 1096884 1084210 1072338 1060963 1049784 1038867 1028537 1018908
52012 1018908 1009586 999906 989521 978619 967386 955419 942032 927194 911724 896302 880679 864252
52000 864252 847082 829832 812920 796431 780820 766996 755393 745455 736247 727145 717696 707399
51988 707399 696144 684536 673307 662585 652119 641882 631910 621752 610722 598697 586183 573566
51976E73566j2722j2625j1843j0447q950p457n650l565j731m45N89J654K549K996
51962E05919L145L335L648L961M197M219L674K417J017L68P50J647K635M020O285
51947E51237R149J1724J3596J5331J7659K0343K2072K1448J8111J2926P250J967
51935G22813k753o846r852j1298j1493j1441j1828j2444j2784j2895j3262j4123
51923E91794j5212j6065j6316j5850j4968j4197j3633j2724j1084r331q424q312
51911D35678p874o413m504l112k406j859j111j86Q09J772K484K844L037L115K616
51896D24890J104j027k836l897m594n260n685n671n480n252m467k668m70R31J336
51881C80954J847L285M962N599N165M947N855P308Q032P441N901M053K304P79
$$ plain form
51976 573566 560844 548219 536376 525929 516979 509522 503872 500307 498576 498131 498720 500374 502923 505919
51962 505919 509064 512399 516047 520008 524205 528424 532098 534515 535532 535900 536650 538297 540932 544952 551237
51947 551237 560386 572110 585706 601037 618696 639039 661111 682559 700670 713596 720846 722813
51935 722813 720060 713214 703362 692064 680571 669130 657302 644858 632074 619179 605917 591794
51923 591794 576582 560517 544201 528351 513383 499186 485553 472829 461745 452414 443990 435678
51911 435678 427804 421391 416887 413775 411369 409510 408399 408213 409022 410794 413278 416122 419159 422274 424890
51896 424890 425994 424967 422131 418234 413640 408380 402695 397024 391544 386292 381825 379157 378687 379618 380954
51881 380954 382801 386086 391048 396647 401812 406759 412614 419922 427954 435395 441296 445349 447653 448432
51867D48432o69k271l927n039n143m544l942l525k884j793n72M45J223J660J411
51852D18862N21k51l02j21p49k368m028m842m875m658m423m188m083m108l814
51837C76573k872j755j305j539j575q16L46J293J987K592K806K229J141K17l81
51822C78941r93j626j791j286m86K41Q26J090P46J24J31J044J923J844J127O97
51806C82552O87M84j51q40j338j782k129k025j379n38J50M96L21l04p50m54J16
51789C73116q2j101j726j080K36J064J138R65P58K36p04j664k148j945j187l00
51773C65576K13K01L7J89Q17J902L416N025N976N710M562L419K714K108J144j74
51757D02835j568k942m382n750o548o312n147l766k911k806l196l665l771l118
$$ plain form
51867 448432 447763 445492 441565 436526 431383 426839 422897 419372 416488 414695 414123 414568 415791 417451 418862
51852 418862 419383 419132 418830 418709 417960 415592 411564 406722 401847 397189 392766 388578 384495 380387 376573
51837 376573 373701 371946 370641 369102 367527 366711 367057 368350 370337 372929 375735 377964 379105 379322 378941
51822 378941 377948 376322 374531 373245 372759 373000 373826 374916 375662 375786 375917 376961 378884 380728 381855 382552
51806 382552 383239 383723 383572 382732 381394 379612 377483 375458 374079 373541 373691 374187 374508 374204 373454 373000 373116
51789 373116 373034 371933 370207 369127 369363 370427 371565 372530 373288 373524 372820 371156 369008 367063 365876 365576
51773 365576 365789 365990 366027 366216 367033 368935 372351 377376 383352 389062 393624 397043 399757 401865 403009 402835
51757 402835 401267 398325 393943 388193 381645 375333 370186 366420 363509 360703 357507 353842 350071 346953
51743C46953j760m08J83J06J42P51J669K594L593M552M829M017K672J699J218
51728C72810O14l43r99n94Q27K415L171K565Q14j279k805l240k628j454l91L0
51712C69513k98j013j566j533p61N64J951K893L218L127K873K558K163J591P29
51697C86009l14j125j408j373j342j156m99K86L82l70j208j494j391j251j015
51682C72731o74o08r02q86p5R53J294R89P39O89L64k61n11k8O49Q60P46J006J973
51663C79048L154L661L042J679L32o45j337j634j080L93K121L482M559N685O765
51648D09225P497P760P266N429K313q34k837m046n593p538q822q969q629q351
51634C83871p904p112o406o064n635m642l206j717l84N41P39L09k39p63j631k841
$$ plain form
51743 346953 345193 344785 344968 345074 345216 345967 347636 350230 353823 358375 363204 367221 369893 371592 372810
51728 372810 373424 373081 372082 371488 372315 374730 377901 380466 381280 380001 377196 373956 371328 369874 369483 369513
51712 369513 369215 368202 366636 365103 364342 364906 366857 369750 372968 376095 378968 381526 383689 385280 386009
51697 386009 385695 384570 383162 381789 380447 379291 378792 379078 379460 379090 377882 376388 374997 373746 372731
51682 372731 372057 371449 370547 369661 369586 370539 371833 372822 373561 374250 374614 374353 373842 373814 374463 375323 376069 377075 379048
51663 379048 382202 385863 388905 390584 390916 390271 388934 387300 386220 386613 388734 392216 396775 402460 409225
51648 409225 416722 424482 431748 437177 439490 438656 435819 431773 426180 418642 409820 400851 392222 383871
51634 383871 375967 368855 362449 356385 350750 346108 342902 341185 340801 341342 342081 342390 342151 341388 339757 336916
51618C36916l642l476k689j923j351q96o40m91p3N96P95J06p20o22L82J370J815
51601C25457K075K664L645M799N943P046Q263R706J0893J0742Q597N139J807o73
51587D06103k657m548n957o125m891k937j169M6J080K524M567O855Q874J0203
51573D11968J0532R809Q559P653P509P699P579P023O334N791N631O185P648R831
51559E19751J2407J5318J8627K2076K4977K6502K5977K3255J9006J4430J0332
51548G32658O602K736j392n497r282j2498j4978j6923j8888k1047k2769k3434
51536E95288k3289k2936k2202k0321j7301j4343j2580j1873j1178r739p719n889
51524D15918m986n161n793n900m971l450k343k259k770k797j824o03l40j196k081
$$ plain form
51618 336916 333274 329798 327109 325186 323835 322939 322299 321808 321735 322331 323126 323232 322512 321890 322272 323642 325457
51601 325457 327532 330196 333841 338640 344583 351629 359892 369598 380491 391233 399830 404969 406776 406103
51587 406103 403446 398898 392941 386816 381925 378988 377819 377865 378945 381469 386036 392891 401765 411968
51573 411968 422500 432309 440868 448521 456030 463729 471308 478331 484665 490456 496087 502272 509920 519751
51559 519751 532158 547476 566103 588179 613156 639658 665635 688890 707896 722326 732658
51548 732658 739260 741996 740604 735107 725825 713327 698349 681426 662538 641491 618722 595288
51536 595288 571999 549063 526861 506540 489239 474896 462316 450443 439265 429526 421807 415918
51524 415918 410932 405771 399978 394078 389107 385657 383314 381055 378285 375488 373664 373061 372721 371525 369444
51509C69444k113j614j361j373j170p78o71q78r18o26l19j27J71N41N85K55O8
51492C59116L13O20O26N52P31R86Q97L37n42j568k509l036l113l134l375l563
51476C43338l347k942k844l054l046k503j804j597k082k724k723j837p35l33p47
51461C11020j137p30L24J275J682J707J704J795J849J771J797K462M040O000P437
51446C42996Q113Q646R569J0650J1426J1793J1632J0379P668M089O93k014m062
51433D31578n323n703n798o435p488p986p625p267p620q168p976o884n382l825
51419C38098k431j569j380j327p60K47J106J542J682J566J188R33J280K056K590
51404C44821K613K481K474K490K548K934L553L785L301K572K234K327K578K963
$$ plain form
51509 369444 367331 365717 364356 362983 361813 361035 360364 359486 358568 357942 357623 357496 357667 358208 358793 359048 359116
51492 359116 359429 360049 360675 361227 361958 362944 363841 364178 363636 362068 359559 356523 353410 350276 346901 343338
51476 343338 339991 337049 334205 331151 328105 325602 323798 322201 320119 317395 314672 312835 312100 311767 311020
51461 311020 309883 309153 309477 310752 312434 314141 315845 317640 319489 321260 323057 325519 329559 335559 342996
51446 342996 351109 359755 369324 379974 391400 403193 414825 425204 432872 436961 437654 435640 431578
51433 431578 426255 420552 414754 408319 400831 392845 385220 377953 370333 362165 354189 347305 341923 338098
51419 338098 335667 334098 332718 331391 330631 330878 331984 333526 335208 336774 337962 338895 340175 342231 344821
51404 344821 347434 349915 352389 354879 357427 360361 363914 367699 371000 373572 375806 378133 380711 383674
51390C83674L542M123M530N003N841O948Q096R478J1455J3931J6470J8953K1573
51377E13617K4282K6688K8601L0159L1341L1619L0285K6894K1521J4921Q310K502
51365G90740k813q500j4631k0210k4286k6845k8388k9148k9079k8270k6952k5292
51353E26326k3347k1120j8496j5422j2294r834q404p679p164o678o168n538m895
51340C79287m635m831m934m511l900l695l853l902l750l697l743l545k996k360
51326C24935j781j207p94q21j145j218p67J4R35J979K843K982K356J653J388J276
51310C32628Q55K57j00k14l27l43j3M23M40L6k16p2J8l28p43o60k08l7l49o12
51290C30435l85J00M90J019K087L284L569K739J938K247L158L256K168R44M49
$$ plain form
51390 383674 387216 391339 395869 400872 406713 413661 421757 431235 442690 456621 473091 492044 513617
51377 513617 537899 564587 593188 623347 654688 686307 716592 743486 765007 779928 788238 790740
51365 790740 787927 779427 764796 744586 720300 693455 665067 635919 606840 578570 551618 526326
51353 526326 502979 481859 463363 447941 435647 425813 417409 409730 402566 395888 389720 384182 379287
51340 379287 374652 369821 364887 360376 356476 352781 348928 345026 341276 337579 333836 330291 327295 324935
51326 324935 323154 321947 321153 320332 319187 317969 317202 317216 318151 320130 322973 325955 328311 329964 331352 332628
51310 332628 333483 333740 333640 333426 333099 332756 332743 333166 333606 333642 333426 333354 333372 333044 332301 331641 331433 331396 331047 330435
51290 330435 330050 330150 330640 331659 333746 337030 340599 343338 345276 347523 350681 353937 356105 357049 357498
51275C57498L26p1m98l47J86K82l34j081j368j109m05O62J722K154J767J028L68
51258C60780l71j450k504k829k216j181l69o7k60p49j154j074n29MJ35O2K38O45
51240C47111O13l86j934k925k735j851j194j014q64n36m40q06j085o58J42L58
51224C31796l20j162j354q24O4J033J826K119J948J874K241K612K430J997K119
51209C48399K913L668L881L722L346K551J445Q20J146J717J446L32o21q30p83
51194C73152j034j229o66N59J507J482P55Q1j57o9J37K73J4q46j855k182j739
51177C68183j511k226l095k734j144J83K15m65q41q59r80j101p35M8O83R15R38
51160C55474Q73P38P84J215J691J670J162N83J1p36j405j462r91o34n57k61L49
$$ plain form
51275 357498 357824 357753 357255 356908 357094 357376 357042 355961 354593 353484 353079 353741 355463 357617 359384 360412 360780
51258 360780 360409 358959 356455 353626 351410 350229 349860 349793 349533 348784 347630 346556 346027 346031 346166 346228 346466 347111
51240 347111 347724 347338 345404 342479 339744 337893 336699 335685 334821 334285 333845 333039 331954 331296 331438 331796
51224 331796 331476 330314 328960 328136 328200 329233 331059 333178 335126 337000 339241 341853 344283 346280 348399
51209 348399 351312 354980 358861 362583 365929 368480 369925 370745 371891 373608 375054 375386 374765 373935 373152
51194 373152 372118 370889 370223 370782 372289 373771 374526 374607 374450 374381 374518 374791 374805 373959 372104 369922 368183
51177 368183 366672 364446 361351 358617 357473 357656 357871 357406 356565 355706 354726 353625 352890 352938 353621 354536 355474
51160 355474 356347 357085 357869 359084 360775 362445 363607 364190 364201 363465 362060 360598 359607 358973 358416 358155 358504
51143C58504N68o6r74j313j040p27p27r40j050o89K28J100J068J67n42l57J51
51126C53361J86OM24J525K666L411L658L082J485l76j265r25l49l43n04NJ287
51109C67334K644L328L096K308J672J584J683J370P27L51M18N26O11J152K115
51094C90919K555J889R19P84J348J536J021O38J042J821K155J803J109M96K47
51079D10282M15P25Q35P86Q93J078Q92L87M10J456K802L392L357L813N322P339
51063D44184R264J1207J3370J5408J6868J7694J7790J6671J4233J1384R136P417
51051F04626N602L897L082K871J776r40m164o419p559q287q797q848q721q974
51037E59145r394r146p905o165m512l343l187m331n988o754o172n115m383l732
$$ plain form
51143 358504 359072 359006 358032 356719 355679 354952 354225 353285 352235 351546 351774 352874 353942 354109 353567 353210 353361
51126 353361 353547 353553 353977 355502 358168 361579 365237 368319 369804 369428 368163 367238 366889 366546 366042 366047 367334
51109 367334 369978 373306 376402 378710 380382 381966 383649 385019 385746 386097 386515 387041 387652 388804 390919
51094 390919 393474 395363 396282 397066 398414 399950 400971 401609 402651 404472 406627 408430 409539 410035 410282
51079 410282 410697 411422 412257 413043 413936 415014 415906 416293 416703 418159 420961 424353 427710 431523 436845 444184
51063 444184 453448 464655 478025 493433 510301 527995 545785 562456 576689 588073 597209 604626
51051 604626 610228 614125 617207 620078 621854 620914 616750 610331 602772 594485 585688 576840 568119 559145
51037 559145 549751 540605 532700 526535 522023 518680 515493 511162 505174 498420 492248 487133 482750 479018
51023D79018k650j244K28K016M346O733Q494R617J0509J1196J1399J1142J0683
51010E61487J0044R150Q207P384O349M760L019J839J195M28o95j763k619l504
50996F05281m248m163l092j869j101k33J581M100O222P276P578P849Q648J0221
50982F44050J2369J4384J5504J5509J4723J3572J2459J1903J2405J4120J6822
50971G97820K0180K3898K7729L1619L5710L9999M4154M7880N1342N4872N8388
50960A233591O1392O3447O4382O4179O2974O1003N8276N4487M9599M4254L9063
50949A856647L3826K8062K2204J7350J3827J0903Q195O428O205O707O377M499
50937B021230J488j963n350q226j0387j2251j4516j7403k0656k4189k8200l2637
$$ plain form
51023 479018 476368 475124 475352 477368 481714 488447 496941 506558 517067 528263 539662 550804 561487
51010 561487 571531 580681 588888 596272 602621 607381 610400 612239 613434 613862 613167 611404 608785 605281
50996 605281 601033 596870 593778 591909 590808 590575 592156 596256 602478 609754 617332 625181 633829 644050
50982 644050 656419 670803 686307 701816 716539 730111 742570 754473 766878 780998 797820
50971 797820 818000 841898 869627 901246 936956 976955 1021109 1068989 1120331 1175203 1233591
50960 1233591 1294983 1358430 1422812 1486991 1549965 1610968 1669244 1723731 1773330 1817584 1856647
50949 1856647 1890473 1918535 1940739 1958089 1971916 1982819 1991014 1997442 2003647 2010354 2016731 2021230
50937 2021230 2022718 2020755 2015405 2007179 1996792 1984541 1970025 1952622 1931966 1907777 1879577 1846940
50925A846940l7036m1090m4969m8835n2390n5045n6435n6646n6057n4945n3181
50914A290311n0487m7090m3792m1063l8317l4702l0380k6473k3691k1720j9982
50903I12614j8365j6852j5185j3314j1745j0856j0213r064p312n561m363l805
50891G85979l650l482k824j565j78P38J134J362J613J865K235K952L962M991N981
50876H01113P018P960Q571R111J0196J1912J3625J4864J5904J7116J8255J8848
50864I54493J9061J9637K1135K3589K6702L0023L3138L6201M0092M5558N2208
50853A301837N9010O5733P3216Q1997R1342J00178J08333J16240J23755J30131
50843B251772J35089J39067J42186J43633J42504J38714J32490J23391J10638
$$ plain form
50925 1846940 1809904 1768814 1723845 1675010 1622620 1567575 1511140 1454494 1398437 1343492 1290311
50914 1290311 1239824 1192734 1148942 1107879 1069562 1034860 1004480 978007 954316 932596 912614
50903 912614 894249 877397 862212 848898 837153 826297 816084 807020 799708 794147 789784 785979
50891 785979 782329 778847 776023 774458 774280 775018 776152 777514 779127 780992 783227 786179 790141 795132 801113
50876 801113 808131 816091 824662 833773 843969 855881 869506 884370 900274 917390 935645 954493
50864 954493 973554 993191 1014326 1037915 1064617 1094640 1127778 1163979 1204071 1249629 1301837
50853 1301837 1360847 1426580 1499796 1581793 1673135 1773313 1881646 1997886 2121641 2251772
50843 2251772 2386861 2525928 2668114 2811747 2954251 3092965 3225455 3348846 3459484
50834C459484R4516P6681N8846M1605K4941R414l785j3795k0479k3906k4054k1303
50822C658165j6651j0974m412K858R491J3233J2512P362j277j2585k6013m0932
50810C590777n6706p2854q8762j03445j15944j25903j33377j38268j40285j39357
50800B475876j35638j29259j20578j10561j00288q9977p9175o7986n7479m8494
50790A536441m0669l3195k6026j9717j4443r966o435m416l985m342m594m567m675
50777A359411n337o626q230r638j0521j1029j1502j1955j2216j2519j3467j5244
50765A231127j7246j8744j9640k0311k0945k1305k1041j9926j7929j5179j1901
50754A026960q309m624j234J465L469N271P362R792J2220J4296J5880J7122J8511
$$ plain form
50834 3459484 3554000 3630681 3689527 3731132 3756073 3765487 3761702 3747907 3727428 3703522 3679468 3658165
50822 3658165 3641514 3630540 3626128 3628986 3638477 3651710 3664222 3671584 3670307 3657722 3631709 3590777
50810 3590777 3534071 3461217 3372455 3269010 3153066 3027163 2893786 2755518 2615233 2475876
50800 2475876 2340238 2210979 2090401 1979840 1879552 1789575 1710400 1642414 1584935 1536441
50790 1536441 1495772 1462577 1436551 1416834 1402391 1392425 1385990 1381574 1377589 1373247 1368653 1364086 1359411
50777 1359411 1354074 1347448 1339218 1329580 1319059 1308030 1296528 1284573 1272357 1259838 1246371 1231127
50765 1231127 1213881 1195137 1175497 1155186 1134241 1112936 1091895 1071969 1054040 1038861 1026960
50754 1026960 1018651 1014027 1012793 1014258 1017727 1022998 1030360 1040152 1052372 1066668 1082548 1099670 1118181
50741A118181K0623K3663K7319L1202L5241L9573M4224M9092N4059N8930O3318
50730A565425O6827O9267P0671P1205P1236P1224P1311P1051O9676O6648O1801
50719B326342N5145M6694L6560K5065J2838P50j0425k0266k8428l4119l6336l4861
50707B338959l0675k5041j8544j1363m141K086O713R714J0942R843O012l69q843
50694B285293j9004l0312m1943n3070o3017p1009p6153p8018p7060p4162o9882
50683A631663o4349n7699n0254m2336l4221k6228j8597j1285m163K571Q492J3559
50671A347153J8284K3062K7455L0463L1468L0734K8987K6742K4123K1194J8276
50660A627941J5923J4567J4140J4071J3812J3385J3281J3679J4078J3928J3454
$$ plain form
50741 1118181 1138804 1162467 1189786 1220988 1256229 1295802 1340026 1389118 1443177 1502107 1565425
50730 1565425 1632252 1701519 1772190 1843395 1914631 1985855 2057166 2128217 2197893 2264541 2326342
50719 2326342 2381487 2428181 2464741 2489806 2502644 2503394 2492969 2472703 2444275 2410156 2373820 2338959
50707 2338959 2308284 2283243 2264699 2253336 2249195 2251281 2257994 2267708 2278650 2288493 2294505 2294136 2285293
50694 2285293 2266289 2235977 2194034 2140964 2077947 2006938 1930785 1852767 1775707 1701545 1631663
50683 1631663 1567314 1509615 1459361 1417025 1382804 1356576 1337979 1326694 1322531 1325102 1333594 1347153
50671 1347153 1365437 1388499 1415954 1446417 1477885 1508619 1537606 1564348 1588471 1609665 1627941
50660 1627941 1643864 1658431 1672571 1686642 1700454 1713839 1727120 1740799 1754877 1768805 1782259
50649A782259J3472J4401J5834J7227J8697K0902K4252K8464L2843L6872M0521
50638B045744M3990M7221M9706N0897N0764M9808M8603M7439M6267M4758M2510
50627B567707L9539L6365L3091K8381K0023O891r907k7750m3767n5343o0599n9440
50615B475191n3823m6177l7649k8363j8926j0566l850J714O465R707J0454Q512
50603B312689M331j790r874j9757l0771m1919n2226o1089o8340p3951p7721p9429
50591A800153p9163p7230p3782o8977o3400n7881n2792m8004m3454l9234l5074
50580A161162l0481k5641k1501j8505j5843j2518q670n179k329L88L277N993Q215
50567A038368J0147J2205J4482J6747J8737K0429K2054K3805K5498K6780K7754
$$ plain form
50649 1782259 1795731 1810132 1825966 1843193 1861890 1882792 1907044 1935508 1968351 2005223 2045744
50638 2045744 2089734 2136955 2186661 2237558 2288322 2338130 2386733 2434172 2480439 2525197 2567707
50627 2567707 2607246 2643611 2676702 2705083 2725106 2731997 2722090 2694340 2650573 2595230 2534631 2475191
50615 2475191 2421368 2375191 2337542 2309179 2290253 2279687 2275837 2277551 2284016 2293723 2304177 2312689
50603 2312689 2317020 2315230 2305356 2285599 2254828 2212909 2160683 2099594 2031254 1957303 1879582 1800153
50591 1800153 1720990 1643760 1569978 1501001 1437601 1379720 1326928 1278924 1235470 1196236 1161162
50580 1161162 1130681 1105040 1083539 1065034 1049191 1036673 1028003 1022824 1020495 1020883 1024160 1030153 1038368
50567 1038368 1048515 1060720 1075202 1091949 1110686 1131115 1153169 1176974 1202472 1229252 1257006
50556A257006K8995L0580L1615L1401L0657L0777L1938L2813L2378L1082K9844
50545A599086K8637K6902K4884K3728K4200K5994K8426L1302L4867L9224M4196
50534A931446M9621N5526O1964O8840P5964Q3288R1030R9479J08527J17375J24899
50523B867959J30431J34053J35999J35955J33244J27575J19187J08169R4146P6987
50513D063705N7494L6854J5556o550k9125n0904p0614q7754j02124j13031j19499
50502C594008j21093j18080j10937j00167q6462p0546n2848l3792j4494L369J8663
50491B907621L1403M1920M9630N3037N0853M2757K9129J0553j2009l6750o1213
50480C106931q3297j01961j16891j27653j33621j34785j32225j27487j21571j14700
$$ plain form
50556 1257006 1286001 1316581 1348196 1379597 1410254 1441031 1472969 1505782 1538160 1569242 1599086
50545 1599086 1627723 1654625 1679509 1703237 1727437 1753431 1781857 1813159 1848026 1887250 1931446
50534 1931446 1981067 2036593 2098557 2167397 2243361 2326649 2417679 2517158 2625685 2743060 2867959
50523 2867959 2998390 3132443 3268442 3404397 3537641 3665216 3784403 3892572 3986718 4063705
50513 4063705 4121199 4158053 4173609 4167059 4137934 4087030 4016416 3928662 3826538 3713507 3594008
50502 3594008 3472915 3354835 3243898 3143731 3057269 2986723 2933875 2900083 2885589 2888958 2907621
50491 2907621 2939024 2980944 3030574 3083611 3134464 3177221 3206350 3216903 3204894 3168144 3106931
50480 3106931 3023634 2921673 2804782 2677129 2543508 2408723 2276498 2149011 2027440 1912740
50470A912740j06871r8286q9280q0127p1103o2566n4859m8127m2227l6762l1329
50459A191203k5846k0605j5845j1427p060k813Q62L695N958Q162J0570J2970J4845
50446A164669J5768J5816J5613J5747J6129J6121J5340J4008J2381J0190P082
50435A318864L424K40j764k743l188l191k543j367j60Q36J925L416N104O639Q220
50420A333712J0478J3648J7190K0520K3803K7813L3058L9248M5548N1236N6173
50409A672427O0764O5409O9854P3214P4667P4019P1572O7722O2834N7286N1235
50398B401003M4363L6080K5952J3906J68j4653k9553m3509n5942o6616p5150q0909
50386B155140q3375q2486p8614p2452o4769n6055m6329l5504k3923j2397j777
$$ plain form
50470 1912740 1805869 1707583 1618303 1538176 1467073 1404507 1349648 1301521 1259294 1222532 1191203
50459 1191203 1165357 1144752 1128907 1117480 1110420 1107607 1108469 1112164 1118122 1126284 1136854 1149824 1164669
50446 1164669 1180437 1196253 1211866 1227613 1243742 1259863 1275203 1289211 1301592 1311782 1318864
50435 1318864 1322288 1322528 1320764 1318021 1314833 1311642 1309099 1307732 1307572 1308408 1310333 1313749 1318853 1325492 1333712
50420 1333712 1344190 1357838 1375028 1395548 1419351 1447164 1480222 1519470 1565018 1616254 1672427
50409 1672427 1733191 1798600 1868454 1941668 2016335 2090354 2161926 2229648 2292482 2349768 2401003
50398 2401003 2445366 2481446 2507398 2521304 2521472 2506819 2477266 2433757 2377815 2311199 2236049 2155140
50386 2155140 2071765 1989279 1910665 1838213 1773444 1717389 1671060 1635556 1611633 1599236 1597459
50375A597459P352J4718K0371K4477K6746K6226K2142J4909N866l930j4128k4192
50363A718016l2878l9035m2637m4566m5555m5673m4751m3123m1937m2588m5470
50352A249803m9289n1945n2259n0481m7235m2703l7186l1600k6746k2470j8239
50341H19650j4194j0953q530o246l656j002J343L253M623N335N599N810N963N649
50327H12644M887M484N171O663P898Q166P729P442P841Q594Q891Q376P463O558
50313I12807N323L276Q88o62q95n32l10l6P39J716K216K230K367K931L639M260
50297I39957M929N731O466P004P455P816P732O876N366L603J851J92j238k205
50283A001535k604k571k346k065j616p42P29K668M704O527Q079R453J0690J1829
$$ plain form
50375 1597459 1604811 1619529 1639900 1664377 1691123 1717349 1739491 1754400 1760266 1756336 1742208 1718016
50363 1718016 1685138 1646103 1603466 1558900 1513345 1467672 1422921 1379798 1337861 1295273 1249803
50352 1249803 1200514 1148569 1096310 1045829 998594 955891 918705 887105 860359 837889 819650
50341 819650 805456 794503 785973 779727 776071 775069 776412 779665 784288 789623 795222 801032 806995 812644
50327 812644 817531 822015 827186 833849 841747 849913 857642 865084 872925 881519 890410 898786 906249 912807
50313 912807 918130 921406 922294 921632 920737 920205 919895 919859 920598 922314 924530 926760 929127 932058 935697 939957
50297 939957 944886 950617 957083 964087 971542 979358 987090 993966 999332 1002935 1004786 1004978 1003740 1001535
50283 1001535 998931 996360 994014 991949 990333 989591 990320 992988 997692 1004219 1012298 1021751 1032441 1044270
50269A044270J3076J4775J7038J9443K1253K1999K1845K1351K0980K0803K0559
50258A257392J9891J8669J7177J5967J5340J5015J4362J2890J0361O567J400m803
50246A400228j1161j6598k0352k2234k2620k2018k0507j7734j3766r754p246o962
50234A209276q676j2118j7139k2812k7333k9515k9808k9336k8418k6806k4873
50223I52442k3491k2787k1861j9980j7470j5221j3772j3077j2730j2206j1222
50212G68625r976q874q059p465p139p056o749n742m352l428l228l167k747k144
50198F88499j630j173q49j002j613k095k181k339k911l396l204k573k117j910
50184F59506j721j678j951k144j770j072o28l93o0K2o40j400r57O72J927J886
$$ plain form
50269 1044270 1057346 1072121 1089159 1108602 1129855 1151854 1173699 1195050 1216030 1236833 1257392
50258 1257392 1277283 1295952 1313129 1329096 1344436 1359451 1373813 1386703 1397064 1403631 1405031 1400228
50246 1400228 1389067 1372469 1352117 1329883 1307263 1285245 1264738 1247004 1233238 1223484 1216238 1209276
50234 1209276 1200600 1188482 1171343 1148531 1121198 1091683 1061875 1032539 1004121 977315 952442
50223 952442 928951 906164 884303 864323 846853 831632 817860 804783 792053 779847 768625
50212 768625 758649 749775 741716 734251 727112 720056 713307 707565 703213 699785 696557 693390 690643 688499
50198 688499 686869 685696 684847 683845 682232 680137 677956 675617 672706 669310 666106 663533 661416 659506
50184 659506 657785 656107 654156 652012 650242 649170 648542 648149 648089 648111 647471 646071 645114 645786 647713 649599
50168F49599J520K018K970L241K939L295M847O848Q499R853J1350J3252J5806
50155G36037J9239K3260K7048L0197L3271L6959M1042M4645M7364M9468N1025
50144A139555N1407N0028M7241M4116M1494L9587L8376L7891L7846L7256L4750
50133A599547K9371K1101J0765n11j1847k2753l2860m1684m8736n3752n6547n6912
50121A335182n5049n1956m8749m5521m1497l6567l1899k8616k6450k4435k2353
50110I22090k0685j9425j7993j6228j4634j3480j2431j1226r989q731p263n878
50098G64127n317n673n950n201l577j831l15R37J688J793J822K671M491O481P793
50083G63939Q334Q686R343J0089J0127R031P487O648O709O709N928M864M324M165
$$ plain form
50168 649599 651119 653137 656107 659348 662287 665582 670429 677277 685776 695629 706979 720231 736037
50155 736037 755276 778536 805584 835781 869052 906011 947053 991698 1039062 1088530 1139555
50144 1139555 1190962 1240990 1288231 1332347 1373841 1413428 1451804 1489695 1527541 1564797 1599547
50133 1599547 1628918 1650019 1660784 1660273 1648426 1625673 1592813 1551129 1502393 1448641 1392094 1335182
50121 1335182 1280133 1228177 1179428 1133907 1092410 1055843 1023944 995328 968878 944443 922090
50110 922090 901405 881980 863987 847759 833125 819645 807214 795988 785999 777268 770005 764127
50098 764127 758810 753137 747187 741986 738409 736578 736263 737200 738888 740681 742503 745174 749665 756146 763939
50083 763939 772273 780959 790302 800391 810518 819549 827036 833684 840393 847102 853030 857894 862218 866383
50069H66383L563K175L70j375k724l351l280l205l828m942n703n725n348m866
50055H28144m183l260k299j323j51J082J929K362L018M471O577Q744J0518J1767
50041H67396J2652J3605J5034J6869J8595J9777K0378K0634K0970K2036K4262
50030A072208K7222K9857L1462L2067L1779L0386K7932K5145K2741K0538J7792
50019A369129J4289J0696P862O014M584K561r95o373j3074k0246k7322l4128m0464
50006A272533m5748m9167n0154m8759m5574m1367l6770l2169k7659k3064j8308
49995H53794j3860j0578q816p965p238o590o468o844p203p433q011r145j0313
49982G43330j0954j1193j1509j2037j2503j2576j2061j0954r525q143o869n543
$$ plain form
50069 866383 869946 872121 872491 871116 868392 865041 861761 858556 854728 849786 844083 838358 833010 828144
50055 828144 823961 820701 818402 817079 816928 818010 819939 822301 825319 829790 836367 845111 855629 867396
50041 867396 880048 893653 908687 925556 944151 963928 984306 1004940 1025910 1047946 1072208
50030 1072208 1099430 1129287 1160749 1192816 1224595 1254981 1282913 1308058 1330799 1351337 1369129
50019 1369129 1383418 1394114 1401976 1407990 1412574 1415135 1414140 1407767 1394693 1374447 1347125 1312997 1272533
50006 1272533 1226785 1177618 1127464 1078705 1033131 991764 954994 922825 895166 872102 853794
49995 853794 839934 829356 820540 812575 805337 798747 792279 785435 778232 770799 762788 753643 743330
49982 743330 732376 721183 709674 697637 685134 672558 660497 649543 640018 631875 625006 619463
49970F19463m307l665l787m164m241m038l862l739l510l173k743j987p12Q32K168
49955E78535L087L703M189M757N667O890P925Q198P648O640N531M538L822L326
49941F54456K698J677M57o30j642k933m609o396p922q905r205r056r065r571j0107
49926E79247r813q383o322m353k883j991j485j052n40j30K0J23M28P57P89O80
49910E45092Q74J407J938K454L353M670N831O494P142Q410J0054J1056J0649R053
49896F28477P167N719M654L339J413p38k502l872n344o995q166q304p689p126
49882F00033p116p585q164q487q397q025p623p191o506n559m642l818k748j297
49868E12875j5N08N34R01J887K912L446L737M359N386O425P209P790Q219Q442
$$ plain form
49970 619463 615156 611491 607704 603540 599299 595261 591399 587660 584150 580977 578234 576247 575535 576367 578535
49955 578535 581622 585325 589514 594271 599938 606828 614753 622951 630599 637239 642770 647308 651130 654456
49941 654456 657154 658831 659288 658658 657016 654083 649474 643078 635156 626251 617046 607990 598925 589354 579247
49926 579247 569434 561051 554729 550376 547493 545502 544017 542965 542425 542295 542315 542438 542866 543623 544412 545092
49910 545092 545966 547373 549311 551765 555118 559788 565619 572113 579255 587665 597719 608775 619424 628477
49896 628477 635644 641363 646017 649356 650769 650031 647529 643657 638313 631318 623152 614848 607159 600033
49882 600033 592917 585332 577168 568681 560284 552259 544636 537445 530939 525380 520738 516920 514172 512875
49868 512875 512860 513368 513902 514803 516690 519602 523048 526785 531144 536530 542955 550164 557954 566173 574615
49853E74615Q558Q753Q812Q098O347M259K821K169J602P24o4m35r43k407m765
$$ plain form
49853 574615 583173 591926 600738 608836 615183 619442 622263 624432 626034 626758 626694 626259 625316 622909 618144
$$ [...]
##END NTUPLES=NMR SPECTRUM
##END=
