
##TITLE=AC1348_GUAAH12166_6647719_L7WRAV9tdh
##JCAMPDX= 6.0         $$ Bruker NMR JCAMP-DX V2.0
##DATA TYPE= NMR SPECTRUM
##DATA CLASS= NTUPLES
##ORIGIN= BRUKER
##OWNER= Administrator
$$ 1.72 TOPSPIN		Version 2.1
$$ 2012-08-10 18:12:12.593 -0500  Administrator@TOPSPIN
$$ Compression mode = diff/dup
##.OBSERVE FREQUENCY= 400.02188249412
##.OBSERVE NUCLEUS= ^1H
##.ACQUISITION MODE= SIMULTANEOUS (DQD)
##.ACQUISITION SCHEME= undefined
##.AVERAGES= 8
##.DIGITISER RES= 22
##SPECTROMETER/DATA SYSTEM= spect
##.PULSE SEQUENCE= zg30
##.SOLVENT NAME= COFFEE_meoh
##.SHIFT REFERENCE= INTERNAL, COFFEE_meoh, 1, 14.98509
##AUDIT TRAIL= $$ (NUMBER, WHEN, WHO, WHERE, PROCESS, VERSION, WHAT)
$$ ##TITLE= Audit trail, TOPSPIN		Version 2.1
$$ ##JCAMPDX= 5.01
$$ ##ORIGIN= Bruker BioSpin GmbH
$$ ##OWNER= Administrator
$$ $$ C:\Bruker\TOPSPIN/data/COFFEE/nmr/AC1348_GUAAH12166_6647719_L7WRAV9tdh/10/pdata/1/auditp.txt
$$ ##AUDIT TRAIL=  $$ (NUMBER, WHEN, WHO, WHERE, PROCESS, VERSION, WHAT)
(   1,<2012-08-10 18:12:04.312 -0500>,<Administrator>,<TOPSPIN>,<go>,<TOPSPIN 2.1>,
      <created by zg
	started at 2012-08-10 18:10:57.296 -0500,
	POWCHK enabled, PULCHK disabled,
       configuration hash MD5:
       6B 1B 68 BB D9 2E 58 E2 7F 35 AD 54 07 DF 0E 41
       data hash MD5: 64K
       05 22 2D F0 01 2F F2 60 30 18 66 9B 13 A9 1D A7>)
(   2,<2012-08-10 18:12:08.437 -0500>,<Administrator>,<TOPSPIN>,<proc1d>,<TOPSPIN 2.1>,
      <Start of raw data processing
       efp LB = 0 FT_mod = 6 PKNL = 1 PHC0 = 0 PHC1 = 0 SI = 32K 
       data hash MD5: 32K
       6F 88 C1 4E F8 58 26 D8 A5 81 C6 CD 73 4A 86 80>)
(   3,<2012-08-10 18:12:08.718 -0500>,<Administrator>,<TOPSPIN>,<proc1d>,<TOPSPIN 2.1>,
      <pk PHC0 = 180.6592 PHC1 = 0 
       data hash MD5: 32K
       64 01 5D AF 88 F8 16 E1 C4 F0 22 FF D1 95 6B 7B>)
(   4,<2012-08-10 18:12:08.812 -0500>,<Administrator>,<TOPSPIN>,<proc1d>,<TOPSPIN 2.1>,
      <abs ABSG = 1 
       data hash MD5: 32K
       07 23 0F 2D 66 93 D4 22 DF 39 E8 C8 0D 81 21 05>)
(   5,<2012-08-10 18:12:08.828 -0500>,<Administrator>,<TOPSPIN>,<proc1d>,<TOPSPIN 2.1>,
      <abs ABSG = 2 
       data hash MD5: 32K
       D3 37 95 A3 3E 97 36 51 3D 93 3A F3 AB 84 08 AF>)
(   6,<2012-08-10 18:12:08.859 -0500>,<Administrator>,<TOPSPIN>,<proc1d>,<TOPSPIN 2.1>,
      <abs ABSG = 3 
       data hash MD5: 32K
       5B CA AC 40 C7 3A 5E E9 BA BA 73 64 C0 21 FA F0>)
(   7,<2012-08-10 18:12:08.890 -0500>,<Administrator>,<TOPSPIN>,<proc1d>,<TOPSPIN 2.1>,
      <abs ABSG = 4 
       data hash MD5: 32K
       95 08 BC 6C F9 15 F6 4E 00 6B 64 7C 64 D9 BC B0>)
(   8,<2012-08-10 18:12:08.937 -0500>,<Administrator>,<TOPSPIN>,<proc1d>,<TOPSPIN 2.1>,
      <abs ABSG = 5 
       data hash MD5: 32K
       5B A4 BD 6A 48 6C 55 16 69 E0 6F D7 5D 5F EB A5>)
$$ ##END=
$$ 
$$ $$ hash MD5
$$ $$ 68 24 8E AF 95 7A EB 19 D2 20 B8 4F 01 12 FF BE
##$RELAX= 
##$RELAX= 
##$RELAX= 
##$RELAX= 
##$RELAX= 
##$RELAX= 
##$RELAX= 
$$ Bruker specific parameters
$$ --------------------------
$$ [...]
##$TP= (0..7)
150 150 150 150 150 150 150 150
##$TP07= 0
##$TPNAME0= <>
##$TPNAME1= <>
##$TPNAME2= <>
##$TPNAME3= <>
##$TPNAME4= <>
##$TPNAME5= <>
##$TPNAME6= <>
##$TPNAME7= <>
##$TPOAL= (0..7)
0.5 0.5 0.5 0.5 0.5 0.5 0.5 0.5
##$TPOFFS= (0..7)
0 0 0 0 0 0 0 0
##$TUNHIN= 0
##$TUNHOUT= 0
##$TUNXOUT= 0
##$USERA1= <user>
##$USERA2= <user>
##$USERA3= <user>
##$USERA4= <user>
##$USERA5= <user>
##$V9= 5
##$VALIST= <valist>
##$VCLIST= <CCCCCCCCCCCCCCC>
##$VD= 0
##$VDLIST= <DDDDDDDDDDDDDDD>
##$VPLIST= <PPPPPPPPPPPPPPP>
##$VTLIST= <TTTTTTTTTTTTTTT>
##$WBST= 1024
##$WBSW= 4
##$XGAIN= (0..3)
0 0 0 0
##$XL= 0
##$YL= 0
##$YMAX_a= 446529
##$YMIN_a= -582171
##$ZGOPTNS= <>
##$ZL1= 120
##$ZL2= 120
##$ZL3= 120
##$ZL4= 120
##$ABSF1= 14.98509
##$ABSF2= -5.573092
##$ABSG= 5
##$ABSL= 3
##$ALPHA= 0
##$AQORDER= 0
##$ASSFAC= 0
##$ASSFACI= 0
##$ASSFACX= 0
##$ASSWID= 0
##$AUNMP= <proc_prof1d_extract_pilot.lims>
##$AXLEFT= 0
##$AXNAME= <>
##$AXNUC= <1H>
##$AXRIGHT= 0
##$AXTYPE= 0
##$AXUNIT= <>
##$AZFE= 0.1
##$AZFW= 0.1
##$BCFW= 0
##$BC_mod= 0
##$BYTORDP= 0
##$COROFFS= 0
##$CY= 15
##$DATMOD= 1
##$DC= 0
##$DFILT= <>
##$DTYPP= 0
##$F1P= 0
##$F2P= 0
##$FCOR= 0.5
##$FTSIZE= 32768
##$FT_mod= 6
##$GAMMA= 0
##$GB= 0
##$INTBC= 1
##$INTSCL= 1
##$ISEN= 128
##$LB= 0
##$LEV0= 0
##$LPBIN= 0
##$MAXI= 10000
##$MC2= 0
##$MEAN= 0
##$ME_mod= 0
##$MI= 0
##$NCOEF= 0
##$NC_proc= -8
##$NLEV= 6
##$NOISF1= 0
##$NOISF2= 0
##$NSP= 0
##$NTH_PI= 0
##$NZP= 0
##$OFFSET= 14.98509
##$PC= 1
##$PHC0= 180.6592
##$PHC1= 0
##$PH_mod= 1
##$PKNL= yes
##$PPARMOD= 0
##$PPDIAG= 0
##$PPIPTYP= 0
##$PPMPNUM= 2147483647
##$PPRESOL= 1
##$PSCAL= 4
##$PSIGN= 0
##$PYNMP= <proc.py>
##$REVERSE= no
##$SF= 400.02
##$SI= 32768
##$SIGF1= 0
##$SIGF2= 0
##$SINO= 400
##$SIOLD= 32768
##$SPECTYP= <>
##$SREGLST= <1H.CDCl3>
##$SSB= 0
##$STSI= 32768
##$STSR= 0
##$SW_p= 8223.68421052631
##$SYMM= 0
##$S_DEV= 0
##$TDeff= 65536
##$TDoff= 0
##$TI= <>
##$TILT= no
##$TM1= 0
##$TM2= 0
##$TOPLEV= 0
##$USERP1= <user>
##$USERP2= <user>
##$USERP3= <user>
##$USERP4= <user>
##$USERP5= <user>
##$WDW= 1
##$XDIM= 32768
##$YMAX_p= 444058825
##$YMIN_p= -792763
##$CURPLOT= <Network HP LaserJet P1505>
##$CURPRIN= <$Network HP LaserJet P1505>
##$DFORMAT= <normdp>
##$LAYOUT= <+/1D_H.xwp>
##$LFORMAT= <normlp>
##$PFORMAT= <normpl>
##$SURQMSG= 1
$$ End of Bruker specific parameters
$$ ---------------------------------
##NTUPLES= NMR SPECTRUM
##VAR_NAME=  FREQUENCY,     SPECTRUM/REAL,   SPECTRUM/IMAG
##SYMBOL=    X,             R,               I
##VAR_TYPE=  INDEPENDENT,   DEPENDENT,       DEPENDENT
##VAR_FORM=  AFFN,          ASDF,            ASDF
##VAR_DIM=   32768,         32768,           32768
##UNITS=     HZ,            ARBITRARY UNITS, ARBITRARY UNITS
##FACTOR=    0.250966925370066, 1,           1
##FIRST=     8223.43324360094, -73829,       32967
##LAST=      0,             115988,          -75139
##MIN=       0,             -792763,         0
##MAX=       8223.43324360094, 444058825,    0
$$ Real data points
##PAGE= N=1
##DATA TABLE= (X++(R..R)), XYDATA
$$ [...]
$$ plain form
19506 -233352 -171920 -79110 -184775 -238740 -194131 -114441 -255394 -269402 151545 -52396 68383
19494 -334125 -322003 103206 32944 206503 -125450 41922 -162573 -83182 134267 -128114
19483 -167878 172837 -89467 -196163 -205138 -194999 315933 208768 -11729 14098 72338 -179139
19471 454731 -26162 451290 -392098 -165968 -67086 -11178 39843 -8736 -239883 -95250 277705
19459 166224 -199638 -386924 -383466 444355 -440062 -18087 -291593 -175957 -50813 -93360
19449 -93360 -313470 -60207 182310 -540801 161530 34941 -165405 -37959 -69933 -329807
19439 -329807 -70182 -234045 53854 -304092 -7133 13851 -143980 80885 158168 61751 83473
19428 83473 204297 -188759 98950 -8580 -251394 193002 216619 -14224 -137864 -34286 -237352
$$ packed form
19506b33352O1432g9110j05665n3965M4609P9690j40953j4008A51545e2396F8383
19494c34125J2122A03206C2944J73559a25450D1922a62573P9391A34267a28114
19483a67878A72837h9467j06696q975J0139C15933j07165a1729A4098N8240a79139
19471D54731b6162D51290c92098a65968f7086a1178C9843h736k31147i5250B77705
19459A66224a99638j87286L458D44355d40062a8087k73506J15636e0813m2547
19449i3360k20110f0207A82310e40801A61530C4941a65405c7959l1974k59874
19439c29807g0182j63863E3854c04092g133A3851a43980H0885P7283F1751K1722
19428H3473J20824a88759I8950h580k42814A93002K3617a4224j23640c4286k03066
$$ plain form
19417 -237352 -330002 -64104 177103 -303038 -239234 -63852 51123 74047 130177 -278849 -158262
19406 -158262 -75527 87619 -90769 -155604 91873 102424 -62418 -33492 243684 305493 61783
19394 -8922 -300082 -453798 -1646 -101062 -217967 -75361 -23290 7790 44481 7010 103656 -239829
19381 -210287 -216084 32215 -198510 -244828 -124283 100085 -185314 95994 -207911 316381
19370 32685 -389358 -194105 149646 83872 -224296 -281638 -324168 -322668 -113505 -145684 23318
19358 -99626 -33241 -222831 -33390 -303235 -384154 -49601 -45046 84975 -89081 -20563 126435
19346 -47864 -203469 -223562 214044 -291065 -238840 76656 -108881 -18666 -52185 29579 -232731
19334 -208198 -15321 79848 273151 145178 21078 -299927 -311023 -152972 -90918 -17892 -304847
$$ packed form
19417b37352r2650f4104A77103c03038O3804f3852E1123K2924N6130b78849J20587
19406a58262g5527H7619i0769o4835I1873J0551f2418K8926B43684O1809F1783
19394h922k91160j53716a646r9416j16905g5361b3290G790L6691G010R6646b39829
19381b10287n797C2215a98510m6318J20545A00085a85314I5994b07911C16381
19370C2685c89358a94105A49646o5774b24296n7342m2530J500a13505l2179B3318
19358i9626c3241j89590c3390k69845q0919d9601M555H4975h9081b0563A26435
19346d7864j55605k0093B14044b91065N2225G6656a08881a8666l3519B9579b32731
19334b08198a5321G9848J93303j27973B1078b99927j1096a52972O2054a7892k86955
$$ plain form
19323 -304847 -267905 -130276 -97681 -20852 -245359 103970 179724 -159249 144435 127478
19313 127478 -54502 -46783 217761 -160377 280980 176851 117488 -236036 280802 -401171
19302 298437 -249455 -329969 48666 263 111717 82259 21902 -147477 -176132 119999 83130
19291 83130 -48864 -387466 149913 64329 25532 -137077 124448 -20105 195723 -187019
19280 -7986 -83408 243531 170711 -36283 133687 34739 15740 -34449 -162094 -79758 282139
19268 59594 -147068 -137413 187405 -64127 -257921 -217908 147016 121996 -42016 -297702 112304
19256 -263123 -294681 -296512 -279101 -426618 -276683 -23123 206722 -393989 5140 -105278 -112440
19245 -112440 -143190 -158435 5805 176766 -136817 -100498 19536 -307569 84646 -270857 88543
$$ packed form
19323c04847L6942a30276L2595b0852k24507A03970P5754a59249A44435j6957
19313A27478e4502P719B17761a60377B80980j04129n9363b36036B80802d01171
19302B98437b49455q0514D8666B63J11454k9458B1902a47477k8655A19999l6869
19291H3130d8864l38602A49913F4329B5532a37077A24448b0105A95723a87019
19280g986p5422B43531p2820c6283A33687C4739A5740c4449j27645g9758B82139
19268E9594a47068R655A87405f4127j93794M0013A47016k5020d2016k55686A12304
19256b63123l1558j831J7411j47517J49935b3123B06722c93989E140a05278p162
19245a12440l0750j5245E805J70961a36817L6319A9536c07569H4646b70857H8543
$$ plain form
19233 195318 -237823 -60602 52383 -243818 -146629 -127251 25614 -92591 -132570 -296428 -71063
19221 -107576 -285600 -201926 220057 9415 82756 -559988 96964 -233951 -279959 -267271 -107760
19209 249910 12100 383538 -152891 30938 -199569 -40701 -38724 91098 -231468 -343186 22782
19197 -255577 46440 83684 -388737 78817 38346 -86664 -358657 -196557 -141171 -84387 -501383
19186 -501383 -366448 -347300 259721 -261564 -74234 12401 -197911 257207 -338273 -357626
19176 -357626 -7874 94484 -360182 227628 -26547 -255339 587 117363 -144483 -190405 -129201
19165 -129201 23309 328352 128016 91857 -41007 -301647 -173250 -310081 136488 117870
19155 117870 -58576 -52538 14565 16141 251996 366664 -133806 129640 269662 191603 22266
$$ packed form
19233A95318b37823f0602E2383b43818R7189J9378B5614i2591l9979j63858g1063
19221a07576j78024Q3674B20057I415P3341e59988I6964b33951m6008J2688a07760
19209B49910A2100L71438a52891C0938a99569d0701J977I1098b31468j11718B2782
19197b55577D6440L7244c88737G8817C8346h6664k71993J62100N5386N6784m16996
19186e01383J34935J9148B59721b61564g4234A2401a97911B57207c38273j9353
19176c57626g874I4484c60182B27628b6547k28792E87J16776a44483m5922O1204
19165a29201B3309L05043A28016l6159d1007k60640J28397j36831A36488j8618
19155A17870e8576O038A4565J576K35855J14668a33806A29640J40022p8059B2266
$$ plain form
19143 -49940 -232373 -289951 -105436 81923 -111766 -126280 31993 -88011 -55926 -128283 -119386
19132 -119386 -156593 -142752 182989 -165569 -360930 45229 -130051 534814 -10009 -259900
19122 -259900 -96129 249412 220713 -93406 -117149 175506 -189180 -140951 -291494 192624
19111 -53392 20021 -97018 16218 23062 20254 -97053 -58552 -151384 165302 -58502 -311756 -46119
19098 -101846 -340903 86502 36283 -1958 71598 -205650 -264530 -166894 150071 -505356 -462664
19087 -462664 153991 10281 -141106 -357360 140782 192991 -58582 -71762 142273 -57873
19076 -111895 -215846 -231432 -245978 -162322 -119375 93372 154600 -94883 187905 81416 17587
19064 170181 65605 140084 -214700 -54320 -103500 -594126 -217805 76780 130384 -13899 -245491
$$ packed form
19143d9940j82433n7578a05436H1923a11766j4514C1993h8011L2085p2357Q897
19132a19386l7207J3841A82989a65569j95361D5229a30051E34814a0009k49891
19122b59900i6129B49412k8699i3406k3743A75506a89180M8229j50543A92624
19111e3392B0021i7018A6218O844k808i7053L8501r2832A65302e8502k53254d6119
19098a01846k39057H6502C6283a958G1598b05650n8880R7636A50071e05356M2692
19087d62664A53991A0281a41106k16254A40782N2209e8582j3180A42273e7873
19076a11895j03951j5586j4546Q3656M2947I3372O1228i4883A87905H1416A7587
19064A70181F5605P4479b14700e4320m9180m90626b17805G6780N3604a3899k31592
$$ plain form
19053 -245491 64065 -72054 9124 -89414 -100212 103936 -114798 15780 -79212 202348 -141496
19041 162123 37607 41835 -148886 202478 -204603 24654 -85690 -241738 275119 132275
19030 -171605 209023 -172557 96890 -356915 -46307 37923 -95558 -171741 76916 8181 129679
19019 129679 -120766 95578 339299 -172324 -462593 -143972 -348966 -10912 -187515 -252793
19009 -252793 -126267 -24973 71232 -317476 -104589 100494 123985 -162814 -386100 -187861
18998 -156336 -200841 31292 268526 25136 -35445 -54152 6968 29916 176768 188039 -171112
18986 -3324 47107 -272161 -267934 43922 76746 -169473 -254998 -104692 -215866 -258705 -80267
18974 96036 245121 23677 -118110 633221 607391 10825 -21634 95417 124154 -110537 68726
$$ packed form
19053b45491F4065g2054I124h9414j0798A03936a14798A5780g9212B02348a41496
19041A62123C7607M228a48886B02478b04603B4654h5690j56048B75119A32275
19030a71605B09023a72557I6890c56915d6307C7923i5558p6183G6916H181J21498
19019A29679a20766I5578K43721a72324k90269a43972k04994a0912j76603o5278
19009b52793a26267b4973G1232c17476a04589A00494K3491a62814k23286a87861
18998a56336m4505C1292K37234B5136c5445j8707F968K2948J46852J1271a71112
18986c324D7107b72161M227D3922L2824a69473q5525a04692j11174m2839h0267
18974I6036J49085B3677a18110F33221k5830A0825b1634I5417K8737a10537F8726
$$ plain form
18962 -135100 -36678 -226009 -133775 -262720 -232238 -208601 -249568 -116105 108191 -567208
18951 -25581 -170096 280984 287432 -251014 -95277 29622 -394547 9345 138328 -318108 218760
18939 -99167 71423 -10643 232885 -39647 122710 -18025 10331 162200 230859 -297645 355464
18927 10496 34092 -323820 179802 410464 10035 -352260 -89242 -378869 -164565 -119145
18917 -119145 -12258 -75650 105131 3115 15321 89011 -15545 -164911 248119 8054 353109
18906 353109 380957 184860 -73056 279245 -5206 -19593 77808 146076 -590248 -226848 -40476
18894 127135 -86999 -206514 80527 -21095 -91938 123759 -83288 -52385 -5877 -507798 -138657
18882 214666 -111148 -2220 -362 2585 -185133 -224718 53170 -91681 -311891 51365 -116551
$$ packed form
18962a35100c6678j89331R2234j28945L0482K3637m0967a16105A08191e67208
18951b5581j44515B80984O448b51014i5277B9622c94547I345J28983c18108B18760
18939i9167G1423a0643B32885c9647A22710a8025A0331J51869O8659b97645C55464
18927A0496K3596c23820A79802K30662A0035c52260h9242k89627a64565M5420
18917a19145a2258o3392A05131C115J2206P3690a5545j49366B48119H054L45055
18906C53109K7848A84860g3056B79245e206j4387G7808O8268e90248b26848d0476
18894A27135h6999j19515H0527b1095p0843A23759h3288L0903e877n01921a38657
18882B14666a11148b220c62B585a85133l9585E3170i1681k20210E1365a16551
$$ plain form
18870 -11683 -412307 139575 51648 199612 -175548 228240 -126525 11071 166126 143105
18860 143105 109993 -26607 145102 -82940 -86518 -446091 -234706 -100686 -146082 -172818 -20976
18848 39827 104590 -69209 -149375 293191 -96268 -186100 64441 -235034 -76619 118031 34955
18836 101544 -92437 -19984 308296 24049 -25334 42314 112581 -325513 -117514 -234564 -25767
18824 78646 -168323 -16362 42212 -93634 328335 88762 77310 341360 146275 -255428 -155273
18813 -155273 -294137 -58793 -213835 281323 -35496 178957 274811 153362 -93327 106179
18802 -96501 -630461 -313434 -308864 -392909 -364186 -142932 -396650 -200209 -220257 232320 126613
18791 126613 -155548 -82849 -57375 -237188 44953 153816 302100 56525 -151349 -1811 -386272
$$ packed form
18870a1683m00624A39575E1648J47964a75548B28240a26525A1071J55055k3021
18860A43105l3112b6607A45102h2940l578l59573K11385a00686m5396k6736b0976
18848C9827O4763f9209q0166B93191i6268q9832F4441b35034g6619A18031C4955
18836A01544i2437a9984C08296B4049b5334D2314P0267c25513a17514j17050b5767
18824G8646a68323a6362D2212i3634C28335H8762j1452K64050A46275b55428J00155
18813a55273j38864e8793j55042B81323c5496A78957R5854j21449i3327A06179
18802i6501n33960c13434M570q4045K8723a42932k53718J96441k0048B32320j05707
18791A26613a55548P2699K5474j79813D4953J08863J48284E6525a51349a811l84461
$$ plain form
18780 -386272 -80700 87321 -136754 -189315 -60269 -1588 -301349 -120343 -232773 38190 -137447
18768 -81783 -31702 -67201 -71218 307906 -260725 69591 127855 -178274 -55539 168232 -3548
18756 -15426 27758 -33471 -359746 20696 14002 57323 109107 -75593 -35624 -171437 35434
18744 197699 216008 -521643 -193830 -50332 -453820 -175073 -1759 75603 -200 191774 492
18732 -259223 154106 -78782 -58450 -124282 -54256 228333 123577 -251164 -406400 336535
18721 -74069 -175664 -186906 -78084 10920 -49886 148367 -235264 -61410 -77181 -161021 81881
18709 -9469 -271759 128016 -42373 -224840 -151594 -110795 3755 31663 -1120 -148504 -180926
18698 -180926 67004 21226 134332 108019 -319100 47085 -86524 -239811 -245007 84366 -13396
$$ packed form
18780c86272h0700H7321a36754n2561f0269a588k99761a20343j12430C8190a37447
18768h1783c1702l5499m017C07906b60725F9591N8264a78274e5539A68232c548
18756a5426B7758c3471l26275B0696o694M3321N1784g5593c5624j35813C5434
18744A97699J8309e21643a93830e0332m03488a75073a759G5603b00A91774D92
18732b59223A54106g8782K0332o5832e4256B28333j04756b51164j55236C36535
18721g4069j01595j1242g8084A0920d9886A48367b35264f1410j5771q3840H1881
18709i469k62290A28016d2373j82467P3246M0799C755K7908a120j47384l2422
18698a80926F7004B1226J13106k6313c19100D7085h6524j53287n196H4366a3396
$$ plain form
18686 -371624 -28836 57050 63005 -39805 61241 290671 44279 -94647 280797 131133 -262912
18674 -55807 43716 154790 -230810 -372270 -69259 -389088 145456 -218507 -56244 290781
18663 348054 12342 57234 -38036 25022 -146543 135928 -296574 -163031 -309035 -151151
18652 135839 73125 -17568 -64044 83179 -259463 -282059 -253935 66865 82951 -104297 -186155
18641 -186155 351550 49657 -116946 12307 98444 -177604 -83927 -39615 40804 -75991 -129535
18630 -129535 45615 -88244 -246676 -36857 135613 -200342 36948 -60974 149903 203582 32700
18618 128194 103357 127627 26406 -32153 -43360 240926 -94532 -19405 143932 -83988 128048
18606 76885 -229945 101382 63776 -130455 -68073 102081 56021 1751 216461 -289694 -246004
$$ packed form
18686c71624b8836E7050N955c9805F1241K29430D4279i4647B80797A31133b62912
18674e5807D3716J11074b30810j41460f9259l19829A45456b18507e6244B90781
18663C48054A2342M4892c8036B5022a46543A35928b96574J33543j46004a51151
18652A35839o2714a7568m6476H3179b59463k2596K8124F6865J6086a04297q1858
18641a86155C51550D9657a16946A2307Q6137a77604h3927c9615D0804g5991n3544
18630a29535D5615h8244j58432c6857A35613b00342C6948f0974A49903N3679C2700
18618A28194k4837K4270B6406c2153j1207B40926i4532a9405A43932h3988A28048
18606G6885b29945A01382l7606a30455O2382A02081m6060A751K14710b89694M3690
$$ plain form
18595 -246004 -198563 -1865 86935 -246930 -32894 53139 -294119 -402101 395605 -65437 -120748
18584 -120748 -117580 56486 94333 -144936 176486 -86176 73947 -231876 159458 -364373 -338712
18573 -338712 -182273 177129 -33436 -265585 -111233 -11222 151285 -76572 -193164 -125528
18563 -125528 -305227 -271823 62640 -194602 -165887 -272013 -113241 -85032 -289714 -33827
18552 -113793 -225709 -232182 177432 235357 57909 95945 -342916 -548434 205539 -96471 117516
18540 -236434 36557 -320233 151081 -329568 75350 -69491 -187327 -204560 -23790 -123820
18530 -123820 -146663 41819 -218705 -21338 -151413 -60775 -100454 -63251 119478 -8624 -119738
18519 -119738 95198 35404 161942 -103751 193714 -186980 204005 11057 -68418 -126179
$$ packed form
18595b46004M7441a865H6935b46930c2894E3139b94119j07982C95605f5437n5311
18584a20748L168E6486L7847a44936A76486h6176G3947b31876A59458c64373K5661
18573c38712J56439A77129c3436k32149a11233a1222A51285g6572j16592O7636
18563a25528j79699L3404F2640a94602K8715j06126a13241K8209k04682c3827
18552a13793j11916o473A77432N7925E7909L8036c42916k05518B05539i6471A17516
18540b36434C6557c20233A51081c29568G5350f9491j17836j7233b3790j00030
18530a23820k2843D1819b18705b1338j30075f0775l9679L7203A19478h624j11114
18519a19738I5198C5404J26538a03751A93714a86980B04005A1057f8418n7761
$$ plain form
18509 -126179 -385486 -105039 -52058 112462 -74030 164324 79882 83427 54091 -6515 -199579
18498 -199579 -168685 21507 -221659 292064 -146616 117658 266183 54412 -252114 107631
18487 181843 -258323 -108345 -171363 -158693 168072 -256104 -74194 -238137 261439 -50541
18476 -173014 14945 -109496 -139242 121363 -183107 141787 -479054 167266 -454487 86485
18465 622887 56312 -59344 249523 -178122 -206219 201167 -220804 125865 -207343 -33374
18454 115461 -248802 -109072 192808 149359 -117446 -346569 -194225 -271269 156844 -314659
18443 -253052 193862 -158345 -12627 53207 -86072 -11572 26899 48428 -171048 116335 -11324
18431 -18286 55526 12920 109881 113512 153327 -112274 -78503 -62990 278215 -386110 -312275
$$ packed form
18509a26179k59307a05039e2058A12462g4030A64324G9882L545k9336f515j93064
18498a99579L0894B1507b21659B92064a46616A17658J48525E4412b52114A07631
18487A81843b58323a08345o3018J2670A68072b56104g4194j63943B61439e0541
18476a73014A4945a09496k9746A21363a83107A41787d79054A67266d54487H6485
18465F22887E6312e9344B49523a78122k8097B01167b20804A25865b07343c3374
18454A15461b48802a09072A92808m3449a17446k29123J52344p7044A56844c14659
18443b53052A93862a58345a2627E3207h6072a1572B6899K1529a71048A16335a1324
18431a8286E5526A2920R6961L631L9815a12274L3771J5513B78215c86110P3835
$$ plain form
18420 -312275 8354 143766 28090 27604 206668 -21525 -289687 -62121 62712 163596 67366
18408 -69297 205329 -58175 -37605 -60705 -255780 -162459 -66897 -70729 -67204 208840 203718 -82340
18395 -47930 88298 -146880 226585 -110032 -9864 -93082 -217020 -25759 -360173 66282 -122497
18383 -128246 177821 58730 -25987 -72257 80669 34907 100709 -151217 53537 -7300 -303172
18372 -303172 122557 152287 108361 -71312 199199 165467 -231207 50828 -143707 -58257 3347
18360 -179404 109236 34815 6802 -247283 -250730 22419 -49357 -22767 140433 129933 24080
18348 -306973 92405 -105367 -342429 188178 -345404 -78046 -96973 -144308 -78242 8344 -108740
18336 76976 -198082 -57922 -113871 -24722 75618 -120915 106662 271323 -148546 -97486 330917
$$ packed form
18420c12275H354J35412B8090m86J79064b1525k68162f2121F2712J00884F7366
18408f9297B05329e8175K0570k3100j95075R3321f6897l832L525B08840n122h2340
18395d7930H8298a46880B26585a10032i864q3218j23938b5759l34414F6282a22497
18383a28246A77821E8730b5987m6270H0669C4907O5802a51217E3537g300k95872
18372c03172A22557K9730m3926g1312A99199l3732b31207E0828a43707e8257C347
18360a79404A09236C4815F802b47283l447B2419d9357b2767A40433j0500B4080
18348c06973I2405a05367k37062A88178c45404g8046j8927m7335O6066H344a08740
18336G6976a98082e7922n5949b4722G5618a20915A06662J64661a48546N1060C30917
$$ plain form
18324 -27810 -126299 -13992 47210 7132 -34621 59828 -167039 20938 198732 168856 169210 46773
18311 233275 -147796 -23502 7040 -210129 -52982 -206840 -142449 -100297 145048 -183033 74360
18299 -115653 -168767 168700 -80459 6030 -204809 51628 -87405 -236163 165884 262261 -39133
18287 -120390 135001 -176956 245341 -488542 194556 -79713 -58390 -257354 -56100 93517
18276 49746 -313147 -116942 39304 -10881 -340884 -59163 53396 -350948 -113336 194615
18265 -1474 384000 -10120 -138272 -75832 95252 -18043 -150117 -53939 249340 -48830 -71619
18254 -71619 341137 -119906 133522 109009 38593 21363 -169650 -257104 -156656 -87928 -52819
18243 -52819 -223875 -298281 101752 199921 -406837 -112270 103498 166918 82848 1133 -281857
$$ packed form
18324b7810r8489a3992D7210G132c4621E9828a67039B0938J77794k9876L54D6773
18311B33275a47796b3502G040b10129e2982j53858O4391M2152A45048a83033G4360
18299a15653n3114A68700h0459F030b04809E1628h7405j48758A65884R6377c9133
18287a20390A35001a76956B45341d88542A94556g9713K1323j98964e6100I3517
18276D9746c13147a16942C9304a0881l30003e9163E3396c50948a13336A94615
18265a474C84000a0120j28152O2440I5252a8043j32074e3939B49340d8830k2789
18254g1619C41137a19906A33522k4513C8593j7230a69650q7454J00448O8728L5109
18243e2819j71056p4406A01752R8169d06837a12270A03498O3420H2848A133b81857
$$ plain form
18231 94062 83586 170340 194074 14673 225634 2512 -66441 -25512 116099 253738 3976
18219 -83298 8891 25331 -74503 -78767 27379 -176635 127484 60519 -106697 -241582 -38060
18207 172261 -44543 171798 36623 85175 -234750 -130640 149278 -141767 177229 -210439
18196 181999 -159028 -259701 11584 -69862 156698 -19408 125729 6160 -23111 -160355 -25178
18184 -26664 24828 234069 33442 -200384 -6911 2285 330251 35999 -42151 -387406 150148
18172 -351485 111719 24599 -221300 -43455 80691 -33929 -169448 -64820 -365899 -180530
18161 -233484 -68465 152762 -396109 -332308 126366 -274815 -94486 103167 108330 -84908 -75176
18150 -75176 342330 -113591 -304066 137745 238964 189019 -52007 10147 -204714 231629
$$ packed form
18231I4062j0476Q6754K3734A4673K10961B512f6441b5512A16099J37639C976
18219h3298H891J6440g4503m264B7379a76635A27484F0519a06697j34885c8060
18207A72261d4543A71798C6623M8552b34750J04110A49278a41767A77229b10439
18196A81999a59028j00673A1584f9862A56698a9408A25729F160b3111j37244b5178
18184b6664B4828K09241C3442b00384f911B285L27966C5999d2151l45255A50148
18172c51485A11719B4599b21300d3455H0691c3929j35519f4820l01079a80530
18161b33484f8465A52762c96109O3801A26366b74815i4486A03167N163h4908R732
18150g5176C42330a13591j90475A37745J01219m9945e2007A0147b04714B31629
$$ plain form
18139 -61827 201056 -296732 -262948 122215 -146209 -189210 -22645 -93391 124331 -9811 -6156
18128 -6156 117210 56211 177790 -175644 48374 -403764 -53750 -147519 302548 323297 -90510
18116 84062 24981 -67415 115222 120649 -183448 114672 48409 85012 218004 390654 299394
18105 299394 -12162 -29210 -21220 -217519 -146329 -121768 -192833 31456 81988 -82500 256662
18093 53134 -255231 -73359 -284663 -115622 -415186 -16589 329846 548111 72151 91193
18083 91193 92834 -5451 31017 322543 -5329 -135767 146774 10590 114965 -286347 -336379
18072 -336379 -277906 -124086 90712 244635 348027 -26361 31952 -103417 -52895 -6992 -21681
18061 -21681 11904 -206339 -295221 -143134 -68488 21229 7178 -169716 78477 275775 198886
$$ packed form
18139f1827B01056b96732L3784A22215a46209m3001b2645p0746A24331i811L655
18128f156A17210E6211J21579a75644D8374d03764e3750r3769C02548K0749i0510
18116H4062B4981f7415A15222N427a83448A14672D8409L6603J32992J72650r1260
18105B99394a2162j7048P990j96299P1190K4561p1065C1456N0532h2500B56662
18093E3134b55231g3359k11304a15622k99564a6589C29846K18265G2151J9042
18083I1193J641e451C1017K91526e329j30438A46774A0590J04375b86347n0032
18072c36379N8473a24086I0712J53923J03392b6361C1952a03417N0522f992j4689
18061b1681A1904b06339q8882a43134f8488B1229G178a69716G8477J97298p6889
$$ plain form
18050 198886 311394 335959 -246776 109517 -16829 -160672 188380 -164476 -100371 35634
18039 -39612 -58410 -140778 23698 -25027 -196386 3840 213165 75351 168092 53532 -181444
18027 70564 -47811 58231 156499 -154738 -65996 10522 -77642 384962 -66317 123064 -8219
18015 258426 92204 -124714 -115446 -42300 -56219 35631 -155411 -348309 311849 -191405 -171258
18004 -171258 -99314 83426 67722 316507 117204 -69316 -10704 389367 408407 -198499 198513
17992 52643 -58123 -180124 -104900 379328 -126513 278385 157119 41777 -36573 -227192
17982 -227192 -182103 -32230 88640 89414 84070 -134450 -68117 -60029 52191 125661 107597 194104
17970 194104 -114736 -155531 -93712 -57144 156436 -48185 169322 151897 37987 141527 -129955
$$ packed form
18050A98886J12508K4565b46776A09517a6829j43843A88380a64476O4105C5634
18039c9612j8798q2368B3698b5027j71359C840K09325G5351R2741E3532a81444
18027G0564d7811E8231R8268a54738f5996A0522g7642C84962f6317A23064h219
18015B58426I2204a24714R268d2300j3919C5631a55411j92898C11849a91405K0147
18004a71258P1944H3426j5704K48785A17204f9316a0704C89367J9040a98499A98513
17992E2643e8123j22001P5224C79328a26513B78385j21266D1777c6573j90619
17982b27192M5089c2230H8640P74n344a34450O6333Q088E2191P3470j8064Q6507
17970A94104a14736m0795O1819L6568A56436d8185A69322j7425C7987J03540a29955
$$ plain form
17958 79661 150376 -217029 327700 195046 -200397 225239 -146313 -226448 83507 -6142 -51710
17947 -51710 -122654 152458 131339 45345 -81289 97101 -231097 -156874 113861 67259 -255253
17935 -77836 46979 214827 -94594 -116830 -21399 -162412 -184416 -212700 345408 -135679 188309
17923 13988 208338 138677 82798 -115472 167881 -75591 130949 258354 -46313 -105913 -68160
17912 -68160 176803 -2883 -261314 448450 -249889 -240111 -99691 -9731 77817 -60704 98119
17900 215814 31347 68097 -84678 -18122 -178358 -7561 -38402 -339434 -38750 -44740 4955 144833
17888 144833 62839 -2775 -32463 6518 208002 133556 -145314 16470 -53794 -115052 -347017
17877 -347017 -338690 -334482 -145302 347128 -191860 -26169 81584 -96192 -70481 31300 115894
$$ packed form
17958G9661P0715b17029C27700j32654b00397B25239a46313q0135H3507f142m5568
17947e1710p0944A52458k1119D5345h1289I7101b31097P4223A13861m6602b55253
17935g7836D6979J67848i4594k2236b1399j41013k2004k8284C45408a35679A88309
17923A3988J94350o9661n5879a15472A67881g5591A30949J27405d6313n9600L7753
17912f8160A76803b883k58431D48450b49889R778i9691i731G7817f0704I8119
17900B15814C1347L6750h4678a8122j60236g561l0841l01032c8750n990D955J39878
17888A44833F2839b775k9688F518K01484p4446a45314A6470e3794o1258k31965
17877c47017Q327M208a45302C47128a91860b6169H1584i6192K5711C1300Q4594
$$ plain form
17866 115894 201024 -85369 160554 412317 -141829 226903 152057 -152733 -35716 113659
17855 63243 159612 273332 330927 -243668 3310 202794 21377 242754 146946 -65615 382402
17843 -8130 269423 140161 -19008 -5946 76206 -11696 23816 372929 -263343 127442 -116903
17831 -364069 23059 21866 75354 355589 -283560 106866 34409 144474 30581 278910 -394829
17819 -28102 -246380 138852 -101494 -102146 3611 262289 187203 294533 23266 205563 -45537
17807 -3171 -90617 234217 -139507 187710 200041 -267891 138555 -45648 -31358 106827 181341
17796 181341 -159330 -204925 159187 136668 -274290 -238894 -17838 -170618 106210 146101
17786 146101 -148223 385200 243209 -41677 54276 129177 -73162 -257452 -224241 63005 -32355
$$ packed form
17866A15894Q5130h5369A60554K51763a41829B26903p4846a52733c5716A13659
17855F3243R6369J13720N7595b43668C310J99484B1377K21377r5808f5615C82402
17843h130B69423j29262a9008e946G6206a1696B3816L49113b63343A27442a16903
17831c64069B3059j193N3488K80235b83560A06866C4409J10065C0581K48329c94829
17819b8102k18278A38852a01494o52C611K58678p5086J07330B3266J82297d5537
17807c171q7446B34217a39507A87710J2331b67891A38555d5648J4290A06827P4514
17796A81341a59330m5595A59187k2519b74290L5396a7838j52780A06210L9891
17786A46101a48223C85200j41991d1677E4276P4901g3162j84290L3211F3005c2355
$$ plain form
17774 199972 371323 136009 107448 68843 102407 186402 387750 162383 30147 122858 270517
17763 270517 29071 180369 98632 143326 -241052 12704 98529 110128 -23933 -56750 -166341
17752 -166341 -41676 264636 65731 -34881 85390 120347 51939 271653 240334 -51640 -100553
17741 -100553 -2096 264264 155300 334602 69882 -204593 -196014 -76356 -156650 -3888 8156
17729 -28357 65644 -10459 71792 -241442 82132 54083 -1025 158715 -167189 137181 -43891
17717 80084 272447 218498 -283810 186178 225642 -140535 106620 558331 -262501 -62830
17706 -19209 -33797 103701 111036 -96819 262776 -213329 42286 -101731 436843 -35291 272287
17694 -78649 164554 367951 113616 -314571 -269943 132521 432616 -161400 231110 164168
$$ packed form
17774A99972J71351A36009k8561l8605L3564Q3995K01348A62383C0147R2711J47659
17763B70517B9071J51298q1737M4694b41052A2704Q5825J1599b3933l2817j09591
17752a66341d1676B64636F5731c4881H5390L4957E1939K19714l1319e1640m8913
17741a00553b096B64264j08964J79302F9882b04593Q579g6356q0294c888H156
17729b8357F5644a0459G1792b41442H2132k8049a025A58715a67189A37181d3891
17717H0084J92363n3949b83810A86178L9464a40535A06620M51711b62501f2830
17706a9209j4588A03701P335i6819B62776b13329D2286a01731D36843c5291B72287
17694g8649A64554K03397A13616c14571M4628A32521L00095a61400B31110o6942
$$ plain form
17684 164168 152718 206162 163039 131755 -89669 89704 197891 -29101 -205049 49134 21527
17672 111431 -125142 -23391 58770 -140909 25069 256077 -189756 -103885 316304 80034
17661 77383 -280050 -63882 282936 416099 350097 -67830 31966 -21815 183154 7613 43114
17650 43114 -47685 -65740 -74415 -159770 99211 254073 2171 -218079 200094 43576 355408
17639 355408 3072 52517 113595 182936 -111101 39402 159376 104744 -47318 -25989 -37134
17628 -37134 341237 211679 -318784 156967 -34410 289429 41234 49483 116532 54259 373165
17617 373165 78523 -203433 67290 44099 -91929 -148503 -221273 104791 558529 87002 -17305
17605 -34751 -322209 197219 134505 53346 20279 118666 -197363 -16968 47044 -42826 156085
$$ packed form
17684A64168j1450N3444m3123l1284h9669H9704J08187b9101j75948D9134B1527
17672A11431a25142b3391E8770a40909B5069K31008a89756Q5871C16304H0034
17661G7383b80050f3882B82936J33163o6002f7830C1966b1815A83154G613L5501
17650D3114d7685j8055q675q5355I9211J54862B171b18079B00094D3576L11832
17639C55408C072M9445O1078O9341a11101C9402J19974n4632d7318K1329j1145
17628c7134C41237j29558c18784A56967c4410B89429D1234Q249O7049E4259L18906
17617C73165G8523b03433F7290k3191i1929n6574p2770A04791M53738H7002a7305
17605c4751k87458A97219o2714E3346B0279R8387a97363a6968D7044d2826A56085
$$ plain form
17593 128261 354555 -284347 465823 131980 -264839 173251 23837 -238754 86553 175392
17583 175392 -55374 132432 100960 111143 16546 191022 37683 40436 -70837 -83435 -14509
17571 293365 -26251 18931 345864 101344 -222163 99190 -114269 -196415 70237 -65618 36036
17559 158652 -42217 261702 -100976 -169485 60881 110416 208965 -162628 75502 398280 138179
17547 462628 113161 139450 359704 394611 -90544 121515 37523 83980 163048 356299 120064
17535 -130690 103753 99222 478819 194883 159510 193991 369760 258635 331333 293806 639400
17524 639400 963414 1032980 952017 562054 541792 810907 467340 438971 373237 745190
17514 745190 284075 379870 297057 28057 417799 965307 708704 896679 845631 215653
$$ packed form
17593A28261K26294b84347D65823A31980b64839A73251B3837b38754H6553Q8839
17583A75392e5374A32432l1472J0183A6546J74476C7683K753g0837j2598a4509
17571B93365b6251A8931L26933A01344b22163I9190a14269q2146G0237f5618C6036
17559A58652d2217B61702a00976o8509F0881M9535R8549a62628G5502L22778A38179
17547D62628A13161K6289K20254L4907i0544A21515C7523M6457P9068J93251A20064
17535a30690A03753m531L79597A94883l5373L4481J75769j11125P2698l7527L45594
17524F39400L24014O9566q0963l89963k0262K69115l43567k8369o5734L71953
17514G45190B84075R5795q2813B8057L89742N47508k56603J87975n1048B15653
$$ plain form
17503 220654 242292 325991 331957 69301 502713 523816 207113 601022 227202 42816 461029
17492 461029 232579 172450 353505 359267 432226 -25098 201476 225476 510320 37951 382461
17481 382461 464018 204717 192605 90414 458723 259633 201685 285629 297716 197612 210547
17470 210547 259352 223181 500135 472190 197385 341045 160189 273564 403944 441162
17460 441162 343734 263934 187083 256993 97190 165585 199319 113488 182650 175482 110120 432642
17448 432642 101193 324068 243813 155312 665898 294904 221112 497878 203657 506667
17438 506667 445265 387744 353665 503730 598725 266883 85875 448904 468999 670909 348965
17427 348965 572479 270312 485131 495864 271630 194464 455054 253731 475544 387094
$$ packed form
17503B20654K1638Q3699N966F9301M33412K1103B07113L93909B27202D2816M18213
17492D61029k28450o0129J81055N762P2959b5098B01476K4000K84844C7951L44510
17481C82461Q1557B04717j2112I0414L68309j99090n7948Q3944J2087j00104J2935
17470B10547M8805l6171K76954k7945A97385J43660A60189J13375J30380L7218
17460D41162r7428p9800p6851O9910I7190O8395L3734q5831O9162p168o5362L22522
17448D32642A01193K22875q0255q8501N10586B94904p3792K76766B03657L03010
17438E06667o1402n7521l4079J50065R4995B66883H5875L63029K0095K01910l21944
17427C48965K23514B70312K14819J0733k24234p7166K60590k01323K21813q8450
$$ plain form
17417 387094 339690 257570 464170 337020 185857 803185 415376 456605 266392 315313
17407 315313 88933 30018 1133 270893 139515 247749 292613 143281 406972 -82076 203783
17395 369793 217431 -134846 309893 443654 50876 -9208 290702 184420 172640 276122
17385 276122 366815 158108 165345 414486 -65716 368351 278175 388504 49149 123702 240861
17374 240861 74219 151130 106754 117023 48978 -67157 223160 456135 465272 271096 -32553
17362 372668 -30851 559678 251974 126073 34351 80810 362352 264732 231563 372821
17352 372821 172557 -224360 -75519 436592 128858 65223 397340 122300 383392 32286
17341 -86975 326300 155295 30845 66236 37842 -23322 154811 380179 159939 74166 -204099
$$ packed form
17417C87094m7404q2120K06600j27150j51163O17328l87809M1229j90213M8921
17407C15313H8933C0018A133K69760j31378J08234M4864A43281K63691h2076B03783
17395C69793j52362a34846C09893J33761E0876i208B90702j06282j1780J03482
17385B76122R0693A58108P237K49141f5716C68351r0176J10329D9149P4553J17159
17374B40861G4219P6911m4376J0269D8978f7157B23160K32975R137j94176c2553
17362C72668c0851E59678B51974j25901C4351M6459K81542r7620l3169J41258
17352C72821A72557b24360g5519D36592A28858o3635L32117A22300K61092C2286
17341h6975C26300A55295C0845L5391k8394b3322A54811K25368A59939G4166b04099
$$ plain form
17329 -42982 280683 564272 345304 395807 157138 -5836 154728 -2519 278144 185014 -12337
17317 375319 37929 470331 22122 416619 408832 135715 43199 565000 341718 267760 193198
17306 193198 190298 369830 213937 205674 495989 2903 364197 200682 261505 202430 146986
17295 146986 274545 57830 79334 203224 476452 385029 328571 260070 181572 447879 482904
17284 482904 245655 314016 186464 131813 114993 94429 133516 72287 593189 268350 50037
17272 236297 422420 611327 176974 508249 209905 227335 319179 -9725 112621 465379
17262 465379 324925 241292 82473 327213 97444 203841 287983 202408 162739 443502 377418
17251 377418 -86424 -90894 288396 419183 56578 303140 -21922 72435 285941 764530 105702
$$ packed form
17329d2982B80683K83589k18968N0503A57138e836A54728b519B78144r3130a2337
17317C75319C7929M32402B2122L94497p787A35715D3199N21801k23282p3958p4562
17306A93198k900J79532j55893q263K90315B903L61294j63515O0823n9075n5444
17295A46986J27559E7830K1504J23890K73228r1423n6458o8501p8498K66307L5025
17284D82904k37249O8361j27552n4651j6820k0564L9087o1229N20902B68350E0037
17272B36297J86123J88907A76974L31275B09905J7430R1844i725A12621L52758
17262D65379j40454q3633H2473K44740I7444J06397Q4142q5575l9669K80763o6084
17251C77418h6424m470B88396J30787E6578K46562b1922G2435K13506M78589A05702
$$ plain form
17239 -20645 333761 61684 -18852 723 189574 194943 162096 273783 19639 429354 226539
17228 226539 594427 233927 -213543 315842 311602 360606 126985 445852 446084 359112 337339
17217 337339 369481 296956 353485 559568 426301 38813 424147 264939 322129 337991 154760
17205 239296 416769 476401 396162 72612 327817 304665 -25831 372440 280109 490726 529632
17194 529632 443416 450233 561937 478612 300803 157312 340659 385606 218482 225042 471964
17183 471964 388557 219142 468348 514218 269006 572615 618504 509480 278743 326469
17173 326469 465315 592846 345401 20084 639646 458270 144952 605952 236601 560099
17163 560099 652680 445467 558638 480966 523580 247944 159290 664021 658611 672191 810963
$$ packed form
17239b0645C33761F1684a8852G23J88851N369l2847J11687A9639M09715k02815
17228B26539L67888B33927b13543C15842m240M9004A26985L18867K32q6972k1773
17217C37339L2142p2525N6529K06083j33267C8813L85334j59208N7190J5862A54760
17205B39296J77473N9632q0239G2612K55205k3152b5831C72440r2331K10617L8906
17194E29632q6216O817J11704q3325j77809j43491J83347M4947j67124O560K46922
17183D71964q3407j69415K49206M5870k45212L03609M5889j09024k30737M7726
17173C26469J38846J27531k47445B0084O19562j81376A44952M61000B36601L23498
17163E60099R2581k07213J13171p7672M2614B47944q8654N04731n410J3580J38772
$$ plain form
17152 810963 475864 92877 401587 622340 792322 366358 477454 579574 424861 417114
17142 417114 462303 345153 540451 505129 548329 439567 477708 823983 371462 962183
17132 962183 867833 620084 411156 593803 661075 1012147 545249 495542 511099 496431
17122 496431 514775 592102 492945 533733 516688 668058 715684 420833 714911 468054 607669
17111 607669 425384 554188 700404 556868 571993 192111 499255 602889 608095 856547
17101 856547 817846 804140 443403 493488 632758 912912 421758 375268 536072 841640
17091 841640 508323 748282 523348 662820 585559 736724 612822 781947 731328 668175
17081 668175 1004196 753574 769039 853868 744182 594554 674935 769539 1010132 605702
$$ packed form
17152H10963l35099I2877L08710K20753J69982C66358J11096J02120j54713p747
17142D17114M5189j17150J95298l5322M3200j08762L8141L46275C71462N90721
17132I62183r4350k47749k08928J82647O7272L51072m66898m9707J5557j4668
17122D96431J8344P7327r9157M0788j7045J51370M7626k94851K94078k46857J39615
17111F07669j82285J28804J46216j43536J5125A92111L07144J03634N206K48452
17101H56547l8701j3706l60737N0085J39270K80154D21758m6490J60804L05568
17091H41640l33317K39959k24934J39472p7261J51165j23902J69125n0619o3153
17081F68175L36021k50622J5465Q4829j09686j49628Q0381R4604K40593m04430
$$ plain form
17071 605702 836333 537190 651199 736539 804252 851307 840544 773121 798655 742075 930179
17060 930179 1080052 490083 651588 852069 937057 822274 1114878 851887 755137 913403
17050 913403 730480 789359 797331 884134 570834 482572 612575 873380 664246 933661
17040 933661 791431 890745 825903 1146662 1020577 953186 746624 576291 952024 950831
17030 950831 830338 797940 1059531 652925 833760 823584 1025939 880246 931652 645319
17020 645319 812618 870460 860379 980693 819738 973984 1022782 822524 901098 815575
17010 815575 890258 1345300 951555 1060605 967255 1019855 952026 969856 1194750 1072223
17000 1072223 1067905 1101712 1412249 1021584 1259941 1235585 1092293 1085832 1048635 1150404 1183869
$$ packed form
17071F05702K30631k99143J14009Q5340O7713M7055j0763o7423K5534n6580J88104
17060I30179J49873D90083J61505K00481Q4988j14783K92604k62991r6750J58266
17050I13403j82923N8879P972Q6803l13300q8262J30003K60805k09134K69415
17040I33661j42230R9314o4842L20759j26085o7391k06562j70333L75733j193
17030I50831j20493l2398K61591m06606J80835j0176K02355j45693N1406k86333
17020F45319J67299N7842j0081J20314j60955J54246M8798k00258P8574q5523
17010H15575P4683M55042l93745J09050r3350N2600o7829J7830K24894j22527
17000A072223m318L3807L10537l90665K38357k4356j43292o461l7197J01769L3465
$$ plain form
16989 1183869 1141563 1378864 977861 1198556 1031630 1250456 1447827 1472947 1521683 1321660
16979 1321660 1362758 923231 1601905 1135399 1147414 1444496 1132199 1530952 1177220 1754644
16969 1754644 1208695 1238655 1353426 1329386 1354876 1469013 1553216 1361818 1423995 1736752
16959 1736752 1263880 1628980 1637096 1528384 1529889 1684472 1152782 1787341 1823549 1782591
16949 1782591 2069489 1673949 1661938 1844777 1866640 1838568 1369589 1836003 1726025 1575009
16939 1575009 2109230 2173813 1952377 2069419 2159662 2081925 1896622 2064150 1817380 2014390
16929 2014390 2235574 2223820 2057347 2078835 2351400 2230216 1983878 2027858 2038080 2384915
16919 2384915 2599302 2356742 2499886 2088767 2131408 2435795 2522767 2535603 2584689 2520501
$$ packed form
16989A183869m2306K37301m01003K20695j66926K18826J97371K5120M8736k00023
16979A321660M1098m39527O78674m66506J2015K97082l12297L98753l53732N77424
16969A754644n45949K9960J14771k4040K5490J14137Q4203j91398O2177L12757
16959A736752m72872L65100Q116j08712J505J54583n31690O34559L6208m0958
16949A782591K86898l95540j2011J82839K1863k8072m68979M66414j09978j51016
16939A575009N34221O4583k21436J17042R0243p7737j85303J67528k46770J97010
16929B014390K21184j1754j66473K1488K72565j21184k46338M3980J0222L46835
16919B384915K14387k42560J43144m11119M2641L04387Q6972J2836M9086o4188
$$ plain form
16909 2520501 2644274 2640062 2619854 2398409 2864089 2361916 2663199 2542945 2810648 2513832
16899 2513832 2947355 2818280 2877982 2815720 3134385 3052583 2866651 2811493 3168201 3226255
16889 3226255 3034088 3131209 2800095 3123574 3231060 3130347 3246063 3667694 3290091 3395434
16879 3395434 3518880 3607902 3730805 3825044 3594396 3713123 3738607 3966955 3728736 4052481
16869 4052481 4329285 3911031 3999608 4384220 4122532 4031377 4256877 4301015 4613894 4423699
16859 4423699 4837301 4594539 4768921 4809515 5197222 5121396 5156251 5076866 5405651 5281014
16849 5281014 5160926 5082334 5256922 5751613 5711157 5691627 5686466 5905060 6087877 6195557
16839 6195557 6220889 6159053 6541769 6506871 6604145 6889910 6889232 7373691 7174863 7194541 6986319
$$ packed form
16909B520501J23773m212k0208k21445M65680n02173L01283j20254K67703k96816
16899B513832M33523j29075N9702o2262L18665q1802j85932n5158L56708N8054
16889C226255j92167R7121l31114L23479J07486j00713J15716M21631l77603J05343
16879C395434J23446Q9022J22903R4239k30648J18727K5484K28348k38219L23745
16869D052481K76804m18254Q8577L84612k61688r1155K25500M4138L12879j90195
16859D423699M13602k42762J74382M0594L87707p5826L4855p9385L28785j24637
16849E281014j20088p8592J74588M94691m0456j9530n161K18594J82817J07680
16839F195557K5332o1836L82716l4898R7274K85765o78M84459j98828J9678k08222
$$ plain form
16828 6986319 7619241 7967143 8120861 8052223 7898799 7996873 8420107 8810140 8823373 8752303
16818 8752303 9040071 9288331 9456787 9433462 9810526 9937504 10226862 10631393 10495003 10755659
16808 10755659 11202412 11487254 11399977 12022267 11717649 12522470 12610413 12932161 13275842 13230033
16798 13230033 14065263 14034619 14713454 14775589 15194120 15553213 15879563 16402477 16831175 16942391
16788 16942391 17918552 18385569 18693789 19044145 19679674 20004977 20497234 21332709 21697749
16779 21697749 22371347 22960974 23484693 24512331 25236574 26406914 26758268 27622512 28574965
16770 28574965 29473986 30198594 31089601 32466349 33050964 34303646 35478979 36670210 38145664
16761 38145664 38927064 40484209 41810726 43163148 44644387 46369129 47925335 49600849
$$ packed form
16828F986319O32922L47902J53718o8638j53424R8074M23234L90033J3233p1070
16818H752303K87768K48260J68456k3325L77064J26978K89358M04531j36390K60656
16808A0755659M46753K84842q7277O22290l04618Q04821Q7943L21748L43681m5809
16798A3230033Q35230l0644O78835O2135M18531L59093L26350N22914M28698J11216
16788A6942391R76161M67017L08220L50356O35529L25303M92257Q35475L65040
16779B1697749O73598N89627N23719J027638P24243J170340L51354Q64244R52453
16770B8574965Q99021P24608Q91007J376748N84615J252682J175333J191231J475454
16761C8145664P81400J557145J326517J352422J481239J724742J556206J675514
$$ plain form
16753 49600849 51198596 52953107 54867856 56693093 58687988 60845404 62685809 65102194
16745 65102194 66998496 69275950 71317256 73648655 76223680 78398947 80658799 82814978
16737 82814978 85198776 87291699 89760313 91520124 93389245 95500499 97258880 98738079
16729 98738079 99952507 101568865 102453242 103097215 103738978 104029549 104129957 103953598 103303721
16720 103303721 103031225 102154925 100890342 99567654 98185795 96561677 95176889 93092263
16712 93092263 91358403 89142042 87047783 84710977 82519770 80276862 77890794 75451473
16704 75451473 73103520 70989277 68569301 66474804 64450285 62415773 60383456 58535760
16696 58535760 56421804 54420705 52672365 50806165 49254228 47644424 45964101 44612806
$$ packed form
16753D9600849J597747J754511J914749J825237J994895K157416J840405K416385
16745F5102194J896302K277454K041306K331399K575025K175267K259852K156179
16737H2814978K383798K092923K468614J759811J869121K111254J758381J479199
16729I8738079J214428J616358Q84377O43973O41763K90571J00408j76359o49877
16720A03303721k72496q76300j264583j322688j381859j624118j384788k084626
16712I3092263j733860k216361k094259k336806k191207k242908k386068k439321
16704G5451473k347953k114243k419976k094497k024519k034512k032317j847696
16696E8535760k113956k001099j748340j866200j551937j609804j680323j351295
$$ plain form
16688 44612806 43030494 41850925 40293006 38929062 37736743 36598216 35202355 34553479
16680 34553479 33101602 31943575 31223185 30339626 29095433 28358237 27608366 26984331 26051689
16671 26051689 25545835 24570419 23476464 23299552 22467719 21852172 21128658 20806000 20258530
16662 20258530 19447645 19021551 18611900 18089383 17809293 17212114 16817262 16302864 15901254
16653 15901254 15571753 15160475 14972999 14656273 14181624 13971181 13523325 13331821 12950150
16644 12950150 12764698 12364326 12221484 12293319 11945001 11570859 11022411 10847624 10331631
16635 10331631 10450370 10406143 10052168 9928375 9585069 9393354 9286770 8932804 8940927 8789348
16625 8789348 8624496 8704253 8428542 8192749 7947154 7840234 7582200 7626900 7560761 7222239
$$ packed form
16688D4612806j582312j179569j557919j363944j192319j138527j395861o48876
16680C4553479j451877j158027p20390q83559j244193p37196p49871o24035r32642
16671B6051689n05854r75416j093955j76912q31833o15547p23514l22658n47470
16662B0258530q10885m26094m09651n22517k80090n97179l94852n14398m01610
16653A5901254l29501m11278j87476l16726m74649k10443m47856j91504l81671
16644A2950150j85452m00372j42842P1835l48318l74142n48448j74787n15993
16635A0331631J18739m4227l53975j23793l43306j91715j06584l53966Q123j51579
16625H789348j64852P9757k75711k35793k45595j06920k58034M4700o6139l38522
$$ plain form
16615 7222239 7202616 7075891 6838376 7150958 6759384 6685262 6614173 6020378 6474077 6266349
16605 6266349 6130644 6285051 5934871 5639449 5476120 5682989 5305653 5666468 5340072
16596 5340072 5452568 5111361 5197929 5164481 5021702 4992335 5003549 4862205 5000136 5078431
16586 5078431 4473632 4544542 5059253 4206984 4672828 4516562 4124008 4398201 4236037 3817995
16576 3817995 4177224 4026371 3671890 3798984 3910845 3676018 3645257 3606668 3875366 3521067
16566 3521067 3889830 3534221 3180643 3517509 3231222 3248019 3318141 3197643 3271662 2745349
16556 2745349 3195041 3039810 3286669 3199083 3055047 3132728 2932406 3097972 3088285 3133334
16546 3133334 2677534 2947863 3139447 2604579 2544836 3053058 2726340 2987351 2392247 2687376
$$ packed form
16615G222239j9623j26725k37515L12582l91574p4122p1089n93795M53699k07728
16605F266349j35705J54407l50180k95422j63329K06869l77336L60815l26396
16596E340072J12496l41207Q6568l3448j42779k9367J1214j41344J37931P8295
16586E078431o04799P0910N14711q52269M65844j56266l92554K74193j62164m18042
16576C817995L59229j50853l54481J27094J11861k34827l0761l8589K68698l54299
16566C521067L68763l55609l53578L36866k86287J6797P0122j20498P4019n26313
16556B745349M49692j55231K46859q7586j44036P7681k00322J65566r687M5049
16546C133334m55800K70329J91584n34868n9743N08222l26718K61011n95104K95129
$$ plain form
16536 2687376 2964989 2458324 2433832 2265617 2390298 2376527 2244274 2522159 2198476 2055330
16526 2055330 2288940 2341227 2474620 2399073 2278724 2208963 2362643 2002981 2354003 2237015
16516 2237015 2371048 2175212 2096394 2078761 1859929 2183239 1824762 2162254 2051628 2039902
16506 2039902 1677090 1979287 2033851 1949447 1333596 1916410 1858680 1969549 1974242 1826302
16496 1826302 1755081 2011391 1662586 1591688 1391258 1888869 1728980 1596454 1493672 1722654
16486 1722654 1542537 1638817 1389253 1776513 1717765 1699772 1852158 1567743 1574714 1711739
16476 1711739 1358353 1487008 1765317 1335874 1499260 1398455 1444213 1184982 1427610 1469775
16466 1469775 1353649 1049625 1645992 1153441 1507698 1385088 1175179 1102912 1339786 1389609
$$ packed form
16536B687376K77613n06665k4492j68215J24681j3771j32253K77885l23683j43146
16526B055330K33610N2287J33393p5547j20349o9761J53680l59662L51022j16988
16516B237015J34033j95836p8818j7633k18832L23310l58477L37492j10626j1726
16506B039902l62812L02197N4564q4404o15851N82814n7730J10869M693j47940
16496A826302p1221K56310l48805p0898k00430M97611j59889j32526j02782K28982
16486A722654j80117R6280k49564L87260n8748j7993J52386k84415O971J37025
16476A711739l53386J28655K78309m29443J63386j00805M5758k59231K42628M2165
16466A469775j16126l04024N96367m92551L54257j22610k09909p2267K36874M9823
$$ plain form
16456 1389609 1425845 1244287 1312034 1271300 1280941 1464184 1159547 1218182 1004389 954929 1408924
16445 1408924 1306292 1028128 1445058 1216054 1234006 1106588 1228965 825313 1018301 1278515
16435 1278515 1423712 1072972 1066262 1278997 1121141 1282309 872785 1214814 1138038 990054
16425 990054 948471 1251735 827381 950517 828808 961606 761229 1064216 916396 878900
16415 878900 861064 873909 1200688 961403 1029674 860560 1243349 1115442 748108 1241434
16405 1241434 862956 917243 793022 1310809 1113886 1094083 802348 1084804 1037934 1040818
16395 1040818 967785 917456 647828 862700 1019153 932197 816492 736202 895987 902586
16385 902586 775466 989766 957377 783423 848949 920334 871600 609009 720927 731042
$$ packed form
16456A389609L6236j81558O7747m0734R641J83243l04637N8635k13793m9460M53995
16445A408924j02632k78164M16930k29004J7952j27418J22377m03652J92988K60214
16435A278515J45197l50740o710K12735j57856J61168m09524L42029p6776j47984
16425I90054m1583L03264m24354J23136j21709J32798k00377L02987j47820l7496
16415H78900j7836J2845L26779k39285O8271j69114L82789j27907l67334M93326
16405A241434l78478N4287j24221N17787j96923j9803k91735K82456m6870K884
16395A040818p3033n0329k69628K14872J56453q6956j15705q0290J59785O599
16385I02586j27120K14300l2389j73954O5526P1385m8734k62591J11918J0115
$$ plain form
16375 731042 850534 908707 1059270 933246 985031 766543 867337 846157 888565 1105283
16365 1105283 819769 633748 868523 545038 717569 675976 721960 766423 726002 1008266
16355 1008266 845011 678595 802307 568262 680447 538278 458729 742802 793011 768336
16345 768336 748040 866087 410542 752732 765190 447216 861259 695334 780355 506384
16335 506384 636217 1013413 552067 625850 670864 946386 636927 905691 665955 725723
16325 725723 616205 350200 507007 625136 742716 286629 551505 384642 475660 673099
16315 673099 612495 657040 762985 713489 487856 539651 791950 551931 476669 502298 510995
16304 510995 415893 360585 811474 472866 219520 196375 544817 621647 631613 620739 316492
$$ packed form
16375G31042J19492N8173J50563j26024N1785k18488J00794k1180M2408K16718
16365A105283k85514j86021K34775l23485J72531m1593M5984M4463m0421K82264
16355A008266j63255j66416J23712k34045J12185j42169p9549K84073N0209k4675
16345G68336k0296J18047D10542L42190J2458l17974M14043j65925Q5021k73971
16335E06384J29833L77196m61346P3783M5014K75522l09459K68764k39736N9768
16325G25723j09518k66005J56807J18129J17580B86629K64876j66863R1018J97439
16315F73099o0604M4545J05945m9496k25633N1795K52299k40019p5262K5629Q697
16304E10995r5102n5308M50889l38608B19520k3145L48442P6830R966j0874l04247
$$ plain form
16293 316492 233412 744414 548216 577758 425019 615939 332407 609555 656501 449127
16283 449127 329737 352218 639180 601230 395789 708362 783223 716342 627243 368576
16273 368576 394078 320251 472678 515649 310969 516594 602926 389026 506300 552744
16263 552744 603775 441917 191990 469358 272466 532443 88050 506004 118214 550822
16253 550822 611824 629850 851826 191289 339972 326099 208298 146851 523882 288953
16243 288953 562853 394828 254072 437212 533596 465724 471252 94162 221742 85722 385217
16232 385217 259734 420858 290776 197344 123370 505259 282597 226714 361948 352347
16222 352347 551186 120132 241344 788442 110503 420799 230340 311062 126059 438634
$$ packed form
16293C16492q3080N11002j96198K9542j52739J90920k83532K77148M6946k07374
16283D49127j19390K2481K86962l7950k05441L12573P4861o6881q9099k58667
16273C68576K5502p3827J52427M2971k04680K05625Q6332k13900J17274M6444
16263E52744N1031j61858A91990K77368j96892K59977H8050M17954A18214M32608
16253E50822O1002J8026K21976A91289J48683j3873j17801o1447L77031k34929
16243B88953K73900j68025j40756J83140R6384o7872N528I4162J27580H5722K99495
16232C85217j25483J61124j30082r3432p3974L81889k22662n5883J35234r601
16222C52347J98839A20132J21212N47098A10503L10296j90459Q0722A26059L12575
$$ plain form
16212 438634 5151 299301 280296 424920 223711 391012 502543 346552 451612 305066
16202 305066 361522 285564 227326 462518 213826 151691 563091 284445 331513 345575 225929
16191 225929 130501 121379 90389 241626 486544 80603 290948 204868 232882 342090 171630
16180 171630 -6924 415322 262885 355367 191624 299166 282334 264721 208157 413263 408545
16169 408545 81892 55549 -60058 321002 150414 -151815 124784 348132 209806 105865
16159 105865 188959 71917 86174 357060 244182 149948 -201487 64290 175284 123503 330084
16148 330084 212664 298626 154686 415920 44020 626981 327388 -30967 19842 29894
16138 29894 -81625 83346 476523 -12704 -46399 377674 96292 212325 309760 407607 233424
$$ packed form
16212D38634E151K94150j9005J44624k01209J67301J11531j55991J05060j46546
16202C05066N6456p5958n8238K35192B13826o2135M11400k78646M7068J4062j19646
16191B25929r5428r122l0990J51237K44918H0603K10345q6080K8014J09208j70460
16180A71630f924D15322j52437R2482j63743J07542j6832j7613n6564K05106m718
16169D08545H1892k6343f0058C21002A50414a51815A24784K23348j38326j03941
16159A05865Q3094G1917J4257K70886j12878r4234b01487F4290J10994n1781K06581
16148C30084j17420Q5962j43940K61234D4020N82961k99593c0967A9842J0052
16138B9894h1625H3346L93177a2704l3695C77674I6292J16033R7435R7847j74183
$$ plain form
16127 233424 89962 341443 136075 216330 202824 202701 25687 45863 -136080 217220 165973
16116 165973 303807 57882 72528 -69345 261937 24109 258175 320037 252599 -82829 296313
16104 -195449 241664 -57813 574991 11148 273174 74914 2690 -125935 -103657 -86733 108702
16092 66879 467172 71453 389088 -540 -39207 131254 303316 189041 168522 -21033 66817
16080 61203 105687 -224182 -44406 -74258 -147003 181941 -814 225685 350042 93007 126923
16069 126923 53749 43649 135888 264252 159642 -11828 253217 237378 -75763 347712 54899
16057 477074 -14328 216714 -14926 207754 -24525 -34612 229559 381065 343464 180927
16047 180927 113878 97284 -136146 178129 -5380 145676 158825 -7140 3276 10153 -45272 -164651
$$ packed form
16127B33424H9962K51481A36075Q0255j3506j23B5687K0176a36080B17220n1247
16116A65973J37834E7882J4646f9345B61937B4109K34066O1862o7438h2829B96313
16104a95449B41664e7813E74991A1148K62026G4914B690a25935K2278J6924A08702
16092F6879M00293G1453L17635e40l8667A31254J72062j14275k0519b1033F6817
16080F1203M4484b24182d4406k9852p2745A81941h14B25685J24357I3007L3916
16069A26923E3749j0100R2239J28364j04610a1828B53217j5839g5763C47712E4899
16057D77074a4328B16714a4926B07754b4525j0087B29559J51506l7601j62537
16047A80927o7049j6594a36146A78129e380A45676J3149g140C276O877d5272j19379
$$ plain form
16035 -164651 -7876 45960 51914 5173 243826 136739 223407 114013 154413 96308 -56825
16023 -93446 -47122 103531 -44945 -408519 -17496 244795 35849 108442 104249 177465 -360191
16011 146561 85722 89838 32605 66500 476412 113684 -203209 -221973 90502 226591 27553
15999 161577 128991 -211052 327957 30265 597893 269407 21265 -79668 -191145 234509
15988 128249 -5081 615429 680141 861530 937144 804134 803841 366622 -100326 562340 -11767
15976 104081 237888 -33468 59614 293510 54175 -72564 -279108 -68592 59773 -123570 -103532
15965 -103532 -206782 -142667 55150 -241429 -109302 -262409 185254 147723 -206988 59055
15954 -307802 -25771 -156128 228290 45262 394404 -115387 93191 26508 -4603 234535 -74719
$$ packed form
16035a64651g876D5960N954E173K38653j07087Q6668j09394M0400n8105e6825
16023i3446M6324A03531d4945l63574a7496B44795C5849P2593m193P3216c60191
16011A46561o0839M116C2605L3895M09912A13684b03209j8764I0502J36089B7553
15999A61577l2586b11052C27957C0265N67628B69407B1265g9668j11477B34509
15988A28249e081F15429O4712J81389P5614j33010k93C66622a00326E62340a1767
15976A04081J33807c3468E9614K33896E4175g2564k06544f8592E9773a23570K0038
15965a03532j03250O4115E5150b41429a09302j53107A85254l7531b06988E9055
15954c07802b5771j30357B28290D5262L49142a15387I3191B6508d603B34535g4719
$$ plain form
15942 71568 54403 126128 379017 246217 12445 422212 -88131 193245 123942 305171 138362
15930 62295 280122 66602 -42526 159721 134524 -77937 76617 72658 110887 324460 -17443
15918 -74806 -388890 -217104 -198827 -169917 -61453 -186371 221780 -64940 98802 -102589 347943
15906 154879 76928 222086 50557 108885 -69189 167245 36456 661 -243122 -324599 -24155
15894 123455 108230 119070 81643 -30239 50131 -257911 349374 -73861 34706 -16795 169004
15882 -58157 -206043 339292 -173136 -33705 214512 146054 112792 -163625 119348 138759
15872 138759 97174 135594 -17022 184047 185104 212073 136120 -236339 137955 75277 96929
15861 96929 112049 15207 -75940 -275219 -142278 -279177 -196918 61496 -220211 107191 201426
$$ packed form
15942G1568j7165P1725K52889j32800A2445M09767h8131A93245o9303J81229A38362
15930F2295K17827F6602d2526A59721k5197g7937G6617l959L8229K13573a7443
15918g4806l14084J71786J8277K8910f1453j24918B21780f4940I8802a02589C47943
15906A54879G6928J45158E0557N8328f9189A67245C6456F61b43122q1477b4155
15894A23455j5225J0840l7427c0239E0131b57911C49374g3861C4706a6795A69004
15882e8157j47886C39292a73136c3705B14512o8458l3262a63625A19348J9411
15872A38759m1585L8420a7022A84047J057K6969p5953b36339A37955o2678K1652
15861I6929J5120A5207g5940j99279J32941j36899Q2259F1496b20211A07191R4235
$$ plain form
15850 201426 11777 -150462 188615 131957 -120993 98552 215934 -210147 -80067 21731
15839 -408363 356475 -166541 -251859 144695 220005 97950 -109498 -231462 -166520 -129217
15829 -129217 -92797 -4101 -91809 206992 -189895 -172268 -141390 80745 96872 -332833 -98601
15817 163541 95087 -209106 -122122 211245 -32494 186070 -177277 -32046 25856 237946
15807 237946 100380 -116103 442529 68795 98315 9029 -133478 -369825 -279423 266321
15796 -26306 -106340 136421 -91097 -137688 -204881 103740 -84980 202970 -201938 -319918 -336578
15785 -336578 -31776 220244 -119816 109145 -68805 -28707 33488 17853 -164146 85948 114352
15774 114352 307007 168182 -609 -320003 57944 15314 107403 -61463 -49723 -142663 105161
$$ packed form
15850B01426A1777a50462A88615n6658a20993I8552J17382b10147h0067B1731
15839d08363C56475a66541q5318A44695P5310I7950a09498j21964O4942L7303
15829a29217L6420d101q7708B06992a89895J7627L0878H0745J6127c32833i8601
15817A63541o8454b09106Q6984B11245c2494A86070a77277c2046B5856K12090
15807B37946A00380a16103D42529F8795K9520I029a33478k36347R0402B66321
15796b6306q0034A36421i1097m6591o7193A03740h4980B02970b01938j17980j6660
15785c36578c1776B20244a19816A09145f8805b8707C3488j5635a64146H5948K8404
15774A14352J92655j38825f09l19394E7944A5314R2089f1463J1740r2940A05161
$$ plain form
15762 -407815 -26670 54677 -157503 69772 -58338 7249 230067 222118 303303 -28414 -123184
15751 -123184 -352193 -345560 108885 7621 132319 -8881 -211189 -52018 43658 18944 71684
15740 71684 10095 38832 -193629 -214430 371718 94565 94120 253776 -80674 201145 -2482
15728 140785 -26548 25350 240775 -349489 31388 -102241 -143953 -195929 135970 70366 -156630
15716 13429 -313945 -355653 69872 206119 -67560 -14484 -137563 -13757 -211401 -95090 135822
15704 121762 131408 140534 -155268 4645 -86000 137238 -90578 310938 -70483 176225 -135868
15692 29589 -21355 12766 -14167 37473 -58936 91289 45553 -185199 106185 135880 -80873
15680 -18232 132656 -12576 -240398 -6430 -185877 243732 48970 9813 276762 -331049 172987
$$ packed form
15762d07815b6670E4677a57503F9772e8338G249K22818p949Q1185b8414r4770
15751a23184k29009O633A08885G621J24698h881k02308e2018D3658A8944N2740
15740G1684A0095K8737a93629k0801C71718I4565m45J59656h0674B01145b482
15728A40785b6548B5350K15425c49489C1388a02241m1712n1976A35970o5604a56630
15716A3429c13945m1708F9872J36247f7560a4484j23079a3757j97644i5090A35822
15704A21762R646R126a55268D645h6000A37238i0578C10938g0483A76225a35868
15692B9589b1355A2766a4167C7473e8936I1289D5553a85199A06185K9695h0873
15680a8232A32656a2576k27822f430j79447B43732D8970I813K66949c31049A72987
$$ plain form
15668 -249885 50701 -206172 172605 19197 -23303 -40506 300799 -107558 373489 36922
15657 -86627 299064 -48068 77402 -43386 105627 -167354 102946 -21297 -148332 -33927 -241741
15646 -241741 -33872 -381035 -74119 229472 194729 -154911 78071 -37117 -175120 143445
15635 7374 -243288 269730 -194777 8048 -77246 -347333 47668 131050 92075 230863 -308240
15623 132210 152300 -62176 31956 -86429 -79199 48057 -89885 -119572 85032 65539 105378 -383407
15610 -376513 -98782 235140 292371 41932 -114895 -51845 -52248 -182374 -233461 323909 133407
15598 -47423 42756 -66464 -245469 -41210 49126 -65981 62806 384259 -237829 17928 98257
15587 98257 -171919 -149087 78168 -191602 89021 -137907 163902 81553 -28532 -210411 -63443
$$ packed form
15668b49885E0701b06172A72605A9197b3303j7203C00799a07558C73489C6922
15657h6627B99064d8068G7402d3386A05627a67354A02946b1297j27035c3927k07814
15646b41741c3872l47163g4119B29472l4743a54911G8071c7117j38003A43445
15635G374b43288B69730a94777H048g7246k70087D7668Q3382l8975J38788c08240
15623A32210K0090f2176C1956h6429P230D8057h9885k9687H5032j9493L9839c83407
15610c76513i8782B35140N7231D1932a14895e1845m03j30126n1087C23909A33407
15598d7423D2756f6464j79005d1210D9126f5981F2806L21453b37829A7928Q0329
15587I8257a71919K2832G8168a91602H9021a37907A63902H1553b8532j81879f3443
$$ plain form
15575 339929 39393 -282507 358152 89324 -218079 -126218 -281712 -20963 34098 292806
15565 292806 13357 4558 56879 174385 60736 -44554 258722 -156696 13400 14976 268067
15554 268067 -54454 -334983 -12285 6649 102314 -31224 169218 148767 -118518 381439 -402737
15542 140180 -89311 77838 -39046 72134 -70824 -121726 60776 82027 255485 89345 210087
15531 210087 -66959 226914 62141 187372 321525 -1389 108762 -214112 -10505 -164021
15521 -164021 163928 154221 343305 25948 -85861 -41756 140052 -5895 315980 -72111 -277505
15510 -277505 152641 296115 -64774 339534 66677 348281 424133 -153864 -249049 174087
15499 329348 332494 199694 182582 122313 -53490 -49552 102576 275408 147777 555468 -81388
$$ packed form
15575C39929C9393b82507C58152H9324b18079R1861j55494b0963C4098K58708
15565B92806A3357D558N2321J17506F0736d4554B58722a56696A3400J576K53091
15554B68067e4454k80529a2285F649R5665c1224A69218k0451a18518C81439d02737
15542A40180h9311G7838c9046G2134g0824n0902F0776K1251J73458H9345J20742
15531B10087f6959B26914F2141J25231J34153a389A08762b14112a0505j53516
15521a64021A63928r707J89084B5948h5861d1756A40052e895C15980g2111k05394
15510b77505A52641J43474f4774C39534F6677K81604P5852a53864r5185A74087
15499C29348L146j32800j7112o0269e3490L938A02576J72832j27631M07691h1388
$$ plain form
15487 110918 54482 -58139 -231373 199489 311643 42104 -191942 -75217 137955 364090
15477 364090 381184 387535 143655 577442 986506 489203 33449 -254511 141094 -82189
15466 -54145 19670 -80710 -185896 -60881 259611 13971 -191424 -154080 70849 151388 119153
15455 119153 71735 218517 169090 -147532 -24349 -45006 -126481 108841 357780 17986 502309
15444 502309 313591 476731 443066 1131010 1102687 704160 498016 137080 198888 248410
15434 248410 -36162 213724 -131803 1535 -207901 -126218 -127437 -7561 82167 20635 354498
15423 354498 -433710 163232 -16701 -16999 102310 -81147 -39496 172298 28588 197538 -18193
15411 15599 89984 -17384 115228 131603 -313922 39821 -34687 112056 -494084 -314193 249669
$$ packed form
15487A10918E4482e8139j73234A99489J12154D2104a91942g5217A37955K26135
15477C64090J7094O351A43655M33787M09064D89203C3449b54511A41094h2189
15466e4145A9670h0710j05186f0881B59611A3971a91424L7344G0849Q0539l2235
15455A19153m7418J46782m9427a47532b4349k0657q1475A08841K48939A7986M84323
15444E02309j88718J63140l3665O87944k8323l98527k06144A37080O1808M9522
15434B48410c6162B13724a31803A535b07901Q1683j219g561H2167B0635L33863
15423C54498d33710A63232a6701k98A02310h1147c9496A72298B8588J68950a8193
15411A5599P4385a7384A15228J6375c13922C9821c4687A12056d94084J79891B49669
$$ plain form
15399 18539 -75220 83970 -370089 -184316 -64151 -151384 269148 -200086 143134 171533 144475
15388 144475 119850 -163205 -146464 -26970 108136 223310 -40360 -134781 -228727 234291 -57504
15376 82585 156451 46587 110158 307101 421606 -118154 -459571 142127 -108127 481550
15365 319255 59095 -61837 356161 204305 -5673 53272 199029 169883 228740 248833 59541
15353 220641 49233 12696 64671 205200 157581 170510 250136 -17031 -61918 219518 -142600
15341 360218 47340 195894 340861 446580 261999 128193 -230808 27809 195338 138665
15331 138665 -8130 -333 189551 -30124 344006 -209073 -13380 263968 63379 -797 -59642 127067
15318 107212 248521 -117698 89247 210388 57472 236658 -125820 -1488 -36988 251238
$$ packed form
15399A8539g5220H3970c70089a84316f4151q7233B69148b00086A43134K8399k7058
15388A44475k4625a63205J6741b6970A08136J15174d0360r4421r3946B34291e7504
15376H2585P3866D6587O3571J96943J14505a18154l41417A42127a08127D81550
15365C19255E9095f1837C56161j51856e673E3272J45757k9146N8857K0093E9541
15353B20641D9233A2696N1975J40529m7619J2929P9626a7031m4887B19518a42600
15341C60218D7340J48554J44967J05719j84581A28193b30808B7809J67529n6673
15331A38665h130c33A89551c0124C44006b09073a3380B63968F3379g97n8845A27067
15318A07212J41309a17698H9247J21141E7472J79186a25820a488l5500B51238
$$ plain form
15307 246854 436175 13330 -24030 352126 118547 -18531 6027 -176501 163869 -53021 128048
15295 -220203 -74737 21471 198099 -32981 -301762 -147349 235172 311279 -40729 -27868 100586
15283 -178936 -140625 -110861 -264441 160661 89587 212213 -138165 -132010 15591 -109128 118029
15271 -247570 72628 44672 88644 -22431 48799 -22044 116919 185256 -112038 194623 15878
15259 145416 -64354 -221558 -191359 104752 258256 124087 11853 318727 53852 -11041
15248 -101899 -34064 -96616 249177 429590 282027 1373831 1879847 1214936 1839335 1034122
15238 1034122 255160 90127 175840 62449 68553 238916 -22455 191397 117774 212475 409
15226 -445285 -170384 -55015 292392 132454 74789 -63735 87274 91576 -183488 -138019 106864
$$ packed form
15307B46854J89321A3330b4030C52126A18547a8531F027a76501A63869e3021A28048
15295b20203g4737B1471J76628c2981k68781a47349B35172P6107d0729J2861A00586
15283a78936L8311K9764j53580A60661p1074J22626a38165O155A5591a09128A18029
15271b47570G2628k7956M3972b2431D8799b2044A16919O8337a12038A94623A5878
15259A45416f4354j57204L0199A04752J53504A24087A1853L06874E3852a1041
15248a01899c4064o2552B49177J80413j47563J091804N06016o64911O24399q05213
15238A034122B55160I0127Q5713F2449O104J70363b2455A91397p3623R4701D09
15226d45285a70384e5015B92392A32454n7665f3735H7274M302a83488M5469A06864
$$ plain form
15214 186372 -256430 135852 30157 278842 204459 267 53769 16947 259320 -163611 261706
15202 272232 -135796 76801 -204256 -242295 317317 206610 59953 183149 353112 -35932
15191 237604 -60242 150246 -39030 -190702 -122324 -57357 58878 2991 107091 -279527 -150057
15180 -150057 -36560 -4175 -19884 76308 -25260 -27192 218151 -39883 -76860 265958 78590
15168 -376873 264896 -113109 -98017 75905 -68631 -136939 8135 -162925 127600 -49386 70996
15156 -99234 -55894 302216 310289 135654 -268180 226549 391889 -41497 207025 226754 79472
15144 100742 58015 -35941 114250 211221 85848 198568 -191049 -170081 -191814 95909 124302
15133 124302 308843 -51102 -131992 -34641 -489260 133408 300712 -122087 90904 158223
$$ packed form
15214A86372b56430A35852C0157K48685p4383B67N3502A6947K42373a63611B61706
15202B72232a35796G6801b04256l8039C17317j10707E9953J23196J69963c5932
15191B37604f0242A50246c9030j51672O8378e7357E8878B991J04100b79527J29470
15180a50057c6560d175j5709G6308b5260j932B18151c9883l6977B65958G8590
15168c76873B64896a13109J5092G5905f8631o8308H135a62925A27600d9386G0996
15156i9234M3340C02216Q073A35654b68180B26549J65340d1497B07025J9729G9472
15144A00742m2727c5941A14250R6971H5848J12720a91049K0968k1733I5909K8393
15133A24302J84541e1102q0890c4641m54619A33408J67304a22087I0904O7319
$$ plain form
15123 158223 338591 147923 111963 372265 75028 703036 228767 128161 -234432 5194
15112 202117 -108468 287854 -87984 -50227 -134349 -69881 327878 -168364 245189 -196125
15101 410702 -12531 -102808 -61966 261907 -11356 112057 -73265 208998 -18980 -107337 -30361
15089 24591 -30544 50061 231546 104592 -104703 -1893 -10861 338753 252098 -49329 237273
15077 -203390 304556 -253992 310860 22673 69574 269887 8988 71830 217636 -26297 155855
15065 -40662 332066 389685 -134247 149749 65300 87288 113104 307591 114751 151371 253799
15054 253799 143864 80310 131356 77148 274995 283939 129490 336184 372730 617206 304375
15042 121486 255310 172896 126100 340994 452212 476437 529120 494442 461870 245855 172784
$$ packed form
15123A58223J80368A47923l5960K60302G5028O28008B28767j00606b34432E194
15112B02117a08468B87854h7984L7757q4122O4468C27878a68364B45189a96125
15101D10702a2531r0277M0842B61907a1356A12057g3265B08998a8980q8357c0361
15089B4591c0544E0061J81485A04592a04703a893q968C38753q6655d9329B37273
15077b03390C04556b53992C10860B2673M6901K00313H988O2842J45806b6297A55855
15065d0662C32066N7619a34247A49749F5300K1988K5816J94487A14751L6620J02428
15054B53799j09935o3554N1046n4208J97847Q944A29490K06694L6546K44476C04375
15042A21486J33824q2414m6796K14894J11218K4225N2683l4678l2572k16015p3071
$$ plain form
15031 172784 467195 383214 751811 518870 519828 666554 388736 263903 238116 162292 550722
15020 550722 248833 225243 394584 147455 287614 286854 306860 158254 27291 205969 207028
15009 207028 387141 606052 525282 572958 375489 126627 72842 260582 -124368 161189
14998 356139 573181 380359 164818 355302 559982 528721 88910 481464 346831 450827
14988 450827 270214 498307 572343 480631 297568 109024 744382 691703 519824 977930
14978 977930 795217 551365 497028 -64620 336669 523463 450532 635775 454796 400960
14968 400960 394776 294503 530676 373148 182438 452061 122574 540151 87195 199836
14958 199836 200100 7887 406141 136422 -39420 420798 208489 543325 -79084 419828 440869
$$ packed form
15031A72784K94411q3981L68597k32941R58J46726k77818j24833k5787p5824L88430
15020E50722B48833k3590J69341A47455J40159p60K0006j48606B7291J78678J059
15009B07028J80113K18911q0770M7676j97469A26627n3785J87740a24368A61189
14998C56139K17042j92822A64818J90484K04680l1261H8910L92554j34633J03996
14988D50827j80613K28093P4036r1712j83063A09024O35358n2679j71879M58106
14978I77930j82713k43852n4337f4620C36669J86794p2931J85243j80979n3836
14968D00960o184j00273K36173j57528A82438K69623A22574M17577H7195J12641
14958A99836K64G887L98254A36422c9420D20798B08489L34836g9084D19828K1041
$$ plain form
14947 440869 301995 286270 284427 489631 579569 577641 357337 589442 450899 178162 713014
14936 713014 436134 400362 560671 446634 791712 465029 910272 935275 1285650 1060992
14926 1060992 1113781 1192274 1316301 1311654 1661677 1238757 1138314 1268112 1590881 1871065
14916 1871065 1716470 1717517 1552295 1521899 834775 856393 671833 430022 430088 286480 575200
14905 575200 298842 484535 398690 262438 424172 143006 280615 405356 138139 177855
14895 177855 445684 326529 533299 292695 314444 522372 456407 401996 500619 567846
14885 567846 441313 377692 785312 579106 834197 456368 622848 718714 436996 647598
14875 647598 422839 164171 431723 272408 561494 554761 411794 225854 81597 627044
$$ packed form
14947D40869j38874j5725j843K05204Q9938j928k20304K32105j38543A78162N34852
14936G13014k76880l5772J60309j14037L45078l26683M45243K5003L50375k24658
14926A060992N2789P8493J24027m647L50023m22920j00443J29798L22769K80184
14916A871065j54595J047j65222l0396o87124K1618j84560k41811O6j43608K88720
14905E75200k76358J85693q5845j36252J61734A43006J37609J24741A38139L9716
14895A77855K67829j19155K06770k40604K1749K07928o5965n4411R8623O7227
14885E67846j26533o3621M07620k06206K55091l77829J66480R5866k81718K10602
14875F47598k24759A64171K67552j59315K89086o733j42967j85940H1597N45447
$$ plain form
14865 627044 699713 591220 434959 539899 473604 469990 181789 448277 368672 183920
14854 394090 805211 420478 713351 538395 296692 409906 29891 365339 394163 597976
14844 597976 534457 885597 1005998 539483 1180974 1030518 880687 328468 894389 499769
14834 499769 694274 496326 717367 93062 445671 202265 443996 573300 509526 642710
14824 642710 519911 386302 490100 416860 441748 571942 556296 730598 738661 536012
14814 536012 758543 591957 616367 588176 321153 681464 938160 723535 697806 826223
14804 826223 867438 458185 1079505 957979 679867 640748 274110 317667 382209 177050
14793 712998 540203 457231 934559 255190 663351 611367 589831 444516 422091 405674
$$ packed form
14865F27044P2669j08493j56261J04940o6295l614A81789K66488p9605A83920
14854C94090M11121l84733K92873j74956k41703J13214B9891L35448K8824K03813
14844E97976o3519L51140J20401m66515O41491j50456j49831C28468N65921l94620
14834D99769J94505j97948K21041I3062L52609B02265K41731J29304o3774J33184
14824F42710j22799j33609J03798p3240K4888J30194j5646J74302Q063k02649
14814E36012K22531j66586K4410k8191k67023L60311K56696k14625k5729J28417
14804H26223M1215m09253O21320j21526k78112l9119B74110M3557O4542A77050
14793G12998j72795q2972M77328B55190M08161n1984k1536j45315k2425j6417
$$ plain form
14783 405674 829696 468327 647928 521444 352388 778285 727440 816784 902561 1086555
14773 1086555 1065352 740090 689815 767383 394268 294175 314107 209743 841021 414181
14762 738598 787998 47746 349350 618820 653119 632777 600579 712820 717849 523133 529652
14751 529652 394840 561821 601680 190349 510707 718732 446662 592480 558595 747835
14741 747835 846063 610350 602423 876574 739523 884739 442222 691572 534793 901782
14731 901782 617142 1001439 1213650 873530 973866 1453835 1504606 1572099 1254208 1169565
14721 1169565 890306 776144 786243 793146 310372 843745 515250 598349 464010 960007
14711 960007 563141 779045 619898 573209 970425 951319 1093850 1122396 1040709 1580664
$$ packed form
14783D05674M24022l61369J79601j26484j69056M25897n0845Q9344Q5777J83994
14773A086555k1203l25262n0275P7568l73115j00093J9932j04364O31278D14181
14762G38598M9400D7746L01604K69470L4299k0342l2198J12241N029j94716O519
14751E29652j34812J66981L9859A90349L20358K08025k72070J45818l3885J89240
14741G47835R8228k35713p927K74151j37051J45216D42222K49350j56779L66989
14731I01782k84640L84297K12211l40120J00336M79969N0771O7493l17891q4643
14721A169565k79259j14162J0099O903C10372N33373l28495Q3099j34339M95997
14711I60007l96866K15904j59147m6689L97216j9106J42531K8546q1687N39955
$$ plain form
14701 1580664 1418113 1498034 1447185 1518726 1093855 949913 997120 723169 1098186 761123
14691 761123 585380 1092475 750294 746428 625907 974926 736870 802388 866789 800511
14681 800511 733106 846413 831067 1037110 1005835 969462 1057380 464213 517072 1074703 793777
14670 793777 1183493 754404 803568 739237 1220314 1010421 1249350 882265 768700 792901
14660 792901 854841 832538 720899 857283 1113792 957028 903413 972541 1280996 1051560
14650 1051560 1137622 1520901 1194088 1001463 964534 848710 1460175 943283 1185280 1148196
14640 1148196 1144590 967202 1201612 633199 1182498 1191588 1089805 1113445 1182451 1227043 963184
14629 963184 1483351 1177583 716598 1260464 1417203 924088 1126137 1154592 981210 1148953
$$ packed form
14701A580664j62551P9921n0849P1541m24871j43942M7207k73951L75017l37063
14691G61123j75743N07095l42181l866j20521L49019k38056O5518O4401o6278
14681H00511o7405J13307j5346K06043l1275l6373Q7918D64213N2859N57631k80926
14670G93777L89716m29089M9164o4331M81077k09893K38929l67085j13565K4201
14660G92901O1940k2303j11639J36384K56509j56764n3615O9128L08455k29436
14650A051560Q6062L83279l26813j92625l6929j15824O11465n16892K41997l7084
14640A148196l606j77388K34410n68413N49299R090j01783K3640O9006M4592k63859
14629I63184N20167l05768m60985N43866J56739m93115K02049K8455j73382J67743
$$ plain form
14619 1148953 871827 1441172 1101918 1158772 1283823 1151024 1354326 1205089 1167518 1354202
14609 1354202 1031132 1424092 1331155 1147894 1429655 1022949 1277560 1423529 1341457 1627428
14599 1627428 1465510 1214798 1192779 1588211 1160766 1545566 1449545 1251693 1337786 1595795
14589 1595795 1128603 1547395 1340207 1611826 1622325 1677338 1427547 1593908 1412683 1489137
14579 1489137 1508134 1640823 1710281 1810384 1876467 1510293 1913814 1738965 2015294 1575643
14569 1575643 1627298 1947385 1785332 1901124 1669983 2075663 2060119 2390460 2166170 2165121
14559 2165121 2405575 2475821 2346091 2469711 2639342 3062223 3153095 3171537 3838664 4697363
14549 4697363 6496455 9555736 16174378 36411597 47061653 17179671 6649880 3075668
$$ packed form
14619A148953k77126N69345l39254N6854J25051j32799K03302j49237l7571J86684
14609A354202l23070L92960r2937j83261K81761m06706K54611J45969q2072K85971
14599A627428j61918k50712k2019L95432m27445L84800r6021j97852Q6093K58009
14589A595795m67192M18792k07188K71619J0499N5013k49791J66361j81225P6454
14579A489137J8997J32689O9458J00103O6083l66174M03521j74849K76329m39651
14569A575643N1655L20087j62053J15792k31141M05680j5544L30341k24290j049
14559B165121K40454P0246j29730J23620J69631M22881R0872J8442O67127Q58699
14549D697363J799092L059281O618642K0237219J0650056A7179671F649880C075668
$$ plain form
14540 2573215 2754227 3799512 5457661 2625396 1994124 1866219 1715465 1683252 1943707
14531 1943707 1509965 2052622 1762074 1804820 1443020 1770287 2173232 1682550 2077104 1943569
14521 1943569 1873032 2342890 1991430 2290796 2300963 1987113 2112188 2388129 2339525 2466131
14511 2466131 2274642 2292972 2536933 2604517 2867529 2716664 2476311 2479656 2303758 2752738
14501 2752738 2586562 2352047 2570562 2628200 2594960 2873280 2746048 2679568 2643827 2917272
14491 2917272 3112851 3075996 2970517 2982060 3003557 3077418 2832215 3250416 3307394 3263289
14481 3263289 3491776 3241069 3152979 2933311 3081261 3428797 3666749 3357513 3226236 3239584
14471 3239584 3523439 3630957 3566090 3786905 3539148 3783927 4230517 3736116 3979084 4178301
$$ packed form
14540B573215J81012J045285J658149B625396o31272j27905j50754l2213K60455
14531A943707m33742N42657k90548M2746l61800L27267M02945m90682L94554j33535
14521A943569p0537M69858l51460K99366J0167l13850J25075K75941m8604J26606
14511B466131j91489J8330K43961O7584K63012j50865k40353L345j75898M48980
14501B752738j66176k34515K18515N7638l3240K78320j27232o6480l5741K73445
14491B917272J95579l6855j05479J1543K1497P3861k45203M18201N6978m4105
14481C263289K28487k50707q8090k19668J47950L47536K37952l09236j31277J3348
14471C239584K83855J07518o4867K20815k47757K44779M46590m94401K42968J99217
$$ plain form
14461 4178301 4007978 4103948 3692107 3984690 4383038 4195506 4422868 4499497 4328430 4070649
14451 4070649 4410154 4463610 4730752 4830802 4988871 4756524 5052140 4911426 5299410 5196233
14441 5196233 4925768 5196253 4946516 5618053 5146652 5604732 5527919 5447854 5805386 5777659
14431 5777659 5696116 5849959 5769336 6181903 6125729 6434544 6252323 6286363 6599736 6915387
14421 6915387 6941261 7209328 7299636 7608970 7533760 7369518 7291552 7760631 7356700 7574307
14411 7574307 7894547 7934016 7927081 8144878 8151340 8537232 8567614 9104621 8948642 8988515 8912665
14400 8912665 9332640 8886912 9430998 9625054 9792177 9854046 9861387 10075164 10174597 10433853
14390 10433853 10521728 11055679 11216910 11168511 11117410 11622848 11900926 12217374 12141795 12472158
$$ packed form
14461D178301j70323R5970m11841K92583L98348j87532K27362P6629j71067k57781
14451D070649L39505N3456K67142J00050J58069k32347K95616j40714L87984j03177
14441E196233k70465K70485k49737O71537m71401M58080p6813q0065L57532k7727
14431E777659q1543J53843q0623M12567n6174L08815j82221L4040L13373L15651
14421F915387K5874K68067R0308L09334p5210j64242p7966M69079m03931K17607
14411G574307L20240L9469o935K17797O462L85892L0382N37007j55979L9873p5850
14400H912665M19975m45728N44086J94056J67123O1869P341K13777R9433K59256
14390A0433853Q7875N33951J61231m8399n1101N05438K78078L16448p5579L30363
$$ plain form
14380 12472158 13090558 13022392 13165203 13227238 13222864 13697146 13797093 14256608 14345137 14909324
14370 14909324 15115499 15372027 15878203 16053494 16515268 16825182 17183189 17285688 17841371
14361 17841371 18297346 18793279 19055440 19275972 19624707 20128066 20647735 21353369 21697185
14352 21697185 22129184 22683768 23290354 23450264 24245340 24954957 25481138 26297601 26996616
14343 26996616 27931853 28542269 29117215 29911053 30827063 31460072 32332560 33344608 34262511
14334 34262511 35318556 36705001 37834460 38903014 39863195 41085936 42542227 43878409
14326 43878409 45182336 47050560 48596988 50109966 51689627 53777685 55314270 58067832
14318 58067832 59894195 62080336 64370697 66918808 69391694 72179823 75073448 77876091
$$ packed form
14380A2472158O18400o8166J42811O2035m374M74282R9947M59515Q8529N64187
14370A4909324K06175K56528N06176J75291M61774L09914L58007J02499N55683
14361A7841371M55975M95933K62161K20532L48735N03359N19669P05634L43816
14352B1697185M31999N54584O06586J59910P95076P09617N26181Q16463O99015
14343B6996616R35237O10416N74946P93838R16010O33009Q72488J012048R17903
14334C4262511J056045J386445J129459J068554R60181J222741J456291J336182
14326D3878409J303927J868224J546428J512978J579661K088058J536585K753562
14318E8067832J826363K186141K290361K548111K472886K788129K893625K802643
$$ plain form
14310 77876091 81696045 85008971 88576646 92533380 96304783 100934953 105922563 110659738
14302 110659738 115871723 121364569 127258884 133719916 140442859 147870324 155411497 163764605
14294 163764605 172330586 181856823 191464791 201744274 212958068 224354244 236788530
14287 236788530 249955908 263034806 277326376 291737149 306739886 321990241 337602518
14280 337602518 352999324 368535893 383404440 397641953 410474984 422196603 431536856
14273 431536856 436751522 439920148 442529878 443946898 444058825 440710091 437197961 430445927
14265 430445927 421104975 410502603 397763172 383714973 368355781 352772872 337097379
14258 337097379 321318090 305912867 290422840 275520873 261277865 247654479 234569637
$$ packed form
14310G7876091L819954L312926L567675L956734L771403M630170M987610M737175
14302A10659738N211985N492846N894315O461032O722943P427465P541173Q353108
14294A63764605Q565981R526237R607968J0279483J1213794J1396176J2434286
14287B36788530J3167378J3078898J4291570J4410773J5002737J5250355J5612277
14280C37602518J5396806J5536569J4868547J4237513J2833031J1721619R340253
14273D31536856N214666L168626K609730J417020J11927l348734l512130o752034
14265D30445927r340952j0602372j2739431j4048199j5359192j5582909j5675493
14258C37097379j5779289j5405223j5490027j4901967j4243008j3623386j3084842
$$ plain form
14251 234569637 222211473 210227195 200804204 190678610 180507554 170987354 162482986
14244 162482986 154948746 147161372 140152194 133100667 126680639 120612351 115439888 110605850
14236 110605850 105555880 100622364 95940017 92316868 88379663 85170812 81638315 78168602
14228 78168602 74795331 71932099 69444936 66511230 63997963 61694628 59278925 57299600
14220 57299600 55620593 53631489 51883937 49967194 48184697 46712464 45699464 44171761
14212 44171761 43044337 41668666 39948809 39315003 38075840 37473422 36324204 34996772
14204 34996772 33981963 32862701 31818070 31165682 31153586 30023727 28691127 28193359 27356571
14195 27356571 26537754 26138288 25443704 24986006 24417453 23632618 22822143 22438675 22148704
$$ packed form
14251B34569637j2358164j1984278r422991j0125594j0171056r520200q504368
14244A62482986p534240p787374p009178p051527o420028o068288n172463m834038
14236A10605850n049970m933516m682347l623149l937205l208851l532497l469713
14228G8168602l373271k863232k487163k933706k513267k303335k415703j979325
14220E7299600j679007j989104j747552j916743j782497j472233j013000j527703
14212D4171761j127424j375671j719857o33806j239163o02418j149218j327432
14204C4996772j014809j119262j044631o52388j2096j129859j332600m97768q36788
14195B7356571q18817l99466o94584m57698n68553p84835q10475l83468k89971
$$ plain form
14186 22148704 21397326 20794987 20243008 20052956 19412852 19089499 18635360 18618058 17897627
14177 17897627 17297712 17234092 16986421 15974237 16025366 15825976 15497916 15013519 14785604
14168 14785604 14075243 14318387 13936527 13539674 13534005 13251699 13144910 12896660 12411728 11978906
14158 11978906 12173425 11923489 11792921 11519659 11281529 10963359 10853849 10598203 10610546
14149 10610546 10180671 9988292 9824707 9742286 9482027 9224216 9126288 9000179 9136036 8891702
14139 8891702 8750441 8745588 8761631 8383835 8003355 8079623 8284255 8030564 7984790 7482602
14129 7482602 8001811 7513725 7211600 7225322 7337933 7256645 6964351 6885373 6946431 6727029
14119 6727029 6762602 6199504 6549492 6021353 6109479 6356415 6257944 5868903 5901823 6187605
$$ packed form
14186B2148704p51378o02339n51979j90052o40104l23353m54139j7302p20431
14177A7897627n99915o3620k47671j012184N1129j99390l28060m84397k27915
14168A4785604p10361K43144l81860l96853n669k82306j06789k48250m84932m32822
14158A1978906J94519k49936j30568k73262k38130l18170j09510k55646J2343
14149A0610546m29875j92379j63585q2421k60259k57811r7928j26109J35857k44334
14139H891702j41261m853J6043l77796l80480P6268K04632k53691m5774n02188
14129G482602N19209m88086l02125J3722J12611q1288k92294p8978O1058k19402
14119F727029L5573n63098L49988n28139Q8126K46936r8471l89041L2920K85782
$$ plain form
14109 6187605 5901985 5793230 5725361 5754663 5641939 5468191 5747063 5538898 5298487 5145062
14099 5145062 5133279 4878158 4942800 4772868 4799503 4948548 4940138 4642522 4846833 4361807
14089 4361807 4756194 4447373 4739951 4316596 4390832 4474164 4225580 4076623 4170939 4235635
14079 4235635 4252161 4286972 4146033 4049436 4100199 3879264 3766960 4061131 4043707 3758906
14069 3758906 3672533 3700146 3709887 3575213 3854382 3742460 3594442 3679430 3720944 3641712 3720882
14058 3720882 3790500 3448105 3478010 3423913 3301111 3440625 3344608 3090240 3178597 3641103
14048 3641103 3150332 3166883 3290685 2946576 2807113 2834211 3131456 3039527 3004596 2834010
14038 2834010 2878459 2573601 2778699 2599421 2780729 2887674 2448570 2696686 2782929 2602040
$$ packed form
14109F187605k85620j08755o7869K9302j12724j73748K78872k08165k40411j53425
14099E145062j1783k55121O4642j69932K6635J49045q410k97616K04311m85026
14089D361807L94387l08821K92578m23355P4236Q3332k48584j48957R4316O4696
14079D235635J6526L4811j40939r6597N0763k20935j12304K94171j7424k84801
14069C758906q6373K7613R741j34674K79169j11922j48018Q4988M1514p9232P9170
14058C720882O9618l42395K9905n4097j22802J39514r6017k54368Q8357M62506
14048C641103m90771J6551J23802l44109j39463K7098K97245r1929l4931j70586
14038B834010M4449l04858K05098j79278J81308J06945m39104K48116Q6243j80889
$$ plain form
14028 2602040 2795208 2615725 2808986 2242893 2247012 2265201 2404756 2590851 2246140 2072518
14018 2072518 2210333 2216104 2335711 2104033 2102852 2287282 2222392 1799949 2259888 2262443 2260046
14007 2260046 2024697 1964314 1888236 1874467 1692868 1826757 1700269 1807457 1643500 1663366
13997 1663366 1386121 1573404 1829463 1613388 1810914 1517601 1994341 2090005 2946673 4889371
13987 4889371 9611127 25810940 51102440 26078357 12050382 6772727 4950411 4177885
13979 4177885 3711447 3171521 2977006 2526403 2672535 2432978 2071755 2210793 2063547
13970 2063547 2126468 2010791 2237095 2207224 1910294 2057882 2080223 1850499 2062347 1875625
13960 1875625 1613651 2029998 1765438 1857701 1846143 1454971 1938724 1653591 1547977 1519478
$$ packed form
14028B602040J93168j79483J93261n66093M119J8189J39555J86095l44711j73622
14018B072518J37815N771J19607k31678j181J84430o4890m22443M59939K555k397
14007B260046k35349o0383p6078j3769j81599J33889j26488J07188j63957J9866
13997A663366k77245J87283K56059k16075J97526k93313M76740R5664Q56668J942698
13987D889371M721756J6199813K5291500k5024083A2050382n277655j822316p72526
13979D177885m66438n39926j94515m50603J46132k39557l61223J39038j47246
13970B063547O2921j15677K26304k9871k96930J47588K2341k29724K11848j86722
13960A875625k61974M16347k64560R2263j1558l91172M83753k85133j05614k8499
$$ plain form
13950 1519478 1597866 1701054 1579522 1491745 1590139 1284076 1230094 1767651 1603912 1879351
13940 1879351 1278047 1422086 1582789 1290081 1408678 1374605 1613305 1305453 1462515 1591711
13930 1591711 1414721 1315627 1356880 1400914 1052059 1572168 1465569 1317761 1181877 1388489
13920 1388489 1401473 1175053 1309031 1389430 1287656 1237408 1405855 1276983 1213662 1546771
13910 1546771 847631 1312555 1195638 1401546 1071029 836944 1364928 1172707 1352282
13901 1352282 1119443 960404 916292 980181 980141 1021397 878451 955614 1114432 971821 1185659
13890 1185659 1317149 1098618 956634 1354016 1179314 1164852 879479 950549 1166868 1343126
13880 1343126 1396823 873826 1047271 963607 782641 1030865 998697 786650 1308147 1087019
$$ packed form
13950A519478P8388J03188j21532q7777R8394l06063n3982N37557j63739K75439
13940A879351o01304J44039J60703k92708J18597l4073K38700l07852J57062J29196
13930A591711j76990r9094M1253M4034l48855N20109j06599j47808j35884K06612
13920A388489J2984k26420J33978Q0399j01774n0248J68447j28872o3321L33109
13910A546771o99140M64924j16917K05908l30517k34085N27984j92221J79575
13901A352282k32839j59039m4112O3889m0M1256j42946P7163J58818j42611K13838
13890A185659J31490k18531j41984L97382j74702j4462k85373P1070K16319J76258
13880A343126N3697n22997J73445q3664j80966K48224l2168k12047N21497k21128
$$ plain form
13870 1087019 1080264 1012276 730467 868924 826516 1179333 851109 1058340 1141098 926953
13860 926953 1166697 709719 979684 924622 818360 943253 935657 527315 816640 942763
13850 942763 933436 773041 826447 709271 666739 972336 786897 849517 673437 983399
13840 983399 665913 721483 1002745 861705 840952 763317 754387 867827 955703 579188 1144600
13829 1144600 797369 863668 861943 736062 785156 1055536 877391 953286 975163 689189
13819 689189 629365 600489 819922 608350 859823 829056 550210 583781 916976 930511
13809 930511 804605 611005 626134 763190 879842 847749 643904 818800 565217 986803
13799 986803 454558 832406 824161 696162 367764 1005722 641594 425741 451182 362574
$$ packed form
13870A087019o755o7988k81809J38457m2408L52817l28224K07231Q2758k14145
13860I26953K39744m56978K69965n5062j06262J24893p596m08342K89325J26123
13850I42763r327j60395N3406j17176m2532L05597j85439O2620j76080L09962
13840I83399l17486N5570K81262j41040k0753p7635q930J13440Q7876l76515N65412
13829A144600l47231O6299j725j25881M9094K70380j78145P5895K1877k85974
13819F89189n9824k8876K19433k11572K51473l0767k78846L3571L33195J3535
13809I30511j25906j93600J5129J37056J16652l2093k03845J74896k53583M21586
13799I86803D54558L77848q245j27999l28398O37958l64128k15853K5441q8608
$$ plain form
13789 362574 652329 713119 803457 935925 558113 707937 735924 952384 868566 699113
13779 699113 568501 708194 287342 546251 793142 523024 441533 592685 245533 658578
13769 658578 495168 504139 715929 648914 559613 977904 313739 385896 687879 639031 315516
13757 508753 401959 735778 752802 202943 348010 648417 666039 559512 736438 422845
13747 422845 498391 639325 528224 547709 358822 464148 368693 596816 554657 577632
13737 577632 308237 553714 274515 372158 356192 417577 582339 501205 686680 733182
13727 733182 754132 649809 618165 625864 833373 423982 507092 395578 759288 257733
13716 205162 759819 230240 203209 274198 658825 929098 401013 373394 432042 131938
$$ packed form
13789C62574K89755O0790R0338J32468l77812J49824K7987K16460q3818j69453
13779F99113j30612J39693B87342K58909K46891k70118q1491J51152B45533M13045
13769F58578j63410Q971K11790o7015q9301M18291C13739P2157L01983m8848C15516
13757E08753j06794L33819J7024B02943J45067L00407J7622j06527J76926l13593
13747D22845P5546J40934j11101J9485j88887J05326r5455K28123m2159K2975
13737E77632k69395K45477B74515R7643j5966O1385J64762q1134J85475M6502
13727G33182K0950j04323l1644P699K07509m09391Q3110j11514L63710B57733
13716B05162N54657B30240k7031P0989L84627K70273D01013k7619N8648A31938
$$ plain form
13705 750092 541569 463633 460367 452055 189141 486189 244640 631399 429548 693299
13695 693299 451267 451754 620638 173321 578977 260875 156610 366049 55295 487433
13685 487433 648864 549077 426475 765365 255537 521656 656799 236004 94963 697255
13675 697255 500260 623566 558562 448308 421173 410134 496797 440830 595101 486009
13665 486009 229078 468537 392330 640416 58448 460391 367031 168871 422060 350947
13655 350947 133505 621211 477486 256655 511379 384418 568252 169429 499119 349356
13645 349356 294904 538889 455023 367198 668155 402350 90215 314628 208187 393235
13635 393235 196388 361356 274606 448872 508196 460208 135404 348776 243546 141050
$$ packed form
13705G50092k08523p7936l266q312A89141K97048k41549L86759k01851K63751
13695F93299k42032M87J68884A73321M05656B60875j04265K09439E5295M32138
13685D87433J61431r9787j22602L38890B55537K66119J35143B36004I4963O02292
13675F97255j96995J23306o5004j10254k7135j1039Q6663n5967J54271j09092
13665D86009B29078K39459p6207K48086E8448M01943r3360A68871K53189p1113
13655C50947A33505M87706j43725k20831K54724j26961J83834A69429L29690j49763
13645C49356n4452K43985q3866q7825L00957k65805I0215K24413j06441J85048
13635C93235A96388J64968q6750J74266N9324m7988A35404K13372j05230j02496
$$ plain form
13625 141050 401153 398530 45202 -102264 230336 263716 453530 430963 341690 520384 -150953
13613 -190292 146208 290814 403364 266510 602153 308331 486611 344086 188648 125211
13603 125211 195935 66504 546050 283192 359061 373758 123839 340541 618351 555584
13593 555584 300161 346416 189777 751442 281057 152509 314217 503614 265775 524522
13583 524522 515273 191102 561195 249232 148982 418732 95683 209738 293421 399035
13573 399035 496172 720948 35892 163235 268731 312125 283201 435609 29297 396477
13563 396477 254584 25244 204228 59184 93031 320161 428095 56513 196117 -6678 56395
13551 -47604 395184 349159 444070 570607 255588 143187 224193 461878 453579 101427 366757
$$ packed form
13625A41050K60103k623D5202a02264B30336L3380J89814k2567q9273J78694a50953
13613a90292A46208J44606J12550j36854L35643k93822J78280j42525j55438o3437
13603A25211P0724F6504M79546k62858P5869J4697A23839K16702K77810o2767
13593E55584k55423M6255j56639N61665B81057j28548J61708J89397k37839K58747
13583E24522r249A91102L70093B49232j00250K69750I5683J14055Q3683J05614
13573C99035R7137K24776C5892J27343J05496M3394k8924J52408B9297L67180
13563C96477j41893B5244J78984E9184L3847K27130J07934E6513J39604f678E6395
13551d7604C95184m6025R4911J26537B55588j12401Q1006K37685q299A01427K65330
$$ plain form
13540 366757 64813 82534 -141455 228943 159204 179373 145926 176997 267745 187363 149786
13529 149786 172639 397490 268011 108400 279401 175341 -3229 -69247 302662 147171
13518 231572 365874 347195 -111046 239407 301622 240257 198922 162190 116986 191833 -13155
13506 348791 125090 184067 174802 232828 368740 311162 102752 109791 86507 -39066 264203
13494 107622 110672 43381 547943 393170 203928 323166 88729 272172 187034 116878 413712
13483 413712 48625 566338 53325 -99206 185868 109173 51911 -6924 292333 50698 446289
13472 446289 358157 300195 311658 297232 -726 415468 340574 -130204 264296 240879 262265
13461 262265 246426 367268 255072 308477 224439 -12239 152673 196276 383438 -160090
$$ packed form
13540C66757F4813J7721a41455B28943o9739K0169l3447L1071R0748q0382l7577
13529A49786K2853K24851j29479A08400J71001j04060c229o6018C02662A47171
13518B31572J34302j8679a11046B39407O2215o1365m1335l6732m5204P4847a3155
13506C48791A25090N8977r265N8026J35912n7578A02752P039k3284c9066B64203
13494A07622L050D3381N04562j54773j89242J19238H8729J83443q5138p0156K96834
13483D13712D8625N17713E3325i9206A85868p6695E1911f924B92333E0698L95591
13472D46289q8132n7962J1463j4426g26D15468p4894a30204B64296k3417K1386
13461B62265j5839J20842j12196N3405q4038a2239A52673M3603J87162a60090
$$ plain form
13450 -31674 -114586 190448 447211 179550 -78476 202218 -34019 -147188 265135 523800
13440 523800 313981 455492 238955 78506 -64314 298089 263357 371952 384286 97830
13429 232268 638856 -22787 43536 258063 294375 129855 466430 281789 78035 321755
13419 321755 -29145 578812 186927 46136 131858 250473 -128060 200011 62300 342521
13409 342521 418889 11492 319239 72343 164585 -156510 -13680 55317 -69437 98351 356774
13398 356774 181987 -11796 149792 -108475 368684 22835 246580 154649 190489 289506
13388 289506 62130 -99087 52762 81133 72618 -74645 371126 246193 509552 11156 113072
13377 113072 -19284 -24030 441832 336335 104774 -146713 -129292 89627 287736 -211350
$$ packed form
13450c1674q2912A90448K56763A79550g8476B02218c4019j13169B65135K58665
13440E23800k09819J41511k16537G8506f4314B98089l4732J08595J2334I7830
13429B32268M06588b2787D3536K14527L6312A29855L36575j84641G8035K43720
13419C21755b9145E78812A86927D6136Q5722J18615a28060B00011F2300K80221
13409C42521P6368A1492L07747G2343R2242a56510a3680E5317f9437I8351K58423
13398C56774j74787a1796A49792a08475C68684B2835K23745r1931L5840R9017
13388B89506F2130i9087E2762K8371q515g4645C71126j24933K63359A1156J01916
13377A13072a9284m746D41832j05497A04774a46713J7421H9627J98109b11350
$$ plain form
13366 65645 374230 -21186 447391 138962 -39430 57817 424219 108398 251625 153010
13356 153010 244788 66255 174479 322526 55012 105887 275957 378252 -79433 245002
13345 297183 334875 631456 303592 263627 157851 336546 198780 217434 280308 304112
13335 304112 266774 400586 66651 198967 455633 12227 176788 98298 183259 125130 382999
13324 382999 96574 422639 272276 5377 -16449 -159114 130076 168772 195714 107513 203456
13313 203456 431172 359305 372401 290978 242536 101756 161962 273564 105213 263634
13303 263634 90022 366963 33311 192102 13729 32708 -12955 210667 -72529 225224 337780
13292 337780 134488 141952 347810 177532 -65337 -231871 -161207 -202531 281475 228011 182509
$$ packed form
13366F5645L08585b1186D47391A38962c9430E7817L66402A08398J43227r8615
13356A53010R1778F6255J08224J48047E5012N0875J70070J02295g9433B45002
13345B97183L7692K96581C03592l9965j05776J78695j37766J8654O2874K3804
13335C04112l7338J33812F6651J32316K56666A2227J64561p8490Q4961n8129K57869
13324C82999I6574L26065j50363E377a6449j42665A30076L8696K6942q8201R5943
13313B03456K27716p1867J3096q1423m8442A01756O0206J11602A05213J58421
13303B63634I0022K76941C3311J58791A3729J8979a2955B10667g2529B25224J12556
13292C37780A34488P464K05858j70278f5337j66534P0664m1324B81475n3464m5502
$$ plain form
13281 182509 177477 252085 196383 -43083 97587 -97660 -153446 -23276 19008 389974 476968
13270 476968 -79629 47647 -39058 90734 119346 710193 -6332 -111564 -122113 180157 185321
13259 185321 -107396 9239 194555 120955 36272 -33574 393427 468495 176791 14079 150228
13248 150228 406162 -49080 73233 58609 -169223 -111539 -94943 17675 -70295 30946 79665
13237 79665 147394 246745 150613 220196 -88757 14348 -204307 -77973 -15306 158650 156601
13226 156601 -119176 249764 231442 -18750 -71711 74818 109133 220376 47055 -207412 240039
13214 19475 -8710 201792 -35563 -276253 -263131 245736 360672 10567 -92265 -20813 -71624
13203 -71624 383131 280133 345401 208385 147907 151890 274677 489261 70521 -11137 -130822
$$ packed form
13281A82509n032P4608n5702d3083I7587i7660n5786b3276A9008L70966Q6994
13270D76968g9629D7647c9058I0734K8612N90847f332j05232j0549A80157N164
13259A85321a07396I239J85316p3600C6272c3574C93427P5068A76791A4079J36149
13248A50228K55934d9080G3233j4624a69223N7684J6596A7675g0295C0946M8719
13237G9665O7729R9351r6132O9583h8757A4348b04307g7973a5306A58650k049
13226A56601a19176B49764j8322a8750n2961G4818L4315J11243D7055b07412B40039
13214A9475h710B01792c5563k40690J3122B45736J14936A0567i2265b0813n0811
13203g1624C83131j02998O5268j37016o0478L983J22787K14584G0521a1137j19685
$$ plain form
13192 -130822 261755 -161446 -31408 83950 281602 -18345 -86962 179460 -203760 -126528
13182 -126528 2192 -387988 72623 -23686 -46767 31347 38122 40029 225011 232280 88271 292421
13170 292421 59774 -259444 348204 161704 -260934 482369 -356496 -161519 -170357 275148
13159 166781 7676 371382 -10907 41890 150394 263896 -111590 64627 -72631 71089 60563
13148 60563 -177722 84503 79646 70137 37277 142568 -191361 -355619 274732 70393 -234321
13136 -207982 34496 98393 -285473 94965 -212438 -233075 509233 128362 165044 -78426 -45832
13125 -45832 -146567 359392 109463 419011 135603 87364 193955 49413 181880 291336
13115 291336 -21316 -193958 -65921 264761 49022 -76376 -127751 -206717 200256 -92443 177914
$$ packed form
13192a30822B61755a61446c1408H3950J97652a8345o8617A79460b03760P7232
13182a26528B192c87988G2623b3686k3081C1347O775J907J84982P269H8271K04150
13170B92421E9774b59444C48204A61704b60934D82369c56496a61519q838B75148
13159A66781G676L63706a0907D1890J08504J13502a11590F4627g2631G1089j0526
13148F0563a77722H4503m857r509l2860J05291a91361j64258B74732G0393b34321
13136b07982C4496O3897b85473I4965b12438k0637E09233A28362L6682g8426L2594
13125d5832j00735C59392A09463L09548A35603m8239J06591D9413J32467J09456
13115B91336b1316j72642f5921B64761D9022g6376n1375p8966B00256i2443A77914
$$ plain form
13103 -189466 -18370 -131024 -273413 20142 -210629 -187553 -45672 227437 306303 170119
13093 170119 -41831 81228 4219 405864 -6759 -93656 57979 -234600 -94031 -70587 113425
13081 3050 138120 -20508 73948 185417 86851 321266 -35261 -100510 108282 67756 96994
13070 96994 208157 154722 124186 386862 191253 -113018 -180008 150374 -54834 -157827
13060 -157827 190475 75836 -132834 -44525 -53033 8852 151118 329461 62103 -293909 180473
13048 67840 146316 149367 243805 289888 107471 227186 -406618 -73254 -192870 187799 -117213
13036 -228695 120819 -16999 118257 105598 231448 220166 66139 28927 56903 132305 -93092
13024 290529 42776 342903 68923 -149476 -213398 564121 224546 -263400 -218952 267576
$$ packed form
13103a89466a8370j12654j42389B0142b10629K3076d5672B27437P8866j36184
13093A70119d1831H1228D219M01645f759q6897E7979b34600i4031K3444A13425
13081C050J35070b0508G3948J11469H6851K34415c5261o5249A08282m0526K9238
13070I6994J11163n3435l0536K62676A91253a13018o6990A50374e4834j02993
13060a57827A90475G5836a32834d4525q508H852J42266J78343F2103b93909A80473
13048F7840P8476L051R4438M6083A07471J19715d06618g3254j19616A87799a17213
13036b28695A20819a6999A18257j2659J25850j1282F6139B8927K7976P5402i3092
13024B90529D2776L00127F8923a49476o3922E64121B24546b63400M4448B67576
$$ plain form
13013 121205 -136289 -265851 45785 -31070 126198 32353 159484 21737 -25366 -39417 -208046
13002 -208046 84008 -105449 -320538 230963 301801 -38226 -48709 -137816 -123332 31012 -45325
12990 69993 40199 169455 61330 6759 -549034 -77878 -106688 174927 24610 -63007 33697
12978 65312 -179966 91436 -49730 1721 385259 346034 333175 76407 53276 121980 75803
12967 75803 -28446 107508 40708 228866 124544 -96575 194744 -147300 -159992 83081 19930
12955 244210 105744 -141131 60379 -219106 146455 202473 25578 52996 94473 -263264
12944 27431 -55757 183922 -75131 79997 129619 269415 -137866 159809 235734 -159039 158490
12932 150443 -82856 -16035 81695 322595 318493 -118661 73544 371746 -225724 195453 -139011
$$ packed form
13013A21205a36289j29562D5785c1070A26198C2353J27131B1737b5366j4051j68629
13002b08046H4008a05449k15089B30963P0838c8226j0483q9107J4484C1012d5325
12990F9993k9794J29256F1330F759e49034g7878k8810A74927B4610f3007C3697
12978F5312a79966I1436d9730A721L83538l9225j2859G6407k3131O8704m6177
12967G5803b8446A07508D0708J88158j04322i6575A94744a47300j2692H3081A9930
12955B44210A05744a41131F0379b19106A46455N6018B5578K7418M1477b63264
12944B7431e5757A83922g5131G9997M9622J39796a37866A59809P5925a59039A58490
12932A50443h2856a6035H1695K40900m102a18661G3544K98202b25724A95453a39011
$$ plain form
12920 53085 -22391 212316 -220926 133602 -128086 277509 -161818 -119430 -184243 -131431
12910 -131431 -182645 31038 -122828 97080 -401108 65830 178743 -39865 541061 -57393 32555
12898 -207160 -30414 -113864 -236723 289008 29369 31853 -39404 159275 -217385 -160747 94997
12886 66841 154777 199801 -199463 123226 -104138 -265805 -181766 -263593 4619 53831 36884
12875 36884 -6887 -239094 -102111 38636 6075 205625 215772 267582 8712 7405 11781 -5916
12862 64767 -197313 -322344 -141021 188764 63931 -141988 -50332 -8263 -100469 -170996 -143823
12851 -143823 162791 -9704 99367 -160494 82400 -181996 -162992 -53516 -43331 -15458 120137
12839 -158264 -98054 167232 94638 -107737 -64046 46508 66384 -49932 230972 114743 116999
$$ packed form
12920E3085b2391B12316b20926A33602a28086B77509a61818M2388o4813N2812
12910a31431n1214C1038a22828I7080d01108F5830J12913c9865E41061e7393C2555
12898b07160c0414q3450j22859B89008B9369K484c9404A59275b17385N6638I4997
12886F6841Q7936M5024a99463A23226a04138j61667Q4039q1827D619M9212j6947
12875C6884f887k32207a02111C8636F075J99550J0147N1810H712j307M376e916
12862F4767a97313j25031a41021A88764F3931a41988e0332h263r2206p0527K7173
12851a43823A62791i704I9367a60494H2400a81996J9004e3516J0185a5458A20137
12839a58264O0210A67232p2594a07737M3691D6508J9876d9932B30972A14743K256
$$ plain form
12828 116999 -125687 -137443 -56781 103388 -129299 135702 240350 74824 211240 169288
12818 169288 38143 -145466 41487 130216 -66996 104338 -208661 192184 -3974 133321 -36301
12806 44502 -418844 -173025 -154945 148227 968 159574 -144627 -147946 -109506 -73271 102271
12794 -44288 305571 -141473 -21363 111230 -13360 -125001 -144692 -151842 208559 26533 93327
12783 93327 -89139 9364 46901 -82479 75943 -85276 -154636 21785 155460 213717 177496 114290
12771 114290 -66517 118143 -231448 110566 183732 241790 -158936 -88326 217795 -244247
12760 79 -218254 -58026 417943 -219445 183810 -220026 -168137 -37242 -263351 79592 72239
12749 72239 64208 121936 213390 -192409 -79487 -302847 99004 -148801 150497 298235 -9947
$$ packed form
12828A16999a25687j1756e6781A03388a29299A35702J04648G4824J36416m1952
12818A69288C8143a45466D1487Q8729f6996A04338b08661A92184c974A33321c6301
12806D4502d18844a73025J8080A48227I68J58606a44627l319L8440L6235A02271
12794d4288C05571a41473b1363A11230a3360j11641j9691p150B08559B6533O6794
12783I3327h9139I364L7537h2479G5943h5276o9360B1785J33675N8257l6221o3206
12771A14290f6517A18143b31448A10566P3166N8058a58936P0610B17795b44247
12760G9b18254e8026D17943b19445A83810b20026N1889c7242k26109G9592p353
12749G2239q031N7728R1454a92409g9487k23360I9004a48801A50497J47738i947
$$ plain form
12737 -60287 17184 44346 -68840 355002 282537 231114 -229758 -145073 70477 -240523 -9147
12725 -234274 96749 -219291 -14529 363708 -274400 158061 204841 60950 24806 -125445
12714 -33215 -169165 77480 -38817 105539 92128 181024 86133 437573 120923 75672 -30279
12702 2816 348102 32067 -73720 -127958 -262218 118433 -64763 -30615 215553 9666 170319
12691 170319 127338 254743 -71560 76152 146309 -61813 50728 377053 102320 -1148 190102
12679 -293127 473509 -43584 -131677 101231 73652 187298 119635 338724 -57683 -319763
12669 -319763 29392 66578 -315320 52875 -71944 -119639 -231451 82615 243362 -280345 -59428
12657 65394 -114919 125265 -212574 -84015 189094 112487 151573 28708 87998 -60854 -177135
$$ packed form
12737f0287A7184K7162f8840C55002p2465n1423b29758Q4685G0477b40523i147
12725b34274I6749b19291a4529C63708b74400A58061M6780F0950B4806a25445
12714c3215j35950G7480c8817A05539j3411Q8896H6133L51440A20923m5251c0279
12702B816L45286C2067g3720n4238j34260A18433f4763c0615B15553I666J60653
12691A70319m2981J27405g1560G6152P0157f1813E0728L26325A02320a148A90102
12679b93127D73509d3584q8093A01231k7579J13646o7663K19089e7683k62080
12669c19763B9392L7186c15320E2875g1944m7695j11812H2615J60747b80345e9428
12657F5394a14919A25265b12574h4015A89094p6607L9086B8708N9290f0854j16281
$$ plain form
12646 -177135 50675 47633 -222787 -13206 -224816 19682 -110594 -106807 -210798 280010 104962
12634 -159673 -55437 182350 142873 236559 206691 -95013 -8147 122027 -133618 -32241 185475
12622 -162605 -40620 44515 111659 203053 165548 203369 -142019 136746 -180524 252623 184048
12611 184048 36336 91312 -35947 -14646 -15747 -199105 -37454 -101690 87960 134986 82628
12600 82628 192119 228811 204434 308837 90097 245466 12783 -94426 65224 313614 130317
12588 -175983 -16871 -116384 -167599 309532 217183 112528 -11022 -164721 328854 80361 93660
12577 93660 -51047 -31692 -458367 48884 -16638 191405 -175051 25311 -134623 -4078 -184268
12566 -184268 184153 -121640 60628 369043 1493 -198018 106311 -218760 40951 198051
$$ packed form
12646a77135E0675l042b22787a3206k11610A9682a10594L787j03991B80010A04962
12634a59673e5437A82350l9477R3686k9868i5013h147A22027a33618c2241A85475
12622a62605d0620D4515O7144R1394l7505L7821a42019A36746a80524B52623o8575
12611A84048C6336N4976c5947a4646j101j83358c7454o4236H7960M7026n2358
12600H2628J09491L6692k4377J04403I0097J55369A2783i4426F5224K48390A30317
12588a75983a6871r9513n1215C09532r2349j04655a1022j53699C28854H0361J3299
12577I3660e1047J9355m26675D8884a6638A91405a75051B5311a34623d078j80190
12566a84268A84153a21640F0628L08415A493a98018A06311b18760D0951J57100
$$ plain form
12556 198051 163067 -147220 -84733 -249598 -115603 -67322 -41843 -28728 1355 162425 -168262
12544 164608 77241 60478 109681 -69084 -111738 246664 -1237 -119558 66596 126495 -162622
12532 -221791 218297 142699 27198 203641 -74683 -40105 220929 51654 97810 -113567 -27481
12520 -283021 264310 97275 168209 113604 9610 151474 -199482 -167848 106773 58736 -7948
12508 247339 103678 132489 -328843 -39940 215569 140784 46807 -144456 -308622 -42381
12497 143411 -11728 -119215 8846 138777 -37215 33831 -112418 -341120 231573 -150718
12486 84235 272359 260923 116600 -67596 136242 92394 -193450 60677 -43904 469362 373129
12475 373129 -109841 77708 259791 237245 -86323 185192 254393 -20669 217835 -146714
$$ packed form
12556A98051l4984a47220O2487j64865a15603M8281K5479J3115A355J61070a68262
12544A64608G7241j6763M9203f9084m2654B46664a237j18321F6596N9899a62622
12532b21791B18297p5598B7198J76443g4683L4578B20929E1654M6156a13567b7481
12520b83021B64310I7275P0934n4605I610J41864a99482L1634A06773m8037g948
12508B47339A03678K8811c28843c9940B15569p4785D6807a44456j64166d2381
12497A43411a1728j07487H846J29931c7215C3831a12418k28702B31573a50718
12486H4235J88124j1436A16600f7596A36242m3848a93450F0677d3904D69362r6233
12475C73129a09841G7708J82083k2546h6323A85192O9201b0669B17835a46714
$$ plain form
12464 127000 195474 -45861 -78415 48272 -160678 -154106 -115213 -78279 284159 -5766 63821
12452 -215064 -157461 88586 -178962 265190 253742 207128 -156944 15333 106512 25358 -40006
12440 -111158 5847 -217314 -114261 -217444 -103966 -108793 -66255 -93768 -104726 109371 131914
12429 131914 -79071 104074 -246588 298329 -314869 -231473 149416 -93290 228455 -234132
12418 88275 82653 -75649 -299362 2953 -69867 109859 -275216 -63024 140204 -214506 -196220
12407 -196220 16914 -164702 -269598 -98815 297710 47610 122889 285854 15199 158227
12397 158227 -16534 -143912 -33440 48338 -241359 -21029 72752 -83689 -152535 196212 112630
12386 112630 -225303 134398 211669 -115985 -191472 -19778 240668 -171815 -6400 292180
$$ packed form
12464A27000O8474d5861l2554D8272a60678O572L8893L6934B84159e766F3821
12452b15064N7603H8586a78962B65190j1448m6614a56944A5333R1179B5358d0006
12440a11158E847b17314J03053j03183a03966m827M2538k7513j0958A09371K2543
12429A31914g9071A04074b46588B98329c14869Q3396A49416i3290B28455b34132
12418H8275n622g5649k23713B953f9867A09859b75216f3024A40204b14506J8286
12407a96220A6914a64702j04896i8815B97710D7610P5279J62965A5199J43028
12397A58227a6534j27378c3440D8338b41359b1029G2752h3689o8846A96212q3582
12386A12630b25303A34398P7271a15985p5487a9778B40668a71815f400B92180
$$ plain form
12375 -38750 132375 209589 85993 -119205 185269 96026 247897 87051 -68877 347231 -190238
12363 -249660 263923 307512 -421606 -396767 60465 -14708 104420 -55880 108053 140372 -202342
12351 -44882 335873 -225201 291681 220759 -408468 306618 10076 23086 -313286 -50899
12340 175584 141965 -442897 -441212 199892 104032 299810 136538 -48288 107037 -162332
12329 4982 459091 363542 238294 -92373 38564 419850 84662 218081 180973 129536 102247
12318 102247 288475 23076 62806 337276 -81729 -71572 32056 169402 -98351 216588 163826
12307 163826 -474262 50232 -132146 4912 122846 -92538 84359 241848 85503 -16741 142752
12295 6354 -57729 11838 9961 63179 168187 282630 -253661 14640 141342 74840 53052
$$ packed form
12375c8750A32375P7214H5993a19205A85269q9243J51871H7051f8877C47231a90238
12363b49660B63923M3589d21606K4839F0465a4708A04420e5880A08053L2319b02342
12351d4882C35873b25201B91681p0922d08468C06618A0076J3010c13286e0899
12340A75584l3619d42897J685A99892r5860J95778A36538d8288A07037a62332
12329D982M54109r5549j25248i2373C8564L81286H4662J33419l7108n1437k7289
12318A02247J86228B3076L9730K74470h1729J0157C2056J37346i8351B16588n2762
12307A63826d74262E0232a32146D912J17934i2538H4359J57489H5503a6741A42752
12295F354e7729A1838j877N3218J05008J14443b53661A4640J26702o6502k1788
$$ plain form
12284 53052 -101406 285872 95301 -81255 32573 1894 57204 414039 21323 85126 317365
12273 317365 64422 180826 -89269 81291 377024 -52367 175647 430440 40230 265420
12263 265420 -174497 270764 350517 -168973 239227 -24380 118572 21313 76665 5025 -237088
12251 -64673 106105 285613 15946 206638 -170347 253294 292773 -58584 127731 149423
12241 149423 -62938 -183286 -99076 110344 -128495 587312 11942 68424 219357 -170564
12230 471581 204067 10753 340151 77645 30881 405774 -18920 -130050 -53615 39246 222841
12219 222841 9596 250989 350367 426391 129877 -28420 68021 -43107 626318 -59614 349677
12207 -14654 399741 9163 -22012 309939 29460 271443 -25302 166826 157771 113103 303546
$$ packed form
12284E3052a01406B85872I5301h1255C2573A894N5310L56835B1323O3803K32239
12273C17365F4422J16404h9269H1291K95733e2367A75647K54793D0230K25190
12263B65420a74497B70764P9753a68973B39227b4380A18572B1313N5352E025b37088
12251f4673A06105J79508A5946J90692a70347B53294L9479e8584A27731K1692
12241A49423f2938j20348Q4210A10344a28495E87312A1942N6482J50933a70564
12230D71581B04067A0753L29398G7645C0881L74893a8920j11130e3615C9246J83595
12219B22841I596K41393R9378P6024A29877b8420F8021d3107F26318e9614C49677
12207a4654C99741I163b2012C09939B9460K41983b5302A66826r055m4668J90443
$$ plain form
12196 303546 217377 -9717 285751 273643 50043 35150 425512 363839 278741 118814 56512
12184 147546 318256 162393 167234 72782 79673 23152 40917 50642 137649 474603 391628
12173 391628 166932 216536 209773 364229 -63018 124603 408820 186785 384755 -97556
12162 279954 95091 210148 -92422 203676 34291 -56272 -135731 253825 -433650 146743
12151 -24640 122003 193240 -14766 202137 -19854 201781 347454 198862 166031 -34216 266155
12139 163735 -145998 168435 -371125 178833 -109004 246561 -185311 -91613 73296 311173
12129 311173 100629 4612 -245588 -84025 364135 186309 123298 53902 141417 207933 178007
12118 178007 32939 94714 -14719 102797 144158 23278 -43597 202411 -15115 -515397 271903
$$ packed form
12196C03546q6169i717B85751j2108E0043j4893L90362o1673q5098A18814E6512
12184A47546J70710j55863M841G2782O891B3152J7765R725Q7007L36954q2975
12173C91628A66932M9604o763J54456f3018A24603K84217A86785J97970i7556
12162B79954I5091J15057i2422B03676C4291e6272p9459B53825d33650A46743
12151b4640A22003P1237a4766B02137a9854B01781J45673j48592l2831c4216B66155
12139A63735a45998A68435c71125A78833a09004B46561a85311i1613G3296K37877
12129C11173A00629D612b45588h4025C64135j77826o3011E3902Q7515O6516k9926
12118A78007C2939O1775a4719A02797M1361B3278d3597B02411a5115n00282B71903
$$ plain form
12106 -35211 312499 -192353 26841 -136568 238153 225986 115358 179410 254143 71932 205314
12095 205314 17088 -11625 -116740 334583 -93231 313358 195593 -220888 267574 106245
12084 -25639 12793 -76226 29764 140818 89641 -69452 391532 -51846 -83395 -193416 37494
12072 184769 -162563 -29483 49507 -136586 -75134 -131864 235140 -69845 256591 85201 15209
12060 214177 -15822 283314 -110693 161307 -333877 100628 44229 36982 134377 82105 -208609
12048 263399 -55370 88743 123374 -118495 -175125 110367 197216 -118515 -36840 247025 -84315
12036 -132324 420973 -156255 -198606 320173 234746 19077 -215173 -95172 264788 -22815
12025 304994 124176 -362908 281326 444227 134382 -2969 183605 -56515 -227158 145336
$$ packed form
12106c5211C12499a92353B6841a36568B38153j2167j10628O4052P4733G1932J33382
12095B05314A7088a1625j05115C34583i3231C13358j17765b20888B67574A06245
12084b5639A2793g6226B9764J11054n1177f9452C91532e1846l1549j10021C7494
12072A84769a62563b9483D9507a36586O1452n6730B35140f9845B56591H5201A5209
12060B14177a5822B83314a10693A61307c33877A00628D4229p247R7395n2272b08609
12048B63399e5370H8743L4631a18495n6630A10367Q6849a18515c6840B47025h4315
12036a32324D20973a56255m2351C20173q5427A9077b15173i5172B64788b2815
12025C04994A24176c62908B81326J62901A34382b969A83605e6515j70643A45336
$$ plain form
12014 187150 125220 217923 207081 82310 147927 134791 -206343 99138 353189 -78917 72432
12002 91012 -260863 -261033 177019 24408 180909 -281806 -278199 998 287389 123339 -106039
11990 -218717 95263 -100496 -445891 -144885 162702 -373960 -66359 -193173 -120604 37801
11979 -135116 167399 -224466 97584 -173711 57061 -187957 103831 -92081 -48186 -86583
11969 -86583 94214 -144526 224616 -195784 198184 -108152 270550 97333 -239305 -137194
11959 -137194 -92444 -21324 -78850 39603 -165251 -149981 -258951 100627 -76543 56167 -17412
11947 -206307 71097 129784 90609 -67464 128590 442944 68552 -360544 -328690 50789 -206203
11935 -59792 -64781 -160890 -199932 -43104 -130397 -64193 268969 -217648 -293705 58269 -222210
$$ packed form
12014A87150o1930R2703j0842H2310O5617j3136b06343I9138K54051g8917G2432
12002I1012b60863j70A77019B4408J56501b81806L607I98K86391A23339a06039
11990b18717I5263a00496l45395a44885A62702c73960f6359j26814P2569C7801
11979a35116A67399b24466I7584a73711E7061a87957A03831i2081M3895l8397
11969h6583I4214a44526B24616a95784A98184a08152B70550I7333b39305J02111
11959a37194M4750b1324n7526C9603a65251J5270j08970A00627g6543E6167a7412
11947b06307G1097N8687l9175f7464A28590L14354F8552c60544L1854E0789b06203
11935e9792m989r6109l9042d3104q7293f4193B68969b17648p6057E8269b22210
$$ plain form
11923 38913 -70096 -138574 -28361 37674 -199974 8136 284177 -43872 134369 132843 48013
11911 63502 262039 -146515 265965 -32361 -83735 192984 131308 26909 -42767 -119155 131862
11899 -138692 51558 125480 -152176 -36962 6382 83841 -85612 85112 63397 -42248 276768
11887 -111594 -35172 -315163 -160595 -63725 -350967 -175184 -29389 -321405 47457 -67492
11876 8625 -185059 -111755 -422707 -32076 -168847 -204631 307350 63833 169420 -15338 -1168
11864 -378816 59772 -72197 163759 -138845 -70313 -62535 103414 -174882 -84496 372185 -113964
11852 -107943 112238 -393781 -12818 -247723 -12707 278025 171646 -161277 -168886 -21844
11841 -320158 -252839 146630 298973 199818 -104985 -191389 12785 168472 -214356 20436
$$ packed form
11923C8913g0096o8478b8361C7674a99974H136K76041d3872A34369j526D8013
11911F3502J98537a46515B65965c2361n1374A92984o1676B6909d2767p6388A31862
11899a38692E1558P3922a52176c6962F382P7459h5612H5112k1715d2248B76768
11887a11594c5172k79991J54568f3725k87242a75184b9389k92016D7457f7492
11876H625a85059P3304l10952c2076j36771l5784C07350F3833J05587a5338a168
11864c78816E9772g2197A63759a38845O8532P778A03414a74882h4496C72185a13964
11852a07943A12238c93781a2818k34905a2707B78025j06379a61277p609b1844
11841c20158O7319A46630J52343r9155a04985q6404A2785J55687b14356B0436
$$ plain form
11830 95226 237888 -142337 -272912 -7828 104566 -261528 -152850 -93191 -51568 -118999 -216628
11819 -216628 -265771 27746 -30160 -92190 -98257 173182 140537 -126920 227271 47330 65112
11808 65112 248458 -126734 72557 -99041 -90321 91084 -298360 -64434 133057 -149874 -268991
11797 -268991 187931 -70181 7402 -188779 -384639 -8888 69108 109570 71409 267174 -389730
11785 -189516 -112451 -79474 -166422 17597 -149565 -12738 164888 -94630 171228 533029 5438
11773 47134 -364109 36628 -18796 -130071 -330071 -28299 -114767 -8329 -332280 -232982 241112
11761 -12225 -55867 132400 23245 47778 -27253 -272421 -163890 -88771 248057 113047 265359
11750 265359 -26930 -287606 18892 -20893 -17275 -425282 183274 21760 -85295 57406 61061
$$ packed form
11830I5226J42662a42337j30575g828A04566b61528J08678N9659M1623o7431r7629
11819b16628m9143B7746c0160o2030o067A73182l2645a26920B27271D7330J7782
11808F5112J83346a26734G2557i9041Q720I1084b98360f4434A33057a49874j19117
11797b68991A87931g0181G402a88779j95860h888F9108M0462l8161J95765c89730
11785a89516P7065L2977q6948A7597a49565a2738A64888i4630A71228L61801E438
11773D7134c64109C6628a8796j11275k00000b8299q6468h329l23951R9298B41112
11761a2225m3642A32400B3245K4533b7253k45168J08531P5119B48057A13047J52312
11750B65359b6930k60676A8892b0893L618m08007A83274B1760h5295E7406L655
$$ plain form
11739 61061 -11851 -134529 157923 -127201 -100592 -399106 -193307 200931 -26611 -149010
11729 -149010 -95703 173244 -117048 161176 -48936 -207769 156775 -217469 179711 191023
11719 191023 40434 175814 -98775 -78611 -325500 193655 153685 -104084 -84741 -90431 -109709
11708 -109709 164835 -19163 211231 -98851 -85358 91788 9070 166006 -32791 18751 -169999
11696 -199109 332192 261714 -301307 -217811 252038 -306629 -87334 -47964 3497 266770 -48181
11684 -75434 -311978 -280745 63532 320160 26812 -149818 -72685 107317 -288950 188828
11673 80896 -92690 70068 -233004 -30982 -68294 -27112 217418 156080 -52164 -81135 48844
11661 -70410 22842 -136842 106230 169552 25944 -107301 -324654 -18347 52793 389896 9431
$$ packed form
11739F1061a1851j22678A57923a27201K6609k98514a93307B00931b6611j22399
11729a49010N3307A73244a17048A61176d8936j58833A56775b17469A79711J1312
11719A91023D0434J35380i8775K0164k46889A93655l9970a04084J9343n690j9278
11708a09709A64835a9163B11231i8851J3493I1788I070J56936c2791A8751a69999
11696a99109C32192p0478c01307Q3496B52038c06629h7334L9370C497K63273d8181
11684g5434k36544L1233F3532K56628B6812a49818g2685A07317b88950A88828
11673H0896i2690G0068b33004c0982l7312b7112B17418o1338e2164k8971D8844
11661g0410B2842a36842A06230O3322B5944a07301k17353a8347E2793L37103I431
$$ plain form
11649 278112 -23137 -7157 64942 1585 -109161 -86924 -316580 -165460 175591 105548 154594
11638 154594 -317974 -99465 245581 143239 339181 166491 48411 -149157 -160619 -12550
11627 162128 171783 89185 156164 -32432 179219 163616 -143666 156479 171112 35146 -153484
11615 215290 28035 91052 31546 -49449 -174036 31773 -73086 -250460 -196874 -79861 48810
11603 -392416 -75486 -9308 -79556 -265655 3934 99934 -57660 -330231 -78190 -86772 -106899 95000
11590 222319 -280293 -187213 44647 -316343 160557 -293492 238778 226153 -168785 66492
11579 131512 162249 -43884 -71122 207949 -110239 -108563 -43719 -141267 87996 19183 -168861
11567 28905 10471 1881 -136036 132213 -217435 98206 206037 221121 -24917 -110139 161807
$$ packed form
11649B78112b3137g157F4942A585a09161K2237k29656J51120A75591p0043M9046
11638A54594c17974i9465B45581j02342J95942A66491D8411a49157j1462a2550
11627A62128R655q2598O6979c2432A79219j5603a43666A56479J4633C5146a53484
11615B15290B8035O3017C1546d9449j24587C1773g3086j77374N3586g9861D8810
11603c92416g5486i308p0248j86099C934R6000e7660k72571g8190q582k0127I5000
11590B22319b80293R3080D4647c16343A60557b93492B38778j2625a68785F6492
11579A31512L0737d3884k7238B07949a10239J676d3719r7548H7996A9183a68861
11567B8905A0471A881a36036A32213b17435I8206J07831J5084b4917q5222A61807
$$ plain form
11555 203804 33353 28908 158576 98457 -19324 66224 -142076 -168337 -90550 242020 172857
11544 172857 3407 -57287 101956 -152021 128822 -9651 287396 275317 -1159 24966 56803
11533 56803 78385 36373 129966 -89977 -169980 -124233 218069 -20684 -61788 -49423 344088
11521 147293 386175 342001 93963 -162952 -265624 -56034 -59507 302177 133110 -75822 188230
11509 144698 130933 79628 10628 12827 317360 289632 111536 100672 26015 107996 188501
11498 188501 74434 195568 -74682 139770 66219 258887 135300 114746 121823 165586 -75444
11486 -48059 128837 19580 260906 190853 -56358 24058 -267862 -104303 -35426 332103 146705
11474 145773 -25210 204825 294599 372910 71450 19682 163649 -12446 118168 103921 399062
$$ packed form
11555B03804C3353m445J29668o0119a9324F6224a42076k6261P7787B42020o9163
11544A72857C407e7287A01956a52021A28822i651B87396j2079a159B4966L1837
11533E6803K1582C6373R3593h9977q0003M5747B18069b0684m1104J2365C44088
11521A47293K38882m4174I3963a62952j02672e6034l473C02177A33110g5822A88230
11509A44698j3765n1305A0628K199L04533k7728A11536j0864B6015Q1981Q0505
11498A88501G4434J21134g4682A39770F6219J92668j23587k0554P077M3763g5444
11486d8059A28837A9580K41326p0053e6358B4058b67862a04303c5426C32103A46705
11474A45773b5210B04825Q9774P8311G1450A9682J43967a2446A18168j4247K95141
$$ plain form
11463 399062 254475 324836 91751 376660 17431 104577 -2225 -9478 -149440 7583 285620
11452 285620 159778 -77561 -162920 138101 118781 -111431 4682 134798 15567 78619 -60763
11440 -194063 370186 278086 105856 90384 12305 -145266 180950 25676 291252 121481
11429 96120 -74819 389907 -25951 -101628 -297872 170493 113241 11469 -19792 -125664 -294486
11418 -294486 112824 45287 68478 62322 87993 -168929 114459 -85693 156472 242487 -150670
11406 -40736 -8132 -23413 -375485 22362 -105166 79781 224471 271702 114020 230021 120642
11395 120642 -41508 175526 -8883 212357 37036 -302509 -40305 126871 -444957 -33801 104061
11383 25644 299627 165930 -242781 -16285 19271 -5060 -134603 201996 398071 -41857 163659
$$ packed form
11463C99062j44587P0361I1751K84909A7431Q7146b225p253j39962G583K78037
11452B85620j25842g7561q5359A38101j9320a11431D682J30116A5567O3052f0763
11440a94063C70186r2100A05856j5472A2305a45266A80950B5676K65576A21481
11429I6120g4819C89907b5951p5677j96244A70493n7252A1469a9792j05872j68822
11418b94486A12824D5287K3191o156K5671a68929A14459h5693A56472Q6015a50670
11406d0736h132j5281l52072B2362a05166G9781J44690M7231A14020J16001j09379
11395A20642d1508A75526h883B12357C7036c02509d0305A26871d44957c3801A04061
11383B5644K73983j33697b42781a6285A9271e060j29543B01996J96075d1857A63659
$$ plain form
11371 207565 -3332 40165 197769 -63633 -166709 -219423 2231 -82260 -401849 108093 5643
11359 -262671 -36438 -137314 -83407 276046 -406490 118917 -437854 65792 -21794 86616
11348 -297886 85834 -79589 161912 -61329 -173592 -253654 187314 31820 -257807 77092 8356
11336 -207609 -137981 126675 -143514 -4597 5165 -103601 -23853 -31608 120291 34488 -260116
11324 193114 -77177 130978 -3335 46607 327682 -186009 -236490 33041 27092 178923 295527
11313 295527 -87954 -43013 -57037 -231014 172537 -93311 -35548 -35185 -285102 -228870 -129252
11302 -129252 28065 -8100 17782 -26666 86424 -67292 -115077 -118651 -325837 141330 -127011
11290 7713 -3552 14561 -38614 -164073 -142803 -98896 -63286 -214857 -97584 -65772 85684 -233966
$$ packed form
11371B07565c332D0165J57604f3633j03076n2714B231h2260l19589A08093E643
11359b62671c6438j00876N3907B76046d06490A18917d37854F5792b1794H6616
11348b97886H5834g9589A61912f1329j12263q0062A87314C1820b57807G7092H356
11336b07609O9628A26675a43514d597E165a03601b3853p755A20291C4488b60116
11324A93114g7177A30978c335D6607K81075a86009n0481C3041n949J51831J16604
11313B95527h7954d3013j4024j73977A72537i3311c5548L63k49917N6232R9618
11302a29252B8065h100A7782b6666H6424f7292m7785l574k07186A41330a27011
11290G713c552A4561c8614j25459K1270M3907L5610j51571i7584L1812H5684b33966
$$ plain form
11277 -268018 -31263 58490 -74155 -124371 -167897 -301924 91730 91677 -49791 -177803 -32510 -101772
11265 -101772 -13387 -104568 -132389 -361454 -31273 138685 -219700 -30393 -150229 -127341 -258039
11254 -258039 -180927 -142999 -79597 39517 6089 -73316 -195527 -68686 -218323 -94717 -106250
11243 -106250 -5307 -31766 -246358 -83936 -264768 -14472 -92692 17692 -119558 -269465 -113657
11231 -84400 -193262 106564 -150082 292244 -187304 -82296 -156975 -65513 -4863 -98192 -49317
11220 -49317 258879 -141469 -115945 98717 230950 141256 -153957 -60168 89669 -132996 -293022
11209 -293022 -216247 177699 67531 -26831 54647 235300 129017 -85261 7391 -169399 -320272
11198 -320272 56678 -274462 -316226 145141 -153198 -10971 -121563 122529 -34983 314069
$$ packed form
11277b68018c1263E8490g4155n0216m3526j34027I1730n3d9791j28012c2510o9262
11265a01772a3387r1181k7821k29065c1273A38685b19700c0393j19836K2888j30698
11254b58039P7112L7928O3402C9517F089g3316j22211f8686j49637i4717j1533
11243a06250e307k6459k14592h3936j80832a4472p8220A7692a19558j49907a13657
11231h4400j08862A06564a50082B92244a87304h2296p4679f5513d863r3329M8875
11220d9317B58879a41469K5524I8717J32233q9694a53957f0168H9669a32996j60026
11209b93022P6775A77699F7531b6831E4647J80653j06283h5261G391a69399j50873
11198c20272E6678b74462m1764A45141a53198a0971j10592A22529c4983C14069
$$ plain form
11187 13920 -234884 -170170 -41869 -47471 -159381 -67074 186857 90721 30954 403730 -65360
11175 -242768 125135 -359398 71082 143657 -60143 -16876 -127256 -115686 -17693 -83175 214017
11163 -67294 -236316 3734 83694 -266084 -152625 313688 97186 -27661 -17841 -30473 -105157
11152 -105157 -206512 -181952 315155 -7658 49132 -168485 -58918 33367 -203691 346651 -24091
11140 13815 -30593 271092 14870 94068 -136395 -15467 85116 -35121 -88322 -53952 -36285
11129 -36285 -178258 19320 318783 146360 19179 277844 -129351 -173265 -29624 337236
11118 85545 15406 -61235 -90591 36172 111999 -270519 -41475 -169523 -19615 -34493 103427
11106 -159129 38795 178107 186354 28057 163772 -124076 334554 26433 248619 13993 -25680
$$ packed form
11187A3920b34884O4714d1869n602j11910f7074A86857I0721C0954L72776f5360
11175b42768A25135c59398G1082P2575f0143a6876j10380J1570a7693o5482B14017
11163f7294j69022C734P9960b66084J13459C13688I7186b7661R820j2632p4684
11152a05157j01355K4560C15155g658D9132a68485e8918C3367b03691C46651b4091
11140A3815c0593B71092A4870P9198a36395a5467H5116c5121n3201L4370J7667
11129c6285j41973A9320K99463A46360A9179K58665a29351m3914b9624C37236
11118H5545A5406f1235k9356C6172P5827b70519d1475j28048a9615j4878A03427
11106a59129C8795J39312Q247B8057J35715a24076C34554B6433K22186A3993b5680
$$ plain form
11094 -42783 327045 148231 23383 -138751 247297 366777 260393 -49164 264001 75157
11083 258793 212026 -138190 220414 227329 233964 61906 157842 216044 289358 193607 -74321
11071 -43419 -17787 328976 -201488 -17222 304040 557926 199487 417957 364413 74958
11060 311966 801463 188245 334083 315544 284753 517633 478222 423238 654729 709470
11050 709470 583827 645428 691300 910319 806273 772542 694289 770446 742794 620934 790462
11039 790462 825173 643568 451185 698466 678847 606435 630757 1002630 641523 801317
11029 801317 626420 828525 547388 544489 573680 408375 622997 691590 494208 601898
11019 601898 793843 389446 418482 464225 777001 696161 575655 782622 408418 439690
$$ packed form
11094d2783C27045A48231B3383a38751B47297J19480j06384d9164B64001G5157
11083B58793m6767a38190B20414O915O635F1906R5936N8202P3314r5751g4321
11071d3419a7787C28976b01488a7222C04040K53886A99487K18470n3544G4958
11060C11966M89497A88245J45838j8539l0791K32880l9411n4984K31491N4741
11050G09470j25643O1601M5872K19019j04046l3731p8253P6157k7652j21860J69528
11039G90462L4711j81605j92383K47281j9619p2412K4322L71873l61107J59794
11029H01317j74897K02105k81137k899K9191j65305K14622O8593j97382J07690
11019F01898J91945C89446K9036M5743L12776q0840j20506K06967l74204L1272
$$ plain form
11009 439690 716319 404179 153785 755270 491030 342355 803610 701556 664126 511986
10999 511986 557425 801614 865855 387363 373890 867029 534686 638333 553452 997154
10989 997154 648188 721314 395942 754336 1167430 499022 695701 998669 723897 968480
10979 968480 1207271 722579 917713 985574 896484 1319776 1551947 1540537 1801503 2428484
10969 2428484 2561431 2457889 2312040 2818010 2543184 2708112 2682173 2263449 2027100 1571224
10959 1571224 1215515 1380736 1316015 1517954 1193115 1449688 1248673 1563785 1387595 1330451
10949 1330451 1178349 879375 920494 879576 414411 464893 460951 205056 209946 -72702 33192
10937 64782 296241 288431 401029 -56682 -4854 96508 -85717 176291 -285534 370227 88120
$$ packed form
11009D39690K76629l12140A53785O01485k64240j48675M61255j02054l7430j52140
10999E11986M5439K44189O4241C87363j3473M93139l32343J03647q4881M43702
10989I97154l48966P3126l25372L58394M13094D99022J96679L02968k74772K44583
10979I68480K38791m84692J95134O7861q9090M23292K32171j1410K60966O26981
10969B428484J32947j03542j45849N05970k74826J64928k5939m18724k36349m55876
10959A571224l55709J65221o4721K01939l24839K56573k01015L15112j76190n7144
10949A330451j52102k98974M1119m0918D14411N0482l942B05056M890g2702C3192
10937F4782K31459p810J12598e6682d854I6508h5717A76291b85534C70227H8120
$$ plain form
10925 330994 116336 343897 70495 -64065 -209059 579557 -212673 -142000 13121 -107638
10914 -6507 -81520 7707 -235312 192777 -148154 -133308 15256 -232225 -210817 -16123 99916
10902 165428 -168878 79322 -343731 -196535 -114383 20692 -178915 310125 -54543 -70493
10892 -70493 -126434 5975 -46468 -68466 -200717 -211297 28584 -51944 -40739 27364 9007 180846
10880 180846 -206317 -79204 -198646 -99440 -290532 -23576 -112475 -160491 -25938 -126418 -96821
10869 -96821 -215042 295513 23932 62951 -113414 145156 -131166 68727 -182091 -102294
10859 -102294 306906 45356 169042 329838 -151325 142306 -168055 46594 177327 21574
10848 -138804 203873 198634 -273705 -223344 -224654 141694 106351 195433 -187318 -244419 69856
$$ packed form
10925C30994A16336K27561G0495f4065j44994E79557b12673P0673A3121a07638
10914f507p5013G707b35312A92777a48154J4846A5256b32225K1408a6123I9916
10902A65428a68878G9322c43731J47196Q2152B0692a78915C10125e4543j5950
10892g0493n5941E975d6468k1998j32251j0580B8584e1944J1205B7364I007J71839
10880A80846b06317g9204j19442R9206j91092b3576q8899m8016b5938j00480K9597
10869i6821j18221B95513B3932L9019a13414A45156a31166F8727a82091P9797
10859a02294C06906D5356J23686J60796a51325A42306a68055D6594J30733B1574
10848a38804B03873n239b73705N0361j310A41694l5343Q9082a87318n7101F9856
$$ plain form
10836 -108516 -138178 -436578 54751 -29741 -30329 -86406 -47626 310730 -5753 102554 114028
10825 114028 -84473 128368 317943 201113 -104704 -216351 -235832 263918 92913 -92936
10814 45121 -313439 92015 -122153 135607 -181053 2491 -66695 141044 -94646 -129503 -28672
10802 89016 184733 199773 -411104 -39624 108342 242053 -147117 -353857 70227 -270659
10791 21903 -382468 -39558 -54290 -10937 -207010 -89820 -17283 -289572 103731 -45209 -255751
10780 -255751 15372 45217 -253775 130598 -256223 -394784 -10929 261623 -80481 -194847
10770 -194847 -288881 70811 -197810 -91793 -430409 -44198 160878 4840 55330 -180081 -420866
10759 -420866 -53318 -240997 -63256 178961 141547 -257832 122800 -26131 -26285 119416 -176780
$$ packed form
10836a08516k9662k98400E4751b9741n88n6077L8780C10730e753A02554J1474
10825A14028h4473A28368J89575j16830a04704j11647j9481B63918I2913i2936
10814D5121c13439I2015a22153A35607a81053B491f6695A41044i4646l4857b8672
10802H9016R5717J5040d11104c9624A08342J33711a47117k06740G0227b70659
10791B1903c82468c9558j4732a0937j96073h9820a7283k72289A03731d5209k10542
10780b55751A5372K9845b53775A30598b56223j38561a0929B61623h0481j14366
10770a94847r4034G0811a97810i1793l38616d4198A60878D840N0490a80081k40785
10759d20866e3318j87679f3256A78961l7414b57832A22800b6131j54A19416a76780
$$ plain form
10747 32980 -167831 -37238 -196676 -25732 -90021 -262087 110962 263968 -220431 23564
10736 42072 -106786 -292462 -88286 -17317 -220131 -107414 -134774 256377 -197157 90270
10725 -36175 -137101 -348156 -21453 54696 100776 -444524 -55908 41250 92626 -57482 345389
10713 -234221 124656 183026 -340635 -234030 -226856 -98475 223842 -136626 -78128 -76226 -49190
10702 -49190 -60545 -429725 40235 -336885 -60362 -19664 -65630 132372 84297 -12764 208973
10690 -196650 -75013 -1690 -183159 28449 -106411 -223776 -197969 -131354 -60102 93676 -235192
10678 -313754 71422 283587 -83002 13778 -142598 -129114 180791 -67616 -233311 -58636 138202
10666 -116209 210580 -116419 39639 228632 504192 270826 -203279 265640 1579 140819
$$ packed form
10747C2980a67831c7238j59438b5732o4289j72066A10962J53006b20431B3564
10736D2072a06786j85676h8286a7317k02814a07414k7360B56377a97157I0270
10725c6175j00926k11055b1453E4696M6080d44524e5908D1250N1376e7482C45389
10713b34221A24656N8370c40635J06605P174i8475B23842a36626N8498J902K7036
10702d9190j1355l69180D0235c36885f0362a9664m5966A32372m8075a2764B08973
10690a96650g5013a690j81469B8449a06411j17365K5807O6615f0102I3676b35192
10678c13754G1422K12165h3002A3778a42598J3484A80791f7616j65695e8636A38202
10666a16209B10580a16419C9639J88993K75560k33366b03279B65640A579J39240
$$ plain form
10656 140819 -306434 115014 -72254 -10800 130285 39490 -445238 137580 -201404 -149248
10646 -149248 -130132 101805 229541 -112028 144492 -394346 159220 -47836 -50113 -21176
10635 162760 -301163 153993 -29669 -129948 -19605 -522983 -302903 -120728 -214177 -156120
10625 -156120 -101697 -62695 167032 8016 109566 -133012 77986 -8082 -64334 -343081 31614
10613 39669 22659 -272083 -224894 -183291 -1843 -140115 57941 161843 11676 155914 -145578
10601 -394855 110736 -98776 306207 -205379 -222471 -1824 68207 -411181 206667 -103924
10590 59974 -187172 -326774 209060 -115846 -121864 -138677 -160311 -452521 -499596 213592 -117997
10578 310846 31838 -217308 84048 -22908 -88829 -47400 -24129 -270725 8666 263370 -320733
$$ packed form
10656A40819c06434A15014g2254a0800A30285C9490d45238A37580b01404N2156
10646a49248J9116A01805J27736a12028A44492c94346A59220d7836k277b1176
10635A62760c01163A53993b9669j00279a9605n03378K20080a20728r3449N8057
10625a56120N4423L9002A67032H016J01550a33012G7986h082n6252k78747C1614
10613C9669j7010b72083M7189M1603a843j38272E7941J03902A1676J44238a45578
10601c94855A10736i8776C06207b05379j7092a824F8207d11181B06667a03924
10590E9974a87172j39602B09060a15846o018j6813k1634k92210m7075B13592a17997
10578C10846C1838b17308H4048b2908o5921M1429K3271k46596H666K54704c20733
$$ plain form
10566 -203087 -233408 124719 -79226 383535 71536 1175 -176461 -51053 -133058 -226526 -186912
10555 -186912 -117434 124505 -169414 7866 357183 143415 -194937 91351 -76341 -256415
10545 -256415 4339 -243699 286760 -63181 158241 -90176 320315 -288193 90805 35585 -65090
10533 -43488 3996 -166197 -182377 -32840 -122882 -49939 74014 -68950 -155869 60563 -217889
10521 -294211 -181359 -142919 -128427 222469 -236733 63309 -191510 -309235 -322847 -193525
10511 -193525 128898 130129 229411 -594642 -171671 -6731 167082 -293883 -42815 -111903 -157329
10500 -157329 233395 23716 195058 168366 207627 -15058 -167420 39299 208268 -157707
10489 717 -19856 -5343 -29800 84735 77646 400710 -318054 -144081 -38446 112827 157299 241502
$$ packed form
10566b03087l0321A24719g9226C83535G1536A175a76461e1053q2005r3468L9614
10555a86912O9478A24505a69414G866L49317A43415a94937I1351g6341j80074
10545b56415D339b43699B86760f3181A58241i0176C20315b88193I0805C5585f5090
10533d3488C996a66197j6180c2840r0042d9939G4014f8950q6919F0563b17889
10521b94211J12852L8440J4492B22469b36733F3309a91510j17725j3612J29322
10511a93525A28898J231R9282e94642a71671f731A67082b93883d2815o9088m5426
10500a57329B33395B3716J71342k6692L9261a5058j52362C9299J68969a57707
10489G17a9856e343k4457H4735p089L23064c18054a44081c8446A12827M4472Q4203
$$ plain form
10477 241502 226147 331932 340670 392391 371798 408940 202367 -28904 30700 -193808 277032
10465 -124320 -205821 29618 182774 -216630 -355 145286 38622 -43272 -244813 -173665 322973
10453 18301 -165306 44562 -462177 57070 -7380 49466 -360894 289418 54998 -169273 -173995
10442 -173995 -39474 -137923 175246 104080 -12244 -224154 53850 187196 -306916 -122314
10431 -187049 466226 -104706 -487722 -21820 137168 128446 188812 -372372 184272 29291
10420 -426474 -44699 -1863 -211401 -207142 -159167 13382 227774 1315 58162 9955 68142 317620
10408 317620 315884 -58442 -17074 76119 -250225 -67502 -230152 106482 -44900 -60412 1618
10396 157089 75571 9447 -400940 276026 129015 -217044 198821 297384 302114 258723 -3741
$$ packed form
10477B41502j5355J05785Q738N1721k0593L7142B02367b8904C0700a93808B77032
10465a24320q1501B9618J53156b16630c55A45286C8622d3272k01541P1148C22973
10453A8301a65306D4562d62177E7070g380D9466c60894B89418E4998a69273m722
10442a73995c9474r8449A75246p1166a2244k11910E3850J33346c06916a22314
10431a87049D66226a04706l83016b1820A37168q722O0366c72372A84272B9291
10420d26474d4699a863k09538M259M7975A3382K14392A315N6847I955N8187K49478
10408C17620j736e8442a7074G6119b50225f7502j62650A06482d4900j5512A618
10396A57089G5571I447d00940B76026A29015b17044A98821R8563M730m3391c741
$$ plain form
10384 150683 41979 -41873 -65961 32471 93247 -130139 310063 -67270 177963 -3224 123067
10372 78162 61755 114135 -54889 106333 324601 469791 334877 233620 172340 852283
10362 852283 435452 138191 413256 382590 92302 276603 328942 238988 207185 414188
10352 414188 122343 339536 227017 -46550 343526 575066 265774 11071 276530 522537
10342 522537 546500 396354 649158 186524 330373 78773 -35894 -37416 414022 246581
10332 246581 183046 97476 41325 320950 -46634 309225 30803 174797 381975 -233751
10321 -93075 215922 226204 149414 131305 -44410 353774 -39177 30788 -17953 30992 -49162
10309 86736 191641 -97319 -109496 2674 82970 -154770 -261724 -256873 -16415 -94945 -36431
$$ packed form
10384A50683D1979d1873k4088C2471O0776a30139C10063f7270A77963c224A23067
10372G8162j6407N2380e4889A06333K18268J45190j34914j01257o1280O79943
10362H52283m16831A38191K75065l0666I2302J84301N2339q9954l1803K07003
10352D14188A22343K17193j12519d6550C43526K31540B65774A1071K65459K46007
10342E22537K3963j50146K52804A86524J43849G8773c5894j522D14022j67441
10332B46581o3535q5570D1325K79625d6634C09225C0803J43994K07178b33751
10321i3075B15922J0282p6790j8109d4410C53774c9177C0788a7953C0992d9162
10309H6736J04905i7319j2177B674Q0296a54770j06954M851a6415p8530c6431
$$ plain form
10297 -108156 -515671 209360 166812 90630 103849 -175436 -346804 97871 -221277 228238
10286 -163478 204994 -5046 -134229 132942 14172 -234429 126291 19735 700 -236035 -219834
10275 -219834 4204 184404 -334396 -218915 88307 -140615 124687 149920 75613 30207 -175526
10263 -160382 -1041 -14401 -26375 77129 -11444 -83283 -48270 205060 -88829 46578 292187
10252 292187 206824 390246 159413 82008 86614 -40832 152386 -145013 -44614 56532 24566
10240 -241496 -373743 -8889 -150193 227603 -360009 166759 -175559 -109336 -258625 -145604
10230 -145604 114398 38478 -230014 -115342 -262727 112125 -117564 -181896 125965 -206319
10219 -107465 147344 -24348 2624 -97140 156864 -401857 19412 116771 56654 238318 19583
$$ packed form
10297a08156m07515B09360m2548p6182J3219a75436j71368I7871b21277B28238
10286a63478B04994e046j29183A32942A4172b34429A26291A9735G00b36035J6201
10275b19834D204J80200c34396J15481H8307a40615A24687K5233p4307C0207a75526
10263a60382a041j3360j1974G7129a1444p1839L5013B05060h8829D6578K45609
10252B92187q5363J83422A59413p7405M606d0832A52386a45013d4614E6532B4566
10240b41496j32247h889j41304B27603c60009A66759a75559O6223j49289J13021
10230a45604A14398C8478b30014J14672j47385A12125a17564o4332A25965b06319
10219a07465A47344b4348B624i7140A56864d01857A9412R7359E6654J81664A9583
$$ plain form
10207 -276222 -141102 -116885 116480 -137606 99123 343148 257849 -209873 190846 194744
10197 194744 -75602 137871 4604 -29275 4889 12896 173039 -263650 136239 369328 -72463
10185 285427 -217205 -442887 -259075 -310424 -228858 -254974 132528 -194536 -192975 -113374 230163
10173 -81625 30201 -163847 334952 -78529 40232 -226039 -68141 -242376 -205069 -33676 16593
10161 57261 -315117 48340 -10077 161608 876 -55034 -216897 -12665 -173277 -190524 -53131
10149 -105041 -136950 -63056 -109262 87024 -318362 -224555 -22496 61688 -54245 -33276 -73707
10138 -73707 -117021 -31884 -19256 12812 -282095 17386 -68959 -21137 206613 124106 186120
10127 186120 79894 -56657 95414 19557 2488 -30424 -202671 -186694 -81789 180141 165682
$$ packed form
10207b76222J35120K4217A16480a37606I9123K44025q5299b09873A90846L898
10197A94744g5602A37871D604b9275D889Q007J60143b63650A36239K33089g2463
10185B85427b17205k25682J83812n1349Q1566k6116A32528a94536J561P9601B30163
10173h1625C0201a63847C34952g8529D0232b26039f8141j74235L7307c3676A6593
10161E7261c15117D8340a0077A61608H76e5034j61863a2665j60612j7247e3131
10149a05041l1909f3056m6206H7024c18362R3807b2496F1688e4245K0969m0431
10138g3707m3314c1884J2628A2812b82095A7386f8959b1137B06613q2507O2014
10127A86120G9894e6657I5414A9557B488c0424j72247J5977h1789A80141j4459
$$ plain form
10116 165682 67633 20070 -107319 -192808 28022 -56866 -103994 -386088 66651 72780 -91521
10104 74746 -2030 -58037 -329516 -116927 -151268 174755 -45289 8688 44049 149415 -48314
10092 -61190 375608 -31426 51632 -150378 -69572 -204511 -140522 -160065 -244660 19134 142573
10081 142573 -159280 148078 57379 -379496 -169998 3831 -154708 -8829 -18188 -343329 28606
10069 98022 37725 10 -168501 -10071 -42424 45244 128592 283955 195682 -194896 -68725 -51369
10057 -51369 -225698 202863 -161490 -171603 236484 23626 -86748 -106742 -21028 144521 -260740
10045 -163996 -116103 -226916 43250 26703 23492 105313 -71066 -55014 87728 -286560 32890
10033 -292535 -214192 -26975 -141259 213484 359643 -4946 177220 -327362 -33663 -45565 -242815
$$ packed form
10116A65682F7633B0070a07319q5489B8022e6866m7128k82094F6651O129i1521
10104G4746b030n6007k71479a16927l4341A74755d5289H688L5361J05366d8314
10092f1190C75608c1426E1632a50378f9572j34939O3989j9543q4595A9134J23439
10081A42573a59280A48078E7379c79496a69998C831a54708h829r359l25141B8606
10069I8022C7725A0a68501a0071l2353D5244Q3348J55363q8273a94896f8725J7356
10057e1369j74329B02863a61490j0113B36484B3626h6748j9994b1028A44521b60740
10045a63996M7893j10813D3250j6547l211Q1821g1066J6052H7728b86560C2890
10033b92535P8343b6975j14284B13484J46159d946A77220c27362c3663j1902j97250
$$ plain form
10022 -242815 -43995 88990 473314 26957 92759 -291902 -5871 -51515 82672 -224484 -76803
10010 -18578 -108857 -196798 -72139 61149 -425 -20726 -108784 -36298 75026 118076 -251417 -141382
9998 -141382 18308 5844 -114740 49547 -285708 -47319 11621 -15887 132416 -265129 -183799
9987 -183799 -32261 -256109 -263643 -243715 12744 271155 38302 31775 5542 132931 -225554
9975 -202003 -236734 -182986 -301996 26278 -127324 -21349 -419451 -111142 31955 -311635 126270
9963 -75592 80936 -235196 -69975 271387 193677 227762 -145878 15722 -251630 175277 171900
9952 171900 211464 -159475 -109795 14763 -221190 -217547 141398 -179283 -318893 117461 -108159
9940 -331540 44502 84544 -49574 -25858 -157872 7622 -38972 364649 -221076 13055 -54036
$$ packed form
10022b42815d3995H8990L84324B6957O5802b91902e871m5644H2672b24484g6803
10010a8578r0279q7941g2139F1149d25k0301q8058c6298G5026M3050b51417J10035
9998a41382A8308E844a14740D9547b85708d7319A1621a5887A32416b65129Q1330
9987a83799c2261k23848p534J9928A2744K58411C8302o527E542J27389b25554
9975b02003l4731N3748j19010B6278a27324b1349l98102a11142C1955c11635A26270
9963g5592H0936b35196f9975B71387p7710L4085a45878A5722b51630A75277l377
9952A71900L9564a59475M9680A4763b21190L643A41398a79283j39610A17461a08159
9940c31540D4502M0042d9574K3716j32014G622c8972C64649b21076A3055e4036
$$ plain form
9928 -169634 -43953 47554 -203613 -93143 -52677 -217980 -81566 106741 213920 -44636 72102
9916 -471067 -58440 -46091 -102945 -26637 192610 -398986 -223379 -155789 -16405 -166618 -41895
9904 78722 -296036 42436 -133294 4823 -343126 -90857 -139229 185942 -373221 68366 -134817
9892 -19794 -182356 -4457 -263748 -257707 -30439 90856 291188 361239 -156735 96167 128065
9881 128065 -210031 -254633 41286 -27806 -119282 -50771 165228 -309102 -99223 -230067 -223270
9870 -223270 150807 -336828 298356 39544 -114925 10089 -290840 -171169 -214726 132133
9859 -212423 206073 -154874 -162647 107556 29880 -288131 -13588 258822 -153982 -237871 -97789
9847 42557 -169806 152357 136739 -252427 -59124 20917 1459 -17727 218343 -240116 -55820
$$ packed form
9928a69634d3953D7554b03613i3143M0466j65303h1566A06741J07179d4636G2102
9916d71067e8440J2349n6854b6637A92610c98986J75607O7590a6405j50213d1895
9904G8722b96036D2436a33294D823c43126i0857m8372A85942c73221F8366a34817
9892a9794j62562d457k59291O041c0439I0856K00332P0051a56735I6167L1898
9881A28065b10031m4602D1286b7806r1476e0771A65228c09102i9223j30844O797
9870b23270A50807c36828B98356C9544a14925A0089b90840J19671m3557A32133
9859b12423B06073a54874p773A07556B9880b88131a3588B58822a53982q3889i7789
9847D2557a69806A52357j5618b52427e9124B0917A459a7727B18343b40116e5820
$$ plain form
9835 -48271 -98771 213448 -126796 199813 28893 -125007 -84780 -57035 -70944 -303035 -170031
9824 -170031 36689 -90961 155515 -451670 -18052 -126331 -163433 -89621 -117197 -121180 25747
9812 38939 -32672 -263306 87921 -207281 5709 62172 -51170 -147654 -11594 -62998 25271 6175
9799 108580 41348 -351988 -185241 -67723 206519 -140015 -77384 -19450 244983 -141622
9788 17059 -33068 -222942 371070 103859 -108025 5350 -179235 166742 -61182 -62671 -32627
9777 -32627 25240 -364462 16616 28218 -277895 20936 -202698 151691 -308669 -264233 -151175
9766 -151175 -146395 -44471 -20564 -149009 68790 -84626 -165361 -12675 99135 -150135 190444
9754 107252 -54669 -82533 211889 75319 134713 -80358 76421 -73979 -44804 -224284 49086
$$ packed form
9835d8271n0500B13448a26796A99813B8893a25007M0227K7745j3909k32091J33004
9824a70031C6689i0961A55515d51670a8052j08279l7102P3812k7576l983B5747
9812C8939c2672k30634H7921b07281E709N6463e1170r6484a1594n1404B5271F175
9799A08580D1348c51988J66747f7723B06519a40015O2631a9450B44983a41622
9788A7059c3068j89874C71070A03859a08025E350a79235A66742f1182j489L0044
9777c2627B5240c64462A6616J1602b77895B0936b02698A51691c08669M4436J13058
9766a51175M780d4471b0564j28445F8790h4626q0735a2675I9135a50135A90444
9754A07252e4669k7864B11889G5319N9394h0358G6421g3979K9175j79480D9086
$$ plain form
9742 281218 -222994 -130465 -53295 -127700 -195164 44245 -52360 53406 -21247 123628 -74424
9730 112611 -195402 -288797 133599 115932 42463 254876 -118059 96240 -22635 161975 51402
9718 -260513 20788 -7769 -18826 100090 -159278 -1076 -78286 -379606 -95824 225884 -261384
9706 -390997 -60496 42428 62839 134384 -259336 35367 77298 -129593 20581 90163 65895
9695 65895 -160595 -427337 -248102 200552 105191 -139208 141661 243285 -16186 -171055
9685 -171055 142956 -71060 -218722 -281546 -301031 38638 94935 108872 -142274 -7856 -81894
9674 -81894 -68143 -44679 -180683 -251135 -92754 -295067 -433299 -192069 89532 79791 -255187
9662 59518 -126400 -238446 -159979 -136807 -71911 48400 -82123 131727 138782 -97391 -164357
$$ packed form
9742B81218b22994R2529e3295p4405o7464D4245e2360E3406b1247A23628g4424
9730A12611a95402r3395A33599j7667D2463K12413a18059I6240b2635A61975E1402
9718b60513B0788g769j1057A00090a59278a076p7210l01320i5824B25884b61384
9706c90997f0496D2428K0411P1545b59336C5367M1931a29593B0581O9582k4268
9695F5895a60595k66742J79235B00552r5361a39208A41661J01624a6186j54869
9685a71055A42956g1060j47662o2824j9485C8638N6297J3937a42274g856p4038
9674h1894J3751K3464j36004p0452i2754k02313j38232a92069H9532r741b55187
9662E9518a26400j12046P8467K3172O4896D8400h2123A31727P055i7391o6966
$$ plain form
9651 -164357 52144 -342182 -245255 55863 -97331 -110810 -4191 -15633 -125917 93069 -292628
9639 102888 -441804 -36358 89808 4722 -4290 20460 -252803 -165180 -321 -412755 182226 194160
9627 194160 -254465 -157148 59665 84561 -152905 -92748 -309012 228299 -121251 -333795
9617 -333795 267115 31392 -97970 -282064 36298 -1520 -38321 65218 -20743 112279 -149609
9605 33581 -45380 101740 -280319 126759 -58852 -50036 213859 -20346 305563 -37358 49722
9593 -276899 -201108 -239398 -120278 -277066 -20012 -342003 -50739 -282317 -396269 -71499 385118
9581 -97085 -143991 -290998 7762 43617 34356 -7323 -354056 -275453 -449159 -152039 64438 489153
9569 489153 167748 -43976 -20192 -297687 -212261 206405 -155343 -268096 -35462 97436 -90664
$$ packed form
9651a64357E2144c42182R6927E5863i7331j3479d191j1442j10284I3069b92628
9639A02888d41804c6358H9808D722d290B0460b52803Q7623c21m12434A82226J1934
9627A94160b54465R7317E9665K4896a52905O0157k16264B28299a21251k12544
9617c33795B67115C1392i7970j84094C6298a520l6801F5218b0743A12279a49609
9605C3581d5380A01740b80319A26759e8852Q816B13859b0346C05563c7358D9722
9593b76899P5791l8290J19120j56788b0012l21991e0739k31578j13952g1499C85118
9581i7085m6906j47007G762L5855r261g323l46733P8603j73706a52039F4438M24715
9569D89153A67748d3976b0192k77495Q5426B06405a55343j12753c5462I7436i0664
$$ plain form
9557 49715 -26175 86269 -244469 -116083 -78360 219162 117105 -144373 -151990 -51142 -23463
9545 63289 -168512 -141450 -148955 95940 -262175 329333 -43665 68918 -137773 97418 168034
9534 168034 -257502 -268719 169505 -815 -170154 -45234 -185791 56716 -28545 289190 -151770
9522 -5977 225471 123338 80360 -11926 -70093 -183388 -272311 -40716 84612 -114469 -211697
9511 -211697 -424540 -102571 41265 41375 80568 -13652 -104981 64633 46604 -87039 128974
9499 -8724 -230401 149284 -239534 274871 123567 -383803 193007 -234758 37852 36127 -201185
9487 208028 56011 -127991 83794 -561433 -283059 94912 289730 141116 -176618 -329453
9477 -329453 59553 -404351 110038 26298 -113793 -39841 19180 -79648 164674 -68577 -40539
$$ packed form
9557D9715b6175H6269b44469a16083L7723B19162j02057a44373p617e1142b3463
9545F3289a68512K7062p505I5940b62175C29333d3665F8918a37773I7418P0616
9534A68034b57502j1217A69505h15j69339d5234j40557E6716b8545B89190a51770
9522e977B25471j02133m2978a1926n8167j13295q8923d0716H4612a14469r7228
9511b11697k12843a02571D1265J10L9193a3652r1329F4633j8029h7039A28974
9499h724k21677A49284b39534B74871A23567c83803A93007b34758C7852j725b01185
9487B08028E6011a27991H3794e61433K78374I4912J94818A41116a76618j52835
9477c29453E9553d04351A10038B6298a13793c9841A9180g9648A64674f8577K8038
$$ plain form
9466 -40539 -244351 -169676 -263798 162671 -249651 40833 189318 -115009 -44943 -426406 -209880
9454 -235840 -158042 -266162 -250951 -107746 -191750 -122766 214625 34774 42087 80778 76124
9443 76124 211941 -12828 -36823 121764 -248442 157761 49530 -140769 -132030 -146366 -66543
9431 -67670 46993 72352 -194937 -111522 -204566 -42845 43289 -159778 94290 143737 -128322
9419 44618 -79386 -142311 43738 272344 -118671 -168559 -261790 -31414 97573 76988 -258304
9407 -236241 306146 -173217 115786 153603 -147874 -103746 -242537 -170098 -332199 38308
9396 -364333 165494 -99601 -55166 45939 361984 -209020 -195280 -273392 -511711 98515 138033
9385 138033 172319 70699 -137121 -149996 -318858 149130 237450 -96857 -184923 25089 -129665
$$ packed form
9466d0539k03812P4675r4122A62671b49651D0833J48485a15009d4943l81463b09880
9454b35840P7798j08120J5211a07746q4004O8984B14625C4774P313L8691m654
9443G6124J35817a2828k3995A21764b48442A57761D9530a40769Q739j4336f6543
9431f7670D6993K5359a94937Q3415r3044d2845D3289a59778I4290M9447a28322
9419D4618g9386o2925D3738K28606a18671m9888r3231c1414I7573k0585b58304
9407b36241C06146a73217A15786L7817a47874M4128j38791P2439j62101C8308
9396c64333A65494i9601M4435D5939L16045b09020J3740p8112k38319I8515L9518
9385A38033L4286G0699a37121j2875j68862A49130Q8320i6857q8066B5089a29665
$$ plain form
9373 138863 21960 -2912 -66703 52621 -93742 116496 -55791 -153114 -80865 -329970 -296598
9362 -296598 -60159 -105619 -177322 -15362 -16919 -2195 -103855 -112851 -278122 -80346 106353 31421
9349 -71162 29399 -72578 -65726 -87898 217634 -363184 136669 52831 -318043 -56190 -78196
9338 -78196 -356730 76189 -269979 -394062 -13935 -67295 5302 30350 -26955 -113655 -266042
9327 -266042 26080 2003 303617 -28756 14726 6752 144094 -27358 -66773 -361843 -268187
9316 -268187 -177837 -299676 -286631 -285238 -77796 -35839 140323 -316334 138748 -72695 -475388
9305 -475388 44822 -56477 -2283 63938 -174009 -158902 119917 -160881 -182500 -42122 230733
9293 -35106 228560 13145 36132 -143672 -170494 88122 -59991 -74008 -229847 185088 -125419
$$ packed form
9373A38863B1960b912o3791E2621i3742A16496e5791r7323P2249k49105L3372
9362b96598f0159m5460p1703a5362j557b195j01660q996j65271h0346A06353C1421
9349g1162B9399g2578O852k2172B17634c63184A36669E2831c18043e6190k2006
9338g8196k78534G6189b69979j24083a3935n3360E302K5048b6955q6700j52387
9327b66042B6080B003L01614b8756A4726F752J37342b7358l9415k95070R3656
9316b68187R0350j21839J3045J393g7796c5839A40323c16334A38748g2695m02693
9305d75388D4822e6477b283F3938a74009J5107A19917a60881k1619d2122B30733
9293c5106B28560A3145K2987a43672k6822H8122e9991j4017j55839A85088a25419
$$ plain form
9281 68009 12272 111589 -142789 193256 122916 -59368 -248884 -54045 131373 22778 -196919
9269 -25671 -206378 143907 311236 -233161 -100163 303387 -46811 -96111 -46605 11941 -164994
9257 -315630 -172356 114 -20377 -10315 -28234 -145698 -184858 -156125 90852 103563 -29164 -102321
9245 -102321 -89304 -287347 143381 -266828 -387453 161403 246523 -35584 69427 -89875 -179728
9234 -179728 -296291 -119947 77962 -98193 -182556 62278 -402019 137013 -73222 -75225 125865
9222 -53670 140460 4858 14151 21483 39721 -79473 -276602 18161 -102702 -95584 225676 383159
9210 383159 -65806 -359208 55181 -120884 -173117 56244 -4052 -180071 65776 -205782 -253830
9199 -253830 122186 -186805 -233024 144570 -104611 18269 59253 -94479 -377961 -205446
$$ packed form
9281F8009A2272R9317a42789A93256p0340e9368j89516e4045A31373B2778a96919
9269b5671j80707A43907J67329b33161a00163C03387d6811m9300d6605A1941a64994
9257c15630J43274A14b0377J0062j7919j17464l9160K8733I0852J2711b9164p3157
9245a02321J3017j98043A43381b66828j20625A61403Q5120c5584F9427h9875q9853
9234a79728j16563a19947G7962i8193q4363F2278d02019A37013g3222k003A25865
9222e3670A40460D858R293P332J8238g9473j97129A8161a02702P118B25676J57483
9210C83159f5806k93402E5181a20884n2233E6244d052j76019F5776b05782m8048
9199b53830A22186a86805m6219A44570a04611A8269M0984i4479k83482J72515
$$ plain form
9189 -205446 88073 -394469 -49138 -111925 -30378 -219117 37118 -177916 -360536 -270806 90581
9177 -86549 152830 247334 13723 29138 -63652 -277285 -156642 134338 -200323 12754 429351
9166 429351 20274 -315370 -3511 -95227 -181060 -22077 9267 -40080 10949 -226973 62942 170083
9154 170083 137265 61068 123150 157314 252734 -151348 143730 -284432 -15882 -301304 -310931
9143 -310931 -72189 215159 302859 -54448 -161319 3012 -50416 295538 -64502 -68382 -5841 234977
9130 244312 -329635 -335841 -47662 -66114 154625 -284265 -15382 -225931 21799 76329 -146481
9118 74626 -31060 -116086 -111464 -313556 -223758 14313 1940 -13518 174180 -92224 -31229 55388
9105 -52839 305522 295546 110497 -181111 -14212 -35527 103401 -348637 -43953 -115229 -29305
$$ packed form
9189b05446H8073c94469d9138o2787c0378j88739C7118a77916j82620Q9730I0581
9177h6549A52830R4504A3723J5415f3652k13633J20643A34338b00323A2754M16597
9166D29351B0274c15370c511r1716q5833b2077I267d0080A0949b26973F2942J07141
9154A70083l2818F1068O2082L4164R5420a51348A43730b84432a5882k85422r627
9143c10931g2189B15159Q7700e4448j06871C012e0416B95538f4502l880e841B34977
9130B44312c29635o206d7662j8452A54625b84265a5382k10549B1799N4530a46481
9118G4626c1060q5026M622k02092Q9798A4313A940a3518A74180i2224c1229E5388
9105e2839C05522r976A10497a81111a4212k1315A03401c48637d3953p1276b9305
$$ plain form
9093 -161304 -59758 -39171 -111208 -63373 -359268 -139818 -176150 -269139 22992 -262637 -66041
9081 108415 12265 134970 -140916 -143229 110496 175611 -166614 -45904 -233689 -142675 55031
9069 -102821 162799 -150359 -66683 -242628 389861 153105 37523 -331392 42650 -390274
9058 -74999 59102 15171 241557 -208267 -91916 -77737 -136959 73316 -481946 -107571 57361
9046 -254568 -99390 -194430 34889 -111051 -39738 -208270 150290 -71506 -470103 3364 54737
9035 54737 -481615 -358779 -175005 207138 -38520 -94406 -27313 110703 -35317 -88786 187944
9023 -25379 -25845 -259238 -8310 -94849 108636 -343140 -40691 148123 383134 -263811 -227624
9012 -227624 103435 7290 68654 -27614 68716 -140176 -119813 -108109 225976 -94927 -152903
$$ packed form
9093a61304e9758K0587p2037M7835k95895a39818l6332r2989B2992b62637f6041
9081A08415A2265J22705a40916k313A10496O5115a66614d5904j87785R1014E5031
9069a02821A62799a50359f6683j75945C89861A53105C7523c31392D2650c90274
9058g4999E9102A5171K26386b08267i1916J4179n9222G3316d81946a07571E7361
9046b54568i9390r5040C4889a11051c9738j68532A50290g1506l98597C364N1373
9035E4737d81615J22836a75005B07138c8520n5886b7313A10703c5317n3469A87944
9023b5379m66k33393h310q6539A08636c43140d0691A48123K35011b63811L6187
9012b27624A03435G290O1364b7614F8716a40176K0363J1704B25976i4927n7976
$$ plain form
9001 -152903 -37724 289482 250361 -93222 -329225 -58242 54992 219368 -128777 278012 -141121
8989 54984 159016 -340154 -57303 164825 -126718 -148854 -322527 12929 -219953 -12552 -133749
8978 -133749 99116 -98411 -21807 26531 163808 61522 43971 -494903 48050 -426 -59614 -331769
8966 -331769 -20682 197677 -537841 -97551 80938 92950 106740 -300609 138102 160260 -56911
8954 -12571 58247 -251441 137245 -65149 12575 -373085 -35039 -210668 -379970 -161468 -320019
8943 -320019 68948 -78534 -38504 -146288 -16158 201526 29503 144522 -208853 316899 83049
8931 494140 208028 40721 -32099 25573 -115417 -78828 121207 326819 426857 555324
8921 555324 1154848 3398965 15321252 8466864 1183549 475152 338264 213887 96731
$$ packed form
9001a52903c7724B89482l9121i3222k36003e8242E4992J64376a28777B78012a41121
8989E4984J04032c40154e7303A64825a26718k2136j73673A2929b19953a2552j21197
8978a33749I9116i8411b1807B6531J37277F1522j7551d94903D8050d26n9188k72155
8966c31769b0682A97677e37841i7551H0938J2012J3790c00609A38102K2158e6911
8954a2571E8247b51441A37245f5149A2575c73085c5039j75629j69302a61468j58551
8943c20019F8948g8534c8504j07784a6158B01526B9503J15019b08853C16899H3049
8931D94140B08028D0721c2099B5573a15417L6589A21207K05612J00038J28467
8921E55324N99524K244117J1922287o854388A183549D75152j36888j24377I6731
$$ plain form
8911 47777 -212714 63801 -98714 30051 32484 188990 467506 -67268 62173 -96310 -223932
8900 -223932 157449 281971 -235882 105578 -78057 -296053 -152104 76591 31253 -107602
8889 56000 -314339 -170329 -67213 5947 -287293 -104133 -99901 19942 183734 -212188 -54685
8877 -172709 -177889 -29852 216419 20515 -139086 166871 -271872 165875 80652 -123148 73883
$$ packed form
8911D7777b12714F3801i8714C0051K433J56506K78516f7268F2173i6310j27622
8900b23932A57449J24522b35882A05578g8057k17996J43949G6591C1253a07602
8889E6000c14339J44010f7213E947b87293a04133M232A9942J63792b12188e4685
8877a72709n180b9852B16419B0515a39086A66871b71872A65875H0652a23148G3883
$$ [...]
##END NTUPLES=NMR SPECTRUM
##END=
