
##TITLE=AC1349_GUAAH12167_6672503_nEyGrZXsEf
##JCAMPDX= 6.0         $$ Bruker NMR JCAMP-DX V2.0
##DATA TYPE= NMR SPECTRUM
##DATA CLASS= NTUPLES
##ORIGIN= BRUKER
##OWNER= Administrator
$$ 1.72 TOPSPIN		Version 2.1
$$ 2012-08-14 18:03:55.500 -0500  Administrator@TOPSPIN
$$ Compression mode = diff/dup
##.OBSERVE FREQUENCY= 400.02188249412
##.OBSERVE NUCLEUS= ^1H
##.ACQUISITION MODE= SIMULTANEOUS (DQD)
##.ACQUISITION SCHEME= undefined
##.AVERAGES= 8
##.DIGITISER RES= 22
##SPECTROMETER/DATA SYSTEM= spect
##.PULSE SEQUENCE= zg30
##.SOLVENT NAME= COFFEE_meoh
##.SHIFT REFERENCE= INTERNAL, COFFEE_meoh, 1, 14.98509
##AUDIT TRAIL= $$ (NUMBER, WHEN, WHO, WHERE, PROCESS, VERSION, WHAT)
$$ ##TITLE= Audit trail, TOPSPIN		Version 2.1
$$ ##JCAMPDX= 5.01
$$ ##ORIGIN= Bruker BioSpin GmbH
$$ ##OWNER= Administrator
$$ $$ C:\Bruker\TOPSPIN/data/COFFEE/nmr/AC1349_GUAAH12167_6672503_nEyGrZXsEf/10/pdata/1/auditp.txt
$$ ##AUDIT TRAIL=  $$ (NUMBER, WHEN, WHO, WHERE, PROCESS, VERSION, WHAT)
(   1,<2012-08-14 18:03:40.656 -0500>,<Administrator>,<TOPSPIN>,<go>,<TOPSPIN 2.1>,
      <created by zg
	started at 2012-08-14 18:02:34.109 -0500,
	POWCHK enabled, PULCHK disabled,
       configuration hash MD5:
       6B 1B 68 BB D9 2E 58 E2 7F 35 AD 54 07 DF 0E 41
       data hash MD5: 64K
       33 C1 89 C9 D5 E9 70 F6 B6 F3 9F 9C AC 41 76 FC>)
(   2,<2012-08-14 18:03:49.453 -0500>,<Administrator>,<TOPSPIN>,<proc1d>,<TOPSPIN 2.1>,
      <Start of raw data processing
       efp LB = 0 FT_mod = 6 PKNL = 1 PHC0 = 0 PHC1 = 0 SI = 32K 
       data hash MD5: 32K
       60 B9 5D E6 A4 5B 23 0B 73 5A 70 4C BA 79 63 56>)
(   3,<2012-08-14 18:03:49.796 -0500>,<Administrator>,<TOPSPIN>,<proc1d>,<TOPSPIN 2.1>,
      <pk PHC0 = 179.566 PHC1 = 0 
       data hash MD5: 32K
       A3 6B 80 77 51 12 03 B5 7B D9 58 4F 5A 35 E3 65>)
(   4,<2012-08-14 18:03:49.937 -0500>,<Administrator>,<TOPSPIN>,<proc1d>,<TOPSPIN 2.1>,
      <abs ABSG = 1 
       data hash MD5: 32K
       42 03 B6 8E 3A 47 30 F4 C0 CC 46 ED B3 F2 81 FD>)
(   5,<2012-08-14 18:03:49.968 -0500>,<Administrator>,<TOPSPIN>,<proc1d>,<TOPSPIN 2.1>,
      <abs ABSG = 2 
       data hash MD5: 32K
       E6 12 3D 87 08 39 40 EE E9 AC 7D 14 81 4C E4 8F>)
(   6,<2012-08-14 18:03:50.000 -0500>,<Administrator>,<TOPSPIN>,<proc1d>,<TOPSPIN 2.1>,
      <abs ABSG = 3 
       data hash MD5: 32K
       90 50 47 54 9A 4B 1A D8 D1 54 A4 F5 4D 2E 5F 43>)
(   7,<2012-08-14 18:03:50.031 -0500>,<Administrator>,<TOPSPIN>,<proc1d>,<TOPSPIN 2.1>,
      <abs ABSG = 4 
       data hash MD5: 32K
       5A A6 DC D9 8B 5D 85 17 AE FB 98 62 74 25 AD EA>)
(   8,<2012-08-14 18:03:50.062 -0500>,<Administrator>,<TOPSPIN>,<proc1d>,<TOPSPIN 2.1>,
      <abs ABSG = 5 
       data hash MD5: 32K
       05 FD 72 AA 58 96 63 C8 43 87 DB 61 90 A9 4C 66>)
$$ ##END=
$$ 
$$ $$ hash MD5
$$ $$ 4A 4B E9 E9 96 11 8E 49 43 8B 4A 46 ED CE B2 50
##$RELAX= 
##$RELAX= 
##$RELAX= 
##$RELAX= 
##$RELAX= 
##$RELAX= 
##$RELAX= 
$$ Bruker specific parameters
$$ --------------------------
$$ [...]
##$TP= (0..7)
150 150 150 150 150 150 150 150
##$TP07= 0
##$TPNAME0= <>
##$TPNAME1= <>
##$TPNAME2= <>
##$TPNAME3= <>
##$TPNAME4= <>
##$TPNAME5= <>
##$TPNAME6= <>
##$TPNAME7= <>
##$TPOAL= (0..7)
0.5 0.5 0.5 0.5 0.5 0.5 0.5 0.5
##$TPOFFS= (0..7)
0 0 0 0 0 0 0 0
##$TUNHIN= 0
##$TUNHOUT= 0
##$TUNXOUT= 0
##$USERA1= <user>
##$USERA2= <user>
##$USERA3= <user>
##$USERA4= <user>
##$USERA5= <user>
##$V9= 5
##$VALIST= <valist>
##$VCLIST= <CCCCCCCCCCCCCCC>
##$VD= 0
##$VDLIST= <DDDDDDDDDDDDDDD>
##$VPLIST= <PPPPPPPPPPPPPPP>
##$VTLIST= <TTTTTTTTTTTTTTT>
##$WBST= 1024
##$WBSW= 4
##$XGAIN= (0..3)
0 0 0 0
##$XL= 0
##$YL= 0
##$YMAX_a= 486458
##$YMIN_a= -617945
##$ZGOPTNS= <>
##$ZL1= 120
##$ZL2= 120
##$ZL3= 120
##$ZL4= 120
##$ABSF1= 14.98509
##$ABSF2= -5.573092
##$ABSG= 5
##$ABSL= 3
##$ALPHA= 0
##$AQORDER= 0
##$ASSFAC= 0
##$ASSFACI= 0
##$ASSFACX= 0
##$ASSWID= 0
##$AUNMP= <proc_prof1d_extract_pilot.lims>
##$AXLEFT= 0
##$AXNAME= <>
##$AXNUC= <1H>
##$AXRIGHT= 0
##$AXTYPE= 0
##$AXUNIT= <>
##$AZFE= 0.1
##$AZFW= 0.1
##$BCFW= 0
##$BC_mod= 0
##$BYTORDP= 0
##$COROFFS= 0
##$CY= 15
##$DATMOD= 1
##$DC= 0
##$DFILT= <>
##$DTYPP= 0
##$F1P= 0
##$F2P= 0
##$FCOR= 0.5
##$FTSIZE= 32768
##$FT_mod= 6
##$GAMMA= 0
##$GB= 0
##$INTBC= 1
##$INTSCL= 1
##$ISEN= 128
##$LB= 0
##$LEV0= 0
##$LPBIN= 0
##$MAXI= 10000
##$MC2= 0
##$MEAN= 0
##$ME_mod= 0
##$MI= 0
##$NCOEF= 0
##$NC_proc= -8
##$NLEV= 6
##$NOISF1= 0
##$NOISF2= 0
##$NSP= 0
##$NTH_PI= 0
##$NZP= 0
##$OFFSET= 14.98509
##$PC= 1
##$PHC0= 179.566
##$PHC1= 0
##$PH_mod= 1
##$PKNL= yes
##$PPARMOD= 0
##$PPDIAG= 0
##$PPIPTYP= 0
##$PPMPNUM= 2147483647
##$PPRESOL= 1
##$PSCAL= 4
##$PSIGN= 0
##$PYNMP= <proc.py>
##$REVERSE= no
##$SF= 400.02
##$SI= 32768
##$SIGF1= 0
##$SIGF2= 0
##$SINO= 400
##$SIOLD= 32768
##$SPECTYP= <>
##$SREGLST= <1H.CDCl3>
##$SSB= 0
##$STSI= 32768
##$STSR= 0
##$SW_p= 8223.68421052631
##$SYMM= 0
##$S_DEV= 0
##$TDeff= 65536
##$TDoff= 0
##$TI= <>
##$TILT= no
##$TM1= 0
##$TM2= 0
##$TOPLEV= 0
##$USERP1= <user>
##$USERP2= <user>
##$USERP3= <user>
##$USERP4= <user>
##$USERP5= <user>
##$WDW= 1
##$XDIM= 32768
##$YMAX_p= 471865001
##$YMIN_p= -766953
##$CURPLOT= <Network HP LaserJet P1505>
##$CURPRIN= <$Network HP LaserJet P1505>
##$DFORMAT= <normdp>
##$LAYOUT= <+/1D_H.xwp>
##$LFORMAT= <normlp>
##$PFORMAT= <normpl>
##$SURQMSG= 1
$$ End of Bruker specific parameters
$$ ---------------------------------
##NTUPLES= NMR SPECTRUM
##VAR_NAME=  FREQUENCY,     SPECTRUM/REAL,   SPECTRUM/IMAG
##SYMBOL=    X,             R,               I
##VAR_TYPE=  INDEPENDENT,   DEPENDENT,       DEPENDENT
##VAR_FORM=  AFFN,          ASDF,            ASDF
##VAR_DIM=   32768,         32768,           32768
##UNITS=     HZ,            ARBITRARY UNITS, ARBITRARY UNITS
##FACTOR=    0.250966925370066, 1,           1
##FIRST=     8223.43324360094, -224670,      -139860
##LAST=      0,             160451,          106142
##MIN=       0,             -766953,         0
##MAX=       8223.43324360094, 471865001,    0
$$ Real data points
##PAGE= N=1
##DATA TABLE= (X++(R..R)), XYDATA
$$ [...]
23841 46258 -299852 -50930 -199633 298591 -117165 -134979 -189662 96001 -227421 -202570 55249
23829 68429 12696 -255719 214924 41161 67366 -64949 -78616 177171 -169333 -158786 266243
23817 -244116 295298 -66080 -415235 575771 99514 283259 -348721 21871 3362 129801
23807 129801 122349 -291031 147762 -53812 -83490 198239 160889 -26929 -313139 -380077 277573
23795 308041 -288944 -78011 -241137 -30396 -161321 -42553 69854 -225336 97072 131102 -251859
23783 -14654 -348953 7746 -30415 -136156 38086 31270 104584 36528 -195421 357178 -318997
23771 156646 94843 -85629 193465 -346141 -59166 55413 148372 -335233 -33606 -163082 85081
23759 -41893 52423 -156948 -265431 -278887 182624 19536 -239605 -179753 269103 123214
23748 -309297 172597 85251 12828 -100774 -203082 -343727 -16527 -243127 -38499 -12545
23737 -194523 85711 -33813 -104575 289421 -230017 -244554 -59454 151283 -207442 8632 191590
23726 191590 125207 -40000 255962 368974 -283281 358589 -15481 315904 70714 148858
23716 148858 -18284 -111424 319086 9970 -256073 9217 -294020 224271 -170155 -107910 -49782
23704 -5431 -85505 -91888 -56087 -183666 -261381 21582 -22535 128827 -155466 -107674 -245731
23693 -245731 206807 135544 -26339 17422 15629 490969 -123135 -358843 109437 11967 14833
23682 14833 104023 -228582 -54560 69213 -116205 -4698 279824 -75871 114368 -254481 -44267
23670 -34554 69782 90805 -80449 171217 -186515 234490 19880 72448 331309 -213842 180924
23658 222386 -138655 80410 -30228 -292332 -18526 -73931 3920 24554 154901 -46661 -259128
23647 -259128 -16733 -73147 -125751 -28255 -190463 10394 60604 -136289 -11718 -65052 -13766
23635 -128855 19084 -207183 -224111 103376 57574 -15133 -15977 146425 244926 11453 6509
23624 6509 -50742 -102536 -330627 -208322 82753 30693 32630 -342042 -115549 176029 -130257
23612 247787 -34922 102906 -122497 -246863 72889 -244630 161803 -74057 13770 259889
23602 259889 256250 -146840 285460 -92329 68434 -600826 279388 -4900 105311 -68582 258099
23590 140908 87943 -125110 138524 -146239 -113007 370261 39571 40086 -102959 283489 206315
23579 206315 168527 -11050 109818 246685 121271 -276841 92972 -190035 -100686 110557
23568 54514 -284672 87075 -50677 -183286 -2030 -107732 -163032 372407 -497401 -512003 252020
23556 -309235 -19172 -19794 134261 207902 -147150 -378391 69304 26002 147125 -105982 -94282
23545 -94282 -180545 352502 -97878 237556 -246338 -376963 -44235 -298799 48493 -62675 48076
23533 245213 40088 8632 100077 -174742 -121681 41697 -35859 -301278 223666 74275 -166582
23521 26011 238012 -454519 -265493 80833 75495 -149945 213189 -64738 -91227 46914 -310364
23509 -151217 105723 86149 -50488 -202720 -103127 185646 -83875 25977 1279 129295 288185
23498 288185 100673 -106868 61400 92131 20954 185933 -233064 -294768 47856 -315192
23487 -96258 -43027 245549 -11308 -93889 -80117 -102570 -194595 -195295 -56223 147155 34194 -287224
23474 -111267 359702 182582 86797 -13055 62231 -60640 -254076 104110 18355 38518 371616
23463 371616 -19158 80170 31853 -248867 -8689 -360249 6315 110306 144043 75204 210876
23452 210876 36114 -79784 -333535 -114176 -162083 -134295 -26128 -187489 15142 -229377 220382
23440 -351032 -314698 -25444 41542 68591 48642 -286178 -194848 266391 -367183 61324 189682
23429 189682 -81102 -382003 185762 -153703 384721 -221054 -163196 -168821 62381 -147014
23418 -48993 149645 85016 -444702 36776 -43843 -61669 51298 -144593 123426 213127 -174184
23406 128664 -192249 300342 -151461 193546 287921 -100143 102943 35545 -24239 -79690
23396 -79690 235117 -134698 185959 65231 61050 166596 -152315 237389 231452 -118642 -160221
23385 -160221 -184891 117282 -103568 77942 104544 173726 121912 273134 -130448 -5625 290690
23373 227319 157950 -46600 -182386 -123165 -201889 80485 -424495 -51098 -407954 -110632 -98408
23362 -98408 -1797 125500 -61502 -145072 153639 62470 -211437 42613 75234 -226288 -57958
23350 345308 -431367 8407 -66788 247 377478 -227274 132583 -286418 -177375 -133004 70636
23338 35814 -199542 -381202 -277991 -68951 353344 -80672 -37463 108606 -128235 158325
23327 195456 -3589 121814 92993 259946 117746 -100464 146786 -135309 -103157 23993
23316 -185069 -63215 114865 13891 -130757 150329 -174355 -155637 -134636 -15164 66010 -257287
23304 -66911 155638 404896 -24888 -287567 19930 33998 5063 -84053 208585 252852 -63677
23292 120509 85518 -47818 106482 -252268 51090 91270 88678 431738 -175827 -331878 -152256
23280 159531 -17484 195550 375303 -146225 132229 -126141 -86219 186137 85249 -372723
23269 -29550 217343 -217151 -257116 67792 94585 81224 -47826 233087 81984 41456 345221
23258 345221 125863 239709 78342 -270317 -6901 139714 -253748 118406 -98155 -42696
23247 -36959 253511 77103 -205919 -6994 5264 85300 178516 229061 59978 -99629 -169123 22660
23234 -15724 -277046 -180022 -242548 -182350 -40716 -16300 29454 -399429 154865 -14855 120250
23222 -89126 319605 -124206 163216 80998 -24309 -52666 -189790 -250313 -58454 108163 -105439
23210 -168700 -277218 25066 161679 -32268 -235858 248625 -48948 1120 -202189 -75298 -62995
23199 -62995 -157012 -114936 -216749 -70045 107950 -230373 157716 -195554 40661 74477 -6772
23187 -202445 -33793 180374 -96539 -100057 99536 142618 -336684 -230300 59602 246145 -405308
23175 -66253 117894 -141490 -308662 -218140 -198897 -57395 -206210 -232211 355134 63509 -229431
23163 -183729 -185417 -71443 169076 145216 -9402 -228723 176472 -131851 -282904 -207568 -111180
23152 -111180 98637 225797 123626 -55524 -4346 -332510 113926 231901 59926 74778 -108413
23140 -216347 -93456 -125302 -22097 -25456 -377945 114263 87177 -106638 -1395 183147 68395
23128 -242126 33977 -219982 -226158 -197132 266506 -106099 207803 -58082 -261640 -158915
23118 -158915 139206 -22938 -90991 -4181 30826 152432 -342426 -24626 343430 -208451 65193
23106 91226 194484 96306 -243107 170828 -106386 -1939 351921 90945 334195 -126503
23095 58680 354394 -25612 -34968 -16505 -62228 7965 74597 165818 -144397 42814 -179164
23083 107226 -355803 53332 -282735 -27081 113242 80008 185836 52247 -8693 -160471 -87485
23072 -87485 -148131 64565 152265 -234888 -350652 -304674 -627 -124793 -37738 -36389 -173796
23061 -173796 -146500 18559 -53843 318684 -58666 164036 -192994 130733 331507 41187
23050 75988 170397 -13297 287489 313944 114990 -124908 -160298 2537 -320455 26297 -145603
23038 -23417 144174 133446 5038 -99281 -172928 144097 -107440 39545 -75639 30073 61557
23027 61557 -96124 178083 72933 -66725 -182384 46055 266789 -88434 -45046 75913 -98559
23015 -232666 -11972 -250494 -145526 225961 -507926 148633 -189696 -67453 -74589 -293642
23005 -293642 -52117 -280369 44874 -371977 -415984 87720 -129173 163846 79091 -115880
22994 -111428 85512 -175246 -95786 -55775 242422 -87599 118532 -289526 -69623 36473 -260492
22982 141866 399012 101833 195491 284920 -294581 -13402 -79523 149019 -134495 24720
22971 154304 -114347 313084 -329658 52441 98583 94678 4788 -47920 -175130 -332006 -50729
22959 1876 4042 72863 -49777 -249133 -33106 -195274 -217229 -394675 93431 215991 -205303
22947 104139 -51885 -4081 50540 -200597 184802 271129 -141889 -265516 70808 199345 73678
22935 -240411 107944 -80355 105947 131080 141403 -96531 -183398 -203447 -144561 91494 11706
22923 -58269 279759 350816 -150536 -41832 -449686 11117 -163735 -78592 297481 151058
22913 151058 -176303 104583 -143888 -97492 -43754 462754 -113220 -251584 -19542 63576
22902 -173057 74162 98597 -254166 -120423 -77209 -182950 -191516 -173030 -22951 257313 -92506
22890 63089 -35671 20578 -162824 26073 -99748 81228 -116666 128249 16852 156765 -116912
22878 -164659 103234 -13553 130970 52199 33898 -172994 -118366 162791 -87337 73209 52074
22867 52074 -255526 -366279 224593 84889 35794 -31425 -151109 -5080 150240 -159681 -151306
22856 -151306 224780 -37669 -17123 -322521 -165292 94467 136271 40115 -260076 -377986
22846 -377986 -11700 77872 -116167 -370319 39664 -291406 26067 445587 13910 -433293
22835 -198477 -365025 37434 -303041 182860 39470 -38535 -182329 141636 -115651 22425
22824 -126088 208047 -8309 443447 264438 271635 -77659 -132090 29778 308325 -108723 -330501
22813 -330501 12753 -90014 175155 13955 -93758 -69656 -66252 -84529 89503 -297949 -45132
22801 -337379 -86466 22189 -398162 -125901 70776 54854 77433 44674 -211244 229524 -210378
22789 -318686 378151 -168903 -168975 560295 -20397 -73666 -87150 62597 135306 323512 -221664
22777 -317505 205523 345695 -59942 -77015 -11317 -113691 -203687 91803 47350 32153 271116
22766 271116 -41348 25922 -165140 -48185 92512 166691 40091 -14551 248925 30809 441720
22755 441720 -119464 -35144 -26032 14182 306378 -87796 -2304 -19226 -223892 -107618 225131
22743 -20321 -189856 -5560 -70633 77843 73525 -160224 -14717 240576 -13357 -613 -74034 -253403
22731 -253403 -268458 -40503 -63568 -354800 149187 97677 251022 75631 -200569 -289306 45764
22719 -112669 -241510 -8165 475781 61146 -209705 84530 37216 16080 234258 -179329 -464815
22708 -464815 9830 99542 381741 -135052 558384 -221065 -106538 128025 -219531 -238641
22698 -238641 -174478 -49522 80035 144331 -149757 120450 -249271 -89982 -394931 162278
22687 -278459 -83162 -298385 88176 86612 274749 95003 80511 -62925 203078 208412 54224
22675 -250778 -429319 -108090 -207991 -114835 -119228 -288936 -22942 -6740 -134 36184 42268 40262
22663 40262 6479 65623 160340 -490295 -266954 -22582 127178 -163043 -192621 -164683 -26985
22651 57563 -5195 -162712 59401 -188842 -174312 138636 -80962 -96872 -120887 -289389 -132495
22639 106536 23835 110500 -88902 -20713 400306 202708 267158 -12257 172976 476744 21623
22627 -214374 30456 27697 -202247 -117884 -176241 -186928 50300 94475 -179202 29531 124223
22616 124223 -100731 188698 -260937 110891 -102067 3732 152233 -176318 -22743 -34409
22606 -34409 -126924 -43933 53794 43961 484830 115917 97100 -69338 -47545 156980 16536
22594 14609 -51759 217292 -12383 -179486 167064 -222062 -224476 -196040 32228 -178146 39044
22582 -77789 58778 108678 -90251 87764 161812 -47482 71406 212992 -75411 -74456 -108898 -1299
22569 99226 -170846 70434 -8597 -72647 369518 -328852 153785 -111351 29963 -188844 -299146
22558 -299146 -43212 220008 379495 165788 173259 -2123 -257378 -96421 55412 -116519 -270971
22547 -270971 -39170 -202000 -188694 -38163 -389132 262801 499963 35233 -98105 -91384 13772
22535 107569 227143 32944 -69025 -220401 -62280 -93885 -32901 13175 -123652 -135517 -458576
22524 -458576 -173045 156871 -131128 450912 -81691 -45429 -70424 13429 -16315 41458 28292
22513 28292 -40681 83654 22881 53293 53473 -158535 323565 23702 -48534 49258 62882 -109592
22500 -122923 -245335 -200627 -306208 -334916 143875 -88191 87030 -150606 -283370 -245817
22490 -245817 -110763 -308822 125804 139068 -156284 -56524 -233232 -228873 -161665 -46679 452940
22478 131928 128261 -37740 -84246 -65551 224501 -195321 290419 -53949 183945 -423198 136989
22466 139437 141698 -27040 194461 -234040 150375 138475 -392555 -194476 209089 31357
22455 390149 -207946 -10639 -176096 118671 162190 -190915 65770 -137163 -96067 -83069
22445 -83069 29230 -12468 -35910 -304037 43062 -282781 -12450 257745 -145598 -169171 36158
22433 -76475 -61212 -278175 -8407 -149951 111902 -166446 -193789 830 28596 180343 -368498
22421 375562 -67027 163886 4558 -193672 -104556 96884 122339 -23526 -389090 -172589 123816
22409 -377415 -17413 107396 -207212 -164215 32794 -127886 -3205 -122166 46878 -112890 189711
22397 -181159 -40539 -29845 -234481 142120 219247 -26596 223008 -140984 144887 1795 43276
22386 43276 -126403 188902 174761 -20841 176867 274202 180405 -120135 376497 -340589
22375 -55884 -157150 -17244 -79263 -134532 -237207 -68468 4900 -107404 -12025 -331712 -175232
22364 -175232 48417 157044 -194390 -50938 -46283 -352913 -266861 -109763 134493 157054 -115176
22352 6587 39464 61410 -74063 -220059 -78580 163230 -224834 -106843 -56198 108080 -153193
22340 -367866 182322 -470297 -362268 5137 -116871 34097 -183999 105900 -9046 64599 906
22328 91091 139261 37666 122617 -358829 -78168 -64917 -142714 244462 101889 -239570 96474
22316 -131532 -48697 -117777 -82497 -142434 195838 23894 -433941 -328120 -39502 -62746 3005
22304 -322109 -159721 -174615 -201091 -40545 -154456 198555 -26132 42271 244814 361816
22294 361816 -65782 58736 90158 -13794 109553 -140191 -227553 -199907 -10956 33296 -723055
22282 33813 239733 123068 265096 -51644 -148108 -209506 -63758 217579 -87680 91276 26368
22270 -130976 129938 -51032 -2345 -133299 -241895 -12864 80882 -124118 290970 236223 -2750
22258 -199037 -286462 3702 25328 -304608 -17707 185042 54091 -48595 -144962 -24193 -83537
22247 -83537 143475 -84771 41947 -42158 164245 24301 322126 65347 444969 -243268 -303465
22236 -303465 -102093 132763 -26555 -37838 -25462 -21642 -296486 32942 184594 46530 193823
22225 193823 109460 -89082 -239623 -16026 220602 -31028 -6467 -75408 113859 -54460 -67924
22214 -67924 -6313 -16925 -15540 82045 -105892 -175180 297916 -198248 -23660 253247 -264482
22202 252243 97759 91495 17479 -137727 -494722 -13014 127491 -25998 -260706 -9804 -283674
22191 -283674 -152379 80679 233818 290207 -178179 -76372 -56287 -15623 83164 -136199 64742
22179 -29278 136286 -340218 -17618 -273161 166813 48367 -133791 201070 116428 -256821
22168 -8426 106648 181451 -474350 -10224 -114146 -9514 -65935 230970 -159187 -67418 -199360
22157 -199360 -117179 8468 38105 -56003 -43734 158888 -108910 126681 -474279 -70747 295536
22145 -297263 -395841 -145976 117037 226686 61516 129583 -63696 -64895 71619 -29663 -371435
22134 -371435 79012 269709 -70982 -226034 -32370 -105199 -77259 -185873 -15514 -8389 92876
22122 -103709 -113913 -34732 273176 -286126 -247285 19913 140602 -12698 -75674 -144370 -368089
22111 -368089 -358869 5709 295034 -148683 -32721 182484 66314 194244 211569 -253698 191013
22099 -131362 -47504 288445 -198570 279105 -163799 81495 -1461 65932 121823 -111873 116650
22087 79689 -29191 -50673 22522 -74230 157097 161415 53130 255737 -236072 -189989 104442
22075 -278563 270454 -29867 -279499 -445084 120783 76608 85044 350268 341877 -218628 155494
22063 -16569 107743 -12250 13082 66001 192604 227560 65140 7171 -21898 -459837 -53060
22051 -83156 109449 323909 26231 -174174 -138040 -66113 328941 71890 -289869 -213183 -371397
22040 -371397 -70102 153841 275000 -277070 -283143 -474064 2600 442359 -318941 -148591
22029 -51580 -149157 -70631 154057 -5591 102095 -382482 93121 -34835 -137498 36466 -45128
22017 -65819 60324 -253351 28938 4908 -291165 -183959 -58584 -93465 20214 26289 150699
22006 150699 -372553 62513 -370408 34614 134687 -170415 147606 -110397 -183556 -418087
21996 -418087 -435832 -54920 107963 19457 -9993 -118226 66901 111243 7832 -57914 40476
21984 -52327 -18644 -147232 -170018 -6285 33597 68960 113746 -195985 -39318 -69148 5040 223596
21972 223596 175959 -174543 -195442 15492 116804 -150031 9498 122478 -142462 -121181 -566935
21961 -566935 -194846 -187439 -272170 -216685 -207970 116342 119909 193191 -138258 195913 -642133
21949 -122142 185532 -108111 206577 -91956 288209 -128492 -174027 115609 65478 4245
21938 -117276 92728 86096 29476 -339493 221080 -337356 -180440 145276 24989 -367585
21927 20137 209032 -206105 -155292 97721 101986 189890 -223854 -81741 151523 -3098 96842
21915 175177 37361 -222465 -128610 295100 -316440 -94556 -31627 -85934 136017 -80653 -202905
21904 -202905 -13931 -31171 109106 -83471 -290557 -5297 92166 -185721 -230844 -249256 -609032
21893 -609032 -477969 -51924 54560 -17697 94600 14650 -146693 -86691 -53564 -36292 -42509
21882 -42509 26553 -415949 57883 -103408 -300077 16594 -185232 239061 -136188 236828
21871 -116854 -105602 -435875 48186 -19662 -111070 -188630 -77545 -176387 21450 225031 -289002
21859 88769 -96658 -297687 -32551 13116 24631 -202191 191844 26407 67145 -132454 -6190
21847 -7421 -251654 -162490 43415 -29174 84650 -67724 -3080 66738 345663 -142161 170758
21835 -53905 -27071 420947 -257369 -272821 139059 -8430 -86092 342919 -275756 -85676 -184820
21824 -184820 -256647 55251 131879 -74506 -224839 -228739 99568 -70515 -83347 -120273 -157306
21813 -157306 -197060 -165058 190874 260342 -187488 -103885 -182591 98039 -261567 -166995 208657
21801 -68096 -114370 519251 98045 -115736 -178893 85581 47373 10808 -186193 -95040 -144340
21790 -144340 187927 -13809 -130642 -25635 -39094 294022 67686 50303 -90869 293633 -49947
21778 117230 204201 142939 -93691 -342530 -68212 69545 -69820 -60304 -316542 -165533 121501
21766 -183061 198466 142827 292274 219658 -627414 -102319 -219064 -78046 -175097 253778
21755 -432289 -455 193654 -113993 304015 -31393 -47324 10282 -316862 -148302 -152572 75377
21743 74730 111061 20135 -124458 122818 141877 371669 -151614 86342 97457 22641 41241
21732 41241 -76074 -87459 152932 -81581 -14980 230588 124783 -78857 301713 45975 281153
21721 281153 -16557 10439 -51792 -73769 -175792 36591 -151008 -242405 16959 -80832 75294
21709 164397 -109853 -247565 -156004 -217104 -140345 46152 -110122 -47253 -224785 128947
21698 212697 -376789 -85672 110477 17207 -94292 -227572 12800 -34191 -248710 -376737
21688 -376737 158877 222924 376756 392605 -351275 158516 -260340 258955 -110647 46520
21677 172641 89268 161972 199720 -37874 46757 35990 48248 -380750 -241199 -75559 -10132
21665 -72948 -232911 -189608 126335 -207475 -170123 956 232853 95591 -317853 195682 2915
21653 -47842 -323361 -98293 -257247 -66387 -298966 -402254 -73647 -80774 -187997 63101 89443
21642 89443 109920 -124242 -139984 123250 198163 223225 51218 -298546 -197127 -133550 -235734
21631 -235734 -244013 308551 -1341 -172034 136355 -12721 -110652 255269 -275015 -89464 -131282
21620 -131282 166340 288610 67992 119872 -99944 -48166 10044 -215512 380136 151912
21609 107978 -9934 95988 -75132 -106893 21415 -164524 -289848 116172 -156002 -162801 20511
21597 -41339 129503 -433977 92513 -441954 -304557 195564 113404 76068 256132 -111537
21586 -340786 -218925 214198 338850 -302778 99114 -364787 -140845 -89983 28636 -154755
21575 -207729 -175550 341465 -193831 -101633 27110 -252822 -212358 -91541 8012 26206 -243661
21563 -254058 -169056 -462394 115355 118993 -37488 117108 8215 -109405 -119716 -159439 -58783
21551 147694 24797 -89738 -407127 -127944 231836 55634 1788 -145049 -97580 -102681 94976
21539 -57324 -35838 -61302 116129 17169 -350107 290741 -303489 -94007 609307 -188704
21528 -285034 -231959 -300378 -395141 24010 110752 407057 -207656 -51561 -383952 -155014 68771
21516 -182826 -320970 -120762 -220842 20282 281693 53164 557828 -102148 119627 -165320
21505 282464 -114670 -120831 -154225 154892 58902 -47798 127560 -24961 189494 233658 335404
21494 335404 -234083 168360 81510 -70131 79256 -269428 144791 -113107 -222091 -9507
21483 -243329 -388586 -215064 79193 113009 -272221 -112760 -143473 -161934 -63135 281704
21472 -263962 -238442 -91725 45107 -292678 304994 -362702 -115379 103755 -238227 87745
21461 -189347 -88308 -224531 -143855 155820 115218 204778 -171197 87346 -118954 -22946 -7889
21449 -144634 399038 -62593 -388916 180666 69840 38772 -1015 136413 -174908 -110378 291567
21437 406230 362300 3419 411724 161586 134297 -305138 -95423 -20380 -174665 -14664 92147
21425 -121388 -11173 -63169 -200861 15877 256605 -163657 -303366 -177461 156191 -135739
21414 -241451 -26778 -39817 330725 83353 -19435 118973 235201 -102113 -333913 -101212
21403 -186156 254892 -85407 -136043 -119159 -229927 -99250 85764 -199707 -97946 521320 -45913
21391 -135882 -184810 185265 72836 191128 105160 -77004 111494 29331 -175313 303624
21380 -64417 -64694 39646 -57240 228073 -107026 -69105 -89763 -21195 -73856 -368272 122845
21368 -98032 -24968 -240748 41625 -187700 -53135 187828 170997 -117215 -335389 49931 229111
21357 229111 33777 -209794 -441364 482192 1001 -198709 -204490 -56875 -347467 -93896 -93887 -43962
21344 64655 -596793 124628 -86013 -203875 -116258 16953 -40688 27633 452346 -12771 6634
21332 -116721 -38713 -76837 118008 -98333 -217412 379425 101574 -67860 -117267 74100 -4760
21320 115289 147407 151238 100110 -156649 -148605 235430 15223 -153434 -117908 -23977 -61832
21309 -61832 -132161 134196 -332226 -389623 31863 -70145 59252 -14546 -10499 93200 53205
21298 53205 -319468 188959 -92744 80240 -139541 -32560 -35666 245943 54426 -263451 -37580
21286 -25759 55432 180247 -82219 87983 -103817 -141993 25145 152279 -343711 201243 103057
21275 103057 100961 -265570 -57204 -26331 -69976 -31400 121871 207230 96985 -73335 175635
21263 88439 6954 74708 -146422 182952 -35543 -56588 -351965 -88647 106178 -161389 133358
21251 -447746 -243266 -276583 -46913 220258 -46646 -161803 -24439 -437299 343436 -391709
21240 -55005 -20425 53838 -247470 -177702 167691 -110675 -124274 -197342 -54851 277546 168910
21229 168910 -229447 -158142 349777 -28791 -95495 34554 -111869 -29305 -174279 -185660 114028
21217 -260165 -60930 328716 -197263 -156937 -78380 38138 -147722 -99865 22905 -210557 25478
21205 82346 262260 -70386 -81598 -47529 -66702 -519808 -58955 -31686 -215977 -241084 -140025
21194 -140025 -165257 -93899 212004 -171156 8522 -7347 442764 -80707 4732 98618 -167581
21182 105532 58748 -128214 136651 61696 -325363 -177253 -96514 -34385 63403 71007 -86766
21170 146336 80400 -95374 275144 -18184 -6145 244797 37523 432849 18545 115668 -176744
21158 -105713 -57579 -137561 111019 -143911 -222308 149298 -303048 -206294 -161106 30651 -152827
21146 -24962 55887 -120714 -22517 56323 -143142 -118533 -54200 -116723 -318324 186133 45053
21134 -195023 60178 85732 95234 -87282 -270522 -155408 -177227 -145478 229831 -168766 79551
21122 -87026 -108098 -276975 15559 -124391 -179500 85343 180065 1395 30453 -17564 -314855
21111 -314855 611 -4873 73949 -86524 -55800 188445 -267753 -7347 102112 -53383 195636
21099 -89828 -272643 76861 -166723 7675 -64914 322174 -266758 210604 -299551 -112157
21088 22006 -196678 -227652 -144887 34819 -81964 -128183 -138230 -144992 -43214 334015 199174
21077 199174 -322984 -20085 -91792 107989 125116 -34772 150004 451206 -56239 -111498 321993
21065 -223866 -86995 -128493 146059 305936 -26435 -145766 -77976 -58808 48290 -224524 85100
21053 199536 -306360 -139252 51893 -105551 -166852 -234080 -74361 -102280 18304 -250197 -52164
21041 -342913 -141011 58543 -70112 54381 -39603 -62987 -173727 -57043 6389 139226 -47429
21029 212833 21925 -27144 -78024 255363 83746 -79895 -183964 -225009 93964 -221838 64739
21017 93503 103877 169083 338699 -106806 -350661 -177554 94284 -24120 -160124 -142668 171943
21005 -240 -267529 -394639 -144410 -84821 -31918 -172660 -240129 -61386 -328612 -49818 22449
20993 122471 -88312 275559 -96796 -260486 170448 219035 -2143 318728 128881 -8268 73996
20981 225680 89041 -40217 -72708 -213803 -206527 270644 69843 -187462 -80656 69535 264700
20970 264700 -45754 -317121 37773 101135 -615720 -208241 170985 236557 -199181 5958 -373918
20958 -370802 193897 -183234 244570 -440645 -51437 -60777 -294131 93364 -297938 54014
20947 132322 74373 20136 308026 -140370 16133 -404387 -374115 -73061 -230088 -62804 7508
20935 -185688 56417 -21709 -105365 -35112 -115423 98348 38951 86142 -129426 -3686 212860
20923 216632 -137154 -25667 -3111 63786 91976 -357887 -272743 81354 127220 -384406 -209720
20912 -209720 122963 78986 5595 -256398 205849 96343 -29444 -70005 -158943 -348629 6514
20900 218682 -83308 -89558 -156743 -284324 370968 -90102 132641 -154834 267492 274798 -101034
20888 -39407 41289 77660 -156447 -307757 210641 40251 -10528 -209741 197114 -100037
20877 11502 -17914 171633 342039 -213860 -90406 178723 -160483 157339 -79564 -14909
20866 -131925 -182062 -264308 83919 -42964 -138773 -68465 192094 123503 -170935 -133039 -161040
20855 -161040 -6868 -128590 -258338 229902 -454372 -329463 85493 186747 -149832 -210687
20845 -210687 253603 -228468 -302362 -22847 83206 73000 42569 70812 -29521 71412 56330
20834 56330 147127 17398 -267017 -295466 119888 79327 -123402 -120973 -198321 -144615 -298220
20823 -298220 88916 302031 27048 -246935 -104855 71946 316017 44474 -75181 -503282
20813 -503282 56214 -165452 43588 12899 -130023 53998 -116198 188050 425850 -58055
20802 152191 -156067 -130431 -379155 -106629 -44159 -207958 20625 -131135 129458 -43736
20791 173848 -4310 -180318 105310 -135658 -280205 103086 158884 98318 -69288 19188 -28824
20779 2254 -42831 -20134 -40822 110180 18856 174039 -90373 -37467 3914 -139454 366385
20767 -242174 -335876 -242786 -53758 199395 -121295 546035 52582 -329968 -224269 -479503
20757 -479503 73898 -29213 256899 -169884 -187031 95473 -404595 -257843 16034 -176082
20746 83375 -121741 48187 341162 -177522 102714 -308375 -1154 221883 -37630 44388 117618
20735 117618 50599 -44094 44584 -130444 276648 251792 -247107 26754 -56386 -96602 -201216
20724 -201216 -128087 -12560 -219847 -38483 129464 -109571 132436 -63305 -267013 12956
20713 -100935 -144316 -130010 107970 -425365 -203322 107199 141495 4750 112529 -287031
20702 80963 -213634 -56902 -21939 -349183 249770 -133849 145582 -157502 -189644 502561
20691 -269307 -191948 -37807 -109589 55402 35722 -48345 -280625 -93166 -158446 -171210 -281933
20680 -281933 176765 -15764 -172031 -236269 -315181 63640 -47936 102023 -215290 69412 101954
20669 101954 -11417 94881 -130199 -122342 158765 -121417 -113632 105867 294682 -172339 -214
20657 76700 90671 221831 52652 -275183 -166766 50019 -213154 -117923 189697 17012 34031
20646 34031 -658267 -216500 -239326 -67242 80044 190189 98068 -58427 189314 50540 -25689
20634 -149679 -206501 -375458 18852 76676 49785 94678 38344 91925 92426 -84936 -417543
20623 -417543 -168869 188406 -184884 -185759 61660 -227701 -221783 -94901 -490891 -292379 211942
20611 -543 84762 -89287 -72868 -44003 -19835 406312 -213358 119428 -130208 -269217 102082
20599 121315 -85217 -740 -90083 -408460 57783 -490962 -729 -613206 -273552 466777 254434
20588 254434 310604 -5874 1232 -2780 -172582 -140892 -113708 -278571 -354185 237770 -60922
20576 -59855 18311 -29387 -124387 152452 39736 379756 -94113 26342 7352 -2046 -158641
20565 -158641 120237 263786 378551 -278230 159114 58268 80400 147728 -279993 256409
20554 -305538 36486 -121900 271053 -374901 -30039 134854 203714 -152083 209889 -99884
20543 -336580 -244531 170031 90904 18057 -318859 -110021 -152687 -72221 -133162 -191867 130309
20531 -149983 -186449 -148790 6626 -330201 -105181 -178007 -136394 -127705 -126954 -230163 309965
20519 -159526 -159386 -284929 -318052 -165613 -363629 15026 -344973 -29208 131745 58396 29290
20508 29290 185757 -180139 119036 -226392 4935 -157696 -66038 17416 -44426 -114392 -133150
20497 -133150 -125597 382544 51743 -469858 -90639 -228645 -227107 -90430 -115851 -18704 -349866
20486 -349866 -282475 -145713 -32889 -22755 -129928 -254368 -465115 -164664 -344414 -197522
20476 -197522 -538038 153810 53433 -192301 -169676 -105686 -314096 10120 -147848 -113345
20466 -113345 -202487 52526 5806 182241 149787 144143 -78748 28878 -86129 -2975 153278 8465
20453 72172 -7321 194482 -19581 -230482 174912 -140838 266820 -95359 -19055 -59436 -270593
20442 -270593 -131833 61768 69549 94765 -91433 4056 -348197 -196694 264299 110258 7517
20430 148103 -175730 -201542 83397 -219346 -7748 -249251 -197461 201799 -246699 54171 38938
20419 38938 -422704 147037 -113777 -221578 72991 -218335 -174143 -66607 -298420 -155119
20409 -155119 -214257 3426 98332 170520 -24999 -7992 -59985 -127823 -52945 233667 -136756
20397 -125952 -81771 -310758 62816 -131596 -121021 -34975 -319510 -62216 -36562 -236502 193785
20385 -399487 -48594 484821 -192134 27598 -51904 314088 -54398 -591049 221193 -216304
20374 -41359 -383814 3929 -149662 270303 -243830 86198 106485 -107713 -581 200679 -63560
20362 -144339 50163 134023 -96068 398623 -27911 10138 -268835 -288424 -247953 -231413 892
20350 -183335 -118804 -248235 -39676 116031 71726 -74081 -42599 301645 -166688 8576 -141058
20338 3382 -248960 -105115 -64732 -450179 -25379 58005 122760 93274 -202621 -261338 -186748
20327 -186748 -30756 -176215 91149 -114153 867 -94287 -258557 -11805 -171196 105242 34274
20315 93524 -133860 -147731 -43775 27598 -177041 91351 -186317 137287 183740 6447 -65421
20303 -229043 326385 130556 -41517 -106972 -82752 -59095 -378389 -171885 71353 32685 298456
20292 298456 221538 -297699 13191 -98653 129315 134452 -176712 453112 -245780 -8587 -226874
20281 -226874 -268120 -309114 -86121 -176952 -143964 111312 152866 -80355 231627 274917 -65037
20269 -101273 232504 69662 43410 -120176 112641 17007 -42037 -307972 163446 429550
20259 429550 -168796 -381199 -348958 -150631 73045 233601 -277751 125778 -28599 -117127
20249 -117127 15630 157481 -257506 -124277 -2752 20159 -263057 52882 -18507 22157 168297
20238 168297 380344 178684 -38127 -85509 142312 250204 -337673 -292358 -60447 -262496
20228 -262496 -116934 -103952 -70538 -16321 -133659 106774 -128705 -5938 31671 -213634 51451
20216 -188010 -311925 22931 -92771 13622 164502 -74629 248898 231417 -115286 -148631 -186305
20205 -186305 23717 -146531 -105749 158114 -226282 -383767 -258623 128388 247098 140176
20195 140176 -9797 -112679 39316 -222767 -271834 -194899 -240301 180495 239756 -198791 -207923
20184 -207923 71693 6704 -224583 108799 78018 -127747 -151385 -410768 320789 14015 107192
20173 107192 -109881 -94125 -602927 16578 -85021 -65675 133150 122296 183108 -200624 -302343
20162 -302343 -162766 132333 -266289 56923 317556 156416 -72784 96064 -92032 -47510
20152 -47510 315687 31403 -77836 1606 -315303 -240541 -75328 90398 347826 121376 6343
20140 30745 14781 -42134 -256288 -124505 108585 -10892 12998 186244 -344028 -183588
20130 -183588 -15854 -434058 -66354 -11885 -110642 62081 -81416 159661 40944 -19347 -16391
20119 -16391 -10004 -79186 -180914 -244741 -141361 -48135 -234359 -245493 -342708 -81873 137686
20107 -137558 -91878 -276281 -46536 -209061 -86287 -82924 -121375 -296070 -49879 -9605 -850 150102
20094 -76274 -10579 -187503 248171 -53473 31622 -204800 -126624 210860 168584 -147334 -325182
20083 -325182 -330947 -21380 -375820 -149119 -97552 -365131 61246 193580 179997 232444 70996
20071 158255 -184416 -186088 -224461 -176267 -136451 -69011 -134777 499716 -220012 -10726 -53666
20060 -53666 146654 -168516 -315195 -148399 -61937 -67660 -203253 -251643 -11456 -131128 -107095
20049 -107095 -112087 -80996 7583 -145393 -263060 -215449 257833 -281245 -62859 -205829 56274
20037 -270486 55821 -179276 183011 -97192 296978 68468 76625 -39907 -428246 -447581 291489
20025 -237492 99248 -266358 202541 -278112 359832 205079 -211592 -353806 -303178 -152714
20015 -152714 43804 -94830 -345899 -64216 262589 92759 11226 -526827 25402 6422 -158981
20003 201819 2528 -169398 237219 13035 -55410 53199 -188073 -347061 -96116 -333677 -100941
19991 25558 50606 136959 -46134 242790 -68718 -29459 -320964 -323991 38124 -189669 106200
19979 -243644 339858 288990 -227997 -314059 8383 -1108 -244918 -217703 -37587 -313039 -5188
19967 -290816 -189326 -188756 -267400 -4006 247866 19947 -21840 -166077 107968 -91768 102439
19955 58056 156009 -43376 -289543 217228 63257 45941 17045 -361711 -25307 -238126 -33798
19943 8347 -62528 151993 -154595 67940 -64341 -90101 392882 256781 -300419 -11689 73967
19931 317242 -119363 -185156 189622 -277663 109038 74992 76001 -478978 129785 257616
19921 257616 -370246 -146890 -36697 208915 -83479 -34729 -127163 187089 -124802 218925
19910 -20398 274602 -258991 -65482 86243 212714 -160726 167078 -176721 -103515 -177947
19900 -177947 35464 77572 16749 -303233 -416100 41919 -239545 148792 -26755 -155231
19890 -155231 47432 -157197 -201273 -7699 266882 -252088 -151053 -334724 119896 -94444
19879 -34916 117657 -10707 -63585 -165233 -115072 -45625 -132178 -185661 -447685 -30318 16433
19867 214344 -221702 -10272 32257 -107114 84477 -307063 53303 -58932 -354903 78272 -94887
19855 -95369 -86754 56136 -98463 -152110 49510 214087 5178 241641 11247 -37791 15135 -12616
19842 -244348 113012 17055 -247927 -392168 -119910 79527 261558 -250898 -148403 95445
19831 -124779 98923 -389995 -30071 171852 11344 -178785 248904 -83633 -391262 311733
19820 -15050 -215089 51024 -211741 -410893 62812 38473 152109 341954 -195135 118796
19809 -231646 -310592 170078 -151047 124953 70239 -163941 -36665 44207 -5679 35355 -47115
19797 -386739 -106769 -3881 -107187 150411 145910 -152743 4018 -162343 -408001 -62752 -159108
19786 -159108 12879 -18853 19367 96698 -71795 107687 -179533 -2034 13083 128710 -132965
19774 20246 -132418 11311 97695 55878 47762 -366549 201009 -156767 -56416 -194855 -92319
19762 -121549 -182982 -59181 -242203 -161505 -14503 85247 -474131 -201615 136648 117900 -89653
19750 -79652 16173 -139502 -460514 -303803 132917 179515 -308171 -125987 -41834 -197804
19740 -197804 -69260 -151592 -173422 47770 94196 234760 3873 -261678 -369937 -14607 -121296
19729 -121296 164664 -174545 -221307 -73704 -282202 -259451 -134635 -304634 32931 -126284
19718 -152819 -135963 6402 163141 -42240 72341 140155 -7350 67395 -166977 129920 -150849
19706 -32985 28733 -233309 76570 -97085 54450 -248176 -33853 312175 -171909 -78362 102586
19694 -287557 249102 257615 -329238 16469 -47184 177079 -80087 155139 -139436 -78825 -228474
19683 -228474 -275837 66469 -143460 -324136 78985 -70112 -64113 -245257 -25023 -152236 270743
19671 52061 -220 -128728 -203598 121471 130275 -8358 67757 -110449 -33335 25228 -113562 -94598
19659 -94598 -25709 -69358 -156491 -149779 162989 -33887 -400644 -52153 29624 -246056 140223
19647 -90354 -98261 -172519 -261163 -325158 29987 -263756 100288 -74469 -159423 -66437 -242597
19636 -242597 -32601 -111870 -125722 50878 -52537 199442 -102407 27306 264044 -218127 -107241
19624 -283018 -12826 -161389 -104044 -321740 45218 -137422 16675 -134637 93653 52056 184556
19613 184556 -13284 15790 376533 -271450 45248 132464 -76935 34968 -153042 -278354 -94279
19601 230788 -7315 231618 155855 88861 -246092 122385 70770 -256799 216071 62839 -269227
19589 75085 -123159 -358641 227529 172859 -134172 -163691 222372 -27015 224593 -53920
19578 -155606 65077 134931 22122 190413 -237815 -64690 -244963 -29777 60286 69877 -241619
19566 -33238 -244022 -29037 -29569 84290 -232416 45385 141313 -184814 100658 -143082 -119809
19555 -119809 -311735 -350807 2277 254938 42571 -86497 -124488 51926 -253288 -437313 -84928
19543 -49597 -169491 -269335 -192930 -145046 -100711 187393 69836 -132200 -224187 55925 15301
19531 -106746 202224 -3931 -12527 2213 -117307 -301398 -66202 100090 -121058 -213864 -56772
19519 -373728 17027 82961 -41356 -234639 -50556 -129105 94987 -203848 12437 173676 -38951
19507 -126923 68103 254195 -246226 -24817 -22895 -235266 41050 47854 -210289 -45759 -76092
19496 -76092 -44452 7832 132767 -170509 -144930 -76186 -55702 -154205 114285 90887 173118
19485 173118 75033 -206729 -67412 225643 -104786 24901 112916 48107 -6947 -81425 171410
19473 12955 48006 103826 -255626 110855 41407 163 -134817 47351 -308153 -143740 -36977
19461 -514234 -360140 12591 -83291 -73605 209749 -7524 -198719 -166553 66434 151136 -89865
19449 78027 137941 -264469 -456964 -4069 -193727 203190 -271205 -41795 -211987 -137968 42103
19437 144922 99013 51275 95311 -18049 140925 -142834 -96963 -223428 -135580 -66582 43476
19425 -180 -94096 24635 -63994 -179334 28285 -174863 56101 195446 137589 -315736 28508
19413 -177737 122331 -49327 -119220 390653 111803 194540 74484 61779 -108340 -235189
19403 -235189 -10880 83247 148751 -140624 358833 48760 234188 -147137 20663 -7451 81561
19391 -474423 373449 -40519 167873 -165717 -247794 -16011 -43337 115495 -476767 -61693
19380 -202936 -228023 -182106 -58820 170928 -143068 -247749 -317640 -69547 -86427 98379 -269767
19368 -19005 -257620 110991 -124073 187312 -146945 78969 -155785 -95937 92585 341526
19358 341526 -191061 -116870 119423 -287020 -56730 -331430 42969 118029 -90025 81528 -464736
19346 68698 -201352 -94644 30260 72478 54336 -14201 -202637 -269663 90668 -309224 10876
19334 -199472 -5349 -5287 -236731 -101711 488 22012 105965 -160002 14289 -74913 -208506 -233876
19322 -233876 179157 195693 -175509 218376 154571 -194897 -94576 -450893 -67614 124406
19311 -188442 187351 70568 -76296 121021 -4204 -162122 -308216 -100481 -198423 -240676 101510
19299 -29513 92853 53637 -81426 -64549 -220764 198133 -57048 -26215 -175723 -99387 -141232
19288 -141232 193784 -189460 6551 49274 241371 -14883 -6536 -695127 -108802 289224 216937
19277 216937 -76972 -184263 362318 -273639 -103192 327747 -68755 -206070 -174080 26090
19266 -245908 -350365 -236594 31546 -153214 23017 -15446 39370 -377642 25655 -63001 -184201
19255 -184201 183372 440719 -135726 -21053 -327315 -295687 106180 -25083 -331773 -380873
19245 -380873 -78021 -54642 -448890 -192365 -195534 -139229 -270251 184412 -76228 -42440 -288944
19234 -288944 193394 -164414 107021 -145812 -125363 -178192 33393 -331623 -211383 -2752
19223 321840 -163122 -298645 -95027 -149544 226598 225330 252202 -143106 -111067 -38685 -314404
19212 -314404 124444 -205367 -176177 336113 -128367 -180774 -129516 -251659 122138 -78159
19201 -29573 -229631 -73887 -129068 -216070 -56936 108084 15806 100526 -332050 3743 -54025
19189 63620 -25158 -231892 -63185 -35148 -194446 -138626 -63643 174785 -123221 7701 -512915
19177 -700961 -273843 -81266 25563 -120689 -145913 -356828 -247134 -212382 61580 110010 -85493
19165 85013 -185380 -14670 725 107378 -334430 -293759 -103293 -38455 -18740 124839 -219030
19153 8432 -99116 310150 -197531 -222635 75314 197691 4072 247547 210742 -94048 -320574
19142 -320574 -49475 -276958 -201875 -61368 -298877 -34293 -125858 -2597 199657 -185594 79988
19130 98196 21995 35543 -5874 172087 -109211 397092 -67129 -420126 386300 -4504 -33129
19119 -33129 -13540 -78612 190192 -420490 -9996 106076 -111359 -123585 118588 191408 69230
19107 222575 -248877 -52226 -122959 -79913 93815 215145 -347813 43740 17366 -111762 -204995
19096 -204995 154494 -196539 -71454 -165329 -37975 57831 -17606 67892 -74189 -228716 -15619
19084 123827 -269942 -29956 -209154 -548436 -45511 304409 47861 10549 277064 -341233
19073 -145922 -206329 -38491 62880 3381 -2987 237059 -127710 34138 -131394 -40309 -127084
19062 -127084 16304 -109216 -57290 39155 -114286 59299 -75142 -327732 -190639 -229385 214490
19050 35461 108992 84470 290457 98526 -19922 5039 198551 164039 157651 63349 184745
19039 184745 -1496 -10567 356 230212 -167963 -26779 -65577 -324773 -279788 177334 56631
19027 97599 -124136 40423 84718 -15084 -155428 -74067 325061 78609 -118650 -10630 -66737
19016 -66737 -211916 211886 -247276 108814 -244991 -75236 83946 -211742 284209 23766
19005 938 73836 131191 -330988 143957 -23988 -90229 -374937 -147583 301107 110144 -267339
18993 -44865 -116903 250727 -283939 -168048 -6336 -335262 108153 54919 -195924 -229680 -90467
18981 -59115 -59391 -208730 -87187 -70789 -35964 -199881 -2191 -69058 85537 161722 -126042 -61174
18968 88017 177949 133022 165838 -263020 -106062 -91858 16277 91108 89009 153221 57977
18956 199458 -26393 -63209 -443131 -227705 -269606 426665 -45163 -176852 -255642 28015 -205313
18944 -195038 72570 -77463 121553 37746 -25961 -64304 -232399 97279 161205 -149561 73059
18932 -62449 -143336 93668 -119344 -62204 -243964 37128 185905 -122912 40111 -28755 -213532
18921 -213532 -313219 -51409 87955 -106351 -122600 -8004 -158168 211499 -229408 -300098 -101037
18909 -262358 -253060 14601 116262 101772 -18965 16181 -118713 -145936 -115557 -12087 -13150
18898 -13150 172814 -115121 3338 -252811 153291 -22912 -64546 -16055 88928 256374 135112
18887 135112 -44945 93087 252866 155363 -271486 67412 -535889 336267 -493509 -5220 222416
18875 -62953 -309927 99368 -220652 12932 273904 -309689 -93981 -247212 -232147 138754
18864 114749 -2697 -161374 264685 9911 106138 -108909 -135089 -284040 -54742 80383 -39320
18852 236276 -294436 174103 -124061 77774 -83030 -218068 -308176 -12718 -131577 22017
18841 -109658 179617 29318 -43546 -155897 -330401 -330759 71794 116566 -132262 -278626 984
18829 350684 29149 57474 131848 98897 -133307 259369 -201017 -80943 68147 40379 294980
18818 294980 172369 245804 -66452 -163442 307043 -325426 201560 35515 -161520 -11676
18807 313343 -162641 -29298 -341329 74325 193412 -185539 119337 -114269 -294961 -130827
18796 -209063 120846 213812 -103696 60540 -83364 -109963 14800 -108774 -61597 168707 46580
18784 285310 -243031 144995 -332360 -10974 61242 -59732 -233975 -121771 -124511 61584 27469
18772 -141087 13054 -242478 -178246 -37559 -125519 -255719 -133145 -270074 231873 21587
18761 188873 -277353 138875 414082 39857 14844 -234889 343488 -165636 10969 117643
18751 117643 -272315 -97815 -183830 238515 -63936 -37204 99650 -405472 282817 53604 81888
18740 81888 209820 -13339 -18076 60920 -131293 -37812 -99863 -173890 -26000 -97529 -113257
18729 -113257 -355905 -125777 -426503 226109 52841 -363850 33250 -66961 -116576 219059
18718 -204501 -110928 -6049 -245133 -212361 -89297 -96649 -8070 10800 231121 -358171 338355
18706 63174 14606 -159249 -89517 -73383 98129 -270214 -229032 64184 -411536 -97757 -192470
18695 -192470 -134519 -42505 -37572 235063 33368 139521 -6116 -418400 106889 -260930 8806
18683 -195843 435259 123608 -150806 -129765 -17383 -1444 -6842 38091 -50725 97782 -132064
18671 145078 -61634 11144 278106 -101177 105 -3702 -192013 -329293 -96253 -75034 127436
18659 -292162 -84247 -103635 451930 -15761 19221 36694 59499 -72007 65816 169041 160059
18648 160059 -251608 131855 21843 -79064 65267 -64200 89020 -123097 38237 -149993 -108367
18637 -108367 96083 30960 44767 -192143 -71003 -38564 57040 -271656 -217794 -137208 -1196
18625 174241 -178951 -131544 224070 128517 -59436 248811 8578 31249 -152867 -21079 -308718
18614 -308718 66677 198527 -183522 -234706 -127436 -168074 -97091 668005 -116883 -214749
18604 -214749 -422880 45404 168651 -16696 -168496 -83639 -256591 233300 -246343 59544
18593 49202 -306677 -334642 93425 -214703 8329 -297338 -105465 -53272 -136496 -197189 -461292
18582 -461292 -81764 526367 -134123 37888 69036 -161920 -114513 17212 92376 -361738 -17726
18570 307323 -41250 72893 -298923 58220 -129520 -394053 -130739 13748 71750 -188848
18559 237122 77479 -4159 243282 -189786 365963 105189 -350321 183273 -407493 89171
18548 -211250 -305537 -64841 -188155 -91396 -338487 6767 270359 -87694 -270295 -30897 -127501
18537 -127501 -26907 252507 -89408 -295190 235140 415208 -98567 -171800 -149883 -100672 -66149
18526 -66149 60530 -194346 145480 -54088 -352022 178061 -216207 -51527 -183649 138712
18515 55890 33494 -272859 -2542 188165 -1463 -137035 -183139 -20923 334856 -278365 -51394
18503 -30608 -343862 38185 272993 -523947 -183664 34301 -224145 -489828 -203518 -312600
18493 -312600 131134 -372428 -316121 -28306 162833 -74665 126023 30975 -60154 -47347 40857
18481 190080 -22682 -89199 -191429 -9438 70278 -199999 180330 -158215 -143710 135509 161539
18470 161539 -171560 21536 -197905 240365 -61282 125439 -156821 291535 157465 172919
18460 172919 -32063 71706 61083 155450 290543 7793 -283339 -17072 -162825 -20372 -188469
18449 -188469 56435 169348 -135514 -52860 11511 -205537 -107251 -16242 90124 -269657 68472
18437 -220061 228080 221195 -168050 -279489 -111941 -155987 -215646 -208100 -125353 -235087 181378
18425 -560954 -114046 -412759 107845 -35296 -26128 -57422 -243519 66163 39180 -156626 -408074
18414 -408074 -122839 38918 -343083 -133956 -20469 124024 -299832 85469 -301420 -536037
18404 -536037 153387 -249488 42987 -50126 9101 -187943 -65534 -18976 -300042 -196133 -107909
18393 -107909 -413587 -160146 50322 30334 -103337 -101004 241900 -241764 -281725 -91059 -261951
18382 -261951 453084 65499 -199470 -194986 23659 -176579 161991 61220 24662 -218706 -375636
18371 -375636 -100900 279913 130949 330025 -123621 23599 5372 25764 184563 -400341
18360 -343836 72995 263746 -160590 114924 74159 -92691 -107582 385996 -35252 185100
18349 30261 18521 67613 -98731 321458 -95925 27767 -80018 122274 -369858 148545 67445
18337 -9331 -183881 207293 113873 143950 -183241 -278096 -50121 147006 -156942 -329273 81230
18325 252 33437 203922 -161040 13416 49471 -131975 -75141 37889 -44288 -108439 -65446
18314 -65446 73675 68429 182739 -123206 12545 -203125 30798 91813 -151525 -123379 -260246
18303 -260246 35496 239403 2140 -351821 -234867 -348927 133718 39005 17056 228079
18293 228079 -73511 -124976 -86198 143097 76193 199655 -127068 -313204 -132158 7374 116426
18282 116426 -28338 -480054 232029 130057 -44042 -103698 -196974 -210994 -83157 124319 99690
18271 99690 -55802 162902 -154540 -5904 -158406 81570 -129691 -5487 119728 293343 163225
18260 163225 -13323 213546 -22792 -109533 -233120 200737 -132494 -118442 28212 291617
18250 291617 170801 119825 138922 132391 -413 128402 -64864 -135109 50609 46899 -286928 -99268
18237 -154712 -403793 60443 -183722 1133 -198921 -92120 -12017 67701 64088 40073 83401
18226 83401 -228371 66608 -232769 39151 213354 58043 -250136 -19557 -225326 -159817 -202164
18215 -202164 -71667 268265 -23761 43957 -90286 -306428 -159789 -42567 -174986 159609
18204 -169807 -53400 -6332 6749 -117960 -2178 178078 68851 -30816 -68530 70687 -374800
18192 -348120 57628 -212342 -186737 156906 -67923 67294 25769 57912 -349119 195329 83902
18180 -7636 215291 320633 -140212 -33739 -85437 732 6166 -191472 201818 425359 34808
18168 80907 49458 -344702 18520 -5 149062 16109 -214561 -90326 -114313 5004 -57272 -213183
18156 -213183 -80038 141254 -75825 -828 413302 -98859 -123751 52270 129628 -68907 -18833
18144 -155361 -203237 -343509 -293898 -190623 -115358 -254177 -431278 -7227 -117599 234042
18133 -177562 -345886 81651 307536 80664 58764 118058 442311 4715 -107262 26300 -25966
18121 58659 -81487 -200604 -157538 -241169 47206 -12551 -74887 11468 36496 73428 495936
18110 495936 78702 -182037 -53333 163609 -91648 -295575 282953 173076 -5988 -183230
18100 -183230 -10364 -242070 -31767 148414 -122995 165474 -104192 -173818 -219870 6641 127433
18089 127433 -99486 -40570 -146377 19585 -339183 7032 83260 132486 -118914 7759 23071
18078 23071 -3167 -128171 17986 127355 -214000 -330902 -276009 -218401 -204959 85433 224983
18067 224983 33469 -166319 -490131 76918 -223260 -52646 -54714 60696 160666 -944 117196
18055 144224 108913 92647 -38756 -274147 -310036 131912 -435579 167940 -383564 -169146
18044 1792 -319150 76053 233551 138765 -524264 -333908 -34043 -11200 -179975 -10252 -29231
18033 -29231 235139 95138 -124395 264805 180470 -47780 119042 -165245 45822 -289588
18022 100358 64972 -107445 -35116 65848 -8057 -279765 161682 -3189 243518 56664 -128410
18010 309635 64855 -53528 50502 39931 56885 -22871 -302265 184506 -92853 88809 -222672
17998 90079 -33527 -67518 -427806 11699 -215513 -99399 92368 77355 -44456 70711 308295
17987 308295 -57334 -63914 -258512 248 -110775 16317 -198495 -8178 -155750 -126277 -296177
17976 -296177 -218889 -106589 78439 100291 -88034 -69183 -39405 66376 10361 163761 191733
17965 191733 247171 -132215 208223 30141 -19535 -310687 -270535 -208572 -71115 296525 46535
17953 -71725 32901 156075 72675 -33048 -234702 -45391 177534 44582 -75442 272412 42033
17941 79226 -256068 -178871 -423829 -59122 -113165 73027 -150008 -220700 372452 -523 80942
17929 -218388 56890 -219910 -200754 -60190 82792 101194 -50444 91361 33584 6710 107187
17918 107187 187054 -61003 -244976 197532 285509 2567 -13566 -154155 -117060 -194290 -176247
17907 -176247 -136541 -185474 109315 223522 -18543 122643 -49836 -2606 148277 79516 77899
17896 77899 -148447 -110280 44265 205086 442447 62636 199617 -2734 -279739 -108443 -280794
17885 -280794 -91983 -217895 -707 -241935 46336 -31406 75821 163040 -316717 138787 126260
17874 126260 -278935 -276734 3994 -367758 -21595 126930 -175272 -2881 17840 109861 54778
17862 109542 189741 -80107 -156854 -374531 -530476 -112700 29246 -63216 70129 26236 -240765
17850 195561 -57466 -117366 90687 -228234 -223286 971 354001 5734 170308 11826 366654
17839 366654 -198889 275466 -29300 -155709 -113361 -302530 17891 52035 88681 -19031 64744
17827 -226012 153404 -135662 197736 -106936 31184 -99604 42379 9154 215744 165870 -55645
17815 72227 -105484 -174143 106291 197571 -75290 -292506 -155213 -53390 221535 -488943
17804 84496 -393919 -339182 -32272 217203 236258 -84908 -327247 -346790 -145293 11293 254095
17793 254095 -318867 118473 110368 124383 36462 -212802 -430724 143164 44239 -141462
17782 245998 266600 159189 -31674 -136920 172894 304865 164146 70494 -108241 116576
17771 -191594 202222 169881 264205 -86104 524984 -77239 16002 4021 -293572 260161 281930
17760 281930 6454 113031 68934 -56017 -48844 -868 3371 -118738 -388168 37550 258906 -235003
17747 211094 196557 199342 -221155 111335 54181 65618 -20998 94390 -143872 81858 -40058
17735 -62420 -230349 -54422 -453818 -155205 111701 -221153 8578 40726 -95006 -238480 -117659
17723 -340393 193129 206367 179310 -285543 81424 -169309 -88579 47687 21322 113306 -142240
17711 4425 -32552 123635 -115747 10781 -74200 -54095 49302 -145350 416765 -78234 -398014
17700 -398014 -104721 109178 -125461 -4642 -127973 218345 -23818 -276731 93601 182801
17690 182801 -66650 341801 142693 -463781 160905 -149478 -4168 111651 3861 253939
17680 253939 89336 31870 238513 -5368 -308006 -91425 18645 -91544 -12634 112629 -86802
17668 279467 -199694 147310 -58831 35307 -88955 70115 -177973 100255 189178 -127924
17657 395814 -95892 -114094 202666 80518 147312 -276156 3771 50498 -94522 -175761 270 -60411
17644 -30741 -521623 -126708 -216446 212028 -64470 -60277 -41148 192585 423944 20150 122172
17633 122172 184969 -104709 367158 96259 261382 -132208 -109019 -254941 -125641 -162471
17623 -162471 -72011 18777 368417 -200222 32092 -138790 76762 -389958 75726 321681
17613 321681 213046 99583 8998 235358 141387 -93385 369784 -28147 25056 -38268 -229238
17602 -229238 15979 143637 325817 75497 -249183 -88208 -134105 70533 77479 -211663 86318
17590 8405 -91897 133833 -268667 298246 -172270 192536 12887 47407 -178030 25316 297325
17579 297325 60078 289837 -25455 200396 -69349 -203067 -206114 169351 -535504 -120660
17568 441252 -49034 -112382 73762 303892 -133463 -175798 -204107 132893 -46472 47648 -68780
17556 -60663 -151935 121161 -58108 10526 -125462 -28828 341857 -252681 204309 -392968
17545 21133 276523 149770 203961 -61153 147877 -189857 29257 28235 -30382 -156799 60003
17533 10638 78310 199055 293335 -461371 210302 -398531 -148820 123902 464330 251942
17523 251942 85615 -43583 -348177 224405 423271 158724 -25526 121046 8792 -138239
17512 -432827 -149926 -423 -206224 -33582 40614 127536 -160012 37300 -185967 166905 235701
17501 235701 108249 189274 175385 40960 -11927 160660 318408 -188813 -154595 111011
17490 386047 77559 -128808 -112657 269970 39023 -329645 221882 375379 -176326 107173
17479 13914 82117 193479 95104 178862 240508 300457 127643 235513 244346 291951 162034
17468 162034 -176702 154838 143878 162216 -48550 37679 201173 88863 234625 468698
17458 468698 230428 245905 82252 572651 263094 32557 -136868 21373 387911 219739
17448 219739 363756 489846 162324 388573 26301 113907 486111 389993 259168 229916
17438 229916 706206 407976 36838 419782 172626 264230 404059 266932 281989 118242
17427 -158361 441397 -29148 -108356 149827 240194 104166 180908 389535 279665 21056
17416 67262 192372 529430 156589 331052 141173 62184 54575 -28401 208855 234684 183813
17405 183813 161550 222763 127156 341551 215444 362356 438914 271707 223587 233084 161402
17394 161402 135844 -291437 85684 18762 302006 133276 282743 254195 -67100 4755 58508
17383 58508 -268293 427661 -75884 55819 256316 -327208 84524 287493 -36442 -3109 174330
17371 -119899 -359676 210036 204335 481092 -83324 -35123 4939 91214 129599 -69067 17839
17359 116902 209468 137838 257036 215122 201045 -121719 96466 81105 194679 51128 -169
17347 140681 -41572 48018 52036 84591 -185030 -27115 22809 -26464 356552 247415 -217606
17335 74006 161668 441509 68347 232180 87393 -196447 273219 91534 335267 199739
17325 199739 -90310 -158541 151018 144880 -153509 51260 -58301 -150083 -11127 74212 -35198
17313 -74952 120621 -19157 211569 83963 176779 88626 -123694 239526 356032 -129675
17302 446070 251289 442646 150612 309831 -227061 256082 388808 434549 129096 330495
17292 330495 91208 -175895 -212084 234674 43139 227043 25319 272422 309786 300327 -48071
17280 430527 55238 307066 -53289 396464 217101 -127897 213229 170697 272964 -35759
17269 -40605 365563 -99892 108654 145109 384365 41196 144042 34626 273036 106172
17258 -80755 13085 75200 101241 143946 244992 -372199 369709 193827 556393 82750 -8829
17246 275187 116352 119172 274122 248316 357998 227049 -188674 95253 361340 101943
17235 -44875 296782 323216 164929 -184034 -386676 7423 382570 39451 61380 -9243 -24439
17224 -24439 180865 -132816 42956 240777 87730 388142 207252 266786 -168948 255937
17213 124740 266825 108881 32437 158402 136720 -16061 246086 322251 505315 -48650
17202 297804 37230 -234038 475569 213547 485310 447869 158987 84764 47338 181671
17192 181671 -115065 370783 94078 373426 313635 312780 -59839 -43113 -158584 160992 306412
17181 306412 555796 146320 670342 227670 318121 390577 -2135 147118 135145 393329
17171 393329 19891 -164967 -25722 118567 165468 349423 243681 341384 65047 505110
17161 505110 360561 302016 259395 100377 142584 369880 352251 393004 349405 402805 25306
17149 340388 572468 -47459 -94050 53469 20279 392987 384428 533262 320466 -21651 -55456
17138 -55456 41826 290885 276309 239353 167203 247250 160331 396067 375210 129065 77745
17127 77745 545316 482957 633363 174274 181228 476039 -760 99398 260024 -12606 440560
17115 304857 243094 430634 319601 418806 536425 309768 -11558 267045 330420 358867
17105 358867 139020 178336 277090 89509 374076 229958 182221 532748 444581 555902
17095 555902 100828 448090 150071 316546 473581 252693 386071 427357 517075 304665
17085 304665 642246 379707 457800 331779 283498 214721 330675 364714 365317 534861 399507
17074 399507 298352 269044 83338 400148 488470 386453 473332 437452 286958 513299
17064 513299 238243 237355 442016 367559 281609 387682 381166 351947 52609 527341 498194
17053 498194 771791 415528 193106 286248 293536 136463 275185 406513 252752 787194
17043 787194 709409 501907 507747 354127 385216 545898 516304 570846 541697 576106 428807
17032 428807 793825 405634 546084 200516 269096 563460 378083 811324 364622 668165
17022 668165 472332 638903 581221 432596 566475 558319 500799 966949 496378 900817
17012 900817 444769 560738 566270 447963 630444 476488 810377 685155 377582 441688
17002 441688 471723 539987 926177 1008915 603649 858872 916118 896408 942090 424129 777650
16991 777650 669777 774511 662443 649996 609939 752444 806620 514146 758476 1023469
16981 1023469 500953 879845 893938 650149 780231 935403 727508 666551 1061252 710698
16971 710698 895959 792158 645884 796105 746960 1192115 732979 880786 571042 985234
16961 985234 961432 1008718 1016284 809898 1059513 955575 928102 939356 1046738 1147856 810206
16950 810206 988351 705444 964071 1221380 980551 960266 1015102 904575 1293982 697175
16940 697175 980916 1221930 1074592 1106606 926864 1101873 846055 1033220 1342240 1205236
16930 1205236 1061806 1223473 924097 1085201 1261633 1140000 1695916 1188533 1152686 1072328
16920 1072328 1175178 1125242 1497019 1199515 1218097 1216833 1265767 1492236 1277597 1271416 1307070
16909 1307070 1686187 1771085 1512486 1744084 1515874 1355811 1424567 1630640 1493664 1605257
16899 1605257 1722659 1470419 1687450 1608443 1237102 1797957 1795768 1742980 1446837 1497897
16889 1497897 1795335 1470178 1928739 1640098 1843239 1953072 1668694 1765260 1871513 1499739
16879 1499739 1963107 1956332 2062026 2098909 2002566 2343876 2438411 2365804 2099951 2542455
16869 2542455 2118070 2475448 2142538 2327400 2199804 2512717 2090254 2042193 2733669 2873381
16859 2873381 2339215 2615636 2724086 2715510 2648312 2495646 2937174 2744030 2709129 2774056
16849 2774056 3061828 3031693 3102524 2910757 2695826 3291007 3328552 3093633 3347339 3305605
16839 3305605 3460031 3563117 3458256 3528531 3771814 3760040 3836735 3872182 3879465 4173841
16829 4173841 3798368 4012640 4180650 4359344 4281617 4176509 4759320 4510561 4632287 4803577
16819 4803577 4888827 4881148 5283335 5000183 4959611 5392195 5275946 5567022 5698130 5558404
16809 5558404 6145666 6014383 6283510 5968657 6315274 6346142 6644236 6765715 6992397 7157459
16799 7157459 7690123 7400221 7628959 7699991 8210208 8152752 8380527 8524894 8993453 9152237
16789 9152237 9540393 9858178 10113969 10357293 10122365 10826042 11136795 11468916 11697218
16780 11697218 12297460 12746247 12867079 13012777 13705588 13972587 14586193 15113327 15379812
16771 15379812 15788106 16681773 16672592 17778089 18109195 19306752 19682953 20363644 21268866
16762 21268866 21929757 22903340 24073452 24899079 25884123 26928442 28228154 29088761 30758601
16753 30758601 31848083 33792686 35042576 36990087 38723599 40872521 42629319 45026994
16745 45026994 47197920 49812025 52535338 55576657 58776321 62097640 65691461 69734027
16737 69734027 73991730 78318476 83704967 88452639 94351410 100021484 106343293 113181745
16729 113181745 120227126 127838290 134983040 142688169 150678789 158573609 166227563 172925065
16721 172925065 179786274 185603620 190177802 194089911 196433007 197455774 197739317 195747845
16713 195747845 192817457 188501688 183166843 177159108 169895348 162523967 154997291 147087945
16705 147087945 138950135 131480831 123457028 116316795 109485915 102553067 96121067 90515563
16697 90515563 84879667 79431937 74970234 70214975 66492152 62632197 58655485 55804460
16689 55804460 52646430 49820806 47024655 44459105 42908115 40249364 37986963 36233798
16681 36233798 34610763 32773491 31537225 29848750 28604534 27357952 26268103 25212982
16673 25212982 24377307 23376261 22060697 21415260 20384811 19813576 19060876 18318020 17690032
16664 17690032 17127851 16587996 15793743 15032515 14554773 14327288 13494903 13336465 13180951
16655 13180951 12705970 12231327 11690953 11571822 10848567 10905088 10596032 10230665 10068760
16646 10068760 9636518 9261426 8744858 8879916 8488633 8414633 8103549 7980197 8003941 7839741
16636 7839741 7230370 7224226 6840221 7033264 6706856 6489581 6142298 6182809 6372937 6236641
16626 6236641 5621382 5754639 5523698 5462293 4928860 5026634 4980872 4984045 4879784 4867153
16616 4867153 4895691 4270437 4444655 4172992 4530435 3911606 3975981 4181553 4075160 3964682
16606 3964682 3773135 3780749 3854808 3664217 3721741 3669053 3394505 3488711 3583671 3406436 3174286
16595 3174286 2920859 3139329 3095378 2862571 2968934 2881100 2728953 2802582 2601878 2922964
16585 2922964 2927269 2417660 2864019 2516008 2470318 2297428 2440339 2421427 2436878 2125748
16575 2125748 2232903 2265498 2296346 2038722 2056569 2182910 2362729 1880450 2033887 1932914
16565 1932914 2092754 1685260 2186051 1836098 1728661 1677409 2043063 1440537 1559037 1867425
16555 1867425 1816879 2000128 1964509 1486396 1664437 1534722 1417222 1612076 1434986 1739677
16545 1739677 1496796 1152735 1427642 1621283 1210924 1394288 1293713 1382788 1522020 1376924
16535 1376924 1218997 1539426 1329307 1423237 1177316 1184296 1238294 1127337 1064068 1077663
16525 1077663 1038954 833278 1023753 847911 937940 1105369 1242415 842757 1163083 1321346
16515 1321346 946074 1288429 963760 935697 1051140 1101540 1095318 865538 940773 1257398
16505 1257398 1198515 705115 1068458 1301578 809713 702401 756504 802896 768693 948916
16495 948916 484134 586974 637997 829196 926504 863934 789762 622951 767141 656039
16485 656039 672961 703474 810520 942200 1025272 1015243 516631 576386 391772 599361
16475 599361 318313 797652 662712 644757 767072 642009 769550 810916 647653 834862
16465 834862 901945 541407 564536 405980 534692 551641 580177 611328 670332 195556 892074
16454 892074 496081 395888 854357 441124 470575 811565 554612 578896 610060 499670
16444 499670 268620 413733 335897 280234 762979 515400 741967 692529 521366 437371
16434 437371 500204 472537 352434 488770 509868 372960 418677 460244 260969 -33023 622327
16422 97344 100005 237589 774938 437632 360865 211600 675251 -1970 356210 265600 22038
16410 126612 403389 244959 332291 551667 567266 198788 496203 533443 181201 295922
16400 295922 190442 310605 -11868 701102 399686 426851 196878 36781 183872 501024
16390 501024 124946 298822 336844 6480 297636 288807 588609 110877 152403 417749 356260
16379 356260 191198 181426 588148 403165 464853 650723 340320 -151680 445045 403934
16369 403934 586781 276135 393288 249512 32483 579171 151205 130239 393240 169581
16358 492660 154242 311284 22057 205086 275795 221709 303357 223341 409969 196349
16347 123874 224785 282269 -30715 202773 155774 472563 154519 262519 19779 -9882 322018
16335 99429 437070 372276 81164 56569 34860 125630 -94323 -69212 -142352 6622 374409
16324 374409 241967 -108759 217997 32618 302211 363652 162968 133356 86200 123405
16314 123405 156980 181843 501222 180398 295938 194415 136027 374357 121489 326626
16304 326626 71373 303134 154018 83049 188664 135690 148917 190381 20434 114692 -243115
16292 54495 60303 -251675 600681 128524 -47577 169505 -295030 250939 -96846 370815
16281 187110 174239 436448 192049 38221 327571 182862 206398 87952 179975 96761 342210
16270 342210 -128630 125224 279149 467531 342168 -520398 117954 91939 78397 -127513
16259 -4158 -58244 63525 63005 61087 69359 84367 169836 128475 220750 -153068 -2674 -243196
16247 -243196 321112 -278885 159057 119344 245963 228972 191495 -36508 146047 23023
16236 309730 18544 279840 390617 -224540 163299 -136477 -109349 294898 -188021 195635
16225 -18800 439158 170945 -97291 3150 186145 175647 30347 197631 338361 -14200 288069
16213 -573142 216196 -31688 -337197 176210 -9020 196682 -148749 -176598 83626 586498
16203 586498 -29199 179759 97275 -164525 -173001 -51369 -131334 -93296 -33747 -147233 14390
16191 208438 25824 75713 528 137825 237766 163610 182472 41225 334177 -105553 326791
16179 162464 -131454 -317132 323769 -116858 -55996 -13833 15236 -81576 -124316 -186892 246323
16167 -281022 -29043 186351 2631 -190520 -13933 66860 226219 53028 -303748 -96726 -140321
16156 -140321 -203851 337380 156482 383263 -39577 -262650 227429 -131997 445448 -65372
16145 -70087 -82444 -141297 143488 323763 403426 23883 39549 -136772 -198265 236607 -15060
16133 106175 153718 -125928 103272 362398 -39751 -101706 -174377 207411 -50137 -137202 196099
16121 150628 -245306 -150875 -206716 -255874 446998 317876 108988 388240 -95043 83365
16110 -25260 -11057 -20205 -134398 159044 -34992 39720 -340123 51608 -69244 258797 215473
16099 215473 33426 64522 205469 57621 148235 -92782 -39501 42078 54295 221915 -157130
16087 -265290 -265528 -81806 -25126 175746 217257 -103713 -191230 -214675 43041 -145209 -175254
16076 -175254 32858 232307 -740 -56973 -44087 -144212 17470 -23425 169909 -86051 -268015
16065 -268015 -179915 -295740 -95553 241316 -83434 193386 132384 -210863 14912 -202860
16054 143689 -259196 54325 -324266 -430336 436318 -25629 164606 -90513 -197489 59154
16043 -31520 150644 178670 -180456 205762 162913 -65697 140189 -89661 -40442 -37880 -245838
16032 -245838 -105452 -76358 -223780 18241 -264919 51329 184704 -180099 -39667 82893
16021 165834 -287415 -232482 247382 97140 252852 -201562 -48482 -393098 138305 171658
16011 171658 -213845 -69043 -460088 -269725 -368127 266794 -61493 44726 -118702 -262073
16001 -262073 -299411 -168195 -30833 -13091 -197121 -60212 -23825 7131 87448 223941 59272
15989 -188851 -225685 264404 -29408 34170 29996 70206 57616 112019 224585 500793 173365
15977 -150650 -113317 -141666 231454 141763 -229420 355701 84208 -97369 273742 289777 -56748
15965 -121130 176854 284644 -83626 -155386 218978 479453 108745 -61235 -111267 392370
15954 -77307 138298 -249649 -62215 -34360 -205308 125715 -52682 -259489 352604 -56721
15943 -137484 200296 178853 73585 -304413 -298185 44564 -185124 -437453 166905 -91541 20530
15931 21317 -260462 67267 29229 -215356 -214971 -217208 -364489 -160716 -161200 -244697 -225959 -275123
15919 -275123 -61828 -324613 186071 -67973 122737 23173 -221604 60070 -77288 -74123 -238724
15908 -238724 -98743 7768 -46869 -120151 -202701 14702 -164931 -15244 -227288 -27224 -207255
15897 -207255 100614 123415 -147568 140799 -113684 -213722 40830 -104855 -317824 -192108
15887 -192108 233502 203838 74843 241467 190211 23675 -15653 10920 248519 32683 129
15875 -111521 -174914 -258700 6951 81878 -194750 -529031 -23473 -164286 41211 10291 -111055
15863 83343 -183911 -114596 10497 -39139 324587 -62488 25000 198619 -77425 -100484 32661
15851 -137071 -396503 163047 150882 177440 -13795 -103865 10743 -86329 -92772 110825 27124
15839 -306246 198552 -258441 -62500 -194269 -220071 99892 -31069 2352 -6485 113010 -21466
15827 328332 -176411 -98307 -102163 -281265 7958 -99317 191479 -84996 237964 60791 44652
15816 44652 49655 85456 13436 212738 -40408 -45660 -93559 -208309 -195261 -290882 -258624 -275245
15804 -275245 176230 -312136 -255188 -521235 -179623 -208302 -93036 -126682 65281 18526 -210241
15792 -146581 123431 -74648 136615 -138531 141472 26462 252397 -37029 -180275 -173765
15782 -173765 -197177 208568 -223411 153005 -264244 -272767 149518 5370 -105616 159478
15771 -100049 56458 -173298 52552 211925 96252 -155460 -66710 -161677 69697 3755 26595
15760 26595 9493 -186475 162562 229936 47892 208148 70745 -214271 164973 -177640 -47208
15748 -65199 288070 14845 -92771 -117133 -157646 176689 73583 39445 -155261 63046 -31300
15736 -114774 -154829 -293643 -206781 -30166 -228345 -180280 -8838 -125477 -366097 -28298 -290160
15725 -290160 156746 162003 248960 -257656 -10443 -278144 -189159 -132077 -351662 -61934 -152971
15714 -152971 153249 101233 -159882 -125669 -19847 88742 167503 -186243 -57350 56492 211468
15703 211468 -174285 174869 21729 -297394 -83342 170475 113881 -198613 278314 -130647
15692 223179 135137 -192748 311242 314778 220008 29158 -66227 -28751 -30137 -33714 50215 123702
15680 123702 119903 -325621 -134025 -59353 319528 352564 -165071 -69371 145559 -110644
15669 105858 -1880 -200462 205406 39568 -13535 -131622 33966 158623 -83758 329965 236081
15658 236081 -39400 134004 25509 -184901 -103141 -172571 -61700 41066 -184779 87027 -226228
15646 44022 -147812 -152524 1333 11043 227972 -117192 113851 36871 -163684 13311 11006
15635 11006 8839 -88346 -150770 -133093 -15667 -31755 -285668 -13147 84658 3873 -5592 49847
15622 152840 -72359 -223226 111759 7074 -33891 156705 -82884 -30119 75918 -266552 -334574
15611 -334574 293587 -495383 -210333 215419 79450 115800 171186 -261967 -256046 9555 -18176
15599 57924 -184398 -149841 139244 59275 -407004 -454215 339981 -86728 -234773 -102685
15588 -133187 -95687 -174749 -57299 120908 300175 -98483 82993 101880 116713 67037 -86567
15576 8379 -40353 -93639 -92091 -87918 106055 281905 -221175 166524 210083 -172041 -150991
15565 -150991 -159880 -59229 76387 95348 -316130 2276 50592 92038 48683 -240096 165678
15553 89334 -215298 266882 128222 -290034 285631 234779 131270 -291519 258196 113741
15542 167815 -153794 -111704 -344697 -47807 28871 342009 105501 -173573 -199385 111247
15531 196531 -169255 -269600 -233824 111358 -35446 86943 -31041 -120441 -390751 -369579 108985
15519 270951 86805 52519 -417857 3677 10908 -171257 -21474 27720 -317800 -92637 -67238
15508 -67238 29024 -59617 -146234 77052 40539 -404890 -265847 -147734 188149 93714 -197108
15496 48503 -52594 104204 -144005 191048 -87369 73965 198562 -294143 10388 -149022
15485 94685 -1741 -155865 164037 -71666 121027 -37345 -160865 -270213 -97283 -92777 67250
15473 -122168 -321049 -185313 -220719 -91027 -122566 241107 -20829 130914 203190 80800 28481
15461 40529 -159582 -26748 218240 239812 -152360 17811 -125595 153979 427438 216776
15451 216776 -215302 383103 -178285 46787 -275545 -73398 -277834 -204979 46829 -79590
15440 128733 77630 94444 -223586 166760 121891 110681 -284286 -121065 -258727 -184443
15430 -184443 221227 -65869 22472 339857 141289 144209 -4538 -8673 -209635 56968 -94057
15418 -188583 207336 -50108 -310009 -42438 -3982 -322106 -83402 -213258 -214059 -161729 3552
15406 31043 -147945 -79822 -45422 -13802 17210 90569 -56436 -77721 105594 -347256 -62637
15394 -31048 195940 54774 321436 -90110 149703 -269839 -13760 -103745 115302 125900 306467
15383 306467 -41449 -54731 231236 -60004 -44887 84869 79240 -7578 -68005 -172510 125955
15371 107691 105184 -203591 134970 -68764 420901 46199 181734 -358925 122304 39796
15360 -111246 -105023 334735 -333760 317549 198800 175628 -105065 165567 74496 -247306
15349 89789 -187746 -348002 -292677 -140786 48854 -61830 -11673 229876 -164 210256 6188
15337 -106925 126519 -24567 -17079 240811 -84341 241417 -29839 -41318 -264570 -38590 -254073
15326 -254073 108555 -28924 7675 -411866 212970 -152096 193789 152728 64974 78253 -149359
15314 -140525 142518 154130 -163793 139660 79551 746 -2236 379674 116148 188702 149210
15303 149210 -286323 -268263 -33048 398432 -7445 -176198 70998 -58973 77685 158238 136916
15292 136916 87534 -225577 56321 -89067 -165153 92439 -349625 -58500 -118629 267432 -4420
15280 237782 173031 112304 257158 -231428 -163833 179212 148391 -29140 207356 226641 578646
15269 578646 -12034 189733 79145 132911 142227 292578 -147676 15069 74557 -47622 190979
15257 -51090 55205 355230 96636 -103285 -202087 221079 478293 458324 949767 1212536
15247 1212536 869281 1334452 1208103 629993 115076 68448 26720 -205750 240484 -95055
15236 -115637 -168541 101210 6708 -173392 65129 -378724 103659 -60950 108376 -79568 -200587
15225 -200587 51483 -146363 36542 -175726 200396 232873 -66407 92345 188164 -105247 -26742
15213 62570 291495 -106237 156065 166828 174681 242910 -130502 -102742 145265 -203174 -157112
15202 -157112 273588 27556 -20755 -259192 -126988 -245261 90266 31092 -90364 -253086
15192 -253086 -292815 68019 261777 287352 -5863 235466 37219 41650 234424 195320 -279461
15180 -11196 -72280 31882 69552 -34639 271805 426654 -48184 284901 35733 76410 -341921
15168 269454 -171652 89606 85742 288735 -126972 -174604 235310 225385 46135 -220815 177650
15156 -2680 -12694 -168774 174325 110087 611630 361942 299492 -56161 179127 209006 -119745
15144 -109953 335160 -88767 41619 -110697 -602752 201736 -130032 -569300 -52247 74966
15133 -33910 40078 -105622 -49279 309162 -32229 260750 -103829 -25809 229917 -103727
15122 214773 -8588 315235 254739 189852 -107822 -52557 -197152 124830 -65799 137293 -39669
15110 -190065 81703 291255 63367 225008 3327 56614 127784 -18967 99285 123228 114916
15099 114916 -231250 -99264 -54410 32953 -1037 211188 198293 261296 376809 314861 95708
15087 287503 203778 -72468 146752 177407 232020 -208686 91416 -112870 273138 152101
15077 152101 85681 184125 675684 117819 72223 358546 81635 53382 159055 -192806
15066 -41909 143892 521976 184340 -76249 60793 108428 126307 -65587 221710 23353 155563
15055 155563 149762 313081 63061 258134 17340 108575 27328 224923 125680 166527 -104040
15043 265545 129260 -129568 381341 96352 -103392 26765 385974 57944 -10644 314408
15032 137130 485958 153826 142719 135299 91678 415188 271141 445817 99965 429609
15022 429609 40407 37033 218887 266954 454572 -121870 115960 166556 -117026 -23885 113502
15010 201929 49795 64066 359483 369665 219142 163023 26689 102175 372271 270346 160846
14999 160846 -113056 488268 514876 164979 166846 -156184 501907 258895 137718 152434
14989 152434 80703 100734 570897 197411 300876 399161 369936 611772 210241 169492
14979 169492 295433 372940 -31872 -103218 484651 74938 -82076 126175 136413 343069 216407
14968 216407 63242 98004 196577 -183539 328424 9781 381413 213549 187505 -103943 -104760
14957 -104760 213642 208384 200322 311811 -2768 256829 283730 190408 278194 225349 406162
14946 406162 129722 475058 47928 177161 319076 324528 107169 359367 170448 546693
14936 546693 314477 438064 199087 183296 391562 459562 362601 338426 58619 286693
14926 286693 146207 25990 78668 125486 215197 156030 182042 380729 -102159 -75133 34574
14914 204761 908231 3510 186748 721145 624269 219634 185027 607424 336704 81829
14903 401265 371057 137769 359718 87321 435757 -160527 184486 432080 -453142 -87516
14892 -85028 568672 605824 96377 270822 169599 73792 -149934 -71293 442986 256412
14882 256412 484139 315953 272054 150688 303077 371943 371279 483574 368668 258940
14872 258940 435187 269084 637764 292483 33200 438305 165879 501649 415482 290812
14862 290812 307910 117664 495766 -187783 600103 292768 718615 491520 475234 362856
14852 362856 512821 373817 174759 620740 433873 409524 110415 482303 215819 367257
14842 367257 547580 373082 547645 560920 596712 712953 197539 325647 206733 753632
14832 753632 646378 405872 121071 503361 439572 494707 556755 319261 488615 332579
14822 332579 309077 576079 275187 228346 398722 278794 364363 493744 464016 572409
14812 572409 585418 523713 680378 513704 699327 634967 491117 281852 605373 521301
14802 521301 354509 441663 286204 533370 64114 462337 511774 444951 424837 496383 398462
14791 398462 416052 164631 573534 521074 147688 413724 465798 368620 593507 463796
14781 463796 582252 524200 666381 445866 288502 575363 205244 729980 367570 591616
14771 591616 632838 198512 277991 604114 614921 458204 778685 627533 543130 448723
14761 448723 741409 588883 501965 661459 271064 272003 480236 578884 452614 627456
14751 627456 373028 821247 757676 123479 619336 608168 740028 817030 562898 518246
14741 518246 516291 878864 516231 665047 735155 503915 526560 622139 586900 802989 559208
14730 559208 526518 589557 336804 1013459 544954 825502 603941 567761 671810 517956
14720 517956 590202 820693 981479 984818 782791 744665 679582 847304 598535 665418 689399
14709 689399 794592 705601 625279 1002089 704556 608449 655171 727297 865360 853683 697636
14698 697636 859002 711241 812039 967533 722307 828434 907852 728766 797727 716063
14688 716063 856951 954014 1132312 699185 581514 867132 738354 547743 884014 917089
14678 917089 1072883 1016010 938281 916980 781485 1046726 1004399 566197 289518 873907
14668 873907 796312 785455 661803 725586 890375 895789 918315 979836 1115049 1118697 994737
14657 994737 1267113 890153 1220557 1166588 751964 912345 1272532 1032482 964156 1217540
14647 1217540 1059151 731733 1016552 1105298 1034124 706926 991324 1298610 1109819 764876
14637 764876 1040058 791091 1207873 1456419 892278 1265398 982000 1341148 1045094 1107540
14627 1107540 775118 998834 1296134 1247300 1202373 1381555 1522725 1446411 1348683 1470681
14617 1470681 1260720 1152380 1098439 988370 1048440 1487312 1170083 1206006 1522297 1511182
14607 1511182 1561714 1673959 1164740 1144205 1243060 1202468 1505849 1355941 1644459 1480118
14597 1480118 1769130 1811285 1249127 1177150 1755968 1541358 1490264 1674815 1532782 1627331
14587 1627331 1836667 1983504 2077860 1768101 1490193 1581849 1957999 1643794 1610371 1429634
14577 1429634 1995130 1846671 1886852 1577409 1830186 1913763 1984302 2011141 2239741 1766423
14567 1766423 2291917 2137856 2390001 2295725 2212257 2516563 2433802 2397946 2781254 2523134
14557 2523134 2909231 2928843 3368144 3323046 3201575 3919592 4779881 6134919 8398435
14548 8398435 12067261 20208474 35773868 41957771 24621113 9594188 4021634 2355757
14540 2355757 2303345 1970458 1890512 1779502 1699495 1731837 1885880 2044050 1783545 1806188
14530 1806188 2051906 2016594 1955595 1726984 1836444 1881076 2373896 1951510 2091268 2238070
14520 2238070 1999244 2110332 2227345 2449012 2130788 2337281 2462348 2579500 2554201 2487984
14510 2487984 2361527 2564298 2522856 3018672 2433240 2773014 2783244 2817440 2573421 2675013
14500 2675013 2935519 2778792 2719086 2948617 2885775 3253606 2885213 2778817 2987966 2944116
14490 2944116 2940900 3213648 3484918 3326437 3066334 3227484 3366644 3431670 3476207 3494039
14480 3494039 3433715 3488059 3358775 3510094 3484363 3938750 3803778 3905997 3468093 3768710
14470 3768710 4114910 3818264 4159563 4175523 4150747 4092097 4140057 4283344 4011563 4371655
14460 4371655 4166778 4485709 4479047 4661425 4917288 4595077 4688575 4274127 4586716 4920665
14450 4920665 4978030 4824660 5222134 4939419 5061332 5489161 5378932 5345636 5686154 5475876
14440 5475876 5528904 5595091 5795241 5757017 5760340 6154246 6132965 6350650 6391494 6111960 6151354
14429 6151354 6309146 6670118 6644425 7081839 7085358 7102155 7146665 6954079 7038585 7463360
14419 7463360 7686010 7519003 7500862 7795655 7997149 7847322 7819358 7882851 8603963 8066468
14409 8066468 8347369 8670635 8818574 9046383 9009829 9036740 9257970 9592397 9549358 9548039
14399 9548039 9925231 10095059 10131105 10271801 10809010 10667844 10977602 10982508 11067113 11596936
14389 11596936 11744584 11769007 11840614 12350470 12921959 12693934 12631687 13083979 13162173 13681082
14379 13681082 13672560 14130211 14446195 14627835 14956662 15740930 15479722 15904929 16012682 16217878
14369 16217878 17025341 17026806 17511924 17917703 18056781 18372262 19362424 19299248 19935109 20583613
14359 20583613 20533324 21006752 21692185 21854890 22614008 23153090 23902382 24383312 24846528
14350 24846528 25122947 26259438 26878277 27877175 28238641 28738159 29648063 30844565 31655568
14341 31655568 32244925 33239778 33623290 34916889 36226982 36957729 37965784 38938327 40337017
14332 40337017 41634612 43051467 44074117 45570787 47045804 48291818 50214345 51832384
14324 51832384 53790681 55930733 57408842 59424146 61559097 64009805 66257985 68783258
14316 68783258 71539277 74356703 76798731 79964188 83461219 87266543 90935425 94515244
14308 94515244 98660120 103238528 107629424 112466381 118112338 123466225 129488095 135684488
14300 135684488 142392154 149266344 157404715 165420925 173889486 183018554 192654565 202797847
14292 202797847 213574511 225224618 237667378 250394515 264206459 278167782 292666572
14285 292666572 308047166 324123059 340555735 356946033 374235633 390682790 407028416
14278 407028416 422661640 437023625 450469269 459219560 464615119 468099195 470494745
14271 470494745 471113167 471632956 471865001 469641268 466804236 460984063 450556284 438194805
14263 438194805 423956841 408392611 392145753 375295142 357889851 341021517 324468467
14256 324468467 308148289 293085564 278448741 263848552 249991327 237035349 224663865
14249 224663865 213124819 202200347 191526741 182132516 172881507 164630231 156694964
14242 156694964 149081617 141725628 135019379 129028722 123296747 118023465 112553595 107539427
14234 107539427 102953513 98594460 94530868 90725788 87459779 83601712 80290283 77562870
14226 77562870 74450339 71807225 68636352 66502208 63681721 61780649 59711339 57715971
14218 57715971 55600642 53691948 52369160 50367339 49228612 48004854 46335802 44408718
14210 44408718 43541213 41687486 40856711 39898066 39291696 37922631 36446244 35581634 34613729
14201 34613729 33559624 33044681 32014620 31082445 30410891 29638467 28891070 28278397 27398590
14192 27398590 26741556 26169528 25795026 24994662 24477692 23661386 23548153 22504273 22031076
14183 22031076 21496632 21246240 20854537 20279106 19903892 19692883 18896057 18829058 18091328
14174 18091328 17691244 17531609 17580273 16891962 16814069 16314367 15997549 15542761 15182165 15307520
14164 15307520 14484763 14714546 14277723 14066536 13825989 13625182 13401775 12941955 12825094
14155 12825094 12522597 12507942 12230449 11965821 11725200 11736387 11439318 11609160 10731971 10778869
14145 10778869 10800452 10658858 10625390 10524561 9969996 9836005 9692720 9458817 9751334 9135703
14135 9135703 9120735 9107669 8673600 8689734 8918732 8601049 8338334 8181940 8156978 8024624
14125 8024624 7792832 7828002 7762110 7682583 7580018 7589278 7522760 7257860 7120335 6985684
14115 6985684 7051951 7053610 7349778 6733291 6663023 6844759 6536353 6641578 6346662 6610458
14105 6610458 6017588 5855872 5995122 5935348 6058968 5640166 5814193 5607603 5582609 5890428
14095 5890428 5468311 5651292 5340246 5155681 5053469 5116251 4993403 4981016 5039652 4858914
14085 4858914 5011615 4539327 4377222 4973244 4562433 4600496 5124633 4616435 4705549 4509787
14075 4509787 4320678 4377237 4532159 4271776 3907341 4587241 4075356 4145514 4178161 4073758
14065 4073758 3991126 3745904 4028632 3895729 4127738 3988722 4061626 4112604 4167454 3921613
14055 3921613 3887745 3709956 3996790 3494633 3804873 3708883 3624062 3532227 3494115 3597843
14045 3597843 3252443 3588503 3314651 2968848 3307537 3140002 3289391 3092433 3151796 3162036
14035 3162036 2736880 3368076 3099648 2929219 2937019 2844229 2849976 2868301 2702011 2951713
14025 2951713 2547631 2934835 3027790 2715421 2769048 2485046 2386382 2297961 2596591 2503630
14015 2503630 2504723 2303819 2384631 2454641 2462907 2034543 2415213 2515804 1966600 2147970
14005 2147970 2058037 2087813 2154830 2168134 2149479 1986867 2181955 1843096 2234455 2184532
13995 2184532 2139844 1886129 2073867 2122548 2470409 3205871 4536504 7688473 14311996
13986 14311996 29804701 41468510 28338433 14386750 8043703 5559891 4696551 4311390
13978 4311390 3343564 3092720 3019934 2634742 2724072 2711260 2602259 2465315 2763253 2578546
13968 2578546 2446121 2160668 2295070 2324955 2305163 2082026 2062308 2329062 1990111 1994099
13958 1994099 1918530 2068670 2279805 1953646 1862103 1858438 1823113 2043326 2264188 2118031
13948 2118031 1905723 2153531 1750331 1501898 1825185 1810564 1846137 1907066 1784390 1574815
13938 1574815 1747756 1888880 1608579 1851211 1716295 1737083 1701125 1643902 1396398 1723912
13928 1723912 1790349 1600305 1686195 1592720 1414919 1485601 1704727 1451699 1355439 1390826
13918 1390826 1147466 1267898 1632663 1554161 1697798 1473482 1313590 1382046 1869716 1110289
13908 1110289 1280527 1469620 1561296 1659446 1411401 1371006 1562858 1217097 1378024 1202573
13898 1202573 1197732 1439240 1723525 1411579 1383630 1322085 943533 1425124 1075949 1036318
13888 1036318 1241664 1208041 1699441 1057480 1674478 1471176 901017 1300008 1135512 1143804
13878 1143804 1213365 1135451 988870 1075808 1301632 996978 1496031 1022580 1241585 1391525
13868 1391525 1494209 1070265 1221142 1507241 1279398 1333816 1395095 1081560 809546 1005725
13858 1005725 1097197 795624 1160465 1138065 731888 1028261 851280 1010482 1253159 1019766
13848 1019766 1331954 1299617 856532 1204350 1147619 1381349 703375 959704 764867 783303
13838 783303 694132 989051 954104 1188033 1200076 1025534 1027046 978025 1077525 1003911 1223193
13827 1223193 945980 307312 818602 1270005 1155890 1038844 849281 917941 851331 729781
13817 729781 826582 946596 572770 972224 696459 564215 757009 751151 762386 922312
13807 922312 607433 403640 889264 843954 731411 552796 500158 849529 1084311 1302339
13797 1302339 223625 987644 502605 653848 730336 731708 765523 736303 914994 900915
13787 900915 590899 461182 600993 739881 666237 590330 683034 874253 649018 653767
13777 653767 926948 493115 400837 881783 518479 672131 662792 544685 832355 660917
13767 660917 675046 730927 758255 714223 855577 786137 938736 482043 749011 701595 664638
13756 664638 893646 765942 377060 804352 664453 995805 542548 437124 993563 683207
13746 683207 481877 637210 630910 803244 794082 710190 604794 413079 751852 758774 427278
13735 427278 704448 721007 533080 271868 655398 662271 679827 611775 777172 484959
13725 484959 636009 596533 627390 512666 474721 566610 579355 626421 485135 322369 665493
13714 665493 464630 635667 446177 470933 821092 687622 731449 774389 605051 572832
13704 572832 555188 670747 854077 653457 249794 528558 437346 533117 398354 468311
13694 468311 255519 252546 406291 803717 701539 701001 679953 242130 63878 649706 333862
13683 333862 372832 181070 349886 544478 467235 380630 645844 656926 402548 571939
13673 571939 477432 458848 783352 280377 419835 379352 488920 232254 297106 507026
13663 507026 534099 551140 374084 307484 215154 466716 479771 652325 608677 513108 457071
13652 457071 246165 651542 204446 332035 260145 517672 194695 376979 87693 202784
13642 202784 273544 430213 612446 680095 556800 25416 288059 173239 324711 1007146
13632 1007146 497183 268953 356636 107109 410490 532936 602903 370190 738250 526454
13622 526454 612812 378672 450011 313052 555307 510969 349264 575263 425767 222269
13612 222269 215747 595356 275085 320065 -9984 293139 664674 311902 402825 302526 300371
13601 300371 274741 219379 267157 392227 515243 407498 209122 567894 477440 528803
13591 528803 416176 192152 270096 94538 471781 412272 352228 296910 525173 542813 655673
13580 655673 133183 430740 337050 392643 711423 -51037 308681 512982 524599 594323
13570 594323 367937 325553 164745 665550 288018 -21194 305409 451600 516951 320701
13560 320701 553748 392290 -12963 502482 427849 270728 40409 396428 354130 -105115
13549 231337 137123 549734 231090 538662 266339 -157242 323619 406528 186740 441314
13539 441314 118207 178820 356044 100752 523818 -229757 419765 156184 197327 536499
13529 536499 377463 295225 178939 280104 538566 372352 332682 263018 519500 435665
13519 435665 -1122 136018 311981 118032 448719 308149 80056 612683 303184 353230
13509 353230 372954 178861 332446 140744 212342 124194 80036 173520 63729 293437 556418
13498 556418 160164 258087 -149957 269228 539996 174651 684674 306576 362885 1653
13487 128850 436079 214464 376124 426190 332464 445974 244023 134676 141023 49222
13476 148977 125482 403042 470372 272505 87608 298593 267996 156190 444059 289787
13466 289787 168592 261344 -83735 277655 576675 109644 349546 301544 165874 -13346
13455 -66402 402704 653987 155766 401219 -45237 99265 -24223 90745 268229 221916 205342
13444 205342 174536 -5652 429960 244329 252665 233072 312368 282060 224102 346146 32885
13432 478549 298274 235752 335366 441869 255801 24341 206186 -225702 287608 43340
13421 194250 404586 326581 131517 -55760 231498 46808 118697 414642 205635 132402
13411 132402 40152 253707 347358 255781 324150 54587 -57199 200385 217675 207016 334509
13400 334509 74911 87040 103340 367498 410359 -85149 473335 148544 -57450 502751 244158
13388 174154 -13570 437443 363447 431093 312655 251654 358161 324365 238981 194086 139251
13377 139251 320158 133322 338050 296834 97439 158075 -51167 494789 293724 265479
13367 265479 82316 176455 274726 387309 411550 -63192 153077 380052 273633 294664 388381
13356 388381 320681 109273 397043 113843 116545 517845 326253 311531 -288868 3920 -32720
13344 54294 417797 141433 636992 257560 752738 354368 79526 350562 339240 221345
13334 221345 -7803 111416 87280 489857 75063 168576 670276 142238 -94567 159419 198514
13323 198514 482170 53237 -59856 122675 -1328 188378 151017 45117 244956 377930 138117
13311 84894 385488 41549 27047 193320 -38491 528722 150779 429915 -54515 729725
13300 196421 -64579 -53561 -54943 220960 290598 284137 142999 -136706 126349 346579 -19617
13288 128616 127222 311470 260436 60013 140519 155365 -146444 -149153 37824 -42624 164411
13276 214008 427234 117457 73981 54476 74753 301342 184175 83792 450119 258397
13266 258397 -103691 203327 363608 100652 -61306 41287 130784 37930 184530 69037
13255 -92825 82617 146076 -74245 376810 128263 191978 -21237 69760 -64230 76052 32279
13243 40478 -280148 196281 239842 188041 232019 265536 -46615 56771 100912 21208 -143541
13231 -153809 286600 -132550 140368 -42083 84304 367577 -18598 256824 153993 211645
13221 211645 -50388 395077 466427 -78129 -53648 376898 -88845 -77304 113577 -14304 223414
13209 -102844 181881 250978 -60465 96059 315020 72189 154920 82102 249234 -14395 504800
13197 109995 369733 168064 -46822 87482 87746 326253 192594 390741 -81065 97797 -157337
13185 195347 70145 291224 25062 -54096 93931 64865 117855 356695 269759 53514 -16094
13173 207456 196856 47166 -75693 461962 363604 99211 94535 -158706 154275 208020 246181
13162 246181 55719 -46420 -59793 91842 -151718 -188904 369155 226079 -1331 20748 243446
13151 243446 175172 117326 139690 73904 -114554 -85235 414616 70432 156351 2771 214782
13140 214782 -32652 302412 -80157 70000 284653 -143130 -193153 409972 -297284 271244
13129 89657 -3077 -223251 -123422 127243 472615 -74979 184816 75887 79702 180744 351779
13118 351779 198810 226640 19273 46260 46558 146848 -210704 260794 -201081 103230 64629
13107 64629 282196 258647 272273 14985 169125 211405 -157634 258283 94694 346468 -285179
13095 -158551 182126 39462 81615 112056 130001 40364 319188 -123017 78996 337494 74133
13083 159512 61387 -175839 34458 43667 -16880 -20819 -46358 54600 -150053 -68998 -25829
13071 300860 45961 72613 144031 51162 450043 -3215 -49352 160625 -92680 -28226 340851
13059 133357 -3873 -62867 -17072 195913 371148 148668 127437 140952 194080 97157 -237359
13047 -120193 165882 61016 177824 -129836 -128908 1641 94627 132318 258792 160853 177745
13036 177745 386325 375019 6561 -9669 -161706 156915 139200 -51319 144908 93136 -27773
13024 42720 -76722 411770 265945 228395 317207 -110701 142885 144713 269554 314304 241117
13013 241117 186139 275458 35693 233640 145017 -232454 397133 123571 36051 -116002
13002 73237 402643 139824 199399 -39680 -30676 -338257 209349 -24426 -273701 -48430 261101
12990 351524 -220473 -112014 -219597 299904 -136671 -7163 -54067 31926 -189791 163606
12979 407176 -18262 109589 -7352 114071 397619 -167684 118198 54806 -302086 208414
12968 448036 59871 360155 216650 111663 160088 -210668 58786 171863 66851 149066
12958 149066 238003 -275090 165323 -105154 106545 -2914 -77591 -511136 275191 -75815
12947 372969 463792 -278131 -181334 52366 -279422 -47029 -105085 109997 -305714 264966
12936 23400 -117177 353107 188652 -101391 684 127990 -113150 278242 45597 -6326 438183
12924 195663 272344 280534 117858 -36600 202061 70843 -30865 226079 137311 -270304 212164
12912 -494048 52790 290258 39194 117572 112979 -10737 101467 -32401 53353 -56959 186908
12900 47341 242692 -182949 -79136 -222474 319755 312738 14601 -160212 157227 101525 112948
12889 112948 -349006 55503 59613 86611 -155277 67473 178125 -100237 -110517 105670 -52202
12877 -123033 365855 120140 229654 80472 38835 176357 229842 -139358 103845 94957
12867 94957 324302 -176686 116321 135127 176406 389568 257880 77822 121401 167400 379072
12856 379072 11343 21430 -17860 36730 -72741 -141878 267532 311382 381028 198924 -78274
12844 -130609 89258 -24338 125354 -101441 -12899 100358 61989 63699 -134513 -38258 -72951
12833 -72951 166595 247628 -206204 194925 189046 -71828 9511 -169507 -240953 -222490 251368
12821 -80403 372599 19724 90159 90479 -224575 189084 156620 -89634 122106 -79366 -194328
12810 -194328 52887 72579 89683 16475 -43141 17519 197989 -116952 338710 172159 -57992
12798 -197156 -22592 -102225 -114741 -186671 282094 102591 62567 486714 -59281 -36975 -126975
12787 -126975 -223907 40386 174636 39078 -88602 -215892 127585 -135530 -12699 -7562 -352606
12776 -352606 -267496 -40121 44422 279186 50211 -119012 154767 -191573 -87643 101553
12765 -61619 -56760 177224 407117 -171667 41972 162761 286825 -102256 333635 -77058
12754 367688 -178270 -263991 4989 -61896 146200 101408 296065 58677 258844 -164474 64921
12742 167403 182579 51978 169692 -95129 255550 -131376 244648 -37788 -94228 88734 156907
12731 156907 -7166 226770 157845 -8901 210710 -209937 106084 -72988 -236056 -128902 -62995
12719 153395 167188 294901 -7918 177829 37478 -45810 170387 160466 321294 -132895 20983
12707 19004 -137830 266723 204751 260332 415204 -45691 108648 125257 -84585 -119803 318728
12695 44282 -37051 602290 -29931 171764 105314 -80429 141001 246565 -51857 -19645 35179
12683 107980 -15038 31588 199171 472515 3623 73668 21312 414071 -86811 -74538 203315
12671 -34369 251009 502844 192179 -78323 2180 444908 170562 81150 123594 221426 343148
12660 343148 135031 471244 421811 272147 -34533 295642 273145 -45261 321318 357911
12650 357911 161837 -101845 -221407 265853 160027 -88980 -369626 -12534 -316718 196345
12639 96321 199550 1451 98136 -71333 51309 -62708 46807 54170 261130 148934 353417
12628 353417 184888 364200 50611 -31882 93189 346003 146243 172076 421325 79201
12617 244536 -93992 -274902 -132164 -120583 170076 -143519 64549 210823 49723 12270
12606 122000 233437 291919 89118 25606 451622 -276286 55626 115747 176875 213452 338908
12595 338908 305129 146056 139556 111105 157776 118962 -1063 -16018 285577 179744 -319562
12583 -213821 247698 35921 40125 332299 -529398 -190122 315166 116666 54417 51517 -191043
12571 -5755 300726 -144354 192610 345189 154692 82067 66807 80700 -208336 128575
12560 286732 -73587 -80528 79494 -138638 -107927 86258 -14965 -11531 -170485 258609 -93856
12548 141782 -34924 122890 3842 -211401 35384 -135372 -7427 -91464 -149887 -252062 146656
12536 -86604 -109719 103254 -66684 72949 57896 28519 224917 175413 -151764 5798 -35312
12524 -40874 -127201 -137893 -108461 -4652 10898 -137416 -22530 23076 58986 -327000 64546
12512 24440 -288638 -20685 35739 -11973 28485 401902 160148 -57504 76125 81132 245460
12501 245460 -135545 202828 270558 74317 -107438 289355 111635 6609 -36653 97603 209544
12490 209544 -122832 -89951 -958 61130 -164949 -89018 -227786 -117630 -119507 287933 -179854
12478 -141384 55753 -288279 -49401 -41707 284895 -29062 -174602 153792 -64142 37933 210543
12467 210543 14990 -129335 -52512 310994 29961 -195592 469221 58091 -71742 195599
12456 9397 -71937 -196652 27709 145276 155369 245525 49273 205197 25212 181389 -172214
12444 -116309 369978 -149967 -10821 151435 156453 -10588 60782 3843 -67605 77167 156644
12433 156644 67716 454471 -80506 171041 -169668 49135 -16348 -325579 -120040 348688
12422 75079 126384 -74272 -66400 -407097 2722 -81287 -389319 192606 -31753 -35806 2011 139163
12410 139163 83252 54941 223180 -136650 80414 90747 36100 -96343 -177575 -106009 -106905
12399 -106905 -148990 185955 32917 -87811 95483 232238 307786 -293396 -66507 59727 219692
12388 219692 181561 172091 -26445 -261374 -103695 42244 -99031 -457569 -62576 13283 -18174
12376 -270339 149476 251646 -118526 107803 205745 128356 54260 34942 149880 -108163
12365 -249096 -340 -30064 77458 -380173 108010 78797 89991 122549 291314 127878 70461
12354 70461 -286603 171381 -147074 170693 -238791 -226388 -128299 135200 -289688 43211
12343 -14519 -434266 -90999 -138155 -159228 117044 310290 -343531 13448 -190640 -9296 353328
12331 -83246 -87477 118852 -90174 385381 -69547 263545 -126393 -11153 161583 -53761 80300
12319 27433 314317 -312615 5812 67485 -74014 -84671 -180850 64668 -5495 348892 93043
12307 126790 -29915 -4606 10869 -30856 -82393 -39348 -77742 241315 -219502 17781 87857
12296 87857 564535 215149 -77800 67752 -167971 10091 890 -296977 345256 -66663 -51931
12285 -51931 -80647 -386433 35244 51251 -143389 55959 105362 229489 122918 197207 4057
12273 288347 -129317 415611 550148 50295 120249 -189196 33384 85909 -189886 86367
12262 -94612 456008 221227 -187158 -214562 263592 330744 106526 23320 -41956 54809 374094
12251 374094 6229 421937 128077 96384 204296 419683 47097 321325 -111589 -61832
12241 -61832 111831 -245145 41 106861 -150906 47304 195606 255731 -278899 208116 251978
12230 251978 61406 59689 213996 95099 243392 -12719 113779 21650 413569 255770 27952
12218 205840 411914 80860 274353 237836 232845 279685 41522 -175386 -109540 129746 103095
12207 103095 434222 172085 231640 173027 -16825 161505 187445 39369 10834 310703 448080
12196 448080 -154801 237596 246329 226535 623851 -271721 353219 506963 394853 100851
12185 152639 130123 58561 250298 36177 114524 304169 -12027 102724 231458 -47511 -72525
12174 -72525 -101953 -220137 254331 188594 400590 131272 105598 163685 -38955 147428 -87195
12162 207967 -88006 -277549 -232971 -341628 -58903 134301 201346 326508 97221 -103606
12151 92198 142731 32222 62626 76143 -37850 -106088 -296155 343365 21008 63739 108908
12140 108908 68973 -259115 124816 82584 -90196 200426 76414 508361 -30639 -156343
12130 -156343 -247078 -46110 82884 117572 227611 -28919 -157394 100818 135033 -2847 10314
12118 180202 311072 64365 -177197 100745 79938 266308 -202574 -70509 -414823 1332
12107 -50969 -47219 -30014 80863 269809 116922 -85418 -20370 -121474 92363 -225543 65762
12095 -22723 50646 253937 86096 -64932 21460 -329449 -265126 305965 -7144 62906 -148298
12083 144570 -215703 324780 285547 225472 -1531 549497 740154 1838730 1386377 460329
12072 204415 122433 -99001 54029 -323148 -387494 -195316 240516 -4737 -46720 110817 94652
12061 94652 -83551 11627 144979 305457 281581 114489 166798 -182760 -108127 -8863 -54240
12050 -54240 142577 285427 -246222 -1274 -55551 102076 8044 -317876 -81536 -143584 -20312
12038 -111684 -73139 2251 -179739 175947 -90403 -267038 268643 -48540 -28922 -244984 -40428
12026 190512 182190 209270 -43667 -17680 317571 -39512 529870 509869 274820 67903 302439
12015 302439 -400921 299585 121590 -50159 10885 47408 -309939 136894 127833 -149551
12004 -214312 269825 1625 36092 -67970 -53782 -57167 31066 -325522 322546 -39191 -109068
11993 -109068 -221751 -36783 -98972 125121 -104257 -86209 84888 167242 29061 65708 217970
11982 217970 38057 -202516 143913 -302174 -92367 -325316 29485 275246 -138016 -76402
11972 -76402 118844 8991 5397 -127094 -173494 73241 -317080 74032 195562 22302 -5499
11960 306806 189751 -262002 99780 117843 -68134 -298825 336143 -77260 -71311 249084 -250023
11948 83169 233959 -198019 195107 -144924 -35348 -194543 -396432 294737 166396 15252
11937 -134686 -295772 -114906 -100918 -87451 277800 5315 -108009 85926 -273744 -140094
11927 -140094 28108 -88001 62539 -93067 -125618 121040 137724 -107310 -109405 -165165 164459
11915 75063 -233819 47516 -28491 77373 -74648 -187118 60204 43461 238690 173579 -101282
11903 -190340 179520 -55875 36814 -19608 -12715 -111227 120014 -168314 -108154 -30163 -420788
11892 -420788 -199260 98676 -94646 120694 -44753 257697 -71430 125850 153027 -187338
11881 96188 92554 -153673 -104776 31428 -39466 65141 134984 -100646 -230587 -119684 111
11869 239239 31601 -303440 -48686 195308 -104172 116762 -33851 -55879 -126708 105654
11858 -178363 -84872 -29183 78719 -61615 -147666 117694 -62400 205096 48976 -262146 -140925
11847 -140925 307589 -209539 -29913 -11836 129488 -6890 -81466 -422463 75792 -85639 -357237
11836 -357237 39589 -417369 171363 295709 -38828 57244 -99485 91154 -169516 -197453 319053
11824 144176 -26210 -90433 -281877 -44944 -246526 -75657 130185 133015 -169800 -268016 12393
11812 -130847 41659 55818 179212 23773 -195767 -197065 -150381 -317342 -59216 -326506 -40970
11800 -28373 -175153 93179 -125520 -616249 241216 114585 25666 192334 -45660 -42733 66866
11788 -262473 114764 14442 23916 2761 11946 -90962 -30901 -433303 -15931 217134 13394
11776 -25905 -88698 -160924 271134 344066 225211 236390 485228 -24134 249683 80338 -172180
11764 22966 129791 207163 28292 -328673 -268959 220745 -72814 -66624 -55147 182784 200905
11753 200905 201377 -150581 -14978 85855 63753 19352 93018 43883 4172 -4222 -7525 -192841
11741 -192841 -181318 -33235 -321482 196125 -351644 -21784 49592 -65697 -50507 -96645 81264
11729 83095 76035 183898 136171 -194143 -407441 317222 -224130 23645 179641 79000 -101079
11717 -17197 71280 102541 -63701 384915 -130881 -104937 73622 -49018 -255888 182844 -128328
11705 -62937 -100663 133338 -252102 -134183 167958 265341 152159 65304 73870 -169318 258724
11693 42365 26567 70516 122846 228973 175505 42181 -124188 -78152 450987 239598 -7170
11681 -37363 139037 -48255 8660 156785 84186 239870 133368 135317 20453 -124274 279623
11669 398372 172336 -35920 163470 195654 209479 215513 -158162 118042 -201128 -117963 -69816
11658 -69816 70354 -196250 -290997 5224 -188738 209340 147651 -378486 -152859 -33561 -152629
11647 -152629 356796 -8576 54132 -33956 190071 142658 -342810 10467 -254129 122752 -112024
11635 -64492 281395 -235387 62358 -232044 521341 261399 260723 53104 -5129 -2711 217179
11623 -200142 -97797 112441 -101438 74482 -105334 37090 360564 130022 197082 110370
11613 110370 -38745 145092 -18883 107892 -226061 137122 18344 243280 79736 38039
11602 -57712 411313 -30785 53608 168533 101673 77308 283068 117713 61522 84921 298235
11591 298235 -140628 -194428 160854 119489 314028 13077 203453 135120 126846 -156344 126361
11579 -19027 39063 -4704 -4280 202113 184417 60434 190851 107274 142467 -5966 80631 218380
11567 218380 129399 98639 -43613 -22746 316989 85938 74105 249258 170479 -23309 14810
11555 -12804 293585 -3833 -14402 47607 -242508 -137359 305285 12120 127001 30896 -62866
11543 71962 296121 60168 -372366 247146 3377 10799 -245371 810042 -197297 88574 538824
11532 538824 200868 -85702 -84214 -296490 433 -57619 141162 218653 82638 -20399 93896
11520 239258 -105349 -108497 -157486 174818 -123491 92659 -12346 26021 55033 132319 479114
11509 479114 227898 265949 77261 11629 180493 123851 228502 -27136 391121 121380
11498 123019 -106090 14540 352492 217400 -40466 79598 -141781 -80749 185845 147111
11488 147111 44744 72982 -11877 328183 10186 288834 171185 328976 119655 81401
11478 81401 197557 -102532 74743 -41383 299454 378742 304754 -94850 -166726 34467 122592
11467 122592 127320 263712 455831 113489 -140717 302600 155373 -193255 -138350 -120548
11457 -120548 73467 15122 276845 249236 87317 -94522 -334206 -193950 -52203 265784 -129920
11445 -297004 -90048 -93865 99317 43409 391046 -35471 -534385 -11444 -44597 34159 -309773
11433 255123 -214650 90876 285327 90697 -87199 -187857 -150564 -140916 -173560 304868 375958
11422 375958 260236 57689 -170579 -48558 196328 -315636 -193876 -71895 245 46624 214023
11411 214023 -5375 86071 -128081 279662 86745 207248 -302996 -219772 96762 -3957 352809
11399 -209954 -85636 69564 60880 8290 -22753 159586 20961 -14424 -139676 117898 -87007
11387 68518 -76525 90792 -16785 237913 370938 51204 217965 259559 195388 379915 86900
11375 133919 329934 112443 243234 -244138 74353 -223807 -32382 173501 -3459 163889
11364 -197239 -213872 503096 -137395 -118901 -134615 -279335 214233 20465 -66673 207435
11353 257713 -217230 -239986 -341399 47241 74773 -96644 196999 -180495 -168277 -195984 90162
11341 -21308 -244825 -256795 62830 320406 3476 95306 -3787 -61299 232548 -95666 -106970
11330 -106970 -313780 372689 -40239 203425 2036 -101381 -39159 -119938 -241481 55796 -110027
11318 33857 70358 164957 -179942 -77894 -350142 -390691 190519 92052 -160721 236802 389387
11307 389387 192632 166384 -225098 -114105 -199570 -170942 218058 51336 -76580 -249212
11297 -249212 47027 -37107 149424 -76627 115245 -223112 160210 -78574 -269779 -288330
11287 -288330 -72911 214495 107694 -145135 -24370 112986 -36654 187258 88949 -210921
11276 -24011 -205760 -74463 -221697 66984 -55546 25446 175009 -137444 -453946 -226348
11265 -94151 -28946 -44140 -48079 -72154 49787 136115 -22686 155848 -349438 -38987 60351
11253 -52518 37114 106189 -371411 -73166 -209573 -74572 -52019 11615 -30868 -98617 -125830
11242 -125830 -263787 -349596 -59814 89390 77829 -264245 86698 -218658 -36475 74098 137667
11231 137667 -59088 165300 253307 132043 -50929 -52712 307714 -75064 189121 -12908 17501
11219 -125186 -307846 247674 -5608 -132958 193666 -239506 4011 -131682 -141902 -195835 111060
11207 65169 -182178 -10031 -240705 -482357 -96121 -68932 78999 54266 468821 108962 57676
11196 57676 287246 223222 282738 182483 -200441 48854 -259473 190105 103960 18867 192153
11185 192153 -29676 73484 -46443 -168557 198204 -164566 5532 103901 97974 -364998 -134131
11173 -279855 -242309 281895 -131992 -300884 159803 -48347 -146003 -104798 -268602 165780
11162 -291625 -62231 -63323 -68925 193626 -55794 -70384 13858 119265 152331 -319710 957 -84828
11149 -214015 152919 -332377 -99463 404607 -34925 77094 9349 207411 154949 8369 204085
11138 204085 85355 -405053 134698 -5846 402192 -625 45236 75669 36364 -174381 -135200
11127 -135200 234708 226868 71151 103237 104095 -24273 -178272 40855 233460 37336 -22370
11115 -156629 75485 -1829 -205411 -100236 138154 -286781 292129 83914 70210 -128176
11104 -189547 159830 69174 19482 4596 -58430 89366 -33890 -5394 335590 42955 57502
11093 57502 -11504 225589 30886 -69879 156492 134755 478799 74433 131600 195757 681127
11082 681127 260158 94246 308782 -18771 310612 342793 304319 414278 284118 362511
11072 362511 129499 505074 104735 362679 208640 65341 264110 437660 753069 524025
11062 524025 658705 349069 351930 692336 333050 809123 512035 675421 679964 498916
11052 498916 755817 813920 688646 755797 512613 747584 698879 733810 761257 696954 464482
11041 464482 320905 1017278 560626 878574 588802 926641 731866 698471 672994 911040
11031 911040 629069 411833 380782 980966 857945 478169 734361 586961 876890 476435
11021 476435 286561 372973 476080 352346 680629 350245 644821 703401 729251 472732
11011 472732 376281 387057 661826 967433 618740 584784 518441 592336 552915 899701 771564
11000 771564 765268 337689 915879 640640 610542 731629 438138 362151 593508 563219
10990 563219 619322 530034 737578 885177 909506 790308 714765 970294 1331721 1438347
10980 1438347 1251596 1499688 1384784 1866273 2042307 2126637 2396260 2601474 2588313 2752734
10970 2752734 2450133 2638314 2070578 2067354 1996757 1431026 1524415 1628250 1422126 1557879
10960 1557879 1377336 1243572 1492809 1569740 1454115 1604942 1409174 1320113 836246 766197
10950 766197 466949 598375 235129 503076 343967 472738 254946 119414 -137555 284483
10939 -75477 472271 227709 182443 42406 232068 167383 216049 75026 -302174 337182 -138583
10927 70656 44269 179007 101634 -170301 60736 67234 -87385 131392 -95064 107975 31949
10915 272962 54073 -76884 30402 40574 201778 -112863 -143062 104771 -140166 -89164 199530
10903 -290215 -197789 -5527 4592 -168189 33930 -42471 117253 -221453 39783 -223964 -270433
10892 -270433 -182826 229227 -323019 -134228 -123240 -135067 -78277 -252721 -65238 74883 -68036
10880 -61840 -90248 35792 1691 229121 130073 -29221 -152589 26803 -118741 25798 414783
10869 414783 -59827 -111801 -135622 171773 90806 -4230 219541 -160762 244574 -288197 -333741
10858 -333741 19611 118049 207045 -109660 -334827 48411 305616 13597 554576 -120842
10847 14510 -141828 118243 -25008 -40219 -117812 71879 36116 204239 -84348 -234534 -134737
10836 -134737 102488 -19008 -249631 -86598 150302 2398 236888 196011 42354 -226221 -263910
10825 -263910 -214869 -109682 221674 47169 -130371 -206357 244689 6289 -212245 57111 -159043
10813 3441 22361 141452 -67901 21211 328376 88607 -343567 -149568 -123520 500997 -41075
10801 78525 -169913 653 -105228 283939 76284 -270714 -450278 156310 74600 8315 -193509
10789 -69499 42334 -89507 -21472 -179905 63074 -118726 -54949 525195 267892 257069 -129419
10777 32026 -580949 -232826 289537 -303883 -61657 173785 36248 -294348 -113093 -55575
10766 395379 -130175 317664 -254857 -425227 -321583 -108419 -293051 -95192 108493 -307924
10755 -233110 147407 -54432 -75238 226212 -43239 277805 -80224 -10181 17122 146988 -117124
10743 -65390 -15372 110800 -133488 275964 -189754 12882 -210751 -359438 89684 166561
10733 166561 5331 -108241 -201116 35005 -20759 -47982 -49957 9257 -18095 116019 9079 24503
10721 24503 115198 -46275 -221347 214049 182669 -319839 75837 -271712 -5544 -147158 122444
10709 -194018 39968 -65768 -292319 -124184 -9027 -447694 49058 -130539 39553 -232889 259874
10697 339501 14268 -206041 -204960 -302811 -275417 133352 -68872 41913 -215425 -87641 -27498
10685 -14180 136166 219176 44472 -115241 -21417 265677 12643 187860 85320 -162840 -157199
10674 -157199 -19248 -280303 -114197 107434 -161190 -55081 140991 129187 -310310 220270
10663 -273386 315305 -186348 240236 -29202 169746 46996 166771 -234366 -197620 -26681
10652 -157689 -107331 380826 32044 -67959 -175170 -83350 -298000 289272 -27705 -48010 -97323
10641 -97323 64000 256504 26699 158816 -83705 -163865 -97470 -473574 -264757 97259 123134
10630 123134 143034 -14007 243838 -24169 32099 -130833 -85703 21566 234492 -2229 79090
10618 -3630 156385 -88660 218890 -114048 -15437 -93311 81413 -113612 -30768 44982 514
10606 -39137 78445 -354864 5616 -48029 -455485 30464 186 238577 -7562 290057 257166 21951
10593 -52587 124472 -70361 56999 424873 63892 -65181 178582 -120422 -128636 170222 -271538
10581 -146830 -59220 92639 -327430 -153124 -215161 -188379 -9123 -207407 -166462 117268 -198972
10569 212433 -173634 50909 165530 -308363 115500 353596 -46448 -189852 65975 -107147
10558 -26494 -102636 -88597 -74380 48470 -50012 -101260 -361229 43001 -142620 -126504 212496
10546 -135432 113819 186955 -197625 -253395 74163 301284 24730 -206859 -60473 -51086 -70251
10535 -70251 -126309 -222545 -146270 180915 237601 -206407 213584 -213136 274274 -226281
10524 53111 -42040 29719 -90333 -131628 -251641 -127513 54444 -116391 60299 -143509 -464354
10513 -464354 126945 -159069 156933 3556 162204 12584 101124 -110345 -191080 -183955 -339808
10502 -339808 -518230 138170 252359 -145995 -198548 -25151 -93000 -46901 -41162 52649 -84330
10490 -152182 54289 -115533 187024 169141 221649 18853 137884 475579 581746 566882
10480 566882 320472 362337 101079 255393 33969 -148843 -143412 -209780 126508 -95606 148652
10468 89974 164077 210411 -201857 -110190 16212 -150869 -350631 184 -105268 54565 -130887
10456 136370 -98611 225926 -186624 -386097 -189214 188714 -59245 306336 -42909 -245036
10446 -245036 251218 66500 3558 47859 250901 19965 -129606 -76182 82186 -323375 75278
10434 -139933 -307490 121772 -160798 -150443 66580 -223133 76774 -86209 139573 -323990
10423 236880 -200821 147155 221793 -168244 150922 -107517 18312 71537 156778 -143831
10412 -56194 108435 443022 -163765 266493 80317 -112277 51373 10753 -52239 -491737
10402 -491737 -220411 -90397 117366 -70019 420822 -317315 417137 -42233 -96649 192597
10391 317115 274290 -87545 481775 318128 286004 85188 205394 70636 -39799 -79559 44192
10379 272151 -58057 165034 409548 266267 423879 376026 117013 -71341 170228 317019
10369 317019 258072 397362 460520 467495 40108 714169 263586 36692 292644 126529 455312
10358 455312 323929 229171 61755 255233 321041 182875 181949 337462 402525 168691 435893
10347 435893 281145 200616 534813 342683 516724 447789 287241 -13844 133275 256363
10337 256363 158090 310857 165587 -25217 101436 64644 90796 -200134 30143 -15317 -193094
10326 -193094 428935 595 335662 142970 432668 10975 303022 422270 223780 132619
10316 132619 49851 190828 233967 222839 262874 116517 160125 412741 166468 -136371
10305 76904 37778 -76067 60366 142737 252083 55057 112249 131774 -169830 180618 -255960
10293 45632 -76364 100110 -332410 -36898 -68640 -82580 -92394 -140418 -309378 -1148 53887
10281 -192645 -25532 276243 21363 -350766 -28246 50310 75037 -339260 -305550 -199820 262406
10269 236647 162717 -1659 -155591 396214 -66239 59992 32195 177096 113737 510724 242235
10257 113396 225521 98434 1280 106167 -236622 155954 212072 -8428 -235270 -186852 145182
10245 -53220 147543 4301 -70105 164899 583 -153611 5000 -131877 -155972 -92229 -83205 -363097
10233 -363097 113322 206096 -236894 176231 -123134 -308086 -55156 -73973 -150128 7475 18998
10222 18998 -259649 -141712 254115 -102859 -112354 -53180 -48382 18068 208884 -62739 -87445
10211 -87445 33903 165096 44063 -194342 -11440 -402192 9893 -51553 -62070 -457707 -181977
10199 139908 -190164 137578 -88563 -525207 59801 -116744 395293 17500 62777 188777
10189 188777 -89850 -168192 99332 -287790 -44845 36701 192182 -284091 -150157 106492
10178 -431285 -199979 -127803 -241364 -2263 -86073 139019 69422 185925 -245166 -291324 295130
10166 168726 -134598 -145372 255693 527481 -344436 -89192 95702 69389 -205572 138933
10155 177888 -84377 133151 101966 -22940 -58564 -78142 156927 165100 -52401 32985 -230804
10143 17117 -182006 -27877 -211213 82308 -83864 -181019 -342419 -295941 261151 44199 -134266
10131 -116679 -343247 59825 -238654 14895 -173700 197812 69348 -105974 31348 128923
10121 128923 -122302 -78774 -560452 -30493 175652 -163015 -71166 -170799 -38442 -57350 -338380
10110 -338380 -311638 50175 -21069 123892 -72009 -21059 -247822 -64901 146098 -57055 91915
10098 -192016 -149213 -184698 -121276 -14780 -247883 -197457 10146 -346694 -288797 -12176 -92750
10087 -92750 1468 327891 -352560 -308971 -248339 99502 51290 -234166 -54660 -181571 298041
10075 -278338 -180375 -8734 6388 -57670 -80959 -94457 116050 -251022 -252683 -64617 37710 183510
10063 183510 191891 -282797 -441709 44530 -79593 36001 171323 30769 231742 -199834 -71462
10051 184840 -118752 -74782 -215412 -336748 -141744 -242211 380870 304648 -237260 2908
10040 101819 -86533 -91899 15117 93976 192383 -310676 -162504 -174357 45660 -53589 -45256
10029 -45256 -268617 -191275 133050 -46955 -56716 -24820 -93849 68597 -342709 9496 140504
10018 140504 84976 -329188 60447 -273779 173982 -100107 66469 -227421 -67345 -266644
10008 -266644 338863 -111690 -407612 -502026 145606 -162371 155939 -97484 -56309 -130429
9998 -130429 152405 -193187 248790 -82783 -286819 -246845 -317126 67540 -169743 -36333 128102
9986 108676 336171 -245963 -129717 -21942 -181373 226582 -33032 -19286 93255 -19181 75256
9974 -41908 248905 -110714 -38857 -49202 108546 -248944 -241499 -449606 114383 -333621 -390792
9963 -390792 -161233 8854 -33231 237643 -258854 184464 -250306 -308993 -160474 -172700 -38240
9951 -192535 89203 198966 12038 -272077 -177441 -189377 540472 -291257 -160590 -137862 132687
9939 -101923 176374 111499 222148 -292971 29791 -23875 15361 34721 -17016 213901 95559
9927 -150190 -151780 -197508 27190 -255045 -135470 91692 -318640 118124 -54478 -173921 -200211
9916 -200211 -185905 101448 280303 322404 56713 32425 -161663 289693 -196742 34991 -296057
9904 -55080 -98498 138263 1705 -127271 -83603 67978 -209612 -129955 -350480 -86089 -151595
9893 -151595 -261513 86302 132448 771 -90431 -43086 -243048 -111013 -160942 -282691 -40189
9881 -44661 -30325 -112991 255307 -73264 -340774 287105 49961 -182021 81364 238755 -511423
9869 -99398 -103344 -111732 40523 -254525 -459315 186295 29533 -208204 -258076 297846 -52588
9857 -250739 41602 296932 -120664 171559 -23633 214083 -165962 -224523 -25930 113521
9846 -159951 -215861 -28633 -265378 -2092 48604 -120357 111693 -466210 -209253 -164316 45961
9834 -183427 280711 -434730 231055 -361349 -314322 -6478 122858 -348577 -225229 -75236
9823 -209261 -161077 269815 303198 -1279 -100774 -258585 -13831 -7802 17302 -2378 -50376 -60262
9811 -60262 -310094 24094 -216272 20983 -156201 226379 -300831 -262869 -213455 -146529 5445
9799 -112058 -619940 -19453 9558 109230 -235999 16637 159562 42581 -144984 -50889 92628
9787 97180 -52654 13422 -54624 -230650 -89017 -247829 -60836 -70138 32382 -126621 -474514
9776 -474514 -242695 -36079 212650 -370559 -220094 178246 -9226 161784 94846 126361 -213936
9764 -28933 212248 103837 157331 -24953 64202 -47717 -106487 130059 -78418 150712 -229261
9752 -133267 443949 -45286 124211 146731 217205 -220663 3366 -255729 -46937 111945 -15129
9740 25192 -539237 -115477 -330966 123692 -387641 -243734 -35550 35090 -124837 101867
9729 -39173 -222706 -268330 201165 -252547 -229159 -192533 -388278 -57450 -66991 -143637 93459
9717 -132430 272812 -89196 -182655 186454 46380 42085 40807 177232 -324206 62374 95228
9706 95228 -163844 89299 88789 -141045 -172855 -326969 3874 -69371 -4773 76288 -106766 -97041
9694 -97041 -204369 12035 -160369 -137612 318811 301696 -221118 152558 -54496 -56014 191928
9682 -159400 -144660 -235496 -117597 48375 88560 227839 -222098 99617 -140026 226543 -169368
9670 -220404 -80595 -47405 197033 75617 -13483 228860 202079 -243093 345834 98597 85230
9659 85230 -56321 -11193 2002 -311957 118876 -161987 -253219 -92490 -207200 -40728 276925
9647 143002 41022 84334 55288 -145935 232834 45586 21054 -141772 -210081 393190 17278
9635 114985 82810 -25863 -197245 -264906 -20238 149217 -11934 113544 -11146 -190522 17741
9623 -159999 -81374 36671 -11350 62819 184220 344047 -129264 -63254 22043 -273647 149631
9611 -123357 114156 -14092 161449 29409 -28774 25685 -331443 107694 169822 -92731 -181297
9600 -181297 6600 253180 -207439 -444500 -70848 -95481 -129923 -142283 -259406 103786 -163825
9588 -37977 185204 -18067 -517651 -493936 207989 -339086 38779 -190085 -262810 -119468 -432188
9577 -432188 75128 -51807 -211270 -105409 295769 367047 -42537 92107 -45320 -15384 -133108
9566 -133108 178067 -70871 -359174 -232309 -227610 23543 -193786 -103377 18154 5632 -170590
9554 24338 195439 41077 -126124 12152 -81634 -120246 -236496 -158391 68348 -363588 -65217
9542 161038 350274 43039 19091 77551 116540 -302874 84230 -29714 -212545 -120241 275501
9530 70938 -236095 -214084 -111327 -226730 132461 282252 110132 -9775 -262546 -101173
9519 -144980 10961 59683 -120860 -348751 55966 -21999 108722 30291 -72112 -359182 -277655
9508 -277655 -90212 120352 -11555 95975 -291699 -53000 155716 -372028 -276692 -379942 -236473
9497 -236473 -117408 67667 -251360 494 -61423 -287492 -88426 95074 97166 -4202 -15580 -70662
9485 -70662 8322 417229 -93578 41473 -34687 -194815 -292419 -44811 -66582 -79517 -138794 14449
9472 -93389 -34114 133042 -306226 -100746 -161687 154066 105477 -115208 -121026 240976 -63979
9460 199458 174009 78890 -94562 -159772 61289 -58470 -475054 152687 63641 -226831 112219
9448 -169581 -453436 -166464 40022 197878 -369334 -514606 338163 -145149 -78179 -93437
9438 -93437 -148277 -118755 -346499 -284941 -121933 71079 -71560 -375107 227114 24053 -407291
9426 -487771 -55238 64381 -199463 -108957 -78855 -4956 -203796 11318 -37507 45793 143318
9415 143318 -220731 -16372 168271 16127 -19336 18919 35035 142112 178388 283471 -81739
9403 -175955 -545402 353451 73462 244067 -370775 -107735 72878 -98314 -212884 -206492 334444
9391 -41740 -129643 130993 -199277 101870 -62102 -61487 21256 63258 -279922 -42499 153234
9379 310029 -231229 -160128 -292604 -267738 -23810 -110737 -160239 -237096 -22865 93589 -73455
9367 373173 116477 30578 134027 -55104 -22915 238587 98567 -126553 172139 64769 -255909
9355 375591 20362 -126138 90297 2183 162567 11630 -49 174722 189504 15190 -1801 -13367
9343 -13367 -178836 -140552 -110674 114277 343787 -155518 57957 -183699 -324923 -90415 -243846
9332 -243846 19419 49066 -11064 195256 -286609 -77477 3962 -2528 328267 79041 -64484
9320 -22449 -101421 157162 37611 -157743 170813 -372747 -83031 -38819 -5792 -113101 -14066
9308 -277925 -70004 320374 -299566 -7509 -122267 -286489 -43940 -158027 157958 -109005
9297 38025 -76573 -49906 120726 -180784 65557 -248769 -111609 43139 -93550 891 252610
9286 252610 -21335 -275182 -266637 138155 -15474 -169787 -171787 -273485 18531 89938 -316436
9274 -251261 -282933 -32720 368427 137494 97118 -98394 293352 102143 -243829 -107075
9263 -268816 133943 -107247 127884 -34987 73460 -137849 -102068 188395 272862 129396
9252 123139 -118471 -119200 -303404 -59768 147671 108166 -94031 -115172 67056 -162001 2738
9240 -89333 -359770 211787 183349 104372 206832 -221873 231543 94402 59464 78684 150677
9229 150677 -142436 2285 26719 -272663 -179158 112604 -385615 53830 135196 -358301 -41954
9217 -240161 -263509 -20150 -20674 91665 40384 92599 1287 -53892 -63768 -105842 -252055 -200493
9205 -200493 126269 -205655 -132297 -17475 -228233 -62952 -49993 11734 -122673 -323849 -344225
9194 -344225 -28522 -55328 -217235 357287 -27024 -94077 -110901 -199850 -134969 -122484 -92698
9183 -92698 -89640 -144271 58340 -52168 74834 22640 158853 59028 -165711 146271 80997
9172 80997 51453 -200341 -102564 -281842 -188257 109016 -240235 -105238 24962 209337 272340
9161 272340 -10957 -306013 206613 -46629 -268569 91811 -30396 9869 -276317 62955 34451
9150 34451 57109 -30078 470100 112417 376066 -74024 -59330 305464 85509 -83252 -40294
9138 84832 -195275 245169 -181011 -38092 -353587 -136322 -65378 -276544 -149058 108313
9127 -247148 407556 -17739 -222114 -82326 -132183 -132990 -16049 -85010 -105502 -73673 474529
9115 -230125 -166492 37314 -162283 22284 -264173 -219272 -105582 67436 11921 -438180 -97766
9103 -81771 118568 -232270 49281 -25674 57701 102325 -99292 -255512 205948 -16427 -135221
9092 -135221 -309587 -404796 -173343 -88759 45306 130332 89398 145415 213309 -255638 21080
9080 -44413 28213 189176 -3613 218497 -206607 -97959 -143386 27154 -121393 -248823 -105698
9068 -221347 -282927 -106844 223090 -232083 -117955 90290 13945 -283349 -206188 121751
9057 49807 -77638 -192579 -66001 -77846 74798 354081 104242 -378282 -142207 115655 -405773
9045 -79359 -91284 -48459 -141891 -1035 -40036 -311871 307273 14838 134949 111664 -111848
9033 -171050 61959 16425 -413272 -86013 249541 58824 52302 -122185 -40276 -120112 6672
9021 -234199 118858 -94185 -88487 194009 25913 -200119 177262 -35828 -531799 68226 52664
9010 52664 138072 190879 -201845 -62216 -155490 -1409 199243 -383543 -230449 -202190 49125
8998 266854 105972 -168568 171469 -231926 -43007 101667 -45394 -255127 -53580 77943
8987 -312548 -417512 -359327 213602 -203704 38845 311427 -75052 -419723 253261 -325408
8976 -102104 -100674 -22602 42293 -122491 125071 43375 -179005 175444 -477069 -9067 97086
8964 211859 -237986 -147365 77013 54556 -228621 -77661 -99989 -133017 -238847 249513 -110091
8952 22208 -66181 -141156 103535 -152389 -49161 -18405 -14860 -157155 -67868 -94398 -263942
8941 -263942 20059 -16170 -173879 -199952 -95161 58048 228471 341378 -30106 -191826 272034
8929 260580 209022 45527 206864 618836 877157 1739227 3601749 11081995 10422201 3774821
8918 1019116 291226 589549 149964 -219428 239749 -75094 173304 -95971 98424 -113098
8907 247793 218785 184103 -187538 138276 57072 -261240 -139740 211887 -135616 -341978
8897 -341978 -113550 -330768 -128497 -31003 -103621 -75334 102434 232032 -19735 -112314 -184932
8886 -184932 -27884 -386339 249561 -39078 -157743 99640 -391327 -144627 267245 -103643
8875 -185792 -307710 -111806 -308509 182445 -193721 -82949 127618 11169 43356 24708
8865 24708 -148075 253323 -152875 -273972 65651 -4427 -67847 4550 4539 202148 4541 16369
8853 16369 61690 -270611 -113999 -272875 -58603 -83626 -136884 -9198 321971 128408 -55723
8841 -88016 -68448 130743 -255246 3496 90658 264878 32502 -100938 1945 -168772 -190519
8830 -190519 -181893 23032 -3648 -68598 -218908 -140669 -20283 134630 -130640 19399 72811
8819 72811 150635 -249268 60851 186199 -257438 337576 -22054 -102141 17257 45207 -158090
8807 -427019 -6695 -242392 32977 135618 -8508 -470909 212442 -290989 101463 -56478 -304976
8796 -304976 -114731 115947 -277750 -46015 1349 -305577 -140905 69816 4663 12871 30753
8785 30753 -94909 -51547 -64915 49734 -64176 -244915 -90831 -23766 -103694 207507 346430
8774 346430 -312775 -137630 -45493 142138 91973 256619 -259592 -100580 128748 81713
8764 81713 173711 -169571 -149676 204910 -216204 101372 44811 -53739 116138 31886 -136366
8752 36763 -152463 -349755 127010 -318179 48973 696 -122332 -294773 -287398 88725 -28866
8740 34045 -217448 -64748 -105167 -486067 -371092 -133656 -174294 -141540 -200111 -202423 -170389
8729 -170389 44180 164402 87006 -195131 74397 -54592 -4884 -263155 -108798 62078 281954
8718 281954 -54556 237649 -384444 -196624 -392294 116611 -75511 150921 55268 -91811
8707 -109815 305287 -146853 -318323 -242104 70101 183047 -61323 115626 -124738 78806
8696 -149281 76791 -79599 148712 -13037 192216 164474 3423 133778 -53762 160538 -29778
8684 83581 117326 84920 -81528 -250557 -133872 -71318 69574 298855 320444 -200905 -117667
8673 -117667 163611 57971 44654 -28532 84761 203343 45921 -195436 76491 -11966 -170594
8662 -170594 231636 -368928 -13161 104028 80035 -20930 137921 -73230 10058 101657 -294471
8650 -196477 -94300 -165252 -190692 -325082 -326344 221332 -269035 -122418 -247719 -205738 -203525
8639 -203525 45534 -144259 -62733 2691 -15246 -47778 -78011 -195877 -120757 -205155 65123
8627 293465 -186647 -90768 133950 -344748 -113914 77489 5174 -10089 172057 -57741 -319887
8616 -319887 -230433 33556 237580 -189126 -20631 41154 281499 20461 -89385 -62503 64445
8604 9673 -4683 -208097 211458 33494 -271544 -343160 79859 -144177 -196628 -18081 -336700
8593 -336700 51380 110266 -100234 -158667 -337059 169146 -234710 207665 59096 -49628 -57005
8582 -57005 55536 -111574 363142 -184523 -191369 78041 210659 -368988 -117747 -425273 -57007
8570 -42136 -125281 44438 56726 -125073 -112658 -7916 -82098 121017 -264590 -179335 87473
8558 -122156 88278 -406451 89644 207485 -16932 14388 107399 -14974 -234183 -36293 128845
8546 -12076 -114086 -23184 -106285 -69607 -26388 -180400 -239848 -25725 -113718 10862 39630
8535 39630 4695 2368 571 -349673 -40218 273191 7032 -50065 -234896 261499 -53564 -58170
8523 -58170 -528954 192477 120426 -121689 14945 -67750 174349 -79853 -174335 123276 25068
8511 133527 110519 -72508 -126762 149340 -359414 -92592 -287196 288931 -124892 -92069 31161
8499 -70561 -58388 13077 435046 -197284 61782 -275321 -84400 -13825 109887 786 -144416
8487 169422 -47920 191330 -125475 80791 -278069 -12625 -23084 21560 -90167 -137338 -109658
8476 -109658 -111664 43690 50546 192782 -288104 15744 125454 104661 24993 200423 304084
8465 304084 161721 -163406 -136409 -53282 81836 -61431 -301467 188990 -27892 -529 263782
8453 63551 -67425 248776 -48944 -167783 -219505 41877 -255917 -252998 -1118 1006 -352172 -59493
8440 -157888 -214839 -157225 -103905 147867 -176171 -4521 69048 -111616 293313 -33943 -242904
8429 -242904 -41235 278587 -114490 -489446 -195153 -36013 98431 34692 141876 -31475 -57417
8418 -57417 -237921 -95087 140473 -77826 11359 -121995 304249 78035 -155787 253261 26571
8406 2717 -144065 68840 -343794 -182625 56257 -90281 67702 90710 -281522 -109339 216160
8394 -42278 252164 3044 75011 -55885 -104017 -73861 -314245 200261 220116 124280 -189045
8382 62975 -91938 128746 83089 -268588 -94811 -78005 63065 65420 -85362 37825 52698 139672
8370 139672 -160045 -245997 -38141 -180694 89758 1178 -7242 -220979 -190263 -8427 -244561
8359 -244561 -66197 82493 -215668 159135 326955 74215 104246 -114877 69168 439454 109343
8347 -385864 -368868 -101941 262123 -164142 -131787 18917 103913 57250 224792 -250420 -96868
8335 229965 -48581 -19417 243485 80211 -101907 -269615 67402 -34142 98934 353745 153455
8323 -139057 -317203 -205150 -94352 -135410 -444902 311333 144482 -137271 -37280 218305
8312 -34885 218710 -419522 93088 -160936 -133257 167716 -48988 18282 -542375 83402 -36760
8300 -135715 -186533 -100516 118684 -384498 76957 -12472 -57878 311908 88837 -178588 -78704
8288 52838 -152586 211887 -231879 102264 -89940 -149661 -88120 -55273 -25318 -185645 -432499
8277 -432499 -213136 -111646 11436 198263 -178869 75389 -261821 362542 -436859 -320905
8267 -320905 370686 40436 322032 -89326 80114 157673 -266122 -55501 -504146 -275980 -523458
8256 -523458 74169 -26690 41053 89283 104856 -32531 -228881 -107040 338316 -233546 81789
8244 397530 -111080 26902 321711 -238787 -299899 -4634 -219330 116994 -39029 -15563 -118216
8233 -118216 -247874 -102780 -196570 108679 69673 -4817 930 -179112 -93504 -190482 -126602
8222 -126602 5661 -7503 89245 161194 15353 93688 -51701 153089 188011 -172068 -369010
8211 -369010 8036 95055 -56348 -44788 62268 -101366 86238 -57965 -133503 -212291 -102358
8199 -93266 -151610 11416 -277078 -128473 -2640 173616 -133618 -2825 -182597 227537 -73641
8187 -293638 -174005 -7505 -298931 143256 -10253 -334745 107288 41729 3912 118753 -147900
8175 42745 127467 -51762 -18293 -124768 -175826 53099 18068 -382965 65656 190770 156205
8164 156205 -207660 98711 192158 -142266 40415 8782 -332332 -17171 -351457 -163526 32749
8152 -140247 -244409 57040 -202282 -3154 6179 -46344 41302 -30445 124653 -161961 -170749
8141 -170749 -93998 -50829 48597 -96125 65783 -37519 -67118 -109685 7419 -83913 -130484 46386
8128 2011 162529 57240 -324384 -169441 -217198 119673 -276341 -172390 8895 -106172 -395692
8117 -395692 191002 8937 192393 170252 49548 -156678 -143820 -128648 441864 -292705 -127428
8105 37023 -35954 -151290 -2003 -159325 -300157 -106676 -16714 -158569 -80366 241954 235509
8094 235509 -47806 256708 -95044 -27622 85580 -370961 -48188 116029 -181614 -15061 -55642
8083 -55642 -333332 -161273 414130 1337 -105102 11081 17413 -214326 73635 -52019 27090
8071 300573 -75949 -30186 139893 -327707 -167689 24777 -53389 145925 134197 -63804 178499
8059 42558 87614 -206302 -59725 245819 251040 25873 221805 -28154 -151496 33754 -34782
8047 -350868 -1148 183291 -258321 -3816 384424 -3552 -127767 53577 179934 -69515 26078
8035 162372 -353323 -182979 175684 -23765 -874 184698 196777 66116 90451 95215 -261511
8023 -60365 -28009 -60746 -244910 47747 171586 -56711 148617 -41851 129766 15096 20219
8012 20219 19769 110890 -50220 306817 34732 -78745 -130902 -43362 87226 -132713 40024 -242115
7999 -113895 283472 -47892 10359 -16998 -239769 88673 -187346 -137577 -6132 236366 -196942
7987 168771 66416 201771 -61331 -102829 -114025 -305065 -201688 45687 -71390 -286865 250621
7975 -118052 -112719 -37059 -46965 3264 -68592 -181090 -483799 117777 -47834 -85472 -188363
7964 -188363 -302459 53503 -287167 284830 34418 -184019 7284 -45237 -276220 252378 112082
7952 71657 117207 -10811 -158768 -506621 47218 163906 -52452 -68070 24822 29026 270714
7941 270714 -197555 29696 28117 184398 -103692 -334913 195046 99837 315505 -87185 183917
7929 188932 -72179 163777 -67257 -95453 -176995 187463 149028 120956 -115544 -99179 -73709
7918 -73709 -39716 -430204 -223525 -146484 -351366 -320779 -65083 23996 -400173 106712 -235908
7906 -138316 -202693 -237918 -243667 -278710 -138857 276856 -77273 -165224 -57881 40270 195676
7895 195676 58544 -74054 -169255 -293851 -313610 50769 8793 -102030 -91349 139334 -8501
7883 -163651 -219980 72327 -22781 -166082 28664 59517 -255050 40936 -82388 314106 -290714
7871 151019 -63972 -62112 -168568 -370527 -153283 -168041 -233724 -30973 291102 133983 -14450
7859 95969 -204130 -297057 -14615 -94231 7901 -94479 165609 190690 -81499 -228479 -45885
7847 146942 143737 196425 -150704 -17584 -270444 57039 126191 -60555 249035 76128 -34154
7835 -7335 -202164 -444933 -67487 121118 390340 95265 132674 109633 -96993 -37917 -298099
7824 -298099 -326630 -156681 -212197 253397 37985 -241872 174875 338225 -11117 -57473 66273
7812 97106 -264105 -25684 -5800 -132553 212784 -127099 -192425 -176423 -92983 241972 104612
7800 -205820 -138654 285720 -89121 31804 -253562 169091 -109295 -67116 -272198 -14411 80933
7788 -68311 120146 41934 -6612 65043 127462 132023 294755 130277 71973 -262533 80135
7776 -78607 -54846 -28170 -34162 -252600 -272574 -82081 180490 -80215 -94762 -115282 -196705 353990
7763 -75142 250375 295972 -31546 170127 151022 43573 175263 -26324 -152526 221205 -56032
7751 140270 144391 -16413 34866 -123799 -73150 -14658 146208 69197 -194096 -9073 195369
7739 -258435 19817 -149898 973 -166302 -213786 -76570 -136531 140583 179543 -28794 -68511
7728 -68511 67104 59730 9753 127734 240004 -126088 -176640 -218985 49359 -160472 -24157
7716 40498 -161327 -205714 -331154 96224 125697 77218 143091 -5880 49050 232981 158141
7705 158141 -99858 -9890 -91828 -371862 -360606 21750 190326 -59561 223630 -290455 -102184
7693 -256956 54451 245367 -30090 -219875 154899 219253 -24396 246794 62509 167746 162203
7682 162203 -368176 -189153 -19631 -197894 26126 198882 89278 -98010 75240 112277 137153
7671 137153 -103572 82221 49352 114204 -305563 -247698 -114215 -284883 97210 -560080 -109589
7659 -4216 77832 -101900 -137529 -303389 -74345 -57176 -134244 -120938 -85162 -50310 -95267 -162331
7647 -162331 4766 50698 121909 -343246 137785 -170640 4804 392255 -135457 -107724 94244
7635 -164823 88924 -259509 -61245 136715 55464 -323506 107131 153301 -185443 -289008
7625 -289008 -15805 -339340 -35001 -103281 16364 -204134 15900 -27268 -2799 -156875 317307
7613 2314 192083 345726 -116461 124875 -128264 -228988 25307 332995 -12110 281667
7602 -239482 -134702 33165 160963 -77190 -28500 138202 30129 -230714 171924 -133636
7591 -352460 316938 -268981 75790 -251909 22382 -257621 -31377 8756 -246801 256179 -76177
7579 160824 138608 373747 245854 -192606 -503745 189643 215125 -150986 131752 -80586
7568 -517104 107440 453897 -33934 -300318 -9288 -197394 174039 -357668 -88980 108156
7557 -307629 55988 -142818 -193890 -164067 130270 1243 -46998 -127623 -299314 -301020 106100
7545 86741 9404 -91415 25267 196235 99040 -123641 152671 -243417 -378372 518433 -160489
7533 120996 -36658 -27844 -8413 71633 11416 -204994 -280761 -313501 17298 -326491 -58293 -352994
7521 -352994 -194080 -159108 225846 -20772 -55328 111904 -38807 -104122 -45444 68106 33193
7509 -110497 -403889 -47546 68520 32895 76632 -223537 -244648 -132399 207586 -149832 -204665
7498 -204665 -245424 188627 -97699 -103679 -138417 -98665 188543 -87945 -32734 -32330 -154193 -10810
7485 -57490 101388 229513 -63292 206540 -47438 4381 -280332 240719 -193699 19177 154533
7474 154533 -197476 -160829 -244809 120212 200580 -190985 324259 -63836 -108859 -237049 -22809
7462 39534 -16460 -179067 163929 420758 -411007 -202444 -463562 -80322 52813 -47730 148955
7450 301697 -212099 -48479 224415 -188642 14450 -61438 -211949 232619 218001 37820 125419
7439 125419 -306919 15293 276021 8549 -79915 63524 -128081 255314 -49868 47776 -120121
7427 -213046 105080 -155009 92288 190795 415846 9918 146291 -62179 101294 -34190 -57655
7416 -57655 143447 22788 215165 7052 176938 -134003 -329526 268928 -50468 -214099 291542
7404 -216440 -8378 -192933 6130 -54539 334410 162927 -395748 210757 -72767 -231398 67296
7392 -177328 597892 87696 90385 -102650 -175420 -126004 -76320 101044 125480 56469 150980
7381 150980 11170 -270440 -159333 -140794 58591 -62992 -766953 -84134 -63356 124110 -114200
7369 -108122 -144707 -30534 -152116 -118685 -214822 33259 198290 294593 -1744 18579 121673
7358 121673 144873 46413 42668 -459553 -255051 9524 103112 -36524 245805 -174316 -131672
7347 -131672 8134 -159210 -84755 -23858 -27659 -328905 165736 -152997 265884 -13877 -261665
7336 -261665 239313 -127746 140493 -178990 -130991 -176938 -91230 -263290 -90851 -298977
7326 -298977 -136245 4109 -60513 -187870 6752 -177525 -73860 -175428 112649 -95957 139850
7314 -286628 66036 -469208 80706 -52504 -150637 -167541 86507 -277831 -52115 64341 282833
7303 282833 263573 292144 -125934 84181 -183846 -107495 47369 161311 -28284 -226309 155058
7291 35969 323666 117347 -365458 -177263 -73351 200685 -294365 -88530 145114 52827
7280 263054 20495 -9272 154508 170559 -442973 334278 -79953 -110138 -12841 -188126 -465804
7269 -465804 110678 -164956 304875 -86927 245744 -236519 35268 418523 -23422 -85291
7259 -85291 80620 -103818 -215986 1890 329722 117388 32014 -138342 43413 262033 -33346
7247 -24446 -72343 -187473 -5682 -81635 200881 -218160 49986 135870 -268795 130304 -261883
7235 110545 -137149 -254561 -132885 53104 -147811 -32263 -73350 -103772 290644 -206697
7224 -29712 -68162 6540 7496 43526 16703 -38135 92558 -1278 9861 -78788 325671 -186215
7211 364247 20537 91757 -185559 -29962 178277 -214886 -253458 -75176 52726 -283688 62227
7199 -268622 29872 -362227 20502 -102316 393323 -143128 -191716 -13698 -69501 -248880 -96275
7187 -20294 -100540 184719 290507 22908 -215704 114484 -46503 41933 161717 104473 -174267
7175 -300363 -102417 -23986 -206466 109797 -102909 -294064 -293085 -264736 -399767 -238869 204139
7163 190762 -57580 -78648 126065 -195755 93968 -130203 -49000 -7956 -45786 -157735 165291
7151 -201954 -138408 -359004 -299868 52784 149249 -4229 -38701 405213 -94541 -200501 14209
7139 -189279 -323213 548 176377 -4452 -275395 118793 15772 -56770 8708 -181240 273755
7127 -151182 -4700 164596 -329911 85951 -251549 170168 460016 -139374 257779 -4150 58335
7115 -174327 -126893 154533 -111318 -210459 260941 -263371 -186285 -210355 -283521 -65498 -2536
7103 65005 -297463 155826 -198290 237207 135565 -188878 43752 24833 149819 -82472
7092 231619 -313586 26265 -307620 30677 620664 6724 -411233 110237 180489 271994 127108
7080 113661 150380 151906 86525 -280847 26248 -179462 -253350 -225694 -206715 -330733 4456
7068 -51912 -332112 -22941 211010 188411 87086 80573 5653 -218273 -105919 -191451 5280 -172650
7055 83058 25742 -218020 101298 -70560 209541 -101322 82065 -360090 102854 -39238 -30270
7044 -30270 98976 -142122 -59055 -220256 -4324 -36701 160839 -223154 296448 -34641 118861
7032 80977 325017 -150111 -240154 -33594 -115984 -121140 -135368 -44499 229726 -92489 -173827
7021 -173827 -109271 -31779 -18039 245643 -86324 21131 45217 22292 39475 -82534 504389
7009 -31658 209974 -47718 -221836 128559 -33124 -31995 -202740 -116013 -215247 77299 120742
6998 120742 -76069 -190531 -148933 135445 -3810 200872 -163083 183463 -201595 103276
6987 -5125 161620 -284603 -258868 -146493 133158 -184448 39656 316533 90630 -51143 -24875
6975 -343160 28121 -162970 17977 -22541 -242890 90843 101670 28441 344541 -160517 -152693
6964 -152693 -184207 -159449 -238006 56618 -153226 377506 30828 -244859 -71862 74465 -34000
6952 -81413 -375805 -215796 -16766 46804 -244248 20402 43730 46168 -266978 -202667 101098
6940 80554 -195681 28598 -107689 95317 -252895 -122192 227435 -153249 -58350 -159005
6930 -159005 -325904 197760 -11466 -33713 78744 118168 -228805 71509 -352169 -96830 -239811
6919 -239811 146348 -228634 -357107 -200541 182263 -189808 -404272 -125024 -44546 127148
6908 131376 18315 -175099 -320422 -470412 -134863 83169 -103153 218840 -108997 -59236
6898 -59236 -124394 177970 189402 181129 38339 -110648 -97351 179413 -103235 -172501 85952
6886 -5967 143148 34788 -77736 -298737 -73590 97385 -314249 95486 122015 -98197 -186775
6875 -186775 -375348 -219707 -294508 41462 -142555 -98120 -177558 143660 -107667 298016
6864 -45968 -32428 -163835 104977 89913 -87813 46660 193000 51044 -203729 -189446 344884
6852 116329 -205793 -67199 223246 -88118 -182578 -67627 130358 -339131 -91720 -172584 433162
6840 216488 -68159 -56268 -168173 -177456 53671 -62877 4619 -253044 -52010 150489 145728 -8322
6827 -59333 -133706 63102 103437 21830 176302 279206 191793 353984 -298454 4274 50270
6816 50270 60309 113988 -30249 123412 124325 -375338 104259 -1889 -58457 -101942 64111 94674
6804 94674 -143546 100086 -23978 -117318 -174646 -116660 -148197 -135889 159112 -109209 241936
6792 230211 30497 -109147 57057 281624 68129 136628 -137684 -73462 70708 265025 113054
6780 19640 4859 114427 243830 -171807 76613 267897 -71287 305159 -273787 -166631 -220313
6769 -220313 263135 49167 -227522 140211 -148624 -306521 178301 -8871 -121121 349774
6758 14326 394057 -297995 61463 27735 53589 104518 103208 -76925 -10602 -102830 241630
6746 -69069 -180784 -194588 -343553 -71620 -16968 -213929 -157827 164436 -193424 -12692 -188985
6735 -188985 37319 30470 -113931 98468 125978 -44326 245896 24862 -97188 145068 246457
6724 246457 310837 -134069 -69729 -50083 30843 -153839 -226565 146746 -89029 69154 27161
6712 104642 160221 -64617 64846 118941 -67760 -55845 203232 -359067 -9392 59703 27364
6700 34534 345957 -99696 -55405 -146086 217966 -101885 30672 247735 117922 -324870 -56083
6688 -329028 220668 -110970 -276237 40394 -43004 42618 -187421 3334 164458 -193656 -291798
6677 -291798 -180605 -148888 41140 -104734 -61223 277821 106770 419992 616 -28290 -165669
6666 -165669 -233137 -48104 -18299 237737 -177394 -308920 132541 -51603 -101547 -310153 250708
6654 -269823 171904 8698 -209679 416463 -267381 -117043 6863 -211879 219377 36465 -56852
6642 87006 -241408 53561 -183259 -2711 73302 -75996 171839 98122 -179219 117828 -406173
6630 -339367 -155339 -96570 117199 -163634 -329491 -201378 -71504 -73804 113986 -266031
6619 33096 207052 209848 -66697 81348 258484 -210614 -161234 142327 -2337 156779 310595
6608 310595 20475 -91355 106970 -166724 -152370 129846 -450154 -217847 -115556 74032
6597 -156050 -233847 -3516 29347 157499 -121387 61208 160362 301488 79736 -263734 84725
6585 348063 124954 -27833 -265750 58691 -268892 -226040 90561 79505 -126639 -159863 100301
6573 275088 47788 -53842 -57882 272060 -84812 -102355 -125568 415839 -9557 -74241 -203784
6562 -203784 179677 252740 13558 -464140 328493 -379878 59944 44144 -171249 -79935 -193743
6551 -193743 100442 -34384 -71979 -55654 374917 -213774 18222 -197272 16369 -71482 108441
6539 -75737 -68049 56042 62401 -89047 295147 -11326 276505 -51646 53747 -121792 -102188 8034
6526 86973 240275 54528 -93781 129087 -66198 -45700 -6701 -143187 -19036 -239443 -160528
6515 -160528 -5576 -28784 -265123 117197 -225698 314625 96727 53410 -12983 4004 143791
6504 143791 95673 -128411 -5047 19161 240551 -278780 33903 110418 -26100 23600 -284052
6492 -164708 -56690 -231317 162453 -282740 -45815 -137029 95422 -171611 -98943 154143 401818
6481 401818 -135664 -202917 155542 16237 -214242 103354 -361892 -240860 104808 178102
6471 178102 -117678 177043 230343 244737 123690 -320069 -34095 58549 91109 93836 75649
6460 75649 9915 -123985 215321 64603 36474 -32729 -183676 -27440 -347187 -306256 -160429
6449 -160429 -35023 105459 -60423 -72213 -38789 -68413 -369456 10868 101801 -126419 287809
6437 -75491 1310 -192598 -27294 -3286 -172858 -369249 448570 118823 -95254 -30747 106237
6425 260278 -157580 59029 -62176 96823 -52745 63948 -187863 197688 -52572 -142872 -447320
6414 -447320 -113473 243738 164388 302817 391992 -77079 -88656 -12616 -136198 145265 -62185
6402 234092 -74146 -290148 33797 -364223 -95803 -211514 -353746 54611 -363306 -383724 -227123
6391 -227123 39195 -10406 -121694 -492034 106780 -329510 -46127 55881 321561 -103857
6380 -218950 -13630 37919 334982 30171 -26499 22549 268924 115071 33399 68755 128387
6369 128387 201245 94523 -137347 -87701 111265 -211005 5223 8838 266450 30373 -383242
6357 -29144 62447 -59650 -262302 173935 37372 151336 -256767 -64727 -133148 43285 -24974
6345 -310111 78853 138826 -115019 -47579 -231773 -236629 3960 -223673 146906 98696 73887
6334 73887 504098 74417 -282524 -44122 41695 240598 212951 52229 -47767 -71686 433134
6322 -374032 -119501 -247711 -332022 137525 -90772 -89150 -165222 210998 -180698 244105 -223104
6310 -213932 384636 -224152 -127216 -166303 -112407 -245485 -120212 -210593 -77094 -10016 315718
6298 -519224 255763 51241 20667 89316 168258 23986 -11690 -56938 -249050 470109 173753
6286 -142017 78050 171950 141687 71771 37727 -282518 -115264 14349 77670 -50635 -327608
6275 -327608 -108130 23149 -92974 -240681 142530 -29281 231440 134371 -104912 165003
6264 170345 -109508 -119196 155896 -195951 347007 277509 332951 -197357 -326193 -247884 229502
6252 -108520 -20727 -59068 -106338 -112497 395757 -107196 44282 142086 -162568 5499 -62630
6240 -15249 -94523 -197481 -278770 339839 -113597 -134756 -306386 234112 -205876 217969
6229 236634 -126813 25258 567607 -255054 -51811 -87733 -36625 -110439 18636 211994 89260
6217 -246784 82582 221404 133754 8578 80203 48225 -169065 -71472 -148505 -63637 364622
6205 -189070 11755 98020 112162 -83089 1302 -333066 -96072 -13903 -208023 27690 -45547
6193 -495589 100004 213852 -279516 -172682 -136773 81600 -62699 -27554 -243639 2972 13703
6182 13703 21825 174868 96188 391979 -167809 -283096 -49689 284688 -116578 114635 141877
6171 141877 -168152 -225534 114535 -51374 128525 113101 -183739 -160269 135005 68921 -342846
6159 40044 -296062 -117144 161482 307172 -12280 -398372 -115524 118108 -75148 -285561
6149 -285561 154447 5731 143501 108858 363035 16425 36041 174558 115966 -260081 228326
6137 62595 268757 -144754 -28865 324062 -143669 314195 -313318 90511 2067 13962 -27834
6125 -52383 -322858 -336669 309021 -47916 -38747 -122578 -213263 -69958 186464 115733 276241
6114 276241 47805 -8104 198548 30238 42519 -489751 -175134 -122073 7414 237389 177001
6103 177001 304137 -12534 125790 138853 116040 145794 -147950 54645 -397893 48255 -15012
6091 101499 15099 -122865 -196035 66592 -88510 -308036 -215359 -137584 78300 -228401 45037
6079 -230157 185440 130812 183824 -138792 139130 106982 297177 -4238 86453 25923 96398
6068 96398 177968 87313 29401 258369 -28632 151698 -253023 483695 35654 7998 163493
6057 163493 -26224 42160 114125 -37450 -37548 236919 -115075 -213045 218881 159066 -25783 199322
6044 -58819 -260799 -314813 -116741 -20786 230830 -99845 -261530 -84694 -71079 343125 -186584
6032 -36120 75633 -143931 -279872 134274 -149714 -26370 -177525 -24913 216243 100012
6021 -133405 379675 118860 284058 -86997 -312236 -124963 161513 -15680 -3830 118812
6010 -207693 92679 -126906 83830 135570 185600 365659 132754 -167400 146325 89609 27306
5998 -16028 48963 -49445 -314734 208399 -54494 -436571 118203 -160981 -92383 171279 -115392
5986 135745 -105814 60440 -168235 -68815 142796 264887 -107663 287150 -47426 -136354
5976 -136354 -40048 -231668 -189686 -49511 -231184 -174395 -65 139393 190076 -189693 -198611 125465
5963 -89439 -263515 216591 61655 -178878 -43343 45387 -91430 225558 127593 -189577 -187069
5952 -187069 163541 2143 -41052 150575 -37012 90484 39515 -37568 150002 -74427 -245462
5941 -245462 42934 -110069 25937 168618 -1051 -150904 -34705 -208894 -469828 -55818 -123840
5930 -123840 50777 -144235 -125067 -169101 -80023 -201808 -180659 -19322 -45946 5726 224768
5919 224768 -234173 92407 -93072 193953 -186036 51658 -171274 -9865 -104954 171137 178962
5908 178962 110390 152333 -223212 -266373 -136125 7656 16842 -224164 -12629 -109717 132935
5896 -244909 -32144 85997 -86605 -213006 -273773 83401 40509 71807 47293 -84439 225175
5884 139959 23702 51839 33330 -94355 -43886 -47049 3873 272035 204416 55972 11738 -49116
5871 141528 -222425 -58856 208049 -179418 -71269 -20561 38414 -62706 -22842 12668 -61134
5859 100714 211748 -413985 -26879 -92665 3608 220549 214945 244165 -12952 -2110 -185626
5848 -185626 119286 175735 40772 -71629 24442 -95113 89095 30204 21947 -192732 78215
5836 -443809 -107173 -35304 -115176 -201098 18693 -24139 -199834 -26729 23354 -9880 18580
5824 -68287 123116 -154373 -182747 -81496 67480 -15822 -73794 25915 -301898 -163341 39178
5812 -45791 -315053 -112860 196930 -77480 -395023 -119692 -263976 85485 257539 -106555
5801 -115367 129575 -177697 -48387 -164384 -14423 292841 -138772 -15555 -128387 -183377
5791 -183377 -100018 4729 40706 181737 -26801 41091 -118834 -135156 -266519 185518 -16816
5779 171389 -35514 -100848 39909 -42603 -285158 -109951 118126 379967 20819 164874 -55870
5767 141226 78873 -175569 244079 -320000 -90821 69602 24050 -235095 135286 285024
5757 285024 21531 38187 31073 202766 232110 68605 130538 -88938 -101076 -116603 37560 16683
5744 -189863 -216403 -14367 23804 -80948 217968 19487 -84483 -100140 -92704 -403222 -48710
5732 244720 -290213 -310105 -88078 -48024 333865 8923 -12305 -218986 64197 35657 -171041
5720 200059 -110414 -39207 174492 304651 -363732 168608 101202 169770 7215 -370512 202553
5708 -174254 -134093 -86977 239379 35922 -236833 64730 79965 -66588 -218711 -139220 181308
5696 284038 -21954 97223 -28292 30941 195562 304921 182115 227518 -215159 545035 -92392
5684 420188 -130674 -362862 -339001 -287116 -83784 205939 -501202 -122845 -32012 -123822 -185125
5673 -185125 -168755 -36826 -174673 -81590 -46574 -285983 176269 9254 96923 -12176 -269586
5662 -269586 -61415 70494 113557 242303 -154746 -11641 -180811 -127404 -21983 -295151 -265765
5651 -265765 -62702 -49011 152347 27792 -1933 -262854 -95012 -322527 -110647 210937 164230
5640 164230 -168094 331201 -315652 -173814 -75769 122151 36721 151726 31933 -167802
5629 -151695 -163512 156153 141534 -111494 -32758 13535 -106688 -194277 176285 -357763 -38307
5617 32020 -13938 157422 -38163 273506 335392 276062 25089 -199366 301209 -156007 264990
5605 -421642 139884 67748 -110989 78568 -195301 -8590 -38786 -33321 -128761 -66382 108856
5593 -26575 162733 -331640 146881 -15684 195649 -198002 87477 10069 -106689 -92844 56089
5581 82405 -366872 104567 167350 218937 -23586 337314 28830 105682 298336 -250219 -3685
5569 316873 113176 30973 -63399 -97921 12857 -233310 111701 -225009 -188902 -1392 125328
5557 -182073 90763 -218000 -215479 -159851 282826 -66868 288191 -53370 134945 -176891 -57493
5545 -43083 -216656 20433 118673 -47318 -82933 83697 56750 16831 -227672 99375 248274
5534 248274 419238 -216231 168200 -125366 -17055 101900 -4491 -124460 -190525 131443
5523 47185 -117028 147393 -119526 -314117 309816 -119491 -114035 -199530 -187268 44709 6218
5511 -122123 291046 -120481 -162799 100762 55729 -98328 -292676 -118192 -53322 7036 -41967
5499 -92240 -58235 -169192 -114051 31572 -134281 -251546 -209853 -176875 44104 -179999 -33402
5487 430669 227644 374436 261600 -92759 154992 43500 -70121 -89150 29634 186854 82246
5475 -118600 9368 -78272 -323868 -17192 85430 94943 191604 -149175 175328 -171335 61058
5463 -146143 197688 -199183 -249987 156821 11021 -148062 349650 -151351 -190371 47705
5452 -60762 120021 -34582 21162 246068 -253497 24153 37857 -173474 -22604 26701 208478
5441 208478 -131742 136566 -88349 228300 109254 -35738 159285 110912 -72366 265181
5430 109312 58017 -327354 -180924 69589 -94837 -259704 -112226 -385897 64341 176940
5420 176940 197256 219243 254753 41254 -668044 -171775 -415671 40775 149188 -211943 352573
5408 -317410 148050 234972 -57160 5029 -168281 -66736 165157 9621 343361 -19166 279920
5396 -174457 115521 -97203 217864 21255 193187 298594 169094 -107805 -146510 63451
5385 230682 4370 -153076 -24256 -80334 -18627 -10467 88854 214993 16533 -51013 20338 -92075
5372 -178587 171430 -233393 -25131 201928 31445 71743 72796 -125400 -158903 116237 136798
5361 136798 -170619 -227852 -200628 -157440 -164809 -79543 237905 135833 -153661 350321 114126
5349 168486 -128423 -11707 -219149 277035 -297736 432710 -25093 -248971 -229023 183719
5338 -117445 187213 159098 -323478 224138 -174978 -90664 312251 105884 -54928 66026
5327 40137 -11473 118206 195255 -66163 -56225 75834 73141 -277046 75772 -48622 -63956 58073
5314 -233884 21919 -243370 41733 -320292 -56097 -124826 -4272 -104471 -274514 206377 146960
5303 146960 97359 146593 -56988 226617 -7123 -257534 -182300 -11816 -76639 -335701 -103924
5291 -233665 -7126 16963 187061 58578 147184 -119834 267547 584 355187 -106129 161547
5279 -63319 -8978 207244 -37975 43126 -100259 -188578 -303721 217772 67816 5133 258435
5268 258435 -232132 104553 120020 -122279 -5386 -157605 -120251 -128247 167931 -128192 -7104
5256 -138244 -310826 -228367 99763 -138216 -4967 577148 -185101 177587 -2399 134478 -259249
5244 55603 87725 -225042 -58892 20595 -578111 157190 -30285 -143804 80295 5812 159729
5233 159729 28654 248124 -180222 -105993 46674 175250 -305691 -25788 145 -250145 -37586
5221 -112428 -213341 -29325 -202651 100854 33545 -93637 224546 485206 -152032 -127564
5211 -127564 -184687 -145118 215058 -193852 171299 -87739 150726 -165703 36067 295478
5201 295478 291436 618 18761 7376 -16184 109492 192757 161884 185736 78278 -239875 305050
5188 -152075 -184321 118780 114095 -182743 43491 -60291 -70730 102451 452115 -114920 -105525
5177 -105525 220559 -106392 111844 545470 424669 120274 -148611 112454 -79050 13896
5166 392450 -81090 -209605 152991 -144020 22918 -137576 -118590 -35490 -143416 -182219 -116670
5155 -116670 -130320 -74690 -239606 -139842 -41579 -260054 -276873 -92570 209751 -53730 -38438
5144 -38438 168 6872 10786 -215558 146739 133711 -318929 -178042 -74316 -216276 -58207 -190343
5132 -190343 -126259 -379697 313750 175447 -117996 -20980 39666 479919 266474 188886
5122 188886 -243875 84590 -411368 -235448 121897 178189 -89293 -239604 113427 -463662
5111 364605 -30402 -137196 -24383 -9486 -78741 114120 -296933 -112896 -175223 -65777 -57927
5100 -57927 69148 214515 181971 -151992 359161 -128585 24163 -124978 207791 -180169
5089 -110474 -155204 105295 -9659 -76215 179284 -38168 469280 -301671 158844 167926 -249440
5077 -130338 134998 163401 -136338 -120156 -96455 -118144 -149110 -79878 -61638 253180 -178530
5065 140869 283103 -33945 215023 61628 89469 164736 26358 204333 -10587 464 -175995
5053 140384 -92174 12257 188120 36144 209264 139621 -278788 -224157 125104 -100255 295391
5041 250648 -69084 -132184 -142241 105476 100452 202690 314869 37763 207394 263 58495
5030 58495 13203 224489 86888 292638 254274 -73026 -304531 94687 -89165 55384 -106661
5018 179440 -109064 -85122 177429 -3305 -148973 34787 14446 59864 -45784 49230 -58500
5006 -43678 -149949 133612 26346 -237147 -121366 70480 76923 -5682 286628 -17996 61994
4994 -91125 249529 220858 75859 190819 -430265 60380 230105 -230992 -116437 362943
4983 -125571 -5052 99755 314467 172121 45294 68135 -50417 -8813 160296 414716 -57389
4971 158216 -67191 14761 258640 -25678 -238165 -79617 104088 121470 -68975 -272327 114698
4959 19891 -21650 9065 64783 -226819 -310143 302425 -72232 203244 -34513 211950 130622
4948 130622 63691 237703 -14152 212636 103417 -54031 36669 -46450 -49099 -241352 -44549
4936 56447 97243 -3600 -235362 -101930 -373364 -296332 77013 23548 -167774 3085 -36173
4924 384028 163024 107511 -269464 93535 -28621 -171982 -256133 255827 237086 56667 -62334
4912 219332 -24669 34655 -153740 -143860 89992 -110411 -451082 -119501 -385929 -235427 12059
4900 -177223 336216 -414316 -299086 316982 103356 383726 119938 147640 99541 658213
4890 658213 -50393 -69727 134543 96051 -10877 69413 19932 98399 295167 279522 -66779
4878 24031 128687 239942 44699 168909 301731 -286898 245765 -217039 100880 108902
4868 108902 176570 109270 265640 131712 -132414 278651 200843 37435 -98908 11194 -48327
4856 -9196 141295 79413 -68191 28926 -60065 -164774 268118 74605 423997 -65299 193671
4844 152877 -106707 -200246 -262237 -6676 64530 90660 165633 -160593 -2951 216325 20030
4832 17580 -84533 -159625 51768 -88090 -193571 -53576 488526 454202 -280501 -109517 -229684
4821 -229684 -38221 -267493 -151563 -19601 -360505 -143769 141735 -87004 26177 218242
4811 218242 -69469 -101759 -31872 37759 223806 -212193 -113624 -146411 170355 11864 -90263
4799 -44426 -263616 39922 159083 -286748 418743 -10321 43732 -154750 35769 131060 -76852
4787 -321093 -155546 -105399 92585 -81365 331544 85869 -24939 -28150 73037 191000 -232924
4775 -9740 17984 -145189 -56891 -236664 4833 127371 52865 -115721 -37491 -78530 -106118
4764 -106118 60642 59230 -100346 -12432 -36014 -235736 -328679 75653 -62483 -72972 374278
4752 -83213 32050 5029 71801 -301336 18391 118651 -329459 311873 58401 117040 206166
4741 206166 137459 -77375 65820 -57075 -183127 275128 153294 326845 249720 -128378 158908
4729 163051 10414 -391913 -88462 -173346 -42976 -102178 -3562 -21621 -67596 87561 54029 47939
4717 47939 -14923 -78068 -45988 -146125 101622 80057 282272 149512 15899 61391 -139129
4705 52081 -102378 -84664 -46739 145217 40759 -174877 91329 -30570 25552 -82782 -239077
4694 -239077 54021 363886 147848 52963 176092 184769 -231137 114963 -115269 277358
4683 211891 51864 201859 -166835 256260 -68692 45198 4978 12906 -124193 85702 209580
4672 209580 208275 -27208 -18181 264818 -57971 50486 -231891 -127534 -94937 -226036 -212054
4661 -212054 184411 158176 70778 -50274 25696 -324183 -221651 206496 204736 204055 6567 -126077
4648 -163478 -242075 107294 -48611 66381 -370820 94906 546633 -51293 -255714 474084 233214
4636 -117642 -88759 -460839 88206 -111102 105261 -219995 252555 -34489 -53737 -140300 44561
4624 6627 64091 -179651 -52087 229117 -170748 138782 263851 5320 -176253 -26817 274732
4612 210728 35450 22241 110321 205888 83572 -131122 -199196 192912 -44675 66693 210932
4601 210932 -131922 39002 110087 -137342 245395 130832 -463647 256093 171066 298016
4591 298016 114776 -314417 31083 72316 183806 221271 224504 -150912 303015 -253459 -82487
4579 206733 -7111 64134 -66592 67564 360781 107428 -174900 -242314 212568 -272637 -202432
4568 -202432 50687 -174086 -140449 -80671 117981 -396035 -77178 -2643 -57707 321756 271548
4557 271548 13051 336518 -374316 81016 -70660 -36267 12682 19596 300185 -192556 -122347
4546 -122347 75484 260872 60410 301948 79237 202141 -241373 -72922 156426 109994 199490
4535 199490 -327313 -327919 152212 328094 138977 166310 132199 -75295 252571 325495 -203395
$$ [...]
##END NTUPLES=NMR SPECTRUM
##END=
