
##TITLE=AC1349_GUAAH12167_6672503_nEyGrZXsEf
##JCAMPDX= 6.0         $$ Bruker NMR JCAMP-DX V2.0
##DATA TYPE= NMR SPECTRUM
##DATA CLASS= NTUPLES
##ORIGIN= BRUKER
##OWNER= Administrator
$$ 1.72 TOPSPIN		Version 2.1
$$ 2012-08-14 18:18:17.781 -0500  Administrator@TOPSPIN
$$ Compression mode = diff/dup
##.OBSERVE FREQUENCY= 400.02188249412
##.OBSERVE NUCLEUS= ^1H
##.ACQUISITION MODE= SIMULTANEOUS (DQD)
##.ACQUISITION SCHEME= undefined
##.AVERAGES= 64
##.DIGITISER RES= 22
##SPECTROMETER/DATA SYSTEM= spect
##.PULSE SEQUENCE= noesygpps1d.comp
##.SOLVENT NAME= COFFEE_meoh
##.SHIFT REFERENCE= INTERNAL, COFFEE_meoh, 1, 14.96085
##AUDIT TRAIL= $$ (NUMBER, WHEN, WHO, WHERE, PROCESS, VERSION, WHAT)
$$ ##TITLE= Audit trail, TOPSPIN		Version 2.1
$$ ##JCAMPDX= 5.01
$$ ##ORIGIN= Bruker BioSpin GmbH
$$ ##OWNER= Administrator
$$ $$ C:\Bruker\TOPSPIN/data/COFFEE/nmr/AC1349_GUAAH12167_6672503_nEyGrZXsEf/12/pdata/1/auditp.txt
$$ ##AUDIT TRAIL=  $$ (NUMBER, WHEN, WHO, WHERE, PROCESS, VERSION, WHAT)
(   1,<2012-08-14 18:18:03.015 -0500>,<Administrator>,<TOPSPIN>,<go>,<TOPSPIN 2.1>,
      <created by zg
	started at 2012-08-14 18:06:18.265 -0500,
	POWCHK enabled, PULCHK disabled,
       configuration hash MD5:
       6B 1B 68 BB D9 2E 58 E2 7F 35 AD 54 07 DF 0E 41
       data hash MD5: 64K
       AB 13 74 26 E3 A7 0A 54 D6 D6 B4 FF F9 60 0A D6>)
(   2,<2012-08-14 18:18:14.843 -0500>,<Administrator>,<TOPSPIN>,<proc1d>,<TOPSPIN 2.1>,
      <Start of raw data processing
       efp LB = 0.3 FT_mod = 6 PKNL = 1 PHC0 = 0 PHC1 = 0 SI = 128K 
       data hash MD5: 128K
       D7 C8 FF 5F 81 D1 20 32 5B 74 E0 6B 45 5B A8 C3>)
(   3,<2012-08-14 18:18:16.343 -0500>,<Administrator>,<TOPSPIN>,<proc1d>,<TOPSPIN 2.1>,
      <pk PHC0 = 1.724854 PHC1 = 0 
       data hash MD5: 128K
       49 F9 E8 8C CE 13 C9 70 85 91 AF C5 32 02 C9 F0>)
(   4,<2012-08-14 18:18:17.078 -0500>,<Administrator>,<TOPSPIN>,<proc1d>,<TOPSPIN 2.1>,
      <abs ABSG = 1 
       data hash MD5: 128K
       A2 89 46 88 02 C4 94 4B 91 8D B4 50 69 3B 70 80>)
(   5,<2012-08-14 18:18:17.187 -0500>,<Administrator>,<TOPSPIN>,<proc1d>,<TOPSPIN 2.1>,
      <abs ABSG = 2 
       data hash MD5: 128K
       14 9E F0 9A F1 42 C4 2C 6E B7 50 FB 6B C0 73 17>)
(   6,<2012-08-14 18:18:17.250 -0500>,<Administrator>,<TOPSPIN>,<proc1d>,<TOPSPIN 2.1>,
      <abs ABSG = 3 
       data hash MD5: 128K
       16 83 5C A2 10 C4 FC 32 15 E1 1D 34 1B 93 31 10>)
(   7,<2012-08-14 18:18:17.328 -0500>,<Administrator>,<TOPSPIN>,<proc1d>,<TOPSPIN 2.1>,
      <abs ABSG = 4 
       data hash MD5: 128K
       4B BE 6F F8 01 BC 5F A5 86 D2 A4 E6 03 7C 24 D8>)
(   8,<2012-08-14 18:18:17.421 -0500>,<Administrator>,<TOPSPIN>,<proc1d>,<TOPSPIN 2.1>,
      <abs ABSG = 5 
       data hash MD5: 128K
       EF EA 68 CF 80 F0 32 58 4D 23 2D F9 94 9A 8A 79>)
$$ ##END=
$$ 
$$ $$ hash MD5
$$ $$ 2A F2 7D 23 B8 15 9D 8B 31 B5 6E 5F 18 EF FC 65
##$RELAX= 
##$RELAX= 
##$RELAX= 
##$RELAX= 
##$RELAX= 
##$RELAX= 
##$RELAX= 
##$RELAX= 
$$ Bruker specific parameters
$$ [...]
150 150 150 150 150 150 150 150
##$TP07= 0
##$TPNAME0= <>
##$TPNAME1= <>
##$TPNAME2= <>
##$TPNAME3= <>
##$TPNAME4= <>
##$TPNAME5= <>
##$TPNAME6= <>
##$TPNAME7= <>
##$TPOAL= (0..7)
0.5 0.5 0.5 0.5 0.5 0.5 0.5 0.5
##$TPOFFS= (0..7)
0 0 0 0 0 0 0 0
##$TUNHIN= 0
##$TUNHOUT= 0
##$TUNXOUT= 0
##$USERA1= <user>
##$USERA2= <user>
##$USERA3= <user>
##$USERA4= <user>
##$USERA5= <user>
##$V9= 5
##$VALIST= <valist>
##$VCLIST= <CCCCCCCCCCCCCCC>
##$VD= 0
##$VDLIST= <DDDDDDDDDDDDDDD>
##$VPLIST= <PPPPPPPPPPPPPPP>
##$VTLIST= <TTTTTTTTTTTTTTT>
##$WBST= 1024
##$WBSW= 4
##$XGAIN= (0..3)
0 0 0 0
##$XL= 0
##$YL= 0
##$YMAX_a= 11075795
##$YMIN_a= -8492801
##$ZGOPTNS= <>
##$ZL1= 120
##$ZL2= 120
##$ZL3= 120
##$ZL4= 120
##$ABSF1= 14.96085
##$ABSF2= -5.597332
##$ABSG= 5
##$ABSL= 3
##$ALPHA= 0
##$AQORDER= 0
##$ASSFAC= 0
##$ASSFACI= 0
##$ASSFACX= 0
##$ASSWID= 0
##$AUNMP= <proc_prof1d_extract.lims>
##$AXLEFT= 0
##$AXNAME= <>
##$AXNUC= <1H>
##$AXRIGHT= 0
##$AXTYPE= 0
##$AXUNIT= <>
##$AZFE= 0.1
##$AZFW= 0.1
##$BCFW= 0
##$BC_mod= 0
##$BYTORDP= 0
##$COROFFS= 0
##$CY= 15
##$DATMOD= 1
##$DC= 0
##$DFILT= <>
##$DTYPP= 0
##$F1P= 0
##$F2P= 0
##$FCOR= 0.5
##$FTSIZE= 131072
##$FT_mod= 6
##$GAMMA= 0
##$GB= 0
##$INTBC= 1
##$INTSCL= 1
##$ISEN= 128
##$LB= 0.3
##$LEV0= 0
##$LPBIN= 0
##$MAXI= 10000
##$MC2= 0
##$MEAN= 0
##$ME_mod= 0
##$MI= 0
##$NCOEF= 0
##$NC_proc= -2
##$NLEV= 6
##$NOISF1= 0
##$NOISF2= 0
##$NSP= 0
##$NTH_PI= 0
##$NZP= 0
##$OFFSET= 14.96085
##$PC= 1
##$PHC0= 1.724854
##$PHC1= 0
##$PH_mod= 1
##$PKNL= yes
##$PPARMOD= 0
##$PPDIAG= 0
##$PPIPTYP= 0
##$PPMPNUM= 2147483647
##$PPRESOL= 1
##$PSCAL= 4
##$PSIGN= 0
##$PYNMP= <proc.py>
##$REVERSE= no
##$SF= 400.020009697025
##$SI= 131072
##$SIGF1= 0
##$SIGF2= 0
##$SINO= 400
##$SIOLD= 131072
##$SPECTYP= <>
##$SREGLST= <1H.CDCl3>
##$SSB= 0
##$STSI= 131072
##$STSR= 0
##$SW_p= 8223.68421052631
##$SYMM= 0
##$S_DEV= 0
##$TDeff= 65536
##$TDoff= 0
##$TI= <>
##$TILT= no
##$TM1= 0
##$TM2= 0
##$TOPLEV= 0
##$USERP1= <user>
##$USERP2= <user>
##$USERP3= <user>
##$USERP4= <user>
##$USERP5= <user>
##$WDW= 1
##$XDIM= 131072
##$YMAX_p= 403577423
##$YMIN_p= -11909
##$CURPLOT= <Network HP LaserJet P1505>
##$CURPRIN= <$Network HP LaserJet P1505>
##$DFORMAT= <normdp>
##$LAYOUT= <+/1D_H.xwp>
##$LFORMAT= <normlp>
##$PFORMAT= <normpl>
##$SURQMSG= 1
$$ End of Bruker specific parameters
$$ ---------------------------------
##NTUPLES= NMR SPECTRUM
##VAR_NAME=  FREQUENCY,     SPECTRUM/REAL,   SPECTRUM/IMAG
##SYMBOL=    X,             R,               I
##VAR_TYPE=  INDEPENDENT,   DEPENDENT,       DEPENDENT
##VAR_FORM=  AFFN,          ASDF,            ASDF
##VAR_DIM=   131072,        131072,          131072
##UNITS=     HZ,            ARBITRARY UNITS, ARBITRARY UNITS
##FACTOR=    0.0627417313425164, 1,          1
##FIRST=     8223.62146879497, 2597,         -56334
##LAST=      0,             3883,            -56500
##MIN=       0,             -11909,          0
##MAX=       8223.62146879497, 403577423,    0
$$ Real data points
##PAGE= N=1
##DATA TABLE= (X++(R..R)), XYDATA
$$ [...]
$$ plain form
63949 1160341 1247533 1347938 1463286 1594530 1742382 1907285 2088919 2286160 2497550 2721469
63939 2721469 2955942 3198726 3447499 3699334 3949813 4193060 4422883 4633751 4820865
63930 4820865 4980008 5107757 5201529 5259173 5278827 5259494 5201592 5106689 4976867 4814750
63920 4814750 4624077 4409915 4178015 3933967 3682893 3429696 3179153 2935455 2701705
63911 2701705 2480147 2272900 2082087 1908998 1753467 1614456 1491087 1382753 1288451 1206646
63901 1206646 1135844 1074864 1022354 976505 935557 898481 865026 835291 809284 786549 766007
63890 766007 746294 726470 706390 686433 667088 648814 632023 616948 603588 591840 581642
63879 581642 573050 566316 561800 559621 559510 561221 564964 571080 579453 589650 601481 614878 629280
$$ packed form
63949A160341Q7192J00405J15348J31244J47852J64903J81634J97241K11390K23919
63939B721469K34473K42784K48773K51835K50479K43247K29823K10868J87114
63930D820865J59143J27749R3772N7644J9654j9333n7902r4903j29822j62117
63920D814750j90673k14162k31900k44048k51074k53197k50543k43698k33750
63911B701705k21558k07247j90813j73089j55531j39011j23369j08334r4302q1805
63901A206646p0802o0980n2510m5849m0948l7076l3455k9735k6007k2735k0542
63890G66007j9713j9824k0080j9957j9345j8274j6791j5075j3360j1748j0198
63879E81642q592o734m516k179j11J711L743O116Q373J0197J1831J3397J4402
$$ plain form
63866 629280 643873 658633 674417 691588 709154 725717 740778 754544 766945 777605 786535 794109
63854 794109 800307 804538 806251 805237 801373 794640 785497 774745 762817 749571 734920 719158 702484
63841 702484 684654 665516 645507 625142 604220 582116 558902 535678 513514 492400 471602
63830 471602 450896 430998 412661 395785 379778 364565 350775 338855 328455 318909 310055 302250
63818 302250 295770 290453 285850 281496 277127 272848 269034 265857 263016 260206 257692 256061 255338 254739 253425
63803 253425 251307 249006 247186 246022 245168 244159 242951 242031 241791 241818 241095 239012 235924 232642 229665 227085
63787 227085 224874 222936 221102 219369 218015 217184 216480 215381 213986 212912 212327 211508 209644 206860 204165
63772 204165 202434 201734 201602 201740 202259 203296 204563 205412 205381 204645 203822 203378 203304 203381 203558 203953 204558 205126 205384
$$ packed form
63866F29280J4593J4760J5784J7171J7566J6563J5061J3766J2401J0660Q930P574
63854G94109O198M231J713j014l864o733r143j0752j1928j3246j4651j5762j6674
63841G02484j7830j9138k0009k0365k0922k2104k3214k3224k2164k1114k0798
63830D71602k0706j9898j8337j6876j6007j5213j3790j1920j0400r546q854p805
63818C02250o480n317m603m354m369m279l814l177k841k810k514j631p23n99j314
63803B53425k118k301j820j164q54j009j208r20k40K7p23k083l088l282k977k580
63787B27085k211j938j834j733j354q31p04j099j395j074n85q19j864k784k695
63772B04165j731p00j32J38N19J037J267Q49l1p36q23m44p4P7J77L95O05N68K58
$$ plain form
63753 205384 205261 204874 204335 203675 202971 202492 202557 203186 204032 204874 206066 208188 211193 214235 216573 218348 220134
63736 220134 221952 223241 223801 224246 225346 227234 229495 231798 234146 236716 239717 243305 247352 251357 254864
63721 254864 258021 261554 266059 271339 276469 280518 283247 285080 286359 286807 285964 284074 282070 280551 279209
63706 279209 277556 275800 274463 273374 271687 269012 265992 263600 262213 261605 261514 261925 262968 264787 267471
63691 267471 270935 274859 278767 282144 284587 286075 287155 288618 290827 293377 295455 296494 296534 296107 295725
63676 295725 295396 294703 293513 292438 292299 293201 294449 295351 295815 296177 296833 298061 299786 301354 301912 301205 299725
63659 299725 298034 296278 294461 292647 290624 287856 284163 280137 276496 273318 270338 267625 265447 263668
63645 263668 261873 259999 258369 257159 256366 256219 257014 258415 259545 260104 260951 263144 266685 270636 274326
$$ packed form
63753B05384j23l87n39o60p04m79O5O29Q46Q42J192K122L005L042K338J775J786
63736B20134J818J289N60M45J100J888K261K303K348K570L001L588M047M005L507
63721B54864L157L533M505N280N130M049K729J833J279M48q43j890k004j519j342
63706B79209j653j756j337j089j687k675l020k392j387o08r1M11J043J819K684
63691B67471L464L924L908L377K443J488J080J463K209K550K078J039M0m27l82
63676B95725l29o93j190j075j39R02J248R02M64L62O56J228J725J568N58p07j480
63659B99725j691j756j817j814k023k768l693m026l641l178k980k713k178j779
63645B63668j795j874j630j210p93j47P95J401J130N59Q47K193L541L951L690
$$ plain form
63630 274326 278003 282244 287121 292246 297430 302937 309062 315804 323210 331737 341818 353069 364460
63617 364460 375530 387120 400594 416563 434614 454074 474682 496662 520469 546432 574436
63606 574436 603973 634536 665688 696592 725840 752129 774767 793187 806386 813557 815128 812479
63594 812479 806706 798325 788221 777993 768892 760801 752534 742766 730488 715127 696743 675931 653317
63581 653317 629388 604943 581259 559393 539556 521407 504724 489517 475898 464249 455283 449394
63569 449394 446069 444316 443612 444102 446006 449306 454079 460604 468875 478238 487811 497216 506778 516998
63555 516998 528046 539827 552517 566822 583594 603284 625893 651265 679164 709195 741113
63544 741113 775206 811782 849851 886596 918551 943338 960227 969539 972051 968886 961462 951297
$$ packed form
63630B74326L677M241M877N125N184N507O125O742P406Q527J0081J1251J1391
63617C64460J1070J1590J3474J5969J8051J9460K0608K1980K3807K5963K8004
63606E74436K9537L0563L1152L0904K9248K6289K2638J8420J3199P171J571k649
63594H12479n773q381j0104j0228r101q091q267r768j2278j5361j8384k0812k2614
63581F53317k3929k4445k3684k1866j9837j8149j6683j5207j3619j1649q966n889
63569D49394l325j753p04M90J904L300M773O525Q271R363R573R405R562J0220
63555E16998J1048J1781J2690J4305J6772J9690K2609K5372K7899L0031L1918
63544G41113L4093L6576L8069L6745L1955K4787J6889R312K512l165p424j0165
$$ plain form
63532 951297 939875 928509 918035 908548 899525 890073 879031 865231 848081 827766 804566 778158
63520 778158 748086 714912 680444 646706 614898 585315 557838 532333 508902 487939 469748
63509 469748 454023 439937 426882 414924 404423 395450 387719 380863 374663 369184 364803 361862 360088
63496 360088 358584 356615 354292 352279 350990 350323 350006 349862 349792 349798 350112 351053 352667 354691 356961 359626 362838
63479 362838 366386 369827 372961 375989 379208 382634 385945 388708 390639 391723 392099 391790 390503 387772 383422
63464 383422 377962 372479 367965 364582 361553 357912 353475 348985 345245 342296 339671 337313 335805 335570
63450 335570 336343 337753 340031 343617 348169 352670 356653 360824 366220 373187 381507 391128 402219 414650
63436 414650 428009 442286 458191 476571 497599 520609 544521 568309 591058 611735 629192
$$ packed form
63532I51297j1422j1366j0474r487r023r452j1042j3800j7150k0315k3200k6408
63520G78158l0072l3174l4468l3738l1808k9583k7477k5505k3431k0963j8191
63509D69748j5725j4086j3055j1958j0501q973p731o856o200n479m381k941j774
63496C60088j504j969k323k013j289o67l17j44p0OL14R41J614K024K270K665L212
63479C62838L548L441L134L028L219L426L311K763J931J084L76l09j287k731m350
63464C83422n460n483m514l383l029l641m437m490l740k949k625k358j508k35
63450C35570P73J410K278L586M552M501L983M171N396O967Q320R621J1091J2431
63436D14650J3359J4277J5905J8380K1028K3010K3912K3788K2749K0677J7457
$$ plain form
63425 629192 642792 653176 662120 671389 681866 693979 708563 726750 749080 775318 805188 838668
63413 838668 875198 912954 949356 982192 1010089 1032217 1048017 1057283 1060283 1057788 1051036 1041471
63401 1041471 1030175 1017509 1003421 987985 971407 953551 933819 911540 886326 858088 827091
63390 827091 794190 760775 728184 697157 667930 640616 615280 591748 569750 549357 531141
63379 531141 515797 503674 494640 488254 484035 481771 481663 484025 488749 495242 503020 512155 522966 535460
63365 535460 549377 564670 581610 600427 621157 643857 668685 695708 724915 756433 790313
63354 790313 825989 862334 898456 934001 968344 999897 1026760 1047850 1062924 1071746 1073939 1069817
63342 1069817 1060812 1048789 1035181 1020864 1006413 992074 977547 961977 944150 922833 897344
$$ packed form
63425F29192J3600J0384Q944R269J0477J2113J4584J8187K2330K6238K9870L3480
63413H38668L6530L7756L6402L2836K7897K2128J5800R266L000k495o752r565
63401A041471j1296j2666j4088j5436j6578j7856j9732k2279k5214k8238l0997
63390H27091l2901l3415l2591l1027k9227k7314k5336k3532k1998k0393j8216
63379E31141j5344j2123r034o386m219k264j08K362M724O493P778R135J0811J2494
63365E35460J3917J5293J6940J8817K0730K2700K4828K7023K9207L1518L3880
63354G90313L5676L6345L6122L5545L4343L1553K6863K1090J5074Q822K193m122
63342A069817r005j2023j3608j4317j4451j4339j4527j5570j7827k1317k5489
$$ plain form
63331 897344 868082 836413 803912 771685 740286 709965 680915 653498 628375 606246 587498
63320 587498 572321 561047 553836 549759 546640 542179 535130 525320 513077 499120 484621 470618 457338
63307 457338 444514 432357 421706 413091 406102 399911 394080 388652 383741 379381 375647 372677 370552
63294 370552 369242 368577 368208 367742 367079 366515 366333 366357 366064 365071 363374 361209 358897 356796 355113 353677 352127
63277 352127 350416 348923 347845 346707 344823 342179 339511 337460 336035 335021 334525 334716 335245 335400 334905
63262 334905 334213 333933 334211 334829 335697 337021 339005 341495 343980 346093 348187 351184 355554 360571 364993
63247 364993 368518 372174 377123 383522 390805 398694 407442 417258 427960 439259 451178 464127 478684
63234 478684 495188 513410 532743 552798 573622 595134 616710 637682 658039 678158 697987
$$ packed form
63331H97344k9262l1669l2501l2227l1399l0321k9050k7417k5123k2129j8748
63320E87498j5177j1274p211m077l119m461p049r810j2243j3957j4499j4003j3280
63307D57338j2824j2157j0651q615o989o191n831n428m911m360l734k970k125
63294C70552j310o65l69m66o63n64j82K4k93r93j697k165k312k101j683j436j550
63277C52127j711j493j078j138j884k644k668k051j425j014m96J91N29J55m95
63262C34905o92k80K78O18Q68J324J984K490K485K113K094K997M370N017M422
63247C64993L525L656M949O399P283P889Q748R816J0702J1299J1919J2949J4557
63234D78684J6504J8222J9333K0055K0824K1512K1576K0972K0357K0119J9829
$$ plain form
63223 697987 717051 735320 753536 772436 792015 811769 831304 850380 868627 885612 901149
63212 901149 915217 927541 937379 943810 946140 944054 937471 926373 910882 891531 869344 845481
63200 845481 820862 796190 772133 749242 727798 708116 690925 676982 666243 657950 651796 648524
63188 648524 648893 652459 658002 665052 674277 686207 700225 715235 730868 747504 765281 783673 802128
63175 802128 820536 838839 856612 873512 889887 906306 922500 937273 949625 959408 966599 970497
63163 970497 970241 965818 957860 946515 931232 911772 888824 863362 835895 806735 776589 746430
63151 746430 716968 688608 661703 636522 613117 591578 572249 555294 540153 525862 512019
63140 512019 499143 487985 478789 471343 465462 461149 458274 456308 454509 452485 450522 449254 448973 449415
$$ packed form
63223F97987J9064J8269J8216J8900J9579J9754J9535J9076J8247J6985J5537
63212I01149J4068J2324R838O431K330k086o583j1098j5491j9351k2187k3863
63200H45481k4619k4672k4057k2891k1444j9682j7191j3943j0739q293o154l272
63188F48524L69L566N543P050R225J1930J4018J5010J5633J6636J7777J8392J8455
63175H02128J8408J8303J7773J6900J6375J6419J6194J4773J2352R783P191L898
63163I70497k56m423p958j1345j5283j9460k2948k5462k7467k9160l0146l0159
63151G46430k9462k8360k6905k5181k3405k1539j9329j6955j5141j4291j3843
63140E12019j2876j1158r196p446n881m313k875j966j799k024j963j268k81M42
$$ plain form
63126 449415 450245 451495 453423 456170 459782 464321 469636 475197 480504 485535 490469 495120 499128 502635
63112 502635 506226 510054 513552 516222 518281 520189 521936 523223 524141 525169 526540 527993 529186 529972 530177
63097 530177 529456 527674 525316 523274 522179 522005 522276 522461 522141 521003 519002 516603 514694 514004 514590 515949
63081 515949 517592 519498 522078 525783 530639 536076 541338 546218 551320 557439 564805 573140 582255 592211
63067 592211 602931 614155 625932 638769 653070 668739 685584 703818 723851 745850 769889
63056 769889 796328 825596 857576 891702 927751 966240 1007830 1052543 1099711 1148519 1198429
63045 1198429 1249156 1300383 1351493 1401609 1450096 1497098 1543427 1589706 1635705 1680713 1724438
63034 1724438 1767250 1809426 1850493 1889522 1925797 1958711 1986985 2008525 2021403 2024741 2018362 2001923
$$ packed form
63126D49415Q30J250J928K747L612M539N315N561N307N031M934M651M008L507
63112E02635L591L828L498K670K059J908J747J287R18J028J371J453J193P86K05
63097E30177p21j782k358k042j095j74K71J85l20j138k001k399j909o90N86J359
63081E15949J643J906K580L705M856N437N262M880N102O119P366Q335R115R956
63067E92211J0720J1224J1777J2837J4301J5669J6845J8234K0033K1999K4039
63056G69889K6439K9268L1980L4126L6049L8489M1590M4713M7168M8808M9910
63045A198429N0727N1227N1110N0116M8487M7002M6329M6279M5999M5008M3725
63034A724438M2812M2176M1067L9029L6275L2914K8274K1540J2878L338o379j6439
$$ plain form
63022 2001923 1975018 1938206 1893359 1842682 1787680 1729304 1668802 1608021 1548915 1493041 1441483
63011 1441483 1395043 1354413 1320258 1293086 1273029 1259852 1253290 1253188 1259233 1270758 1287011 1307364
62999 1307364 1331069 1357086 1384581 1413570 1444578 1477602 1511644 1545354 1577851 1608942 1638835
62988 1638835 1667761 1695610 1721722 1745142 1765092 1781041 1792354 1798185 1797790 1790676 1776353 1754242
62976 1754242 1724074 1686167 1641185 1589908 1533515 1473863 1413044 1352608 1293387 1235962 1181047
62965 1181047 1129366 1081388 1037288 997030 960429 927200 896979 869317 843697 819706 797211
62954 797211 776321 757118 739380 722563 706049 689455 672743 656086 639774 624265 610128
62943 610128 597628 586406 575785 565383 555233 545420 535962 527058 519042 511949 505491 499640 494784
$$ packed form
63022B001923k6905l6812m4847n0677n5002n8376o0502o0781n9106n5874n1558
63011A441483m6440m0630l4155k7172k0057j3177o562j02O045J1525J6253K0353
62999A307364K3705K6017K7495K8989L1008L3024L4042L3710L2497L1091K9893
62988A638835K8926K7849K6112K3420J9950J5949J1313N831l95p114j4323k2111
62976A754242l0168l7907m4982n1277n6393n9652o0819o0436n9221n7425n4915
62965A181047n1681m7978m4100m0258l6601l3229l0221k7662k5620k3991k2495
62954G97211k0890j9203j7738j6817j6514j6594j6712j6657j6312j5509j4137
62943F10128j2500j1222j0621j0402j0150r813r458q904q016p093o458n851m856
$$ plain form
62930 494784 491014 487618 483791 479690 476376 474735 474721 475493 475980 475524 474394 473599 473800 474493 474621 473849 472713
62913 472713 471668 470589 469243 467611 465539 462739 459427 456374 453898 451305 447821 443697 439815 436514
62899 436514 433499 430745 428801 428030 428034 428058 427673 426972 426368 426327 427018 428037 428610 428227 427089 425940 425500 425922
62881 425922 426644 426923 426723 426963 428520 431060 433220 434010 433687 433173 432985 432924 432459 431093 428595 425267 421975
62864 421975 419632 418515 418153 417897 417572 417555 418253 419509 420621 421075 421141 421553 422633 424000 425188 426178 427165
62847 427165 428135 428979 429805 430774 431689 432052 431550 430343 428893 427692 427026 426773 426379 425277 423453 421533 420318
62830 420318 420212 420983 421908 422289 422011 421612 421729 422567 423967 425724 427582 429193 430504 432057 434438 437484
62814 437484 440502 443292 446392 450176 454313 458423 462682 467332 472090 476658 481511 487424 494374 501625
$$ packed form
62930D94784l770l396l827m101l314j641j4P72M87m56j130p95K01O93J28p72j136
62913D72713j045j079j346j632k072k800l312l053k476k593l484m124l882l301
62899D36514l015k754j944p71MK4l85p01o04m1O91J019N73l83j138j149m40M22
62881D25922P22K79k00K40J557K540K160P90l23n14j88o1m65j366k498l328l292
62864D21975k343j117l62k56l25j7O98J256J112M54O6M12J080J367J188R90R87
62847D27165R70Q44Q26R69R15L63n02j207j450j201o66k53l94j102j824j920j215
62830D20318j06P71R25L81k78l99J17Q38J400J757J858J611J311J553K381L046
62814D37484L018K790L100L784M137M110M259M650M758M568M853N913O950P251
$$ plain form
62800 501625 508944 517017 526437 536911 547854 559213 571258 583903 596857 610326 625112 642081
62788 642081 661888 685124 712187 742881 776559 812970 852761 897004 946334 1000713 1059834
62777 1059834 1123505 1191660 1264033 1339785 1417355 1494811 1570451 1642954 1710886 1772311 1825159
62766 1825159 1867834 1899216 1918179 1923607 1915052 1893169 1859366 1815252 1762484 1702788 1637681 1568213
62754 1568213 1495256 1420058 1344306 1269619 1197114 1127457 1061161 998757 940816 887810 839870
62743 839870 796661 757592 722122 689833 660412 633853 610594 591058 574928 561148 548741
62732 548741 537374 527074 517835 509803 503444 498988 495858 493133 490609 488945 488682 489562 491042 493106
62718 493106 496225 500669 506210 512570 519936 528941 540168 553692 569169 586379 605544 626965 650488
$$ packed form
62800E01625P319Q073R420J0474J0943J1359J2045J2645J2954J3469J4786J6969
62788F42081J9807K3236K7063L0694L3678L6411L9791M4243M9330N4379N9121
62777A059834O3671O8155P2373P5752P7570P7456P5640P2503O7932O1425N2848
62766A825159M2675L1382J8963N428q555k1883l3803m4114n2768n9696o5107o9468
62754A568213p2957p5198p5752p4687p2505o9657o6296o2404n7941n3006m7940
62743H39870m3209l9069l5470l2289k9421k6559k3259j9536j6130j3780j2407
62732E48741j1367j0300r239q032o359m456l130k725k524j664k63Q80J480K064
62718D93106L119M444N541O360P366R005J1227J3524J5477J7210J9165K1421K3523
$$ plain form
62705 650488 675778 703253 734342 770443 811699 857085 905604 957104 1011957 1070318 1131904
62694 1131904 1196252 1262894 1331217 1400183 1468282 1533742 1594841 1649990 1697523 1735555 1762277
62683 1762277 1776529 1778114 1767520 1745392 1712210 1668450 1615056 1553751 1486796 1416351 1344083
62672 1344083 1271358 1199552 1129968 1063543 1000913 942696 889373 840815 796273 755078 717188
62661 717188 682897 652235 624915 600695 579431 560795 544207 529168 515474 503093 491988
62650 491988 482116 473337 465246 457304 449331 441677 434750 428472 422467 416727 411875 408677 407371 407416 407776
62635 407776 407492 406258 404571 403250 402695 402620 402444 401824 400819 399748 398975 398682 398655 398407 397673 396736 396179 396390
62617 396390 397460 399422 402250 405608 408957 412143 415702 420313 426055 432471 439334 447010 455939 466037
$$ packed form
62705F50488K5290K7475L1089L6101M1256M5386M8519N1500N4853N8361O1586
62694A131904O4348O6642O8323O8966O8099O5460O1099N5149M7533L8032K6722
62683A762277J4252J585j0594k2128l3182m3760n3394o1305o6955p0445p2268
62672A344083p2725p1806o9584o6425o2630n8217n3323m8558m4542m1195l7890
62661G17188l4291l0662k7320k4220k1264j8636j6588j5039j3694j2381j1105
62650D91988r872q779q091p942p973p654o927o278o005n740m852l198j306M5L60
62635D07776k84j234j687j321n55p5j76o20j005j071p73k93k7k48p34r37n57K11
62617C96390J070J962K828L358L349L186L559M611N742O416O863P676Q929J0098
$$ plain form
62603 466037 476874 488334 500790 514652 530014 546902 565697 587068 611491 638940 669056
62592 669056 701468 735905 772079 809512 847448 884868 920597 953473 982458 1006583 1024827
62581 1024827 1036203 1040158 1037009 1027736 1013089 992924 966757 935125 900083 864065 828450 793512
62569 793512 759402 726512 694899 664147 634253 606180 581025 558928 539258 521626 506109
62558 506109 492563 480394 469248 459458 451514 445357 440458 436333 432751 429571 426647 423833 421034
62545 421034 418388 416395 415532 415531 415372 414329 412878 412233 413063 415003 417280 419394 421121 422303 423019 423799
62529 423799 425393 428260 432361 437403 443230 450029 458267 468413 480673 494948 511052 528972 548951
62516 548951 571357 596473 624395 655083 688466 724411 762608 802564 843706 885386 926747
$$ packed form
62603D66037J0837J1460J2456J3862J5362J6888J8795K1371K4423K7449L0116
62592F69056L2412L4437L6174L7433L7936L7420L5729L2876K8985K4125J8244
62581A024827J1376L955l149r273j4647k0165k6167l1632l5042l6018l5615l4938
62569G93512l4110l2890l1613l0752k9894k8073k5155k2097j9670j7632j5517
62558E06109j3546j2169j1146r790p944o157m899m125l582l180k924k814k799
62545D21034k646j993q63jj59j043j451o45Q30J940K277K114J727J182P16P80
62529D23799J594K867M101N042N827O799Q238J0146J2260J4275J6104J7920J9979
62516E48951K2406K5116K7922L0688L3383L5945L8197L9956M1142M1680M1361
$$ plain form
62505 926747 966685 1003988 1037448 1065928 1088631 1105417 1116616 1122343 1122256 1116238 1105056 1089989
62493 1089989 1072056 1052048 1031224 1011323 993701 978931 967474 960242 958070 960988 968542 980686
62481 980686 997802 1019858 1045984 1075100 1106577 1140046 1174712 1209082 1241259 1269406 1292088
62470 1292088 1308511 1318462 1321854 1318229 1306781 1286934 1258868 1223496 1182109 1136153 1087140 1036361
62458 1036361 984559 932192 880234 830473 784593 743030 705127 670442 639487 613040 591183
62447 591183 573343 558938 547565 538752 532108 527686 525723 525884 527113 528477 529919 532024 535216 539328
62433 539328 543766 547881 551251 553767 555374 555736 554357 551141 546568 541075 534471 526280 516592 506227
62419 506227 496078 486534 477580 469157 461276 453996 447422 441628 436510 431911 427971 425126 423539 422686
$$ packed form
62505I26747L9938L7303L3460K8480K2703J6786J1199N727q7o018j1182j5067
62493A089989j7933k0008k0824j9901j7622j4770j1457p232k172K918P554J2144
62481I80686J7116K2056K6126K9116L1477L3469L4666L4370L2177K8147K2682
62470A292088J6423R951L392l625j1448j9847k8066l5372m1387m5956m9013n0779
62458A036361n1802n2367n1958m9761m5880m1563l7903l4685l0955k6447k1857
62447E91183j7840j4405j1373q813o644m422j963J61J229J364J442K105L192M112
62433E39328M438M115L370K516J607L62j379l216m573n493o604q191r688j0365
62419E06227j0149r544q954q423p881p280o574n794n118m599l940k845j587q53
$$ plain form
62405 422686 421778 420456 418826 416904 414489 411743 409496 408608 409109 410318 411777 413724 416524 419947 423367
62390 423367 426561 429923 433781 437778 441202 443822 446158 448974 452669 457166 462114 467131 472047 477097
62376 477097 482856 489877 498421 508486 519891 532172 544658 556985 569592 583453 599277 617071
62364 617071 636525 657605 680677 706198 734407 765301 798840 835249 875095 918900 966585
62353 966585 1017394 1070310 1124276 1177883 1229127 1275940 1316907 1351262 1378221 1396761 1406199 1406811
62341 1406811 1399629 1385712 1365677 1339781 1308284 1271826 1231631 1189356 1146551 1104183 1062645
62330 1062645 1022216 983432 947148 914314 885601 861021 839829 820903 803302 786504 770233
62319 770233 754276 738451 722483 705801 687675 667869 647130 626817 607951 590734 574920
$$ packed form
62405D22686r08j322j630j922k415k746k247q88N01J209J459J947K800L423L420
62390D23367L194L362L858L997L424K620K336K816L695M497M948N017M916N050
62376D77097N759P021Q544J0065J1405J2281J2486J2327J2607J3861J5824J7794
62364F17071J9454K1080K3072K5521K8209L0894L3539L6409L9846M3805M7685
62353I66585N0809N2916N3966N3607N1244M6813M0967L4355K6959J8540R438O12
62341A406811p182j3917k0035k5896l1497l6458m0195m2275m2805m2368m1538
62330A062645m0429l8784l6284l2834k8713k4580k1192j8926j7601j6798j6271
62319G70233j5957j5825j5968j6682j8126j9806k0739k0313j8866j7217j5814
$$ plain form
62308 574920 560407 547339 535830 525813 517197 509997 504268 499998 497125 495584 495219 495603 496133 496554
62294 496554 497468 500055 505017 511796 519026 525773 532229 539289 547720 557734 569017 580885 592573
62281 592573 603606 613881 623401 632138 640240 648006 655416 661990 667481 672536 678189 684752 691580 697979
62267 697979 703997 710358 718039 727910 740315 754833 770925 789019 810555 836661 867214 901550
62255 901550 939689 982262 1029392 1080192 1133345 1187623 1241641 1293471 1340835 1381695 1414700
62244 1414700 1439268 1455384 1463248 1463093 1455228 1440034 1417735 1388336 1352034 1309631 1262294 1211027
62232 1211027 1156641 1100314 1043931 989622 938887 892104 848876 808979 772972 741711 715209
62221 715209 692376 672048 653967 638370 624975 612928 601708 591553 582910 575877 570235 565617
$$ packed form
62308E74920j4513j3068j1509j0017q616p200n729m270k873j541l65L84N30M21
62294D96554R14K587M962O779P230O747O456P060Q431J0014J1283J1868J1688
62281E92573J1033J0275R520Q737Q102P766P410O574N491N055N653O563O828O399
62267F97979O018O361P681R871J2405J4518J6092J8094K1536K6106L0553L4336
62255I01550L8139M2573M7130N0800N3153N4278N4018N1830M7364M0860L3005
62244A414700K4568J6116P864j55p865j5194k2299k9399l6302m2403m7337n1267
62232A211027n4386n6327n6383n4309n0735m6783m3228l9897l6007l1261k6502
62221G15209k2833k0328j8081j5597j3395j2047j1220j0155q643p033n642m618
$$ plain form
62209 565617 561568 557791 554476 552034 550449 549236 548113 547255 546801 546666 547124 548952 552446 556671 560328
62194 560328 563258 566550 571253 577592 585405 594656 605094 615908 626351 636628 647655 659845 672527
62181 672527 684855 696976 709746 723345 736725 748762 759528 769978 780657 791341 801962
62170 801962 813246 826184 841318 858874 879244 902947 930271 961223 995665 1033127 1072527
62159 1072527 1112347 1151057 1187176 1219046 1244985 1263904 1275652 1280638 1279226 1271693 1258759 1241714
62147 1241714 1221614 1198366 1171055 1139380 1104456 1067996 1031176 994739 959695 927063 897063
62136 897063 869440 844690 824088 808146 795789 785494 776631 769191 762894 757291 752347 748209 744624
62123 744624 741165 737879 735218 733533 733091 734296 737299 741474 745719 749098 750868 750416 747871 744490 741668
$$ packed form
62209E65617m049l777l315k442j585j213j123q58m54j35M58J828L494M225L657
62194E60328K930L292M703O339P813R251J0438J0814J0443J0277J1027J2190J2682
62181F72527J2328J2121J2770J3599J3380J2037J0766J0450J0679J0684J0621
62170H01962J1284J2938J5134J7556K0370K3703K7324L0952L4442L7462L9400
62159A072527L9820L8710L6119L1870K5939J8919J1748M986j412p533j2934j7045
62147A241714k0100k3248k7311l1675l4924l6460l6820l6437l5044l2632l0000
62136H97063k7623k4750k0602j5942j2357j0295q863p440o297n603m944m138l585
62123G44624l459l286k661j685m42J205L003M175M245L379J770m52k545l381k822
$$ plain form
62108 741668 739698 738068 736553 735029 732459 727340 719467 710310 701319 692683 684161 676296 670211 666640
62094 666640 665565 666354 668050 670080 672942 677601 684004 690902 697465 704202 711844 720189 728792 737959
62080 737959 748115 758839 769573 780933 794217 809745 826643 844208 862553 881927 902262
62069 902262 923548 945794 968439 990536 1011760 1032648 1053716 1075090 1097145 1120641 1145649
62058 1145649 1170867 1194425 1214914 1231369 1242941 1249244 1250683 1247854 1240862 1229538 1213904 1193911
62046 1193911 1169141 1139463 1105740 1069240 1030580 989932 948144 906729 866612 827731 790159
62035 790159 754906 723066 694709 669216 646294 625976 607854 591110 575457 561486 549812
62024 549812 540239 531948 524204 516581 508841 500979 493397 486641 480824 475385 469539 462972 456120 449795
$$ packed form
62108G41668j970j630j515j524k570n119p873r157q991q636q522p865o085l571
62094F66640j075P89J696K030K862M659O403O898O563O737P642Q345Q603R167
62080G37959J0156J0724J0734J1360J3284J5528J6898J7565J8345J9374K0335
62069I02262K1286K2246K2645K2097K1224K0888K1068K1374K2055K3496K5008
62058A145649K5218K3558K0489J6455J1572O303J439k829o992j1324j5634j9993
62046A193911k4770k9678l3723l6500l8660m0648m1788m1415m0117l8881l7572
62035G90159l5253l1840k8357k5493k2922k0318j8122j6744j5653j3971j1674
62024E49812r573q291p744p623p740p862p582o756n817n439n846o567o852o325
$$ plain form
62010 449795 444527 440240 436558 433349 430901 429639 429851 431629 434772 438656 442498 446035 449811 454606
61996 454606 460683 467689 474915 481303 485557 487004 486456 485636 485433 485076 483238 479511 474497 468822 462687
61981 462687 456209 449596 442839 435682 428122 420724 414147 408476 403172 397637 391686 385588 379866 375098
61967 375098 371686 369516 367914 366217 364423 363035 362130 360991 359031 356749 355226 354832 355053 355626 357041
61952 357041 359648 362951 366284 369676 373501 377819 382735 388980 397226 406999 417092 427003 437080 447257
61938 447257 456776 465597 475072 486452 499310 512214 524516 536642 548908 560887 571997 582018
61926 582018 590824 598154 603824 607849 610208 610793 609629 606850 602467 596565 589770 583071 577019 571512
61912 571512 566570 562883 561224 561697 563966 567976 573898 581503 590114 599294 609104 619441 629491 638148
$$ packed form
62010D49795n268m287l682l209k448j262K12J778L143L884L842L537L776M795
61996D54606O077P006P226O388M254J447n48q20k03l57j838l727n014n675o135
61981D62687o478o613o757p157p560p398o577n671n304n535n951o098n722m768
61967C75098l412k170j602j697j794j388r05j139j960k282j523l94K21N73J415
61952C57041K607L303L333L392L825M318M916O245Q246R773J0093R911J0077J0177
61938D47257R519Q821R475J1380J2858J2904J2302J2126J2266J1979J1110J0021
61926E82018Q806P330N670M025K359N85j164k779m383n902o795o699o052n507
61912E71512m942l687j659M73K269M010N922P605Q611R180R810J0337J0050Q657
$$ plain form
61898 638148 644841 649637 652602 653377 651526 647091 640601 632611 623457 613490 603320 593577 584527 576156
61884 576156 568545 561855 555851 549869 543504 537060 530994 525093 518613 511151 502979 494529 486094 478146
61870 478146 471463 466479 462773 459563 456598 454268 452997 452944 454237 457063 461303 466424 471991 478210 485713
61855 485713 494803 505176 516473 528952 543336 559956 578312 597646 617701 638557 659880 680862
61843 680862 700998 720366 738856 755526 769141 779072 785301 787910 787170 783943 779219 773131 765111
61830 765111 755297 745308 737217 732027 729479 729060 730747 734804 741236 749556 758965 768595 777518 784624
61816 784624 788796 789478 786957 781759 773827 762645 748157 731178 712839 693969 675082 656447 637965
61803 637965 619452 601383 584955 571040 559327 548808 538825 529349 520627 512986 506676 501393 496174
$$ packed form
61898F38148O693M796K965P75j851m435o490p990r154r967j0170r743r050q371
61884E76156p611o690o004n982o365o444o066n901o480p462q172q450q435p948
61870D78146o683m984l706l210k965k330j271n3J293K826M240N121N567O219P503
61855D85713R090J0373J1297J2479J4384J6620J8356J9334K0055K0856K1323K0982
61843F80862K0136J9368J8490J6670J3615R931O229K609p40l227m724o088q020
61830G65111r814r989q091n190k548m19J687M057O432Q320R409R630Q923P106
61816G84624M172O82k521n198p932j1182j4488j6979j8339j8870j8887j8635j8482
61803F37965j8513j8069j6428j3915j1713j0519r983r476q722p641o310n283n219
$$ plain form
61790 496174 490327 484361 479423 475814 472581 468627 463742 458540 453823 450171 447692 445938 444321 442742
61776 442742 441554 440849 440092 438652 436439 433865 431426 429442 427966 426794 425717 424857 424563 424914 425552 426138
61760 426138 426732 427574 428726 430147 431960 434398 437434 440580 443061 444282 444258 443599 442998 442738 442759 442949 443089
61743 443089 442737 441626 440152 438918 437739 435657 432192 428061 424311 421268 418800 417217 417108 418372 420012
61728 420012 421101 421560 421880 422430 423240 424223 425406 426972 429131 431821 434529 436617 437922 438928 440252
61713 440252 442085 444142 446034 447529 448554 449028 448749 447412 444847 441260 437275 433637 430758 428454 426047
61698 426047 422858 418714 414052 409448 405087 400720 396141 391519 387181 383193 379394 375788 372625 369928
61684 369928 367238 364153 360937 358163 355808 353298 350593 348644 348277 349061 349851 350145 350235 350226 349734 348674 347612
$$ packed form
61790D96174n847n966m938l609l233l954m885n202m717l652k479j754j617j579
61776D42742j188p05p57j440k213k574k439j984j476j172j077q60k94L51O38N86
61760D26138N94Q42J152J421J813K438L036L146K481J221k4o59o01k60K1J90J40
61743D43089l52j111j474j234j179k082l465m131l750l043k468j583j09J264J640
61728D20012J089M59L20N50Q10R83J183J566K159K690K708K088J305J006J324
61713D40252J833K057J892J495J025M74k79j337k565l587l985l638k879k304k407
61698D26047l189m144m662m604m361m367m579m622m338l988l799l606l163k697
61684C69928k690l085l216k774k355k510k705j949l67P84P90K94R0rm92j060j062
$$ plain form
61667 347612 347026 346786 346658 346761 347174 347622 347989 348694 350016 351398 352025 351886 351684 351904 352571 353816 356014
61650 356014 359205 362861 366391 369485 371918 373467 374245 374771 375560 376850 378790 381494 384700 387677 389757
61635 389757 390812 391153 391158 391065 390841 390150 388740 386995 385725 385126 384336 382395 379422 376413 374015 371985 369881
61618 369881 367802 366213 365272 364593 363626 362178 360584 359396 358857 358603 357874 355994 352749 348491 343923 339593
61602 339593 335417 330818 325539 320179 315692 312455 310092 308105 306236 304204 301611 298493 295606 293738
61588 293738 292783 291876 290396 288470 286521 284780 283461 282978 283464 284145 283716 281626 278819 276961 276911 278080
61572 278080 279263 279896 280389 281347 282758 284021 284608 284500 284031 283567 283339 283399 283604 283736 283780 284024 284761 285951
61554 285951 287241 288287 288959 289370 289886 291052 293222 296088 298730 300350 301005 301543 302761 304645 306500
$$ packed form
61667C47612n86k40j28J03M13M48L67P05J322J382O27j39k02K20O67J245K198
61650C56014L191L656L530L094K433J549P78N26P89J290J940K704L206K977K080
61635C89757J055L41Nr3k24o91j410j745j270n99p90j941k973l009k398k030k104
61618C69881k079j589r41o79r67j448j594j188n39k54p29j880l245m258m568m330
61602C39593m176m599n279n360m487l237k363j987j869k032k593l118k887j868
61588B93738r55r07j480j926j949j741j319m83M86O81m29k090k807j858n0J169
61572B78080J183O33M93R58J411J263N87j08m69m64k28O0K05J32M4K44P37J190
61554B85951J290J046O72M11N16J166K170K866K642J620O55N38J218J884J855
$$ plain form
61539 306500 307793 308703 309719 310840 311541 311618 311684 312418 313574 314220 313997 313622 313861 314434 314370 313263 311704 310461
61521 310461 309667 309019 308402 308003 307896 307831 307487 306686 305350 303470 301269 299220 297636 296361 295083 293910
61505 293910 293323 293536 294194 294854 295446 296043 296459 296445 296155 296027 296233 296584 296989 297680 298894 300583 302516 304463
61487 304463 306189 307511 308471 309317 310248 311304 312527 313992 315662 317408 319192 321028 322772 324314 325980
61472 325980 328333 331363 334226 335946 336108 334800 332374 329626 327688 327150 327452 327539 326958 325942 324716 323304
61456 323304 321923 320887 320066 318948 317450 316211 315870 316336 317003 317411 317532 317579 317780 318161 318472 318447 318199 318161
61438 318161 318613 319552 321067 323487 326846 330459 333411 335413 336934 338483 340026 341183 341789 342090 342409
61423 342409 342801 343203 343852 345265 347584 350165 352153 353421 354621 356193 357721 358454 358187 357387 356683 356484
$$ packed form
61539C06500J293R10J016J121P01P7O6P34J156O46k23l75K39N73o4j107j559j243
61521C10461p94o48o17l99j07o5l44q01j336j880k201k049j584j275j278j173
61505B93910n87K13O58O60N92N97M16j4k90j28K06L51M05O91J214J689J933J947
61487C04463J726J322R60Q46R31J056J223J465J670J746J784J836J744J542J666
61472C25980K353L030K863J720J62j308k426k748j938n38L02Q7n81j016j226j412
61456C23304j381j036q21j118j498j239l41M66O67M08J21M7K01L81L11k5k48l8
61438C18161M52R39J515K420L359L613K952K002J521J549J543J157O06L01L19
61423C42409L92M02O49J413K319K581J988J268J200J572J528P33k67q00p04j99
$$ plain form
61407 356484 356911 357689 358192 357991 357408 357212 357650 358043 357531 355997 354078 352472 351442 350837 350241 349169 347481
61390 347481 345689 344572 344320 344358 344195 344190 345114 347124 349534 351548 352831 353377 353328 353162 353736 355747 359199
61373 359199 363465 367703 371219 373776 375877 378421 381788 385417 388543 391051 393180 394702 395084 394488 393961
61358 393961 394312 395232 395838 395792 395560 395795 396864 398861 401699 405090 408657 412266 416108 420364 424773 428717
61342 428717 431807 434277 436632 438936 440754 441849 442610 443533 444535 445128 445110 444719 444189 443582 443047 442764 442526
61325 442526 441840 440617 439387 438600 438055 437356 436653 436582 437650 439970 443469 448000 453315 459181 465534 472337
61309 472337 479437 486808 494868 504243 515148 527151 539573 551960 564139 575976 587091 596802
61297 596802 604367 609429 612196 613118 612512 610560 607417 603048 597112 589373 580249 570642 561211 552080 543262
$$ packed form
61407C56484M27P78N03k01n83j96M38L93n12j534j919j606j030o05n96j072j688
61390C47481j792j117k52L8j63nR24K010K410K014J283N46m9j66N74K011L452
61373C59199M266M238L516K557K101K544L367L629L126K508K129J522L82n96n27
61358C93961L51R20O06m6k32K35J069J997K838L391L567L609L842M256M409L944
61342D28717L090K470K355K304J818J095P61R23J002N93j8l91n30o07n35k83k38
61325D42526o86j223j230p87n45o99p03p1J068K320L499M531N315N866O353O803
61309D72337P100P371Q060R375J0905J2003J2422J2387J2179J1837J1115R711
61297E96802P565N062K767R22o06j952l143m369n936p739r124r607r431r131q818
$$ plain form
61282 543262 534884 526830 518640 510209 502335 496083 491668 488365 485527 483277 482091 482093 483025 484654 486925
61267 486925 489816 493234 496935 500427 503216 505415 507909 511525 516155 521022 525708 530375 535032 539173
61253 539173 542448 545186 547858 550351 552201 553321 554083 554790 555456 556040 556484 556570 556050 554960 553509 551699
61237 551699 549335 546422 543242 540056 537018 534394 532540 531583 531388 531892 533176 535170 537613 540432 543888
61222 543888 548218 553353 559075 565222 571657 578285 585216 592681 600696 608956 617083 624708 631351 636626
61208 636626 640703 644228 647637 650914 654109 657639 661755 666115 670265 674232 678394 683102 688814 696254
61194 696254 705857 717210 729428 741917 754276 765706 775185 782323 787545 791362 793926 795364 795955
61181 795955 795686 794064 790772 786236 781259 776231 770960 765067 758282 750537 742153 733915 726544 719930
$$ packed form
61282E43262q378q054q190q431p874o252m415l303k838k250j186KR32J629K271
61267D86925K891L418L701L492K789K199K494L616M630M867M686M667M657M141
61253E39173L275K738K672K493J850J120P62P07O66N84M44Q6n20j090j451j810
61237E51699k364k913l180l186l038k624j854r57j95N04J284J994K443K819L456
61222E43888M330N135N722O147O435O628O931P465Q015Q260Q127P625O643N275
61208F36626M077L525L409L277L195L530M116M360M150L967M162M708N712P440
61194F96254R603J1353J2218J2489J2359J1430R479P138N222L817K564J438N91
61181G95955k69j622l292m536m977n028n271n893o785p745q384q238p371o614
$$ plain form
61167 719930 713113 705219 696301 687087 677994 668700 658765 648421 638421 629141 620148 610822 601163 591741
61153 591741 583023 575103 568147 562728 559448 558309 558650 559665 560757 561388 560890 558718 554911 550081 544841
61138 544841 539450 534127 529467 526182 524428 523684 523382 523427 524025 525306 527358 530393 534591 539834 545871
61123 545871 552791 561140 571574 584473 599826 617277 636222 656041 676366 697162 718535 740549
61111 740549 763181 786327 809728 832963 855605 877462 898531 918679 937430 954256 969068
61100 969068 982196 993731 1003076 1009378 1012260 1011864 1008345 1001780 992576 981436 968669 953991 937404
61087 937404 920025 903481 888407 873944 858907 843299 828490 815990 806183 798305 791507 785690
61075 785690 781237 778230 776339 775517 776383 779676 785512 793419 803039 814608 828715 845690 865234 886642
$$ packed form
61167G19930o817p894q918r214r093r294r935j0344j0000r280q993r326r659r422
61153E91741q718p920o956n419l280j139L41J015J092O31m98k172l807m830n240
61138E44841n391n323m660l285j754p44l02M5N98J281K052L035M198N243O037
61123E45871O920Q349J0434J2899J5353J7451J8945J9819K0325K0796K1373K2014
61111G40549K2632K3146K3401K3235K2642K1857K1069K0148J8751J6826J4812
61100I69068J3128J1535R345O302K882l96l519o565r204j1140j2767j4678j6587
61087I37404j7379j6544j5074j4463j5037j5608j4809j2500r807p878o798n817
61075G85690m453l007j891q22Q66L293N836P907R620J1569J4107J6975J9544K1408
$$ plain form
61061 886642 909387 933510 959400 987364 1017475 1049657 1083651 1118999 1155396 1192995 1232035
61050 1232035 1272189 1312598 1352471 1391198 1427960 1461939 1493116 1522232 1549516 1573959 1594269
61039 1594269 1610158 1622234 1631078 1637070 1640870 1643420 1645516 1647879 1651531 1657504 1666043 1676626 1688982
61026 1688982 1703781 1722108 1744474 1770712 1800986 1836886 1881337 1937131 2005587 2086793 2180933
61015 2180933 2288727 2410744 2547521 2701331 2877499 3083374 3326404 3613841 3953848
61006 3953848 4356127 4832138 5396250 6067010 6866499 7818378 8946590 10271992 11799752
60997 11799752 13496809 15273096 16986114 18475656 19613890 20345563 20701328 20783241 20730708
60988 20730708 20676063 20700190 20803089 20903610 20870405 20570211 19913198 18880102 17524247
$$ packed form
61061H86642K2745K4123K5890K7964L0111L2182L3994L5348L6397L7599L9040
61050A232035M0154M0409L9873L8727L6762L3979L1177K9116K7284K4443K0310
61039A594269J5889J2076Q844N992L800K550K096K363L652N973Q539J0583J2356
61026A688982J4799J8327K2366K6238L0274L5900M4451N5794O8456Q1206R4140
61015B180933J07794J22017J36777J53810J76168K05875K43030K87437L40007
61006C953848M02279M76011N64112O70760P99489R51879J128212J325402J527760
60997A1799752J697057J776287J713018J489542J138234P31673L55765Q1913n2533
60988B0730708n4645K4127J02899J00521l3205l00194o57013j033096j355855
$$ plain form
60979 17524247 15949442 14274294 12600906 11001794 9523667 8195664 7033280 6039296
60971 6039296 5205896 4517995 3955967 3498180 3124146 2816795 2562315 2348982 2167125
60962 2167125 2009790 1872357 1751310 1643653 1547131 1460279 1382145 1312249 1250596 1197210
60952 1197210 1151525 1112247 1077573 1045499 1014458 984068 954942 927466 901174 875649 851470
60941 851470 829528 809783 791422 774062 757972 743117 728823 714670 701115 688814 677745
60930 677745 667399 657500 648086 639060 630200 621662 613960 607208 600755 594073 587779 583112 580284 577980
60916 577980 574828 570853 566913 563207 559176 554700 550521 547351 545212 543765 542653 541333 539335 536964
60902 536964 535190 534499 534388 534194 533762 532900 530946 527531 523296 519182 515345 511306 506841 502168 497481
$$ packed form
60979A7524247j574805j675148j673388j599112j478127j328003j162384r93984
60971F039296q33400o87901n62028m57787l74034l07351k54480k13333j81857
60962B167125j57335j37433j21047j07657r6522q6852p8134o9896o1653n3386
60952A197210m5685l9278l4674l2074l1041l0390k9126k7476k6292k5525k4179
60941H51470k1942j9745j8361j7360j6090j4855j4294j4153j3555j2301j1069
60930F77745j0346r899r414r026q860q538p702o752o453o682o294m667k828k304
60916E77980l152l975l940l706m031m476m179l170k139j447j112j320j998k371
60902E36964j774o91j11j94m32q62j954l415m235m114l837m039m465m673m687
$$ plain form
60887 497481 492811 488093 482903 476426 468268 459063 449865 441214 433297 426570 421411 417241 412863 407864
60873 407864 403074 399484 397152 395417 393794 392382 391568 391584 392386 393927 396383 399919 404266 408878 413552
60858 413552 418433 423360 427786 431604 435413 439515 443304 446194 448640 451547 455156 459209 463686 468455
60844 468455 472571 475008 475964 476469 476773 476088 473969 470904 467311 462924 457629 452135 447333 443492 440373
60829 440373 437554 434343 430060 424888 419981 416305 413636 410958 407405 402610 396646 390071 383729 378134
60815 378134 373216 368795 364907 361471 358041 354223 350135 346308 343313 341444 340324 338848 336128 332653
60801 332653 329867 328368 327201 325310 323003 321395 320964 321281 321810 322270 322501 322656 323424 325452 328549 331841
60785 331841 334680 337023 339043 340856 342669 344805 347448 350515 353771 356926 359683 361880 363466 364306
$$ packed form
60887D97481m670m718n190o477q158r205r198q651p917o727n159m170m378m999
60873D07864m790l590k332j735j623j412q14J6Q02J541K456L536M347M612M674
60858D13552M881M927M426L818L809M102L789K890K446K907L609M053M477M769
60844D68455M116K437R56N05L04o85k119l065l593m387n295n494m802l841l119
60829D40373k819l211m283n172m907l676k669k678l553m795n964o575o342n595
60815C78134m918m421l888l436l430l818m088l827k995j869j120j476k720l475
60801C32653k786j499j167j891k307j608m31L17N29M60K31J55P68K028L097L292
60785C31841K839K343K020J813J813K136K643L067L256L155K757K197J586Q40
$$ plain form
60771 364306 364223 363398 362392 361559 360755 359951 359738 360648 362181 363042 362381 360407 357844 355235 352902 351149 350139
60754 350139 349642 349022 347600 345183 342359 340065 338752 338092 337629 337386 337624 338363 339495 341029 342690 343511
60738 343511 342519 339882 336834 334308 332079 329371 325883 321992 318337 315491 313740 312870 312296 311586 310794
60723 310794 310184 309876 309892 310333 311272 312566 313905 314967 315457 315246 314704 314667 315817 318132 321114 324406 327884
60706 327884 331289 334291 337034 340166 344007 347942 350997 352871 354033 354879 355273 355060 354585 354409 354680 355033
60690 355033 354986 354216 352612 350387 348081 346138 344492 342803 341100 339929 339790 340604 341801 342781 343286 343494
60674 343494 343841 344649 345927 347532 349321 350983 351987 352068 351625 351206 350723 349656 348002 346383 345134 343881
60658 343881 342261 340454 338692 336862 335100 334216 334846 336494 338060 339145 340214 341668 343424 345367 347528
$$ packed form
60771C64306q3q25j006q33q04q04k13R10J533Q61o61j974k563k609k333j753j010
60754C50139m97o20j422k417k824k294j313o60m63k43K38P39J132J534J661Q21
60738C43511r92k637l048k526k229k708l488l891l655k846j751q70n74p10p92
60723C10794o10l08J6M41R39J294J339J062M90k11n42l7J150K315K982L292L478
60706C27884L405L002K743L132L841L935L055J874J162Q46L94k13m75j76K71L53
60690C55033m7p70j604k225k306j943j646j689j703j171j39Q14J197R80N05K08
60674C43494L47Q08J278J605J789J662J004Q1m43m19m83j067j654j619j249j253
60658C43881j620j807j762j830j762q84O30J648J566J085J069J454J756J943K161
$$ plain form
60643 347528 349707 351524 352917 354021 354419 353259 350469 347263 344905 343407 342032 340679 339985 340126 340315
60628 340315 339774 338636 337524 336685 335999 335578 335735 336321 336632 336197 335346 334751 334687 335020 335645 336530 337428 338022
60610 338022 338430 339178 340518 342044 343185 343823 344194 344326 343921 342798 341307 340221 340161 341074 342308 343311
60594 343311 344154 345174 346274 347023 347476 348377 350200 352367 353792 354009 353384 352440 351436 350588 350230 350565 351472
60577 351472 352687 354052 355540 357144 358872 360800 363137 366194 370198 375142 380955 387796 395883 404930
60563 404930 414057 422483 430071 436970 442975 447532 450155 450535 448496 444338 439088 433913 429227 424825
60549 424825 420866 418206 417559 418790 421324 424884 429458 434774 440313 445841 451675 458345 466226 475523
60535 475523 486362 498633 511756 524846 537259 548857 559584 568851 575667 579403 580223 578661 575067
$$ packed form
60643C47528K179J817J393J104L98j160k790l206k358j498j375j353o94J41J89
60628C40315n41j138j112q39o86m21J57N86L11m35q51n95o4L33O25Q85Q98N94
60610C38022M08P48J340J526J141O38L71J32m05j123j491j086o0R13J234J003
60594C43311Q43J020J100P49M53R01J823K167J425K17o25r44j004q48l58L35R07
60577C51472J215J365J488J604J728J928K337L057M004M944N813O841Q087R047
60563D04930R127Q426P588O899O005M557K623L80k039m158n250n175m686m402
60549D24825l959k660o47J231K534L560M574N316N539N528N834O670P881R297
60535D75523J0839J2271J3123J3090J2413J1598J0727R267O816L736Q20j562l594
$$ plain form
60522 575067 569688 563000 555627 548034 540539 533538 527339 521798 516498 511441 507370 505211 505264 506946 509303
60507 509303 511746 514458 518111 523231 529911 538175 548381 561046 576362 594129 614183 636703 662021
60494 662021 690167 720599 752365 784599 816773 848221 877496 902702 922739 937821 948486
60483 948486 954449 954879 949360 937942 920534 897101 868531 836558 802606 767290 731212 695560
60471 695560 661456 629224 598841 570765 545784 524203 505593 489310 474932 462258 451224
60460 451224 441854 434083 427603 422003 417010 412526 408531 405051 402090 399455 396780 393896 391088 388812
60446 388812 387190 385853 384153 381517 377856 373911 370955 369822 370160 370835 371022 370707 370229 369738 369238 368854
60430 368854 368751 368849 368808 368390 367710 367131 366929 367094 367427 367798 368251 368867 369514 369881 369780 369413 369235 369629 370755
$$ packed form
60522E75067n379o688p373p593p495p001o199n541n300n057m071k159N3J682K357
60507E09303K443K712L653N120O680Q264J0206J2665J5316J7767K0054K2520K5318
60494F62021K8146L0432L1766L2234L2174L1448K9275K5206K0037J5082J0665
60483I48486N963M30n519j1418j7408k3433k8570l1973l3952l5316l6078l5652
60471F95560l4104l2232l0383k8076k4981k1581j8610j6283j4378j2674j1034
60460D51224r370p771o480n600m993m484l995l480k961k635k675k884k808k276
60446C88812j622j337j700k636l661l945k956j133L38O75J87l15m78m91n00l84
60430C68854j03R8m1m18o80n79k02J65L33L71M53O16O47L67j01l67j78L94J126
$$ plain form
60411 370755 372629 375102 377779 380255 382577 385184 388182 390992 393085 394794 396844 399234 401234 402534
60397 402534 403725 405429 407621 410157 413301 417171 421171 424570 427335 429830 432125 434200 436464 439281
60383 439281 442192 444433 446104 448013 450428 452909 455402 458507 462310 465856 468363 470376 473087 476952
60369 476952 481455 485875 489803 493098 495780 497919 499494 500569 501586 503113 505238 507698 510678 514850
60355 514850 520361 526514 532880 540097 548901 558870 568803 578009 586555 594399 600981 605641 607974 607814
60341 607814 605258 600691 594496 586928 578576 570571 563843 558295 553164 548046 543153 538801 535119 532100
60327 532100 529430 526347 522225 517288 512353 507922 503908 500131 496600 493389 490697 488975 488604 489534 491693
60312 491693 495579 501875 510559 520903 532287 544448 556989 569316 581047 591901 601217 608351
$$ packed form
60411C70755J874K473K677K476K322K607K998K810K093J709K050K390K000J300
60397D02534J191J704K192K536L144L870M000L399K765K495K295K075K264K817
60383D39281K911K241J671J909K415K481K493L105L803L546K507K013K711L865
60369D76952M503M420L928L295K682K139J575J075J017J527K125K460K980M172
60355E14850N511O153O366P217Q804R969R933R206Q546P844O582M660K333j60
60341F07814k556m567o195p568q352q005o728n548n131n118m893m352l682l019
60327E32100k670l083m122m937m935m431m014l777l531l211k692j722l71R30K159
60312D91693L886O296Q684J0344J1384J2161J2541J2327J1731J0854R316P134
$$ plain form
60300 608351 613557 617631 620406 620474 616840 610155 601753 592086 580742 567592 553246 538630 524614
60287 524614 511914 500921 491686 484287 478912 475401 473131 471715 471341 471955 472535 471891 469950 467604 465460
60272 465460 463423 461422 459750 458472 457101 455228 453028 450876 448791 446588 444356 442429 440910 439446
60258 439446 437491 434739 431340 427704 424138 420802 418118 416939 417925 420697 423941 426477 428067 429202
60244 429202 430408 431940 433855 436074 438355 440372 441839 442538 442422 441788 441210 441132 441551 442220 443052 444081
60228 444081 445125 445820 446163 446768 448251 450440 452511 454022 455488 457685 460599 463492 465993 468686 472405
60213 472405 477254 482641 488132 493885 500272 507348 514858 522555 530339 538177 545993 553660 561066 568183
60199 568183 575086 581846 588386 594518 600160 605517 610949 616545 621790 625785 627959 628565 628317 627506 625695
$$ packed form
60300F08351N206M074K775O8l634o685q402r667j1344j3150j4346j4616j4016
60287E24614j2700j0993r235p399n375l511k270j416l74O14N80o44j941k346k144
60272D65460k037k001j672j278j371j873k200k152k085k203k232j927j519j464
60258D39446j955k752l399l636l566l336k684j179R86K772L244K536J590J135
60244D29202J206J532J915K219K281K017J467O99j16o34n78p8M19O69Q32J029
60228D44081J044O95L43O05J483K189K071J511J466K197K914K893K501K693L719
60213D72405M849N387N491N753O387P076P510P697P784P838P816P667P406P117
60199E68183O903O760O540O132N642N357N432N596N245L995K174O06k48q11j811
$$ plain form
60184 625695 622368 617699 612407 606969 601289 595159 588756 582462 576298 569854 562861 555684 549067 543425
60170 543425 538697 534913 532481 531487 530953 529453 526665 523776 522042 521332 520533 518965 516883 514859 513393
60155 513393 513071 514337 516862 519590 521609 522621 522594 521655 520583 520648 522359 524799 526751 528125 529694 531829
60139 531829 534287 537087 540708 545379 550830 556914 563791 571263 578575 585215 591404 597414 602939 607578
60125 607578 611485 614995 617967 620138 621844 623719 625724 627166 627765 628113 628866 629988 631134 632397 634305
60110 634305 637176 640678 643949 646058 646562 645812 644637 643591 642545 641005 638678 635655 632219 628688 625367
60095 625367 622436 619776 616967 613602 609808 606433 604390 603609 602830 600815 597643 594466 592125 590510 589281
60080 589281 588552 588551 589088 589845 590883 592346 593831 594511 593917 592237 589795 586544 582192 576642 570180 563294
$$ packed form
60184F25695l327m669n292n438n680o130o403o294o164o444o993p177o617n642
60170E43425m728l784k432r94n34j500k788k889j734p10p99j568k082k024j466
60155E13393l22J266K525K728K019J012k7r39j072O5J711K440J952J374J569K135
60139E31829K458K800L621M671N451O084O877P472P312O640O189O010N525M639
60125F07578L907L510K972K171J706J875K005J442N99L48P53J122J146J263J908
60110F34305K871L502L271K109N04p50j175j046j046j540k327l023l436l531l321
60095F25367k931k660k809l365l794l375k043p81p79k015l172l177k341j615j229
60080E89281p29jN37P57J038J463J485O80n94j680k442l251m352n550o462o886
$$ plain form
60064 563294 556333 549331 542170 534914 527843 521166 514892 509046 503811 499312 495466 492142 489266 486653
60050 486653 484165 482274 482051 484046 487391 490591 493166 496025 500130 505262 510295 514402 517792 521357
60036 521357 525695 530421 534572 537783 540756 544236 547826 550356 551236 550803 549444 547161 544130 540846 537281
60021 537281 532570 526012 517894 508881 499214 489155 479629 471515 464471 457361 449891 443009 437549 433276
60007 433276 429596 426496 424196 422326 420125 417410 414781 412837 411560 410623 409959 409799 410319 411473 413128
59992 413128 415157 417359 419491 421523 423699 426227 428986 431765 434699 438210 442431 446929 451050 454374
59978 454374 456763 458276 459168 459744 460036 459774 458841 457435 455625 453110 449814 446468 444091 442972 442622 442668
59962 442668 443325 444929 447456 450619 454086 457526 460787 464132 467900 471758 474702 476016 475868 474740 472758
$$ packed form
60064E63294o961p002p161p256p071o677o274n846n235m499l846l324k876k613
60050D86653k488j891k23J995L345L200K575K859M105N132N033M107L390L565
60036E21357M338M726M151L211K973L480L590K530Q80m33j359k283l031l284l565
60021E37281m711o558q118r013r667j0059r526q114p044p110p470o882n460m273
60007D33276l680l100k300j870k201k715k629j944j277r37o64j60N20J154J655
59992D13128K029K202K132K032K176K528K759K779K934L511M221M498M121L324
59978D54374K389J513Q92N76K92k62r33j406j810k515l296l346k377j119l50M6
59962D42668O57J604K527L163L467L440L261L345L768L858K944J314j48j128j982
$$ plain form
59947 472758 470009 467171 465211 464493 464508 464385 463362 460955 457286 453281 450084 448060 446640 445236 443947
59932 443947 443167 442923 443000 443551 445110 447934 451600 455416 459072 462730 466558 470385 473864 476821 479288
59917 479288 481222 482397 482684 482342 481889 481692 481793 482145 482894 484379 486857 490236 494075 497906 501583 505345
59901 505345 509497 514003 518309 521576 523224 523474 523261 523423 523922 524107 523701 523200 523244 524023 525602 528368 532627
59884 532627 537945 543409 548509 553380 558244 563140 568227 573815 579882 585989 591849 597554 603032 607748
59870 607748 611309 613993 616248 617927 618486 617808 616428 614919 613448 611976 610600 609590 609173 609300 609544
59855 609544 609395 608788 608254 608345 609083 610205 611801 614382 618213 622765 626831 629133 628956 626418 622204 616983
59839 616983 611271 605790 601564 599210 598279 597555 595902 592726 587996 582347 576941 572688 569534 566851 564374
$$ packed form
59947D72758k749k838j960p18J5j23j023k407l669m005l197k024j420j404j289
59932D43947p80k44P7N51J559K824L666L816L656L658L828L827L479K957K467
59917D79288J934J175K87l42m53j97J01L52P49J485K478L379L839L831L677L762
59901E05345M152M506M306L267J648K50k13J62M99J85m06n01M4P79J579K766M259
59884E32627N318N464N100M871M864M896N087N588O067O107N860N705N478M716
59870F07748L561K684K255J679N59o78j380j509j471j472j376j010m17J27K44
59855F09544j49o07n34R1P38J122J596K581L831M552M066K302j77k538m214n221
59839F16983n712n481m226k354r31p24j653l176m730n649n406m253l154k683k477
$$ plain form
59824 564374 562351 560914 559873 559122 558663 558120 556744 554098 550358 545902 541109 536619 533166 530840 528941
59809 528941 526826 524536 522411 520643 519434 519021 519108 518734 517186 514727 512013 509197 506083 502790 499710
59794 499710 497000 494573 492386 490305 487971 485332 483054 481817 481299 480467 478834 476883 475249 473978 472712
59779 472712 471176 469390 467746 466871 467033 467701 468107 468281 469135 471414 474943 478985 482937 486608 490136 493845
59763 493845 497981 502487 507177 512040 517092 522094 526820 531596 537081 543423 550110 556799 563823 571620
59749 571620 580085 588826 597799 607252 617115 626758 635447 642982 649818 656506 662960 668443 672467 675494
59735 675494 678338 680992 682524 682259 680612 678550 676565 674466 671983 669237 666604 664299 662218 660212
59721 660212 658343 656607 654488 651303 647230 643437 640675 638270 635181 631612 628631 626472 624445 622550
$$ packed form
59824E64374k023j437j041p51m59n43j376k646l740m456m793m490l453k326j899
59809E28941k115k290k125j768j209m13Q7l74j548k459k714k816l114l293l080
59794D99710k710k427k187k081k334k639k278j237n18q32j633j951j634j271j266
59779D72712j536j786j644q75J62O68M06J74Q54K279L529M042L952L671L528L709
59763D93845M136M506M690M863N052N002M726M776N485O342O687O689P024P797
59749E71620Q465Q741Q973R453R863R643Q689P535O836O688O454N483M024L027
59735F75494K844K654J532k65j647k062j985k099k483k746k633k305k081k006
59721F60212j869j736k119l185m073l793k762k405l089l569k981k159k027j895
$$ plain form
59707 622550 621861 622733 623756 623319 621461 619352 617599 616013 614608 613752 613369 612862 611976 611187 611044 611558 612325
59690 612325 612960 613337 613466 613129 611649 608460 604107 600201 597929 596937 596048 594664 592906 590779 587936 584213
59674 584213 579769 574729 569174 563449 557958 552702 547449 542311 537690 533733 530293 527331 524890 522795
59660 522795 520906 519542 519070 519205 519411 519895 521345 523635 525689 526950 528139 530156 532987 536171 539555
59645 539555 542867 545171 545687 544872 543839 542863 541227 538534 535294 532032 528494 524176 519208 514269 509865
59630 509865 506094 502994 500696 499129 497828 496282 494422 492590 490973 489228 486803 483509 479648 475628
59616 475628 471770 468437 465982 464326 462865 461045 458936 457042 455765 455352 456153 458342 461331 463940 465484
59601 465484 466388 467440 468673 469433 469419 469133 469181 469601 470135 470786 471705 472731 473464 473769 473804 473659 473353 473201 473633
$$ packed form
59707F22550o89Q72J023m37j858k109j753j586j405q56l83n07q86p89j43N14P67
59690F12325O35L77J29l37j480l189m353l906k272r92q89j384j758k127k843l723
59674E84213m444n040n555n725n491n256n253n138m621l957l440k962k441k095
59660E22795j889j364m72J35K06M84J450K290K054J261J189K017K831L184L384
59645E39555L312K304N16q15j033r76j636k693l240l262l538m318m968m939m404
59630E09865l771l100k298j567j301j546j860j832j617j745k425l294l861m020
59616D75628l858l333k455j656j461j820k109j894j277m13Q01K189K989K609J544
59601D65484R04J052J233P60j4k86M8M20N34O51R19J026P33L05L5j45l06j52M32
$$ plain form
59582 473633 474491 474973 474574 473709 473116 472969 472942 472757 472188 470833 468488 465689 463308 461618 460242 459020 458303
59565 458303 458209 458205 457777 457112 456717 456654 456580 456344 456167 456295 456799 457707 459013 460492 461728 462483 462989 463824 465477
59546 465477 467975 470897 473793 476687 480121 484670 490465 497331 505402 515445 528314 543954 560888
59533 560888 576758 589401 597540 600835 599713 595237 588770 581467 574154 567588 562413 558642 555677 553254
59519 553254 552058 552791 554819 556400 556322 554758 552470 549800 546701 543150 539032 534011 527971 521409 514984
59504 514984 508856 502848 497107 492103 487935 484054 479870 475387 471054 467143 463563 460269 457607 456044
59490 456044 455667 456136 457101 458361 459572 460225 460270 460506 461889 464495 467549 470366 472818 474973 476935 479219
59474 479219 482708 487743 493574 499042 503599 507420 510774 513655 515902 517390 518157 518502 518865 519543 520690
$$ packed form
59582D73633Q58M82l99q65n93j47k7j85n69j355k345k799k381j690j376j222p17
59565D58303r4mm28o65l95o3p4k36j77J28N04R08J306J479J236P55N06Q35J653
59546D65477K498K922K896K894L434M549N795O866Q071J0043J2869J5640J6934
59533E60888J5870J2643Q139L295j122m476o467p303p313o566n175l771k965k423
59519E53254j196P33K028J581p8j564k288k670l099l551m118n021o040o562o425
59504E14984o128o008n741n004m168l881m184m483m333l911l580l294k662j563
59490D56044l77M69R65J260J211O53M5K36J383K606L054K817K452K155J962K284
59474D79219L489N035N831N468M557L821L354K881K247J488P67L45L63O78J147
$$ plain form
59459 520690 522589 525547 529372 533372 537137 540938 545062 549249 553260 557607 563051 569554 576286 582556
59445 582556 588109 592672 595879 597714 598335 597393 594283 589346 584110 579816 576206 572262 567714 563184 559181
59430 559181 555717 552838 550828 549747 549362 549800 551809 555977 562015 569165 577147 586335 597151 609677
59416 609677 623885 639916 658041 678534 701622 727269 754797 782717 808892 830768 845743
59405 845743 852097 850089 842048 831099 819822 810082 803514 801336 803589 808901 815046 819520 819923 814650
59391 814650 803719 788675 771415 753206 734791 716922 700437 686021 674042 664446 656713 650249
59379 650249 644978 641194 638679 636477 633869 631145 628949 627255 625582 623904 622604 621598 620270 618446
59365 618446 616840 616288 616946 618454 620459 622708 624987 627318 630014 633370 637464 642430 648668 656581 666263
$$ packed form
59459E20690J899K958L825M000L765L801M124M187M011M347N444O503O732O270
59445E82556N553M563L207J835O21r42l110m937n236m294l610l944m548m530m003
59430E59181l464k879k010j081l85M38K009M168O038P150P982R188J0816J2526
59416F09677J4208J6031J8125K0493K3088K5647K7528K7920K6175K1876J4975
59405H45743O354k008q041j0949j1277r740o568k178K253N312O145M474M03n273
59391H14650j0931j5044j7260j8209j8415j7869j6485j4416j1979r596p733o464
59379F50249n271l784k515k202k608k724k196j694j673j678j300j006j328j824
59365F18446j606n52O58J508K005K249K279K331K696L356M094M966O238P913R682
$$ plain form
59350 666263 677605 690404 704201 718236 731938 745314 758697 772275 786052 799977 813740
59339 813740 826607 837904 847614 856080 863071 867588 868710 866350 861058 853445 843997 833088 820811
59326 820811 807010 791807 775944 760238 744814 729303 713813 699150 685920 673854 662386
59315 662386 651561 641878 633445 625867 619030 613441 609502 606810 604627 602875 602267 603474 606574 611446
59301 611446 618309 627407 638168 648973 657944 663814 666024 664310 658591 649301 637489 624381 610899
59288 610899 597649 585216 574320 565754 560157 557624 557402 558195 559028 559796 560926 562807 565772 570336
59274 570336 576877 585093 594195 603787 614235 626078 639313 653313 667194 680145 691698 701903
59262 701903 711131 719611 727194 733466 737846 739734 739011 736452 733198 729642 725272 719770 713808 708442
$$ packed form
59350F66263J1342J2799J3797J4035J3702J3376J3383J3578J3777J3925J3763
59339H13740J2867J1297R710Q466O991M517J122k360n292p613r448j0909j2277
59326H20811j3801j5203j5863j5706j5424j5511j5490j4663j3230j2066j1468
59315F62386j0825r683q433p578o837n589l939k692k183j752o08J207L100M872
59301F11446O863R098J0761J0805Q971N870K210j714n719r290j1812j3108j3482
59288F10899j3250j2433j0896q566n597k533k22P93Q33P68J130J881K965M564
59274E70336O541Q216R102R592J0448J1843J3235J4000J3881J2951J1553J0205
59262G01903R228Q480P583O272M380J888p23k559l254l556m370n502n962n366
$$ plain form
59248 708442 704079 700470 697404 694939 693161 692176 692329 694024 697250 701440 705726 709221 711367 712374 713141
59233 713141 714306 715415 715400 713816 711220 708299 705024 700815 695250 688390 680561 671991 662686 652624
59219 652624 642068 631585 621695 612632 604462 597229 590809 584847 579158 574061 570044 567201 565215 563767
59205 563767 562657 561662 560608 559581 558781 558224 557807 557619 557939 558982 560858 563634 567132 570919 574781 579026
59189 579026 583844 588590 592339 595155 598180 602313 607267 612093 616158 619402 622075 624490 626700 628259
59175 628259 628652 628117 627581 627558 627530 626712 625088 623346 622178 621969 622846 624519 626266 627493 628260 628962 629675
59158 629675 630105 630051 629471 628167 625780 622167 617554 612214 606144 599158 591297 583227 576071 570506 565921
59143 565921 560864 554571 547767 541704 536816 532708 529094 526087 523673 521502 519337 517274 515475 514095
$$ packed form
59248G08442m363l609l066k465j778r85J53J695L226M190M286L495K146J007P67
59233G13141J165J109j5j584k596k921l275m209n565o860p829q570r305j0062
59219F52624j0556j0483r890r063q170p233o420n962n689n097m017k843j986j448
59205E63767j110r95j054j027q00n57m17j88L20J043J876K776L498L787L862M245
59189E79026M818M746L749K816L025M133M954M826M065L244K673K415K210J559
59175F28259L93n35n36k3k8q18j624j742j168k09Q77J673J747J227P67P02P13
59158F29675M30n4n80j304k387l613m613n340o070o986p861q070p156n565m585
59143E65921n057o293o804o063m888m108l614l007k414k171k165k063j799j380
$$ plain form
59129 514095 513478 513954 515247 516502 517181 517666 518819 521201 524919 529886 535889 542504 549242 555859 562493
59114 562493 569542 577371 585909 594539 602662 610388 618302 626475 634212 641038 647444 654077 660546 665719
59100 665719 669176 671689 674129 676430 677867 677883 676394 673702 670519 667706 665552 663420 660537 656997 653614
59085 653614 650926 648821 647080 645698 644476 642803 640187 636718 632697 627999 622205 615264 607755 600455
59071 600455 593851 588002 582696 577698 572962 568575 564417 560031 555068 549836 545210 541907 539956 538811
59057 538811 537836 536668 535274 533798 532325 530791 529127 527407 525793 524403 523318 522640 522394 522428 522509 522456
59041 522456 522084 521191 519843 518566 517963 518156 518841 519885 521504 523814 526532 529387 532598 536642 541715
59026 541715 547595 554014 560942 568610 577446 587996 600575 614847 629892 644829 659316 673300
$$ packed form
59129E14095o17M76J293J255O79M85J153K382L718M967O003O615O738O617O634
59114E62493P049P829Q538Q630Q123P726P914Q173P737O826O406O633O469N173
59100F65719L457K513K440K301J437J6j489k692l183k813k154k132k883l540l383
59085F53614k688k105j741j382j222j673k616l469m021m698n794o941p509p300
59071F00455o604n849n306m998m736m387m158m386m963n232m626l303j951j145
59057E38811r75j168j394j476j473j534j664j720j614j390j085o78k46L4Q1n3
59041E22456l72q93j348j277o03J93O85J044J619K310K718K855L211M044N073
59026E41715N880O419O928P668Q836J0550J2579J4272J5045J4937J4487J3984
$$ plain form
59014 673300 686345 697477 705799 711076 713518 713180 709977 704299 697206 689783 682574 675874 670291 666520
59000 666520 664650 664129 664468 665600 667454 669585 671546 673378 675450 677872 680275 682108 682984 682845 681987
58985 681987 680916 679935 678775 676737 673296 668639 663692 659675 657539 657576 659402 662362 666142 671060 677683
58970 677683 686150 695984 706619 717909 729907 742330 754629 766617 778619 790787 802557 813033
58958 813033 821756 828859 834603 838969 841582 841786 838902 832683 823453 811707 797798 782262 766176
58945 766176 750684 736186 722357 708940 696165 684368 673620 663815 654817 646534 639241 633848
58933 633848 631246 631119 631861 632071 631840 632144 633354 634864 636126 637345 638889 640399 640907 639850 637724 635639
58917 635639 634250 633199 631604 629026 625903 623048 620882 619257 618019 617548 618538 621192 624878 628870 633333
$$ packed form
59014F73300J3045J1132Q322N277K442l38l203n678p093p423p209o700n583l771
59000F66520j870n21L39J132J854K131J961J832K072K422K403J833Q76j39q58
58985F81987j071r81j160k038l441m657m947m017k136L7J826K960L780M918O623
58970F77683Q467R834J0635J1290J1998J2423J2299J1988J2002J2168J1770J0476
58958H13033Q723P103N744M366K613K04k884o219r230j1746j3909j5536j6086
58945G66176j5492j4498j3829j3417j2775j1797j0748r805q998q283p293n393
58933F33848k602j27P42K10k31L04J210J510J262J219J544J510N08j057k126k085
58917F35639j389j051j595k578l123k855k166j625j238m71R90K654L686L992M463
$$ plain form
58902 633333 639241 647201 656763 667059 677770 689134 701282 714022 727152 740493 753665 766260
58890 766260 778378 790676 803782 817882 832833 848380 864187 879880 895129 909523 922495
58879 922495 933622 942885 950295 955363 957391 956276 952633 947067 939755 930795 920485 909060 896525
58866 896525 882955 868815 854951 842500 832560 825333 819530 813228 805514 796946 788393 780084 771976
58853 771976 764244 756906 749498 741671 733713 726065 718712 711566 705081 699884 695959 692621 689118 684817
58839 684817 679083 671573 662702 653407 644421 635917 627685 619399 610895 602529 595108 589151 584362 580127
58825 580127 576333 573398 571693 571279 572045 573717 575909 578458 581575 585332 589286 593001 596699 600849 605243
58810 605243 609074 611958 614344 616804 619358 621624 623215 623820 623232 621547 619186 616534 613599 610080 605681
$$ packed form
58902F33333N908P960R562J0296J0711J1364J2148J2740J3130J3341J3172J2595
58890G66260J2118J2298J3106J4100J4951J5547J5807J5693J5249J4394J2972
58879I22495J1127R263P410N068K028j115l643n566p312q960j0310j1425j2535
58866H96525j3570j4140j3864j2451r940p227n803o302p714q568q553q309q108
58853G71976p732p338p408p827p958p648p353p146o485n197l925l338l503m301
58839F84817n734p510q871r295q986q504q232q286q504q366p421n957m789m235
58825E80127l794k935j705m14P66J672K192K549L117L757L954L715L698M150M394
58810F05243L831K884K386K460K554K266J591O05n88j685k361k652k935l519m399
$$ plain form
58795 605681 600409 594679 589076 583879 578890 573786 568539 563371 558507 554186 550759 548453 547135 546484
58781 546484 546302 546495 546998 547965 549815 552745 556277 559561 561967 563183 562978 561287 558394 554693 550360
58766 550360 545571 540814 536515 532488 528255 523854 519867 516723 514489 513321 513447 514458 515266 515253 515183 516514
58750 516514 519851 524358 528600 531737 533909 535731 537576 539337 540767 541922 543261 545338 548408 552225
58736 552225 556233 560130 564231 569110 574823 580725 586162 591058 595697 600214 604474 608276 611528 614420
58722 614420 617445 620929 624463 627261 629205 631017 633148 635180 636813 638834 642358 647508 653530 659872
58708 659872 666364 672452 677093 679435 679077 675807 669772 661842 653075 643686 633089 620925 607440 592923
58694 592923 577555 561959 547198 533952 522218 511919 503164 495694 488843 482401 476923 472756 469323
$$ packed form
58795F05681n272n730n603n197m989n104n247n168m864m321l427k306j318o51
58781E46484j82J93N03R67J850K930L532L284K406J216k05j691k893l701m333
58766E50360m789m757m299m027m233m401l987l144k234j168J26J011Q08j3p0J331
58750E16514L337M507M242L137K172J822J845J761J430J155J339K077L070L817
58736E52225M008L897M101M879N713N902N437M896M639M517M260L802L252K892
58722F14420L025L484L534K798J944J812K131K032J633K021L524N150O022O342
58708F59872O492O088M641K342l58l270o035p930q767r389j0597j2164j3485j4517
58694E92923j5368j5596j4761j3246j1734j0299q755p470o851o442n478m167l433
$$ plain form
58681 469323 465857 462374 459359 456820 454274 451498 448713 446057 443339 440458 437761 435801 434873 434939 436009
58666 436009 438439 442646 448534 455507 463211 471932 481826 491995 500890 507663 512659 516520 519341 520912
58652 520912 521304 520872 519894 518493 516733 514579 511867 508547 504906 501384 498143 494836 490886 486119 481155
58637 481155 477023 474283 472687 471715 471124 470810 470572 470345 470352 470650 470840 470625 470265 469972 469236 467498 465295 463916
58619 463916 463924 464719 465617 466681 468293 470531 473301 476667 480760 485564 490885 496321 501389 505906 510133
58604 510133 514235 517859 520653 522863 524914 526703 527905 528600 528869 528178 526158 523733 522290 521824 521062
58589 521062 519611 518739 519661 522245 525956 531001 537736 545740 554305 563287 572750 582246 591147 599343 607120
58574 607120 614627 621932 629275 636791 644219 651211 657741 664128 671069 679760 691373 706117 723255
$$ packed form
58681D69323l466l483l015k539k546k776k785k656k718k881k697j960r28O6J070
58666D36009K430M207N888O973P704Q721R894J0169Q895O773M996L861K821J571
58652E20912L92m32r78j401j760k154k712l320l641l522l241l307l950m767m964
58637D81155m132k740j596r72n91l14k38k27PK98J90k15l60k93p36j738k203j379
58619D63916QP95Q98J064J612K238K770L366M093M804N321N436N068M517M227
58604E10133M102L624K794K210K051J789J202O95K69o91k020k425j443m66p62
58589E21062j451q72R22K584L711N045O735Q004Q565Q982R463R496Q901Q196P777
58574F07120P507P305P343P516P428O992O530O387O941Q691J1613J4744J7138
$$ plain form
58561 723255 742234 763228 786310 810680 835117 858733 880961 901214 918810 932908 942515 947200
58549 947200 947883 946191 942890 937713 930827 923384 916188 908792 900585 891854 883017 873534 862419 849330
58535 849330 834428 817733 799416 780350 761637 743786 726830 710913 696255 682949 671260
58524 671260 661701 654331 648380 643008 638067 633776 630138 627040 624373 621647 618091 613579 608894 604766
58510 604766 601293 598653 597381 597357 597370 596459 594872 593117 590968 588305 586046 585164 585390 585869 586487 587562
58494 587562 588836 589912 591208 593386 596185 598857 601438 604597 608558 613121 618407 624633 631449 638493
58480 638493 646419 656395 668784 682999 698345 714192 729782 744748 759355 773340 785057 792833
58468 792833 796618 797188 794403 787717 777994 767216 756475 745729 735515 727363 722253 719935 719981 722381
$$ packed form
58561G23255J8979K0994K3082K4370K4437K3616K2228K0253J7596J4098R607M685
58549I47200O83j692l301n177o886p443p196p396q207q731q837r483j1115j3089
58535H49330j4902j6695j8317j9066j8713j7851j6956j5917j4658j3306j1689
58524F71260r559p370n951n372m941m291l638l098k667k726l556m512m685m128
58510F04766l473k640j272k4J3r11j587j755k149k663k259q82K26M79O18J075
58494E87562J274J076J296K178K799K672K581L159L961M563N286O226O816P044
58480F38493P926R976J2389J4215J5346J5847J5590J4966J4607J3985J1717P776
58468G92833L785N70k785o686r723j0778j0741j0746j0214q152n110k318M6K400
$$ plain form
58454 722381 726938 733262 741569 752304 764783 777297 788746 799011 807510 812723 813649 810695 804753
58441 804753 796357 786105 774801 762732 749805 736876 725910 718228 713382 710225 708209 707172 706814
58428 706814 707145 708769 712091 716746 722277 728806 736552 745284 754651 764450 774029 781962 786885 788367
58414 788367 786704 782322 775746 767733 759022 750173 741725 734074 727043 720030 712770 705607 699010 693316
58400 693316 688924 686124 684673 684103 684459 686035 688404 690547 692183 694184 697343 701391 705559 709456 712952
58385 712952 715753 717610 718742 719783 721373 723795 726724 729431 731636 734040 737732 743241 750504 759250
58371 759250 768785 777883 785813 793283 801518 810642 819874 828983 838539 848836 859675 871148 883528
58358 883528 896395 908962 921304 934121 947152 958981 968655 976496 983117 988736 993676 998461 1002996
$$ packed form
58454G22381M557O324Q307J0735J2479J2514J1449J0265Q499N213R26k954n942
58441H04753q396j0252j1304j2069j2927j2929j0966p682m846l157k016j037l58
58428G06814L31J624L322M655N531O529P746Q732R367R799R579P933M923J482
58414G88367j663m382o576q013q711q849q448p651p031p013p260p163o597n694
58400F93316m392k800j451n70L56J576K369K143J636K001L159M048M168L897L496
58385G12952K801J857J132J041J590K422K929K707K205K404L692N509P263Q746
58371G59250R535R098P930P470Q235R124R232R109R556J0297J0839J1473J2380
58358H83528J2867J2567J2342J2817J3031J1829R674P841O621N619M940M785M535
$$ plain form
58345 1002996 1006608 1009232 1011753 1014995 1019187 1024523 1031261 1039069 1047248 1055739 1065073 1075336 1086234
58332 1086234 1098062 1111363 1125636 1139770 1153866 1169089 1185481 1201381 1215459 1227823 1238661
58321 1238661 1247322 1253514 1258065 1261765 1264686 1267311 1271027 1276600 1283233 1289951 1296910 1304680 1313321 1322875
58307 1322875 1333717 1345706 1358032 1370528 1384038 1398774 1413541 1427415 1441119 1455808 1471473
58296 1471473 1487506 1504004 1521578 1540423 1560268 1580645 1600794 1620088 1638967 1658663 1679661
58285 1679661 1701335 1723340 1746273 1770579 1795923 1821998 1848821 1875873 1902142 1927450 1952740
58274 1952740 1978951 2006817 2037660 2072664 2111223 2151768 2194432 2240912 2291417 2343976 2397428
58263 2397428 2452867 2511235 2571668 2633224 2696167 2760427 2824884 2889483 2956206 3026614 3100112
$$ packed form
58345A002996L612K624K521L242M192N336O738P808Q179Q491R334J0263J0898
58332A086234J1828J3301J4273J4134J4096J5223J6392J5900J4078J2364J0838
58321A238661Q661O192M551L700K921K625L716N573O633O718O959P770Q641R554
58307A322875J0842J1989J2326J2496J3510J4736J4767J3874J3704J4689J5665
58296A471473J6033J6498J7574J8845J9845K0377K0149J9294J8879J9696K0998
58285A679661K1674K2005K2933K4306K5344K6075K6823K7052K6269K5308K5290
58274A952740K6211K7866L0843L5004L8559M0545M2664M6480N0505N2559N3452
58263B397428N5439N8368O0433O1556O2943O4260O4457O4599O6723P0408P3498
$$ plain form
58252 3100112 3175667 3253322 3332872 3413053 3493403 3575254 3659870 3747449 3838846 3936116 4040292
58241 4040292 4150869 4268432 4395263 4532183 4677518 4830586 4993445 5167746 5352861
58232 5352861 5548837 5758082 5982134 6219818 6470858 6738315 7025185 7331629 7658096
58223 7658096 8008231 8386320 8795094 9238694 9724638 10260300 10851026 11504590 12233759
58214 12233759 13051509 13968140 14997457 16162754 17493434 19019554 20772437 22784711
58206 22784711 25084210 27692183 30633029 33943173 37669527 41870193 46627650 52058594
58198 52058594 58305895 65529157 73914751 83694451 95152026 108622787 124495876 143202338
58190 143202338 165172081 190765659 220155892 253078864 288450611 324065372 356696700
$$ packed form
58252C100112P5555P7655P9550Q0181Q0350Q1851Q4616Q7579R1397R7270J04176
58241D040292J10577J17563J26831J36920J45335J53068J62859J74301J85115
58232E352861J95976K09245K24052K37684K51040K67457K86870L06444L26467
58223G658096L50135L78089M08774M43600M85944N35662N90726O53564P29169
58214A2233759Q17750R16631J029317J165297J330680J526120J752883K012274
58206B2784711K299499K607973K940846L310144L726354M200666M757457N430944
58198E2058594O247301P223262Q385594R779700J1457575J3470761J5873089J8706462
58190A43202338K1969743K5593578K9390233L2922972L5371747L5614761L2631328
$$ plain form
58183 356696700 382713160 398969020 403577423 396295040 378444144 352440746 321122723
58176 321122723 287158543 252739450 219533615 188733545 161088584 136942326 116312002
58169 116312002 98986164 84606948 72742694 62959674 54871532 48151197 42525910
58162 42525910 37777792 33742312 30293312 27326990 24758972 22525549 20576660 18867698
58154 18867698 17360357 16025566 14839327 13777957 12821024 11955357 11171824 10460538 9812304
58145 9812304 9221485 8683676 8192864 7743751 7333997 6960899 6618198 6299089 6000116
58136 6000116 5719571 5454669 5203236 4965911 4743710 4535241 4338767 4154856 3984304
58127 3984304 3825343 3675548 3534819 3403886 3281400 3164986 3053924 2948613 2848684 2753763
$$ packed form
58183C56696700K6016460J6255860M608403p282383j7850896k6003398l1318023
58176C21122723l3964180l4419093l3205835l0800070k7644961k4146258k0630324
58169A16312002j7325838j4379216j1864254r783020q088142o720335n625287
58162D2525910m748118m035480l449000k966322k568018k233423j948889j708962
58154A8867698j507341j334791j186239j061370r56933q65667p83533p11286o48234
58145I812304n90819n37809m90812m49113m09754l73098l42701l19109k98973
58136F000116k80545k64902k51433k37325k22201k08469j96474j83911j70552
58127C984304j58961j49795j40729j30933j22486j16414j11062j05311r9929r4921
$$ plain form
58117 2753763 2664861 2583012 2507546 2437267 2371948 2311067 2252613 2194972 2138682 2084779 2032894
58106 2032894 1982603 1934957 1890821 1849170 1808920 1771003 1736647 1704964 1674208 1644181 1615314
58095 1615314 1586437 1555555 1522118 1486836 1450090 1412240 1374537 1338004 1302228 1266827 1233221
58084 1233221 1203172 1176392 1151222 1126942 1103789 1081535 1059757 1038902 1019454 1000614 981327
58073 981327 962024 943881 926946 910484 894477 879224 864073 848222 832365 818001 805405
58062 805405 793720 782747 773158 765163 758273 752208 746809 741226 734387 726183 717247 707840 697930 688012
58048 688012 678811 670369 662323 654768 647992 641702 635408 629208 623407 617789 611995 606161 600421 594413
58034 594413 587995 581808 576271 570697 564243 557052 549618 541797 533361 524734 516272 507653 498938 491206
$$ packed form
58117B753763q8902q1849p5466p0279o5319o0881n8454n7641n6290n3903n1885
58106B032894n0291m7646m4136m1651m0250l7917l4356l1683l0756l0027k8867
58095A615314k8877l0882l3437l5282l6746l7850l7703l6533l5776l5401l3606
58084A233221l0049k6780k5170k4280k3153k2254k1778k0855j9448j8840j9287
58073I81327j9303j8143j6935j6462j6007j5253j5151j5851j5857j4364j2596
58062H05405j1685j0973r589p995o890o065n399n583o839q204q936r407r910r918
58048F88012r201q442q046p555o776o290o294o200n801n618n794n834n740o008
58034E94413o418o187n537n574o454p191p434p821q436q627q462q619q715p732
$$ plain form
58020 491206 484979 479044 472192 465257 459927 456303 453190 450124 447457 444936 441869 438446 435484 433083
58006 433083 430794 428705 427046 425185 422525 419963 419040 419958 421847 424480 428086 431901 434754 436900 439451
57991 439451 442036 442885 441352 438524 435106 430546 424736 418865 413861 409441 405293 401807 398917 395546
57977 395546 391063 386363 382733 380419 378797 377154 374933 372061 369386 367913 367393 366712 365906 366420 368778
57962 368778 371266 371871 370543 368606 366810 365085 363661 363148 363490 363630 362433 359621 355804 351833 348137
57947 348137 344655 341461 339149 338185 338098 337890 337248 336792 337234 338923 342147 347103 353427 360325 367239 373877
57931 373877 379801 384783 389507 394941 400847 405777 408705 409770 409250 406873 402636 397351 391649 385124
57917 385124 377151 368095 359077 350857 343513 336921 331021 325676 320669 315897 311508 307860 305247 303496
$$ packed form
58020D91206o227n935o852o935n330l624l113l066k667k521l067l423k962k401
58006D33083k289k089j659j861k660k562r23R18J889K633L606L815K853K146K551
57991D39451K585Q49j533k828l418m560n810n871n004m420m148l486k890l371
57977C95546m483m700l630k314j622j643k221k872k675j473n20o81q06N14K358
57962C68778K488O05j328j937j796j725j424n13L42J40j197k812l817l971l696
57947C48137l482l194k312r64q7k08o42m56M42J689L224M956O324O898O914O638
57931C73877N924M982M724N434N906M930K928J065n20k377m237n285n702o525
57917C85124p973r056r018q220p344o592n900n345n007m772m389l648k613j751
$$ plain form
57903 303496 301964 300185 298307 296562 294674 292356 290138 288998 289244 290341 291660 292791 293398 293623 294482
57888 294482 296948 300623 304173 307045 309852 313068 316431 319819 323612 327810 331733 335023 338070 341005
57874 341005 343145 343979 343952 343704 343159 341901 339944 337677 335430 333489 332084 331139 330436 330076 330183 330218 329458
57857 329458 328295 328028 329033 330211 330715 331124 332196 333500 334252 334741 335817 337437 338717 339221 339310 339355 339251
57840 339251 338660 337246 334874 332012 329691 328582 328352 328234 327936 327594 327286 327179 327836 329752 332682 335845
57824 335845 338723 341341 343906 346435 348671 350237 351099 351852 353113 354597 355306 354707 353066 350471 346369
57809 346369 340460 333279 325378 316657 307100 297518 288840 281203 274392 268684 264452 261360 258633 255799
57795 255799 252584 248541 243607 238690 234929 232490 230766 229519 229106 229676 230873 232347 234054 236115 238759
$$ packed form
57903C03496j532j779j878j745j888k318k218j140K46J097J319J131O07K25Q59
57888B94482K466L675L550K872K807L216L363L388L793M198L923L290L047K935
57874C41005K140Q34k7k48n45j258j957k267k247j941j405r45p03l60J07L5p60
57857C29458j163k67J005J178N04M09J072J304P52M89J076J620J280N04Q9M5j04
57840C39251n91j414k372k862k321j109k30j18k98l42l08j07O57J916K930L163
57824C35845K878K618K565K529K236J566Q62P53J261J484P09n99j641k595m102
57809C46369n909p181p901q721r557r582q678p637o811n708m232l092k727k834
57795B55799l215m043m934m917l761k439j724j247m13N70J197J474J707K061K644
$$ plain form
57780 238759 242259 246501 250883 255049 259370 264219 269122 273246 276400 278909 280809 281933 282517 282902 282747
57765 282747 281380 278926 276353 274317 272587 270639 268215 265231 261802 258472 255865 253998 252404 250964
57751 250964 250099 250144 251165 253441 257474 263248 269940 276601 282767 288326 293210 297365 300641 302548 302530
57736 302530 300612 297509 294039 290670 287589 284809 282165 279609 277506 276245 275604 274967 274211 273847 274193
57721 274193 274934 275662 276318 276926 277380 277891 279134 281539 284604 287331 289212 290576 292097 294143 296487 298439
57705 298439 299369 299234 298532 297722 296883 295991 295295 295241 296064 297549 299096 300043 300081 299362 298172 296604 294765 293111
57687 293111 292118 291611 290815 289291 287500 286242 285818 286043 286909 288884 292523 298016 305309 314610 326690
57672 326690 342580 363029 388361 418858 455065 497443 545589 597567 649600 696268 731512
$$ packed form
57780B38759L500M242M382M166M321M849M903M124L154K509J900J124N84L85j55
57765B82747j367k454k573k036j730j948k424k984l429l330k607j867j594j440
57751B50964q65M5J021K276M033N774O692O661O166N559M884M155L276J907j8
57736C02530j918l103l470l369l081k780k644k556k103j261o41o37p56l64L46
57721B74193P41P28O56O08M54N11J243K405L065K727J881J364J521K046K344J952
57705B98439R30j35p02q10q39q92o96n4Q23J485J547R47L8p19j190j568j839j654
57687B93111r93n07p96j524j791j258m24K25Q66J975L639N493P293R301J2080
57672C26690J5890K0449K5332L0497L6207M2378M8146N1978N2033M6668L5244
$$ plain form
57661 731512 750360 750460 732464 699343 655346 605039 552537 501161 453485 411289 375155 344422
57649 344422 318026 295494 276959 262392 251186 242514 235783 230648 226813 223892 221420 219082 217024
57636 217024 215754 215533 216052 216857 217850 219063 220227 221054 221774 222869 224303 225506 226146 226391 226330 225658 224242
57619 224242 222581 221341 220622 219950 218883 217372 215603 213693 211646 209547 207629 206026 204473 202567 200409
57604 200409 198655 197675 196979 195875 194435 193261 192488 191646 190507 189380 188320 186703 184091 181148 179161
57589 179161 178715 179149 179273 178336 176421 174246 172718 172399 173080 173855 173821 172900 171917 171721 172280 172825 172800 172318
57571 172318 171613 170508 168735 166445 164069 161916 160224 159253 158913 158533 157555 156339 155801 156330 157562 159118
57555 159118 160962 163016 165038 167048 169368 172041 174623 176813 178878 181182 183514 185143 185406 184238
$$ packed form
57661G31512J8848J00j7996l3121m3997n0307n2502n1376m7676m2196l6134l0733
57649C44422k6396k2532j8535j4567j1206q672o731n135l835k921k472k338k058
57636B17024j270k21N19Q05R93J213J164Q27P20J095J434J203O40K45o1o72j416
57619B24242j661j240p19o72j067j511j769j910k047k099j918j603j553j906k158
57604B00409j754r80o96j104j440j174p73q42j139j127j060j617k612k943j987
57589A79161m46M34J24r37j915k175j528l19O81P75l4r21r83j96N59N45k5m82
57571A72318p05j105j773k290k376k153j692r71l40l80r78j216n38N29J232J556
57555A59118J844K054K022K010K320K673K582K190K065K304K332J629K63j168
$$ plain form
57541 184238 182300 180556 179498 178780 177862 176861 176359 176472 176596 176086 174703 172460 169561 166564 164005 161781
57525 161781 159466 157209 155471 153715 150393 144890 138679 133769 130547 127939 125203 122575 120346 118278
57511 118278 116097 113868 111703 109637 107918 106920 106568 106261 105540 104533 103615 102937 102411 101877 101204 100434 99904
57494 99904 99902 100177 100109 99548 99104 99397 100248 100905 100834 100074 98986 98060 97833 98596 100039 101461 102457 103232 104139
57475 104139 105215 106371 107754 109446 110896 111180 110064 108489 107661 107862 108457 108872 109103 109303 109342 109047 108568
57458 108568 108254 108251 108464 108809 109274 109721 109839 109417 108609 107831 107329 106952 106413 105717 105247 105405 106229 107320 108064
57439 108064 108028 107444 107242 108266 110356 112483 113866 114571 114942 115026 114940 115196 116045 116807 116593 115541 114682 114612
57421 114612 114963 115183 115184 115050 114707 114124 113415 112566 111523 110692 110839 112206 114148 115876 117183 118234 119079
$$ packed form
57541A84238j938j744j058p18r18j001n02J13J24n10j383k243k899k997k559k224
57525A61781k315k257j738j756l322n503o211m910l222k608k736k628k229k068
57511A18278k181k229k165k066j719r98l52l07p21j007r18o78n26n34o73p70n30
57494I9904kK75o8n61m44K93Q51O57p1p60j088r26k27P63J443J422R96P75R07
57475A04139J076J156J383J692J450K84j116j575q28K01N95M15K31K00L9k95m79
57458A08568l14lK13L45M65M47J18m22q08p78n02l77n39o96m70J58Q24J091P44
57439A08064l6n84k02J024K090K127J383P05L71Q4q6K56Q49P62k14j052q59p0
57421A14612L51K20Jj34l43n83p09q49j043q31J47J367J942J728J307J051Q45
$$ plain form
57404 119079 119708 120231 120651 120714 120267 119539 118884 118471 118325 118388 118385 117990 117266 116555 115896 115050 114286 114470 116005 118265
57384 118265 120534 122965 126065 129718 133298 136375 138700 139906 140035 140035 140880 142225 142753 141888 140434 139346
57368 139346 138544 137256 135019 132003 128717 125727 123397 121646 120096 118570 117310 116652 116667 117128 117618 117740
57352 117740 117497 117436 118076 119237 120291 121070 122007 123251 124203 124304 123868 123665 123876 123954 123441 122502 121533 120583
57334 120583 119326 117471 115016 112211 109390 106801 104482 102286 100032 97665 95241 92786 90283 87781
57320 87781 85420 83226 80943 78260 75262 72538 70678 69673 68912 67799 66280 64689 63140 61304 58908
57305 58908 56252 53858 51691 49250 46606 44797 44708 45925 47288 48360 49664 51559 53656 55503 57145
57290 57145 58741 60223 61708 63676 66305 69106 71681 74380 77623 80992 83663 85481 86941 88224
$$ packed form
57404A19079O29N23M20O3m47p28o55m13j46O3ll95p24p11o59q46p64J84J535K260
57384A18265K269K431L100L653L580L077K325J206J29%Q45J345N28q65j454j088
57368A39346q02j288k237l016l286k990k330j751j550j526j260o58J5M61M90J22
57352A17740k43o1O40J161J054P79R37J244R52J01m36k03K11P8n13r39r69r50
57334A20583j257j855k455k805k821k589k319k196k254k367k424k455k503k502
57320H7781k361k194k283k683k998k724j860j005p61j113j519j591j549j836k396
57305E8908k656k394k167k441k644j809q9J217J363J072J304J895K097J847J642
57290E7145J596J482J485J968K629K801K575K699L243L369K671J818J460J283
$$ plain form
57276 88224 88989 89226 89691 91208 93841 96859 99278 100426 100377 99995 100269 101483 103143 104733 106319 108378
57260 108378 111167 114379 117330 119535 121171 122855 124917 127050 128788 130078 131199 132439 134154 136788
57246 136788 140257 143528 145405 145830 145899 146539 147596 148430 148943 149689 151186 153375 155698 157484 158313 158129
57230 158129 157123 155624 154132 153230 153203 153864 154954 156606 159104 162278 165518 168472 171419 174870 179067
57215 179067 184007 189704 196182 203381 211322 220356 231025 243451 256889 270059 282117 293289 304444
57202 304444 316169 328420 340895 353281 365153 376225 386907 398126 410202 422243 433094
57191 433094 442553 451281 459797 468128 476249 484345 492655 501480 511295 522578 535577 550430 567195
57178 567195 585446 604283 623335 643420 665499 689214 713259 737088 761280 786092 810620
$$ packed form
57276H8224P65K37M65J517K633L018K419J148m9l82K74J214J660J590J586K059
57260A08378K789L212K951K205J636J684K062K133J738J290J121J240J715K634
57246A36788L469L271J877M25O9O40J057Q34N13P46J497K189K323J786Q29j84
57230A58129j006j499j492r02k7O61J090J652K498L174L240K954K947L451M197
57215A79067M940N697O478P199P941R034J0669J2426J3438J3170J2058J1172J1155
57202C04444J1725J2251J2475J2386J1872J1072J0682J1219J2076J2041J0851
57191D33094R459Q728Q516Q331Q121Q096Q310Q825R815J1283J2999J4853J6765
57178E67195J8251J8837J9052K0085K2079K3715K4045K3829K4192K4812K4528
$$ plain form
57167 810620 833861 855955 877861 900279 923318 946778 970262 993245 1015455 1036989 1057780
57156 1057780 1077230 1094737 1110360 1124631 1137839 1149901 1160923 1171590 1182900 1195590 1209812
57145 1209812 1225269 1241680 1259121 1277872 1298004 1319213 1341020 1362983 1384807 1406455 1428204
57134 1428204 1450426 1473345 1497068 1521720 1547262 1573273 1599188 1624828 1650593 1677185 1705269
57123 1705269 1735227 1767056 1800652 1836345 1874922 1916944 1962336 2010921 2063028 2119301 2180494
57112 2180494 2248117 2324963 2414310 2518817 2640889 2784022 2953051 3152928 3387476 3658768
57102 3658768 3966686 4309126 4683737 5090462 5533120 6019826 6562990 7178294 7881875
57093 7881875 8687608 9606780 10649402 11825170 13145099 14625108 16286965 18149315
$$ packed form
57167H10620K3241K2094K1906K2418K3039K3460K3484K2983K2210K1534K0791
57156A057780J9450J7507J5623J4271J3208J2062J1022J0667J1310J2690J4222
57145A209812J5457J6411J7441J8751K0132K1209K1807K1963K1824K1648K1749
57134A428204K2222K2919K3723K4652K5542K6011K5915K5640K5765K6592K8084
57123A705269K9958L1829L3596L5693L8577M2022M5392M8585N2107N6273O1193
57112B180494O7623P6846Q9347J04507J22072J43133J69029J99877K34548K71292
57102C658768L07918L42440L74611M06725M42658M86706N43164O15304P03581
57093G881875Q05733R19172J042622J175768J319929J480009J661857J862350
$$ plain form
57085 18149315 20209349 22424753 24705044 26915809 28898302 30504926 31638683 32273295
57077 32273295 32440895 32200605 31613723 30736282 29619916 28310967 26848753 25267226 23598333
57068 23598333 21873291 20122323 18375294 16662616 15014313 13457604 12014794 10701672
57060 10701672 9525873 8486063 7573364 6774681 6076146 5465246 4931210 4464239 4054911
57051 4054911 3694710 3376936 3096569 2849276 2630972 2438108 2267525 2115843 1979632
57042 1979632 1856404 1744843 1643851 1552000 1468164 1392081 1323884 1263565 1211122 1166660 1129947
57031 1129947 1100504 1078590 1065611 1062907 1070279 1085856 1106533 1127552 1142080 1142763 1124953 1088840
57019 1088840 1038674 980094 917911 855549 795553 739934 689842 645255 605480 570032 538730
$$ packed form
57085A8149315K060034K215404K280291K210765J982493J606624J133757O34612
57077C2273295J67600k40290n86882q77441j116366j308949j462214j581527j668893
57068B3598333j725042j750968j747029j712678j648303j556709j442810j313122
57060A0701672j175799j039810r12699p98683o98535o10900n34036m66971m09328
57051D054911l60201l17774k80367k47293k18304j92864j70583j51682j36211
57042A979632j23228j11561j00992r1851q3836p6083o8197o0319n2443m4462l6713
57031A129947k9443k1914j2979k704P372J5577K0677K1019J4528O83j7810l6113
57019A088840n0166n8580o2183o2362n9996n5619n0092m4587l9775l5448l1302
$$ plain form
57008 538730 511024 485853 462519 441277 422624 406271 391337 377442 365155 355287 348076 343150
56996 343150 340036 338523 338724 340868 345039 351065 358656 367545 377453 388036 399054 410459 422039
56983 422039 432924 441642 446795 447566 443554 434438 420240 401946 381450 360549 340110 320317 301473
56970 301473 284146 268708 255326 244418 236536 231578 228724 227604 229052 234124 242736 253936 267211
56957 267211 282719 300197 318390 335645 350385 360814 365082 362468 354191 342567 329455 315724
56945 315724 301896 288819 277671 269440 264399 262046 261775 263658 268293 275900 286035 298419 313590
56932 313590 332187 353752 376563 398489 417575 431941 439723 439542 431131 415573 395014 371910
56920 371910 348200 325013 303033 282897 265054 249543 236281 225466 217288 211256 206266 201541
$$ packed form
57008E38730k7706k5171k3334k1242j8653j6353j4934j3895j2287r868p211m926
56996C43150l114j513K01K144M171O026P591Q889R908J0583J1018J1405J1580
56983D22039J0885Q718N153P71m012r116j4198j8294k0496k0901k0439j9793j8844
56970C01473j7327j5438j3382j0908p882m958k854j120J448N072Q612J1200J3275
56957B67211J5508J7478J8193J7255J4740J0429M268k614q277j1624j3112j3731
56945C15724j3828j3077j1148q231n041k353k71J883M635P607J0135J2384J5171
56932C13590J8597K1565K2811K1926J9086J4366P782j81q411j5558k0559k3104
56920C71910k3710k3187k1980k0136j7843j5511j3262j0815q178o032m990m725
$$ plain form
56908 201541 197259 193999 191742 189696 187126 184184 181821 180921 181557 183047 184682 186336 188409 191356 195403
56893 195403 200749 207801 216974 228261 241177 255279 270630 287572 305979 324811 342346 356658
56881 356658 365978 369150 366273 358875 349058 338392 327759 318056 310468 305774 303772 303801 305794 310589
56867 310589 319301 332611 350642 373315 400780 433559 472150 516131 563490 610816 654161 689765
56855 689765 714310 725258 721652 704771 677835 644835 609415 574441 542028 513640 490255 472648
56843 472648 461529 457323 460055 469735 486860 512313 546801 590648 644152 707520 779722 857063
56831 857063 932910 998981 1047373 1072299 1071175 1045095 998582 938381 871459 803281 737497 676842
56819 676842 623787 580059 546027 521142 504890 496930 496658 503591 518364 542505 576727 619813
$$ packed form
56908B01541m282l260k257k046k570k942k363r00O36J490J635J654K073K947M047
56893A95403N346P052R173J1287J2916J4102J5351J6942J8407J8832J7535J4312
56881C56658R320L172k877p398r817j0666j0633r703p588m694k002K9J993M795
56867C10589Q712J3310J8031K2673K7465L2779L8591M3981M7359M7326M3345L5604
56855F89765K4545J0948l606j6881k6936l3000l5420l4974l2413k8388k3385j7607
56843D72648j1119m206K732R680J7125K5453L4488M3847N3504O3368P2202P7341
56831H57063P5847O6071M8392K4926j124k6080m6513o0201o6922o8178o5784o0655
56819F76842n3055m3728l4032k4885j6252p960k72O933J4773K4141L4222M3086
$$ plain form
56807 619813 669356 722756 776699 826065 864333 885552 886304 866638 829897 781406 726515 669463
56795 669463 613686 562243 517139 478662 446191 419575 399244 385385 377873 376825 382367 393871
56783 393871 410253 431021 456074 484204 512531 537590 556330 566071 564754 552037 529642 500075
56771 500075 465491 428060 390438 354873 322144 292135 265190 242141 223116 207104 192896
56760 192896 180008 168602 158905 150908 144372 138951 134348 130410 127024 124057 121494 119494 118124 117097
56746 117097 115903 114178 111895 109283 106659 104249 102139 100417 99222 98505 97880 97005 96071 95583 95698 96063
56730 96063 96335 96486 96647 97040 98069 100009 102498 104744 106362 107649 109043 110792 113135 116123 119066
56715 119066 120861 121219 121021 121155 121586 121961 122427 123292 124427 125614 127036 128787 130352 131275 131992 133263
$$ packed form
56807F19813M9543N3400N3943M9366L8268K1219P52j9666l6741m8491n4891n7052
56795F69463n5777n1443m5104l8477l2471k6616k0331j3859p512j048N542J1504
56783C93871J6382K0768K5053K8130K8327K5059J8740R741j317j2717k2395k9567
56771E00075l4584l7431l7622l5565l2729l0009k6945k3049j9025j6012j4208
56760A92896j2888j1406r697p997o536n421m603l938l386k967k563k000j370j027
56746A17097j194j725k283k612k624k410k110j722j195p17o25q75r34m88J15L65
56730I6063K72J51J61L93J029J940K489K246J618J287J394J749K343K988K943
56715A19066J795L58j98J34M31L75M66Q65J135J187J422J751J565R23P17J271
$$ plain form
56699 133263 135009 136472 137358 138100 139051 140151 141348 142639 143640 143799 143244 142840 143154 143813 144128 143951 143644
56682 143644 143484 143422 143278 143081 143128 143639 144300 144415 143766 142993 142723 142604 141791 140211 138669 137653 136753 135506
56664 135506 134228 133611 133893 134767 135830 136788 137473 137953 138541 139450 140593 141841 143265 144816 145991 146173
56648 146173 145372 144307 143623 143184 142360 140898 139258 137966 136869 135357 133251 131135 129711 129129 129141 129622
56632 129622 130605 131938 133253 134309 135213 136268 137655 139168 140247 140503 140288 140464 141384 142341 142342 141250 139853
56615 139853 139002 138956 139459 140064 140387 140308 139942 139332 138343 137048 135971 135550 135535 135311 134727 134232 134267 134905 136043
56596 136043 137518 138958 139946 140478 140966 141588 141890 141235 139626 137950 137409 138589 140985 143468 145304 146654
56580 146654 148047 149637 151172 152446 153436 154120 154501 154816 155471 156723 158563 160869 163505 166345 169349
$$ packed form
56699A33263J746J463Q86P42R51J100J197J291J001J59n55m04L14O59L15j77l07
56682A43644j60o2j44j97M7N11O61J15o49p73k70j19q13j580j542j016r00j247
56664A35506j278o17K82Q74J063R58O85M80N88R09J143J248J424J551J175J82
56648A46173q01j065o84m39q24j462j640j292j097j512k106k116j424n82J2M81
56632A29622R83J333J315J056R04J055J387J513J079K56k15J76R20R57Jj092j397
56615A39853q51m6N03O05L23p9l66o10r89j295j077m21j5k24n84m95L5O38J138
56596A36043J475J440R88N32M88O22L02o55j609j676n41J180K396K483J836J350
56580A46654J393J590J535J274R90O84L81L15O55J252J840K306K636K840L004
$$ plain form
56565 169349 172594 176214 180397 185403 191347 198054 205469 214145 224624 236158 246726 254788 260459
56552 260459 264518 266989 267488 266406 264732 262877 260474 257271 253513 249553 245755 242620 240265 237918
56538 237918 234735 231089 228242 226771 226115 225631 225124 224265 222495 219886 217246 215048 212980 210867 209138
56523 209138 207950 206703 205029 203554 203008 203085 202820 201710 199920 197811 195825 194468 193798 193223 192275 191314
56507 191314 191044 191567 192335 192713 192218 190598 188194 185968 184630 183938 183196 182205 181315 180823 180762 181033 181238 180665
56489 180665 178976 176805 175231 174744 175094 175872 176712 177145 176864 176181 175758 175896 176444 177269 178357 179520 180475
56472 180475 181204 181859 182398 182759 183286 184365 185608 186054 185393 184462 184208 184583 184773 184200 182955 181575 180716
56455 180716 180841 181840 183032 183790 184112 184350 184572 184569 184436 184737 185923 187784 189612 190801 191202 191135 191156 191650
$$ packed form
56565A69349L245L620M183N006N944O707P415Q676J0479J1534J0568Q062N671
56552B60459M059K471M99j082j674j855k403l203l758l960l798l135k355k347
56538B37918l183l646k847j471o56m84n07q59j770k609k640k198k068k113j729
56523B09138j188j247j674j475n46P7k65j110j790k109j986j357o70n75r48r61
56507A91314k70N23P68L78m95j620k404k226j338o92p42r91q90m92o1K71K05n73
56489A80665j689k171j574m87L50P78Q40M33k81o83m23J38N48Q25J088J163R55
56472A80475P29O55N39L61N27J079J243M46o61r31k54L75J90n73j245j380q59
56455A80716J25R99J192P58L22K38K22lj33L01J186J861J828J189M01o7K1M94
$$ plain form
56437 191650 192458 193009 192951 192491 191996 191499 190873 190222 189626 188659 186796 184380 182502 181691 181333 180731 180185 180433
56419 180433 181494 182778 184089 185819 188237 191198 194544 198196 201828 205006 207711 210289 212855 215221
56405 215221 217321 219161 220388 220611 220207 220065 220330 220130 218930 217481 216885 217204 217518 217054 215798 214267
56389 214267 213114 212845 213562 214990 216847 219016 221311 223419 225218 226862 228456 229999 231723 233985 236609
56374 236609 238810 240065 240682 241204 241653 241735 241452 241153 241174 241715 242856 244481 246362 248405 250487 252092 252641
56357 252641 252308 251945 251960 251961 251814 252293 254097 256815 259553 262072 264614 266979 268620 269460 269895 270053 269713
56340 269713 268976 268436 268598 269557 271258 273623 276361 278950 280944 282184 282880 283602 285002 287254 289973 292877
56324 292877 296169 299922 303447 305857 307131 308099 309369 310653 311268 310995 310353 310100 310492 311075 311377 311646
$$ packed form
56437A91650Q08N51n8m60m95m97o26o51n96r67j863k416j878q11l58o02n46K48
56419A80433J061J284J311J730K418K961L346L652L632L178K705K578K566K366
56405B15221K100J840J227K23m04j42K65k00j200j449n96L19L14m64j256j531
56389B14267j153k69P17J428J857K169K295K108J799J644J594J543J724K262K624
56374B36609K201J255O17N22M49Q2k83k99K1N41J141J625J881K043K082J605N49
56357B52641l33l63J5Jj47M79J804K718K738K519K542K365J641Q40M35J58l40
56340B69713p37n40J62R59J701K365K738K589J994J240O96P22J400K252K719K904
56324B92877L292L753L525K410J274R68J270J284O15k73o42k53L92N83L02K69
$$ plain form
56308 311646 312537 314130 315823 317320 319048 321365 324006 326723 329855 333696 337841 341763 345620 349880
56294 349880 354524 359202 363844 368547 373224 377940 383260 389574 396385 402934 409245 415875 422901 429923
56280 429923 436914 444319 452311 460595 468927 477369 486140 495677 506545 518745 531427 544022 557345
56267 557345 572737 590364 609273 629099 650716 675064 702225 731886 764020 798831 836730
56256 836730 878675 925944 979205 1038274 1103095 1174586 1254283 1343344 1441986 1549551 1665015
56245 1665015 1787687 1917393 2053755 2195397 2340137 2485595 2629108 2767319 2896610
56236 2896610 3013895 3116443 3201111 3264627 3304827 3321054 3313400 3282348 3229374 3157089 3068302
56225 3068302 2965352 2850590 2726934 2597536 2465134 2331971 2200089 2071398 1947566
$$ packed form
56308C11646Q91J593J693J497J728K317K641K717L132L841M145L922L857M260
56294C49880M644M678M642M703M677M716N320O314O811O549O311O630P026P022
56280D29923O991P405P992Q284Q332Q442Q771R537J0868J2200J2682J2595J3323
56267E57345J5392J7627J8909J9826K1617K4348K7161K9661L2134L4811L7899
56256H36730M1945M7269N3261N9069O4821P1491P9697Q9061R8642J07565J15464
56245A665015J22672J29706J36362J41642J44740J45458J43513J38211J29291
56236B896610J17285J02548Q4668O3516M0200J6227p654l1052n2974p2285q8787
56225C068302j02950j14762j23656j29398j32402j33163j31882j28691j23832
$$ plain form
56216 1947566 1829794 1718583 1613852 1515638 1424519 1341008 1264751 1194886 1130972 1072925 1020131
56205 1020131 971500 926586 885928 849885 817652 787811 759567 733146 709269 688430 670463
56194 670463 654594 640040 626655 614921 605288 597633 591287 585502 579968 574940 570670 566787 562709
56181 562709 558718 555891 554632 553984 552923 551624 550731 550025 548766 546930 545138 543694 542562 542026 542488
56166 542488 543821 545745 548569 552737 558054 564322 572263 582537 594074 604716 613591 621697 630207
56153 630207 639483 649925 662463 677778 695945 717157 741917 770365 802391 838571 880130 927858
56141 927858 982019 1043225 1112098 1187793 1267972 1350428 1433546 1514979 1591381 1660272 1721262
56130 1721262 1775045 1822301 1864077 1901916 1936532 1966891 1991236 2008508 2018505 2021497 2018194 2009417
$$ packed form
56216A947566j17772j11211j04731r8214r1119q3511p6257o9865o3914n8047n2794
56205A020131m8631m4914m0658l6043l2233k9841k8244k6421k3877k0839j7967
56194F70463j5869j4554j3385j1734r633p655o346n785n534n028m270l883m078
56181E62709l991k827j259o48j061j299q93p06j259j836j792j444j132n36M62
56166E42488J333J924K824M168N317O268P941J0274J1537J0642Q875Q106Q510
56153F30207R276J0442J2538J5315J8167K1212K4760K8448L2026L6180M1559M7728
56141I27858N4161O1206O8873P5695Q0179Q2456Q3118Q1433P6402O8891O0990
56130A721262N3783M7256M1776L7839L4616L0359K4345J7272R997K992l303q777
$$ plain form
56118 2009417 1995368 1975673 1950004 1917696 1876838 1825177 1762458 1690978 1613692 1533015 1451670
56107 1451670 1373070 1299951 1233603 1174879 1124662 1082656 1047134 1016785 991801 972351 957264
56096 957264 945150 935742 929104 924490 921012 918581 917227 916443 916147 917382 920930 925975 931194 936485
56082 936485 942589 949649 957205 965142 973665 982681 991999 1001759 1012045 1022566 1033304 1044904 1057799
56069 1057799 1071532 1085508 1099859 1115012 1130962 1147430 1164129 1180553 1196295 1211878 1228451
56058 1228451 1246341 1264793 1283376 1302492 1322214 1341863 1361174 1380491 1399357 1416390 1431289
56047 1431289 1445515 1460235 1475043 1489522 1504545 1520941 1538235 1555779 1573879 1592850 1612255
56036 1612255 1631996 1652886 1675296 1698704 1723432 1751196 1782966 1817946 1855636 1896960 1942183
$$ packed form
56118B009417j4049j9695k5669l2308m0858n1661o2719p1480p7286q0677q1345
56107A451670p8600p3119o6348n8724n0217m2006l5522l0349k4984j9450j5087
56096I57264j2114r408o638m614l478k431j354p84k96J235L548N045N219N291
56082I36485O104P060P556P937Q523R016R318R760J0286J0521J0738J1600J2895
56069A057799J3733J3976J4351J5153J5950J6468J6699J6424J5742J5583J6573
56058A228451J7890J8452J8583J9116J9722J9649J9311J9317J8866J7033J4899
56047A431289J4226J4720J4808J4479J5023J6396J7294J7544J8100J8971J9405
56036A612255J9741K0890K2410K3408K4728K7764L1770L4980L7690M1324M5223
$$ plain form
56025 1942183 1989686 2038253 2088644 2141337 2194723 2247285 2299735 2353115 2406764 2460231 2515433
56014 2515433 2574677 2638093 2705037 2776300 2852623 2932591 3014429 3098504 3185886 3275994 3368112
56003 3368112 3463832 3565479 3673434 3787275 3908144 4037536 4175098 4320018 4473227 4635960
55993 4635960 4807745 4988184 5179052 5382227 5597509 5825029 6067666 6328253 6606661
55984 6606661 6902822 7220405 7564185 7936156 8337919 8774667 9253057 9777742 10354344
55975 10354344 10993571 11708147 12508447 13406505 14422596 15583223 16914731 18442958 20195058
55966 20195058 22195164 24461373 27014667 29890349 33137692 36816226 41004272 45810272
55958 45810272 51367828 57823579 65342076 74124271 84416607 96509808 110741057 127488927
$$ packed form
56025A942183M7503M8567N0391N2693N3386N2562N2450N3380N3649N3467N5202
56014B515433N9244O3416O6944P1263P6323P9968Q1838Q4075Q7382R0108R2118
56003C368112R5720J01647J07955J13841J20869J29392J37562J44920J53209J62733
55993D635960J71785J80439J90868K03175K15282K27520K42637K60587K78408
55984F606661K96161L17583L43780L71971M01763M36748M78390N24685N76602
55975A0354344O39227P14576Q00300Q98058J016091J160627J331508J528227J752100
55966B0195058K000106K266209K553294K875682L247343L678534M188046M806000
55958D5810272N557556O455751P518497Q782195J0292336J2093201J4231249J6747870
$$ plain form
55950 127488927 147140167 170032479 196361674 225975661 258013067 290555739 320631363
55943 320631363 344754899 359823530 363947402 356883830 339971390 315638155 286688589
55936 286688589 255668974 224553515 194753139 167243201 142638547 121217124 102967685
55929 102967685 87673769 74995032 64533544 55895431 48736193 42771214 37765338
55922 37765338 33528544 29916652 26820986 24152526 21837624 19821397 18063006 16525571
55914 16525571 15174828 13984240 12933626 12002923 11172485 10428014 9759308 9154733 8601979
55905 8601979 8093555 7626526 7197042 6799373 6429879 6087539 5770495 5475625 5201349
55896 5201349 4947442 4712264 4493259 4289753 4102186 3928920 3766819 3614726 3473547
$$ packed form
55950A27488927J9651240K2892312K6329195K9613987L2037406L2542672L0075624
55943C20631363K4123536J5068631M123872p063572j6912440k4333235k8949566
55936B86688589l1019615l1115459k9800376k7509938k4604654k1421423j8249439
55929A02967685j5293916j2678737j0461488q638113p159238n964979n005876
55922C7765338m236794l611892l095666k668460k314902k016227j758391j537435
55914A6525571j350743j190588j050614r30703q30438p44471o68706o04575n52754
55905H601979n08424m67029m29484l97669l69494l42340l17044k94870k74276
55896E201349k53907k35178k19005k03506j87567j73266j62101j52093j41179
$$ plain form
55887 3473547 3343234 3222396 3110492 3007617 2912173 2821145 2732536 2645478 2558641 2471162
55877 2471162 2384853 2302998 2227000 2156062 2089546 2027237 1967636 1908557 1849585 1792005 1736488
55866 1736488 1682740 1631104 1582416 1536459 1492580 1451634 1415239 1383220 1353741 1325877 1300021
55855 1300021 1275682 1250979 1224599 1196627 1167264 1136420 1104733 1073441 1043023 1013320 984975
55844 984975 959197 936032 914297 893292 873191 853834 834657 815953 798716 783048 768069
55833 768069 753500 739939 727353 714675 701289 687814 675123 663513 652958 643225 633579 623249
55821 623249 612258 601078 589744 578190 567136 557547 549451 542266 536001 530947 526551 521860 516867
55808 516867 512240 508042 504023 500823 499321 498998 498546 498122 499348 502800 506982 510222 512288 513746 514957
$$ packed form
55887C473547j30313j20838j11904j02875r5444r1028q8609q7058q6837q7479
55877B471162q6309q1855p5998p0938o6516o2309n9601n9079n8972n7580n5517
55866A736488n3748n1636m8688m5957m3879m0946l6395l2019k9479k7864k5856
55855A300021k4339k4703k6380k7972k9363l0844l1687l1292l0418k9703k8345
55844I84975k5778k3165k1735k1005k0101j9357j9177j8704j7237j5668j4979
55833G68069j4569j3561j2586j2678j3386j3475j2691j1610j0555r733r646j0330
55821F23249j0991j1180j1334j1554j1054r589q096p185o265n054m396m691m993
55808E16867m627m198m019l200j502l23m52m24J226L452M182L240K066J458J211
$$ plain form
55793 514957 516102 517155 517407 515927 512750 508743 504306 499271 494097 489835 486590 483181 478672 473164
55779 473164 466775 459077 450069 440681 431762 423443 415977 410332 407377 407132 409169 413041 417866 422109
55765 422109 424289 423690 420417 415231 409262 403205 396912 390361 384706 381395 380380 380169 379519 378032 375249
55750 375249 370447 363533 355082 345377 334551 323580 313783 305115 296396 287608 280446 276046 273518 271510
55736 271510 269861 268755 267443 265038 261889 259082 257074 255635 254634 254046 253571 252871 251849 250305 247857
55721 247857 244664 241580 239043 236472 233373 230402 228572 227894 227553 227127 226991 227734 229702 232835 236502
55706 236502 239709 241880 243201 244030 244407 244377 244186 243646 241798 237826 232077 225752 219807 214483 209599 204898
55690 204898 200294 196027 192466 189710 187713 186681 186852 187867 189113 190760 193638 197798 202090 205640
$$ packed form
55793E14957J145J053K52j480l177m007m437n035n174m262l245l409m509n508
55779D73164o389p698r008r388q919q319p466n645k955k45K037L872M825M243
55765D22109K180n99l273n186n969o057o293o551n655l311j015k11o50j487k783
55750C75249m802o914q451r705j0826j0971r797q668q719q788p162m400k528k008
55736B71510j649j106j312k405l149k807k008j439j001n88m75p00j022j544k448
55721B47857l193l084k537k571l099k971j830o78l41m26j36P43J968L133L667
55706B36502L207K171J321Q29L77l0j91n40j848l972n749o325n945n324m884m701
55690B04898m604m267l561k756j997j032J71J015J246J647K878M160M292L550
$$ plain form
55676 205640 208936 212757 216705 219532 220478 219605 217271 214055 210908 208626 207152 205833 204184 202092 199577
55661 199577 196843 194327 192242 190286 188218 186551 186219 187594 190088 192609 194257 194825 194899 195280 196187 197245
55645 197245 198208 199258 200477 201564 202230 202393 201784 199962 196990 193466 189564 184752 178978 173457 169499
55630 169499 166968 164561 161330 157421 153636 150872 149750 150111 150932 151166 150571 149520 148311 147066 145956
55615 145956 144959 143597 141375 138356 134988 131588 128384 125781 124118 123279 122825 122311 121221 119098 116199
55600 116199 113705 112663 112833 113055 112574 111588 110649 110087 109956 110129 110343 110380 110241 110041 109869 109833 109963 109987 109584
55581 109584 109070 109342 110847 113053 115268 117531 120295 123691 127619 132183 137510 143387 149601 156280 163349
55566 163349 169927 174896 177955 179603 180224 179688 177757 174509 170338 165779 161133 156159 150476 144387 138747
$$ packed form
55676B05640L296L821L948K827R46q73k334l216l147k282j474j319j649k092k515
55661A99577k734k516k085j956k068j667l32J375K494K521J648N68P4L81R07J058
55645A97245R63J050J219J087O66J63o09j822k972l524l902m812n774n521l958
55630A69499k531k407l231l909l785k764j122L61Q21K34n95j051j209j245j110
55615A45956r97j362k222l019l368l400l204k603j663q39m54n14j090k123k899
55600A16199k494j042J70K22m81r86r39n62j31J73K14L7j39k00j72l6J30K4m03
55581A09584n14K72J505K206K215K263K764L396L928M564N327N877O214O679P069
55566A63349O578M969L059J648O21n36j931l248m171m559m646m974n683o089n640
$$ plain form
55551 138747 133763 128712 123353 118826 116265 115146 114048 112671 112026 112749 114300 115848 117100 118090 118958
55536 118958 120059 121673 123455 124712 125252 125423 125420 125170 124774 124366 123648 122359 121124 120928 121656 122048 121347
55519 121347 120029 118596 116592 113455 109640 106170 103449 101087 98653 96208 94260 93462 94096 95596 96844
55504 96844 97117 96528 95461 93986 92038 89821 87808 86486 86077 86183 85833 84404 82457 80992 79891 77992
55488 77992 74907 71819 69954 69154 68652 68448 68913 69574 69501 68789 68647 69838 71857 73894 75855 78045 80459
55471 80459 82862 85194 87420 89200 90194 90629 91174 92120 92939 92793 91373 89161 86900 84921 82981 80720
55455 80720 78311 76617 76506 77838 79242 79247 77712 75910 75126 75550 76688 78364 80712 83455 85848 87488
55439 87488 88636 89598 90238 90367 90207 90129 90135 89955 89501 88939 88346 87517 86219 84581 83191 82707 83191 83894 83928
$$ packed form
55551A38747m984n051n359m527k561j119j098j377o45P23J551J548J252R90Q68
55536A18958J101J614J782J257N40J71lk50l96m08p18j289j235j96P28L92p01
55519A21347j318j433k004l137l815l470k721k362k434k445j948p98O34J500J248
55504I6844K73n89j067j475j948k217k013j322m09J06l50j429j947j465j101j899
55488G7992l085l088j865q00n02k04M65O61p3p12j42J191K019K037J961K190K414
55471H0459K403K332K226J780R94M35N45R46Q19j46j420k212k261j979j940k261
55455H0720k409j694j11J332J404Nj535j802p84M24J138J676K348K743K393J640
55439H7488J148R62O40J29j60p8Oj80m54n62n93q29j298j638j390m84M84P03L4
$$ plain form
55420 83928 83239 82643 82894 84030 85716 87751 89820 91148 91027 89761 88553 88237 88464 88413 87999 87920 88567
55403 88567 89384 89562 89055 88565 88583 88795 88543 87619 86445 85528 84865 83924 82288 80407 79496 80391 82571 84682
55385 84682 86012 87008 88298 89820 91203 92364 93206 93178 91881 89909 88379 87643 87057 86071 84899 83989
55369 83989 83353 82725 82003 81228 80378 79438 78524 77840 77608 77973 78804 79611 79972 79973 79926 79776 79230 78436 77987 78069
55349 78069 78090 77428 76224 75194 74913 75448 76433 77286 77598 77446 77190 76949 76578 76127 75939 76137 76485 76876 77492
55330 77492 78226 78457 77779 76604 75582 74731 73560 71853 69916 68185 67075 67113 68697 71544 74650 77048
55314 77048 78576 79813 81345 83095 84407 84758 84232 83235 81949 80433 79084 78494 78772 79407 79965 80465
55298 80465 80932 81086 80788 80371 80172 80118 80164 80689 81909 83207 83683 83269 82731 82594 82659 82650 82779 83359 84173 84576
$$ packed form
55420H3928o89n96K51J136J686K035K069J328j21j266j208l16K27n1m14p9O47
55403H8567Q17J78n07m90J8K12k52r24j174r17o63r41j636j881r11Q95K180K111
55385H4682J330R96J290J522J383J161Q42k8j297j972j530p36n86r86j172r10
55369H3989o36o28p22p75q50r40r14o84k32L65Q31Q07L61Jm7j50n46p94m49Q2
55349G8069K1o62j204j030k81N35R85Q53L12j52k56k41l71m51j88J98L48L91O16
55330G7492P34K31o78j175j022q51j171j707j937j731j110L8J584K847L106K398
55314G7048J528J237J532J750J312L51n26r97j286j516j349n90K78O35N58N00
55298H0465M67J54k98m17j99n4M6N25J220J298M76m14n38j37O5rJ29N80Q14M03
$$ plain form
55278 84576 84180 83323 82866 83459 84895 86230 86629 86010 84785 83273 81643 80239 79526 79598 80036 80295 80108
55261 80108 79572 79046 78958 79477 80381 81373 82478 83936 85720 87366 88260 87983 86537 84390 82244 80513 79140
55244 79140 78063 77587 77907 78479 78450 77781 77412 78090 79407 80261 80031 79009 77929 77376 77592 78499 79750 80847
55226 80847 81366 81234 80817 80656 80990 81617 82285 83040 83983 84825 85003 84283 83013 81788 81046 80917 81222 81636
55208 81636 82075 82803 83841 84468 83925 82640 82071 82993 84517 85237 84834 84004 83230 82417 81602 81223 81495 82115
55190 82115 82784 83553 84384 84805 84393 83337 82232 81495 81231 81437 82028 82740 83294 83631 83760 83545 82864 81949
55172 81949 81305 81342 82291 84303 87237 90324 92469 93150 92889 92690 93100 93823 94083 93299 91650 90049 89422
55155 89422 89928 91039 92336 93875 95700 97365 98230 98015 96878 95162 93303 91736 90574 89606 88739 88237
$$ packed form
55278H4576l96q57m57N93J436J335L99o19j225j512j630j404p13P2M38K59j87
55261H0108n36n26q8N19R04R92J105J458J784J646Q94k77j446k147k146j731j373
55244G9140j077m76L20N72k9o69l69O78J317Q54k30j022j080n53K16R07J251J097
55226H0847N19j32m17j61L34O27O68P55R43Q42J78p20j270j225p42j29L05M14
55208H1636M39P28J038O27n43j285n69R22J524P20m03q30p74q13q15l79K72O20
55190H2115O69P69Q31M21m12j056j105p37k64K06N91P12N54L37J29k15o81r15
55172H1949o44L7R49K012K934L087K145O81k61j99M10P23K60p84j649j601o27
55155H9422N06J111J297J539J825J665Q65k15j137j716j859j567j162r68q67n02
$$ plain form
55139 88237 88218 88249 87900 87477 87707 88763 90073 91060 91622 91885 91996 92154 92409 92352 91505 90135 89150 89005 89218
55120 89218 89243 89260 89708 90437 90869 90788 90479 90192 89895 89556 89321 89332 89548 89803 89980 90173 90662 91521 92246 92072
55100 92072 90859 89395 88603 88686 89291 90188 91409 92863 94244 95329 96154 96924 97968 99580 101618 103326
55084 103326 103898 103234 101969 100797 99986 99473 99116 98808 98563 98572 99043 99939 100937 101640 101852 101787 101977 102740 103661
55065 103661 103900 103188 102181 101603 101427 101211 100895 100710 100595 100264 99759 99319 98789 97724 96180 94867 94364
55048 94364 94593 95141 95620 95606 94796 93515 92619 92551 92888 93152 93627 94878 96707 98136 98392 97509 95973 94214
55030 94214 92583 91492 91337 92268 94042 96073 97680 98440 98389 97865 97210 96619 96124 95592 94826 93809 92772
55013 92772 91910 91122 90224 89333 88847 88998 89643 90517 91462 92256 92467 91846 90870 90551 91507 93303 94907 95660
$$ packed form
55139H8237j9L1l49m23K30J056J310R87N62K63J11J58K55n7q47j370r85j45K13
55120H9218K5J7M48P29M32q1l09k87k97l39k35J1K16K55J77J93M89Q59P25j74
55100I2072j213j464p92Q3O05Q97J221J454J381J085Q25P70J044J612K038J708
55084A03326N72o64j265j172q11n13l57l08k45RM71Q96R98P03K12o5J90P63R21
55065A03661K39p12j007n78j76k16l16j85j15l31n05m40n30j065j544j313n03
55048I4364K29N48M79j4q10j281q96o8L37K64M75J251J829J429K56q83j536j759
55030I4214j631j091j55R31J774K031J607P60n1n24o55n91m95n32p66j017j037
55013I2772q62p88q98q91m86J51O45Q74R45P94K11o21r76l19R56J796J604P53
$$ plain form
54995 95660 95668 95404 95237 95332 95669 96038 96265 96559 97413 98969 100690 101841 102128 101744 101109 100787 101308 102591 103650
54976 103650 103405 101837 100076 99317 99937 101541 103389 104723 105162 105010 104906 105044 105081 104899 104992 105753 106762
54959 106762 107204 106841 106195 105866 106058 106678 107504 108160 108273 107843 107249 106734 106073 104922 103428 102234 101799 101851
54941 101851 101639 100708 99344 98274 98044 98716 100016 101603 103188 104540 105492 106040 106451 107192 108561 110370
54925 110370 112200 114014 116257 119203 122539 125901 129536 133944 138991 143922 148253 152139 155788 159090
54911 159090 162061 165085 168230 170638 171106 169202 165527 161037 156416 151942 147586 143250 139146 135835
54897 135835 133610 132024 130422 128784 127551 126675 125450 123523 121520 120295 119901 119743 119518 119462 119785 120371
54881 120371 121196 122598 124884 127859 130982 133845 136433 139125 142561 147244 152984 158850 163928 168009
$$ packed form
54995I5660Qk64j67R5L37L69K27K94Q54J556J721J151K87l84o35l22N21J283J059
54976A03650k45j568j761p59O20J604J848J334M39j52j04J38L7j82R3P61J009
54959A06762M42l63o46l29J92O20Q26O56J13m30n94n15o61j151j494j194m35N2
54941A01851k12r31j364j070k30O72J300J587J585J352R52N48M11P41J369J809
54925A10370J830J814K243K946L336L362L635M408N047M931M331L886L649L302
54911A59090K971L024L145K408M68j904l675m490m621m474m356m336m104l311
54897A35835k225j586j602j638j233q76j225j927k003j225l94j58k25n6L23N86
54881A20371Q25J402K286K975L123K863K588K692L436M683N740N866N078M081
$$ plain form
54867 168009 171299 173668 174635 174035 172200 169396 165578 160869 155774 150577 144983 138876 133154 129156 127254
54852 127254 126469 125518 123846 121625 119246 117058 115322 114131 113409 113043 112885 112643 112029 111042 109936 108860
54836 108860 107745 106572 105475 104478 103374 102039 100685 99681 99247 99398 100010 100834 101573 102099 102520 102977
54820 102977 103471 103884 104081 103976 103618 103189 102810 102474 102276 102498 103150 103665 103490 102870 102553 102747 102961 102963 103222
54801 103222 104113 105257 106026 106290 106305 106262 106401 107135 108585 110203 111293 111705 111695 111457 111224 111456 112325 113273
54783 113273 113681 113806 114395 115489 116320 116370 115858 115135 114339 113863 114416 116193 118505 120663 122782 125326 128265
54766 128265 131262 134425 138301 143148 148591 153988 158882 163106 166759 170051 173020 175392 176795 176921
54752 176921 175332 171442 165196 157707 150781 145628 142225 139864 137918 135927 133492 130546 127650 125525
$$ packed form
54867A68009L290K369R67o00j835k804l818m709n095n197n594o107n722l998j902
54852A27254p85r51j672k221k379k188j736j191p22l66j58k42o14r87j106j076
54836A08860j115j173j097r97j104j335j354j004m34J51O12Q24P39N26M21M57
54820A02977M94M13J97j05l58m29l79l36j98K22O52N15j75o20l17J94K14KK59
54801A03222Q91J144P69K64J5m3J39P34J450J618J090M12j0k38k33K32Q69R48
54783A13273M08J25N89J094Q31N0n12p23p96m76N53J777K312K158K119K544K939
54766A28265K997L163L876M847N443N397M894M224L653L292K969K372J403J26
54752A76921j589l890o246p489o926n153l403k361j946j991k435k946k896k125
$$ plain form
54738 125525 124241 123128 121674 120251 119738 120493 121897 122956 123208 123001 122963 123354 123934 124465 125171 126619 129061
54721 129061 132065 134993 137810 141194 145777 151416 157365 162968 167976 172223 175308 176728 176208 173768
54707 173768 169600 164121 158137 152646 148159 144274 140164 135611 131330 128169 126191 124787 123449 122087
54693 122087 120734 119441 118550 118506 119140 119488 118715 116981 115076 113450 112014 110743 109951 109922 110609 111745 112920
54676 112920 113514 113045 111796 110792 110807 111529 111958 111500 110388 109136 107956 106898 106260 106476 107481 108441 108381
54659 108381 107149 105686 105257 106426 108631 110625 111393 110885 109949 109441 109392 109218 108721 108453 108906 109751 110264
54642 110264 110250 110110 110134 110217 110233 110177 109883 109091 107960 107097 106847 106925 106992 107191 107802 108663 109418 110134 111199 112529
54622 112529 113363 113020 111665 110180 109315 109040 108675 107647 106205 105303 105668 106978 108155 108418 107892 107178 106658
$$ packed form
54738A25525j284j113j454j423n13P55J404J059K52k07l8L91N80N31P06J448K442
54721A29061L004K928K817L384M583N639N949N603N008M247L085J420n20k440
54707A73768m168n479n984n491m487l885m110m553m281l161j978j404j338j362
54693A22087j353j293q91m4O34L48p73j734j905j626j436j271p92k9O87J136J175
54676A12920N94m69j249j004J5P22M29m58j112j252j180j058o38K16J005R60o0
54659A08381j232j463m29J169K205J994P68n08r36n08m9j74m97k68M53Q45N13
54642A10264j4j40K4Q3J6n6k94p92j131q63k50P8O7J99O11Q61P55P16J065J330
54622A12529Q34l43j355j485q65k75l65j028j442r02L65J310J177K63n26p14n20
$$ plain form
54605 106658 106457 106845 108176 110246 112059 112592 111821 110663 109888 109404 108821 108323 108517 109488 110607 111401 112106
54588 112106 112996 113623 113326 112327 111617 111652 111780 111332 110757 111084 112470 113902 114453 114281 114171 114483 114953 115330
54570 115330 115722 116313 116981 117352 117129 116338 115341 114547 114048 113622 113230 113292 114169 115509 116493 116790 116785 116741 116227 114829
54550 114829 113136 112439 113375 115266 116861 117511 117513 117560 118060 118981 120125 121416 122829 124125 124855 124745 124010
54533 124010 123145 122498 122050 121557 120847 120118 119971 120885 122557 124007 124561 124474 124346 124245 123839 123162 122675 122545
54515 122545 122374 121794 120959 120247 119777 119409 119000 118494 117945 117548 117469 117534 117367 116931 116682 117043 117966 119135 120321
54496 120321 121308 121809 121783 121649 121790 121962 121540 120349 118949 118098 118174 119167 120915 123180 125643 127963 129825
54479 129825 130956 131265 131046 130866 131099 131618 132016 132073 131864 131556 131269 131143 131313 131685 131893 131714 131469 131792 132942
$$ packed form
54605A06658k01L88J331K070J813N33p71j158p75m84n83m98J94R71J119P94P05
54588A12106Q90O27k97r99p10L5J28m48n75L27J386J432N51j72j10L12M70L77
54570A15330L92N91O68L71k23p91r97p94m99m26l92O2Q77J340R84K97nm4n14j398
54550A14829j693o97R36J891J595O50KM7N00R21J144J291J413J296P30j10p35
54533A24010q65o47m48m93p10p29j47R14J672J450N54q7j28j01m06o77m87j30
54515A22545j71n80q35p12m70l68m09n06n49l97p9O5j67m36k49L61R23J169J186
54496A20321R87N01k6j34J41J72m22j191j400q51P6R93J748K265K463K320J862
54479A29825J131L09k19j80K33N19L98N7k09l08k87j26J70L72K08j79k45L23J150
$$ plain form
54460 132942 134512 135904 136836 137270 137122 136448 135845 136158 137534 138965 139090 137469 134922 132626 131102 130137
54444 130137 129456 129116 129184 129369 129302 129019 128818 128680 128310 127817 127792 128435 129055 128945 128431 128441 129264 130402 131579
54425 131579 133151 135270 137256 138224 138016 137238 136681 136866 137831 139091 140065 140719 141475 142314 142495 141553 140172
54408 140172 139513 139871 140511 140677 140269 139595 138988 138755 139043 139654 140264 140874 141741 142839 143811 144525 145264 146173
54390 146173 146927 147218 147232 147289 147303 147023 146655 146727 147258 147538 146924 145594 144314 143720 144025 145165 146836 148516
54372 148516 149840 150966 152213 153384 153894 153708 153655 154541 156349 158661 161356 164334 166909 168334 168861 169520
54356 169520 170651 171353 170648 168627 166117 163750 161772 160229 158802 156812 154004 151153 149352 148818 148800
54341 148800 148532 147802 146736 145575 144690 144358 144392 144355 144130 143938 143771 143204 141901 140005 137998 136472 136011
$$ packed form
54460A32942J570J392R32M34j48o74o03L13J376J431J25j621k547k296j524r65
54444A30137o81l40O8J85o7k83k01j38l70m93k5O43O20j10n14J0Q23J138J177
54425A31579J572K119J986R68k08p78n57J85R65J260R74O54P56Q39J81r42j381
54408A40172o59L58O40J66m08o74o07k33K88O11O10O10Q67J098R72P14P39R09
54390A46173P54K91J4N7J4k80l68P2N31K80o14j330j280n94L05J140J671J680
54372A48516J324J126J247J171N10j86n3Q86J808K312K695K978K575J425N27O59
54356A69520J131P02p05k021k510k367j978j543j427j990k808k851j801n34j8
54341A48800k68p30j066j161q85l32L4l7k25j92j67n67j303j896k007j526m61
$$ plain form
54324 136011 136791 138194 139252 139717 140274 141463 142811 143498 143542 143741 144506 145285 145301 144443 143190 141917 140600
54307 140600 139106 137528 136164 135294 135006 135120 135304 135348 135363 135561 135796 135557 134573 133303 132588 132814 133626 134366
54289 134366 134574 134091 133002 131678 130638 130240 130555 131524 133015 134731 136355 137864 139408 140759 141307 140788
54273 140788 139686 138691 138117 138078 138786 140205 141785 143017 144020 145040 145696 145403 144449 143925 144470 145700 147002
54256 147002 148298 149745 151213 152445 153409 154168 154624 154769 154962 155646 156794 157847 158203 157730 156767 155662
54240 155662 154340 152503 150310 148529 147657 147160 146108 144435 142971 142261 142018 141904 142134 142853 143545 143615 143271
54223 143271 143242 143842 144788 145802 146852 147815 148414 148611 148769 149226 149912 150492 150761 150812 150848 150885 150593 149540 147655
54204 147655 145384 143353 141963 141366 141607 142575 143851 144874 145357 145470 145563 145771 145911 145777 145420 145073 144838
$$ packed form
54324A36011P80J403J058M65N57J189J348O87M4J99P65P79J6q58j253j273j317
54307A40600j494j578j364q70k88J14J84M4J5J98K35k39r84j270p15K26Q12P40
54289A34366K08m83j089j324j040l98L15R69J491J716J624J509J544J351N48n19
54273A40788j102r95n74l9P08J419J580J232J003J020O56k93r54n24N45J230J302
54256A47002J296J447J468J232R64P59M56J45J93O84J148J053L56m73r63j105
54240A55662j322j837k193j781q72m97j052j673j464p10k43j14K30P19O92P0l44
54223A43271k9O00R46J014J050R63N99J97J58M57O86N80K69N1L6L7k92j053j885
54204A47655k271k031j390n97K41R68J276J023M83J13R3K08J40j34l57l47k35
$$ plain form
54187 144838 144624 144467 144679 145488 146687 147872 148880 149723 150263 150331 150133 150133 150470 150838 150945 150732 150136 149088
54169 149088 147867 147067 147017 147543 148379 149358 150095 149978 148863 147410 146445 146239 146566 147056 147206 146529 145116 143717
54151 143717 142893 142421 141927 141618 141811 142096 141686 140539 139519 139392 140135 141227 142157 142610 142561 142322 142264 142432
54133 142432 142623 142702 142579 142069 141097 139973 139166 138942 139441 140815 142867 144885 146381 147795 149834 152253
54117 152253 153975 154453 154262 154292 154975 156376 158314 160192 161358 161975 162971 164834 166998 168807 170454 172486
54101 172486 174866 177191 179450 181864 184123 185483 185696 185255 184566 183395 181446 179172 177551 176985 176736
54086 176736 175717 173782 171985 171433 172144 173326 174494 175760 177066 177814 177610 176868 176202 175544 174405 172858
54070 172858 171626 171063 170570 169357 167523 166010 165510 165727 165871 165667 165607 166217 167370 168483 169193 169609 169973
$$ packed form
54187A44838k14j57K12Q09J199J185J008Q43N40O8j98%L37L68J07k13n96j048
54169A49088j221q00n0N26Q36R79P37j17j115j453r65k06L27M90J50o77j413j399
54151A43717q24m72m94l09J93K85m10j147j020j27P43J092R30M53m9k39n8J68
54133A42432J91P9j23n10r72j124q07k24M99J374K052K018J496J414K039K419
54117A52253J722M78j91L0O83J401J938J878J166O17R96J863K164J809J647K032
54101A72486K380K325K259K414K259J360K13m41o89j171j949k274j621n66k49
54086A76736j019j935j797n52P11J182J168J266J306P48k04p42o66o58j139j547
54070A72858j232n63m93j213j834j513n00K17J44k04o0O10J153J113P10M16L64
$$ plain form
54053 169973 170314 170450 170269 169988 170206 171488 173748 176297 178667 181157 184236 187711 190977 193915 196993
54038 196993 200522 204350 208305 212379 216439 220341 224493 229633 235789 241991 247340 251853 255928 259491
54024 259491 262175 263965 265166 266040 266899 268205 270071 271836 272620 272153 270738 268586 265664 262048 258025
54009 258025 253853 249691 245680 241871 238180 234610 231278 228089 224743 221305 218359 216214 214341 212010
53995 212010 209112 205878 202302 198477 195093 192840 191547 190639 190199 190716 191971 193088 193688 194082 194286 193828
53979 193828 192801 192127 192380 193146 194024 195428 197757 200457 202747 204794 207427 210929 214869 219005 223646
53964 223646 229066 235031 240924 245894 248857 248865 245788 240560 234650 229291 225003 221567 218438 215345 212613
53949 212613 210900 210653 211793 213799 216073 218315 220582 222977 225487 228288 231932 236765 242226 247178
$$ packed form
54053A69973L41J36j81k81K18J282K260K549K370K490L079L475L266K938L078
54038A96993L529L828L955M074M060L902M152N140O156O202N349M513M075L563
54024B59491K684J790J201Q74Q59J306J866J765P84m67j415k152k922l616m023
54009B58025m172m162m011l809l691l570l332l189l346l438k946k145j873k331
53995B12010k898l234l576l825l384k253j293r08m40N17J255J117O00L94K04m58
53979A93828j027o74K53P66Q78J404K329K700K290K047K633L502L940M136M641
53964B23646N420N965N893M970K963Ql077n228n910n359m288l436l129l093k732
53949B12613j713k47J140K006K274K242K267K395K510K801L644M833N461M952
$$ plain form
53935 247178 250983 253892 256436 258972 261773 264857 267574 269126 269864 271324 274446 278380 281684 284200
53921 284200 286936 290525 294669 298956 303389 308065 312964 318141 323600 328993 333976 338882 344405 350493
53907 350493 356102 360228 362768 364204 364902 364986 364579 363814 362692 361001 358356 354455 349506 344227 339086
53892 339086 333714 327527 320758 314303 308566 303079 297361 291516 285776 280043 274200 268387 262683 257041
53878 257041 251885 248210 246451 245592 244015 241110 237586 234309 231365 228326 225030 221886 219475 217855
53864 217855 216275 213903 210951 208652 207733 207313 205935 203439 201053 199594 198425 196558 194099 191955 190473
53849 190473 189175 187822 186994 187286 188325 189069 188972 188450 188208 188467 188972 189431 189703 189688 189389 189008 188800 188801 188883
53830 188883 189057 189511 190301 191224 192018 192560 192869 193105 193515 194110 194393 193802 192550 191716 192238 194002 196137 197924
$$ packed form
53935B47178L805K909K544K536K801L084K717J552P38J460L122L934L304K516
53921B84200K736L589M144M287M433M676M899N177N459N393M983M906N523O088
53907C50493N609M126K540J436O98Q4m07p65j122j691k645l901m949n279n141
53892C39086n372o187o769o455n737n487n718n845n740n733n843n813n704n642
53878B57041n156l675j759q59j577k905l524l277k944l039l296l144k411j620
53864B17855j580k372k952k299r19m20j378k496k386j459j169j867k459k144j482
53849A90473j298j353q28K92J039P44r7n22k42K59N05M59K72j5k99l81k08JQ2
53830A88883J74M54P90R23P94N42L09K36M10N95K83n91j252q34N22J764K135J787
$$ plain form
53812 197924 199155 199881 200309 201005 202736 205846 209870 213889 217271 220072 222852 226149 230121 234572 239207
53797 239207 243725 247836 251453 254923 258805 263269 267905 272196 275944 279065 281295 282488 283029 283560 284274
53782 284274 284756 284512 283329 281127 277797 273458 268646 264020 259864 256019 252276 248690 245460 242627 240018
53767 240018 237460 234843 231909 228243 223781 219166 215219 212062 209193 206495 204607 203946 203849 203255 202034
53752 202034 201015 200686 200443 199368 197399 195453 194498 194630 195003 194675 193595 192706 192926 194095 195156 195331
53736 195331 194835 194400 194405 194674 194950 195334 196201 197756 199687 201362 202439 203238 204413 206326 208791 211334 213558
53719 213558 215360 216931 218496 219971 221002 221474 221750 222268 223177 224559 226568 228920 230676 231230 231360 232564
53703 232564 235281 238492 241207 243579 246206 249087 251830 254462 257362 260599 263893 267131 270442 273798
$$ packed form
53812A97924J231P26M28O96J731L110M024M019L382K801K780L297L972M451M635
53797B39207M518M111L617L470L882M464M636M291L748L121K230J193N41N31P14
53782B84274M82k44j183k202l330m339m812m626m156l845l743l586l230k833k609
53767B40018k558k617k934l666m462m615l947l157k869k698j888o61r7n94j221
53752B02034j019l29k43j075j969j946r55J32L73l28j080q89K20J169J061J75
53736A95331m96m35NK69K76L84Q67J555J931J675J077P99J175J913K465K543K224
53719B13558J802J571J565J475J031M72K76N18R09J382K009K352J756N54J30J204
53703B32564K717L211K715K372K627K881K743K632K900L237L294L238L311L356
$$ plain form
53689 273798 276906 279534 281717 283578 285054 285755 285167 283274 280958 279344 278531 277487 275538 273515 272770
53674 272770 273476 274617 275505 276426 277618 278388 277772 275716 273125 270884 269167 267663 266177 264892 264107 263857
53658 263857 263954 264396 265495 267366 269441 270834 271126 270512 269278 267594 265921 265103 265676 267267 268939 270013
53642 270013 270444 270671 271426 273469 277008 281289 285072 287735 289756 292065 295176 299082 303700 308923 314209
53627 314209 318598 321462 323114 324398 325805 327222 328448 329620 331127 333393 336738 341066 345609 349361
53613 349361 352052 354380 357070 360059 362892 365570 368538 371983 375637 379236 382755 386165 389275 391870
53599 391870 393787 394992 395842 397077 399041 400992 401715 400874 399303 397875 396611 395040 392900 390295 387654
53584 387654 385820 385542 386412 386745 385153 381959 378585 375798 373260 370611 368184 366461 365415 364667 363929
$$ packed form
53689B73798L108K628K183J861J476P01n88j893k316j614q13j044j949k023p45
53674B72770P06J141Q88R21J192P70o16k056k591k241j717j504j486j285p85k50
53658B63857R7M42J099J871K075J393K92o14j234j684j673q18N73J591J672J074
53642B70013M31K27P55K043L539M281L783K663K021K309L111L906M618N223N286
53627C14209M389K864J652J284J407J417J226J172J507K266L345M328M543L752
53613C49361K691K328K690K989K833K678K968L445L654L599L519L410L110K595
53599C91870J917J205Q50J235J964J951P23q41j571j428j264j571k140k605k641
53584C87654j834k78Q70L33j592l194l374k787k538k649k427j723j046p48p38
$$ plain form
53569 363929 363028 361828 360421 359181 358369 357799 357078 356015 354650 353119 351722 351015 351458 352882 354495 355532
53553 355532 355850 355866 356000 356316 356681 357158 358054 359547 361359 363004 364376 365982 368503 372165 376604 381253
53537 381253 385778 390160 394489 398825 403306 408338 414526 422232 431120 440296 449097 457751 467089 477573
53523 477573 488806 500191 511892 524775 539361 555215 571549 588106 605122 622671 640572
53512 640572 658989 678623 700072 723152 746993 770663 793695 816309 839206 862895 887025
53501 887025 910649 933300 955424 977551 999427 1020424 1040474 1059996 1079000 1096968 1113748
53490 1113748 1129979 1146349 1162864 1179142 1195091 1210960 1226977 1243237 1259774 1276431 1292795
53479 1292795 1308475 1323267 1336826 1348531 1358066 1365925 1372780 1378407 1381800 1382384 1380563 1376825 1370874
$$ packed form
53569C63929r01j200j407j240q12n70p21j063j365j531j397p07M43J424J613J037
53553C55532L18J6J34L16L65M77Q96J493J812J645J372J606K521L662M439M649
53537C81253M525M382M329M336M481N032O188P706Q888R176Q801Q654R338J0484
53523D77573J1233J1385J1701J2883J4586J5854J6334J6557J7016J7549J7901
53512F40572J8417J9634K1449K3080K3841K3670K3032K2614K2897K3689K4130
53501H87025K3624K2651K2124K2127K1876K0997K0050J9522J9004J7968J6780
53490A113748J6231J6370J6515J6278J5949J5869J6017J6260J6537J6657J6364
53479A292795J5680J4792J3559J1705R535P859O855N627L393N84j821l738n951
$$ plain form
53466 1370874 1362076 1350508 1337098 1322874 1308391 1293793 1279075 1264233 1249344 1234442 1219209
53455 1219209 1202944 1185157 1166101 1146491 1126779 1107040 1087422 1068212 1049414 1030726 1012145
53444 1012145 994166 977277 961680 947792 936490 928291 922543 917985 913945 910536 907864 905741 904232
53431 904232 903807 904716 906670 909480 913605 919673 927670 936933 946799 957022 967750 979405 992513 1007394
53417 1007394 1024016 1042240 1062085 1083619 1106802 1131582 1157987 1185935 1215146 1245493 1277226
53406 1277226 1310616 1345572 1381924 1419845 1459662 1501419 1544992 1590447 1637769 1686390 1735610
53395 1735610 1785497 1836712 1889315 1942391 1995124 2047646 2100353 2152929 2204595 2254976 2304068
53384 2304068 2351559 2396808 2439455 2479509 2516826 2550984 2581718 2609068 2632960 2653037 2668943
$$ packed form
53466A370874q798j1568j3410j4224j4483j4598j4718j4842j4889j4902j5233
53455A219209j6265j7787j9056j9610j9712j9739j9618j9210j8798j8688j8581
53444A012145j7979j6889j5597j3888j1302q199n748m558m040l409k672k123j509
53431I04232m25R09J954K810M125O068P997R263R866J0223J0728J1655J3108J4881
53417A007394J6622J8224J9845K1534K3183K4780K6405K7948K9211L0347L1733
53406A277226L3390L4956L6352L7921L9817M1757M3573M5455M7322M8621M9220
53395A735610M9887N1215N2603N3076N2733N2522N2707N2576N1666N0381M9092
53384B304068M7491M5249M2647M0054L7317L4158L0734K7350K3892K0077J5906
$$ plain form
53373 2668943 2680409 2687019 2688357 2684499 2675814 2662043 2642123 2615398 2582631 2545326 2504361 2459892
53361 2459892 2412388 2363000 2312757 2261962 2210640 2159086 2107737 2056941 2007271 1959696 1914935
53350 1914935 1872725 1832099 1792348 1753344 1715037 1677170 1639562 1602322 1565621 1529640 1494903
53339 1494903 1462203 1431819 1403091 1375213 1348309 1323301 1300877 1281072 1263834 1249260 1236962
53328 1236962 1225658 1213955 1201410 1188477 1175576 1162623 1149447 1136246 1123468 1111485 1100509
53317 1100509 1090666 1081959 1074309 1067783 1062735 1059583 1058364 1058569 1059502 1060862 1062939 1066215 1070871 1076843
53303 1076843 1084282 1093573 1104773 1117398 1131097 1146235 1163336 1182101 1201599 1221454 1242310 1264927
53291 1264927 1289316 1314946 1341229 1367322 1391970 1414209 1434149 1452608 1470093 1486544 1501794
$$ packed form
53373B668943J1466O610J338l858q685j3771j9920k6725l2767l7305m0965m4469
53361B459892m7504m9388n0243n0795n1322n1554n1349n0796m9670m7575m4761
53350A914935m2210m0626l9751l9004l8307l7867l7608l7240l6701l5981l4737
53339A494903l2700l0384k8728k7878k6904k5008k2424j9805j7238j4574j2298
53328A236962j1304j1703j2545j2933j2901j2953j3176j3201j2778j1983j0976
53317A100509r843q707p650o526n048l152j219K05R33J360K077L276M656N972
53303A076843P439R291J1200J2625J3699J5138J7101J8765J9498J9855K0856K2617
53291A264927K4389K5630K6283K6093K4648K2239J9940J8459J7485J6451J5250
$$ plain form
53280 1501794 1515603 1527226 1535646 1540495 1542308 1541689 1538647 1532963 1524691 1513924 1500498 1484392 1466134
53267 1466134 1446349 1425102 1402187 1377905 1352953 1327548 1301254 1273865 1245962 1218248 1190719
53256 1190719 1162973 1135125 1107900 1081754 1056322 1031003 1005834 981436 958123 935368 912292
53245 912292 888562 864605 841091 818464 796961 776718 757537 738759 719718 700467 681899
53234 681899 665037 650303 637483 626254 616524 608249 601059 594248 587193 579739 572108 564470 556681
53221 556681 548395 539265 529061 517773 505727 493456 481370 469624 458370 447925 438489 429847
53209 429847 421613 413672 406130 398899 391661 384337 377282 370875 365062 359391 353328 346500 338911 331157
53195 331157 324162 318389 313399 308400 303166 298067 293273 288379 283063 277779 273418 270353 268115 266034
$$ packed form
53280A501794J3809J1623Q420M849J813o19l042n684q272j0767j3426j6106j8258
53267A466134j9785k1247k2915k4282k4952k5405k6294k7389k7903k7714k7529
53256A190719k7746k7848k7225k6146k5432k5319k5169k4398k3313k2755k3076
53245I12292k3730k3957k3514k2627k1503k0243j9181j8778j9041j9251j8568
53234F81899j6862j4734j2820j1229r730q275p190o811p055p454p631p638p789
53221E56681q286r130j0204j1288j2046j2271j2086j1746j1254j0445r436q642
53209D29847q234p941p542p231p238p324p055o407n813n671o063o828p589p754
53195C31157o995n773m990m999n234n099m794m894n316n284m361l065k238k081
$$ plain form
53181 266034 263847 261617 259371 257152 255258 254086 253648 253486 253178 252659 251961 250882 249250 247396 245953
53166 245953 245072 244118 242342 239729 237014 234984 233926 233597 233490 233108 232271 231334 230963 231484 232477 233147 233057
53149 233057 232378 231540 230893 230745 231366 232654 233989 234710 234739 234478 234195 233822 233413 233371 234002 235081 236134 237039
53131 237039 238115 239580 241129 242098 242099 241549 241467 242515 244206 245357 245375 244785 244412 244514 245047 246227 248202
53114 248202 250452 252224 253533 255019 256705 257579 256772 254661 252349 250367 248359 245883 243104 240629 238886
53099 238886 237689 236396 234593 232659 231483 231463 231989 232083 231360 230209 229211 228665 228554 228671 228711 228460 227955 227340
53081 227340 226578 225449 223889 222263 221182 221018 221598 222423 223148 223727 224105 224069 223605 223167 223195 223484 223388 222626
53063 222626 221463 220105 218443 216579 215092 214469 214606 215184 216135 217369 218375 218628 218268 217995 218362 219484
$$ packed form
53181B66034k187k230k246k219j894j172m38j62l08n19o98j079j632j854j443
53166B45953q81r54j776k613k715k030j058l29j07l82q37r37l71N21R93O70r0
53149B33057o79q38o47j48O21J288J335P21K9k61k83l73m09m2O31J079J053R05
53131B37039J076J465J549R69Jn50q2J048J691J151J8n90l73J02N33J180J975
53114B48202K250J772J309J486J686Q74q07k111k312j982k008k476k779k475j743
53099B38886j197j293j803j934j176k0N26R4p23j151r98n46j11J17M0k51n05o15
53081B27340p62j129j560j626j081j64N80Q25P25N79L78l6m64m38K8K89r6p62
53063B22626j163j358j662j864j487o23J37N78R51J234J006K53l60k73L67J122
$$ plain form
53047 219484 221200 223074 224360 224508 223827 223259 223381 223865 223975 223336 222191 221137 220673 220838 221219 221414 221377
53030 221377 221218 220850 220158 219399 219056 219259 219645 219856 219955 220292 221141 222444 223741 224412 224194 223483 222926 222820
53012 222820 223059 223493 223992 224300 224287 224303 224832 225794 226581 226889 227063 227486 228044 228397 228414 228110 227440 226453 225486 225011
52992 225011 225366 226630 228456 230001 230396 229556 228270 227453 227521 228488 230163 232055 233648 235121 237310 240466
52976 240466 243474 244925 244729 244046 243778 243829 243919 244380 245700 247618 249125 249372 248477 247446 247290 248114 249081
52959 249081 249374 249057 248786 248849 248873 248527 248044 247781 247534 246693 245067 243205 241748 240600 239034 236639 233915
52942 233915 231741 230436 229693 229374 229754 230807 231767 231920 231484 231131 230954 230613 230416 231272 233237 234941 235038
52925 235038 233748 232310 231348 230549 229679 228957 228339 227368 226145 225694 226701 228365 229248 228965 228319 227880 227296
$$ packed form
53047B19484J716J874J286J48o81n68J22M84J10o39j145j054m64J65L81J95l7
53030B21377j59l68o92p59l43K03L86K11R9L37Q49J303J297O71k18p11n57j06
53012B22820K39M34M99L08j3J6N29R62P87L08J74M23N58L53J7l04o70r87r67m75
52992B25011L55J264J826J545L95q40j286q17O8R67J675J892J593J473K189L156
52976B40466L008J451j96o83k68N1R0M61J320J918J507K47q95j031j56Q24R67
52959B49081K93l17k71O3K4l46m83k63k47q41j626j862j457j148j566k395k724
52942B33915k174j305p43l19L80J053R60J53m36l53j77l41j97Q56J965J704R7
52925B35038j290j438r62p99q70p22o18r71j223m51J007J664Q83k83o46m39n84
$$ plain form
52908 227296 226182 224917 224107 223756 223508 223365 223605 224186 224758 225218 225752 226349 226738 226900 227210 227882 228627 229048
52890 229048 229038 228596 227586 226019 224362 223233 222805 222824 223106 223755 224822 226061 227206 228364 229872 231797
52874 231797 233753 235392 236937 238926 241386 243564 244732 245008 245039 245073 244853 244409 244392 245354 247069 248856 250329
52857 250329 251509 252448 253062 253243 252828 251491 248918 245156 240680 236145 232107 228809 226091 223592 221124
52842 221124 218775 216635 214631 212737 211133 209992 209275 208923 209034 209627 210323 210504 209803 208417 207077 206665
52826 206665 207558 209207 210633 211496 212339 213645 215060 215893 215980 215642 215129 214596 214378 214760 215539 216324 217069 217916
52808 217916 218707 219209 219657 220428 221264 221531 221232 221012 221004 220446 218728 216215 213690 211586 210161 209818 210648 212006
52790 212006 213046 213486 213519 213287 212870 212488 212287 212074 211647 211191 210995 210994 210963 210975 211329 212198 213645 215681 217913
$$ packed form
52908B27296j114j265q10l51k48j43K40N81N72M60N34N97L89J62L10O72P45M21
52890B29048j0m42j010j567j657j129m28J9K82O49J067J239J145J158J508J925
52874B31797J956J639J545J989K460K178J168K76L1L4k20m44j7R62J715J787J473
52857B50329J180R39O14J81m15j337k573l762m476m535m038l298k718k499k468
52842B21124k349k140k004j894j604j141p17l52J11N93O96J81p01j386j340m12
52826B06665Q93J649J426Q63Q43J306J415Q33Q7l38n13n33k18L82P79P85P45Q47
52808B17916P91N02M48P71Q36K67k99k20qn58j718k513k525k104j425l43Q30J358
52790B12006J040M40L3k32m17l82k01k13m27m56j96jl1J2L54Q69J447K036K232
$$ plain form
52771 217913 219401 219404 218150 216438 214724 213067 211756 211234 211384 211563 211492 211554 211991 212401 212311 211858 211565 211758
52753 211758 212475 213614 214878 215857 216466 217121 218227 219673 221098 222430 223856 225391 226806 227942 228925
52738 228925 230053 231623 233695 235866 237394 237784 237243 236498 236308 237164 239111 241518 243270 243650 243008 242246
52722 242246 241712 241016 239921 238815 238050 237217 235582 233142 230830 229554 229295 229297 229006 228644 228810 229669 230618
52705 230618 230831 230064 228909 228253 228533 229505 230662 231766 232873 233908 234452 234119 233039 231747 230655 229883
52689 229883 229537 229692 229977 229633 228335 226649 225329 224440 223628 222989 223039 223855 224898 225728 226297 226443 225789 224542
52671 224542 223752 224266 225749 227201 228076 228430 228283 227555 226548 225916 226114 227211 229150 231729 234400 236655
52655 236655 238626 240833 243282 245355 246709 247762 249006 250307 251193 251427 250956 249622 247390 244705 242240
$$ packed form
52771B17913J488Lj254j712j714j657j311n22J50J79p1O2M37M10r0m53k93J93
52753B11758P17J139J264R79O09O55J106J446J425J332J426J535J415J136R83
52738B28925J128J570K072K171J528L90n41p45j90Q56J947K407J752L80o42p62
52722B42246n34o96j095j106p65q33j635k440k312j276k59Kk91l62J66Q59R49
52705B30618K13p67j155o56K80R72J157J104J107J035N44l33j080j292j092p72
52689B29883l46J55K85l44j298j686j320q89q12o39N0Q16J043Q30N69J46o54j247
52671B24542p90N14J483J452Q75L54j47p28j007o32J98J097J939K579K671K255
52655B36655J971K207K449K073J354J053J244J301Q86K34m71j334k232k685k465
$$ plain form
52640 242240 240429 239419 239323 240129 241423 242490 242746 242024 240546 238826 237427 236673 236603 237223 238549 240308
52624 240308 241962 243247 244410 245549 246047 245152 243015 240672 239018 238185 237923 238064 238429 238678 238566 238229
52608 238229 237994 238024 238279 238696 239301 240140 241150 242091 242674 242889 243106 243644 244279 244428 243890 243183 243009 243501 244169
52589 244169 244506 244548 244827 245797 247346 248871 249818 250024 249599 248740 247801 247308 247523 248079 248357 248183 247902 247820 247880
52570 247880 247901 247790 247457 246849 246209 246012 246499 247406 248236 248524 247878 246173 243954 242241 241562 241387 240890 240031
52552 240031 239435 239403 239570 239563 239405 239131 238551 237813 237696 238748 240284 240972 240492 240001 240597 241888 242615 242379 242021
52533 242021 242296 242896 243112 242953 243062 243753 244652 245256 245490 245609 245829 246183 246637 247252 248166 249339 250363 250749
52515 250749 250514 250279 250658 251707 253081 254448 255606 256580 257913 260418 264141 267799 269877 270179 269764 269479
$$ packed form
52640B42240j811j010r6Q06J294J067K56p22j478j720j399p54p0O20J326J759
52624B40308J654J285J163J139M98q95k137k343j654q33k62J41L65K49j12l37
52608B38229k35L0K55M17O05Q39J010R41N83K15K17N38O35J49n38p07j74M92O68
52589B44169L37M2K79R70J549J525R47K06m25q59r39m93K15N56K78j74k81q2O0
52570B47880K1j11l33o08o40j97M87R07Q30K88o46j705k219j713o79j75m97q59
52552B40031n96l2J67pj58k74n80p38j17J052J536O88m80m91N96J291P27k36l58
52533B42021K75O00K16j59J09O91Q99O04K34J19K20L54M54O15R14J173J024L86
52515B50749k35k35L79J049J374J367J158R74J333K505L723L658K078L02m15k85
$$ plain form
52499 269479 269254 268831 268321 267650 266154 263319 259606 256011 253000 250286 247587 245179 243667 243386 244011 244715
52483 244715 244811 244296 243671 243275 243049 242939 243123 243740 244732 246091 247863 249747 251141 251898 252659 254085 256088
52466 256088 258191 260216 262167 263793 264959 266250 268479 271480 274063 275412 276030 276986 278533 279817 279762
52451 279762 277894 274416 269832 264749 259897 256022 253476 251930 250740 249690 249166 249481 250279 250878 251026
52436 251026 251067 251429 252188 253069 253574 253203 251821 249885 248156 247130 246869 247272 248224 249449 250441 250741 250332
52419 250332 249792 249963 251326 253612 256210 258916 262017 265512 268694 270897 272439 274467 278018 283475 290666
52404 290666 298969 307349 314826 320978 325732 328712 329298 327381 323618 318805 313300 307234 300922 294890
52390 294890 289734 286026 284024 283294 282938 282478 282244 282677 283491 283902 283542 282852 282621 283412 285377 288259 291463
$$ packed form
52499B69479k25m23n10o71j496k835l713l595l011k714k699k408j512k81O25P04
52483B44715R6n15o25l96k26j10J84O17R92J359J772J884J394P57P61J426K003
52466B56088K103K025J951J626J166J291K229L001K583J349O18R56J547J284n5
52451B79762j868l478m584n083m852l875k546j546j190j050n24L15P98N99J48
52436B51026M1L62P59Q81N05l71j382j936j729j026k61M03R52J225R92L00m09
52419B50332n40J71J363K286K598K706L101L495L182K203J542K028L551N457P191
52404B90666Q303Q380P477O152M754K980N86j917l763m813n505o066o312o032
52390B94890n156l708k002p30l56m60k34M33Q14M11l60o90k31P91J965K882L204
$$ plain form
52373 291463 294394 296997 299892 303797 308735 313917 318465 322143 325291 328164 330603 332365 333476 334091
52359 334091 334236 333943 333522 333384 333587 333773 333613 333191 332934 333217 334054 335101 335981 336628 337239 337925 338684 339785
52341 339785 341859 345384 350254 356071 362566 369448 376170 382358 388356 394921 402494 411178 421230 432970
52327 432970 446150 459970 473874 488009 502875 518916 536428 555272 574583 593300 611158
52316 611158 628713 646250 663312 679541 695328 711131 726673 741355 755148 768507 781655
52305 781655 794495 807062 819526 831740 843143 853137 861421 868143 873956 879631 885216 889729 891987
52292 891987 891546 888604 883450 876599 869136 862057 855274 847991 840166 832913 827202 822851 819237 816413
52278 816413 814896 814819 816040 818925 824150 831439 839204 846115 852782 861227 872517 885405 897661 908428
$$ packed form
52373B91463K931K603K895L905M938N182M548L678L148K873K439J762J111O15
52359C34091J45k93m21j38K03J86j60m22k57K83Q37J047Q80O47O11O86P59J101
52341C39785K074L525M870N817O495O882O722O188N998O565P573Q684J0052J1740
52327D32970J3180J3820J3904J4135J4866J6041J7512J8844J9311J8717J7858
52316F11158J7555J7537J7062J6229J5787J5803J5542J4682J3793J3359J3148
52305G81655J2840J2567J2464J2214J1403R994Q284O722N813N675N585M513K258
52292H91987m41k942n154o851p463p079o783p283p825p253n711m351l614k824
52278H16413j517p7J221K885N225P289P765O911O667Q445J1290J2888J2256J0767
$$ plain form
52264 908428 918804 930199 942670 955062 966314 976266 985460 994578 1003991 1013462 1022310 1030127 1037294
52251 1037294 1044498 1051707 1057950 1062219 1064346 1064847 1064131 1062061 1058171 1052154 1044176 1034812 1024658 1013954
52237 1013954 1002643 990792 978863 967540 957331 948336 940286 932739 925353 918059 911011 904419 898534
52224 898534 893637 889849 886874 884117 881200 878294 875921 874547 874409 875548 877778 880690 883957 887748
52210 887748 892641 898917 905949 912493 917711 921841 925778 930119 934749 939209 943170 946471 949048 951095
52196 951095 953182 955927 959522 963666 967934 972098 976138 980175 984353 988631 992634 995839 997988 999213
52182 999213 999708 999399 997990 995166 990678 984387 976510 967828 959432 952040 945561 939365 932994 926564 920589
52167 920589 915593 911875 909462 908127 907560 907657 908587 910473 913125 916245 919811 923958 928492 932782 936226
$$ packed form
52264I08428J0376J1395J2471J2392J1252R952R194R118R413R471Q848P817P167
52251A037294P204P209O243M269K127N01p16k070l890o017p978r364j0154j0704
52237A013954j1311j1851j1929j1323j0209q995q050p547p386p294p048o592n885
52224H98534m897l788k975k757k917k906k373j374j38J139K230K912L267L791
52210H87748M893O276P032O544N218M130L937M341M630M460L961L301K577K047
52196I51095K087K745L595M144M268M164M040M037M178M278M003L205K149J225
52182I99213M95l09j409k824m488o291p877q682q396p392o479o196o371o430n975
52167I20589m996l718k413j335n67R7R30J886K652L120L566M147M534M290L444
$$ plain form
52152 936226 938600 939876 940063 939436 938659 938336 938470 938586 938384 938052 938024 938647 940125 942509 945582 948887 951993
52135 951993 954777 957417 960166 963207 966768 971328 977585 986094 996938 1009850 1024660 1041529 1060727
52122 1060727 1082330 1106125 1131643 1158208 1185161 1212181 1239242 1266128 1292137 1316399 1338433
52111 1338433 1358272 1376196 1392456 1407028 1419394 1428738 1434690 1437905 1439682 1440953 1441649 1440981 1438235
52098 1438235 1433528 1427956 1422809 1418332 1413421 1406811 1398371 1388829 1378462 1366695 1353081 1338080 1322579
52085 1322579 1307119 1291925 1277361 1263937 1252056 1242085 1234502 1229614 1227209 1226859 1228493 1232355 1238365
52072 1238365 1245831 1253924 1262336 1271442 1281943 1294248 1307974 1322067 1335687 1348918 1362324 1375776
52060 1375776 1388228 1398858 1407978 1416350 1423893 1429678 1433208 1435080 1436168 1436580 1435753 1433283 1429169 1423364
$$ packed form
52152I36226K374J276J87o27p77l23J34J16k02l32k8O23J478K384L073L305L106
52135I51993K784K640K749L041L561M560O257Q509J0844J2912J4810J6869J9198
52122A060727K1603K3795K5518K6565K6953K7020K7061K6886K6009K4262K2034
52111A338433J9839J7924J6260J4572J2366R344N952L215J777J271O96o68k746
52098A438235m707n572n147m477m911o610q440r542j0367j1767j3614j5001j5501
52085A322579j5460j5194j4564j3424j1881r971p583m888k405l50J634L862O010
52072A238365P466Q093Q412R106J0501J2305J3726J4093J3620J3231J3406J3452
52060A375776J2452J0630R120Q372P543N785L530J872J088M12q27k470m114n805
$$ plain form
52046 1423364 1415501 1405233 1392687 1378471 1363156 1346720 1328541 1308223 1286458 1264717 1243883
52035 1243883 1223625 1203476 1184096 1166768 1151853 1138558 1126254 1115225 1105793 1097423 1089253 1080979
$$ packed form
52046A423364p863j0268j2546j4216j5315j6436j8179k0318k1765k1741k0834
52035A243883k0258k0149j9380j7328j4915j3295j2304j1029r432q370q170q274
$$ [...]
##END NTUPLES=NMR SPECTRUM
##END=
