
##TITLE=AC1349_GUAAH12167_6647812_7JEnGtCvir
##JCAMPDX= 6.0         $$ Bruker NMR JCAMP-DX V2.0
##DATA TYPE= NMR SPECTRUM
##DATA CLASS= NTUPLES
##ORIGIN= BRUKER
##OWNER= Administrator
$$ 1.72 TOPSPIN		Version 2.1
$$ 2012-08-10 19:24:25.203 -0500  Administrator@TOPSPIN
$$ Compression mode = diff/dup
##.OBSERVE FREQUENCY= 400.02188249412
##.OBSERVE NUCLEUS= ^1H
##.ACQUISITION MODE= SIMULTANEOUS (DQD)
##.ACQUISITION SCHEME= undefined
##.AVERAGES= 8
##.DIGITISER RES= 22
##SPECTROMETER/DATA SYSTEM= spect
##.PULSE SEQUENCE= zg30
##.SOLVENT NAME= COFFEE_meoh
##.SHIFT REFERENCE= INTERNAL, COFFEE_meoh, 1, 14.98509
##AUDIT TRAIL= $$ (NUMBER, WHEN, WHO, WHERE, PROCESS, VERSION, WHAT)
$$ ##TITLE= Audit trail, TOPSPIN		Version 2.1
$$ ##JCAMPDX= 5.01
$$ ##ORIGIN= Bruker BioSpin GmbH
$$ ##OWNER= Administrator
$$ $$ C:\Bruker\TOPSPIN/data/COFFEE/nmr/AC1349_GUAAH12167_6647812_7JEnGtCvir/10/pdata/1/auditp.txt
$$ ##AUDIT TRAIL=  $$ (NUMBER, WHEN, WHO, WHERE, PROCESS, VERSION, WHAT)
(   1,<2012-08-10 19:24:17.125 -0500>,<Administrator>,<TOPSPIN>,<go>,<TOPSPIN 2.1>,
      <created by zg
	started at 2012-08-10 19:23:10.187 -0500,
	POWCHK enabled, PULCHK disabled,
       configuration hash MD5:
       6B 1B 68 BB D9 2E 58 E2 7F 35 AD 54 07 DF 0E 41
       data hash MD5: 64K
       F6 F9 1A 6C 02 23 C2 05 DB 0E EA 86 07 31 49 35>)
(   2,<2012-08-10 19:24:20.968 -0500>,<Administrator>,<TOPSPIN>,<proc1d>,<TOPSPIN 2.1>,
      <Start of raw data processing
       efp LB = 0 FT_mod = 6 PKNL = 1 PHC0 = 0 PHC1 = 0 SI = 32K 
       data hash MD5: 32K
       B4 96 3A 73 6D 76 28 3B 90 BF B3 ED CE 1D B0 B6>)
(   3,<2012-08-10 19:24:21.265 -0500>,<Administrator>,<TOPSPIN>,<proc1d>,<TOPSPIN 2.1>,
      <pk PHC0 = 178.5443 PHC1 = 0 
       data hash MD5: 32K
       7C 41 8E 13 2A CB 4F C6 4A 3B DA 33 87 C1 62 BC>)
(   4,<2012-08-10 19:24:21.437 -0500>,<Administrator>,<TOPSPIN>,<proc1d>,<TOPSPIN 2.1>,
      <abs ABSG = 1 
       data hash MD5: 32K
       EC 5D 0D 48 BF ED 8A B6 84 0F 6C 34 48 7B EE 5A>)
(   5,<2012-08-10 19:24:21.546 -0500>,<Administrator>,<TOPSPIN>,<proc1d>,<TOPSPIN 2.1>,
      <abs ABSG = 2 
       data hash MD5: 32K
       72 A3 87 DE 4A 4C 5D DE FD 8A 1C 52 D6 67 40 79>)
(   6,<2012-08-10 19:24:21.578 -0500>,<Administrator>,<TOPSPIN>,<proc1d>,<TOPSPIN 2.1>,
      <abs ABSG = 3 
       data hash MD5: 32K
       EB C9 D2 2C E1 B2 E8 E0 35 E7 00 1D 84 A7 B6 96>)
(   7,<2012-08-10 19:24:21.609 -0500>,<Administrator>,<TOPSPIN>,<proc1d>,<TOPSPIN 2.1>,
      <abs ABSG = 4 
       data hash MD5: 32K
       DA CF F3 A2 E0 73 2C 93 69 19 F6 33 18 4A 14 B5>)
(   8,<2012-08-10 19:24:21.640 -0500>,<Administrator>,<TOPSPIN>,<proc1d>,<TOPSPIN 2.1>,
      <abs ABSG = 5 
       data hash MD5: 32K
       FB 12 28 50 4D 8F 14 EB 20 E2 E9 4F E5 6B 47 92>)
$$ ##END=
$$ 
$$ $$ hash MD5
$$ $$ E4 45 11 03 26 96 08 0B 2C 5E 50 02 02 E3 10 1C
##$RELAX= 
##$RELAX= 
##$RELAX= 
##$RELAX= 
##$RELAX= 
##$RELAX= 
##$RELAX= 
$$ Bruker specific parameters
$$ --------------------------
$$ [...]
150 150 150 150 150 150 150 150
##$TP07= 0
##$TPNAME0= <>
##$TPNAME1= <>
##$TPNAME2= <>
##$TPNAME3= <>
##$TPNAME4= <>
##$TPNAME5= <>
##$TPNAME6= <>
##$TPNAME7= <>
##$TPOAL= (0..7)
0.5 0.5 0.5 0.5 0.5 0.5 0.5 0.5
##$TPOFFS= (0..7)
0 0 0 0 0 0 0 0
##$TUNHIN= 0
##$TUNHOUT= 0
##$TUNXOUT= 0
##$USERA1= <user>
##$USERA2= <user>
##$USERA3= <user>
##$USERA4= <user>
##$USERA5= <user>
##$V9= 5
##$VALIST= <valist>
##$VCLIST= <CCCCCCCCCCCCCCC>
##$VD= 0
##$VDLIST= <DDDDDDDDDDDDDDD>
##$VPLIST= <PPPPPPPPPPPPPPP>
##$VTLIST= <TTTTTTTTTTTTTTT>
##$WBST= 1024
##$WBSW= 4
##$XGAIN= (0..3)
0 0 0 0
##$XL= 0
##$YL= 0
##$YMAX_a= 453452
##$YMIN_a= -590083
##$ZGOPTNS= <>
##$ZL1= 120
##$ZL2= 120
##$ZL3= 120
##$ZL4= 120
##$ABSF1= 14.98509
##$ABSF2= -5.573092
##$ABSG= 5
##$ABSL= 3
##$ALPHA= 0
##$AQORDER= 0
##$ASSFAC= 0
##$ASSFACI= 0
##$ASSFACX= 0
##$ASSWID= 0
##$AUNMP= <proc_prof1d_extract_pilot.lims>
##$AXLEFT= 0
##$AXNAME= <>
##$AXNUC= <1H>
##$AXRIGHT= 0
##$AXTYPE= 0
##$AXUNIT= <>
##$AZFE= 0.1
##$AZFW= 0.1
##$BCFW= 0
##$BC_mod= 0
##$BYTORDP= 0
##$COROFFS= 0
##$CY= 15
##$DATMOD= 1
##$DC= 0
##$DFILT= <>
##$DTYPP= 0
##$F1P= 0
##$F2P= 0
##$FCOR= 0.5
##$FTSIZE= 32768
##$FT_mod= 6
##$GAMMA= 0
##$GB= 0
##$INTBC= 1
##$INTSCL= 1
##$ISEN= 128
##$LB= 0
##$LEV0= 0
##$LPBIN= 0
##$MAXI= 10000
##$MC2= 0
##$MEAN= 0
##$ME_mod= 0
##$MI= 0
##$NCOEF= 0
##$NC_proc= -8
##$NLEV= 6
##$NOISF1= 0
##$NOISF2= 0
##$NSP= 0
##$NTH_PI= 0
##$NZP= 0
##$OFFSET= 14.98509
##$PC= 1
##$PHC0= 178.5443
##$PHC1= 0
##$PH_mod= 1
##$PKNL= yes
##$PPARMOD= 0
##$PPDIAG= 0
##$PPIPTYP= 0
##$PPMPNUM= 2147483647
##$PPRESOL= 1
##$PSCAL= 4
##$PSIGN= 0
##$PYNMP= <proc.py>
##$REVERSE= no
##$SF= 400.02
##$SI= 32768
##$SIGF1= 0
##$SIGF2= 0
##$SINO= 400
##$SIOLD= 32768
##$SPECTYP= <>
##$SREGLST= <1H.CDCl3>
##$SSB= 0
##$STSI= 32768
##$STSR= 0
##$SW_p= 8223.68421052631
##$SYMM= 0
##$S_DEV= 0
##$TDeff= 65536
##$TDoff= 0
##$TI= <>
##$TILT= no
##$TM1= 0
##$TM2= 0
##$TOPLEV= 0
##$USERP1= <user>
##$USERP2= <user>
##$USERP3= <user>
##$USERP4= <user>
##$USERP5= <user>
##$WDW= 1
##$XDIM= 32768
##$YMAX_p= 459951999
##$YMIN_p= -699160
##$CURPLOT= <Network HP LaserJet P1505>
##$CURPRIN= <$Network HP LaserJet P1505>
##$DFORMAT= <normdp>
##$LAYOUT= <+/1D_H.xwp>
##$LFORMAT= <normlp>
##$PFORMAT= <normpl>
##$SURQMSG= 1
$$ End of Bruker specific parameters
$$ ---------------------------------
##NTUPLES= NMR SPECTRUM
##VAR_NAME=  FREQUENCY,     SPECTRUM/REAL,   SPECTRUM/IMAG
##SYMBOL=    X,             R,               I
##VAR_TYPE=  INDEPENDENT,   DEPENDENT,       DEPENDENT
##VAR_FORM=  AFFN,          ASDF,            ASDF
##VAR_DIM=   32768,         32768,           32768
##UNITS=     HZ,            ARBITRARY UNITS, ARBITRARY UNITS
##FACTOR=    0.250966925370066, 1,           1
##FIRST=     8223.43324360094, -88838,       -210367
##LAST=      0,             20683,           -131269
##MIN=       0,             -699160,         0
##MAX=       8223.43324360094, 459951999,    0
$$ Real data points
##PAGE= N=1
##DATA TABLE= (X++(R..R)), XYDATA
$$ [...]
$$ plain form
19486 -234869 154988 -66578 160288 -17599 -279913 16865 21143 -161155 -369407 -273880 -128835
19474 -251374 -129242 150571 233085 210633 -247917 56129 -440752 -256985 -183556 -22294
19463 30163 -70827 -22975 -205878 -168666 -317746 -48760 -44950 43674 -104343 -153333 -217597
19452 -217597 -7403 92181 -343710 -476275 -87843 38730 -114311 -69044 -158835 68905 257180
19441 257180 -165398 -321302 40292 -80622 -171104 -51959 -349740 62750 -93511 -28256 195203
19429 21204 79567 56960 -55796 254495 -257053 77711 174604 -214668 -138862 184856 -127533
19417 -122719 61057 70339 -218266 -61630 -77093 52231 141577 -34147 -33774 133944 -163400
19405 87 151638 -5408 -170268 -151481 114173 -52214 -45216 -76848 -127014 -51566 -32388 -580505
$$ packed form
19486b34869A54988f6578A60288a7599k62314A6865M278a61155k08252R5527a28835
19474b51374J22132A50571Q2514k2452b47917E6129d40752J83767P3429b2294
19463C0163g0827b2975j82903L7212j49080d8760L810D3674a04343m8990o4264
19452b17597g403I2181c43710j32565h7843C8730a14311M5267q9791F8905J88275
19441B57180a65398j55904D0292h0622r0482e1959k97781F2750i3511b8256A95203
19429B1204N8363k2607e5796B54495b57053G7711R6893b14668P5806A84856a27533
19417a22719F1057R282b18266f1630j5463E2231Q9346c4147L73A33944a63400
19405H7J51551e408j64860J8787A14173e2214O998l1632n0166e1566J9178n48117
$$ plain form
19393 -580505 208961 -291297 182661 -132066 -295098 164483 -143307 -234895 -263578 -93571
19382 -77362 -73232 -11334 -9599 -157002 -216429 193035 -35254 233655 -418174 -80882 -194441
19371 -194441 28739 -27072 -177461 159022 -192302 20925 26682 -173736 -224620 -7888 -122404
19360 -122404 -165561 365117 42288 -105707 405320 -161706 -76185 -134675 -217218 215102
19349 -66417 98456 -61138 -91031 -257260 -89974 21629 -81812 -236371 -342312 232353 -84868
19337 79174 63414 -366784 -124876 40914 -6323 120571 -310301 219780 28714 -174250 -262614
19326 -262614 -305796 -101149 -246650 -144235 121408 -91225 -269543 -110521 39297 -20722
19315 19841 -16164 -40140 -59012 -22789 -329174 -140409 -343249 -118612 64408 -129582 66361
$$ packed form
19393e80505B08961b91297A82661a32066j63032A64483a43307r1588k8683i3571
19382g7362M130a1334J735j47403n9427A93035c5254B33655d18174h0882j13559
19371a94441B8739b7072j50389A59022a92302B0925N757a73736n0884g888j14516
19360a22404m3157C65117D2288a05707D05320a61706g6185n8490q2543B15102
19349f6417I8456f1138k9893j66229h9974B1629h1812j54559j05941B32353h4868
19337G9174j5760c66784a24876D0914f323A20571c10301B19780B8714a74250q8364
19326b62614m3182a01149j45501J02415A21408i1225j78318a10521C9297b0722
19315A9841a6164k3976j8872b2789l06385a40409k02840a18612F4408a29582F6361
$$ plain form
19303 44702 -183916 -168468 -274097 -192434 -14384 93586 -280276 130256 -55375 -27686 -63185
19292 -63185 -131047 8784 -27581 101459 -5663 -198237 -40930 228412 13944 107063 214361
19281 214361 -594 121957 -357260 53894 -184266 -34073 -224988 -118177 -341071 -296310 -174904
19270 -174904 -131688 -158008 -329660 180982 34813 -85983 19987 -107070 -316025 -321213 -168032
19259 -168032 -105993 184880 -44888 -302899 -4001 -106581 170978 -37934 24693 277334 -133560
19247 -194236 -182608 -102973 -13655 -227839 143438 111886 103940 197186 -68016 -43090 -159161
19236 -159161 -213404 -174314 -260781 -161554 130054 -46420 -150915 18816 -37333 49544 77299
19225 77299 152609 -47538 7757 -153107 -102442 -395123 -129053 50234 137706 -168578 -96592
$$ packed form
19303D4702a83916J5448j05629Q1663a4384I3586b80276A30256e5375b7686l5499
19292f3185o7862H784b7581A01459e663j92574d0930B28412A3944R3119J07298
19281B14361e94A21957c57260E3894a84266c4073j90915J06811k22894M4761J21406
19270a74904M3216k6320j71652A80982C4813h5983A9987a07070k08955n188J53181
19259a68032O2039A84880d4888k58011d001j02580A70978c7934B4693K52641a33560
19247a94236J1628P9635a3655k14184A43438l1552p946R3246f8016K4926j16071
19236a59161n4243L9090q6467R9227A30054d6420j04495A8816c7333D9544K7755
19225G7299P5310d7538G757a53107N0665k92681a29053E0234Q7472a68578P1986
$$ plain form
19214 -96592 61820 38807 -251347 121665 38341 -236250 -13843 -46395 80056 -113458 -195658
19203 -195658 -126786 -183207 -120215 -24601 139238 -109709 -76709 -198597 -105621 -228091 35958
19191 -167004 -44690 -365298 46302 -263476 -150363 47051 221173 246374 9584 28168 -118291
19179 165234 -66322 -6583 -69528 -179408 -132987 181754 -72390 -182799 -197818 -320449 -447844
19168 -447844 -133811 -479228 -58018 -176676 82937 -58180 264022 -137275 145588 -196532
19157 169028 31456 281100 97330 78919 -219859 -245555 -6210 -292908 -32557 -46770 -89680
19146 -89680 104956 -640003 17484 65637 175336 -405255 272159 252609 -263468 -50229
19135 -88208 -58941 6943 187764 -152097 -472951 125584 112719 236328 -144824 268484
$$ packed form
19214i6592F1820k3013b51347A21665C8341b36250a3843l2552H0056a13458q2200
19203a95658O8872n6421O2992b4601A39238a09709L3000j21888R2976j22470C5958
19191a67004d4690l20608D6302b63476J13113D7051J74122K5201I584J8584a18291
19179A65234f6322f583o2945j09880M6421A81754g2390j10409j5019j22631j27395
19168d47844a33811l45417e8018j18658H2937e8180B64022a37275A45588a96532
19157A69028C1456K49644I7330j8411b19859k5696f210k86698c2557j4213m2910
19146h9680A04956f40003A7484M8153J09699d05255B72159j9550b63468e0229
19135h8208K9267F943J80821a52097l20854A25584j2865J23609a44824B68484
$$ plain form
19124 -143681 -191343 -78599 211378 -67453 -46651 -124074 149150 -20120 75074 -326571 -250761
19113 -250761 84319 -318186 -224185 33754 -107050 -295234 -207100 -117751 -258000 -283687 71721
19101 -192346 -107 -47820 200276 -132279 -372223 -18414 80422 -215991 -39963 52551 -3519
19089 -287985 135746 -22435 -143248 94712 -81682 132342 -258546 -253719 -38919 -143185 -231719
19078 -231719 -296760 -199353 -17648 -137679 -35426 25299 55761 267971 -180368 44445 -54774
19066 -122574 65581 34436 -93877 -121946 30122 -110463 -66733 -108023 97099 -97235 -169974
19055 -169974 -87071 -205872 -151603 -202207 -187768 -128809 15425 -33513 -90210 181692 -86953
19043 -177234 176359 10679 150585 56524 -127702 -186786 50535 -591 -269210 90605 135571
$$ packed form
19124a43681m7662g8599B11378f7453K0802p7423A49150b0120G5074c26571P5810
19113b50761H4319c18186R4001C3754a07050j88184Q8134Q9349j40249k5687G1721
19101a92346a07m7713B00276a32279k39944a8414H0422b15991c9963E2551c519
19089b87985A35746b2435j20813I4712h1682A32342b58546M827c8919j04266q8534
19078b31719o5041R7407a7648j20031c5426B5299L0462K12210a80368D4445e4774
19066a22574F5581l1145i3877k8069C0122a10463M3730m1290I7099i7235p2739
19055a69974Q2903j18801N4269n0604J4439N8959A5425c3513n6697A81692h6953
19043a77234A76359A0679J39906E6524a27702n9084E0535e91k68619I0605M4966
$$ plain form
19032 135571 121961 27997 -232905 25307 -274084 39643 177824 -72050 330201 46060 -462090
19020 259990 -261512 158479 -13329 7465 -133524 75625 -367439 18990 -197370 -106208 -207031
19009 -207031 104227 287565 10303 -31993 -13731 63156 -26780 -134821 -138399 -189929 103049
18997 125872 -57686 161256 25089 -16200 157909 314190 -75008 -21725 -312321 24200 -115066
18985 -141869 71674 -163776 44735 155589 -115020 198192 -69192 74105 -14240 -22180 333259
18973 14675 -217350 -185618 754900 712558 310428 199806 149465 84783 136293 -303836 259540
18961 -30751 -29624 -242368 -227061 -34450 -199292 32838 64900 -318323 12479 -371900 -10723
18949 203662 58934 -207291 111151 410857 25542 -129929 -68153 -151985 -254251 162877
$$ packed form
19032A35571j3610B7997b32905B5307b74084C9643J38181g2050C30201D6060d62090
19020B59990b61512A58479a3329G465a33524G5625c67439A8990a97370R1162j00823
19009b07031A04227J83338A0303c1993a3731F3156b6780j08041l578n1530A03049
18997A25872e7686A61256B5089a6200A57909J56281g5008b1725k90596B4200a15066
18985a41869G1674a63776D4735J10854a15020A98192f9192G4105a4240p940C33259
18973A4675b17350L1732G54900m2342C10428j10622n0341o4682N1510c03836B59540
18961c0751J127k12744J5307c4450j64842C2838L2062c18323A2479c71900a0723
18949B03662E8934b07291A11151K99706B5542a29929O1776q3832j02266A62877
$$ plain form
18938 105010 250399 -17744 -49046 -27850 55340 -137250 114870 -103126 -58135 -44667 -128753
18927 -128753 -15166 -264497 -16795 200963 43284 -52493 -384893 -27336 -192226 91063 47098
18916 47098 28846 41049 -317174 -130661 5098 120611 359409 62163 378015 416116 753069
18905 753069 118895 -40763 242338 -202166 22932 271483 143845 12456 -153415 -367130
18895 -367130 36403 -133231 -192270 110352 -179905 9355 -103110 -236363 -131341 124984
18884 -105982 -174827 -121365 -179141 -60397 141488 -106514 -158889 139683 -422112 -350499 200291
18872 224221 143072 -55511 295030 -26767 -172973 -289435 51832 72509 -213348 -8671 49455
18860 98730 -55612 -207602 -229905 -53874 240816 98557 -223809 -192404 42147 157623 -206851
$$ packed form
18938A05010J45389a7744l1302K1196E5340a37250A14870a03126M4991J3468q4086
18927a28753a5166k49331a6795B00963D3284e2493l32400b7336j64890I1063m3965
18916D7098j8252J2203c17174a30661E098J15513K38798F2163L15852L8101L36953
18905G53069A18895d0763B42338b02166B2932K48551j27638A2456a53415k13715
18895c67130C6403a33231n9039A10352a79905I355a03110j33253J05022A24984
18884a05982o8845N3462n7776f0397A41488a06514n2375A39683d22112P1613B00291
18872B24221q1149e5511B95030b6767j46206j16462E1832K0677b13348h671D9455
18860I8730e5612j51990k2303e3874B40816I8557b23809L1405D2147J15476b06851
$$ plain form
18848 136147 300714 -26760 16604 -57160 -35081 -135782 -12349 -281513 202943 12280 1032
18836 -184879 -44127 -119998 214148 102 -118004 -209439 -332586 -20787 -15908 -46289 -167994
18825 -167994 -316491 -6517 79931 69801 80561 -18829 140859 -191344 -137443 18660 -27868
18813 -170883 -340247 110676 53465 -23663 290302 173751 16514 -30536 352285 -158746
18802 -264796 -27041 -13097 136283 -384661 -31173 -64328 67445 -201731 70784 18233 -156272
18790 -163596 45212 -290782 -36711 -200474 385250 -336839 -243879 -87658 -16475 -214246
18780 -214246 -102288 -43379 -360966 -2368 289695 -307052 -176917 -362544 -264091 -369700
18770 -369700 38426 -190398 -42390 33613 94003 -124345 92861 -185448 315394 -418683
$$ packed form
18848A36147J64567b6760A6604e7160K2079j00701a2349k69164B02943A2280A032
18836a84879d4127p5871B14148A02a18004r1435j23147b0787M879l0381j21705
18825a67994j48497f517G9931j0130J0760a8829A40859a91344N3901A8660b7868
18813a70883j69364A10676E3465b3663B90302j16551A6514c0536C52285a58746
18802b64796b7041a3097A36283c84661c1173l3155F7445b01731G0784A8233a56272
18790a63596D5212b90782c6711j63763C85250c36839R2960h7658a6475j97771
18780b14246a02288d3379l17587b368B89695c07052J30135j85627R8453j05609
18770c69700C8426a90398d2390C3613O0390a24345I2861a85448C15394d18683
$$ plain form
18759 -16230 -197990 -188035 -43299 -18268 19224 198303 -329908 -225449 -174960 -3601 5662
18747 206962 87920 -212674 105766 194236 106038 -58833 275167 176956 34104 -336573 124117
18735 4785 -179520 278751 -35553 29891 -439853 -27310 -128280 112983 -111623 36820 -90844
18723 244727 -239271 -46724 -156482 -353891 -415342 55908 -208785 -68434 402177 -191194
18712 -85693 182224 -368878 -199583 -367613 -198004 -100055 -127218 75678 -169656 -132137
18702 -132137 -108331 -237150 160289 -268794 -161694 -25821 -77295 -118621 -61445 118425
18691 -61635 -323918 -85229 218241 39370 -212732 -223099 5922 -179808 -320547 -71616 -50543
18680 -50543 284350 -347923 -81064 -137461 25336 -80234 -158241 182347 -23481 16347 -125623
$$ packed form
18759a6230j81760R955d3299a8268A9224J79079c29908J04459N0489c601E662
18747B06962H7920b12674A05766Q8470q8198e8833B75167r8211C4104c36573A24117
18735D785a79520B78751c5553B9891d39853b7310j00970A12983a11623C6820i0844
18723B44727b39271d6724j09758j97409o1451E5908b08785f8434D02177a91194
18712h5693A82224c68878J69295j68030J69609R7949k7163G5678a69656L7519
18702a32137K3806j28819A60289b68794J07100b5821n1474m1326N7176A18425
18691f1635k62283h5229B18241C9370b12732j0367E922a79808j40739g1616K1073
18680e0543B84350c47923h1064n6397B5336h0234p8007A82347b3481A6347a25623
$$ plain form
18668 103467 -73751 -106343 -111302 -143404 -194839 -309915 -6156 -288873 -136895 -278227 -278952
18657 -278952 155485 -299539 -68131 -72127 350 -213606 -349941 -175828 -220536 104973 -132126
18645 -73034 142134 -41543 104508 -46899 16585 -18980 -252063 88063 -200108 131436 -239445
18633 202101 -219713 28134 -232817 57601 238087 -46571 -146001 60501 -397990 247838
18622 -345528 11331 182848 146525 -159978 -227761 214728 -90596 -78294 -134350 -65326 -207501
18611 -207501 160492 215593 -110999 234855 -186994 52024 113339 195772 -153153 112519
18600 -41299 92403 -312400 -100729 226587 -24385 -140415 83615 -88326 81640 15120 20699
18589 20699 191781 -83840 -151296 -48642 216772 139775 99951 66396 2197 93599 -171332
$$ packed form
18668A03467g3751l2592m959l2102n1435j15076f156k82717a36895j41332p25
18657b78952A55485b99539f8131l996C50b13606j36335J74113m4708A04973a32126
18645g3034A42134d1543A04508d6899A6585a8980k33083H8063b00108A31436b39445
18633B02101b19713B8134b32817E7601J80486d6571r9430F0501c97990B47838
18622c45528A1331J71517l6323a59978o7783B14728i0596J2302n6056f5326j42175
18611b07501A60492N5101a10999B34855a86994E2024O1315Q2433a53153A12519
18600d1299I2403c12400a00729B26587b4385j16030H3615h8326H1640A5120N579
18589B0699J71082h3840o7456d8642B16772p6997l9824l3555B197R1402a71332
$$ plain form
18577 -8813 42783 -158777 -286059 -124685 174502 162956 -158069 -290362 426432 80156
18566 -146478 -4831 -140016 -106407 142486 -137019 271683 -20102 -174308 272616 -10681
18555 264992 -74668 -85697 -304286 60488 -287391 127400 -138073 -40391 87888 123238 116412
18544 116412 -233803 -87266 -89500 137576 -296027 204521 27052 -119311 86249 -146241
18533 -221090 37003 -198797 -70911 -160287 219925 -202281 16747 -90188 42530 38938 67862
18522 67862 -385410 182095 -80003 208734 -214238 -170752 -186801 121070 -238860 -6447 -338788
18511 -338788 -457721 15402 69924 -50546 56498 -74427 -225789 -230859 -41360 96598 38458
18499 -48012 -305051 90022 -248853 -42964 68343 325449 43376 -3288 -144066 18401 -187794
$$ packed form
18577h813D2783a58777j27282a24685A74502j1546a58069j32293D26432H0156
18566a46478d831j35185L3609A42486a37019B71683b0102j54206B72616a0681
18555B64992g4668j1029k18589F0488b87391A27400a38073d0391H7888L5350o826
18544A16412b33803h7266k234A37576b96027B04521B7052a19311H6249a46241
18533b21090C7003a98797g0911q9376B19925b02281A6747i0188D2530l592K8924
18522F7862c85410A82095h0003B08734b14238M3486j6049A21070b38860f447l32341
18511c38788j18933A5402N4522e0546E6498g4427j51362n070d1360I6598C8458
18499d8012k57039I0022b48853d2964F8343K57106D3376c288j40778A8401a87794
$$ plain form
18487 -249339 157875 -331628 -243609 12131 -137572 -31512 122841 34639 -103784 284775
18476 -134359 59203 50537 -101758 -311829 124176 -99201 44815 -202242 -308574 290819
18465 -272733 -378290 -52320 73780 45062 58079 -292818 28132 176191 -190060 65283 -283311
18453 128402 128345 -113147 -26651 22245 -197718 198768 -85951 -119691 99641 -124877 -176111
18442 -176111 -367225 71357 8308 20332 174081 100251 -51417 -62291 -38542 -215478 58974
18430 97381 -73744 259691 139971 129726 240764 -316352 25175 -112352 -184695 -678 -3883
18419 -3883 170669 -21865 -283532 214497 117690 -11663 -535997 -267630 -64860 234554 -63696
18407 -150268 -175100 -267166 -140748 -177158 -103890 29687 82797 -66531 -125930 119667 -225698
$$ packed form
18487b49339A57875c31628Q8019A2131a37572c1512A22841C4639a03784B84775
18476a34359E9203q666a01758k10071A24176i9201D4815b02242j06332B90819
18465b72733j05557e2320G3780k8718J3017b92818B8132J48059a90060F5283b83311
18453A28402n7a13147b6651B2245a97718A98768h5951l3740I9641a24877n1234
18442a76111j91114G1357H308J2024J53749p3830e1417j0874K3749j76936E8974
18430I7381g3744B59691j19720j0245J11038c16352B5175a12352p2343f78l205
18419c883A70669b1865k61667B14497r6807a1663n24334b67630f4860B34554f3696
18407a50268k4832r2066J26418l6410P3268B9687N3110f6531n9399A19667b25698
$$ plain form
18395 -16387 303444 -307177 28678 -335 -76279 -47 162636 16063 -600041 36373 -64756 33006
18382 -292090 318438 135170 -29515 -387815 232442 -85775 -277336 -222326 -320055 51972
18371 -32862 -50828 -113041 -93509 114783 -88888 -270838 86326 88958 -70863 -64311 -243660
18360 -243660 -185365 59282 53764 109557 236177 186564 391442 -328871 -138129 50620 132604
18349 132604 83471 -12353 -361592 -265274 -43956 -273906 -21838 -140186 -3011 127466 -147720
18337 166585 36724 71997 -296619 85148 -123366 -78872 204531 -199916 -338958 -199367
18327 -199367 -162901 61627 -158961 41256 30819 -129880 -132875 -217603 33931 -82371 139425
18315 -131916 -197615 177429 -201046 -422240 -89483 -106174 13912 -222623 98145 105609 -24027
$$ packed form
18395a6387C03444c07177B8678c35p5944d7A62636A6063f00041C6373f4756C3006
18382b92090C18438A35170b9515l58300B32442h5775j91561N5010r7729E1972
18371c2862j7966o2213J9532A14783h8888j81950H6326K632g0863O552j79349
18360b43660N8295E9282n518N5793J26620m9613K04878c28871a38129E0620Q1984
18349A32604m9133a2353l49239R6318d3956k29950b1838j18348c011A27466a47720
18337A66585C6724L5273b96619H5148a23366M4494B04531a99916j39042J39591
18327a99367L6466F1627a58961D1256j0437a29880k995q4728C3931h2371A39425
18315a31916o5699A77429b01046k21194h9483j6691A3912b22623I8145P464b4027
$$ plain form
18303 292273 2232 -185429 49988 -87144 140623 -239996 115190 20131 113837 8579 -349801
18291 65124 68263 -149681 -299 -105955 -265501 26702 22402 31764 -155649 -73689 -388468 -258019
18279 -258019 -244257 48143 -142841 88989 -31423 165855 79718 -123508 -416653 -233567
18269 -233567 -205629 241313 160314 -105680 -114373 23128 63012 193247 14141 -67027 -167736
18258 -167736 -168150 10597 65530 89894 50630 -7937 -121685 52052 72481 25519 59131 -220547
18245 -223741 -19803 -189467 3846 50930 -179152 -62427 -33856 154212 148173 -279629 104459
18233 -16197 210019 461301 108357 -300895 39693 -11397 -65026 77566 -112356 8450 -243506
18221 97266 -131945 -240126 -11666 -223271 -40984 -380573 140056 68228 -102264 106479
$$ packed form
18303B92273B232a85429D9988h7144A40623b39996A15190B0131R3706H579c49801
18291F5124L139a49681b99j05656j59546B6702m300R362a55649g3689l14779J30449
18279b58019J3762D8143a42841H8989c1423A65855G9718a23508k93145J83086
18269b33567K7938B41313q0999a05680q693B3128L9884J30235A4141f7027j00709
18258a67736m14A0597N4933K4364l9264g937j13748E2052K0429B5519L3612b20547
18245b23741a9803j69664C846M7084a79152f2427K8571A54212o039b79629A04459
18233a6197B10019K51282A08357c00895C9693a1397n3629G7566a12356H450b43506
18221I7266a31945j08181a1666k11605d0984l39589A40056F8228a02264A06479
$$ plain form
18210 -44635 -86287 132757 -10417 250278 40457 -264899 -84333 -30207 129196 -190655 -159320
18199 -159320 -209252 80622 -256729 -135337 -177852 106364 161635 -220119 -114185 75374
18188 92492 -11066 -336668 184 205892 61903 -82604 -101542 -9969 -96960 58827 -219262 58328
18175 -170264 -195724 -94856 96543 215372 234292 -107698 165527 -431574 43502 -502422
18164 257771 -1898 26583 90638 -346387 -113208 75488 -210182 -269361 56278 156107 48480
18152 214687 88508 -173814 20601 -61033 -210615 46869 -448015 -168397 24477 22665 -329822
18140 2645 120058 -406620 -119747 -228216 48992 54813 -79763 -68686 -20877 117760 -536904
18128 -12620 -148714 -38788 141931 51427 153351 -385924 -75195 -72292 -214221 -83281 -21968
$$ packed form
18210d4635m1652A32757a0417B50278D0457b64899h4333c0207A29196a90655L1335
18199a59320m9932H0622b56729J21392m2515A06364N5271b20119J05934G5374
18188I2492a1066l25602A84K05708F1903h2604j8938i969q6991E8827b19262E8328
18175a70264k5460i4856I6543J18829J8920a07698A65527d31574D3502e02422
18164B57771a898B6583O4055c46387a13208G5488b10182n9179E6278R9829D8480
18152B14687H8508a73814B0601f1033j49582D6869d48015a68397B4477j812c29822
18140B645J17413d06620a19747j08469D8992N821g9763J1077b0877A17760e36904
18128a2620j36094c8788A41931E1427J01924c85924g5195K903j41929h3281b1968
$$ plain form
18116 -125905 -32556 -3935 334117 -139447 -181764 -43029 43045 198249 482444 -94500 -189079
18105 -189079 109455 128153 59785 226157 -26562 -204838 -158880 96088 92984 22503 -196106
18093 -95472 414472 -184458 43964 257956 -242942 68311 -64051 35287 -38834 5054 55166
18082 55166 76000 -222664 170329 -92548 107508 -136984 72967 -192913 131492 112591
18072 112591 45466 35296 209301 -206169 -138419 -11514 16877 -64223 316441 128487 213879
18061 213879 59216 -85204 -53827 144427 -139724 -200815 -125282 -67023 -111971 -302099 -193202
18050 -193202 -28363 -32745 124113 -18878 231651 136539 389835 65720 -154647 27173 99083
18039 99083 -160167 289554 86129 -83683 118580 156858 -6348 238714 -9096 -48684 -5063
$$ packed form
18116a25905c2556c935C34117a39447m2317d3029D3045J55204K84195i4500r4579
18105a89079A09455J8698E9785J66372b6562j78276M5958I6088l104B2503a96106
18093i5472D14472a84458D3964K13992b42942F8311f4051C5287c8834E054N0112
18082E5166K0834b22664A70329i2548A07508a36984G2967a92913A31492j8901
18072A12591D5466j0170J74005b06169O7750a1514A6877f4223C16441A28487Q5392
18061B13879E9216h5204L1377A44427a39724o1091P5533N8259m4948j90128J08897
18050a93202b8363m382A24113a8878B31651r5112K53296F5720a54647B7173P1910
18039I9083a60167B89554H6129h3683A18580L8278f348B38714i096l9588e063
$$ plain form
18027 -155315 81761 -69617 115927 147201 146321 -322642 109441 -1870 -296486 341722 164179
18015 -31413 -57383 31380 -31181 -145884 -42333 -106444 304202 -41835 364339 37184 53999
18004 53999 156469 -70594 -354927 -99535 147238 -159057 -236314 -103514 -279 -29994 27193
17992 249099 -47891 -141296 -240410 124063 86709 -317027 -63855 359287 165683 -18205 -197514
17981 -197514 -272268 -85630 -400619 -266980 -140997 9492 83374 241697 261449 368946 -111516
17969 190794 -54194 -54993 -110568 185284 -106195 -105728 42153 13702 -364405 -87164 -44107 -215779
17957 -215779 292502 382138 157516 46798 -46827 -262927 -234888 227279 -140054 34212
17946 -94218 -31974 -178980 59987 166670 242969 -30738 37456 13810 -152165 -40024 285345
$$ packed form
18027a55315H1761f9617A15927L1274q80c22642A09441a870k94616C41722A64179
18015c1413k5970C1380c1181j14703d2333o4111C04202d1835C64339C7184J6815
18004E3999J02470g0594k84333i9535A47238a59057p7257a03514b79k9715B7193
17992B49099d7891r3405r9114A24063l7354c17027f3855C59287A65683a8205j79309
17981a97514p4754h5630l14989J33639J25983I492P3882J58323J9752J07497a11516
17969A90794e4194p99n5575A85284a06195M67D2153A3702c64405h7164M3057j71672
17957b15779B92502Q9636A57516D6798d6827k16100K8039B27279a40054C4212
17946i4218c1974j47006E9987J06683P6299c0738C7456A3810a52165d0024B85345
$$ plain form
17934 -126174 -103584 220045 -210199 -15555 286824 53358 -248590 164663 -44746 -389819
17924 -389819 237317 -8472 -177982 119733 -307589 -360585 -109804 208285 354237 160709
17913 -130246 38418 177429 80935 -91272 -179885 88978 -59194 -30233 -12295 -48817 131901
17901 -79921 134786 67304 139259 -248773 5121 196780 62941 -4245 151670 27826 -68965
17889 245318 236284 84403 75114 362943 -436131 13129 -136884 -607024 137413 32033 -269704
17877 384921 -42131 100987 -53272 148847 148035 -155530 -573295 -81044 49724 31178 129944
17866 129944 -109624 310384 -228363 77860 86650 -410353 -107347 58799 3673 27983 -83712
17854 -88733 -22457 4744 -198978 35614 344164 134903 -181022 176779 185741 147444 -305562
$$ packed form
17934a26174K2590B20045b10199a5555B86824E3358b48590A64663d4746l45073
17924c89819B37317h472j69510A19733c07589n2996a09804B08285J45952A60709
17913a30246C8418J39011H0935i1272q8613H8978e9194K8961a2295l6522A31901
17901g9921A34786F7304P1955b48773E121J91659F2941d245A51670B7826f8965
17889B45318r034H4403r289K87829d36131A3129a36884m70140A37413C2033b69704
17877C84921d2131A00987e3272A48847q12a55530m17765h1044D9724j8546R8766
17866A29944a09624C10384b28363G7860Q790d10353a07347E8799C673K4310h3712
17854h8733b2457D744a98978C5614L08550A34903a81022A76779Q962l8297c05562
$$ plain form
17842 -138081 95169 58334 -46553 30938 -201681 -73416 -261865 60647 136455 -85061 251008
17830 187974 -81103 312291 1364 44723 -78231 -162151 205091 -280129 -122179 -23411 190890
17818 11516 -42675 -39066 113660 -116623 -87881 77702 202926 -63223 -74541 19221 113653
17807 113653 -197036 345994 -534908 -135216 97835 82768 310720 -73604 14168 -142584
17796 -62705 134237 -38650 62987 242084 -268771 -161345 47290 -90158 -173612 27144 -195797
17784 -77491 -107739 -218030 -198894 -177842 -214287 189539 142558 39815 340503 346942 -67425
17772 395036 169028 213188 384256 -343285 -38004 97372 2621 230612 144175 71662 -83945
17760 116277 183642 78399 3897 156894 258412 207734 39945 -196333 214657 343041 112668
$$ packed form
17842a38081I5169l6835d6553C0938b01681g3416j88449F0647P5808h5061B51008
17830A87974h1103C12291A364M3359g8231q3920B05091b80129a22179b3411A90890
17818A1516d2675L609A13660a16623K8742G7702J25224f3223j1318A9221R4432
17807A13653a97036C45994e34908a35216I7835j5067K27952g3604A4168a42584
17796f2705A34237c8650F2987J79097b68771J07426D7290i0158q3454B7144a95797
17784g7491l0248j10291J9136K1052l6445A89539m6981C9815L00688O439f7425
17772C95036A69028M4160J71068c43285c8004I7372B621K27991q6437G1662h3945
17760A16277O7365G8399C897J52997J01518n0678C9945a96333B14657J28384A12668
$$ plain form
17748 15413 33547 123505 64840 172236 -34494 -9653 74537 183582 135482 101976 134911
17737 134911 32982 319658 -41537 -38073 126578 394293 -132047 -45581 198822 75419 124766
17726 124766 6851 51284 -24022 242570 403791 26701 135688 120242 202074 134397 151979
17715 151979 -110594 -53502 -223411 -125633 47670 -94389 204638 -328299 -112445 278091
17704 15967 -209854 121547 96861 -97000 -117757 144772 167851 204772 47106 155769 12141
17692 -6598 121535 47836 -21720 327976 153554 -33207 293816 203290 -211119 -156746 85193
17680 52789 218862 -3282 -57152 142836 -97095 386478 378226 180008 427708 190485 126186
17669 126186 -125971 -83210 448081 -76884 119615 -137848 190378 322948 26924 -214743
$$ packed form
17748A5413J8134Q9958n8665J07396c4494i653G4537J09045m8100l3506L2935
17737A34911C2982K86676d1537L464A26578K67715a32047d5581A98822G5419M9347
17726A24766F851M4433b4022B42570J61221B6701J08987j5446Q1832o7677J7582
17715A51979a10594e3502j69909R7778D7670i4389B04638c28299a12445B78091
17704A5967b09854A21547k4686i7000k0757A44772K3079L6921D7106J08663A2141
17692f598A21535D7836b1720C27976A53554c3207B93816r0526b11119N4373H5193
17680E2789J66073c282n3870A42836i7095C86478q252A80008K47700A90485o4299
17669A26186a25971M2761D48081g6884A19615a37848A90378J32570B6924b14743
$$ plain form
17658 -83000 -114869 -8646 227958 -80053 -30357 -98937 -53331 265983 147674 193711 387226
17647 387226 23541 -259062 -196029 61789 145149 12131 112714 -102944 70100 302389 205721
17636 205721 -1930 -159527 25043 -199507 325775 246466 -32563 -2167 71563 167766 221322
17625 221322 413297 -27159 245613 171448 11250 -65563 641796 47454 -135642 39667 213280
17614 213280 80386 -3500 -38818 75283 31881 120588 43802 427383 72280 442455 -194225
17602 105056 40281 92111 79221 -65281 426962 251332 68926 -322426 154890 56257 35762
17591 35762 298136 164079 173933 141823 142334 -100491 310347 52295 142174 284637 195437
17580 195437 94326 110555 308976 199485 -121893 73323 37560 -175007 356802 -50489
$$ packed form
17658h3000l1869h646B27958h0053c0357o8580M5606B65983j18309M6037J93515
17647C87226B3541b59062O3033F1789Q3360A2131J00583a02944G0100K32289r6668
17636B05721a930j57597B5043a99507C25775p9309c2563b167G1563R6203N3556
17625B21322J91975b7159B45613p4165A1250f5563F41796D7454a35642C9667J73613
17614B13280H0386c500l5318G5283C1881Q8707D3802L83581G2280L70175a94225
17602A05056D0281N1830j2890f5281D26962j75630F8926c22426A54890E6257k0495
17591C5762K62374j34057R854l2110N11a00491C10347E2295Q9879J42463q9200
17580A95437I4326J6229J98421j09491a21893G3323l5763a75007C56802e0489
$$ plain form
17569 304018 -60059 -45368 358836 43048 157554 -76532 269113 397877 217835 -70834
17558 281257 291917 198099 170495 -42677 -45925 -31948 176662 104490 157854 301730 333409
17547 333409 -75373 243003 250092 198158 270609 -152862 -798 207827 328344 151783 -116398
17535 271667 81619 332052 313114 250413 88459 224378 249215 221751 416486 699746 846310
17524 846310 971336 1077519 858474 544080 593971 537580 469245 531766 557825 231057
17513 335778 533539 296939 694082 1064654 1207037 1158529 752561 738076 307730 185130
17503 185130 11409 287641 459272 353309 224226 245609 536611 297427 367872 574654
17493 574654 256291 175126 110782 302731 91328 478118 394219 37029 356941 593418
$$ packed form
17569C04018f0059J4691C58836D3048J14506g6532B69113J28764j80042g0834
17558B81257J0660r3818k7604d2677l248J3977A76662p2172N3364J43876L1679
17547C33409g5373B43003P089n1934P2451a52862g98B07827J20517A51783a16398
17535B71667H1619K50433j8938o2701H8459J35919K4837k7464J94735K83260J46564
17524H46310J25026J06183k19045l14394M9891n6391o8335O2521K6059B31057
17513C35778J97761k36600L97143L70572J42383m8508m05968j4485C07730j22600
17503A85130A1409K76232J71631j05963j29083K1383K91002k39184P0445K06782
17493E74654B56291q1165o4344J91949I1328L86790q3899C7029L19912K36477
$$ plain form
17483 593418 255275 290813 339575 284041 329662 308838 479704 333142 139900 268850
17473 268850 170812 163074 277935 154167 106775 264183 75559 308058 343976 363640 316652
17462 316652 316737 200497 324014 -60018 78218 254904 223645 430795 29917 299961 160003
17451 160003 530626 332760 523373 369381 246356 248616 248268 316736 495020 297863 318473
17440 318473 116237 196794 264414 404400 322406 466528 346835 541126 277919 255383
17430 255383 144850 -4873 329198 704551 242977 312645 248745 325541 475089 463908 29625
17418 461614 231404 313455 290056 225792 274726 605401 239599 253850 171604 402062 565450
17407 565450 389881 483202 217110 247210 96915 421983 -52708 167842 211316 329017
$$ packed form
17483E93418B55275L5538M8762n5534M5621k0824J70866j46562A39900J28950
17473B68850r8038p738J14861j23768m7392J57408G5559K32499L5918J9664m6988
17462C16652Q5j16240J23517f0018G8218J76686l1259K07150B9917K70044j39958
17451A60003L70623j97866J90613j53992j23025K260l48O8468J78284j97157K0610
17440C18473A16237Q0557O7620J39986q1994J44122j19693J94291k63207k2536
17430B55383j10533d873C29198L75353B42977O9668o3900P6796J49548j1181B9625
17418D61614k30210Q2051k3399o4264M8934L30675B39599J4251q2246K30458J63388
17407E65450j75569R3321B17110L0100I6915L25068e2708A67842M3474J17701
$$ plain form
17397 329017 262173 117848 387726 328476 238182 297486 381020 379170 427266 127924 194180
17386 194180 63895 77609 57939 226138 95107 112223 163062 -141026 627195 396234 101378
17374 118017 222099 60663 616814 176266 547245 285987 95377 217830 479377 373946
17364 373946 229631 260531 84306 563891 407098 -192411 210811 -168181 246923 130892
17354 130892 195037 451133 400805 119730 344142 504545 89084 153302 -100361 148613
17343 126450 644348 324046 191295 143221 356076 204838 364053 252237 354205 353348
17333 353348 178010 117536 312087 213676 342954 348690 332184 50278 304140 178552 81238
17321 391413 281478 -47179 98635 310204 44349 174143 186862 317286 346035 212663
$$ packed form
17397C29017o6844A17848K69878n9250r0294N9304Q3534j850M8096A27924O6256
17386A94180F3895J3714j9670J68199I5107J7116N0839a41026F27195k30961A01378
17374A18017J04082F0663N56151A76266L70979k61258I5377J22453K61547j05431
17364C73946j44315L0900H4306M79585j56793a92411B10811a68181B46923j16031
17354A30892O4145K56096n0328A19730K24412J60403H9084O4218a00361A48613
17343A26450N17898l20302j32751m8074K12855j51238J59215j11816J01968q57
17333C53348j75338o0474J94551r8411J29278N736j6506E0278K53862j25588H1238
17321C91413j09935d7179I8635K11569D4349J29794J2719J30424K8749j33372
$$ plain form
17311 212663 403291 337469 -84276 337565 448152 -22722 25520 222257 320950 163119
17301 163119 122873 220584 344026 551414 -37448 243210 512030 366397 416155 -105582
17290 121630 356021 515060 327933 517172 55107 -120532 381693 32061 413042 508857
17280 508857 252094 262443 157648 236167 12410 141915 433781 569103 -116732 357759
17269 442364 60564 334653 335805 424416 204060 388464 110749 368271 117485 42062
17258 380373 326564 351120 -13007 221307 33288 578617 129996 223007 296361 -99253 893514
17246 -100880 356923 379538 331503 -55030 446155 406598 290956 402731 119616 192109
17236 192109 392096 557277 116258 549425 362157 200090 278668 508332 276080 172771
$$ packed form
17311B12663J90628o5822h4276C37565J10587b2722B5520J96737R8693j57831
17301A63119m0246R7711J23442K07388c7448B43210K68820j45633M9758a05582
17290A21630K34391J59039j87127J89239E5107a20532C81693C2061L80981R5815
17280E08857B52094J0349j04795P8519A2410J29505K91866J35322a16732C57759
17269D42364F0564K74089J152Q8611B04060J84404A10749K57522A17485D2062
17258C80373n3809K4556a3007B21307C3288N45329A29996R3011P3354i9253H93514
17246a00880C56923K2615m8035e5030D46155l9557j15642J11775A19616P2493
17236A92109J99987J65181A16258M33167j87268j62067P8578K29664k32252j03309
$$ plain form
17226 172771 424813 472347 246522 325838 45926 523441 790895 46710 158603 571165
17216 571165 454331 349283 459986 479276 599251 229066 366427 536654 323600 483334
17206 483334 -129709 429608 333435 57459 286870 320328 304412 557699 227432 357273
17196 357273 234772 234644 276491 248379 471985 347218 370339 326660 593380 320236 261247
17185 261247 517228 496010 644048 319218 266736 610851 319394 590748 658178 404083
17175 404083 652777 537150 472599 680682 453114 -224261 386833 455976 421531 312122
17165 312122 331684 123389 731479 743376 258561 674363 866330 563310 597960 375464
17155 375464 397401 495010 439196 587730 312596 692016 595287 310820 202049 609678
$$ packed form
17226A72771K52042M7534k25825P9316D5926M77515K67454D6710J11893M12562
17216E71165j16834j05048J10703J9290J19975B29066J37361J70227k13054J59734
17206D83334a29709D29608r6173E7459K29411L3458j5916K53287B27432J29841
17196C57273j22501j28M1847k8112K23606j24767K3121m3679K66720k73144n8989
17185B61247K55981k1218J48038C19218n2482L44115k91457K71354O7430k54095
17175D04083K48694j15627o4551K08083k27568b24261C86833O9143l4445j09409
17165C12122J9562A23389O08090J1897B58561M15802J91967l03020L4650k22496
17155C75464K1937R7609n5814J48534k75134L79420r6729k84467j08771M07629
$$ plain form
17145 609678 290561 378828 418758 893060 373163 566174 439447 783878 470234 561504
17135 561504 404167 720629 505040 508407 576570 499427 662905 639849 597119 510894 476025
17124 476025 556947 475132 271530 588192 148865 726140 360259 643110 668651 498529
17114 498529 442700 425290 535765 361949 670891 721409 547628 680801 317436 932653
17104 932653 663633 689537 618060 638317 693991 752794 762189 699090 635731 601374 497402
17093 497402 884263 1155153 875237 758783 513450 466435 602983 759596 674167 1058936
17083 1058936 655409 562265 631347 752546 775801 699318 532435 253597 556491 510254
17073 510254 451881 681108 908208 433758 941070 802108 812431 1126803 648334 652899
$$ packed form
17145F09678B90561Q8267L9930M74302C73163J93011j26727L44431l13644R1270
17135E61504j57337L16462k15589L367O8163p7143J63478k3056m2730q6225l4869
17124D76025Q0922q1815k03602L16662A48865N77275C60259K82851K5541j70122
17114D98529n5829j7410J10475j73816L08942N0518j73781J33173C17436O15217
17104I32653k69020K5904p1477K0257N5674N8803R395o3099o3359l4357j03972
17093D97402L86861K70890k79916j16454k45333m7015J36548J56613q5429L84769
17083A058936m03527r3144O9082J21199K3255p6483j66883B53597L02894m6237
17073E10254n8373K29227K27100D33758N07312j38962J0323L14372m78469M565
$$ plain form
17063 652899 470852 708310 800402 876769 469823 725898 645221 964257 737345 1029719
17053 1029719 595782 759542 746521 605571 974680 916417 761496 545967 1051894 1086758
17043 1086758 1145756 1093190 655009 1040157 1154410 924519 917127 1196156 1110470 717728
17033 717728 879647 809722 1147854 1017580 211067 1055813 854146 922715 764738 795680
17023 795680 910481 1037972 982598 840493 1093361 856016 1013972 885576 1175258 1225748
17013 1225748 979398 1073213 1038493 998398 1045864 1168590 843880 1140711 1106032 1239692
17003 1239692 1058452 1281096 1183793 1502978 872296 1086485 1009457 1207468 1042082 1297978
16993 1297978 1316335 1282113 1317472 901427 1402706 1143222 1321484 1074247 1414061 1273186
$$ packed form
17063F52899j82047K37458R2092P6367m06946K56075q0677L19036k26912K92374
17053A029719m33937J63760j3021j40950L69109n8263j54921k15529N05927L4864
17043A086758N8998n2566m38181L85148J14253k29891p392K79029q5686l92742
17033G17728J61919o9925L38132j30274B11067Q44746k01667O8569j57977L0942
17023G95680J14801J27491n5374j42105K52868k37345J57956j28396K89682N0490
17013A225748k46350R3815l4720m0095M7466J22726l24710K96831l4679J33660
17003A239692j81240K22644r7303L19185o30682K14189p7028J98011j65386K55896
16993A297978J8357l4222L5359m16045N01279k59484J78262k47237L39814j40875
$$ plain form
16983 1273186 1179923 1256390 1243063 1237907 1370429 1610255 1359869 1307096 1299637 1552461 1456819
16972 1456819 1521679 1475185 1635344 1665302 1370345 1507035 1512952 1397921 1662544 1597923
16962 1597923 1394913 1662293 1694424 1427430 1776522 1426217 1742319 1781899 1898145 2121772
16952 2121772 1691119 1665589 1800877 1549040 1864479 1856515 1584021 1962153 1755720 1738305
16942 1738305 1865966 1939960 1921808 1794888 2070481 1904415 2061465 2061114 2123304 1775457
16932 1775457 1967284 2111404 2242804 1983816 2174034 1994655 2307795 1964529 2396028
16923 2396028 2451671 2337966 2076738 2569896 1899314 2335183 2645580 2458822 2455901 2152795
16913 2152795 2432005 2561821 2025621 2438391 2674821 2797340 2673715 2200598 2967359
$$ packed form
16983A273186r3263P6467j3327n156J32522K39826k50386n2773p459K52824r5642
16972A456819O4860m6494J60159K9958k94957J36690N917j15031K64623o4621
16962A597923k03010K67380L2131k66994L49092l50305L16102L9580J16246K23627
16952B121772m30653k5530J35288k51837L15439p964k72494L78132k06433j7415
16942A738305J27661P3994j8152j26920K75593j66066J57050l51O2190l47847
16932A775457J91827J44120J31400k58988J90218j79379L13140l43266M31499
16923B396028N5643j13705k61228M93158o70582M35869L10397j86758k921l03106
16913B152795K79210J29816n36200M12770K36430J22519j23625m73117P66761
$$ plain form
16904 2967359 2660490 3059904 2787136 2571667 2803481 2909172 2781752 2786436 3086971 2937653
16894 2937653 2898013 3207929 3030439 3243804 3106285 3185642 3460500 3292114 3222264 2883088
16884 2883088 3446340 3229098 3293331 3271149 3387885 3380491 3807527 3470600 3735543 3485342
16874 3485342 3820653 3548438 3558925 3504096 3564179 4000492 3966875 4299751 4314392 4065281
16864 4065281 4181303 4335808 4442208 4584372 4620160 4842419 4621553 4636846 4525344 4566803
16854 4566803 4677070 5052216 5112642 4852765 5101177 5036065 5399127 5446593 5780275 5858732
16844 5858732 5296406 5822394 5812896 5965741 5897731 6109560 6338133 6301114 6112043 6498592
16834 6498592 6847192 6725121 6809661 7242473 7037661 7153395 7259774 7569167 7776695 7706401
$$ packed form
16904B967359l06869L99414k72768k15469K31814J05691j27420M684L00535j49318
16894B937653l9640L09916j77490K13365j37519P9357K74858j68386o9850l39176
16884B883088N63252k17242O4233k2182J16736p394M27036l36927K64943k50201
16874C485342L35311k72215J0487n4829O0083M36313l3617L32876J4641k49111
16864D065281J16022J54505J06400J42164L5788K22259k20866J5293j11502M1459
16854D566803J10267L75146O0426k59877K48412o5112L63062M7466L33682P8457
16844E858732n62326N25988r498J52845o8010K11829K28573l7019j89071L86549
16834F498592L48600j22071Q4540M32812k04812J15734J06379L09393K07528p0294
$$ plain form
16824 7706401 7798651 7968353 8200945 8379882 8607837 8362992 9086441 8960836 9274912 9150164
16814 9150164 9364011 9787851 10329947 10035974 9960118 10335768 10661771 11102525 11249593 11084620
16804 11084620 11655505 12335219 11961314 12656767 12894271 12994562 13213765 13826963 13697528
16795 13697528 13931654 14647588 14870442 15398784 15528003 16474163 16429607 17290347 17041652
16786 17041652 17749292 18488455 18736544 19175961 19635030 20083371 20815257 21203547 21618532
16777 21618532 22409890 23240956 23810857 24496535 25110189 25999233 26357299 27490331 28227218
16768 28227218 29204185 29837952 31031724 32033863 32837828 33724784 35406765 36016267 37250749
16759 37250749 38477854 39954440 41200567 42836117 44364930 45864905 47405971 48828248
$$ packed form
16824G706401R2250J69702K32592J78937K27955k44845P23449j25605L14076j24748
16814I150164K13847M23840N42096k93973p5856L75650L26003M40754J47068j64973
16804A1084620N70885O79714l73905O95453K37504J00291K19203O13198j29435
16795A3697528K34126P15934K22854N28342J29219R46160m4556Q60740k48695
16786A7041652P07640P39163K48089M39417M59069M48341P31886L88290M14985
16777B1618532P91358Q31066N69901O85678O13654Q89044L58066J133032P36887
16768B8227218R76967O33767J193772J002139Q03965Q86956J681981O09502J234482
16759C7250749J227105J476586J246127J635550J528813J499975J541066J422277
$$ plain form
16751 48828248 50770622 52433446 54011684 56323930 57678115 59907214 61872455 64400322
16743 64400322 66178666 68496336 70935361 73347578 75627816 78004941 80337885 82510663
16735 82510663 85295919 87518618 89642958 92070649 94178633 95990127 97992453 100098001
16727 100098001 101774426 103141630 104414814 105350254 106398407 107022056 107314515 107731432
16719 107731432 107229593 106959251 106358104 105575192 104331568 103465339 101639345 99917951 98468579
16710 98468579 96361296 93926919 92201687 89852638 87528701 85044061 82588204 80338091
16702 80338091 77897126 75529730 73064730 70757390 68241105 66360275 63795934 62088562
16694 62088562 59826598 57980480 55914165 53864730 52023037 50505796 48452334 46728363
$$ packed form
16751D8828248J942374J662824J578238K312246J354185K229099J965241K527867
16743F4400322J778344K317670K439025K412217K280238K377125K332944K172778
16735H2510663K785256K222699K124340K427691K107984J811494K002326K105548
16727A00098001J676425J367204J273184R35440J048153O23649K92459M16917
16719A07731432n01839k70342o01147p82912j243624q66229j825994j721394j449372
16710I8468579k107283k434377j725232k349049k323937k484640k455857k250113
16702H0338091k440965k367396k465000k307340k516285j880830k564341j707372
16694F2088562k261964j846118k066315k049435j841693j517241k053462j723971
$$ plain form
16686 46728363 45083750 44035431 42031646 40692156 39599664 38322498 36737965 35788566
16678 35788566 34708596 33516999 32268132 31566718 30501282 29634738 28577740 27449663
16670 27449663 26903514 26303230 25209703 24576439 23826470 23422508 22595818 22158061 21342682
16661 21342682 20775320 20415485 19828094 19249755 18566887 18102896 17500491 16977078 16975448 16264546
16651 16264546 15796992 15226237 15256290 14948608 14234644 14260298 13668423 13564034 13485239 12841036
16641 12841036 12482704 12132587 12025197 11803988 11207259 11235825 11120306 10974935 10309209
16632 10309209 9989242 10195941 9787681 9701787 9305751 9449987 9121004 8905701 8779010
16623 8779010 8495496 8615834 8439804 7827578 7734842 7911754 7384049 7686868 7753569 7482920
$$ packed form
16686D6728363j644613j048319k003785j339490j092492j277166j584533r49399
16678C5788566j079970j191597j248867p01414j065436q66544j056998j128077
16670B7449663n46149o00284j093527o33264p49969m03962q26690m37757q15379
16661B1342682n67362l59835n87391n78339o82868m63991o02405n23413j630p10902
16651A6264546m67554n70755L0053l07682p13964K5654n91875j04389p8795o44203
16641A2841036l58332l50117j07390k21209n96729K8566j15519j45371o65726
16632A0309209l19967K06699m08260q5894l96036J44236l28983k15303j26691
16623H779010k83514J20338j76030o12226r2736J76912n27705L02819O6701k70649
$$ plain form
16613 7482920 6974405 7409961 6946821 7014256 6706129 6475388 6357442 6379390 5960748 5974557
16603 5974557 6520132 5618220 6076346 5621675 5685742 5397911 5848639 5494637 5338693 4995600
16593 4995600 4616587 5232158 5024481 4842513 4516470 4773074 4906163 4679132 4610267 4237542
16583 4237542 4401136 4600973 4223771 4367856 4180373 4063919 4018451 4005890 4038876 3819110
16573 3819110 4107287 3756081 3697449 3759083 3477682 3713315 3424330 3401940 3596942 3548468
16563 3548468 3531763 3555958 3109321 3320163 3535020 3407028 3663590 3125472 3185501 3169719
16553 3169719 2684857 3245563 2968627 2903194 3371395 2538048 2715266 2510215 2872244 2960170
16543 2960170 2680481 2833250 2792408 2848166 2474925 2876327 2543245 2427253 2363431 2300357
$$ packed form
16613G482920n08515M35556m63140O7435l08127k30741j17946K1948m18642J3809
16603E974557N45575r01912M58126m54671O4067k87831M50728l54002j55944l43093
16593D995600l79013O15571k07677j81968l26043K56604J33089k27031o8865l72725
16583D237542J63594J99837l77202J44085j87483j16454m5468j2561L2986k19766
16573C819110K88177l51206n8632O1634k81401K35633k88985k2390J95002m8474
16563C548468j6705K4195m46637K10842K14857j27992K56562n38118O0029j5782
16553C169719m84862N60706k76936o5433M68201q33347J77218k05051L62029Q7926
16543B960170k79689J52769m0842N5758l73241M01402l33082j15992o3822o3074
$$ plain form
16533 2300357 2443766 2575511 2466035 2446600 2364554 2347773 2210697 2107850 2222550 2000784
16523 2000784 2189854 2067428 2387554 2277148 1965843 2324882 2117685 1732536 2285813
16514 2285813 2035073 1825105 1852316 1930972 2003434 2191806 1838358 1773274 1810986 1835926
16504 1835926 2035774 1739036 1860472 1777833 1644132 1877433 1631179 1875448 1688854 1595416
16494 1595416 1612323 1895381 1614532 1309902 1835354 1376237 1756603 1854009 1684804 1598856
16484 1598856 1571052 1509103 1423647 1306125 1507135 1251578 1532314 1300613 1436269 1499695
16474 1499695 1418527 987976 1189788 1488915 1641819 1483062 1386151 1263398 1452153 1170196
16464 1170196 1437338 1032068 1440086 1017284 1209243 1356994 961719 1337944 1317089 1283785
$$ packed form
16533B300357J43409J31745j09476j9435q2046j6781j37076j02847J14700k21766
16523B000784J89070j22426L20126j10406l11305L59039k07197l85149N53277
16514B285813k50740k09968K7211P8656P2462J88372l53448o5084L7712K4940
16504A835926J99848k96738J21436q2639j33701K33301k46254K44269j86594r3438
16494A595416J6907K83058k80849l04630N25452m59117L80366R7406j69205q5948
16484A598856k7804o1949q5456j17522K01010k55557K80736k31701J35656O3426
16474A499695q1168m30551K01812K99127J52904j58757r6911j22753J88755k81957
16464A170196K67142m05270M08018m22802J91959J47751l95275L76225k0855l3304
$$ plain form
16454 1283785 1084775 1136775 1252370 1352234 953590 1056491 1147056 1270945 1071069 1269747
16444 1269747 975287 1163136 1020354 989198 1154369 1182534 920726 839017 1175516 888879
16434 888879 1369309 1185645 858442 931913 1033810 740600 1202051 850803 949594 824081
16424 824081 928040 949323 1101839 1012941 862356 1346916 1066239 537933 906473 1135176
16414 1135176 1028596 925085 880168 935746 671873 848983 980959 963731 661173 622796
16404 622796 753952 862803 686931 636851 977389 622270 721319 906290 816795 769155
16394 769155 699584 731477 740070 780301 726548 794579 757905 985456 701501 827531 423457
16383 423457 539793 667285 708173 719831 925415 929372 982630 363998 472743 747296
$$ packed form
16454A283785j99010N2000J15595R9864l98644J02901R0565J23889j99876J98678
16444A269747k94460J87849j42782l1156J65171K8165k61808q1709L36499k86637
16434H88879M80430j83664l27203P3471J01897k93210M61451l51248R8791j25513
16424H24081J03959K1283J52516q8898j50585M84560k80677n28306L68540K28703
16414A135176j06580j03511m4917N5578k63873J77110J31976j7228l02558l8377
16404F22796J31156J08851j75872n0080L40538l55119R9049J84971q9495m7640
16394G69155o9571L1893Q593M0231n3753O8031l6674K27551k83955J26030m04074
16383D23457J16336J27492M0888J1658K05584L957N3258C63998J08745K74553
$$ plain form
16373 747296 770229 847611 689039 758537 657540 785545 675704 615439 446375 545499
16363 545499 606352 657507 510245 846339 665390 826309 608854 832330 244864 518039
16353 518039 667510 500905 408575 763292 693787 570243 559268 474619 683471 423401
16343 423401 572619 921826 501776 481239 597108 490998 689277 626799 599955 543837
16333 543837 397901 795433 601120 214276 1042368 541032 206499 196155 -195723 106543
16322 313915 514088 475841 393208 409576 542928 767507 699909 667059 166048 464858
16312 464858 408483 405987 689255 539172 716584 536084 226682 380296 356787 296313
16302 296313 364812 432144 101273 366113 438160 643216 2001 313500 272826 484676 209311
$$ packed form
16373G47296K2933P7382j58572O9498j00997J28005j09841o0265j69064R9124
16363E45499O0853N1155j47262L36094j80949J60919k17455K23476B44864K73175
16353E18039J49471j66605r2330L54717o9505j23544j0975q4649K08852k60070
16343D23401J49218L49207m20050k0537J15869j06110J98279o2478k6844n6118
16333E43837j45936L97532j94313B14276Q28092n01336B06499j0344a95723A06543
16322C13915K00173l8247q2633J6368J33352K24579o7598l2850A66048K98810
16312D64858n6375k496K83268j50083J77412j80500B26682J53614k3509o0474
16302B96313O8499O7332A01273K64840P2047K05056B001L11499m0674K11850B09311
$$ plain form
16290 443159 533369 281725 453065 132866 277440 576087 293312 473426 625703 346905
16280 346905 408672 476488 179850 276772 291634 123011 543475 355402 393806 111543
16269 -137421 150582 219835 348186 371142 610506 -1216 512081 280693 247052 643568
16259 643568 302859 239434 362772 479079 325822 218003 359415 330579 361558 385531
16249 385531 90439 193789 48671 232372 308541 405341 431996 204993 294354 461350 557989
16238 557989 349193 532121 544235 407668 218934 319736 50639 325927 299587 607953
16228 607953 56789 324866 277462 205966 90003 657994 13182 114856 127069 121606 422979
16217 422979 162253 128549 344878 329608 782687 281547 124714 126861 71307 185395
$$ packed form
16290D43159R0210k51644J71340A32866J44574K98647k82775J80114J52277k78798
16280C46905O1767O7816A79850R6922J4862A23011M20464j88073L8404A11543
16269a37421A50582O9253J28351K2956K39364a216E12081k31388l3641L96516
16259F43568C02859o3425J23338J16307j53257j07819J41412k8836L0979K3973
16249C85531I0439J03350D8671J83701P6169R6800K6655B04993Q9361J66996R6639
16238E57989k08796J82928J2114j36567j88734J00802E0639K75288k6340L08366
16228F07953E6789K68077m7404p1496I0003N67991A3182J01674J2213n463L01373
16217D22979A62253l3704K16329j5270M53079B81547A24714K147n5554J14088
$$ plain form
16207 185395 -34786 16790 167559 167899 298130 526763 30858 263104 328730 263017 -26449
16195 259795 389110 140611 234088 45158 316211 448286 301082 554637 470381 106255
16184 334812 24657 -7467 238980 234711 375389 60731 -66571 192708 256299 77487 241256
16173 241256 442894 -11846 87420 190344 250850 301995 503936 297092 61393 1441 300402
16162 300402 272319 403981 240975 336878 325866 167528 313427 230024 -47227 311448
16151 280798 136390 72638 258705 26923 -82653 232217 202607 90994 -35258 104734 21962
16139 -137511 244955 139380 138972 132807 303531 184121 -21002 253914 172345 178220 -106855
16127 1137 22943 269675 -39920 508452 319460 298050 222972 488693 -102951 82550 374348
$$ packed form
16207A85395c4786A6790J50769L40J30231K28633C0858K32246O5626o5713b6449
16195B59795J29315A40611R3477D5158K71053J32075j47204K53555q4256A06255
16184C34812B4657g467B38980m269J40678F0731f6571A92708O3591G7487J63769
16173B41256K01638a1846H7420J02924O0506N1145K01941k06844F1393A441K98961
16162C00402k8083J31662j63006R5903j1012j58338J45899q3403d7227C11448
16151B80798A36390o3752J86067B6923h2653B32217k9610I0994c5258A04734B1962
16139a37511B44955j05575m08o165J70724j19410b1002B53914q1569N875a06855
16127A137K1806K46732c9920E08452j88992k1410p5078K65721a02951H2550K91798
$$ plain form
16116 374348 222320 178229 250038 -114346 12968 -304065 67972 10964 56466 327660 -56051
16104 262679 -25707 198361 143941 478727 -139638 55752 354249 -193273 70944 -3828 328391
16092 238582 -622 32931 125168 -89498 56865 -31917 309724 -9140 64900 -49385 -402580 94465
16079 69566 183470 -39184 -28285 372629 122735 14441 345421 256115 206225 -161780 -72099
16067 179807 153522 34266 102899 -132073 -44667 88125 66907 31412 -30006 190327 354808
16056 354808 154425 107479 -218576 445930 212089 196688 316306 7411 55234 96567 385509
16045 385509 144458 -115310 237118 -74116 158117 9532 -133698 156119 293085 53154
16034 -141498 -37069 120124 61601 168725 225145 57059 214963 89144 237276 -125644
$$ packed form
16116C74348j52028m4091P1809a14346A2968c04065F7972A0964M5502K71194e6051
16104B62679b5707A98361n4420L34786a39638E5752K98497a93273G0944c828C28391
16092B38582f22C2931R2237h9498E6865c1917C09724i140F4900d9385l53195I4465
16079F9566J13904c9184J0899C72629A22735A4441L30980q9306m9890a61780g2099
16067A79807k6285C4266O8633a32073d4667H8125k1218C1412c0006A90327J64481
16056C54808A54425m6946b18576D45930B12089j5401J19618G411M7823M1333K88942
16045C85509A44458a15310B37118g4116A58117I532a33698A56119J36966E3154
16034a41498c7069A20124n8523J07124N6420E7059J57904H9144J48132a25644
$$ plain form
16023 -186813 -137963 266078 -84975 250681 333529 -39542 -255081 -137392 -240504 13612
16012 -2051 104627 -10848 290640 192664 -72830 -53215 315820 56016 -7813 -333495 44666
16000 54666 44988 -50097 211156 209451 192599 225460 4893 -161691 127956 148064 181412 154310
15988 154310 602233 327620 979811 751297 1018620 1093572 832031 655435 326519 208311
15978 208311 357136 -62350 227996 150693 233414 233083 -163388 -55782 92676 -44968 79270
15966 -114090 -148465 41382 -14112 249655 -9533 -72987 1708 -195918 -50174 88299 33940
15954 176758 153260 89826 -54107 91633 188361 31983 436156 22773 5952 31506 -227330
15942 178344 -163089 -165539 37668 102353 -6837 -255808 321564 39039 -79083 34855 172818
$$ packed form
16023a86813M8850B66078h4975B50681Q2848c9542k15539J17689j03112A3612
16012b051A04627a0848B90640r7976g2830J9615C15820E6016g813l25682D4666
16000E4666r678e0097B11156j705j6852L2861D893a61691A27956K0108L3348k7102
15988A54310M47923k74613O52191k28514K67323P4952k61541j76596C26519j18208
15978B08311J48825f2350B27996p7303Q2721l31a63388e5782I2676d4968G9270
15966a14090l4375D1382a4112B49655i533o3454A708a95918e0174H8299C3940
15954A76758k3498o3434e4107I1633R6728C1983M04173B2773E952K5554b27330
15942A78344a63089k450C7668O4685f837k48971C21564C9039g9083C4855J37963
$$ plain form
15931 172818 -114138 62457 218081 237694 145090 261743 -85058 239896 -142544 -214667
15921 -214667 371269 25580 -27568 -65598 101044 -184824 51809 33723 91911 15117 12147
15910 12147 -31519 39861 -97519 -84460 30769 -50930 183562 -87891 69681 -107213 203219
15898 333885 127119 328352 139968 427548 -39867 71637 -68331 -226640 99642 -48777
15887 265517 -16127 -1278 -23349 178352 -54103 -298368 -20089 -81199 -160640 -281805 -70894
15875 -197659 151154 -118472 84767 57179 73788 221137 -322076 6658 -30835 223127 -67932
15863 87892 -5303 -40120 103134 -414992 224276 17964 236110 3183 316874 -77762 -76752
15852 -76752 178543 -1610 -373632 162862 -204354 238629 -61410 -17360 -488089 -30321 -102660
$$ packed form
15931A72818a14138F2457J55624J9613r2604J16653h5058B39896a42544p2123
15921b14667C71269B5580b7568l8030A01044a84824E1809j8086N8188A5117k970
15910A2147c1519C9861i7519J3059C0769e0930A83562h7891F9681a07213B03219
15898C33885A27119K01233A39968K87580c9867G1637f8331j58309I9642d8777
15887B65517a6127a278k2071A78352e4103k44265b0089o1110p9441j21165g0894
15875a97659A51154a18472H4767k7588J6609J47349c22076F658c0835B23127f7932
15863H7892e303l4817A03134d14992B24276A7964K18146C183L13691g7762J010
15852g6752A78543a610l72022A62862b04354B38629f1410a7360m70729c0321p2339
$$ plain form
15841 -102660 109386 -94259 176793 22195 -19992 -72161 155582 44157 -184334 -243725 68091
15829 -53555 -175193 -101915 39114 -53844 -167685 130184 66971 51138 -139927 243664 170831
15818 170831 18925 93835 10618 255373 -110724 80071 -45817 124267 82548 -208812 -29722
15806 -225846 -107597 -165945 106508 -172054 -116252 3053 33513 -57010 69903 -93860 -191487
15795 -191487 65793 221724 449495 239066 -173958 34076 101020 134678 -45197 92329 236203
15784 236203 -131448 223083 -114011 -176600 110678 99343 132885 -41728 -130690 -97036 200421
15772 -198982 -391866 -6054 14527 262794 78589 -285997 -26733 -189769 -18718 -47331 -129369
15761 -129369 -219289 160577 61510 119105 7451 183858 -311372 -90154 -121190 254480 44873
$$ packed form
15841a02660A09386i4259A76793B2195a9992n2169A55582D4157a84334n9391F8091
15829e3555j21638P3278C9114e3844j13841A30184o3213j5833a39927B43664p2833
15818A70831A8925P4910A0618K44755a10724H0071d5817A24267m1719b08812b9722
15806b25846a07597n8348A06508a72054N5802C053L0460e7010F9903i3860r7627
15795a91487F5793J55931K27771k10429a73958C4076O6944L3658d5197I2329J43874
15784B36203a31448B23083a14011o2589A10678j1335L3542d1728q8962L3654B00421
15772a98982j92884f054A4527K48267G8589b85997b6733j63036a8718k8613q2038
15761a29369q9920A60577F1510N7595G451J76407c11372i0154l1036B54480D4873
$$ plain form
15749 192015 -261827 187879 246648 183740 68974 -19942 -138639 7388 -117263 6861 -124295
15737 53514 -194852 -181966 -159 67157 -127409 -226508 -17086 49470 61291 266235 -186164
15725 -305517 13447 150573 -113193 -95410 -5439 89074 193567 -130424 374226 46593 9012
15713 262298 -137694 -104333 248430 41342 -138022 90204 -407795 79521 92578 68182 -118205
15701 351818 -34944 -56610 -150264 -231786 -19331 -274148 -15750 -86288 125770 257532 -253338
15689 -47010 8510 408894 55655 373504 339335 -194693 54799 122625 -211962 252585 -84390
15677 216326 -66256 -32561 4052 7735 185417 -58627 44779 -17814 -455491 79454 197243
15666 197243 229443 39311 -5285 161045 76904 -243345 20112 -221665 -213297 -177224 78654
$$ packed form
15749A92015b61827A87879N8769o2908F8974a9942j18697G388a17263F861a24295
15737E3514a94852J2886a59F7157a27409r9099a7086D9470J1821K04944a86164
15725c05517A3447J37126a13193J7783e439H9074J04493a30424C74226D6593I012
15713B62298a37694L3361B48430D1342a38022I0204d07795G9521J3057k4396a18205
15701C51818c4944k1666r3654q1522a9331k54817a5750p0538A25770J31762b53338
15689d7010H510M00384E5655L17849l4169a94693E4799O7826b11962B52585h4390
15677B16326f6256c2561D052L683J77682e8627D4779a7814m37677G9454J17789
15666A97243L2200C9311e285A61045G6904b43345B0112b21665Q368L6073G8654
$$ plain form
15654 82047 243605 -458672 -144215 -191949 -322566 -118995 15857 -9178 -242613 46379 -329900
15642 237944 173483 -119712 7194 -118332 287233 -34514 -8425 68932 -405653 -105071 -142712
15631 -142712 127688 -135127 99224 -57646 190588 41336 120489 -32308 137540 -38604 142731
15619 237464 -111717 107559 112013 194302 -9449 -24947 50923 97300 -56985 -299753 -439771
15608 -439771 -402585 -355302 -108783 -111165 -189663 -55665 -170038 -155447 -10269 3843 35898
15597 35898 -156272 141666 -77847 -158821 449623 154937 12399 -138289 329888 119021
15586 116809 -177463 55024 -47644 -25728 -82280 -204560 -148098 67404 55817 244873 -38628
15574 73057 151907 77514 -103935 189769 -44026 -91440 2436 47957 193850 199528 66428
$$ packed form
15654H2047J61558d58672a44215m7734j30617a18995A5857i178k33435D6379c29900
15642B37944o4461a19712G194a18332B87233c4514h425F8932d05653a05071l7641
15631a42712A27688a35127I9224e7646A90588D1336P9153c2308A37540c8604A42731
15619B37464a11717A07559M454Q2289i449j5498E0923M6377e6985k42768j40018
15608d39771L7186M7283a08783k382p8498e5665j14373J4591a0269C843L2055
15597C5898a56272A41666g7847q0974D49623A54937A2399a38289C29888A19021
15586A16809a77463E5024d7644K1916n6552j22280N6462F7404j1587J89056c8628
15574G3057P8850p4393a03935A89769d4026m7414B436M5521J45893N678F6428
$$ plain form
15562 -11906 79926 -82901 78288 -96525 -81444 252887 21913 -11289 209991 235488 -49448
15550 -112097 -95868 -197341 -50199 244164 -119883 328163 28822 -182739 118660 30176
15539 120452 339742 -322225 -16562 -52144 338504 -40269 -6445 19273 -243330 -203763 98627
15527 -159953 -156755 -324166 165947 -162763 -120787 153059 146568 -108625 66688 193216 122929
15516 122929 42680 168979 12284 152335 99798 362453 336255 61160 289637 -138672
15505 -112762 1517 429444 174697 171686 287633 216188 42617 32614 145476 233838 157605
15494 157605 215354 -21384 -15763 114025 -169099 56128 69155 -129201 185794 254837 289979
15483 289979 -90215 153845 147806 310079 107958 439103 244873 355339 328462 605113
$$ packed form
15562a1906G9926h2901G8288i6525J5081B52887B1913a1289B09991K5497d9448
15550a12097J6229j01473e0199B44164a19883C28163B8822a82739A18660C0176
15539A20452K19290c22225a6562l5582C38504d0269f445A9273b43330L9567I8627
15527a59953L198j67411A65947a62763M1976A53059o491a08625F6688J26528p0287
15516A22929D2680J26299A2284J40051n2537K62655k6198F1160K28477a38672
15505a12762A517M27927A74697l011J15947p1445D2617j0003J12862Q8362p6233
15494A57605N7749b1384N621A14025a69099E6128J3027a29201A85794O9043L5142
15483B89979i0215A53845o039J62273A07958L31145j94230J10466k6877K76651
$$ plain form
15473 605113 542542 551325 519206 335107 7640 222220 -252272 71864 -58329 218500 -172983
15461 62068 -274473 105556 91084 -196714 107087 109887 20225 91491 -25317 -58519 32018
15449 12212 -178016 -219402 -220825 238919 84792 192350 198669 825257 1121349 1210241 915783
15438 915783 194328 307266 553297 69247 78605 24133 -187308 65850 414001 146699
15427 -113028 127227 256970 141673 79236 -20201 186119 119942 66094 -163854 262831
15416 332431 -147838 -136496 147166 -266678 125043 141206 -76487 -24634 2951 270000 -213773
15404 22416 150038 180051 107192 -58290 -69421 91141 87821 103536 74551 -155604 98587
15392 -191898 81866 -345446 58512 -16562 -5738 37996 199702 -262145 -197790 -186465 -124578
$$ packed form
15473F05113o2571Q783l2119j84099G640K14580b52272G1864e8329B18500a72983
15461F2068b74473A05556j4472a96714A07087K800B0225P1266b5317l3202C2018
15449A2212a78016m1386j423B38919H4792J07558O319O26588K96092Q8892k94458
15438I15783A94328J12938K46031F9247R358B4133a87308F5850L48151A46699
15427a13028A27227J29743j15297o2437b0201A86119o6177n3848a63854B62831
15416C32431a47838J1342A47166b66678A25043J6163g6487b4634B951K67049b13773
15404B2416J27622L0013p2859e8290j1131I1141l320J5715k8985a55604I8587
15392a91898H1866c45446E8512a6562e738C7996J61706b62145O4355J1325O1887
$$ plain form
15381 -124578 -327695 161199 166412 -104540 109726 126378 -68421 93902 -47445 540507 523744
15370 523744 145005 230787 -41597 64276 239393 104140 -54713 216422 245527 117350
15359 -164785 85271 85313 -25511 196423 265359 127675 110660 384236 270183 133570 167848
15348 167848 96925 47031 -68427 341541 535119 460045 395033 247223 190271 162960 384142
15337 384142 92897 241805 -136942 293261 -150956 195637 -110069 81964 282210 80690
15326 69404 92577 4817 -145938 382161 64717 310480 8701 240750 75882 347241 254046
15315 254046 284717 219128 184111 -9469 33417 77105 180803 167058 100373 86256 156054
15304 156054 143848 304248 217443 167626 257825 103333 -138943 134287 144817 -38365 -35617
$$ packed form
15381a24578k03117A61199N213a04540A09726J6652f8421I3902d7445E40507j6763
15370E23744A45005Q5782d1597F4276J75117A04140e4713B16422K9105A17350
15359a64785H5271M2b5511A96423O8936A27675j7015K73576j14053A33570L4278
15348A67848p0923D7031f8427C41541J93578p5074o5012j47810n6952k7311K21182
15337C84142I2897J48908a36942B93261a50956A95637a10069H1964K00246H0690
15326F9404K3173D817a45938C82161F4717K45763H701K32049G5882K71359r3195
15315B54046L0671o5589l5017i469C3417M3688J03698j3745o6685j4117O9798
15304A56054j2206J60400q6805m9817R0199A03333a38943A34287J0530c8365K748
$$ plain form
15293 -35617 -125687 444214 -179710 -74083 260933 -44085 120807 -161514 195669 -161802
15282 -171177 1606 194973 191060 176795 -133891 123612 -47130 -5557 268823 173647 -105896
15270 160446 -46476 178222 153361 15981 -35265 -90198 -101441 312944 -426370 76847 55056
15259 55056 118189 9879 42546 208883 35 183579 -214201 67825 305299 148524 246211
15248 246211 247126 40834 180998 -48953 179918 524064 842391 1785109 1526288 1681539
15238 1681539 1511900 376865 273716 58327 -17250 -53609 90144 -29386 -192546 283675
15227 -192142 -343846 140416 100721 -49644 23985 73889 -53236 -31662 151165 186206 184849
15216 184849 -44364 102920 163587 -66213 -128416 121502 205246 -219990 111982 93738 -320676
$$ packed form
15293c5617r0070D44214a79710g4083B60933d4085A20807a61514A95669a61802
15282a71177A606J93367l913j4265a33891A23612d7130e557B68823r5176a05896
15270A60446d6476A78222k4861A5981c5265n4933j1243C12944d26370G6847k1791
15259E5056O3133I879L2667J66337C5J83544b14201F7825K37474A48524R7687
15248B46211R15D0834J40164d8953A79918L44146L18327R42718k58821J55251
15238A681539j69639C76865j03149E8327a7250l6359I0144b9386j63160B83675
15227a92142j51704A40416l9695d9644B3985M9904e3236K1574A51165L5041j357
15216A84849d4364A02920O0667f6213o2203A21502Q3744b19990A11982j8244c20676
$$ plain form
15204 244940 122069 -206555 195077 37967 97567 -294817 147938 113169 -92646 15412
15193 -187696 -97983 -117849 -86044 83744 148408 -123567 49472 132450 -103798 -213404 131842
15181 25237 310578 84715 63973 220406 193504 343995 133621 162111 -149495 61682 143177
15170 143177 -60882 176954 -1343 -148769 162002 453185 67845 247195 86223 203466
15160 203466 197557 -38622 -58680 329920 275088 168608 -41426 266464 493173 -104274 12036
15148 -121291 56645 22614 138512 -142614 75301 177851 -105499 148515 3142 -13655 293475
15136 25932 140636 -58471 118034 63615 164225 261254 67737 47361 -93389 -68769 158368
15124 250224 145122 -90171 -99940 14732 267101 299934 257838 264973 474733 94980 142798
$$ packed form
15204B44940A22069b06555A95077C7967N9600b94817A47938l4769i2646A5412
15193a87696Q9713j9866L1805H3744O4664a23567D9472Q2978a03798j09606A31842
15181B5237K85341H4715k0742J56433k6902J50491A33621K8490a49495F1682Q1495
15170A43177f0882A76954a343j47426A62002K91183F7845J79350H6223J17243
15160B03466n909c8622k0058C29920n4832j06480d1426B66464K26709a04274A2036
15148a21291E6645B2614J15898a42614G5301J02550a05499A48515C142a3655B93475
15136B5932J14704e8471A18034n4419J00610R7029F7737k0376i3389K4620A58368
15124B50224j05102i0171r769A4732K52369L2833m2096P135K09760I4980M7818
$$ plain form
15113 142798 72935 -50703 47835 197231 -133582 329649 158169 -4023 122091 160201 371459
15102 371459 -88981 -60110 178281 -54288 48245 88756 60240 -35885 199200 226691 31166
15090 47477 194628 -69731 28006 -179953 28403 238138 -217035 112657 272637 335939
15080 335939 214764 206741 41093 96346 402235 85975 259317 24424 214984 -171241 171423
15068 173872 217998 211404 2254 381131 46840 162450 -11055 171813 340274 121997 263048
15057 263048 356696 390312 -14020 326036 257016 441412 39933 594696 470899 476924 389195
15046 389195 552761 428645 304852 323718 197311 399793 413297 370133 406013 504351
15036 504351 410444 -4002 421343 345142 414159 683213 745049 940437 613157 415640 641840
$$ packed form
15113A42798o9863e0703D7835J49396a33582C29649A58169d023A22091L8110K11258
15102C71459h8981K8871A78281e4288D8245M0511k8516c5885A99200K7491C1166
15090D7477J47151f9731B8006a79953B8403K09735b17035A12657J59980O3302
15080C35939j21175q023D1093N5253L05889H5975J73342B4424J90560a71241A71423
15068A73872M4126o594B254L78877D6840J15610a1055A71813J68461A21997J41051
15057B63048R3648L3616a4020C26036o9020J84396C9933N54763j23797O025q7729
15046C89195J63566j24116j23793J8866j26407K02482J3504m3164L5880R8338
15036E04351r3907d002D21343p6201O9017K69054O1836J95388l27280j97517K26200
$$ plain form
15025 641840 669196 311146 388745 343668 196716 668980 554888 507875 539422 269406
15014 368869 264641 303252 -39011 734001 260529 495815 610987 293943 537969 337766
15004 337766 -75993 476233 166848 395118 222066 484645 462913 518452 170048 182577
14994 182577 447730 212359 356687 367208 -41753 110354 348313 760952 595943 331755
14984 331755 537374 724250 382580 733503 749124 732987 572100 617050 628746 503371
14974 503371 588708 637309 538373 670629 746654 615721 331406 -63834 474929 270742
14964 270742 -29733 369952 320932 389524 238238 200678 446340 -1000 244182 224250 389958
14953 389958 110816 498893 141779 223682 353724 203115 420235 281687 532271 779270
$$ packed form
15025F41840K7356C11146P7599m5077j46952M72264j14092m7013L1547B69406
15014C68869j04228L8611c9011G34001B60529K35286J15172B93943K44026k00203
15004C37766g5993D76233A66848K28270j73052K62579k1732N5539A70048J2529
14994A82577K65153B12359J44328J0521d1753A10354K37959M12639j65009k64188
14984C31755K05619J86876l41670L50923J5621j6137j60887M4950J1696j25375
14974E03371Q5337M8601r8936J32256P6025j30933k84315f3834D74929k04187
14964B70742b9733C69952m9020O8592j51286l7560K45662a000B44182j9932J65708
14953C89958A10816L88077A41779Q1903J30042j50609K17120j38548K50584K46999
$$ plain form
14943 779270 424919 473446 493534 373059 295499 367843 327240 240954 337810 508805 414102
14932 414102 720750 773535 1347650 1202395 1210018 1192078 1203506 1744239 1461218 1309039
14922 1309039 1475018 1397037 1288265 1498634 2151795 2461310 2282170 2049083 1629666 1383790
14912 1383790 1106228 748506 675984 524126 345466 330498 413901 500079 279283 523979
14902 523979 248308 288866 466630 547412 637394 236274 290415 490966 265530 429259
14892 429259 319406 362545 656982 223327 525390 551227 791165 773802 701270 647908
14882 647908 723457 1110773 841892 976018 649135 281036 506550 574310 488578 728020
14872 728020 111757 501644 588453 178821 647907 508936 580893 565713 692456 685828
$$ packed form
14943G79270l54351M8527K0088j20475p7560P2344m0603q6286R6856J70995r4703
14932D14102L06648N2785N74115j45255P623j7940J1428N40733k83021j52179
14922A309039J65979p7981j08772K10369O53161L09515j79140k33087m19417k45876
14912A383790k77562l57722p2522j51858j78660j4968Q3403Q6178k20796K44696
14902E23979B48308M0558J77764Q0782Q9982B36274N4141K00551k25436J63729
14892D29259j09853M3139K94437B23327L02063K5837K39938j7363p2532n3362
14882F47908P5549L87316k68881J34126l26883B81036K25514O7760q5732K39442
14872G28020A11757L89887Q6809A78821M69086j38971P1957j5180J26743o628
$$ plain form
14862 685828 405187 575556 643366 400979 839380 415180 404142 320538 612839 558368
14852 558368 529090 790256 270587 447759 661211 380298 664524 932214 1077318 1079067
14842 1079067 1136452 1315774 837454 726917 784693 410357 911344 620653 521536 451849
14832 451849 433048 645499 518934 912616 470835 530919 706804 682979 331550 524622
14822 524622 448192 344561 541668 592067 966918 520294 711027 719746 511086 648697
14812 648697 677993 768184 447516 426329 506827 756546 638854 661148 1066675 913717
14802 913717 665982 590081 684923 210954 535936 313513 702030 427054 413275 695592
14792 695592 657023 806935 556020 646261 444127 654856 298959 648721 483803 414450
$$ packed form
14862F85828k80641J70369O7810k42387M38401D15180j1038q3604K92301n4471
14852E58368k9278K61166B70587J77172K13452k80913K84226K67690J45104J749
14842A079067N7385J79322m78320j10537N7776l74336N00987k90691r9117o9687
14832D51849j8801K12451j26565L93682m41781O0084J75885k3825C31550J93072
14822E24622p6430j03631J97107N0399L74851m46624J90733Q719k08660J37611
14812F48697K9296R0191l20668k1187Q0498K49719j17692K2294M05527j52958
14802I13717k47735p5901R4842B10954L24982k22423L88517k74976j3779K82317
14792F95592l8569J49912k50915R0241k02134K10729B98959L49762j64918o9353
$$ plain form
14782 414450 393870 426255 519283 621299 817251 631767 603578 840447 912096 642231
14772 642231 703406 810863 373854 653127 493967 453291 632946 541785 412673 498316
14762 498316 414485 549165 697081 472144 838841 523172 407224 490285 515093 602982
14752 602982 93209 592866 441627 539883 734433 532696 592355 616315 723567 503864
14742 503864 141586 664302 715282 582521 647650 458300 995364 780838 541377 806864
14732 806864 763847 950092 1138618 1243713 1515181 1608438 1796682 1539285 1323779 1020221
14722 1020221 931588 672336 872969 650199 1050146 194604 476070 736157 566714 588809
14712 588809 755208 711702 779918 1191144 1050219 1003746 932274 966362 1693576 1468612
$$ packed form
14782D14450k0580L2385R3028J02016J95952j85484k8189K36869P1649k69865
14772F42231O1175J07457C73854K79273j59160m0676J79655r1161j29112Q5643
14762D98316q3831J34680J47916k24937L66697l15669j15948Q3061K4808Q7889
14752F02982I3209M99657j51239R8256J94550k01737N9659K3960J07252k19703
14742E03864A41586N22716N0980j32761O5129j89350N37064k14526k39461K65487
14732H06864m3017J86245J88526J05095K71468R3257J88244k57397k15506l03558
14722A020221q8633k59252K00633k22770L99947A94604K81466K60087j69443K2095
14712E88809J66399m3506O8216M11226j40925m6473p1472L4088P27214k24964
$$ plain form
14702 1468612 1392978 1665125 1674505 1750460 1327185 1183953 838500 922319 722125 573224
14692 573224 642185 625854 852251 282294 725406 647021 775695 1012145 572516 817929
14682 817929 798239 844571 849635 644106 523544 987487 769798 816448 688955 874975
14672 874975 981809 1091109 763405 640424 585046 767466 1005601 1367122 768562 1293533
14662 1293533 820834 955882 713507 869952 1181101 633610 1051894 768876 1144369
14653 1144369 1197931 1284795 1173383 1178154 1048547 1197002 716225 1112155 1493111 1183988
14643 1183988 853866 1032314 1231364 1143904 1101045 1114368 948780 1352608 1017726 1040232
14633 1040232 1214727 1106655 1116854 1059387 1020535 1198857 967576 1085736 976231 931976
$$ packed form
14702A468612p5634K72147R380P5955m23275j43232l45453Q3819k00194j48901
14692E73224O8961j6331K26397B82294M43112p8385J28674K36450m39629K45413
14682H17929j9690M6332N064k05529j20562M63943k17689M6650j27493J86020
14672H74975J06834J09300l27704j22981n5378J82420K38135L61521n98560N24971
14662A293533m72699J35048k42375J56445L11149n47491M18284k83018L75493
14653A144369N3562Q6864j11412M771j29607J48455m80777L95930L80956l09123
14643A183988l30122J78448J99050q7460m2859J3323j65588M03828l34882K2506
14633A040232J74495j08072J0199n7467l8852J78322k31281J18160j09505m4255
$$ plain form
14623 931976 1235791 1237245 1057803 1228054 974795 1169669 1223543 1141581 1230259 990065
14613 990065 958536 1213529 1320894 1073183 1246742 1348567 1209467 1186819 1269870 1214286
14603 1214286 1612454 1385697 1207209 1504934 1189856 1338993 1255844 1413924 1328903 1355627
14593 1355627 1585087 1371958 1186315 1558566 1450284 1577529 1335714 1682666 1354023
14584 1354023 1572010 1813154 1726813 1668568 1545985 1698090 1518811 1797988 1988711 2123203
14574 2123203 1982384 1744723 1517471 1753877 1519084 1764276 2036920 1604209 1913135
14565 1913135 1939608 2115325 2101838 1981408 2151032 2166396 2528194 2592297 2485542 2530784
14555 2530784 2200567 3046609 3074950 3676017 4104447 4563874 6049246 9596969 18148075
$$ packed form
14623I31976L03815J454j79442J70251k53259J94874N3874q1962Q8678k40194
14613I90065l1529K54993J07365k47711J73559J01825j39100k2648Q3051n5584
14603A214286L98168k26757j78488K97725l15078J49137q3149J58080q5021K6724
14593A355627K29460k13129j85643L72251j08282J27245k41815L46952l28643
14584A354023K17987K41144q6341n8245j22583J52105j79279K79177J90723J34492
14574B123203j40819k37661k27252K36406k34793K45192K72644m32711L08926
14565A913135K6473J75717j3487j20430J69624J5364L61798O4103j06755M5242
14555B530784l30217Q46042K8341O01067M28430M59427J485372L547723Q551106
$$ plain form
14546 18148075 36730145 42343580 19774848 9029739 3974074 2969864 2175879 2216359
14538 2216359 2998166 4656121 4183121 2639998 1882062 1794241 1834501 1914806 1810713 1764828
14528 1764828 1770444 1912009 2037524 1767155 1689855 1922442 1566279 1874182 2087899 1977191
14518 1977191 2209191 2458715 2357780 2342644 2147677 2189478 2332496 2548902 2599234 2346754
14508 2346754 2445198 2638768 2422976 2808034 2473487 2633790 2652309 2789668 2635422 2400991
14498 2400991 2841112 2396259 2845765 3126082 2933648 2709011 2930001 2699171 3097374
14489 3097374 3038786 2829831 2915710 2858491 3141196 3142654 3052135 3171175 2994610 3086870 3260350
14478 3260350 3206605 3471239 3480488 3450297 3596936 3624244 3580780 3454837 3581118 3734305
$$ packed form
14546A8148075J8582070N613435A9774848I029739C974074j004210p93985M0480
14538B216359P81807J657955m73000j543123p57936q7821M0260Q0305j04093m5885
14528A764828N616J41565J25515k70369p7300K32587l56163L07903K13717j10708
14518A977191K32000K49524j00935j5136j94967M1801J43018K16406N0332k52480
14508B346754R8444J93570k15792L85058l34547J60303J8519J37359j54246k34431
14498B400991M40121m44853M49506K80317j92434k24637K20990k30830L98203
14489C097374n8588k08955Q5879n7219K82705J458r0519J19040j76565R2260J73480
14478C260350n3745K64634R249l0191J46639K7308m3464j25943J26281J53187
$$ plain form
14468 3734305 3891686 3802772 4131422 3857036 3849097 3684851 4034809 3840434 4113051 4195133
14458 4195133 4138399 4239145 4143478 4181007 4643880 4188339 4508800 4567078 4848223 4583254
14448 4583254 4528084 4590220 4634078 4807610 4933149 4802524 5181721 5156683 5330004 5307384
14438 5307384 5462149 5448637 5623729 5666513 5746018 5872731 5504057 5626313 5907977 5847201
14428 5847201 6149247 5815024 6274887 6275183 6236991 6427489 6811274 6817035 6925975 7296545
14418 7296545 7148995 7333625 7433298 7317274 7474837 7590141 7632150 7883686 8039968 7885195
14408 7885195 8076705 8388514 8689846 8856960 8753644 9074165 8837081 9402393 8998695
14399 8998695 9389166 9541896 9395144 9800795 9705946 9712772 10100712 10264243 10801616 10460210
$$ packed form
14468C734305J57381q8914L28650k74386p939j64246L49958j94375K72617Q2082
14458D195133n6734J00746r5667L7529M62873m55541L20461N8278K81145k64969
14448D583254n5170O2136M3858J73532J25539j30625L79197k5038J73321k2620
14438E307384J54765j3512J75092M2784P9505J26713l68674J22256K81664o0776
14428E847201L02046l34223M59863K96l8192J90498L83785N761J08940L70570
14418G296545j47550J84630R9673j16024J57563J15304M2009K51536J56282j54773
14408G885195J91510L11809L01332J67114j03316L20521k37084N65312m03698
14399H998695L90471J52730j46752M05651r4849O826L87940J63531N37373l41406
$$ plain form
14389 10460210 10788204 11137278 11273801 11857245 11536722 12251321 12366827 12833396 12917174
14380 12917174 12998022 13280442 12942394 13328752 13645980 13879924 14260614 14785952 14921295
14371 14921295 15249754 15303379 15952302 16313129 16696069 16942807 17578409 17583245 17770495 18038000
14361 18038000 18950529 18850690 19336883 20095925 20325805 20900390 21417964 21684314 22037104
14352 22037104 22714063 23286595 23882037 24593686 24942441 26028633 26767694 26897492 27512861
14343 27512861 28521295 28951492 30082460 30923947 31871072 32393841 33844244 34552077 35345968
14334 35345968 36331431 37686782 39003401 40081473 41495377 42604250 44218719 45566656
14326 45566656 47174061 48870568 50664787 52283884 53887488 56144048 57829945 60438321
$$ packed form
14389A0460210L27994L49074J36523N83444l20523P14599J15506M66569Q3778
14380A2917174Q0848K82420l38048L86358L17228K33944L80690N25338J35343
14371A4921295L28459N3625O48923L60827L82940K46738O35602M836J87250K67505
14361A8038000R12529r9839M86193P59042K29880N74585N17574K66350L52790
14352B2037104O76959N72532N95442P11649L48755J086192P39061J29798O15369
14343B7512861J008434M30197J130968Q41487R47125N22769J450403P07833P93891
14334C5345968R85463J355351J316619J078072J413904J108873J614469J347937
14326D5566656J607405J696507J794219J619097J603604K256560J685897K608376
$$ plain form
14318 60438321 62213244 64423209 66703913 69388633 71976858 75212027 78254717 81716320
14310 81716320 85040119 88602868 92439769 96609849 100939194 105609706 110795313 115924035
14302 115924035 121740979 127483468 133845950 140698318 147938542 155552978 163691210 172531698
14294 172531698 181691030 191423949 201534173 212871148 224192243 236931016 249749653
14287 249749653 263681259 278164959 293104331 308267304 324426917 340402419 356662079
14280 356662079 372711033 388760648 404134762 418367857 431865301 443475568 452943753
14273 452943753 457626811 459951999 458589420 456427216 455042353 449449114 445731343 441850616
14265 441850616 431838948 418990393 404731597 390033906 373450783 356657524 339669133
$$ packed form
14318F0438321J774923K209965K280704K684720K588225L235169L042690L461603
14310H1716320L323799L562749L836901M170080M329345M670512N185607N128722
14302A15924035N816944N742489O362482O852368P240224P614436Q138232Q840488
14294A72531698R159332R732919J0110224J1336975J1321095J2738773J2818637
14287B49749653J3931606J4483700J4939372J5162973J6159613J5975502J6259660
14280C56662079J6048954J6049615J5374114J4233095J3497444J1610267R468185
14273D52943753M683058K325188j362579k162204j384863n593239l717771l880727
14265D41850616j0011668j2848555j4258796j4697691j6583123j6793259j6988391
$$ plain form
14258 339669133 323302631 306870646 290837697 275764983 260900471 247160234 233738912
14251 233738912 221419715 209118063 198190162 188235756 179835263 170074671 161261268
14244 161261268 153574604 145691561 138640950 131988796 125284589 119547146 114173352 109057401
14236 109057401 104274203 99296305 95018000 91013980 87092085 83988144 80442091 76848703
14228 76848703 73828725 71064369 68232678 65623806 63302049 60754219 58636766 56660509
14220 56660509 54871988 53039450 50755716 49172818 47729991 46108363 44621749 43852278
14212 43852278 42669420 40828036 39193446 38133624 37406731 37025143 35836180 34391522
14204 34391522 33612378 32450553 31220283 30637444 30530521 29413327 28622739 27769241 26888375
$$ packed form
14258C39669133j6366502j6431985j6032949j5072714j4864512j3740237j3421322
14251B33738912j2319197j2301652j0927901r954406q400493r760592q813403
14244A61261268p686664p883043p050611o652154o704207n737443n373794n115951
14236A09057401m783198m977898m278305m004020l921895l103941l546053l593388
14228G6848703l019978k764356k831691k608872k321757k547830k117453j976257
14220E6660509j788521j832538k283734j582898j442827j621628j486614p69471
14212D3852278j182858j841384j634590j059822p26893l81588j188963j444658
14204C4391522p79144j161825j230270n82839j06923j117194p90588q53498q80866
$$ plain form
14195 26888375 26119854 25953647 25333031 24578003 24147645 23427982 22674387 22296338 21521418
14186 21521418 21124666 20568869 20204606 19602829 19345239 18547897 18473583 18159368 17785115
14177 17785115 17382135 17048397 16430277 16278636 15902299 15812869 15274347 14667496 14280022
14168 14280022 14802260 14684977 13794740 13988337 13270709 13358923 12626976 12600982 12622239 12195383
14158 12195383 12017489 11825663 12126096 11737786 11250375 11159783 10970156 10883298 10721667 10411737
14148 10411737 10607491 10172772 10003388 9760886 9672993 9344151 9296221 9178765 9148205 8587400
14138 8587400 8881192 8553131 8692091 8704638 8315759 8494563 8161964 8143962 7686215 7667656
14128 7667656 7594707 7676779 7588839 7285960 7055703 7147466 6781763 6813808 6780505 6943464
$$ packed form
14195B6888375p68521j66207o20616p55028m30358p19663p53595l78049p74920
14186B1521418l96752n55797l64263o01777k57590p97342p4314l14215l74253
14177A7785115m02980l33738o18120j51641l76337q9430n38522o06851l87474
14168A4280022N22238j17283q90237J93597p17628Q8214p31947k5994K1257m26856
14158A2195383j77894j91826L00433l88310m87411r0592j89627q6858j61631l09930
14148A0411737J95754m34719j69384k42502q7893l28842m7930j17456l0560n60805
14138H587400K93792l28061J38960J2547l88879J78804l32599j8002m57747j8559
14128G667656p2949Q2072q7940l02879k30257R1763l65703L2045l3303J62959
$$ plain form
14118 6943464 6601869 6816844 6523876 6481185 6583964 6207010 6513302 6270689 6027548 6053479
14108 6053479 5832431 5604235 5943507 5693741 5274404 5412296 5507695 5449454 5234721 5224828
14098 5224828 5434702 5274924 5117123 4929226 4931812 4981229 4945267 4696466 4850850 5012772
14088 5012772 4408654 4741104 4432977 4786679 4794014 4592797 4475149 4563203 4486177 4175298
14078 4175298 4027618 3811442 4207432 3965150 4108711 3942952 3905928 3481618 3891641 3719684
14068 3719684 3897410 3602713 3704122 3715166 3884465 3961030 3545112 3720589 3643259 3836730
14058 3836730 3952638 3568225 3256156 3226592 3482172 3245516 3253755 3489114 3108058 2719717
14048 2719717 3022091 2830201 3073015 3099820 3148688 3106816 2961900 2599748 3195928 2732653
$$ packed form
14118F943464l41595K14975k92968m2691J02779l76954L06292k42613k43141K5931
14108F053479k21048k28196L39272k49766m19337J37892R5399n8241k14733r893
14098E224828K09874j59778j57801j87897K586M9417l5962k48801J54384J61922
14088E012772o04118L32450l08127L53702P335k01217j17648Q8054p7026l10879
14078D175298j47680k16176L95990k42282J43561j65759l7024m24310M10023j71957
14068C719684J77726k94697J01409J1044J69299P6565m15918J75477p7330J93471
14058C836730J15908l84413l12069k9564K55580k36656Q239K35359l81056l88341
14048B719717L02374j91890K42814K6805M8868m1872j44916l62152N96180m63275
$$ plain form
14038 2732653 2832349 2689055 2964436 2584367 2755474 2653789 2676066 2435231 2657947 2972961
14028 2972961 2618172 2664868 2553807 2614063 2492954 1964085 2306755 2422296 2036238 2040620
14018 2040620 2177853 2272879 2352306 2004001 2316840 2150703 2294932 1968648 2314438 2490472
14008 2490472 2297605 2019763 1992536 2027190 1654695 1922534 2073835 2021656 1667454 1753973
13998 1753973 1771509 1787721 1723066 2054118 1749333 1538617 1859557 1645001 2015400 3017923
13988 3017923 4932577 11288221 28353482 44774324 26922768 14503632 8046717 5148464
13980 5148464 4182666 3860621 3118102 2761358 2747626 2556912 2266802 2295938 2348810 2393589
13970 2393589 2190350 2088384 1849336 2100692 1975810 1781846 1882629 1663509 1628777 1988962
$$ packed form
14038B732653R9696j43294K75381l80069J71107j01685K2277k40835K22716L15014
14028B972961l54789M6696j11061O0256j21109n28869L42670J15541l86058M382
14018B040620J37233R5026P9427l48305L12839j66137J44229l26284L45790J76034
14008B490472j92867k77842k7227L4654l72495K67839J51301n2179l54202Q6519
13998A753973J7536J6212o4655L31052l04785k10716L20940k14556L70399J002523
13988C017923J914654O355644J7065261J6420842j7851556j2419136o456915k898253
13980E148464r65798l22045p42519l56744j3732j90714k90110K9136N2872M4779
13970B393589k03239j01966k39048K51356j24882j93964J00783k19120l4732L60185
$$ plain form
13960 1988962 2046557 1801211 2017883 1772045 1696929 1635892 1932143 1687710 1671903 2163985
13950 2163985 1798098 1864814 1604104 1533433 1744942 1397912 1533424 1557997 1665156 1651031
13940 1651031 1764730 1439242 1286022 1772253 1443131 1397026 1492163 1688424 1148445 1033037
13930 1033037 1359875 1467942 1490316 1630484 1327792 1341286 1551586 1564232 1298980 1113474
13920 1113474 1547445 1453681 1290730 1302883 1508004 1412886 1897377 1402451 1352816 1152275
13910 1152275 1269852 1282976 925494 1270076 998961 1285210 1093808 1423019 1299068 966029
13900 966029 1113791 995312 940315 1263956 1227634 1035368 920044 1177966 1209543 1360289
13890 1360289 986486 1185989 980784 1276146 1354591 1464436 1229471 1278545 887389 1083881
$$ packed form
13960A988962N7595k45346K16672k45838p5116o1037K96251k44433j5807M92082
13950B163985l65887O6716k60710p0671K11509l47030J35512K4573J07159j4125
13940A651031J13699l25488j53220M86231l29122m6105R5137J96261n39979j15408
13930A033037L26838J08067K2374J40168l02692J3494K10300J2646k65252j85506
13920A113474M33971r3764j62951J2153K05121r5118M84491m94926m9635k00541
13910A152275J17577J3124l57482L44582k71115K86249j91402L29211j23951l33039
13900I66029J47762j18479n4997L23641l6322j92266j15324K57922L1577J50746
13890A360289l73803J99503k05205K95362P8445J09845k34965M9074l91156J96492
$$ plain form
13880 1083881 939836 1371564 1216787 837139 1217522 1173595 1128703 743121 1182355 881910
13870 881910 955285 1063006 976564 937077 667910 1181750 1008257 893607 1084641 913107
13860 913107 1162902 986326 796794 858517 1282467 725680 921936 963774 1001779 838963
13850 838963 964139 986084 829693 895129 803336 567462 868508 500252 786904 864631
13840 864631 1111102 953420 969045 1154529 640142 762248 710149 850576 817362 912830
13830 912830 775647 778399 907275 715208 1072541 1043467 851713 1095922 942686 1054040
13820 1054040 496934 707815 589084 841351 1063118 1018950 573996 751068 645183 836110
13810 836110 432015 433726 858654 788155 1197830 543667 416346 886015 627375 586882
$$ packed form
13880A083881j44045M31728j54777l79648L80383m3927m4892l85582M39234l00445
13870H81910P3375J07721q6442l9487k69167N13840j73493j14650J91034j71534
13860I13107K49795j76576j89532O1723M23950n56787J96256M1838L8005j62816
13850H38963J25176K1945j56391O5436r1793k35874L01046l68256K86652P7727
13840H64631K46471j57682J5625J85484n14387J22106n2099J40427l3214R5468
13830I12830j37183K752J28876j92067L57333k9074j91754K44209j53236J11354
13820A054040D96934K10881j18731K52267K21767m4168m44954J77072j05885J90927
13810H36110m04095J711M24928p0499M09675E43667j27321M69669k58640m0493
$$ plain form
13800 586882 752805 643891 867225 529436 649200 627169 587130 793067 645234 790406
13790 790406 516583 666028 683263 804906 734932 970333 439410 872181 635006 985310
13780 985310 623100 556567 722102 613876 338514 506564 393835 643784 764918 591219
13770 591219 774044 407136 483420 464094 634692 579207 715081 565066 537591 642603
13760 642603 409914 624818 862440 448814 943095 326767 532472 679347 564536 455826
13750 455826 360761 747429 485549 567547 485881 283075 592795 477906 412064 757352
13740 757352 542154 486088 748526 435818 515879 640025 455097 453443 377088 597713
13730 597713 708092 725271 600389 180077 877932 485327 244771 557156 621007 419093
$$ packed form
13800E86882J65923j08914K23334l37789J19764k2031m0039K05937j47833J45172
13790G90406k73823J49445J7235J21643o9974K35401D39410M32771k37175L50304
13780I85310l62210o6533J65535j08226k75362J68050j12729K49949J21134j73699
13770E91219J82825l66908P6284j9326J70598n5485J35874j50015k7475J05012
13760F42603k32689K14904K37622m13626M94281C26767K05705J46875j14811j08710
13750D55826r5065L86668k61880Q1998q1666k02806L09720j14889o5842L45288
13740G57352k15198n6066K62438l12708Q0061J24146j84928j654p6355K20625
13730E97713J10379J7179j24882A80077O97855l92605k40556L12385O3851k01914
$$ plain form
13720 419093 548972 427332 786054 729156 348097 272471 634526 523167 505316 273187
13710 273187 471726 457412 363376 393072 125038 331194 267926 772670 473210 428596
13700 428596 424719 554214 739584 311202 358786 219633 268621 667657 859550 440064
13690 440064 386606 377034 213194 439516 202972 160394 357753 296317 332672 424041 532523
13679 532523 453378 286317 357971 481413 568831 293510 526864 501930 405323 112369
13668 285346 350738 37276 548213 442678 332397 79543 401288 23543 321398 244765
13658 244765 236678 588361 387442 510613 448296 496744 380279 378021 77553 -28475 313053
13646 289907 535437 398928 375989 414222 511968 311642 212953 457802 430060 356736 290624
$$ packed form
13720D19093J29879j21640L58722n6898C48097p5626L62055j11359j7851k32129
13710B73187J98539j4314r4036K9696A25038K06156o3268N04744k99460m4614
13700D28596l877J29495J85370C11202M7584j39153M8988L99036J91893m19486
13690D40064n3458r572j63840K26322B02972m2578J97359o1436L6355R1369J08482
13679E32523p9145j67061P1654J23442Q7418k75321K33354k4934r6607A12369
13668B85346O5392C7276N10937j05535j10281G9543L21745B3543K97855p6633
13658B44765q087L51683k00919J23171o2317M8448j16465k258G7553b8475C13053
13646B89907K45530j36509k2939L8233R7746k00326r8689K44849k7742p3324o6112
$$ plain form
13635 290624 399065 422638 99566 225159 -113429 167530 399246 457454 322657 276993
13625 276993 209013 587951 533821 344582 551669 393666 166130 257699 756529 336295
13614 422594 786268 495346 259240 598591 133918 375811 169102 453132 270140 294141
13604 294141 423230 415836 321019 301022 384055 119878 44232 296990 346120 189507 222884
13593 222884 -12348 308355 358041 271310 489296 339790 167346 176324 457417 22085 19575
13582 19575 464983 362777 485858 501612 121166 208783 390525 151740 396274 239981
13572 239981 95631 399415 379595 287039 386048 380016 502312 560893 436476 216326 135694
13561 135694 478993 309057 213444 387996 255202 154273 206014 153930 413984 254707
$$ packed form
13635B90624J08441K3573I9566J25593a13429A67530K31716N8208j34797m5664
13625B76993o7980L78938n4130j89239K07087j58003A66130R1569M98830C36295
13614D22594L63674k90922k36106L39351A33918K41893A69102K84030j82992K4001
13604B94141J29089p394r4817j9997Q3033A19878D4232K52758M9130j56613L3377
13593B22884a2348C08355M9686q6731K17986j49506A67346Q978K81093B2085k510
13582A9575M45408j02206J23081J5754A21166Q7617J81742A51740K44534j56293
13572B39981I5631L03784j9820r2556R9009o032J22296N8581j24417B16326q0632
13561A35694L43299j69936r5613J74552j32794j00929N1741n2084K60054j59277
$$ plain form
13551 254707 72418 394573 618434 370335 4031 205666 16216 -273122 173587 231822
13541 231822 352140 135792 105233 299517 178944 -32260 324994 279784 333512 275713
13531 275713 217869 138057 204503 205808 47341 348882 408839 47952 308718 270545 91101
13519 480411 176069 -83768 37797 366622 192351 722048 238272 177652 391947 597104
13509 597104 120344 525908 200269 49546 152322 110946 -54366 313844 319984 283318 291905
13498 291905 337926 151856 159036 -153920 -214620 138723 253351 281822 32188 336246 80990
13486 168210 297244 -144953 -19999 145467 136173 502732 386403 232588 299115 341576
13476 341576 170747 298835 278578 259066 488816 204006 48703 -45473 615806 139626
$$ packed form
13551B54707G2418L22155K23861k48099D031K01635A6216b73122A73587N8235
13541B31822J20318A35792l0559J94284j20573c2260C24994m5210N3728n7799
13531B75713n7844p9812O6446J305D7341L01541N9957D7952K60766l8173I1101
13519D80411A76069h3768C7797L28825j74271N29697B38272o0620K14295K05157
13509E97104A20344M05564B00269D9546J02776m1376e4366C13844O140l6666Q587
13498B91905M6021A51856P180a53920o0700A38723J14628K8471C2188L04058H0990
13486A68210J29034a44953a9999A45467r294L66559j16329j53815O6527M2461
13476C41576A70747J28088k0257j9512K29750B04006D8703d5473F15806A39626
$$ plain form
13465 476429 -46381 87239 107740 170574 187098 267156 234736 174719 264834 -27114 115810
13453 223182 -84935 -16665 126860 271596 -100465 271937 73838 134681 -35176 78501 135672
13442 135672 37184 288173 194691 193893 209235 -4335 -93494 210768 72836 146184 28227 -83494
13429 316741 244256 262138 85017 159290 -45715 368112 396370 178134 212850 211128 -136489
13417 133913 427455 -16736 -34614 -46079 171132 52586 106399 -95938 15727 316500 14874
13405 118677 359829 414358 230524 276890 150654 344844 262998 137730 15889 490610
13395 490610 -108520 269364 382715 144307 247694 -29265 150830 304508 84199 169811
13385 169811 373693 -6914 248224 -263698 154204 50930 379536 335085 261649 -416848
$$ packed form
13465D76429d6381H7239K0501O2834J6524Q0058l2420o0017R0115b7114A15810
13453B23182h4935a6665A26860J44736a00465B71937G3838O0843c5176G8501N7171
13442A35672C7184K50989r3482p98J5342d335q9159B10768G2836P3348B8227h3494
13429C16741p2485J7882H5017P4273d5715C68112K8258A78134L4716j722a36489
13417A33913K93542a6736j7878j1465A71132E2586N3813i5938A5727L00773A4874
13405A18677K41152N4529j83834M6366j26236J94190q1846j25268A5889M74721
13395D90610a08520B69364J13351A44307J03387b9265A50830J53678H4199Q5612
13385A69811K03882f914B48224b63698A54204E0930L28606m4451p3436d16848
$$ plain form
13374 -43995 -193419 278569 307696 176059 131354 -115082 225922 235603 426924 180650
13363 -45974 223938 462112 136370 220492 199329 186766 457698 155320 212382 -53992 -22374
13351 -20882 -36486 108839 175050 278193 328046 256654 375293 87913 -68392 321074 144124
13339 461583 230096 257323 124250 288513 369901 471678 148935 345498 205019 454385
13329 454385 -95903 280548 131474 62888 520889 148002 225544 452606 307171 186150
13319 186150 506619 343539 -39313 288535 178249 34389 300186 245543 338329 337332 171127
13308 171127 86675 116115 -3005 325764 74738 128602 209554 379661 -248572 181466 79773
13296 13466 -3710 460875 268126 377902 119007 75989 -109262 63571 -108903 345896
$$ packed form
13374d3995j49424B78569K9127j31637m4705a15082B25922R681J91321A80650
13363d5974B23938K38174A36370Q4122k1163j2563K70932A55320N7062e3992b2374
13351b0882j5604A08839O6211J03143M9853p1392J18639H7913f8392C21074A44124
13339D61583B30096K7227A24250J64263Q1388J01777A48935J96563j40479K49366
13329D54385i5903B80548A31474F2888M58001A48002P7542K27062j45435j21021
13319A86150L20469j63080c9313B88535j10286C4389K65797n4643R2786r97j66205
13308A71127q4452K9440c005C25764G4738N3864Q0952J70107b48572A81466G9773
13296A3466c710D60875j92749J09776A19007m3018a09262F3571a08903C45896
$$ plain form
13285 107501 -241051 265422 -35528 29578 307376 -323076 100631 90770 195961 -19132
13274 36980 116427 295463 169973 359054 336375 -10219 -214899 62453 344825 233095
13264 233095 64981 113629 75323 90552 27493 52446 269579 -19897 38802 275203 97709
13252 392326 453264 88592 162696 118033 279137 -175532 -88409 -68738 69916 155505 -122755
13240 199290 -21792 13313 257236 281888 -245975 52746 245846 134227 136140 -210623 58212
13228 267352 187672 -153837 -62383 24006 138902 194971 -66828 212757 138205 -59100 -11595
13216 540 30916 12359 53807 95247 236506 15742 -131136 66529 193145 -166302 266214
13204 168482 120659 -3257 295192 -98050 -410887 -89234 31223 83272 211775 -324602 237477
$$ packed form
13285A07501b41051B65422c5528B9578K77798c23076A00631r861J05191a9132
13274C6980P9447J79036j25490J89081k2679a0219k04680F2453K82372j11730
13264B33095F4981M8648l8306J5229B7493K4953K17133a9897C8802K36401I7709
13252C92326O0938H8592P4104m4663J61104a75532Q7123J9671F9916Q5589a22755
13240A99290b1792A3313K43923K4652b45975E2746J93100j11619J913b10623E8212
13228B67352p9680a53837f2383B4006J14896N6069f6828B12757p4552e9100a1595
13216E40L0376A2359M1448M1440J41259A5742a31136F6529J26616a66302B66214
13204A68482m7823c257B95192i8050l12837h9234C1223N2049J28503c24602B37477
$$ plain form
13192 36755 -63465 -6584 124507 -155241 318454 194991 142499 7712 -36531 -330594 -78076
13180 36397 158152 -263094 98154 -173864 170367 4536 34445 142944 170464 176530 -222591
13168 -15869 -190088 -28919 33720 213999 2785 78460 255828 38079 235886 -136902 110094
13156 63083 127190 286760 113734 229265 254455 -28861 310252 -330517 15989 594733
13146 594733 -127284 199123 42405 -59430 -241019 400498 47753 -193298 167484 -257714
13135 -122782 385399 -191235 160861 -91829 214371 185862 -100520 27026 -234030 27491
13124 -205180 -277225 107606 95741 -192743 106175 -278383 -117031 -106929 199504 -200975
13113 96113 330529 73571 -51337 -36715 -114401 -80056 8782 -175848 125416 16079 -59114
$$ packed form
13192C6755f3465f584A24507a55241C18454j23463n2492G712c6531k94063g8076
13180C6397J21755b63094I8154a73864A70367D536K9909J08499K7520O066b22591
13168a5869j74219b8919C3720J80279B785P5675J77368C8079J97807a36902A10094
13156F3083O4107J59570A13734J15531K5190b8861C10252c30517A5989N78744
13146E94733a27284A99123D2405e9430j81589D00498D7753a93298A67484b57714
13135a22782C85399a91235A60861i1829B14371k8509a00520B7026b34030B7491
13124b05180p2045A07606j1865a92743A06175b78383a17031J0102A99504b00975
13113I6113K34416G3571e1337J4622p7686L4345H782a75848A25416A6079e9114
$$ plain form
13101 -415121 47387 10567 52672 -293842 148701 301062 268000 100677 127607 378160
13091 378160 181361 24127 -222543 24203 134479 306589 -179099 227632 207311 -128893
13080 160665 -153212 -30914 100361 -93454 207473 -106750 121454 114963 40595 281843
13070 281843 -43380 170264 -114693 -468550 -158125 436593 125403 79108 156282 -94 -184077
13059 -184077 -21215 257638 421492 200134 -44062 -110598 -45804 136593 207325 187110 195950
13048 195950 128628 130524 -45438 221179 -99269 112684 203388 -70332 31110 -45751 -26185
13037 -26185 -25494 277534 3233 -19750 -2790 403342 -92483 -80431 334619 105389 -141423
13025 68326 108946 13046 82785 90446 -271286 -53888 284332 142163 317440 -226234 85697
$$ packed form
13101d15121D7387A0567M2105b93842A48701J52361l3062A00677K6930K50553
13091C78160A81361B4127b22543B4203J10276J72110a79099B27632k0321a28893
13080A60665a53212c0914A00361i3454B07473a06750A21454o491D0595K41248
13070B81843d3380A70264a14693l53857a58125D36593A25403m6295P7174i4j83983
13059a84077b1215B57638J63854B00134d4062o6536d5804A36593P0732k0215Q840
13048A95950o7322J896d5438B21179i9269A12684R0704g0332C1110d5751J9566
13037b6185O91B77534C233a9750b790D03342i2483J2052C34619A05389a41423
13025F8326M0620A3046O9739P661b71286e3888B84332A42163J75277b26234H5697
$$ plain form
13013 -67460 66575 -104220 -32402 -93237 86577 -34350 67447 -150700 69148 191560 -105476
13001 187010 138786 -194345 84361 52476 158272 -17398 -13608 149340 -78501 -26497 28172
12989 -48563 -19199 -96193 -379711 287758 146137 -113252 2245 115450 54215 269379 56101
12977 164014 91514 153684 240921 -184299 360996 -98423 290942 -68330 158798 -25267 123210
12965 311136 -55294 64372 -218555 80788 370317 12980 -129408 265964 67736 214987
12955 214987 -77963 70557 115039 163355 35507 -285711 -55674 53922 56474 117574 -158615
12943 14540 505288 496085 64967 97848 -15397 182608 -35500 -238753 -310083 166527 -154026
12931 22122 -835 -247667 -40755 -156564 39327 167615 59158 -196457 -177984 -26810 -20587
$$ packed form
13013f7460F6575a04220c2402o0835H6577c4350F7447a50700F9148J22412a05476
13001A87010m8224a94345H4361l1885J05796a7398L790A49340g8501b6497B8172
12989d8563a9199p6994k83518B87758j41621a13252B245J13205E4215K15164E6101
12977A64014p2500O2170Q7237a84299C60996i8423B90942f8330A58798b5267A23210
12965C11136e5294F4372b18555H0788K89529A2980a29408B65964F7736J47251
12955B14987g7963G0557M4482M8316C5507b85711e5674E3922K552O1100a58615
12943A4540M90748r203F4967L2881a5397A82608c5500k03253p1330A66527a54026
12931B2122h35k46832d0755j15809C9327J28288E9158a96457J8473b6810O223
$$ plain form
12920 -20587 240723 -94243 211988 161709 85081 23855 48475 -93418 -44261 133458 -156175
12908 -287798 -135517 156324 -236979 107461 -185329 34775 17595 -11014 -135772 -62556
12897 -230465 -117287 -16594 -182256 357027 163293 -151684 -178320 318302 -101125 -238427
12887 -238427 -96946 31835 124451 -47411 91873 -151021 -172025 254456 -157520 16272 162013
12876 162013 253826 132219 506152 195170 -183956 20669 156954 45380 174572 -281159
12865 -364522 155051 -85304 -136915 -77273 136840 228062 -26207 -370014 2870 32326 217132
12854 217132 -227081 -394 -317033 -199400 53135 -57990 -3090 -93443 78889 104960 67059
12843 67059 196390 140959 144919 31146 -32054 -51417 -179647 264834 157711 240269 61243
$$ packed form
12920b0587B40723i4243B11988n0279p6628B3855K4620i3418d4261A33458a56175
12908b87798a35517A56324b36979A07461a85329C4775j7180a1014j24758f2556
12897b30465J13178a6594j65662C57027A63293a51684k6636C18302a01125j37302
12887b38427i6946C1835R2616d7411I1873a51021k1004B54456a57520A6272J45741
12876A62013R1813j21607L73933A95170a83956B0669J36285D5380J29192b81159
12865c64522A55051h5304n1611N9642A36840R1222b6207l43807B870K9456J84806
12854B17132b27081c94l16639J17633E3135e7990c090r0353G8889K6071l7901
12843F7059J29331n5431L960C1146c2054j9363j28230B64834j07123Q2558F1243
$$ plain form
12831 44195 249728 58536 70966 -52124 67078 -253776 36756 -8663 -76265 -35331 184951
12819 -55550 102799 -218723 -279038 -103831 108326 -84465 39230 -115084 -214776 -45063 102827
12807 94003 -72800 -44229 -42473 -87108 318850 180046 28945 23764 166026 122386 -269101
12795 222370 -12984 -25739 -219485 -135352 104044 -73406 76609 -22958 66071 9557 121004
12784 121004 -20932 156730 -34254 -102463 56056 -348341 -70881 104301 -184898 19835 51214
12773 51214 -62464 -127346 -63647 276106 72328 56382 -208650 -60629 67599 285794 63193
12761 -158662 -179050 -244068 -96080 60445 242269 -26895 132198 37906 -54861 -139882 101079
12749 -79839 -7689 -253806 -106620 -212367 -51038 -251315 18501 88926 68151 162927 134236
$$ packed form
12831D4195K05533E8536J2430e2124F7078b53776C6756h663o7602c5331A84951
12819e5550A02799b18723o0315a03831A08326h4465C9230a15084r9692d5063A02827
12807I4003g2800K8571J756m4635C18850j38804B8945n181J42262m3640b69101
12795B22370a2984j2755j93746Q4133A04044g3406G6609b2958F6071I557J11447
12784A21004b0932A56730c4254o8209E6056c48341g0881A04301a84898A9835L1379
12773E1214f2464o4882f3647B76106G2328j5946b08650f0629F7599K18195F3193
12761a58662k0388o5018i6080F0445J81824b6895A32198C7906e4861q5021A01079
12749g9839g689k46117a06620j05747e1038k00277A8501P0425k0775R4776k8691
$$ plain form
12738 134236 198469 134273 -83645 -9948 293965 -126987 -343193 -17600 -127865 50253 -642
12726 242949 19452 26266 -88819 -154726 219044 68930 -259971 -245683 49683 -180858 54157
12714 -27751 -137473 -74390 188238 53781 -82841 -69557 327245 214743 257434 88628 97730
12703 97730 22719 111849 264602 151100 136104 20450 249649 253729 -289840 -492885 304419
12691 405423 -71377 -71265 -208652 116722 -123823 80791 295392 213119 72870 59335 -38127
12679 252485 243420 65896 -130381 6129 139020 239625 37388 110245 -12486 67544 137165
12668 137165 -298111 -359651 219339 37842 -44665 -75021 -202426 -51304 -99385 240480 52015
12656 -26633 354222 -175464 20925 -142522 364351 64588 100443 277161 -22367 -107728 20224
$$ packed form
12738A34236O4233o4196h3645i948B93965a26987k16206a7600j10265E0253f42
12726B42949A9452O814h8819o5907B19044F8930b59971J4288D9683a80858E4157
12714b7751j09722O3083A88238E3781h2841J3284C27245j12502M2691H8628R102
12703I7730B2719Q9130J52753j13502j4996B0450K29199M080b89840k03045C04419
12691D05423g1377J12j37387A16722a23823H0791K14601q2273G2870j3535c8127
12679B52485r065F5896a30381F129J32891J00605C7388P2857a2486F7544O9621
12668A37165b98111o1540B19339C7842d4665l0356j27405e1304m8081B40480E2015
12656b6633C54222a75464B0925a42522C64351F4588L5855J76718b2367q5361B0224
$$ plain form
12644 -55726 13317 45867 37791 23326 8430 -28955 -185887 -54642 -391580 17139 109766 -193040
12631 130110 188739 305922 155495 -194830 11294 314179 177990 364732 111180 -14972
12620 -49808 -162927 -10047 -124061 35257 -81236 -106421 47068 -50970 203462 -54824 76573
12608 12458 69560 208519 9863 29324 -67865 -109135 -41503 22531 74164 59700 -156740
12596 -129814 116087 -13022 -38488 250155 249201 -258063 -141227 22316 -115344 -148653 -241138
12585 -241138 54271 177208 82480 132353 -261692 -155250 153945 -63031 -24040 147572
12574 63474 210411 9529 8225 -24003 77181 24387 61849 138826 265208 -163123 55316
12562 -104904 -72920 -135314 -173646 -80060 -313323 526409 -2568 -229811 -48669 -152076 164024
$$ packed form
12644e5726A3317L2550q076j4465H430b8955j56932e4642l36938A7139R2627a93040
12631A30110N8629J17183j50427a94830A1294L02885j36189J86742A11180a4972
12620d9808j13119a0047j14014C5257h1236k5185D7068e0970B03462e4824G6573
12608A2458N7102J38959I863J9461f7865m1270d1503B2531N1633j4464a56740
12596a29814A16087a3022k5466B50155r54b58063J16836B2316a15344l3309r2485
12585b41138E4271J22937H2480M9873b61692J06442A53945f3031b4040A47572
12574F3474J46937I529j304b4003G7181B4387L7462P6977J26382a63123E5316
12562a04904L1984o2394l8332h0060k33263E26409b568k27243d8669j03407A64024
$$ plain form
12550 291979 -377529 -210300 177502 127109 -106147 38841 -18148 105821 -13527 -6856 87771
12538 -95340 -146718 69497 198521 49996 76509 -72547 -30166 203529 140372 176118 -201358
12526 44258 -155811 -58099 -39339 -92619 -19848 9714 -121791 34981 6479 126307 1096 141946
12514 141946 30708 100208 -10440 -133052 -148484 101363 -127379 84684 -202833 -82100 -405473
12503 -405473 461796 143302 71656 -225385 224152 83269 64227 -68250 -204128 329057
12492 -12164 -241870 162848 -195450 -175560 -62308 -232321 895 80936 95931 43365 109099
12481 109099 -84093 21963 -103301 341525 -86360 247290 -167679 325058 114582 66517
12471 66517 -8797 -130892 -27019 375721 -280836 -108996 -125172 81709 -120315 -123958 73100
$$ packed form
12550B91979c77529J67229A77502n0393a06147C8841a8148A05821a3527O671H7771
12538i5340n1378F9497J29024D9996K6513g2547c0166B03529o3157L5746b01358
12526D4258a55811e8099J8760n3280a9848I714a21791C4981F479J19828A096J40850
12514A41946C0708O9500a0440j22612j5432A01363a27379H4684b02833h2100l23373
12503d05473D61796A43302p1646b25385B24152H3269j9042f8250j35878C29057
12492a2164k29706A62848a95450J9890f2308j70013H95Q0041J4995D3365O5734
12481A09099h4093B1963a03301C41525h6360B47290a67679C25058A14582m8065
12471F6517h797j22095b7019C75721b80836a08996j6176H1709a20315l643G3100
$$ plain form
12459 55655 236304 227449 -180755 234903 170134 -86845 -167978 -20523 -50553 -178819 191195
12447 -10216 -31785 -179478 -68730 193248 -178456 -46913 100570 200024 -118652 220742
12436 -120152 -237641 12764 44244 258668 -207979 -130170 36853 -49351 375783 115279
12425 9669 -50352 94104 39559 -29040 140765 178649 72099 231674 -588141 -10588 -44978
12414 -44978 -125765 -125636 74196 -96903 -238748 -35246 -103803 28489 -90354 233047 -131040
12402 -40775 -5558 7898 -230933 140236 112725 123023 44110 19587 -91630 -1659 -235954 303630
12389 -219644 -248487 75745 138806 134404 -48171 128450 -39409 225929 256586 369504 186507
12378 186507 9566 122980 53160 160492 32308 180252 -32744 453795 101160 197649 19534
$$ packed form
12459E5655J80649q855a80755B34903o4769h6845q1133b0523l0030j28266A91195
12447a0216k1569j47693f8730A93248a78456d6913A00570R9454a18652B20742
12436a20152j17489A2764L1480K14424b07979P7809C6853d9351C75783A15279
12425I669e0352I4104C9559b9040A40765L7884G2099J59575e88141a0588l4390
12414d4978q0787J29G4196i6903j41845c5246o8557B8489i0354B33047a31040
12402d0775e558G898b30933A40236k7511J0298D4110A9587i1630a659k34295C03630
12389b19644k8843G5745O3061m402d8171A28450c9409B25929L0657J12918j82997
12378A86507I566J13414E3160J07332C2308J47944c2744D53795A01160R6489A9534
$$ plain form
12366 -366093 -126011 -42460 248925 -322814 -235944 -122213 -7054 67833 -89066 -59927 62395
12354 -77950 -378926 60222 69279 -42939 -290430 -184537 -78947 -99987 -307511 81260 59808
12343 59808 100236 183621 -71501 110199 136744 610 88456 -282088 144593 97378 -9747 87970
12330 -28563 174289 513936 -100301 213443 244685 36291 266467 298023 415162 156736
12319 129442 -44303 265913 -17328 234750 74063 203195 -14868 48197 31071 289681 -11451
12307 18896 -144912 76133 120187 -139707 28700 -83957 -111820 219276 39551 -165180 8497
12295 59837 -273188 -64717 21722 120992 196369 272287 -19877 191770 6071 -243147 -104110
12283 181319 -133332 73941 56256 230283 110349 277104 301781 30416 116787 192750 -166904
$$ packed form
12366c66093a26011d2460B48925c22814Q6870J13731g054F7833h9066K9139F2395
12354g7950l00976F0222R057d2939k47491J05893g8947k1040k07524H1260k1452
12343E9808M0428Q3385g1501A10199K6545F10Q7846b82088A44593m7215i747H7970
12330b8563A74289L39647a00301B13443L1242C6291K30176L1556J17139A56736
12319A29442d4303B65913a7328B34750G4063J29132a4868D8197j7126K58610a1451
12307A8896a44912G6133M4054a39707B8700h3957k7863B19276C9551a65180H497
12295E9837b73188f4717B1722R9270P5377P5918a9877A91770F071b43147a04110
12283A81319a33332G3941j7685J74027A10349J66755K4677C0416Q6371P5963a66904
$$ plain form
12271 473067 -222641 302036 80618 617231 259187 306764 295704 217828 92333 -87424 7648
12259 110115 100106 414905 238211 264078 -218846 177893 -17975 449455 18106 -15044
12248 315085 273622 270103 -50005 140036 196799 641719 -153871 240194 -174232 325993
12237 -212984 121190 292305 46005 143149 3319 -136051 -157009 48118 -206059 -45842 -111094
12226 -111094 151911 87671 -110073 -52710 451337 161339 263662 82919 307396 -22948
12215 309601 181894 129131 -18775 350621 315608 -120357 319871 228559 218259 -177445
12204 48991 123590 -168449 146139 -214213 162594 102236 54835 87770 182903 187461 101956
12193 101956 191006 210165 346890 283959 6703 138619 422302 419126 -208646 352141 225950
$$ packed form
12271D73067b22641C02036H0618N36613B59187M7577j1060p7876I2333h7424G648
12259A10115j0009L14799j76694K5867b18846A77893a7975D49455A8106a5044
12248C15085m1463l519e0005A40036N6763M44920a53871B40194a74232C25993
12237b12984A21190J71115D6005R7144C319a36051k0958D8118b06059d5842o5252
12226a11094A51911o4240a10073e2710D51337A61339J02323H2919K24477b2948
12215C09601j27707n2763a8775C50621l5013a20357C19871r1312j0300a77445
12204D8991P4599a68449A46139b14213A62594o0358m7401L2935R5133M558q5505
12193A01956Q9050J9159J36725o2931F703J31916K83683l176b08646C52141j26191
$$ plain form
12182 225950 98561 215036 209726 -59545 331959 67494 252404 -55055 109177 -33425 30310
12170 71033 359787 117623 298502 501781 469842 123366 381959 308237 295686 20287
12159 232136 264849 87547 25201 153550 61119 437660 145569 404 -1064 319442 226814
12148 226814 -2877 -62718 19709 379278 92649 352074 -44711 306899 -25978 29041 5996
12136 300401 298518 444906 215083 -268133 -229768 82447 41896 -351523 -17289 32211 61155
12125 61155 189024 375143 114169 -12605 127276 115743 -72081 -21075 563786 -267071
12114 -99797 35378 206478 528182 -223215 459202 209430 115594 210847 160385 -88701 314091
12102 49922 198322 130505 182376 68390 376295 57767 85188 56545 -28785 -135107 65124
$$ packed form
12182B25950I8561J16475n310e9545C31959F7494J84910e5055A09177c3425C0310
12170G1033K88754A17623J80879K03279l1939A23366K58593p3722j2551B0287
12159B32136L2713H7547B5201J28349F1119L76541A45569D04a064C19442r2628
12148B26814b877n9841A9709L59569I2649K59425d4711C06899b5978B9041E996
12136C00401j883J46388B15083b68133L8365H2447m0551c51523a7289C2211K8944
12125F1155J27869J86119A14169a2605A27276j1533g2081b1075E63786b67071
12114i9797C5378J71100L21704b23215D59202B09430r3836R5253n0462h8701C14091
12102D9922J48400o7817N1871F8390L07905E7767K7421k8643b8785j06322F5124
$$ plain form
12090 390172 4582 222029 319267 193155 65083 -68555 -8326 417075 163295 13620 126186
12079 126186 -129314 421493 -32085 115824 52285 12737 283626 50039 85913 -195576
12068 192903 -113094 254485 74341 -117774 -240842 59231 -74295 -232228 46982 -371212
12057 137533 -66660 119879 24578 194943 -243830 381683 -61565 -193450 -228656 142009
12046 -111103 172170 -412363 62024 5972 97516 129532 -211358 -102601 105766 -346813
12035 420024 242042 4474 126954 -126227 64208 333524 112633 47596 210635 452419
12025 452419 218793 189337 203424 -96802 136955 30600 -28991 -99004 189476 39968 -1147
12013 18785 190432 213893 16473 -6804 423299 -180888 -64237 40836 31005 63331 -461650
$$ packed form
12090C90172D582K17447R7238j26112F5083f8555h326D17075A63295A3620J12566
12079A26186a29314D21493c2085A15824E2285A2737K70889E0039L5874a95576
12068A92903a13094B54485G4341a17774j23068E9231g4295j57933D6982c71212
12057A37533f6660A19879B4578J70365b43830C81683f1565j31885l5206A42009
12046a11103A72170d12363F2024E972R1544L2016b11358a02601A05766c46813
12035D20024j77982D474J22480a26227F4208K69316A12633D7596J63039K41784
12025D52419B18793k9456J4087i6802A36955C0600b8991p0013A89476C9968a147
12013A8785J71647K3461A6473f804D23299a80888f4237D0836r831L2326d61650
$$ plain form
12001 16975 -109639 38683 -155586 173596 -84103 140113 259364 -21523 120383 -60534
11990 -13058 -48587 -23021 27142 13628 87981 130374 100328 48561 317359 137559 -249689
11978 325998 292434 118241 -117558 82998 218311 -22334 -112433 64017 -141541 -90633 187279
11966 -356619 -134868 -30786 -323501 -165639 -45124 -40376 -184838 100020 -231699 259865
11955 55739 -307347 94816 -291743 -141450 15662 -69037 216129 97133 -76987 -19901 -30146
11944 -30146 -136444 -105925 13360 -51004 23821 144206 82036 56914 -85520 -318224 126267
11932 -153076 -333341 -170549 -122657 184808 -293341 28565 -463673 -24944 -5003 200675
11921 -35292 36141 -190878 -182868 78856 83777 32203 26369 65761 -144265 4904 178829 -223288
$$ packed form
12001A6975a09639C8683a55586A73596h4103A40113J19251b1523A20383f0534
11990a3058l5529b3021B7142j3514P4353M2393l0046D8561K68798A37559b49689
11978C25998l3564A18241a17558H2998J35313b2334r0099F4017a41541N0908A87279
11966c56619a34868c0786k92715J57862d5124M748j44462A00020b31699B59865
11955E5739c07347I4816b91743a41450A5662f9037B16129I7133g6987a9901j0245
11944c0146j06298L0519A3360e1004B3821J20385o2170k5122h5520k32704A26267
11932a53076j80265J62792M7892A84808b93341B8565d63673b4944e003B00675
11921c5292C6141a90878Q010G8856M921C2203n834L9392a44265D904J73925b23288
$$ plain form
11908 -287213 126623 -54703 -65453 -116168 -79795 376951 212093 -128090 -253804 -191869
11898 -191869 -267842 21355 270638 74931 197946 26331 -255675 -109735 -158881 99950 -387915
11886 -194294 48001 -217028 425569 -249757 213494 -13155 -110871 304590 275481 -122869
11875 51310 -11795 -214213 -367016 -100627 17241 346365 -140423 -63733 377 258121 -15357
11863 -204671 -473424 66537 -61469 -94912 156000 203105 857 -9926 223532 -43450 -65577
11852 -65577 -4606 44918 117372 -110976 -82613 -19849 209085 4145 -53134 -56014 23657 -324175
11839 35867 -174868 -173459 137818 -9811 -169425 -341958 245267 -29497 63569 -224159 -243794
11828 -243794 -124396 -161704 -92123 104458 -22128 -123389 161508 112996 -215854 -250680
$$ packed form
11908b87213A26623e4703j0750n0715L6373C76951j64858a28090j25714O1935
11898a91869p5973B1355K49283G4931J23015B6331b55675a09735m9146I9950c87915
11886a94294D8001b17028D25569b49757B13494a3155r7716C04590k9109a22869
11875E1310a1795k02418j52803a00627A7241L29124a40423f3733C77K57744a5357
11863b04671k68753F6537f1469l3443A56000M7105H57i926B23532d3450k2127
11852f5577d606D4918P2454a10976K8363a9849B09085D145e3134k880B3657c24175
11839C5867a74868J409A37818i811j59614j72533B45267b9497F3569b24159j9635
11828b43794J19398l7308O9581A04458b2128j01261A61508m8512b15854l4826
$$ plain form
11818 -250680 -67266 374413 -6391 -118620 -138885 34859 -46411 -319791 -212289 -16136 299906
11806 -84612 -151393 -331567 121582 185757 -183313 -221620 -83219 -99866 47887 -20656 -145330
11795 -145330 77329 9413 84744 -53691 220329 40760 -339029 103494 138676 22849 -17525
11783 251844 45521 160899 95596 -179585 53215 -146915 129268 22868 -53172 -237181
11773 -237181 112423 -110369 -109949 -181148 -344665 -135692 -221148 -160308 40832 53043 452326
11762 452326 -159744 98775 -141278 -286657 55671 -226726 438345 -357744 -203291 -97045
11751 -381833 183745 29612 13592 -433827 -195842 -163570 -362819 96006 354860 -271175
11740 -88533 -33407 32533 327626 -60270 -129094 266472 68535 -98283 -25369 273112 -268958
$$ packed form
11818b50680f7266C74413f391j12229k0265C4859d6411k73380J07502a6136B99906
11806h4612o6781j80174A21582O4175a83313l8307h3219j6647D7887b0656j24674
11795a45330G7329I413P5331e3691B20329D0760c39029A03494L5182B2849a7525
11783B51844D5521J15378o5303a79585E3215a46915A29268B2868e3172j84009
11773b37181A12423a10369M20p1199j63517a35692q5456O0840D0832J2211L99283
11762D52326a59744I8775a41278j45379E5671b26726D38345c57744J54453i7045
11751c81833A83745B9612A3592d33827a95842L2272j99249I6006K58854b71175
11740h8533c3407C2533K95093f0270o8824B66472F8535i8283b5369B73112b68958
$$ plain form
11728 -211918 24725 -6429 -269680 -34042 -134328 -246533 -28044 -344994 -37145 153004 -247647
11716 -117307 128622 157917 174780 -410922 -46235 44316 -228036 -4954 -121045 360760 77970
11704 106063 247353 49120 170658 -243037 131781 341854 -32676 -125403 375420 -64525
11693 284351 -174510 552787 -115321 93788 497642 155249 -301413 229428 -95334 -78560
11683 -78560 164130 154462 -85496 -37 -294387 -100870 67745 283258 -279088 -274071 183122
11671 513771 24465 41734 -106018 12787 -130096 -53493 -210386 219810 -193444 568 -146735
11659 268906 348626 70659 102830 87554 283909 -79392 -2578 81927 206144 -91211 -205579
11648 -205579 120500 -295218 204771 -222008 53362 -61142 -16087 306264 135513 -75092
$$ packed form
11728b11918B4725f429k63251c4042j00286j12205b8044l16950c7145A53004b47647
11716a17307A28622K9295J6863d10922d6235D4316b28036d954j16091C60760G7970
11704A06063J41290D9120J21538b43037A31781K10073c2676r2727C75420f4525
11693B84351a74510E52787a15321I3788M03854A55249c01413B29428i5334J6774
11683g8560A64130r668h5496c7k94350a00870F7745K15513b79088N017A83122
11671E13771B4465J7269a06018A2787a30096e3493j56893B19810a93444E68a46735
11659B68906P9720G0659L2171j5276J96355g9392b578H1927J24217i1211j14368
11648b05579A20500b95218B04771b22008E3362f1142a6087C06264A35513g5092
$$ plain form
11637 -173524 99236 41712 -127046 -523822 159495 92194 171304 107489 54487 67691 -11783
11625 147945 38097 26673 -70957 101365 -107938 -144274 -184734 279760 -285631 -27499 -54754
11614 -54754 12290 -41295 -18186 73208 -137773 38393 49216 114394 -62443 -27076 141648
11602 24830 330143 -364126 96996 294082 126117 -200780 -50107 83805 226714 91116
11591 -166649 983 -287339 163939 259692 744 -49686 267372 -215847 39462 -373288 215688
11579 62359 99412 -149043 -108927 14910 103882 -190554 250285 103826 29500 269927 -534344
11567 -170899 -132952 -201851 -57364 312201 24242 17751 -323412 -151545 -245890 104296 -70
11555 176068 -127928 -196503 -226967 48056 -211042 -291948 -209449 194668 -51535 -43305 -83303
$$ packed form
11637a73524I9236D1712a27046l96776A59495o7301P9110o3815n3002J3204a1783
11625A47945C8097j1424g0957A01365a07938l6336m0460B79760b85631b7499k7255
11614e4754A2290d1295a8186G3208a37773C8393J0823O5178f2443b7076A41648
11602B4830L05313c64126I6996J97086A26117b00780e0107H3805J42909I1116
11591a66649I83b87339A63939R5753G44d9686B67372b15847C9462c73288B15688
11579F2359L7053a49043M0116A4910Q8972a90554B50285A03826B9500K40427e34344
11567a70899L7947o8899e7364C12201B4242o491c23412a51545r4345A04296g0
11555A76068a27928o8575l0464D8056b11042q0906Q2499A94668e1535Q230l9998
$$ plain form
11544 -83303 202072 -54889 -251093 -152369 133415 63476 175978 -22273 -53130 115749 277504
11533 277504 27586 382671 -324998 -90786 -3426 -225017 -10446 62704 51922 178790 170140
11522 170140 97644 248912 327392 212319 269052 13658 -242680 69688 287953 -313102
11511 103890 264342 39717 -162350 280769 -81000 208597 -207245 260019 249751 -1140
11500 181351 246720 238287 31048 112065 155241 156640 270503 26243 -138229 60740 31859
11489 31859 220726 131453 143329 -155315 226527 88923 -326 201712 -60446 174327 297777
11478 297777 211723 -28050 -19591 47568 362671 13950 148552 232147 248863 361666 390664
11467 390664 -9544 403023 -43058 84046 146936 206529 217437 17097 105331 448947 23550
$$ packed form
11544h3303B02072e4889j96204R8724A33415F3476J12502b2273l0857A15749J61755
11533B77504B7586L55085c24998i0786c426k21591a0446F2704j0782J26868q650
11522A70140p2496J51268P8480j15073N6733A3658b42680F9688K18265c13102
11511A03890J60452C9717a62350B80769h1000B08597b07245B60019j0268a140
11500A81351O5369q433C1048Q1017M3176J399J13863B6243a38229F0740k8881
11489C1859J88867q9273J1876a55315B26527H8923c26B01712f0446A74327J23450
11478B97777q6054b8050Q459D7568L15103A3950J34602Q3595J6716J12803K8998
11467C90664i544D03023d3058H4046O2890N9593J0908A7097Q8234L43616B3550
$$ plain form
11455 543325 -112070 164922 148463 253722 14630 86419 229900 233039 -139256 -108557 -172575
11444 -172575 -449273 92147 -239955 301024 137975 178814 10056 92334 -357619 203165
11433 143209 -74681 17393 380384 300344 182425 -161007 -29874 -303239 93250 -175044
11422 510570 196245 -79931 179155 -3509 -135924 175280 42382 56837 188167 329831
11412 329831 -221291 40834 -254793 31009 -20430 210875 73926 145911 -79893 -112915 11520
11400 -224152 -68011 81861 18536 -362 -167132 -18490 -194573 70192 136032 -45266 -325296
11389 -325296 -176397 -280136 87000 -105152 103044 231769 -363455 -220671 131457 -117550
11378 -207242 322662 -244418 -517447 246051 327279 -358348 -248400 274048 37716 -322000
$$ packed form
11455E43325a12070A64922j6459J05259A4630P1789J43481L139a39256L0699o4018
11444a72575k76698I2147b39955C01024A37975M0839A0056Q2278c57619B03165
11433A43209g4681A7393L62991q0040j17919a61007b9874k73365I3250a75044
11422E10570A96245g9931A79155c509j32415A75280D2382J4455J31330J41664
11412C29831b21291D0834b54793C1009b0430B10875G3926P1985g9893l3022A1520
11400b24152f8011H1861A8536c62j66770a8490j76083G0192O5840d5266k80030
11389c25296J48899j03739H7000a05152A03044J28725c63455J42784A31457a17550
11378b07242C22662b44418k73029B46051Q1228c58348J09948B74048C7716c22000
$$ plain form
11367 129779 -138783 -153721 -90493 21262 -219054 -29974 137101 -224462 -223721 149421 82320
11356 82320 -134183 333417 -3450 200449 290868 -271632 186277 13641 -133710 -245012
11346 -245012 -351524 -125356 563792 4123 174925 -23042 308536 125863 -81143 -111850
11336 -111850 -281331 -231486 -197675 -268765 -73917 -361574 14454 -73816 -200306 162298 -17974
11324 254017 33622 -100133 -35531 24386 -26389 158829 118248 -11693 291317 -118199 -244446
11313 -244446 -268844 178900 -167760 252301 -63534 -463 -113567 -36804 -61858 209033 206614
11302 206614 -7242 -377454 133693 171199 -189776 10985 -25689 4165 -224289 115867 -135431
11290 -126464 -4225 -73387 -144563 176943 -212110 -25 -334473 82724 -79568 86155 -169212
$$ packed form
11367A29779a38783j4938O3228B1262b19054b9974A37101b24462P41A49421o7101
11356H2320a34183C33417c450B00449R0419b71632A86277A3641a33710j11302
11346b45012j06512a25356E63792D123J70802b3042C08536A25863h1143l0707
11336a11850j69481M9845L3811p1090g3917k87657A4454g3816j26490A62298a7974
11324B54017C3622a00133c5531B4386b6389A58829m0581a1693B91317a18199j26247
11313b44446k4398A78900a67760B52301f3534d63j13104c6804k5054B09033k419
11302B06614g242l70212A33693L7506a89776A0985b5689D165b24289A15867a35431
11290a26464d225o9162p1176A76943b12110b5l34448H2724g9568H6155a69212
$$ plain form
11278 40375 95872 -176323 -112790 -283126 30115 233372 250723 -250947 31958 134540 -170576
11266 -299978 40498 -147743 -245057 -148432 -120899 -307602 238105 106614 17926 77953 -55435
11254 40434 -156594 243450 -213479 -213910 72198 -31862 236398 -81673 38585 -77258 -74834
11243 -74834 -17173 -217382 -269785 -7643 -26253 -60240 -128847 -7416 262201 182432 -260931
11231 253181 -226511 275058 102412 -247462 71724 -56131 107843 -241309 -222110 69 38212
11220 38212 -48433 -293917 14957 72585 -316637 -69213 -2854 -211497 -284179 -427047 -38134
11208 40914 119198 -83024 -274003 -220054 -97315 -204844 -394364 -144612 -128747 -47133 -44106
11197 -44106 -43900 178490 180956 -243026 -119781 -322669 -331758 132534 -19546 -279283 223684
$$ packed form
11278D0375N5497a76323O3533j70336C0115K03257J7351b50947C1958J02582a70576
11266b99978D0498a47743r7314R6625K7533j86703B38105A06614A7926O0027e5435
11254D0434a56594B43450b13479m31G2198c1862B36398h1673C8585g7258K424
11243g4834a7173k00209n2403g643j8610l3987o8607g416B62201p9769b60931
11231B53181b26511B75058A02412b47462G1724e6131A07843b41309J9199F9L8143
11220C8212d8433k45484A4957N7628c16637f9213b854k08643p2682j42868c8134
11208D0914P8284h3024j90979N3949i7315j07529j89520a44612J5865d7133L027
11197d4106K06A78490K466b43026a19781k02888r089A32534a9546k59737B23684
$$ plain form
11185 183951 -115916 -65746 140530 56974 1765 -62673 180464 -324834 -191212 -142236 -160699
11174 -160699 -493960 186834 -60943 -35621 -54424 -50763 -361987 -209498 -379157 -71130 -6597
11162 -41050 -181274 40733 41100 -91008 -6194 -5542 -209020 -36790 93748 -213656 -111132 -252080
11150 -252080 111637 -130784 60602 -136694 126966 -81451 154705 -301205 -242580 -111559
11139 129504 37638 -190921 27629 -34258 123998 228086 -13353 -289585 72483 197075
11129 197075 123937 -286454 -81125 242494 118842 342385 -191707 316196 -50756 -62080
11119 -62080 -74949 112295 373312 199134 -19444 -33030 -64949 99631 279820 421227 66934
11107 -153370 56151 57829 246198 200298 -79689 -192506 213110 371268 202623 -28616 14027
$$ packed form
11185A83951a15916N0170A40530E6974A765f2673A80464c24834J33622M8976j8463
11174a60699l33261A86834f0943K5322j8803L661l11224J52489j69659g1130f597
11162d1050j40224D0733L67i1008f194O52k03478c6790I3748b13656J02524j40948
11150b52080A11637a30784F0602a36694A26966h1451A54705c01205N8625a11559
11139A29504C7638a90921B7629c4258A23998J04088a3353k76232G2483J24592
11129A97075p3138b86454h1125B42494A18842K23543a91707C16196e0756j1324
11119f2080j2869A12295K61017j74178a9444j3586l1919I9631J80189J41407F6934
11107a53370E6151J678J88369m5900g9689j12817B13110J58158j68645b8616A4027
$$ plain form
11095 206456 -69760 127984 281705 350294 -1577 -86811 69054 265923 346687 328132 450468
11084 450468 56229 9410 386029 277610 9852 151618 -42064 64518 132639 -51810 129565
11072 476603 59758 401616 162104 193390 276339 332485 218884 134798 62424 -120383 310504
11060 313700 287781 367820 292089 419564 625525 473276 284095 575248 399310 833504
11050 833504 606319 744323 864282 787471 562688 723364 711835 882359 552118 795473
11040 795473 711401 886405 656034 644031 551774 561216 640044 869520 415235 950929 523653
11029 523653 419790 322123 823817 487974 957446 861466 983156 583584 620752 987657
11019 987657 544391 1004306 431016 430473 588716 570745 621782 555938 596334 105057 621867
$$ packed form
11095B06456f9760A27984J53721O8589a577q5234F9054J96869Q0764j8555J22336
11084D50468E6229I410L76619j08419I852J41766d2064F4518O8121e1810A29565
11072D76603E9758L41858A62104L1286Q2949N6146j13601q4086F2424a20383C10504
11060C13700k5919Q0039p5731J27475K05961j52249j89181K91153j75938M34194
11050H33504k27185J38004J19959p6811k24783J60676j1529J70524l30241K43355
11040G95473q4072J75004k30371j2003r2257R442P8828K29476D15235N35694m27276
11029E23653j03863r7667N01694l35843M69472r5980J21690l99572L7168L66905
11019I87657m43266M59915D31016n43J58243j7971N1037o5844M0396A05057N16810
$$ plain form
11008 621867 294026 810811 309861 665188 499780 756216 375687 222469 574121 903222
10998 903222 589473 773866 215669 721920 720568 445557 653303 655966 733794 603228
10988 603228 520010 958144 355004 812983 587002 683194 931923 760024 747223 1150678
10978 1150678 882150 989612 969738 1240742 1141974 1687493 1640610 1862989 1953691 2045842
10968 2045842 2249226 2546350 2787224 2482193 2284915 2784435 2080694 2171918 1662591 1546054
10958 1546054 1486521 1470672 1550798 1170157 1421184 1418266 1397582 1333320 1405977 1153984 1169072
10947 1169072 925840 622356 357579 523991 483855 632664 219865 -80945 -52972 -418
10936 319852 250180 15524 78801 220694 57398 -39968 101066 304663 250325 -255429 -161086
$$ packed form
11008F21867B94026N16785C09861L55327j65408K56436C75687j53218L51652L29101
10998I03222l13749J84393B15669N06251j352k75011K07746K663P7828j30566
10988F03228q3218M38134C55004M57979k25981R6192K48729j71899j2801M03455
10978A150678k68528J07462j9874K71004r8768N45519m6883K22379R0702R2151
10968B045842K03384K97124K40874l05031j97278M99520p03741R1224n09327j16537
10958A546054n9533j5849Q0126l80641K51027k918k0684o4262P2657k51993J5088
10947A169072k43232l03484k64777J66412m0136J48809B19865h0945K7973d18
10936C19852o9672A5524O3277J41893E7398c9968A01066K03597n4338b55429R4343
$$ plain form
10925 -161086 -72180 -141827 7000 34366 -1076 -126863 -309225 327941 42627 6762 -449284
10913 -50002 -104370 -71567 -99605 -186631 -66122 -193839 1664 -54295 -8521 -81211 124517 15580
10900 -232125 -195697 -78387 67483 48988 -143956 82275 162761 -57204 49278 49161 372962
10889 372962 2168 34448 -143512 19370 172022 -297085 84299 83013 342754 -129603 -192583
10878 -192583 54042 250930 -109083 143713 -56966 -245069 -135252 -131004 177815 14572
10867 229727 -239250 -102582 -248750 -89437 -148614 452322 -94577 -267228 94519 59560
10857 59560 -185501 100447 -33740 271600 -217577 863 21727 -166343 -104197 -49305 77340
10845 -90886 74229 -258532 186324 -48233 368978 -25331 -192072 -76846 -322887 64687 -164877
$$ packed form
10925a61086g2180o9647G000K7366a076j25787j82362C27941D2627F762d49284
10913e0002n4368L2803k8038q7026f6122j27717A664e4295h521p2690A24517A5580
10900b32125L6428g8387F7483j8495a43956H2275Q0486e7204D9278j17L23801
10889C72962B168L2280a43512A9370J52652b97085H4299j286K59741a29603o2980
10878a92583E4042J96888a09083A43713e6966j88103J09817M248A77815A4572
10867B29727b39250a02582j46168h9437n9177D52322i4577j72651I4519l4959
10857E9560a85501A00447c3740B71600b17577H63K0864a66343O2146d9305G7340
10845i0886G4229b58532A86324d8233C68978b5331j66741g6846k46041F4687a64877
$$ plain form
10833 257242 -310793 -113283 75128 -249049 -282617 -37112 -48584 -105357 159266 -28886 145331
10821 26310 255432 -43051 -41394 -165445 -157736 64013 -215948 2755 -294401 -213704 -175943
10810 -175943 154327 166035 42934 -82377 -131027 -33361 -184059 19711 -8553 -321196 105172
10798 155734 17368 -217308 -377182 45762 -68436 84672 -290664 -60186 -135376 -126217 -100895
10787 -100895 -62764 35931 -156169 -123159 260199 -273217 31217 103503 93466 221095 111391
10776 111391 -161341 -29711 -497315 218321 59620 -123781 -107441 189804 24333 -167782
10765 -23394 -282024 131413 -73807 -136656 102926 -66660 -347420 150206 -64586 51920 -91264
10753 328395 103372 188149 -207047 60107 -26672 11965 -277032 -21086 -337630 -51880 158313
$$ packed form
10833B57242c10793a13283G5128b49049l3568c7112j1472n6773A59266b8886A45331
10821B6310K29122d3051J657j24051P709F4013b15948B755b94401Q0697L7761
10810a75943A54327J1708D2934h2377m8650c3361j50698A9711h553l12643A05172
10798A55734A7368b17308j59874D5762f8436H4672b90664f0186p5190R159K5322
10787a00895L8131C5931a56169L3010B60199b73217C1217P2286j0037J27629j09704
10776A11391a61341b9711m67604B18321E9620a23781J6340A89804B4333a67782
10765b3394k58630A31413g3807o2849A02926f6660k80760A50206f4586E1920i1264
10753C28395A03372Q4777b07047F0107b6672A1965b77032b1086l16544e1880A58313
$$ plain form
10741 -159075 380764 -212950 107704 -245223 27315 -157198 39320 42351 -155792 2056 -230291
10729 -104062 -297679 151125 -10048 -159243 -29942 -276995 275977 121262 -215220 -226850
10719 -226850 -10141 -35917 -294824 323643 4747 -114314 52162 -185982 -9093 -127871 -340855
10708 -340855 69596 -67058 35135 410115 -164243 315725 -94212 -176134 -62302 39746 -177742
10696 74358 62530 -142511 -91244 24537 -27401 69527 44276 176903 -131669 -42137 39014
10684 -89075 30355 -134637 9943 -40023 -147298 -163251 51540 94796 -179509 68272 -64489
10672 72310 -82586 -299161 -8335 95043 98982 -116994 347472 -292864 -148870 120656 110485
10661 110485 -89189 37969 301686 -194623 -78985 -286132 -58435 41416 -306282 -148591
$$ packed form
10741a59075C80764b12950A07704b45223B7315a57198C9320L031a55792B056b30291
10729a04062j93617A51125a0048j49195b9942k47053B75977A21262b15220j1630
10719b26850a0141k5776k58907C23643D747a14314E2162a85982i093j18778k12984
10708c40855F9596f7058C5135L74980a64243C15725i4212q1922f2302C9746a77742
10696G4358j1828a42511N1267B4537b7401F9527k5251J32627a31669d2137C9014
10684h9075C0355a34637I943d0023j07275j5953E1540M3256a79509F8272f4489
10672G2310h2586k16575h335I5043L939a16994C47472b92864J43994A20656j0171
10661A10485h9189C7969K63717a94623g8985k07147e8435D1416c06282a48591
$$ plain form
10650 -338900 170278 -247046 -113924 -59175 -265531 -3062 -281638 -25502 -354163 -277131
10640 -277131 -208486 55530 -241685 -335404 -70173 -250822 17263 157436 1177 -171841 117592
10628 113442 -211376 -45051 -236084 -108761 -71791 -170027 -431836 -132105 56878 49030 -519316
10616 -69064 -44305 -1815 37582 59287 250890 -218750 -192848 -119778 -60180 -211434 -91738
10604 28937 -59107 -68062 205819 -51981 -15058 -259306 -50569 -168639 213639 -316125 146745
10592 137457 31837 163127 -225329 -118966 -315900 -304347 181254 -118533 110016 -212674
10581 -228007 -12493 188317 -331172 -154554 75357 -135516 -2578 -137348 -68178 46853 -191605
10569 86916 125561 -49829 93301 39311 -181165 142168 -368018 -43176 89679 31130 -4046
$$ packed form
10650c38900A70278b47046a13924N4749k06356c062k78576b5502l28661P7032
10640b77131O8645E5530b41685r3719g0173j80649A7263J40173A177a71841A17592
10628A13442b11376d5051j91033a08761L6970r8236k61809a32105E6878p848e19316
10616f9064K4759a815C7582K1705J91603b18750K5902P3070N9598j51254i1738
10604B8937e9107q955B05819e1981a5058k44248e0569j18070B13639c16125A46745
10592A37457C1837J31290b25329J06363j96934J1553A81254a18533A10016b12674
10581b28007a2493A88317c31172a54554G5357a35516b578j34770f8178D6853a91605
10569H6916L8645d9829I3301C9311a81165A42168c68018d3176H9679C1130d046
$$ plain form
10557 18601 277679 -134669 -134797 -175099 236690 -189259 234588 -107070 -66554 -72630 -73452
10546 -73452 -244091 -213669 -56766 -179096 -187103 -463059 172252 51393 -204503 -138171 -234927
10535 -234927 344603 -327079 -70930 -58675 -27469 -211218 -156416 -43208 160651 -89247 -177086
10524 -177086 -220207 83743 -36919 -201478 -60794 -38666 192108 64664 149139 -192084 -85533
10512 -276456 117216 -233327 296559 -179217 -15199 -99589 -175349 -278974 -44570 186463
10501 -40804 73278 125711 96181 189765 -109569 91337 46858 -178461 24254 162198 -41477
10489 -193961 -107759 34112 93436 23924 -199403 43606 -133702 -164116 -48782 -302817 -16427
10477 108904 -62326 289780 406247 110958 210574 635201 53128 -74086 -130356 84680 102718
$$ packed form
10557A8601K59078a34669j28m0302B36690a89259B34588a07070M0516o076q22
10546g3452j70639L0422e6766j22330q007k75956A72252E1393b04503O6332r6756
10535b34927C44603c27079g0930J2255b7469j83749N4802d3208A60651h9247q7839
10524a77086m3121H3743c6919j64559f0794K2128A92108F4664Q4475a92084h5533
10512b76456A17216b33327B96559a79217a5199q4390p5760j03625d4570A86463
10501d0804G3278N2433k9530R3584a09569I1337m4479a78461B4254J37944d1477
10489a93961Q6202C4112N9324B3924a99403D3606a33702l0414d8782k54035a6427
10477A08904f2326B89780J16467A10958R9616M24627E3128g4086n6270H4680J8038
$$ plain form
10466 102718 90061 171554 53847 -42582 83184 -12906 -254580 134031 149052 -286099 483354
10454 -23089 198174 -95640 57071 -40155 -297289 -214665 87418 -209922 15683 -377350 -93481
10442 97294 -57763 -113294 50002 124119 -314940 35895 -101731 33819 299962 -69978 -183406
10431 -183406 -22419 67735 -75533 167459 -245962 124022 211161 -32979 -163769 -146127 -40261
10419 -13344 -136629 -36076 -43779 -269224 -395196 -27215 -46940 -83549 -274104 -96809 -366803
10408 -366803 261735 -131883 -105208 -282613 -246801 -320590 242093 143925 -316506 -213076
10398 -213076 -49964 180752 -257388 -163173 87619 113990 327606 164987 70251 267785
10388 267785 139036 14738 -36727 242853 146291 298119 -126986 -21280 212916 -144646
$$ packed form
10466A02718j2657Q1493E3847d2582H3184a2906k41674A34031J5021b86099D83354
10454b3089A98174i5640E7071d0155k57134Q2624H7418b09922A5683c77350i3481
10442I7294e7763n5531E0002P4117c14940C5895a01731C3819K66143f9978j13428
10431a83406b2419F7735g5533A67459b45962A24022Q7139c2979j30790J7642d0261
10419a3344j23285c6076p703k25445j25972b7215j9725l6609j90555i6809k69994
10408c66803B61735a31883K6675j77405L5812p3789B42093r8168c16506J03430
10398b13076d9964A80752b57388R4215H7619K6371K13616j62619G0251J97534
10388B67785j28749A4738c6727B42853r6562J51828a26986b1280B12916a44646
$$ plain form
10377 220569 101307 -165403 149556 323708 425009 196209 502210 162900 -242540 189781
10366 -93074 202935 450956 189859 250910 217783 175100 519655 259413 577953 232448
10355 -106864 143316 297644 -928 227014 168399 557980 560838 317153 106809 546190 283584
10344 283584 295841 269769 232193 499282 494808 250537 356654 30647 254998 323626 180261
10333 180261 117745 137941 218330 102393 21052 -13868 -119476 -121660 -5145 199792 -93763
10321 -131704 -237112 180273 169464 65399 353899 -9805 162617 36140 -97850 212090 489194
10310 489194 -74719 11868 -39923 141851 85757 -157782 169993 53061 143110 -305717 -22811
10298 -49956 -72631 -116972 -234939 283740 -450535 -53690 340647 109859 3101 -152334 -222717
$$ packed form
10377B20569A01307a65403A49556J74152J01301A96209L06001A62900b42540A89781
10366i3074B02935K48021A89859O1051l3127m2683L44555B59413L18540B32448
10355a06864A43316J54328i28B27014n8615L89581K858k43685A06809M39381k62606
10344B83584J2257k6072l7576K67089m474k44271J06117C0647K24351O8628j43365
10333A80261o2516K0196Q0389A02393B1052a3868j05608k184e145A99792i3763
10321a31704j05408A80273j0809F5399K88500i805A62617C6140i7850B12090K77104
10310D89194g4719A1868c9923A41851n6094a57782A69993E3061R0049c05717b2811
10298d9956k2675m4341j17967B83740d50535e3690C40647A09859C101a52334p0383
$$ plain form
10287 -222717 -42240 -34202 39747 -156964 -165997 275829 -45139 24747 44707 -147713 -65761
10275 -409773 274072 22484 -72185 15378 8421 -170616 -78429 -15934 82490 -124764 -208090
10264 -208090 -94118 -138991 -11997 167097 -118411 145100 -287045 14960 85748 133153 233732
10253 233732 201055 432639 210188 66661 -67127 77835 451907 -64704 -239528 8875 -106301
10241 215995 249835 148190 17931 187565 -39969 98785 33029 -100956 30328 -1802 20987
10229 -18423 -4248 239206 153989 187717 -429357 90489 46938 -178830 -276075 -45590 -115454
10218 -115454 134184 205127 -287831 -92069 117452 -166450 167241 -86935 203759 -375453
10207 -248741 58134 47879 326901 -215452 -310597 296609 -45838 -76683 -147940 -122763 185580
$$ packed form
10287b22717d2240Q038C9747a56964r033B75829d5139B4747J9960a47713f5761
10275d09773B74072B2484g2185A5378o957a70616g8429a5934H2490a24764q3326
10264b08090i4118m4873a1997A67097a18411A45100b87045A4960P0788M7405J00579
10253B33732l2677K31584B10188F6661f7127G7835L74072f4704j74824H875a06301
10241B15995L3840j01645A7931J69634c9969I8785C3029a00956C0328a802B0987
10229a8423d248B39206q5217L3728d29357I0489m3551a78830r7245d5590o9864
10218a15454A34184P0943b87831i2069A17452a66450A67241h6935B03759c75453
10207b48741E8134j0255K79022b15452r5145B96609d5838l0845p1257K5177A85580
$$ plain form
10195 185814 -219267 -334068 -309918 47057 -42595 -279806 21013 22764 518 84995 5699 -92864
10182 -103712 -157668 11839 -151058 -74171 -64843 188980 612 -423823 43447 -164833 233365
10170 -40284 -36031 -31164 -189096 106655 -278977 39101 -39716 -357427 -292771 -81641 -37459
10158 70689 -29604 23653 52098 -20413 -229362 -264630 -7353 -178269 -302183 -85867 -21140
10146 30106 -342340 46294 5538 -372359 -239812 -55751 -31965 -3837 -103444 -85469 -39457
10134 -54294 -190613 251054 -105965 27025 43406 -351091 -222552 75547 69238 123100 -5778
10122 104855 -76511 81937 -136054 -133303 -49268 140460 -116276 110741 -111413 92820 -28647
10110 -267320 -39360 130510 87495 -296294 154564 -20380 -140177 -62877 4756 110719 -9820
$$ packed form
10195A85814b19267j14801K4150D7057d2595k37211B1013J751E18Q4477E699i2864
10182a03712n3956A1839a51058g4171R328A88980F12d23823D3447a64833B33365
10170d0284M253M867j57932A06655b78977C9101c9716l17711O4656h1641c7459
10158G0689b9604B3653K8445b0413k08949l5268g353j70916j23914h5867b1140
10146C0106c42340D6294E538c72359J32547e5751K3786c837r9607J7975c9457
10134e4294j36319B51054a05965B7025J6381c51091J28539G5547o309N3862e778
10122A04855g6511H1937a36054K751d9268A40460a16276A10741a11413I2820b8647
10110b67320c9360A30510m3015b96294A54564b0380j19797f2877D756J05963i820
$$ plain form
10098 -160396 -96693 -66079 170584 -14907 -228489 57188 264417 -165749 336280 -273821
10087 -207680 -57821 142474 -195351 71850 -69802 254394 -91532 88849 -233456 -107803
10076 -586 171604 -187432 -74007 -93853 -370555 -101858 -343556 -161482 -342741 -190522
10066 -190522 -382041 -49691 -235558 -322559 -259184 334429 124736 -138749 -105682 -130549
10056 -130549 -333680 -307129 -191444 228912 84797 -147895 -181622 244562 -123824 -386680
10046 -386680 287572 19897 110341 229449 -163501 -310364 -308290 -65386 196253 -68529 -166334
10035 -166334 -233703 59747 -19601 43334 134580 -133843 155700 56181 172431 -489034 -75272
10023 123757 -78420 -105277 -247767 12383 -44783 -175905 -223027 132783 -82202 17375 172855
$$ packed form
10098a60396O3703L0614A70584a4907k13582E7188K07229a65749C36280b73821
10087b07680e7821A42474a95351G1850f9802B54394i1532H8849b33456a07803
10076e86A71604a87432g4007j9846k76702a01858k41698a61482j81259J52219
10066a90522j91519d9691j85867q7001O3375C34429A24736a38749L3067k4867
10056a30549k03131K6551J15685B28912H4797a47895l3727B44562a23824k62856
10046c86680B87572A9897R0444J19108a63501j46863K074f5386A96253f8529r7805
10035a66334o7369E9747a9601D3334R1246a33843A55700E6181J16250d89034g5272
10023A23757g8420k6857j42490A2383d4783j31122m7122A32783h2202A7375J55480
$$ plain form
10012 172855 -120195 -62625 32315 -59012 -275606 9832 -76260 -355253 -20476 -37128 -356917
10001 -356917 59990 -61218 -76466 41241 -50495 -426405 -60510 233497 41604 268953 -211080
9989 223566 275515 61944 -288778 -85131 104796 62850 -1176 -231978 90159 89839 -256503
9977 -99136 161719 -56192 -146019 -13190 -144424 -145244 -296976 -156197 95937 83106 50031
9966 50031 -98294 58602 57166 88399 -153300 -137687 -58423 110635 129493 -245985 86494
9954 34042 -162173 269936 10867 -145351 -303360 50710 294810 -307353 -304748 -61444 -260444
9943 -260444 -183786 -40483 -107874 -281033 113696 -294061 196158 124117 -57777 -98941 -99032
9932 -99032 -235704 -227700 301249 130497 -71747 52387 -41582 -433800 -138628 -114508 -120636
$$ packed form
10012A72855a20195N7570C2315e9012k16594I832g6260k78993b0476j6652l19789
10001c56917E9990f1218j5248D1241e0495l75910f0510B33497D1604K27349b11080
9989B23566N1949F1944b88778h5131A04796m1946a176k30802I0159l20b56503
9977i9136A61719e6192q9827a3190j31234q20j51732J40779I5937j2831l3075
9966E0031i8294E8602j436L1233a53300J5613e8423A10635J8858b45985H6494
9954C4042a62173B69936A0867a45351j58009E0710K44100c07353K605f1444j99000
9943b60444P6658d0483o7391j73159A13696b94061A96158p2041e7777m1164r1
9932i9032j36672Q004C01249A30497g1747E2387d1582l92218a38628K4120o128
$$ plain form
9921 -120636 83343 213798 -87217 -143954 250199 -273511 -2385 255532 -118929 -551374 -167024
9909 303602 75970 -87252 -157762 130446 -219488 69351 -79851 232741 -169746 -149994 145182
9897 -50773 -46407 -108080 261048 85292 136564 -224204 -186312 -337717 -285085 -318847 -266599
9886 -266599 -212274 -622859 -221453 40396 -134967 58373 304505 -240819 -591206 -97412
9875 -88654 -39399 356617 -237054 -112813 -84060 -18162 74491 -98396 54337 59470 -58604
9863 154865 -96046 -106048 74472 155219 -15992 201914 155671 -97806 3121 -133504 289297
9851 15076 89626 -28070 39565 138597 -231040 -14439 15735 10427 -75580 -49975 -335490 22312
9838 -4990 -256277 14488 -116052 909 -231581 2812 157441 110102 -167794 -118397 -32732 98355
$$ packed form
9921a20636H3343J30455h7217n6737B50199b73511b385B55532a18929m32445a67024
9909C03602G5970h7252p0510A30446b19488F9351g9851B32741a69746J9752A45182
9897e0773M366o1673B61048H5292N1272b24204L7892j51405N2632l3762N2248
9886b66599N4325m10585b21453D0396a34967E8373K46132b40819l50387i7412
9875h8654c9399C56617b37054a12813K8753a8162G4491i8396E4337N133e8604
9863A54865i6046j0002G4472Q0747a5992B01914m6243i7806C121a33504B89297
9851A5076P4550b8070C9565R9032b31040a4439A5735n308g5580K5605k85515B2312
9838d990k51287A4488a16052I09b31581B812J54629m7339a67794M9397c2732I8355
$$ plain form
9825 -11897 -5243 17568 -333101 44114 -575501 -4739 -153254 -101989 -84128 -104310 -174698 -111667
9813 -111667 -286984 -89393 -285680 148419 71168 -245406 -82457 61013 43955 -280955 -155575
9802 -155575 -317742 -273591 -59340 -131652 -158606 -179878 7303 -21645 -72505 -94419 -129231 -84327
9790 -84327 -154418 344786 -214841 143800 233283 -21830 -79886 -166103 -111790 -54497 -133087
9779 -133087 -313846 -50921 -371122 -22160 88326 -49805 -82829 -38131 10873 -52540 -66228
9768 -66228 -215206 138355 -27548 -352016 -146350 -225469 185391 -70589 123150 141101 -98732
9756 -119350 -112107 253276 -163554 126632 -129529 89602 135689 54572 -105805 -190027 91860
9744 49211 -58715 77714 -197991 -240987 -288241 -13845 -102329 -287351 -217840 -157591 -46793
$$ packed form
9825a1897e243A7568c33101D4114e75501d739j48515N1265J7861k0182p0388O3031
9813a11667j75317h9393j96287A48419G1168b45406h2457F1013j7058b80955J25380
9802a55575j62167M4151e9340p2312k6954k1272G303b1645n0860k1914l4812M4904
9790h4327p0091C44786b14841A43800Q9483b1830n8056q6217N4313e4497p8590
9779a33087j80759e0921l20201b2160H8326d9805l3024c8131A0873e2540j3688
9768f6228j48978A38355b7548l24468a46350p9119A85391g0589A23150J7951i8732
9756a19350P243B53276a63554A26632a29529H9602M6087E4572a05805q4222I1860
9744D9211e8715G7714a97991m2996m7254a3845q8484j85022O9511O0249d6793
$$ plain form
9732 -387523 -132897 -77563 -29072 32624 -117445 -89121 6309 88545 -23662 -116708 -183611
9721 -183611 -223984 3141 -81968 44902 163511 124086 83404 -292161 -174798 -58951 63141
9709 26103 157634 -259500 62627 111210 73311 -295900 -335733 -322835 -183380 -61145 -430042
9698 -430042 -61625 24809 -197789 -123764 -56424 -123635 -349441 -37778 -83018 -179382 -53229
9686 -130056 -249529 -271997 -6495 -294866 83423 -137694 48829 -3681 12362 -273179 -371611
9675 -371611 -121346 -295070 89339 -129942 -77165 -10587 316040 -266572 -2253 -30069 -86209
9664 -86209 -11523 -176490 223395 -32463 -54193 -96255 -252150 -264282 -265858 -28190 -157342
9653 -157342 -78833 -315140 243931 -31790 -136435 -221334 -55501 -8189 -117913 143247 -177125
$$ packed form
9732c87523a32897N5334b9072C2624a17445K8324F309Q2236b3662r3046o6903
9721a83611m0373C141h1968D4902J18609l9425m0682b92161J17363e8951F3141
9709B6103J31531b59500F2627M8583l7899b95900l9833J2898J39455f1145l68897
9698d30042f1625B4809a97789P4025e6424o7211k25806c7778m5240r6364e3229
9686a30056j19473k2468f495k88371H3423a37694D8829c681A2362b73179r8432
9675c71611a21346j73724H9339a29942N2777a0587C16040b66572b253k7816n6140
9664h6209a1523j64967B23395c2463k1730m2062j55895j2132j576b8190j29152
9653a57342P8509k36307B43931c1790j04645q4899e5501h189j09724A43247a77125
$$ plain form
9641 91694 -51547 -300600 -46032 237381 52785 -115210 -117744 -66156 132355 337040 81078
9629 -6128 -150667 66038 -154120 -126681 146963 -92691 138833 -141672 149083 -83217 343086
9617 232850 -160560 283254 -266284 146095 289492 -21180 -144495 -84450 -164789 22382
9606 16870 -296436 -173035 -298656 55927 -116074 -1238 -221806 58267 -93831 -158499 -79854
9595 -79854 -323447 -65477 95221 -8790 -277686 -70492 -53367 -212320 -133135 -275295 112514
9583 -86631 97644 -47107 -412996 -296482 -30901 -24328 -217643 -356223 249296 -70386 130619
9571 74089 -102752 -197302 -166876 212884 31653 -233370 -195156 -370730 -124074 -51514 117553
9559 -100612 204506 97306 40797 -97542 -120643 138857 -56826 -244879 -90678 237387 -298435
$$ packed form
9641I1694e1547k49053d6032B37381E2785a15210k534N1588A32355K04685H1078
9629f128j44539F6038a54120K7439A46963i2691A38833a41672A49083h3217C43086
9617B32850a60560B83254b66284A46095J43397b1180j23315O0045q0339B2382
9606A6870b96436J23401j25621E5927a16074a238k20568E8267i3831o4668P8645
9595g9854k43593f5477I5221h790k68896g0492J7125j58953P9185j42160A12514
9583h6631I7644d7107l65889J16514c0901O573j93315j38580B49296g0386A30619
9571G4089a02752r4550L0426B12884C1653b33370L8214j75574a24074e1514A17553
9559a00612B04506I7306D0797i7542k3101A38857e6826j88053i0678B37387b98435
$$ plain form
9547 -110165 242923 -50115 -318909 -89434 -42187 -160375 -309623 -164684 -70614 57655 -37142
9535 -229583 150904 -161118 -73440 -376075 -129567 -75307 -60456 -509514 34308 206111
9525 206111 21978 203860 -79936 132072 3301 4134 -271591 -21059 82936 -88495 -189609
9514 -189609 176109 -173593 143227 -168566 -325245 -90475 -117856 -99290 -210896 39584
9503 270125 -192692 166821 36238 -328520 -172510 10264 -217206 273929 -207257 -400780
9493 -400780 -55593 59330 -448074 -107628 36136 -232481 -294126 -60434 -248669 -125869 34053
9481 61161 201937 -34381 -224846 91596 -273427 -432836 -260133 -258667 163971 -359609 157018
9469 -140642 -161676 -178086 -144642 91848 -157740 50055 209741 180579 -171161 156852 -340530
$$ packed form
9547a10165B42923e0115k68794h9434d2187j18188j49248J44939g0614E7655c7142
9535b29583A50904a61118g3440l02635a29567N4260J4851m49058C4308J71803
9525B06111B1978J81882g9936A32072C301Q33b71591b1059H2936h8495j01114
9514a89609A76109a73593A43227a68566j56679i0475k7381J8566j11606C9584
9503B70125a92692A66821C6238c28520J56010A0264b17206B73929b07257j93523
9493d00780e5593E9330d48074a07628C6136b32481o1645f0434j88235J22800C4053
9481F1161J40776c4381j90465I1596b73427j59409J72703J466A63971c59609A57018
9469a40642k1034j6410L3444I1848a57740E0055J59686k9162a71161A56852c40530
$$ plain form
9457 -178931 33895 9236 -86495 41482 -181131 53996 65537 -70034 98322 -108280 161235
9445 138858 179850 -83610 -26995 -53322 272126 -264935 -7944 78840 -113009 -141099 -317984
9434 -317984 44056 -193563 -28272 -253820 -42667 -196306 54840 -59708 58818 -135171 -103517
9423 -103517 -350932 -138504 176204 -174067 -294099 70268 -188195 -103994 120480 -23895
9412 68808 4776 -113225 215260 -44310 -315992 -138141 -23610 -80136 108367 139451 145788
9401 145788 -275882 -132368 46206 -329843 -4716 -14753 -135381 12316 -160540 260926 -171611
9389 -17935 212698 -36335 27917 -82491 -283062 -652876 187318 31886 123940 156684 -466037
9377 -50996 63220 229117 -94847 -211185 -42777 -96808 -410457 101117 -49957 124950 -133742
$$ packed form
9457a78931C3895I236h6495D1482a81131E3996J1541g0034I8322a08280A61235
9445A38858M0992h3610b6995k6327B72126b64935g944G8840a13009k8090j76885
9434c17984D4056a93563b8272k25548d2667j53639E4840e9708E8818a35171L1654
9423a03517k47415a38504A76204a74067j20032G0268a88195Q4201A20480b3895
9412F8808D776a13225B15260d4310k71682a38141b3610n6526A08367L1084O337
9401A45788b75882a32368D6206c29843d716j0037j20628A2316a60540B60926a71611
9389a7935B12698c6335B7917h2491k00571l69814A87318C1886R2054L2744d66037
9377e0996F3220J65897i4847j16338d2777n4031l13649A01117d9957A24950a33742
$$ plain form
9365 -158348 -119420 -35962 174757 86961 -37721 -381672 -78619 8183 -235039 215800 -303858
9353 101271 189362 -185824 133109 -99185 -30053 2356 51069 52585 -248242 62443 -274065
9341 -73178 179460 -152117 -144336 10554 244435 -63972 -239413 -99071 85713 -150572 -137696
9330 -137696 -221853 -25073 -47514 173009 12767 -183470 164099 -564092 100175 211789
9320 211789 -41836 115824 -151821 -155226 174145 157691 -138820 -64835 -182129 -122637 -81783
9309 -81783 -145313 -27746 -7259 138535 -268032 153195 -283539 -229570 -7318 -270172 -335201
9298 -335201 404078 -50564 -19573 -133974 -57505 -11945 -177251 -169035 127691 354871 378329
9287 378329 224730 -139456 -86721 58747 83274 -226773 128796 -226830 77688 -49730 207007
$$ packed form
9365a58348L8928c5962A74757H6961c7721l43951g8619H183b35039B15800c03858
9353A01271Q8091a85824A33109i9185c0053B356M8713J516b48242F2443b74065
9341g3178A79460a52117P781A0554K33881f3972j75441i9071H5713a50572J2876
9330a37696q4157b5073k2441A73009A2767a83470A64099e64092A00175J11614
9320B11789d1836A15824a51821l405A74145j6454a38820f4835j17294N9492M0854
9309h1783o3530b7746g259A38535b68032A53195b83539N3969g318k62854o5029
9298c35201D04078e0564a9573j14401e7505a1945j65306Q216A27691K27180K3458
9287C78329j53599a39456N2735E8747K4527b26773A28796b26830G7688d9730B07007
$$ plain form
9275 -8227 148948 -129475 -64494 29026 18372 -141486 -91352 -7515 60551 -373749 -289717
9264 -289717 106320 1864 -102725 -181899 18847 78922 -90872 -124342 -246037 9073 1301 105870
9252 105870 264185 -191920 -16699 -275025 -134836 -160932 -52426 -16271 -309873 -39745 128120
9240 -30119 166937 -30432 -144371 47550 42406 133505 -147406 180420 -277346 76940 -320580
9228 130080 -18044 236600 -177543 -57803 -213260 -46392 -86623 -77454 -21100 -110443 -461740
9217 -461740 -239993 -68958 -20807 112984 -93110 154772 -44045 -145063 226742 118782
9207 118782 -25952 143497 -239934 384433 -108984 136549 -164134 -122972 122337 162393
9197 162393 -22291 28440 -39360 8332 248126 -301626 -216601 81235 -61501 123110 -7008
$$ packed form
9275h227A48948a29475f4494B9026j0654a41486N0134g515F0551c73749Q4032
9264b89717A06320A864a02725p9174A8847O0075i0872l3470j21695I073A301J04569
9252A05870J58315a91920a6699k58326a34836k6096e2426a6271k93602c9745A28120
9240c0119A66937c0432j13939D7550n144R1099a47406A80420b77346G6940c20580
9228A30080a8044B36600a77543e7803j55457d6392m0231R169b1100q9343l51297
9217d61740K21747f8958b0807A12984i3110A54772d4045j01018B26742j07960
9207A18782b5952A43497b39934C84433a08984A36549a64134M1162A22337M0056
9197A62393b2291B8440c9360H332K39794c01626Q5025H1235f1501A23110g008
$$ plain form
9185 -149428 -182870 -141252 189048 72703 -324266 -277349 -111606 111064 96235 242263 -90681
9173 -372343 -190946 -155283 238063 -10170 -343910 122080 -26807 161397 -187826 80356
9162 -250645 -110666 -95992 -307282 -273977 20370 44403 315093 106412 -249991 -33230 -126860
9151 -126860 -35917 -76730 252553 372345 -3684 19325 129478 58618 -239262 8269 -49338
9139 185857 -25032 -127304 -229283 49337 -196924 91370 -443087 46115 -115794 4616 -117032
9127 -160454 65116 -177874 74498 -121464 -50905 -72408 -15681 -20232 -109916 -147918 -77825
9116 -77825 -473622 -59495 124070 -87203 279866 -110596 -146524 -226311 218483 -135484 151274
9104 -32496 -120525 -21539 -307721 -165293 -25310 -200809 -293378 -147338 -10068 -353590 -153851
$$ packed form
9185a49428l3442M1618A89048G2703c24266M6917a11606A11064j4829J46028i0681
9173c72343J81397L5663B38063a0170l33740A22080b6807A61397a87826H0356
9162b50645a10666J4674k11290L3305B0370K4033K70690A06412b49991c3230r3630
9151a26860c5917m0813B52553J19792c684A9325J10153E8618b39262H269d9338
9139A85857b5032j02272j01979D9337a96924I1370d43087D6115a15794D616a17032
9127a60454F5116a77874G4498a21464e0905k1503a5681m551q9684l8002P0093
9116g7825l95797e9495A24070h7203B79866a10596l5928p9787B18483a35484A51274
9104c2496q8029b1539k86182J42428b5310j75499r2569J46040a0068l43522a53851
$$ plain form
9092 -13424 -396717 31036 -111148 122349 65638 -92732 3165 -11039 -221155 22880 130648
9081 130648 156409 -173917 -165318 -278220 -21877 100334 -211928 -177636 -24343 29548 -146588
9069 -141893 -115199 -219998 -75862 166003 -242714 -74045 -392139 -223658 241096 -190264
9058 -159262 -127233 -484385 147576 -287148 -55117 33927 -96252 -170775 87870 -314491 -310252
9047 -310252 96380 -93217 -242519 52928 -30912 214721 39457 10054 -88100 -228417 -290927
9036 -290927 -218335 84222 -86867 -158923 -183509 -27793 233064 307884 -132472 -25951 -18375
9025 -18375 -269113 92837 91904 -31944 -120192 -85582 122168 182987 129984 119613 -9911 -84085
9013 -84085 -176916 121545 -138493 95476 -16333 234095 -74298 111821 -139094 -281942 61662
$$ packed form
9092a3424l83293C1036a11148A22349n6711i2732C165a1039k10116B2880J07768
9081A30648K5761a73917Q599j12902b1877A00334b11928L4292b4343B9548a46588
9069a41893K6694j04799g5862A66003b42714g4045l18094J68481B41096a90264
9058a59262L2029l57152A47576b87148e5117C3927i6252p4523H7870c14491M239
9047c10252I6380i3217j49302E2928c0912B14721C9457A0054h8100j40317o2510
9036b90927P2592H4222h6867p2056k4586b7793B33064P4820a32472b5951P576
9025a8375k50738I2837r33c1944q8248L4610A22168O0819n3003j0371i911p4174
9013h4085r2831A21545a38493I5476a6333B34095g4298A11821a39094j42848F1662
$$ plain form
9001 -60595 220353 -155201 372030 -36388 -310164 -390174 -100104 190804 -113867 -328976
8991 -328976 116046 38168 -159788 -60174 -232818 -175087 -108462 -473899 118139 -221623
8980 -356606 264340 -310122 -340785 -372866 38849 -65849 -188045 -165695 -230072 -18821 -375874
8969 -375874 -165993 -172098 -98184 -242320 -142521 -312941 -64004 -151318 252755 -69711 -285095
8958 -285095 -12876 -253752 -40922 -165269 119327 -37707 -147961 -147208 -121627 -37758 278828
8946 -38445 -165345 151262 -191487 -396897 82785 -59820 171553 240374 -317468 -259986 -139423
8935 -139423 65304 1631 141496 390309 135146 -125030 -4488 33440 94151 96620 124796
8924 124796 347057 855352 574356 1448967 4474256 13603282 8383801 3170471 1060159
$$ packed form
9001f0595B20353a55201C72030c6388k73776q0010a00104A90804a13867k15109
8991c28976A16046C8168a59788f0174j72644N7731O6625l65437A18139b21623
8980c56606B64340c10122l0663l2081C8849f5849j22196K2350o4377a8821l57053
8969c75874a65993o105P3914j44136R9799j70420f4004q7314B52755f9711k15384
8958b85095a2876k40876d0922j24347A19327c7707j10254P53K5581c7758B78828
8946c8445j26900A51262a91487k05410H2785e9820A71553O8821c17468N7482J20563
8935a39423F5304A631J39865K48813A35146a25030d488C3440O0711K469K8176
8924A24796K22261N08295k80996Q74611L025289R129026n219481C170471A060159
$$ plain form
8914 286536 303195 -32747 57614 87375 394832 -259258 55643 -103807 204472 155397 98936
8903 98936 -58557 -21227 -224555 321518 -100331 -85250 -296985 249277 -230046 70878 61469
8892 61469 -58014 -186203 -83142 131462 -259567 -36627 -43975 -90578 311378 -161823 -103858
8881 -103858 -79621 -52245 -63036 -342178 251428 -116850 -6069 -25135 21524 180760 -401384
8869 -242105 -156184 104346 299733 -25764 93873 241202 10946 -118007 225780 241738 49984
$$ packed form
8914B86536J6659c2747E7614K9761L07457b59258E5643a03807B04472m9075n6461
8903I8936e8557b1227k03328C21518a00331J5081k11735B49277b30046G0878r409
8892F1469e8014j28189h3142A31462b59567c6627p348m6603C11378a61823N7965
8881a03858K4237K7376j0791k79142B51428a16850f069j9066B1524J59236d01384
8869b42105Q5921A04346J95387b5764I3873J47329A0946a18007B25780J5958D9984
$$ [...]
##END NTUPLES=NMR SPECTRUM
##END=
