
##TITLE=AC1349_GUAAH12167_6647812_7JEnGtCvir
##JCAMPDX= 6.0         $$ Bruker NMR JCAMP-DX V2.0
##DATA TYPE= NMR SPECTRUM
##DATA CLASS= NTUPLES
##ORIGIN= BRUKER
##OWNER= Administrator
$$ 1.72 TOPSPIN		Version 2.1
$$ 2012-08-10 19:37:27.750 -0500  Administrator@TOPSPIN
$$ Compression mode = diff/dup
##.OBSERVE FREQUENCY= 400.02188249412
##.OBSERVE NUCLEUS= ^1H
##.ACQUISITION MODE= SIMULTANEOUS (DQD)
##.ACQUISITION SCHEME= undefined
##.AVERAGES= 64
##.DIGITISER RES= 22
##SPECTROMETER/DATA SYSTEM= spect
##.PULSE SEQUENCE= noesygpps1d.comp
##.SOLVENT NAME= COFFEE_meoh
##.SHIFT REFERENCE= INTERNAL, COFFEE_meoh, 1, 14.96259
##AUDIT TRAIL= $$ (NUMBER, WHEN, WHO, WHERE, PROCESS, VERSION, WHAT)
$$ ##TITLE= Audit trail, TOPSPIN		Version 2.1
$$ ##JCAMPDX= 5.01
$$ ##ORIGIN= Bruker BioSpin GmbH
$$ ##OWNER= Administrator
$$ $$ C:\Bruker\TOPSPIN/data/COFFEE/nmr/AC1349_GUAAH12167_6647812_7JEnGtCvir/12/pdata/1/auditp.txt
$$ ##AUDIT TRAIL=  $$ (NUMBER, WHEN, WHO, WHERE, PROCESS, VERSION, WHAT)
(   1,<2012-08-10 19:37:22.921 -0500>,<Administrator>,<TOPSPIN>,<go>,<TOPSPIN 2.1>,
      <created by zg
	started at 2012-08-10 19:25:52.718 -0500,
	POWCHK enabled, PULCHK disabled,
       configuration hash MD5:
       6B 1B 68 BB D9 2E 58 E2 7F 35 AD 54 07 DF 0E 41
       data hash MD5: 64K
       8A C9 F1 CC 83 91 58 99 26 43 7A E7 6F 96 52 C2>)
(   2,<2012-08-10 19:37:25.734 -0500>,<Administrator>,<TOPSPIN>,<proc1d>,<TOPSPIN 2.1>,
      <Start of raw data processing
       efp LB = 0.3 FT_mod = 6 PKNL = 1 PHC0 = 0 PHC1 = 0 SI = 128K 
       data hash MD5: 128K
       BD 60 78 3F 44 C6 60 ED 80 0A 2B A6 B5 C3 EF 75>)
(   3,<2012-08-10 19:37:26.906 -0500>,<Administrator>,<TOPSPIN>,<proc1d>,<TOPSPIN 2.1>,
      <pk PHC0 = 0.7635498 PHC1 = 0 
       data hash MD5: 128K
       26 FD 8C 06 80 5D E1 2B F9 80 DE 76 E2 CF AA 1C>)
(   4,<2012-08-10 19:37:27.406 -0500>,<Administrator>,<TOPSPIN>,<proc1d>,<TOPSPIN 2.1>,
      <abs ABSG = 1 
       data hash MD5: 128K
       B0 47 8C 24 42 07 4B 69 7B 3B 96 B9 3A AB B0 6B>)
(   5,<2012-08-10 19:37:27.484 -0500>,<Administrator>,<TOPSPIN>,<proc1d>,<TOPSPIN 2.1>,
      <abs ABSG = 2 
       data hash MD5: 128K
       FB AE 17 AB E4 63 FA D1 2F 5B 54 FF 64 6A ED 97>)
(   6,<2012-08-10 19:37:27.531 -0500>,<Administrator>,<TOPSPIN>,<proc1d>,<TOPSPIN 2.1>,
      <abs ABSG = 3 
       data hash MD5: 128K
       1D CC 78 10 E9 23 C0 6A 6E 46 08 AC 01 C5 97 39>)
(   7,<2012-08-10 19:37:27.609 -0500>,<Administrator>,<TOPSPIN>,<proc1d>,<TOPSPIN 2.1>,
      <abs ABSG = 4 
       data hash MD5: 128K
       2D 51 A9 F2 A3 0E D7 33 1A 13 6D 1B 6C 2B A7 4A>)
(   8,<2012-08-10 19:37:27.656 -0500>,<Administrator>,<TOPSPIN>,<proc1d>,<TOPSPIN 2.1>,
      <abs ABSG = 5 
       data hash MD5: 128K
       44 BB D0 AD 22 AF F6 52 99 60 8B D6 9F A0 2C FC>)
$$ ##END=
$$ 
$$ $$ hash MD5
$$ $$ A6 D3 B3 8A 54 50 AE 1B 69 5E F7 C3 7C 0F 19 BC
##$RELAX= 
##$RELAX= 
##$RELAX= 
##$RELAX= 
##$RELAX= 
##$RELAX= 
##$RELAX= 
##$RELAX= 
$$ Bruker specific parameters
$$ [...]
##$TP07= 0
##$TPNAME0= <>
##$TPNAME1= <>
##$TPNAME2= <>
##$TPNAME3= <>
##$TPNAME4= <>
##$TPNAME5= <>
##$TPNAME6= <>
##$TPNAME7= <>
##$TPOAL= (0..7)
0.5 0.5 0.5 0.5 0.5 0.5 0.5 0.5
##$TPOFFS= (0..7)
0 0 0 0 0 0 0 0
##$TUNHIN= 0
##$TUNHOUT= 0
##$TUNXOUT= 0
##$USERA1= <user>
##$USERA2= <user>
##$USERA3= <user>
##$USERA4= <user>
##$USERA5= <user>
##$V9= 5
##$VALIST= <valist>
##$VCLIST= <CCCCCCCCCCCCCCC>
##$VD= 0
##$VDLIST= <DDDDDDDDDDDDDDD>
##$VPLIST= <PPPPPPPPPPPPPPP>
##$VTLIST= <TTTTTTTTTTTTTTT>
##$WBST= 1024
##$WBSW= 4
##$XGAIN= (0..3)
0 0 0 0
##$XL= 0
##$YL= 0
##$YMAX_a= 15551516
##$YMIN_a= -9147953
##$ZGOPTNS= <>
##$ZL1= 120
##$ZL2= 120
##$ZL3= 120
##$ZL4= 120
##$ABSF1= 14.96259
##$ABSF2= -5.595592
##$ABSG= 5
##$ABSL= 3
##$ALPHA= 0
##$AQORDER= 0
##$ASSFAC= 0
##$ASSFACI= 0
##$ASSFACX= 0
##$ASSWID= 0
##$AUNMP= <proc_prof1d_extract.lims>
##$AXLEFT= 0
##$AXNAME= <>
##$AXNUC= <1H>
##$AXRIGHT= 0
##$AXTYPE= 0
##$AXUNIT= <>
##$AZFE= 0.1
##$AZFW= 0.1
##$BCFW= 0
##$BC_mod= 0
##$BYTORDP= 0
##$COROFFS= 0
##$CY= 15
##$DATMOD= 1
##$DC= 0
##$DFILT= <>
##$DTYPP= 0
##$F1P= 0
##$F2P= 0
##$FCOR= 0.5
##$FTSIZE= 131072
##$FT_mod= 6
##$GAMMA= 0
##$GB= 0
##$INTBC= 1
##$INTSCL= 1
##$ISEN= 128
##$LB= 0.3
##$LEV0= 0
##$LPBIN= 0
##$MAXI= 10000
##$MC2= 0
##$MEAN= 0
##$ME_mod= 0
##$MI= 0
##$NCOEF= 0
##$NC_proc= -2
##$NLEV= 6
##$NOISF1= 0
##$NOISF2= 0
##$NSP= 0
##$NTH_PI= 0
##$NZP= 0
##$OFFSET= 14.96259
##$PC= 1
##$PHC0= 0.7635498
##$PHC1= 0
##$PH_mod= 1
##$PKNL= yes
##$PPARMOD= 0
##$PPDIAG= 0
##$PPIPTYP= 0
##$PPMPNUM= 2147483647
##$PPRESOL= 1
##$PSCAL= 4
##$PSIGN= 0
##$PYNMP= <proc.py>
##$REVERSE= no
##$SF= 400.020009002454
##$SI= 131072
##$SIGF1= 0
##$SIGF2= 0
##$SINO= 400
##$SIOLD= 131072
##$SPECTYP= <>
##$SREGLST= <1H.CDCl3>
##$SSB= 0
##$STSI= 131072
##$STSR= 0
##$SW_p= 8223.68421052631
##$SYMM= 0
##$S_DEV= 0
##$TDeff= 65536
##$TDoff= 0
##$TI= <>
##$TILT= no
##$TM1= 0
##$TM2= 0
##$TOPLEV= 0
##$USERP1= <user>
##$USERP2= <user>
##$USERP3= <user>
##$USERP4= <user>
##$USERP5= <user>
##$WDW= 1
##$XDIM= 131072
##$YMAX_p= 412969684
##$YMIN_p= -10897
##$CURPLOT= <Network HP LaserJet P1505>
##$CURPRIN= <$Network HP LaserJet P1505>
##$DFORMAT= <normdp>
##$LAYOUT= <+/1D_H.xwp>
##$LFORMAT= <normlp>
##$PFORMAT= <normpl>
##$SURQMSG= 1
$$ End of Bruker specific parameters
$$ ---------------------------------
##NTUPLES= NMR SPECTRUM
##VAR_NAME=  FREQUENCY,     SPECTRUM/REAL,   SPECTRUM/IMAG
##SYMBOL=    X,             R,               I
##VAR_TYPE=  INDEPENDENT,   DEPENDENT,       DEPENDENT
##VAR_FORM=  AFFN,          ASDF,            ASDF
##VAR_DIM=   131072,        131072,          131072
##UNITS=     HZ,            ARBITRARY UNITS, ARBITRARY UNITS
##FACTOR=    0.0627417313425164, 1,          1
##FIRST=     8223.62146879497, 4688,         -56182
##LAST=      0,             5748,            -55781
##MIN=       0,             -10897,          0
##MAX=       8223.62146879497, 412969684,    0
$$ Real data points
##PAGE= N=1
##DATA TABLE= (X++(R..R)), XYDATA
$$ [...]
$$ plain form
63258 304495 306140 308536 310777 312532 314425 317074 320366 323935 327623 331184 334220 336962 340488 345565
63244 345565 351634 357576 363198 369354 376817 385643 395565 406440 418201 430798 444341 459130 475543
63231 475543 493965 514563 536835 559628 581948 603661 625042 645862 665406 683316 699959
63220 699959 715921 731485 746660 761398 775781 790250 805531 821926 838709 854599 868748
63209 868748 880805 890103 895536 896456 893066 885637 873938 857978 838766 817573 794709 769808 743314
63196 743314 716908 692203 669629 649017 630765 615725 604098 595139 588160 583389 581536 582844
63184 582844 586967 593589 602708 614325 628215 644107 661714 680403 699210 717515 735536 753899
63172 753899 772855 792183 811665 831217 850554 869131 886564 902884 918162 932033 943672
$$ packed form
63258C04495J645K396K241J755J893K649L292L569L688L561L036K742L526N077
63244C45565O069N942N622O156P463Q826R922J0875J1761J2597J3543J4789J6413
63231D75543J8422K0598K2272K2793K2320K1713K1381K0820J9544J7910J6643
63220F99959J5962J5564J5175J4738J4383J4469J5281J6395J6783J5890J4149
63209H68748J2057R298N433R20l390p429j1699j5960j9212k1193k2864k4901k6494
63196G43314k6406k4705k2574k0612j8252j5040j1627q959o979m771j853J308
63184E82844M123O622R119J1617J3890J5892J7607J8689J8807J8305J8021J8363
63172G53899J8956J9328J9482J9552J9337J8577J7433J6320J5278J3871J1639
$$ plain form
63161 943672 952187 957012 957996 955099 947980 936085 919359 898752 875686 851035 824914 797434 769213
63148 769213 741071 713690 687770 664046 642706 623143 604760 587862 573273 561232 551166
63137 551166 542537 535347 529641 525046 521172 518110 516151 515200 514873 515055 515975 517667 519687 521517 523060
63122 523060 524613 526472 528700 531170 533746 536477 539631 543463 547900 552595 557336 562268 567571 573071
63108 573071 578368 583236 587745 592027 596161 600274 604467 608544 611989 614316 615371 615222 613968 611813
63094 611813 609190 606551 603995 601268 598210 595152 592756 591427 590930 590655 590301 590169 590742 592138 594148
63079 594148 596697 599974 604094 608966 614609 621316 629277 638183 647436 656665 665925 675494 685632 696424
63065 696424 707732 719386 731548 744733 759368 775462 792843 811529 831680 853405 876893
$$ packed form
63161I43672Q515M825R84k897p119j1895j6726k0607k3066k4651k6121k7480k8221
63148G69213k8142k7381k5920k3724k1340j9563j8383j6898j4589j2041j0066
63137E51166q629p190n706m595l874l062j959r51l27J82R20J692K020J830J543
63122E23060J553J859K228K470K576K731L154L832M437M695M741M932N303N500
63108E73071N297M868M509M282M134M113M193M077L445K327J055j49j254k155
63094F11813k623k639k556k727l058l058k396j329m97k75l54j32N73J396K010
63079E94148K549L277M120M872N643O707P961Q906R253R229R260R569J0138J0792
63065F96424J1308J1654J2162J3185J4635J6094J7381J8686K0151K1725K3488
$$ plain form
63054 876893 902563 930754 961305 993725 1027732 1063362 1100652 1139448 1179457 1220151 1260767
63043 1260767 1300823 1340601 1380623 1420596 1459430 1496549 1532684 1569018 1605930 1643004 1679925
63032 1679925 1716836 1753909 1791019 1827781 1863432 1896572 1925319 1947856 1962716 1968734 1965219 1952307
63020 1952307 1930781 1901368 1864453 1820656 1771376 1718485 1663662 1608258 1553587 1501004 1451721
63009 1451721 1406817 1367310 1333866 1306442 1284612 1268336 1258061 1253923 1255216 1261027 1271116 1285808
62997 1285808 1305103 1328290 1354412 1382683 1412351 1442529 1472459 1501912 1531160 1560603 1590356
62986 1590356 1619986 1648637 1675558 1700494 1723291 1743127 1758560 1768504 1772721 1771013 1762361 1745492
62974 1745492 1720211 1687613 1648868 1604307 1553984 1498791 1440652 1381665 1323243 1266016 1210320
$$ packed form
63054H76893K5670K8191L0551L2420L4007L5630L7290L8796M0009M0694M0616
63043A260767M0056L9778M0022L9973L8834L7119L6135L6334L6912L7074L6921
63032A679925L6911L7073L7110L6762L5651L3140K8747K2537J4860O018l515j2912
63020A952307k1526k9413l6915m3797m9280n2891n4823n5404n4671n2583m9283
63009A451721m4904l9507l3444k7424k1830j6276j0275m138J293N811J0089J4692
62997A285808J9295K3187K6122K8271K9668L0178K9930K9453K9248K9443K9753
62986A590356K9630K8651K6921K4936K2797J9836J5433R944M217j708q652j6869
62974A745492k5281l2598l8745m4561n0323n5193n8139n8987n8422n7227n5696
$$ plain form
62963 1210320 1156666 1105793 1058275 1014154 973142 935283 901301 872029 847422 826220 806840
62952 806840 788634 772174 758249 746720 736551 726825 717411 708598 700404 692452 684357 676037 667777
62939 667777 660044 653039 646303 639049 631099 623188 616058 609526 602915 596219 590190 585199 580607 575590
62925 575590 570234 565401 561682 558817 556136 553332 550708 548771 547671 547031 546251 544909 542883 540298 537467
62910 537467 534735 532223 529813 527510 525691 524773 524702 524969 525018 524486 523263 521588 519977 518731 517594 516162
62894 516162 514397 512405 509935 506663 502856 499124 495518 491497 486936 482475 478656 475307 472109 469140
62880 469140 466470 463746 460736 457852 455568 453706 451862 450237 449410 449478 450055 450916 452005 452903 453090 452827
62864 452827 453110 454510 456619 458848 461168 463682 466015 467720 468968 470326 472003 473783 475573 477461
$$ packed form
62963A210320n3654n0873m7518m4121m1012l7859l3982k9272k4607k1202j9380
62952H06840j8206j6460j3925j1529j0169r726r414q813q194p952q095q320q260
62939F67777p733p005o736p254p950p911p130o532o611o696o029m991m592n017
62925E75590n356m833l719k865k681k804k624j937j100o40p80j342k026k585k831
62910E37467k732k512k410k303j819r18p1K67M9n32j223j675j611j246j137j432
62894E16162j765j992k470l272l807l732l606m021m561m461l819l349l198k969
62880D69140k670k724l010k884k284j862j844j625q27O8N77Q61J089Q98J87k63
62864D52827K83J400K109K229K320K514K333J705J248J358J677J780J790J888
$$ plain form
62850 477461 479229 480441 481251 482604 485140 488218 490619 492129 493773 496279 498975 500738 501640 502900 505287
62835 505287 508326 511228 513905 516623 519144 520884 521749 522237 522680 522792 522113 520616 518760 517077 515750
62820 515750 514491 512868 510897 509176 508242 507835 507032 505128 502212 498983 496222 494431 493655 493528 493589 493608
62804 493608 493549 493388 493207 493438 494715 497406 501398 506302 511677 517219 523051 529826 538100 547568 557326
62789 557326 567105 577838 590776 606309 624004 643503 664965 688773 715263 744756 777512 813589
62777 813589 853038 896288 944060 996758 1054128 1115600 1180745 1249275 1320784 1394527 1469191
62766 1469191 1542671 1612387 1676208 1732933 1781539 1820159 1846396 1858833 1857803 1844463 1819557
62755 1819557 1783510 1737377 1683079 1622644 1557676 1489591 1419914 1350063 1281031 1213493 1148087
$$ packed form
62850D77461J768J212Q10J353K536L078K401J510J644K506K696J763R02J260K387
62835E05287L039K902K677K718K521J740Q65M88M43J12o79j497j856j683j327
62820E15750j259j623j971j721r34m07q03j904k916l229k761j791p76j27O1J9
62804D93608n9j61j81K31J277K691L992M904N375N542N832O775Q274R468R758
62789E57326R779J0733J2938J5533J7695J9499K1462K3808K6490K9493L2756L6077
62777H13589L9449M3250M7772N2698N7370O1472O5145O8530P1509P3743P4664
62766A469191P3480O9716O3821N6725M8606L8620K6237J2437j030j3340k4906
62755A819557l6047m6133n4298o0435o4968o8085o9677o9851o9032o7538o5406
$$ plain form
62744 1148087 1085416 1025947 970030 917963 869985 826277 786948 751819 720228 691309 664578
62733 664578 640070 617921 598091 580562 565344 552050 539826 528089 517102 507464 499227 491864
62721 491864 484881 478088 471531 465716 461731 460411 461189 462366 462793 462882 463770 466081 469935 475629 483511
62706 483511 493261 504061 515752 529380 546203 566397 589049 613370 639591 668628 701158 737257
62694 737257 776898 820483 868704 921878 979534 1040620 1103966 1168533 1233282 1296897 1357599
62683 1357599 1413232 1461719 1501639 1532378 1553539 1564272 1563370 1550248 1525686 1491401 1448950 1399347
62671 1399347 1343705 1283787 1221551 1158408 1095318 1033449 974201 918422 865999 816476 769858
62660 769858 726613 687082 651106 618140 587620 559388 533830 511381 491747 473869 456879
$$ packed form
62744A148087o2671n9469n5917n2067m7978m3708l9329l5129l1591k8919k6731
62733F64578k4508k2149j9830j7529j5218j3294j2224j1737j0987r638q237p363
62721D91864o983o793o557n815l985j320P78J177M27Q9Q88K311L854N694P882
62706D83511R750J0800J1691J3628J6823K0194K2652K4321K6221K9037L2530L6099
62694G37257L9641M3585M8221N3174N7656O1086O3346O4567O4749O3615O0702
62683A357599N5633M8487L9920L0739K1161J0733r02j3122k4562l4285m2451m9603
62671A399347n5642n9918o2236o3143o3090o1869n9248n5779n2423m9523m6618
62660G69858m3245l9531l5976l2966l0520k8232k5558k2449j9634j7878j6990
$$ plain form
62649 456879 440840 426300 413371 401605 390604 380304 370727 361882 353942 347083 341036 335159 329138
62636 329138 323321 318177 313642 309217 304525 299579 294649 290120 286396 283710 281946 280734 279745 278842 278003
62621 278003 277212 276447 275681 274833 273850 272879 272300 272470 273429 275021 277279 280422 284326 288299 291774 295111
62605 295111 299303 304841 311319 318261 325854 334586 344538 355485 367485 380977 396419 414102 434187
62592 434187 456680 481437 508462 538031 570287 604984 641852 680890 721759 763060 802752
62581 802752 839256 871788 899829 922894 940704 952926 958640 956767 947316 931642 911242 886803
62569 886803 858790 828276 796549 764198 731242 698089 665824 635462 607325 581234 557089
62558 557089 535044 515234 497506 481430 466497 452201 438029 423720 409751 397188 386544
$$ packed form
62649D56879j6039j4540j2929j1766j1001j0300r577q845p940o859o047n877o021
62636C29138n817n144m535m425m692m946m930m529l724k686j764j212r89r03q39
62621B78003p91p65p66q48r83r71n79J70R59J592K258L143L904L973L475L337
62605B95111M192N538O478O942P593Q732R952J0947J2000J3492J5442J7683K0085
62592D34187K2493K4757K7025K9569L2256L4697L6868L9038M0869M1301L9692
62581H02752L6504L2532K8041K3065J7810J2222N714j873r451j5674k0400k4439
62569H86803k8013l0514l1727l2351l2956l3153l2265l0362k8137k6091k4145
62558E57089k2045j9810j7728j6076j4933j4296j4172j4309j3969j2563j0644
$$ plain form
62547 386544 376924 366830 355876 345112 335603 327346 319904 313376 308124 303978 300379 297167 294643
62534 294643 292954 291977 291779 292668 294650 297264 300106 303175 306538 309952 313105 316132 319727 324722 331535
62519 331535 339921 349241 359090 369706 381750 395740 411803 429933 450322 473336 499166 527570
62507 527570 557974 589902 623247 658049 694013 730292 765707 799045 829257 855553 877260
62496 877260 893445 902845 904603 899105 887678 871419 850746 826190 798929 770115 740154 709158
62484 709158 677833 647368 618687 592283 568518 547435 528443 510869 494909 481476 471006
62473 471006 462956 456586 451610 447798 444504 441127 437852 435491 434628 435065 436009 436683 436943 437470 439232 442612
62457 442612 447203 452484 458391 464981 471868 478443 484643 491114 498487 506665 514902 522356 528437 532777
$$ packed form
62547C86544r620j0094j0954j0764r509q257p442o528n252m146l599l212k524
62534B94643j689r77j98Q89J982K614K842L069L363L414L153L027L595M995O813
62519C31535Q386R320R849J0616J2044J3990J6063J8130K0389K3014K5830K8404
62507E27570L0404L1928L3345L4802L5964L6279L5415L3338L0212K6296K1707
62496H77260J6185R400J758n498j1427j6259k0673k4556k7261k8814k9961l0996
62484G09158l1325l0465k8681k6404k3765k1083j8992j7574j5960j3433j0470
62473D71006q050o370m976l812l294l377l275k361q63M37R44O74K60N27J762L380
62457D42612M591N281N907O590O887O575O200O471P373Q178Q237P454O081M340
$$ plain form
62443 532777 535142 535481 533929 530577 525230 517493 507236 494903 481313 467168 452844 438583 424755
62430 424755 411908 400590 391084 383230 376546 370618 365369 360948 357486 355067 353779 353569 354141 355248
62416 355248 357126 360389 365438 372077 379781 388159 397083 406491 416139 425591 434528 443097 451747 460542
62402 460542 468780 475605 480852 484923 487930 489453 489267 487811 485638 482725 478675 473442 467543 461698
62388 461698 456389 451596 446767 441300 435323 429881 426107 424368 424353 425748 428457 432485 438062 445793 456261
62373 456261 469532 485458 504321 526652 552452 581177 612641 647316 685563 727105 771566
62362 771566 818961 869154 921229 973901 1026260 1077590 1126684 1171882 1211614 1244422 1268659
62351 1268659 1283004 1287458 1283367 1272303 1255239 1232850 1206017 1175714 1142665 1107277 1069722 1030170
$$ packed form
62443E32777K365L39j552l352n347p737j0257j2333j3590j4145j4324j4261j3828
62430D24755j2847j1318r506p854o684n928n249m421l462k419j288k10N72J107
62416C55248J878L263N049O639P704Q378Q924R408R648R452Q937Q569Q650Q795
62402D60542Q238O825N247M071L007J523j86j456k173k913m050n233n899n845
62388D61698n309m793m829n467n977n442l774j739j5J395K709M028N577P731J0468
62373D56261J3271J5926J8863K2331K5800K8725L1464L4675L8247M1542M4461
62362G71566M7395N0193N2075N2672N2359N1330M9094M5198L9732L2808K4237
62351A268659J4345M454m091j1064j7064k2389k6833l0303l3049l5388l7555l9552
$$ plain form
62339 1030170 989389 949042 910794 874997 840913 808386 778499 752154 728844 707576 688342
62328 688342 671653 656946 642590 627598 612559 598722 586873 577283 570019 564881 561379 559017
62316 559017 557330 555688 553640 551544 550243 549823 549191 547137 543337 538086 531677 524499 517210 510242 503444
62301 503444 496675 490407 485210 480955 477141 473762 471214 469516 468264 467389 467339 468374 470251 472767 476149
62286 476149 480610 485813 491137 496373 501971 508558 516179 524022 531096 537377 544011 552133 561715 571977
62272 571977 582678 594321 607104 620492 634157 648830 665749 685577 708296 733970 763112
62261 763112 796303 833735 875104 919734 966765 1015335 1064564 1113211 1159411 1200959 1235991
62250 1235991 1263407 1282698 1293508 1295509 1288758 1274119 1253142 1227348 1197629 1164378 1128048 1089472
$$ packed form
62339A030170m0781m0347l8248l5797l4084l2527k9887k6345k3310k1268j9234
62328F88342j6689j4707j4356j4992j5039j3837j1849r590p264n138l502k362
62316E59017j687j642k048k096j301m20o32k054l800n251o409p178p289o968o798
62301E03444o769o268n197m255l814l379k548j698j252q75n0J035J877K516L382
62286D76149M461N203N324N236N598O587P621P843P074O281O634Q122R582J0262
62272E71977J0701J1643J2783J3388J3665J4673J6919J9828K2719K5674K9142
62261G63112L3191L7432M1369M4630M7031M8570M9229M8647M6200M1548L5032
62250A235991K7416J9291J0810K001o751j4639k0977k5794k9719l3251l6330l8576
$$ plain form
62238 1089472 1049749 1010098 971729 935481 901543 869830 840737 815252 794142 777256 763713
62227 763713 752534 742963 734502 727055 720909 716273 712780 709584 705867 701231 695827 690338 685665 682266
62213 682266 679837 677797 675989 674684 674104 674329 675587 678152 681847 686082 690581 695718 701928 709129 717115
62198 717115 726278 737488 751273 767387 785255 804622 825794 849397 875850 904830 935277 966023
62186 966023 996275 1025212 1051400 1073279 1090402 1103698 1114226 1122153 1127320 1130414 1132892 1135931
62174 1135931 1140033 1145710 1153943 1165656 1181118 1200157 1222728 1248913 1278410 1310232 1342859 1374552
62162 1374552 1403631 1428752 1449156 1464711 1475690 1482527 1485727 1485954 1483936 1480082 1474219 1465978 1455492
62149 1455492 1443487 1430638 1417300 1404115 1392400 1383304 1376735 1371727 1367814 1365515 1365483 1367766 1371999
$$ packed form
62238A089472l9723l9651l8369l6248l3938l1713k9093k5485k1110j6886j3543
62227G63713j1179r571q461p447o146m636l493l196l717m636n404n489m673l399
62213F82266k429k040j808j305n80K25J258K565L695M235M499N137O210P201P986
62198G17115R163J1210J3785J6114J7868J9367K1172K3603K6453K8980L0447L0746
62186I66023L0252K8937K6188K1879J7123J3296J0528P927N167L094K478L039
62174A135931M102N677Q233J1713J5462J9039K2571K6185K9497L1822L2627L1693
62162A374552K9079K5121K0404J5555J0979O837L200K27k018l854n863q241j0486
62149A455492j2005j2849j3338j3185j1715r096o569n008l913k299l2K283M233
$$ plain form
62136 1371999 1377716 1384278 1391095 1398284 1406662 1416755 1428226 1440550 1453713 1467830 1482595 1497796
62124 1497796 1514064 1532432 1553157 1575446 1598338 1621517 1645327 1670373 1696995 1724765 1752540
62113 1752540 1779375 1805411 1831591 1858592 1886259 1913958 1941174 1967891 1994665 2022256 2050939
62102 2050939 2080340 2110124 2140519 2171861 2204049 2237007 2271384 2308089 2347301 2388645 2432244
62091 2432244 2478817 2528583 2580743 2634213 2688291 2742378 2795782 2848354 2901028 2955359 3012646
62080 3012646 3073471 3137488 3203163 3267895 3328838 3383894 3432328 3474954 3513830 3551314 3589136
62069 3589136 3628333 3669652 3713291 3758255 3802733 3845431 3885996 3923947 3957916 3986416 4008852
62058 4008852 4025346 4036093 4041369 4041703 4037407 4028207 4013903 3995030 3972338 3945882 3915343 3881093
$$ packed form
62136A371999N717O562O817P189Q378J0093J1471J2324J3163J4117J4765J5201
62124A497796J6268J8368K0725K2289K2892K3179K3810K5046K6622K7770K7775
62113A752540K6835K6036K6180K7001K7667K7699K7216K6717K6774K7591K8683
62102B050939K9401K9784L0395L1342L2188L2958L4377L6705L9212M1344M3599
62091B432244M6573M9766N2160N3470N4078N4087N3404N2572N2674N4331N7287
62080C012646O0825O4017O5675O4732O0943N5056M8434M2626L8876L7484L7822
62069C589136L9197M1319M3639M4964M4478M2698M0565L7951L3969K8500K2436
62058D008852J6494J0747N276L34m296r200j4304j8873k2692k6456l0539l4250
$$ plain form
62046 3881093 3844292 3805973 3766688 3727128 3688431 3651660 3617359 3585829 3557437 3532391 3510453
62035 3510453 3491077 3473755 3458194 3444403 3432699 3423436 3416614 3411878 3408901 3407563 3407717 3408958 3410745
62022 3410745 3412664 3414577 3416626 3419085 3422046 3425250 3428298 3430956 3433102 3434486 3434841 3434205 3432849 3430837
62008 3430837 3427937 3424114 3419794 3415370 3410620 3404898 3397882 3389867 3381213 3371678 3360361 3346140 3328010
61995 3328010 3305096 3276661 3242258 3201796 3155512 3104055 3048716 2991314 2933617 2876860 2821863
61984 2821863 2769279 2719416 2671995 2626548 2583124 2542250 2504215 2468776 2435602 2404612 2375714
61973 2375714 2348687 2323505 2300383 2279139 2258918 2238953 2219388 2200895 2183660 2167240 2151295
61962 2151295 2135955 2121360 2107265 2093273 2079183 2064934 2050453 2035711 2020815 2005943 1991321
$$ packed form
62046C881093l6801l8319l9285l9560l8697l6771l4301l1530k8392k5046k1938
62035C510453j9376j7322j5561j3791j1704r263o822m736k977j338J54J241J787
62022C410745J919J913K049K459K961L204L048K658K146J384L55o36j356k012
62008C430837k900l823m320m424m750n722p016q015q654r535j1317j4221j8130
61995C328010k2914k8435l4403m0462m6284n1457n5339n7402n7697n6757n4997
61984B821863n2584m9863m7421m5447m3424m0874l8035l5439l3174l0990k8898
61973B375714k7027k5182k3122k1244k0221j9965j9565j8493j7235j6420j5945
61962B151295j5340j4595j4095j3992j4090j4249j4481j4742j4896j4872j4622
$$ plain form
61951 1991321 1977323 1964445 1952976 1942842 1933901 1926372 1920783 1917448 1916061 1915878 1916285 1917172 1918917 1922190
61937 1922190 1927763 1936156 1947205 1960107 1974223 1989847 2007998 2029456 2054217 2081834 2111978 2144690
61925 2144690 2180515 2220593 2266316 2318659 2378084 2445335 2522137 2610893 2713863 2832881 2969713
61914 2969713 3126404 3305364 3509443 3742037 4007019 4308603 4651403 5040561 5481678
61905 5481678 5980298 6540927 7165583 7852187 8593113 9373808 10171251 10952872 11677466
61896 11677466 12299053 12773148 13063935 13150598 13030913 12720771 12249869 11655542 10976821
61887 10976821 10249871 9505291 8767290 8053978 7377826 6746355 6163579 5631607 5151080
61878 5151080 4720612 4336858 3995652 3692869 3424346 3185976 2974395 2787022 2621027
$$ packed form
61951A991321j3998j2878j1469j0134q941p529n589l335j387j83M07Q87J745L273
61937A922190N573Q393J1049J2902J4116J5624J8151K1458K4761K7617L0144L2712
61925B144690L5825M0078M5723N2343N9425O7251P6802Q8756J02970J19018J36832
61914B969713J56691J78960K04079K32594K64982L01584L42800L89158M41117
61905E481678M98620N60629O24656O86604P40926P80695P97443P81621P24594
61896A1677466O21587M74095K90787Q6663j19685l10142m70902n94327o78721
61887A0976821p26950p44580p38001p13312o76152o31471n82776n31972m80527
61878E151080m30468l83754l41206l02783k68523k38370k11581j87373j65995
$$ plain form
61869 2621027 2473033 2340448 2222338 2118167 2026202 1944039 1870301 1804795 1747229 1696830
61859 1696830 1653141 1616138 1585312 1559431 1537512 1519415 1505338 1495276 1489100 1486455 1486315 1487165
61847 1487165 1487944 1488455 1488845 1489197 1489644 1490192 1490204 1488693 1485452 1481409 1477679 1474818 1473218 1473478 1475869 1479976
61831 1479976 1485397 1492343 1500966 1510337 1518740 1524929 1528825 1531163 1532727 1533725 1533617 1531756 1528415 1524935
61817 1524935 1522645 1521998 1523018 1526096 1531802 1540272 1551406 1565520 1583190 1604546 1629366 1657954 1691310
61804 1691310 1730198 1774456 1823556 1877514 1936934 2002382 2074047 2151987 2236451 2328002 2427583
61793 2427583 2536535 2656320 2788068 2932611 3091231 3266334 3461108 3678524 3921055
61784 3921055 4191583 4494333 4834705 5218554 5652114 6142522 6697979 7327346 8039837
$$ packed form
61869B621027j47994j32585j18110j04171r1965q2163p3738o5506n7566n0399
61859A696830m3689l7003l0826k5881k1919j8097j4077j0062o176k645j40Q50
61847A487165P79N11L90L52M47N48J2j511l241m043l730k861j600K60K391M107
61831A479976N421O946Q623R371Q403O189L896K338J564R98j08j861l341l480
61817A524935k290o47J020L078N706Q470J1134J4114J7670K1356K4820K8588L3356
61804A691310L8888M4258M9100N3958N9420O5448P1665P7940Q4464R1551R9581
61793B427583J08952J19785J31748J44543J58620J75103J94774K17416K42531
61784C921055K70528L02750L40372L83849M33560M90408N55457O29367P12491
$$ plain form
61775 8039837 8844788 9750840 10764420 11888094 13118600 14443824 15838999 17263681
61767 17263681 18660777 19958334 21075274 21931982 22463778 22632449 22431862 21887091 21048366
61758 21048366 19981453 18756885 17441314 16092687 14757966 13471935 12257638 11129058
61750 11129058 10094202 9156261 8313527 7560472 6890180 6295868 5770505 5306261 4895280
61741 4895280 4530906 4207848 3921422 3667093 3440701 3238749 3058271 2896509 2750913
61732 2750913 2619544 2501338 2395643 2301356 2216704 2140034 2070543 2007864 1951045 1898316 1847895
61721 1847895 1798761 1750667 1703729 1658117 1613909 1571104 1529875 1490810 1454701 1421980 1392478
61710 1392478 1365709 1341263 1318910 1298470 1279637 1261930 1244891 1228432 1212842 1198266 1184315
$$ packed form
61775H039837Q04951R06052J013580J123674J230506J325224J395175J424682
61767A7263681J397096J297557J116940Q56708N31796J68671k00587n44771q38725
61758B1048366j066913j224568j315571j348627j334721j286031j214297j128580
61750A1129058j034856r37941q42734p53055o70292n94312n25363m64244m10981
61741D895280l64374l23058k86426k54329k26392k01952j80478j61762j45596
61732B750913j31369j18206j05695r4287q4652p6670o9491o2679n6819n2729n0421
61721A847895m9134m8094m6938m5612m4208m2805m1229l9065l6109l2721k9502
61710A392478k6769k4446k2353k0440j8833j7707j7039j6459j5590j4576j3951
$$ plain form
61699 1184315 1170469 1156771 1143772 1131760 1120444 1109504 1099088 1089455 1080358 1071187 1061737 1052582
61687 1052582 1044559 1037948 1032139 1026012 1018596 1009563 999375 989028 979449 970842 962570 953850 944595
61674 944595 935451 927038 919406 912251 905314 898440 891555 884902 879004 874016 869302 864039 858113 852056
61660 852056 846206 840438 834763 829674 825709 823031 821622 821508 822494 823968 825332 826554 828069 830184 832791
61645 832791 835600 838481 841504 844749 848119 851423 854635 857984 861641 865401 868959 872495 876701 882125
61631 882125 888614 895422 901630 906496 909758 911768 913034 913433 912136 908509 902760 895445 886679 876317
61617 876317 864682 852655 840993 829967 819572 809682 799972 790190 780686 772275 765339 759343 753426
61604 753426 747261 741129 735417 730280 725646 721309 717163 713537 711091 710155 710302 710833 711591 712987 715361
$$ packed form
61699A184315j3846j3698j2999j2012j1316j0940j0416r633r097r171r450r155
61687A052582q023o611n809o127p416r033j0188j0347r579q607q272q720r255
61674I44595r144q413p632p155o937o874o885o653n898m988m714n263n926o057
61660H52056n850n768n675n089l965k678j409j14R86J474J364J222J515K115K607
61645H32791K809K881L023L245L370L304L212L349L657L760L558L536M206N424
61631H82125O489O808O208M866L262K010J266L99j297l627n749p315q766j0362
61617H76317j1635j2027j1662j1026j0395r890r710r782r504q411o936n996n917
61604G53426o165o132n712n137m634m337m146l626k446r36J47N31P58J396K374
$$ plain form
61589 715361 718647 722627 727158 732019 736856 741534 746464 752416 759972 769150 779471 790482 802255
61576 802255 815323 830030 846117 863121 880960 899839 919818 940978 963894 989234 1016710
61565 1016710 1045026 1073222 1101550 1130564 1159804 1188016 1214434 1239230 1262815 1285353 1307045
61554 1307045 1328281 1349202 1369446 1388539 1406302 1422657 1437294 1449725 1459551 1466533 1470459 1471056
61542 1471056 1468009 1461166 1450876 1438012 1423468 1407608 1390491 1372537 1354614 1337411 1321110 1305790
61530 1305790 1291823 1279634 1269347 1260950 1254659 1250903 1250043 1252284 1257730 1266454 1278678 1295066 1316631
61517 1316631 1344191 1378020 1418161 1464896 1518733 1580216 1650072 1729498 1819946 1922541 2037907
61506 2037907 2166644 2309985 2469893 2648402 2846658 3064433 3300467 3552861 3818563
$$ packed form
61589G15361L286L980M531M861M837M678M930N952P556R178J0321J1011J1773
61576H02255J3068J4707J6087J7004J7839J8879J9979K1160K2916K5340K7476
61565A016710K8316K8196K8328K9014K9240K8212K6418K4796K3585K2538K1692
61554A307045K1236K0921K0244J9093J7763J6355J4637J2431R826O982L926N97
61542A471056l047o843j0290j2864j4544j5860j7117j7954j7923j7203j6301j5320
61530A305790j3967j2189j0287q397o291l756q60K241N446Q724J2224J6388K1565
61517A316631K7560L3829M0141M6735N3837O1483O9856P9426R0448J02595J15366
61506B037907J28737J43341J59908J78509J98256K17775K36034K52394K65702
$$ plain form
61497 3818563 4092217 4365709 4628948 4870893 5080217 5246387 5361612 5422398 5429357 5385938
61487 5385938 5297661 5171859 5016877 4840815 4650970 4454107 4256441 4063046 3877709 3703488
61477 3703488 3542926 3397505 3267466 3152656 3053311 2969711 2901401 2847219 2806036 2777154
61467 2777154 2760174 2754769 2760532 2776663 2801836 2834553 2873608 2917993 2966514 3017768 3070428 3123314
61455 3123314 3175328 3225634 3273721 3319034 3360828 3398954 3434664 3469994 3506283 3543853 3583120
61444 3583120 3625112 3670542 3719119 3770392 3824540 3881502 3939743 3996793 4050847 4101008 4146125
61433 4146125 4184452 4214624 4236082 4248177 4249701 4239847 4219095 4188713 4149945 4104230 4053621 4000231
61421 4000231 3945476 3890405 3836552 3785800 3739483 3698134 3662060 3631698 3607459 3589660 3578507
$$ packed form
61497C818563K73654K73492K63239K41945K09324J66170J15225O0786O959m3419
61487E385938q8277j25802j54982j76062j89845j96863j97666j93395j85337j74221
61477C703488j60562j45421j30039j14810r9345q3600o8310n4182m1183k8882
61467B777154j6980n405N763J6131K5173L2717L9055M4385M8521N1254N2660N2886
61455C123314N2014N0306M8087M5313M1794L8126L5710L5330L6289L7570L9267
61444C583120M1992M5430M8577N1273N4148N6962N8241N7050N4054N0161M5117
61433D146125L8327L0172K1458J2095J524r854k0752l0382l8768m5715n0609n3390
61421D000231n4755n5071n3853n0752m6317m1349l6074l0362k4239j7799j1153
$$ plain form
61410 3578507 3573727 3574262 3578714 3586023 3595251 3604929 3613287 3619202 3622372 3622489 3618855 3611018 3599296 3584431
61396 3584431 3567264 3549120 3532167 3518995 3511952 3513009 3523947 3546426 3582111 3632979 3701278 3788904
61384 3788904 3896953 4026003 4176718 4350048 4546910 4767619 5011219 5275123 5555460
61375 5555460 5847500 6145179 6439954 6720645 6974963 7191542 7361272 7478082 7539652 7547487
61365 7547487 7505831 7420084 7295695 7137632 6950249 6737755 6504990 6257483 6000405 5737773
61355 5737773 5472991 5209888 4952696 4705015 4469073 4245871 4035769 3839087 3656507
61346 3656507 3488974 3337107 3200824 3079623 2972998 2880448 2801485 2735909 2683718 2644348
61336 2644348 2616322 2598113 2589104 2589217 2597955 2614466 2638401 2669829 2708090 2751375 2797752 2846138
$$ packed form
61410C578507m780N35M452P309R228R678Q358N915L170J17l634p837j1722j4865
61396C584431j7167j8144j6953j3172p043J057J0938K2479L5685N0868O8299Q7626
61384C788904J08049J29050J50715J73330J96862K20709K43600K63904K80337
61375E555460K92040K97679K94775K80691K54318K16579J69730J16810O1570P835
61365G547487m1656q5747j24389j58063j87383k12494k32765k47507k57078k62632
61355E737773k64782k63103k57192k47681k35942k23202k10102j96682j82580
61346C656507j67533j51867j36283j21201j06625r2550p8963o5576n2191l9370
61336B644348k8026j8209r009J13Q738J6511K3935L1428L8261M3285M6377M8386
$$ plain form
61324 2846138 2895958 2946306 2995907 3043698 3089022 3131417 3170595 3206676 3240173 3271586 3301065
61313 3301065 3328528 3354080 3378222 3401553 3424233 3445677 3464695 3479752 3489183 3491626 3486654 3474952
61301 3474952 3457641 3435348 3407997 3375293 3337171 3293895 3246016 3194325 3139649 3082629 3023793
61290 3023793 2963891 2904063 2845722 2790305 2738965 2692345 2650618 2613865 2582295 2556093 2535213
61279 2535213 2519496 2508687 2502143 2498637 2496795 2495633 2494424 2492236 2488044 2481311 2472148 2460907 2447921
61266 2447921 2433673 2418855 2404100 2389863 2376652 2365125 2355891 2349480 2346773 2349344 2359241 2378462
61254 2378462 2408570 2450570 2504924 2571735 2651047 2742942 2847301 2963501 3090245 3225353
61244 3225353 3365379 3505316 3638718 3758226 3856254 3925772 3961159 3958966 3918379 3841342 3732353
$$ packed form
61324B846138M9820N0348M9601M7791M5324M2395L9178L6081L3497L1413K9479
61313C301065K7463K5552K4142K3331K2680K1444J9018J5057R431K443m972j1702
61301C474952j7311k2293k7351l2704l8122m3276m7879n1691n4676n7020n8836
61290C023793n9902n9828n8341n5417n1340m6620m1727l6753l1570k6202k0880
61279B535213j5717j0809o544l506j842j162j209k188m192o733r163j1241j2986
61266B447921j4248j4818j4755j4237j3211j1527r234o411k707K571R897J9221
61254B378462L0108M2000N4354O6811P9312R1895J04359J16200J26744J35108
61244C225353J40026J39937J33402J19508R8028O9518L5387k193m0587p7037j08989
$$ plain form
61233 3732353 3597834 3445071 3281086 3112015 2943108 2778826 2622573 2476349 2340924
61224 2340924 2216521 2103316 2001397 1910560 1830281 1759739 1697873 1643673 1596482 1555715 1520242
61213 1520242 1488613 1460233 1435842 1416367 1401678 1391058 1384425 1382258 1384455 1390180 1398904 1410818
61201 1410818 1425938 1443485 1462422 1482036 1501661 1520246 1536492 1549162 1557352 1561068 1561569 1560467
61189 1560467 1558325 1554655 1549179 1542138 1533272 1521576 1506582 1488922 1469130 1446889 1422189 1396298
61177 1396298 1370628 1345311 1319735 1293848 1268047 1242358 1216754 1191852 1168293 1145678 1123004
61166 1123004 1099920 1076798 1053912 1031347 1009385 988174 967356 946781 927159 909224 892759
61155 892759 877353 863450 851449 840214 827880 813883 798854 782786 764950 745655 726500
$$ packed form
61233C732353j34519j52763j63985j69071j68907j64282j56253j46224j35425
61224B340924j24403j13205j01919r0837q0279p0542o1866n4200m7191m0767l5473
61213A520242l1629k8380k4391j9475j4689j0620o633k167K197N725Q724J1914
61201A410818J5120J7547J8937J9614J9625J8585J6246J2670Q190L716N01j102
61189A560467k142l670n476p041q866j1696j4994j7660j9792k2241k4700k5891
61177A396298k5670k5317k5576k5887k5801k5689k5604k4902k3559k2615k2674
61166A123004k3084k3122k2886k2565k1962k1211k0818k0575j9622j7935j6465
61155H92759j5406j3903j2001j1235j2334j3997j5029j6068j7836j9295j9155
$$ plain form
61144 726500 708517 691458 675265 660786 648446 637605 627991 620591 616202 614062 612832 612249 612968
61131 612968 615391 619439 624926 631455 638300 645039 651928 659307 667046 674959 683156 691574 699755 707647
61117 707647 716082 725967 737453 750240 764014 778026 790907 801731 811001 819863 828521 835824 840192
61104 840192 840606 837102 830787 823118 814748 805276 794330 782451 770618 759345 748658 738524 728810
61091 728810 719153 709356 699653 690180 680481 669998 658888 648039 638365 630239 623365 617035 610736
61078 610736 604645 599327 595046 591836 590049 590104 591608 593483 595209 597226 599863 602651 605067 607197 609209
61063 609209 610828 611815 612360 612585 612288 611557 610951 610591 609828 608358 606929 606303 606291 606479 607187 608903 611341
61046 611341 613917 616669 619902 623442 627045 631200 636727 643847 652207 661425 671008 680227 688829 697418
$$ packed form
61144G26500j7983j7059j6193j4479j2340j0841r614p400m389k140j230n83P19
61131F12968K423M048N487O529O845O739O889P379P739P913Q197Q418Q181P892
61117G07647Q435R885J1486J2787J3774J4012J2881J0824R270Q862Q658P303M368
61104H40192M14l504o315p669q370r472j0946j1879j1833j1273j0687j0134r714
61091G28810r657r797r703r473r699j0483j1110j0849r674q126o874o330o299
61078F10736o091n318m281l210j787N5J504J875J726K017K637K788K416K130K012
61063F09209J619R87N45K25k97p31o06l60p63j470j429o26j2J88P08J716K438
61046F11341K576K752L233L540L603M155N527P120Q360R218R583R219Q602Q589
$$ plain form
61032 697418 706527 715832 724948 734314 744374 754439 763409 771244 778750 786251 793512 800672 808171 815900
61018 815900 823489 831427 840944 852657 866132 880738 896184 912207 928584 945628 964163 984989
61006 984989 1008767 1036200 1067736 1103292 1142801 1186682 1235063 1286937 1340952 1396873 1455581
60995 1455581 1518025 1585173 1658824 1741426 1834807 1939618 2055909 2183751 2323616 2476962
60985 2476962 2646571 2836246 3051012 3298258 3587840 3930447 4337360 4823840 5412658
60976 5412658 6133588 7020803 8112515 9451789 11084101 13049788 15367376 17998426
60968 17998426 20798543 23495601 25748279 27283649 28030037 28145980 27929223 27685578 27642070
60959 27642070 27911358 28463777 29101538 29490521 29285653 28291817 26546937 24272472 21747045
$$ packed form
61032F97418R109R305R116R366J0060J0065Q970P835P506P501P261P160P499P729
61018H15900P589P938R517J1713J3475J4606J5446J6023J6377J7044J8535K0826
61006I84989K3778K7433L1536L5556L9509M3881M8381N1874N4015N5921N8708
60995A455581O2444O7148P3651Q2602R3381J04811J16291J27842J39865J53346
60985B476962J69609J89675K14766K47246K89582L42607M06913M86480N88818
60976E412658P20930Q87215J091712J339274J632312J965687K317588K631050
60968A7998426K800117K697058K252678J535370P46388J15943k16757k43645m3508
60959B7642070K69288N52419O37761L88983k04868r93836j744880k274465k525427
$$ plain form
60950 21747045 19202696 16790552 14592632 12641589 10936824 9460902 8193340 7115380
60942 7115380 6208288 5452305 4827323 4312603 3886652 3529735 3226622 2965993 2738283
60933 2738283 2535811 2354169 2191273 2044881 1912286 1792052 1684333 1589165 1505505 1431854
60923 1431854 1366534 1307187 1251148 1196813 1144039 1093163 1044373 998140 955370 916732 882193
60912 882193 851281 823369 797785 774191 752885 734337 718492 704942 693582 684493 677280 671171
60900 671171 665850 661681 659094 658205 659070 661780 666144 671676 678018 685110 692896 701119 709524 718032 726581
60885 726581 734810 741831 746397 747639 745773 741840 736580 729846 721196 710594 698303 684661 670387
60872 670387 656564 643740 631426 619067 607205 597043 589072 582772 577544 573260 569933 567476 565945
$$ packed form
60950B1747045k544349k412144k197920j951043j704765j475922j267562j077960
60942G115380r07092p55983o24982n14720m25951l56917l03113k60629k27710
60933B738283k02472j81642j62896j46392j32595j20234j07719r5168q3660p3651
60923A431854o5320n9347n6039n4335n2774n0876m8790m6233m2770l8638l4539
60912H82193l0912k7912k5584k3594k1306j8548j5845j3550j1360r089p213o109
60900F71171n321m169k587q89Q65K710M364N532O342P092P786Q223Q405Q508Q549
60885G26581Q229P021M566J242j866l933n260o734q650j0602j2291j3642j4274
60872F70387j3823j2824j2314j2359j1862j0162p971o300n228m284l327k457j531
$$ plain form
60859 565945 565658 566944 569963 574605 580320 586343 592558 599959 609726 621994 635983 651101 667293
60846 667293 684481 702451 721394 741755 763285 784807 805229 824273 841926 857722 871019
60835 871019 881608 889606 895039 898062 899451 900332 901312 902195 902593 902442 901746 900130 896974 891927 885112
60820 885112 876890 867633 857591 846710 834557 820818 805909 790760 775879 761059 746266 732273
60808 732273 719853 708717 697960 687393 677778 669744 663153 657624 653125 649913 648372 648956 651741
60795 651741 655994 660806 666195 672965 681414 691025 701631 713920 728271 743931 759933 776105 792458
60782 792458 808289 822819 836328 849724 863141 875648 886271 894765 901585 907651 914005 921128
60770 921128 928672 936198 943817 951648 959079 965320 970469 975288 979977 983786 985844 985885 984224 981575 978764
$$ packed form
60859E65945k87J286L019M642N715O023O215P401R767J2268J3989J5118J6192
60846F67293J7188J7970J8943K0361K1530K1522K0422J9044J7653J5796J3297
60835H71019J0589P998N433L023J389Q81R80Q83L98j51o96j616l156n047o815
60820H85112q222r257j0042j0881j2153j3739j4909j5149j4881j4820j4793j3993
60808G32273j2420j1136j0757j0567r615q034o591n529m499l212j541N84K785
60795F51741M253M812N389O770Q449R611J0606J2289J4351J5660J6002J6172J6353
60782G92458J5831J4530J3509J3396J3417J2507J0623Q494O820O066O354P123
60770I21128P544P526P619P831P431O241N149M819M689L809K058M1j661k649k811
$$ plain form
60755 978764 976106 973112 969314 965277 962135 960187 958617 956673 954501 952640 951205 949888 948366 946400
60741 946400 943697 939891 934686 928117 920764 913524 906935 900920 895337 890456 886511 883089 879508 875642
60727 875642 871918 868630 865707 862968 860196 857113 853802 850973 849242 848257 847046 845077 842418 839045
60713 839045 834799 830078 825826 822612 820221 818265 816663 815404 814398 813743 813622 813747 813381 812102 810145
60698 810145 807773 804782 800764 795451 788632 780161 770297 759592 748180 735536 721217 705573 689494
60685 689494 673748 658782 644832 631888 619686 608072 597348 588203 581267 576715 574121 572806
60673 572806 572486 573481 576003 579437 582803 585890 589472 594342 600563 607678 615123 622273 628543 633736 638039
60658 638039 641563 644271 646396 648467 650778 653262 656125 660047 665411 671748 678389 685355 693085 701506
$$ packed form
60755I78764k658k994l798m037l142j948j570j944k172j861j435j317j522j966
60741I46400k703l806n205o569p353p240o589o015n583m881l945l422l581l866
60727H75642l724l288k923k739k772l083l311k829j731r85j211j969k659l373
60713H39045m246m721m252l214k391j956j602j259j006o55j21J25l66j279j957
60698H10145k372k991m018n313o819q471r864j0705j1412j2644j4319j5644j6079
60685F89494j5746j4966j3950j2944j2202j1614j0724r145o936m552k594j315
60673E72806l20R95K522L434L366L087L582M870O221P115P445P150O270N193M303
60658F38039L524K708K125K071K311K484K863L922N364O337O641O966P730Q421
$$ plain form
60644 701506 709912 717771 725258 732875 740824 748950 757227 766157 776569 788956 803075 818300 834251
60631 834251 850892 868131 885641 903017 919806 935340 948926 960300 969517 976271 979740 979389
60619 979389 975585 969128 960410 949411 936304 921632 905896 889362 872398 855747 840326 826830
60607 826830 815645 806987 800902 797064 794777 793419 792924 793637 795657 798448 801155 803109 803968 803635 802272
60592 802272 800188 797583 794581 791716 790009 790207 792101 794923 798246 802099 806417 810859 815130 819024
60578 819024 822192 824355 825787 827180 828933 830916 832906 834800 836349 837170 837147 836409 834770 831609 826543
60563 826543 819860 812079 803439 794048 784167 773940 763076 751231 738716 726575 715922 707295 700592
60550 700592 695463 691702 689313 688241 688250 689119 690879 693706 697743 703157 710222 719140 730007 743265 759996
$$ packed form
60644G01506Q406P859P487P617P949Q126Q277Q930J0412J2387J4119J5225J5951
60631H34251J6641J7239J7510J7376J6789J5534J3586J1374R217O754L469l51
60619I79389l804o457q718j0999j3107j4672j5736j6534j6964j6651j5421j3496
60607H26830j1185q658o085l838k287j358m95P13K020K791K707J954Q59l33j363
60592H02272k084k605l002k865j707J98J894K822L323L853M318M442M271L894
60578H19024L168K163J432J393J753J983J990J894J549Q21k3p38j639l161n066
60563H26543o683p781q640r391r881j0227j0864j1845j2515j2141j0653q627o703
60550G00592n129l761k389j072RQ69J760K827M037N414P065Q918J0867J3258J6731
$$ plain form
60535 759996 781286 807232 836876 869073 903010 937750 971507 1001542 1024796 1038916 1043118 1038245
60523 1038245 1025927 1007882 986015 962733 940486 920987 905105 893264 885586 881924 882234 886598
60511 886598 894300 903214 911011 916931 921696 925839 929091 931497 933998 937436 941805 947087 954223 964775
60497 964775 980060 1001014 1028316 1062177 1102534 1149972 1205979 1271686 1346741 1430057 1521533
60486 1521533 1622600 1735440 1862408 2006377 2171175 2361325 2581095 2833149 3117087
60477 3117087 3428110 3755866 4083740 4389688 4649530 4841579 4950053 4966353 4889605 4727221
60467 4727221 4494177 4210084 3895535 3569530 3247850 2941752 2657662 2398567 2165839
60458 2165839 1959792 1779300 1622055 1485553 1367627 1266188 1179047 1104223 1040227 985854
$$ packed form
60535G59996K1290K5946K9644L2197L3937L4740L3757L0035K3254J4120M202m873
60523A038245j2318j8045k1867k3282k2247j9499j5882j1841p678l662L10M364
60511H86598P702Q914P797N920M765M143L252K406K501L438M369N282P136J0552
60497I64775J5285K0954K7302L3861M0357M7438N6007O5707P5055Q3316R1476
60486A521533J01067J12840J26968J43969J64798J90150K19770K52054K83938
60477C117087L11023L27756L27874L05948K59842J92049J08474J6300p6748j62384
60467D727221k33044k84093l14549l26005l21680l06098k84090k59095k32728
60458B165839k06047j80492j57245j36502j17926j01439q7141p4824o3996n4373
$$ plain form
60448 985854 939706 899917 864463 832041 802668 777079 755418 736822 720277 705309 691620
60437 691620 678691 666203 654410 643576 633426 623610 614376 606279 599510 593967 589648 586409 583661
60424 583661 580948 578628 577355 577020 576913 576872 577523 579239 581557 583860 586145 588728 591564 594247 596491
60409 596491 598369 600104 601802 603362 604649 605755 607092 609190 612470 617145 623056 629537 635776 641528
60395 641528 647193 653022 658657 663816 669005 674871 681017 686097 689219 690752 691633 692323 692691 692552 691944
60380 691944 690921 689318 686862 683568 679956 676680 673979 671686 669795 668603 668102 667708 666943 666036 665379
60365 665379 664761 663728 662523 661937 662223 662800 663185 663710 665093 667712 671501 676165 681193 685971 690242 694390
60349 694390 699127 704933 711866 719698 728172 737211 746910 757133 767223 776475 784929 793278 801718 809265
$$ packed form
60448I85854m6148l9789l5454l2422k9373k5589k1661j8596j6545j4968j3689
60437F91620j2929j2488j1793j0834j0150r816r234q097o769n543m319l239k748
60424E83661k713k320j273l35j07m1O51J716K318K303K285K583K836K683K244
60409E96491J878J735J698J560J287J106J337K098L280M675N911O481O239N752
60395F41528N665N829N635N159N189N866O146N080L122J533Q81O90L68j39o08
60380F91944j023j603k456l294l612l276k701k293j891j192n01l94p65r07o57
60365F65379o18j033j205n86K86N77L85N25J383K619L789M664N028M778M271M148
60349F94390M737N806O933P832Q474R039R699J0223J0090R252Q454Q349Q440P547
$$ plain form
60335 809265 814613 817506 818935 820121 821734 824108 827640 832616 838919 846312 854898 864946 876163 887436
60321 887436 897382 904871 908985 908959 904656 896905 887033 876103 864830 853951 844124 835454 827624 820558
60307 820558 814531 809555 805135 800885 797004 793874 791573 790057 789562 790530 793266 797806 803839 810596 817136
60292 817136 823068 828720 834448 839997 844826 848705 851679 853660 854424 853894 852150 849337 845857 842484 839931
60277 839931 838319 837275 836510 836128 836506 837985 840637 844265 848770 854531 862109 871531 882166 893502
60263 893502 905693 919251 934567 951980 971906 994572 1019897 1047835 1078592 1112386 1149506
60252 1149506 1190836 1237738 1290964 1350160 1414942 1486050 1564856 1652034 1747244 1849837 1959230
60241 1959230 2074704 2195360 2320149 2447577 2575562 2701944 2824804 2941869 3050114
$$ packed form
60335H09265N348K893J429J186J613K374L532M976O303P393Q586J0048J1217J1273
60321H87436R946P489M114k6m303p751r872j0930j1273j0879r827q670p830p066
60307H20558o027m976m420m250l881l130k301j516m95R68K736M540O033O757O540
60292H17136N932N652N728N549M829L879K974J981P64n30j744k813l480l373k553
60277H39931j612j044p65l82L78J479K652L628M505N761P578R422J0635J1336
60263H93502J2191J3558J5316J7413J9926K2666K5325K7938L0757L3794L7120
60252A149506M1330M6902N3226N9196O4782P1108P8806Q7178R5210J02593J09393
60241A959230J15474J20656J24789J27428J27985J26382J22860J17065J08245
$$ plain form
60232 3050114 3146713 3230240 3300339 3356419 3397312 3422072 3430471 3422920 3400619 3365711 3320613 3267277
60220 3267277 3207829 3145694 3085000 3028646 2977811 2933609 2898262 2874090 2862039 2861950 2873864 2898478
60208 2898478 2936624 2988906 3055800 3137566 3233853 3343414 3464169 3593476 3728403 3865827
60198 3865827 4002210 4133536 4255855 4366032 4461807 4541166 4602004 4642442 4661255 4658017 4633127
60187 4633127 4587818 4523885 4443386 4348825 4243598 4131864 4017853 3905433 3798201 3699465
60177 3699465 3611842 3537086 3476476 3431251 3402579 3391251 3397472 3420910 3461009 3517307 3589103
60166 3589103 3674516 3769969 3870895 3972877 4071904 4164006 4245452 4313517 4366638 4403775 4424027
60155 4424027 4427026 4413408 4384853 4344076 4294855 4241639 4188747 4139909 4098311 4066668 4047121
$$ packed form
60232C050114R6599Q3527P0099N6080M0893K4760Q399p551k2301l4908m5098n3336
60220C267277n9448o2135o0694n6354n0835m4202l5347k4172j2051q9J1914K4614
60208B898478L8146N2282O6894Q1766R6287J09561J20755J29307J34927J37424
60198C865827J36383J31326J22319J10177R5775P9359O0838M0438J8813l238k4890
60187D633127m5309o3933q0499r4561j05227j11734j14011j12420j07232r8736
60177C699465q7623p4756o0610m5225k8672j1328O221K3438M0099N6298P1796
60166C589103Q5413R5453J00926J01982R9027R2102Q1446O8065N3121L7137K0252
60155D424027K999j3618k8555m0777m9221n3216n2892m8838m1598l1643j9547
$$ plain form
60144 4047121 4041340 4050764 4076528 4119294 4179665 4258810 4358324 4479438 4622837 4789430 4980818
60133 4980818 5198712 5444139 5717340 6018053 6345340 6697030 7069427 7457579 7855864
60124 7855864 8258452 8659155 9050830 9425191 9773714 10088964 10365145 10597626 10782264
60115 10782264 10915203 10993210 11014317 10978273 10886151 10739406 10539809 10290904 9999404 9674646
60105 9674646 9326661 8964952 8598660 8236935 7888680 7562012 7263767 6999002 6770885
60096 6770885 6581291 6431423 6321672 6251368 6219323 6224429 6264980 6337496 6436929 6557971 6695395
60085 6695395 6843057 6993486 7138936 7272362 7387282 7477740 7539313 7570075 7570148 7540485 7482338
60074 7482338 7397507 7288489 7158112 7009005 6843410 6663568 6472295 6273021 6069111 5863551
$$ packed form
60144D047121n781R424K5764M2766O0371P9145R9514J21114J43399J66593J91388
60133D980818K17894K45427K73201L00713L27287L51690L72397L88152L98285
60124G855864M02588M00703L91675L74361L48523L15250K76181K32481J84638
60115A0782264J32939P8007K1107l6044r2122j46745j99597k48905k91500l24758
60105I674646l47985l61709l66292l61725l48255l26668k98245k64765k28117
60096F770885j89594j49868j09751p0304l2045N106M0551P2516R9433J21042J37424
60085F695395J47662J50429J45450J33426J14920R0458O1573L0762P3k9663n8147
60074G482338q4831j09018j30377j49107j65595j79842j91273j99274k03910k05560
$$ plain form
60064 5863551 5659652 5461597 5273548 5098248 4937061 4791252 4662541 4552511 4462200 4392333
60054 4392333 4343248 4314584 4305869 4317608 4351028 4406525 4482979 4578673 4691829 4819717 4958063
60043 4958063 5102027 5247298 5389705 5524312 5645612 5748496 5828834 5883672 5911474 5911919
60033 5911919 5885073 5830995 5750411 5645407 5519159 5375356 5218223 5052664 4883863 4716759
60023 4716759 4555829 4404787 4266092 4141158 4031315 3938152 3862673 3804832 3764519 3742603
60013 3742603 3740422 3758542 3796610 3854306 3931972 4030327 4149869 4290444 4451053 4629898 4824350
60002 4824350 5030387 5242121 5452496 5654805 5843296 6012511 6157094 6272898 6357828 6411129
59992 6411129 6432279 6420971 6377651 6303592 6200936 6073165 5925149 5762264 5589787 5413341
$$ packed form
60064E863551k03899j98055j88049j75300j61187j45809j28711j10030r0311o9867
60054D392333m9085k8664q715J1739L3420N5497P6454R5694J13156J27888J38346
60043D958063J43964J45271J42407J34607J21300J02884Q0338N4838K7802M45
60033E911919k6846n4078q0584j05004j26248j43803j57133j65559j68801j67104
60023D716759j60930j51042j38695j24934j09843r3163p5479n7841m0313k1916
60013C742603k181J8120L8068N7696P7666R8355J19542J40575J60609J78845J94452
60002D824350K06037K11734K10375K02309J88491J69215J44583J15804Q4930N3301
59992F411129K1150j1308m3320p4059j02656j27771j48016j62885j72477j76446
$$ plain form
59982 5413341 5239076 5072578 4917880 4778033 4656064 4554680 4475449 4419013 4385752 4375562
59972 4375562 4387382 4419742 4471456 4540952 4625269 4720733 4824562 4934947 5049704 5165888
59962 5165888 5280808 5392429 5498451 5595842 5681701 5754017 5811365 5852719 5878172 5889338 5888461
59951 5888461 5877373 5857826 5832564 5805530 5781046 5763174 5755923 5763722 5791432 5843764 5924675 6037314
59939 6037314 6184515 6369136 6593813 6860466 7170101 7522760 7917133 8349995 8815933
59930 8815933 9307161 9812978 10319203 10808496 11261696 11659389 11983237 12217411 12350271
59921 12350271 12375800 12294209 12111746 11839962 11494411 11092802 10653006 10191623 9723430 9261355
59911 9261355 8816365 8397133 8009942 7659098 7347460 7076711 6847616 6660466 6515323
$$ packed form
59982E413341j74265j66498j54698j39847j21969j01384p9231n6436l3261j0190
59972D375562J1820L2360N1714O9496Q4317R5464J03829J10385J14757J16184
59962E165888J14920J11621J06022R7391Q5859P2316N7348M1354K5453J1166q77
59951E888461j1088j9547k5262k7034k4484j7872p251P799K7710N2332Q0911J12639
59939F037314J47201J84621K24677K66653L09635L52659L94373M32862M65938
59930H815933M91228N05817N06225M89293M53200L97693L23848K34174J32860
59921A2350271K5529q1591j82463k71784l45551m01609m39796m61383m68193m62075
59911I261355m44990m19232l87191l50844l11638k70749k29095j87150j45143
$$ plain form
59902 6515323 6411772 6348757 6325015 6339472 6390893 6477442 6597051 6747929 6927810 7132535
59892 7132535 7355740 7589716 7825708 8053253 8260200 8434104 8563670 8639372 8654150 8604606
59882 8604606 8491501 8319000 8093797 7824800 7522449 7197349 6859497 6518473 6183175
59873 6183175 5860575 5555307 5270810 5010117 4775003 4565347 4380227 4219000 4080449
59864 4080449 3961549 3858292 3767465 3686732 3613375 3544133 3476352 3408530 3339903 3270597 3202273
59853 3202273 3137700 3079229 3028048 2984788 2950053 2924019 2906002 2894697 2888531 2885659 2883847 2880440
59841 2880440 2872420 2856891 2832071 2797909 2755682 2707331 2655242 2601978 2549521 2499036 2451806
59830 2451806 2409836 2374826 2347023 2325895 2311580 2304862 2306119 2315394 2333314 2360756 2397476 2442040
$$ packed form
59902F515323j03551o3015k3742J4457N1421Q6549J19609J50878J79881K04725
59892G132535K23205K33976K35992K27545K06947J73904J29566P5702J4778m9544
59882H604606j13105j72501k25203k68997l02351l25100l37852l41024l35298
59873F183175l22600l05268k84497k60693k35114k09656j85120j61227j38551
59864D080449j18900j03257r0827q0733p3357o9242o7781o7822o8627o9306o8324
59853C202273o4573n8471n1181m3260l4735k6034j8017j1305o166k872j812l407
59841B880440q020j5529k4820l4162m2227m8351n2089n3264n2457n0485m7230
59830B451806m1970l5010k7803k1128j4315o718J257R275J7920K7442L6720M4564
$$ plain form
59818 2442040 2493223 2550521 2613118 2679443 2748272 2819417 2892777 2967256 3041017 3112036 3177878
59807 3177878 3235474 3281877 3315172 3334575 3340329 3334150 3319383 3299966 3279003 3258503 3240288 3226780
59795 3226780 3220862 3225170 3241554 3271194 3315306 3375679 3454480 3553586 3674493 3819056 3990304
59784 3990304 4192547 4430654 4708927 5030073 5394631 5800414 6241143 6704209 7169033
59775 7169033 7607574 7987314 8276310 8449704 8495859 8419039 8236889 7974609 7659261 7315868
59765 7315868 6965057 6622159 6297819 5999136 5730186 5492351 5285351 5108439 4960535
59756 4960535 4839747 4743578 4669790 4616762 4583273 4568488 4571895 4592645 4629135 4680015 4745560
59745 4745560 4827389 4926794 5043974 5178910 5332225 5505089 5698916 5915478 6156872 6425258
$$ packed form
59818B442040N1183N7298O2597O6325O8829P1145P3360P4479P3761P1019O5842
59807C177878N7596M6403L3295J9403N754o179j4767j9417k0963k0500j8215j3508
59795C226780n918M308J6384K9640M4112O0373P8801R9106J20907J44563J71248
59784C990304K02243K38107K78273L21146L64558M05783M40729M63066M64824
59775G169033M38541L79740K88996J73394M6155p6820j82150k62280l15348l43393
59765G315868l50811l42898l24340k98683k68950k37835k07000j76912j47904
59756D960535j20788r6169p3788n3028l3489j4785L407K0750L6490N0880O5545
59745D745560Q1829R9405J17180J34936J53315J72864J93827K16562K41394K68386
$$ plain form
59735 6425258 6722936 7052613 7417046 7818344 8257996 8737396 9257631 9818468 10417632
59726 10417632 11050527 11709724 12384608 13062224 13728859 14371055 14976429 15535667 16044951
59717 16044951 16506603 16927883 17319994 17697683 18077729 18476046 18905683 19376793 19896673
59708 19896673 20468437 21089575 21751881 22442117 23142255 23829880 24479696 25065895 25564641
59699 25564641 25956489 26228486 26375338 26399491 26310625 26124570 25861512 25544265 25197364 24845994
59689 24845994 24513546 24219230 23978281 23804276 23710314 23707957 23806216 24012199 24332127 24771393
59679 24771393 25334214 26023185 26837863 27772522 28814849 29945757 31138271 32355129 33547825
59670 33547825 34659009 35626905 36390299 36894943 37101349 36990869 36567343 35855322 34897043
$$ packed form
59735F425258K97678L29677L64433M01298M39652M79400N20235N60837N99164
59726A0417632O32895O59197O74884O77616O66635O42196O05374N59238N09284
59717A6044951M61652M21280L92111L77689L80046L98317M29637M71110N19880
59708A9896673N71764O21138O62306O90236P00138O87625O49816N86199M98746
59699B5564641L91848K71997J46852K4153q8866j86055k63058l17247l46901l51370
59689B4845994l32448k94316k40949j74005r3962k357R8259K05983L19928M39266
59679B4771393N62821O88971Q14678R34659J042327J130908J192514J216858J192696
59670C3547825J111184R67896P63394N04644K06406j10480m23526p12021r58279
$$ plain form
59661 34897043 33747820 32469103 31121176 29758363 28426682 27161945 25988006 24916109
59653 24916109 23944946 23060378 22236057 21437595 20630392 19787805 18896189 17955833 16978744
59644 16978744 15984568 14995763 14033028 13112091 12242870 11430970 10679699 9990609 9362843
59635 9362843 8793337 8278355 7814542 7398458 7025914 6692465 6394224 6127904 5890624
59626 5890624 5680248 5495436 5334712 5195636 5075379 4971857 4883812 4809968 4748562 4697539
59616 4697539 4654640 4617218 4582304 4546989 4508716 4465362 4415228 4356902 4289245 4211861 4125662
59605 4125662 4032602 3934724 3833740 3731526 3630382 3532440 3439202 3351851 3271601 3199383 3135502
59594 3135502 3079866 3032277 2992437 2960214 2936082 2920708 2913772 2913682 2918815 2928539 2942652 2960408
$$ packed form
59661C4897043j149223j278717j347927j362813j331681j264737j173939j071897
59653B4916109r71163q84568q24321p98462q07203q42587q91616r40356r77089
59644A6978744r94176r88805r62735r20937q69221q11900p51271o89090o27766
59635I362843n69506n14982m63813m16084l72544l33449k98241k66320k37280
59626E890624k10376j84812j60724j39076j20257j03522q8045p3844o1406n1023
59616D697539m2899l7422l4914l5315l8273m3354n0134n8326o7657p7384q6199
59605D125662r3060r7878j00984j02214j01144r7942r3238q7351q0250p2218o3881
59594C135502n5636m7589l9840l2223k4132j5374o936r0N133R724J4113J7756
$$ plain form
59582 2960408 2980683 3002720 3026055 3049935 3073283 3095221 3115386 3134071 3152368 3171887 3193957
59571 3193957 3219255 3248335 3282189 3322036 3368978 3424163 3488867 3564093 3650365 3748192 3858391
59560 3858391 3981805 4119203 4271727 4440921 4627953 4833297 5057454 5301338 5565288
59551 5565288 5848060 6147273 6460445 6785029 7117702 7454176 7789638 8119240 8438571
59542 8438571 8744112 9033131 9303211 9552616 9781321 9990780 10181867 10353385 10503197
59533 10503197 10630644 10737768 10829200 10911735 10993436 11081776 11181944 11296472 11425409 11565858
59523 11565858 11711507 11853198 11979941 12079457 12139027 12147330 12095982 11979452 11794600 11541499
59513 11541499 11224531 10851780 10433263 9979975 9503777 9016577 8528892 8049258 7584656
$$ packed form
59582B960408K0275K2037K3335K3880K3348K1938K0165J8685J8297J9519K2070
59571C193957K5298K9080L3854L9847M6942N5185O4704P5226Q6272R7827J10199
59560C858391J23414J37398J52524J69194J87032K05344K24157K43884K63950
59551E565288K82772K99213L13172L24584L32673L36474L35462L29602L19331
59542H438571L05541K89019K70080K49405K28705K09459J91087J71518J49812
59533A0503197J27447J07124R1432Q2535Q1701Q8340J00168J14528J28937J40449
59523A1565858J45649J41691J26743R9516N9570Q303n1348j16530j84852k53101
59513A1541499l16968l72751m18517m53288m76198m87200m87685m79634m64602
$$ plain form
59504 7584656 7140766 6721901 6331328 5971711 5644730 5350418 5087440 4854060 4648504
59495 4648504 4468778 4312867 4179217 4066578 3973500 3898471 3840497 3799081 3773715 3763883 3769440
59484 3769440 3790534 3827166 3879199 3946745 4030237 4130260 4247626 4383414 4538596 4713740
59474 4713740 4909212 5125326 5361931 5618068 5892007 6180868 6479602 6780722 7075448
59465 7075448 7354646 7608415 7825832 7996404 8111946 8167008 8158602 8086771 7955205 7770305
59455 7770305 7539592 7271320 6974775 6659593 6334537 6007300 5684802 5372570 5074033
59446 5074033 4791322 4526553 4281504 4056428 3850476 3663245 3494880 3344700 3210911
59437 3210911 3091840 2986485 2893676 2811830 2739939 2677985 2625920 2582964 2548194 2521089 2501050
$$ packed form
59504G584656m43890m18865l90573l59617l26981k94312k62978k33380k05556
59495D648504j79726j55911j33650j12639r3078p5029n7974m1416k5366r832N557
59484C769440K1094L6632N2033O7546Q3492J00023J17366J35788J55182J75144
59474D713740J95472K16114K36605K56137K73939K88861K98734L01120K94726
59465G075448K79198K53769K17417J70572J15542N5062q406p1831j31566j84900
59455G770305k30713k68272k96545l15182l25056l27237l22498l12232k98537
59446E074033k82711k64769k45049k25076k05952j87231j68365j50180j33789
59437C210911j19071j05355r2809q1846p1891o1954n2065m2956l4770k7105k0039
$$ plain form
59426 2501050 2487003 2477903 2473285 2473081 2477296 2485978 2498992 2515593 2534628 2555284 2577467 2601650
59414 2601650 2628915 2660905 2698740 2741478 2785932 2828180 2865317 2896557 2923866 2951717 2985333
59403 2985333 3028531 3083217 3150550 3231754 3327825 3439092 3565109 3704443 3855000 4015960
59393 4015960 4189996 4383101 4602010 4852263 5138394 5464523 5833910 6248472 6709215
59384 6709215 7216535 7769335 8363739 8992422 9644497 10305961 10961202 11595204 12195065
59375 12195065 12750431 13253919 13701710 14093262 14430095 14715048 14952309 15146825 15302593
59366 15302593 15421294 15502194 15542564 15538074 15483833 15375936 15212197 14991957 14716634 14391527
59356 14391527 14026808 13636107 13233786 12832783 12443256 12071584 11720076 11387683 11070920
$$ packed form
59426B501050j4047r100m618k04M215Q682J3014J6601J9035K0656K2183K4183
59414B601650K7265L1990L7835M2738M4454M2248L7137L1240K7309K7851L3616
59403B985333M3198N4686O7333Q1204R6071J11267J26017J39334J50557J60960
59393D015960J74036J93105K18909K50253K86131L26129L69387M14562M60743
59384F709215N07320N52800N94404O28683O52075O61464O55241O34002N99861
59375A2195065N55366N03488M47791L91552L36833K84953K37261J94516J55768
59366A5302593J18701Q0900M0370m490n4241j07897j63739k20240k75323l25107
59356A4391527l64719l90701m02321m01003l89527l71672l51508l32393l16763
$$ plain form
59347 11070920 10764314 10460956 10153784 9837126 9507701 9164989 8810985 8449382 8084692
59338 8084692 7721983 7366880 7024915 6700489 6396594 6115318 5858029 5625172 5416583
59329 5416583 5232248 5072215 4935737 4821142 4726840 4651964 4595912 4557828 4536697 4531331 4539980
59318 4539980 4560434 4590835 4629923 4676250 4727595 4781345 4834982 4885940 4931447 4968883 4996079
59307 4996079 5011250 5013093 5001199 4976054 4938537 4889777 4831476 4765881 4695429 4622870 4551520
59296 4551520 4484566 4423844 4370059 4324438 4289465 4267647 4260242 4267632 4290334 4329067 4384285 4456203
59284 4456203 4545070 4651073 4774183 4914325 5071303 5244154 5430711 5628000 5832858 6041944
59274 6041944 6251277 6455908 6650043 6827841 6984644 7117511 7224319 7302487 7349028 7361818
$$ packed form
59347A1070920l06606l03358l07172l16658l29425l42712l54004l61603l64690
59338H084692l62709l55103l41965l24426l03895k81276k57289k32857k08589
59329E416583j84335j60033j36478j14595r4302p4876n6052l8084k1131n366Q649
59318D539980K0454L0401L9088M6327N1345N3750N3637N0958M5507L7436K7196
59307D996079J5171J843j1894k5145l7517m8760n8301o5595p0452p2559p1350
59296D551520o6954o0722n3785m5621l4973k1818p405P390K2702L8733N5218P1918
59284D456203Q8867J06003J23110J40142J56978J72851J86557J97289K04858K09086
59274F041944K09333K04631J94135J77798J56803J32867J06808P8168M6541J2790
$$ plain form
59264 7361818 7340569 7287056 7205199 7100744 6979842 6847374 6706689 6560373 6410488 6258320
59254 6258320 6104874 5951606 5799884 5650151 5502895 5360351 5225829 5101237 4986795
59245 4986795 4883607 4794835 4723523 4670734 4637020 4624579 4636613 4675394 4742236 4838786 4967118
59234 4967118 5129013 5326399 5562226 5839565 6159605 6521016 6920793 7354236 7813625
59225 7813625 8287433 8761003 9217584 9639021 10006758 10303452 10514432 10628613 10639269 10544809
59215 10544809 10348977 10060310 9691287 9257501 8776675 8267190 7746215 7228120 6724112
59206 6724112 6243113 5792415 5377002 4998625 4656523 4349381 4076273 3835835 3625416
59197 3625416 3441481 3280548 3139688 3016689 2909923 2817676 2737593 2667297 2605436 2551400
$$ packed form
59264G361818k1249n3513q1857j04455j20902j32468j40685j46316j49885j52168
59254F258320j53446j53268j51722j49733j47256j42544j34522j24592j14442
59245D986795j03188q8772p1312n2789l3714j2441J2034L8781O6842R6550J28332
59234D967118J61895J97386K35827K77339L20040L61411L99777M33443M59389
59225G813625M73808M73570M56581M21437L67737K96694K10980J14181J0656r4460
59215A0544809j95832k88667l69023m33786m80826n09485n20975n18095n04008
59206F724112m80999m50698m15413l78377l42102l07142k73108k40438k10419
59197C625416j83935j60933j40860j22999j06766r2247q0083p0296o1861n4036
$$ plain form
59187 2551400 2504123 2462109 2424817 2392963 2367040 2346422 2330327 2318806 2312154 2310056 2311888 2317339
59175 2317339 2326385 2339228 2356592 2379403 2407834 2441379 2480119 2524964 2576250 2633155 2695144
59164 2695144 2762975 2837465 2918084 3003608 3093318 3186570 3281830 3377141 3470997 3561869 3647285
59153 3647285 3724391 3791110 3846053 3887761 3914942 3927282 3925280 3909562 3880929 3840762 3790788
59142 3790788 3732834 3669291 3603154 3536854 3471534 3408181 3348875 3296109 3251417 3215542 3189415
59131 3189415 3173948 3169341 3175682 3193957 3225397 3270103 3327380 3397391 3481494 3581029 3696681
59120 3696681 3829014 3978656 4145851 4330655 4533689 4755982 4997936 5259062 5538601
59111 5538601 5835549 6147754 6471409 6801305 7130679 7450523 7749631 8015884 8237662
$$ packed form
59187B551400m7277m2014l7292l1854k5923k0618j6095j1521o652k098J832N451
59175B317339R046J2843J7364K2811K8431L3545L8740M4845N1286N6905O1989
59164B695144O7831P4490Q0619Q5524Q9710R3252R5260R5311R3856R0872Q5416
59153C647285P7106O6719N4943M1708K7181J2340k002j5718k8633m0167m9974
59142C790788n7954o3543o6137o6300o5320o3353n9306n2766m4692l5875k6127
59131C189415j5467m607O341J8275L1440M4706N7277P0011Q4103R9535J15652
59120C696681J32333J49642J67195J84804K03034K22293K41954K61126K79539
59111E538601K96948L12205L23655L29896L29374L19844K99108K66253K21778
$$ plain form
59102 8237662 8404593 8508131 8542461 8505512 8399540 8230803 8008084 7740858 7438583 7111142
59092 7111142 6768612 6419612 6070158 5724575 5387007 5061475 4751044 4457780 4183183
59083 4183183 3927940 3691608 3473358 3272905 3090145 2924278 2773932 2637829 2514529
59074 2514529 2402002 2298494 2203735 2118452 2042679 1975277 1914996 1861144 1813174 1770349 1732073
59063 1732073 1698135 1668604 1643783 1623986 1608875 1597205 1587682 1579709 1572785 1565655 1556811 1545468
59051 1545468 1531225 1513167 1490380 1463367 1433997 1403892 1373588 1343355 1314091 1287066 1263189
59040 1263189 1242653 1225067 1210035 1197800 1189075 1184011 1181905 1182407 1186367 1194778 1207401 1223210 1241612
59027 1241612 1262218 1283835 1304827 1324299 1341915 1356750 1367475 1373751 1376438 1376459 1374421 1371434 1369184
$$ packed form
59102H237662J66931J03538L4330l6949j05972j68737k22719k67226l02275l27441
59092G111142l42530l49000l49454l45583l37568l25532l10431k93264k74597
59083D183183k55243k36332k18250k00453j82760j65867j50346j36103j23300
59074B514529j12527j03508r4759q5283p5773o7402o0281n3852m7970m2825l8276
59063A732073l3938k9531k4821j9797j5111j1670r523p973o924p130q844j1343
59051A545468j4243j8058k2787k7013k9370l0105l0304l0233k9264k7025k3877
59040A263189k0536j7586j5032j2235q725n064k106N02L960Q411J2623J5809J8402
59027A241612K0606K1617K0992J9472J7616J4835J0725O276K687K1k038k987k250
$$ plain form
59014 1369184 1368796 1370307 1373465 1378354 1385206 1394310 1406211 1421148 1438124 1455268 1471252 1485688 1498065
59001 1498065 1507235 1512373 1513779 1512301 1508386 1502073 1493567 1483538 1472972 1462790 1453428 1444898 1437444
58988 1437444 1431782 1428375 1426847 1426617 1427759 1430652 1435161 1440837 1447643 1455833 1465387 1476277 1488913 1503555
58974 1503555 1519608 1536439 1554713 1576009 1601231 1630150 1662309 1697401 1734885 1774155 1815078
58963 1815078 1857591 1900914 1943955 1986248 2027586 2067039 2103490 2137095 2169173 2200766 2232456
58952 2232456 2265449 2301497 2341460 2385121 2432659 2485245 2543853 2608656 2680005 2758994 2846510
58941 2846510 2942570 3047037 3160324 3283114 3416154 3560679 3718330 3890403 4077837 4282094
58931 4282094 4505310 4749441 5016083 5307260 5625545 5973290 6352693 6766842 7219643
$$ packed form
59014A369184l88J511L158M889O852R104J1901J4937J6976J7144J5984J4436J2377
59001A498065R170N138J406j478l915o313q506j0029j0566j0182r362q530p454
58988A437444n662l407j528k30J142K893M509N676O806Q190R554J0890J2636J4642
58974A503555J6053J6831J8274K1296K5222K8919L2159L5092L7484L9270M0923
58963A815078M2513M3323M3041M2293M1338L9453L6451L3605L2078L1593L1690
58952B232456L2993L6048L9963M3661M7538N2586N8608O4803P1349P8989Q7516
58941B846510R6060J04467J13287J22790J33040J44525J57651J72073J87434K04257
58931D282094K23216K44131K66642K91177L18285L47745L79403M14149M52801
$$ plain form
58922 7219643 7714326 8252910 8837376 9470182 10152809 10884416 11662124 12481338 13334443
58913 13334443 14209026 15087475 15947819 16764905 17511852 18161642 18688372 19068788 19285264
58904 19285264 19329141 19201656 18912084 18475660 17912690 17247295 16504867 15709851 14885042
58895 14885042 14051157 13225707 12422290 11651197 10920236 10234818 9597976 9010899 8473355
58886 8473355 7983681 7539089 7136322 6771769 6441148 6139842 5863658 5608740 5371102
58877 5371102 5147327 4935865 4736754 4549964 4374848 4211137 4059247 3919246 3790483
58868 3790483 3672486 3565163 3467762 3378696 3296879 3222341 3155147 3094717 3040668 2993353 2952985
58857 2952985 2919055 2891165 2869544 2854149 2844082 2838579 2837985 2843195 2854627 2872197 2895676 2924737
$$ packed form
58922G219643M94683N38584N84466O32806O82627P31607P77708Q19214Q53105
58913A3334443Q74583Q78449Q60344Q17086P46947O49790N26730L80416K16476
58904A9285264M3877j27485k89572m36424n62970o65395p42428p95016q24809
58895A4885042q33885q25450q03417p71093p30961o85418o36842n87077n37544
58886H473355m89674m44592m02767l64553l30621l01306k76184k54918k37638
58877E371102k23775k11462j99111j86790j75116j63711j51890j40001j28763
58868C790483j17997j07323r7401q9066q1817p4538o7194o0430n4049m7315m0368
58857B952985l3930k7890k1621j5395j0067n503n94N210J1432J7570K3479K9061
$$ plain form
58845 2924737 2959219 2999610 3046661 3100375 3160173 3226214 3299616 3381208 3471084 3569664 3678045
58834 3678045 3796843 3925942 4065988 4219000 4386718 4569449 4767498 4982805 5218196
58825 5218196 5475796 5757322 6065420 6403677 6775564 7184175 7632809 8125069 8664267
58816 8664267 9252800 9891598 10579681 11314292 12091120 12903346 13739839 14584479 15417070
58807 15417070 16214149 16949246 17594302 18122618 18511323 18742550 18805038 18696498 18424330
58798 18424330 18003535 17454068 16799444 16065422 15277606 14459262 13630477 12807848 12004180
58789 12004180 11229098 10490222 9793104 9140172 8531239 7965643 7442998 6961876 6519488
58780 6519488 6113423 5742363 5404356 5095865 4813519 4555482 4320004 4103797 3903152
$$ packed form
58845B924737L4482M0391M7051N3714N9798O6041P3402Q1592Q9876R8580J08381
58834C678045J18798J29099J40046J53012J67718J82731J98049K15307K35391
58825E218196K57600K81526L08098L38257L71887M08611M48634M92260N39198
58816H664267N88533O38798O88083P34611P76828Q12226Q36493Q44640Q32591
58807A5417070P97079P35097O45056N28316L88705K31227O2488j08540k72168
58798A8424330m20795n49467o54624p34022p87816q18344q28785q22629q03668
58789A2004180p75082p38876o97118o52932o08933n65596n22645m81122m42388
58780F519488m06065l71060l38007l08491k82346k58037k35478k16207k00645
$$ plain form
58771 3903152 3715876 3541138 3378301 3226839 3086481 2956382 2834949 2721328 2616149
58762 2616149 2519863 2431364 2349304 2273720 2205140 2143039 2086522 2035768 1991417 1953050 1919456
58751 1919456 1889867 1863760 1840023 1817496 1796046 1776100 1757610 1740365 1724737 1711030 1698449
58740 1698449 1685592 1671568 1655952 1638422 1619369 1600178 1581820 1563679 1544619 1524517 1503858
58729 1503858 1482529 1460086 1436560 1412022 1386009 1358333 1329742 1300783 1270942 1240064 1209723
58718 1209723 1181737 1155990 1131148 1106903 1083968 1062407 1041598 1021670 1003456 987079 971806
58707 971806 957295 943876 931697 920567 910478 901414 893022 885362 879433 875863 873564 870898 867730
58694 867730 865060 863072 860826 857560 852913 846106 836392 824385 811744 799482 787581 776127 765672
$$ packed form
58771C903152j87276j74738j62837j51462j40358j30099j21433j13621j05179
58762B616149r6286q8499q2060p5584o8580o2101n6517n0754m4351l8367l3594
58751A919456k9589k6107k3737k2527k1450j9946j8490j7245j5628j3707j2581
58740A698449j2857j4024j5616j7530j9053j9191j8358j8141j9060k0102k0659
58729A503858k1329k2443k3526k4538k6013k7676k8591k8959k9841l0878l0341
58718A209723k7986k5747k4842k4245k2935k1561k0809j9928j8214j6377j5273
58707I71806j4511j3419j2179j1130j0089r064q392p660n929l570k299k666l168
58694H67730k670j988k246l266m647o807r714j2007j2641j2262j1901j1454j0455
$$ plain form
58681 765672 756501 748530 741845 736490 731951 727885 725049 724410 725543 727011 728083 728989 729725 729890 729665
58666 729665 729796 730605 732010 734348 738052 742542 746526 749472 751866 754140 756338 758744 761853 765773 770538
58651 770538 776821 785310 795536 806356 817502 829686 843299 858018 873595 890070 907321 925390
58639 925390 945133 967541 992525 1019355 1048220 1080379 1116880 1158118 1204581 1257015 1315825
58628 1315825 1381192 1453845 1535102 1626332 1729031 1844965 1975432 2120858 2282008 2460943
58618 2460943 2659547 2877501 3112933 3364405 3630446 3906923 4186015 4457697 4710916
58609 4710916 4933513 5113035 5239023 5304665 5306967 5246869 5129682 4964467 4762231 4534383
58599 4534383 4291791 4043742 3797206 3557387 3328582 3113957 2915022 2732265 2566007
$$ packed form
58681G65672r171p971o685n355m539m066k836o39J133J468J072R06P36J65k25
58666G29665J31Q09J405K338L704M490L984K946K394K274K198K406L109L920M765
58651G70538O283Q489J0226J0820J1146J2184J3613J4719J5577J6475J7251J8069
58639I25390J9743K2408K4984K6830K8865L2159L6501M1238M6463N2434N8810
58628A315825O5367P2653Q1257R1230J02699J15934J30467J45426J61150J78935
58618B460943J98604K17954K35432K51472K66041K76477K79092K71682K53219
58609D710916K22597J79522J25988O5642K302o0098j17187j65215k02236k27848
58599D534383k42592k48049k46536k39819k28805k14625j98935j82757j66258
$$ plain form
58590 2566007 2415998 2280873 2159087 2050028 1953442 1868462 1794220 1730715 1677866 1634264
58580 1634264 1597987 1567944 1543151 1521434 1500323 1478739 1456418 1432371 1405610 1376923 1348263
58569 1348263 1320667 1294272 1269890 1248724 1230697 1214670 1200108 1186942 1174139 1160259 1145393
58558 1145393 1130842 1116987 1103126 1089339 1076752 1065895 1056417 1048418 1042314 1037253 1031378 1023861
58546 1023861 1015208 1005524 994089 980843 966705 952151 936869 920912 904853 888809 872683 857229
58534 857229 843364 830589 817712 804960 793671 784010 774754 765288 755965 746484 735888 724353
58522 724353 713211 702960 692912 682883 673461 664613 655834 647689 641253 636095 630869 625931 623063
58509 623063 622412 622106 621389 621729 624147 627718 631545 636078 641508 646914 652075 658357 666744 676559 686997
$$ packed form
58590B566007j50009j35125j21786j09059r6586q4980p4242o3505n2849m3602
58580A634264l6277l0043k4793k1717k1111k1584k2321k4047k6761k8687k8660
58569A348263k7596k6395k4382k1166j8027j6027j4562j3166j2803j3880j4866
58558A145393j4551j3855j3861j3787j2587j0857r478p999o104n061n875p517
58546A023861q653r684j1435j3246j4138j4554j5282j5957j6059j6044j6126j5454
58534H57229j3865j2775j2877j2752j1289r661r256r466r323r481j0596j1535
58522G24353j1142j0251j0048j0029r422q848q779q145o436n158n226m938k868
58509F23063o51l06p17L40K418L571L827M533N430N406N161O282Q387R815J0438
$$ plain form
58494 686997 698371 711033 724551 738725 753936 769836 785135 799273 812765 825405 835648
58483 835648 842255 844996 843494 837239 827195 815534 803233 789720 775183 761068 747718 733786
58471 733786 718847 704523 692138 681197 671105 662325 654831 647353 639274 631569 624930 618689 612451
58458 612451 606929 602272 597485 592462 588616 586381 584120 580764 577778 577184 579187 582891 587736 593116
58444 593116 598152 603029 609198 617406 626930 637401 649544 663321 677192 690158 702776 715315
58432 715315 726760 736539 745314 753162 758914 762255 764473 766125 765977 763230 758766 753194 745863 736910
58418 736910 728159 720778 714165 708188 704165 702343 700772 698259 696194 695997 697038 698675 702021 707735
58404 707735 714069 718979 722432 724970 725889 724557 721762 718192 713384 707637 702942 700401 698636 696302
$$ packed form
58494F86997J1374J2662J3518J4174J5211J5900J5299J4138J3492J2640J0243
58483H35648O607K741j502o255j0044j1661j2301j3513j4537j4115j3350j3932
58471G33786j4939j4324j2385j0941j0092q780p494p478q079p705o639o241o238
58458F12451n522m657m787n023l846k235k261l356k986n94K003L704M845N380
58444E93116N036M877O169Q208R524J0471J2143J3777J3871J2966J2618J2539
58432G15315J1445R779Q775P848N752L341K218J652j48k747m464n572p331q953
58418G36910q751p381o613n977m023j822j571k513k065j97J041J637L346N714
58404G07735O334M910L453K538R19j332k795l570m808n747m695k541j765k334
$$ plain form
58390 696302 694264 693724 694293 695532 698332 703034 708164 712696 717600 723588 729493 734539 739966 746603 753019
58375 753019 757929 762279 767134 771777 775785 780680 787396 794283 799723 804632 810285 815797 819896 823206
58361 823206 826726 830043 832887 836415 841134 845781 849898 855033 861699 867946 872836 878236 884989 890531
58347 890531 892856 893745 895262 896182 894986 893375 893467 894258 894282 895084 898572 903401 907652 912718 920872 931084
58331 931084 940910 950551 961525 973209 984154 994980 1006727 1018201 1028121 1037810 1048729 1059654
58319 1059654 1069498 1080294 1093843 1108033 1120214 1131649 1144674 1157953 1168797 1177852 1187214 1196046
58307 1196046 1202396 1207383 1213364 1219919 1225782 1232565 1242285 1253255 1262885 1272500 1284868 1299041 1312308
58294 1312308 1325306 1340425 1356960 1372654 1388411 1406722 1426939 1446693 1466432 1488133 1511241
$$ packed form
58390F96302k038n40N69J239K800M702N130M532M904N988N905N046N427O637O416
58375G53019M910M350M855M643M008M895O716O887N440M909N653N512M099L310
58361H23206L520L317K844L528M719M647M117N135O666O247M890N400O753N542
58347H90531K325Q89J517R20j196j611R2P91K4Q02L488M829M251N066Q154J0212
58331I31084R826R641J0974J1684J0945J0826J1747J1474R920R689J0919J0925
58319A059654R844J0796J3549J4190J2181J1435J3025J3279J0844R055R362Q832
58307A196046O350M987N981O555N863O783R720J0970R630R615J2368J4173J3267
58294A312308J2998J5119J6535J5694J5757J8311K0217J9754J9739K1701K3108
$$ plain form
58283 1511241 1534247 1558450 1585741 1614703 1643300 1673034 1705848 1739558 1771360 1803143 1838039
58272 1838039 1874389 1908709 1941981 1977170 2013021 2046444 2078684 2113052 2148849 2183676 2219353
58261 2219353 2259258 2302233 2345472 2390789 2441435 2495477 2549278 2604694 2665646 2730502 2795470
58250 2795470 2862587 2936294 3014933 3093995 3174986 3262379 3354592 3447178 3542342 3645767 3756375
58239 3756375 3868956 3984613 4108654 4240548 4376392 4518926 4674209 4840587 5012267
58230 5012267 5191685 5386625 5597202 5817967 6050951 6303960 6577807 6868365 7179299
58221 7179299 7519050 7887189 8278261 8697189 9155879 9657035 10197752 10786912 11441404
58212 11441404 12167195 12962999 13840991 14824209 15925942 17154358 18537083 20119348 21942009
$$ packed form
58283A511241K3006K4203K7291K8962K8597K9734L2814L3710L1802L1783L4896
58272A838039L6350L4320L3272L5189L5851L3423L2240L4368L5797L4827L5677
58261B219353L9905M2975M3239M5317N0646N4042N3801N5416O0952O4856O4968
58250B795470O7117P3707P8639P9062Q0991Q7393R2213R2586R5164J03425J10608
58239C756375J12581J15657J24041J31894J35844J42534J55283J66378J71680
58230E012267J79418J94940K10577K20765K32984K53009K73847K90558L10934
58221G179299L39751L68139L91072M18928M58690N01156N40717N89160O54492
58212A1441404P25791P95804Q77992R83218J101733J228416J382725J582265J822661
$$ plain form
58203 21942009 24050243 26524154 29470558 32982180 37136320 42038579 47841932 54736751
58195 54736751 62984555 72988608 85297847 100528133 119312498 142318449 170217540
58188 170217540 203509548 242177784 285103677 329290725 369497103 399197716 412969684
58181 412969684 408898392 389202725 358718102 322628436 285020109 248597346 214930750
58174 214930750 184733375 158136482 134993564 115083003 98151584 83911027 72064908
58167 72064908 62320070 54364932 47880028 42593281 38304317 34852892 32099843 29951967
58159 29951967 28373689 27355353 26890246 26992410 27709814 29100618 31207223 34039614
58151 34039614 37505745 41273533 44699133 46981554 47508144 46145503 43254656 39446776
$$ packed form
58203B1942009K108234K473911K946404L511622M154140M902259N803353O894819
58195E4736751Q247804J0004053J2309239J5230286J8784365K3005951K7899091
58188A70217540L3292008L8668236M2925893M4187048M0206378K9700613J3771968
58181D12969684m071292j9695667l0484623l6089666l7608327l6422763l3666596
58174B14930750l0197375k6596893k3142918j9910561j6931419j4240557j1846119
58167G2064908r744838p955138o484904n286747m288964l451425k753049k147876
58159B9951967j578278j018336m65107J02164P17404J390804K106605K832391
58151C4039614L466131L767788L425600K282421N26590j362641k890847l807880
$$ plain form
58143 39446776 35293960 31185006 27338866 23866819 20806772 18142295 15835071 13853926
58135 13853926 12174479 10764695 9585910 8604499 7791846 7116789 6549252 6069450 5664101
58126 5664101 5315926 5006201 4725333 4471018 4237166 4014097 3798797 3595616 3406596
58117 3406596 3229313 3064076 2914809 2782096 2662641 2555973 2464534 2386711 2316433 2249890
58107 2249890 2186273 2122330 2053332 1979938 1907627 1838948 1772321 1708284 1650187 1598233 1549187
58096 1549187 1502511 1460685 1422945 1384868 1344861 1305323 1266958 1227947 1189374 1155371 1126737
58085 1126737 1099859 1072842 1047267 1023153 997879 971270 946428 924310 902575 880802 861592
58074 861592 845277 828689 810622 793667 779273 765748 752473 741315 732388 722972 712259 702835
$$ packed form
58143C9446776m152816m108954l846140l472047l060047k664477k307224j981145
58135A3853926j679447j409784j178785r81411q12653o75057n67537m79802m05349
58126E664101l48175l09725k80868k54315k33852k23069k15300k03181j89020
58117C406596j77283j65237j49267j32713j19455j06668r1439p7823p0278o6543
58107B249890o3617o3943o8998p3394p2311o8679o6627o4037n8097n1954m9046
58096A549187m6676m1826l7740l8077m0007l9538l8365l9011l8573l4003k8634
58085A126737k6878k7017k5575k4114k5274k6609k4842k2118k1735k1773j9210
58074H61592j6315j6588j8067j6955j4394j3525j3275j1158q927r416j0713r424
$$ plain form
58062 702835 696024 689982 683713 678654 674791 669505 661859 654010 646886 638493 628051 617824 609191 600711
58048 600711 591664 583787 577874 572242 566147 561267 558307 555621 552624 551097 551656 552475 552946 555083 559682
58033 559682 564516 567997 571275 575071 577732 578227 578007 578255 578218 577796 578664 581211 583338 583909 584458 585978
58017 585978 586981 586313 584948 583453 580671 576475 572799 570192 566275 559427 551194 543320 535253 526411
58003 526411 518157 511456 505052 497858 490742 484291 477291 469179 461592 455778 450934 446745 444965 446569
57989 446569 449720 452431 454960 457895 460367 462082 464684 469073 473629 476977 480241 484648 489227 492968
57975 492968 496933 502013 506726 509470 510951 512140 511886 508953 504610 500725 496845 491479 484901 478425
57961 478425 472205 465864 460143 455915 452627 449416 446573 444336 441655 437856 434085 431435 429208 426779
$$ packed form
58062G02835o811o042o269n059l863n286p646p849p124q393j0442j0227q633q480
58048F00711r047p877n913n632o095m880k960k686k997j527N59Q19M71K137M599
58033E59682M834L481L278L796K661M95k20K48l7m22Q68K547K127N71N49J520
58017E85978J003o68j365j495k782m196l676k607l917o848q233p874q067q842
58003E26411q254o701o404p194p116o451p000q112p587n814m844m189j780J604
57989D46569L151K711K529K935K472J715K602M389M556L348L264M407M579L741
57975D92968L965N080M713K744J481J189k54k933m343l885l880n366o578o476
57961D78425o220o341n721m228l288l211k843k237k681l799l771k650k227k429
$$ plain form
57947 426779 425512 426734 429262 431100 432374 434436 437193 439434 440879 441855 441741 439686 436239 432556 428582
57932 428582 423580 417717 411629 405070 397397 388715 379409 369401 359064 349848 342728 336962 331565 326952
57918 326952 323980 322551 322455 324308 328244 332828 336762 340650 345720 351919 358647 366166 374791 383729 392256
57903 392256 400967 410367 419265 426177 431400 436231 440993 445258 449032 452242 453925 453378 451315 448622
57889 448622 444884 439427 432860 426304 420023 413998 408751 404372 399918 395055 391032 388716 386990 384583
57875 384583 382082 380551 379621 378769 379082 381689 385610 389247 392978 398231 404921 411876 418896 426214 432760
57860 432760 437262 440462 444046 447878 450415 451414 452011 452422 451750 449959 447984 445882 442797 438795 434982
57845 434982 431715 428358 424786 421512 418361 414630 410597 407296 404795 402172 399153 396267 393390 389693
$$ packed form
57947D26779j267J222K528J838J274K062K757K241J445R76j14k055l447l683l974
57932D28582n002n863o088o559p673q682r306j0008j0337r216p120n766n397m613
57918C26952k972j429r6J853L936M584L934L888N070O199O728P519Q625Q938Q527
57903C92256Q711R400Q898O912N223M831M762M265L774L210J683n47k063k693
57889D48622l738n457o567o556o281o025n247m379m454m863m023k316j726k407
57875C84583k501j531r30q52L13K607L921L637L731N253O690O955P020P318O546
57860D32760M502L200L584L832K537R99N97M11o72j791j975k102l085m002l813
57845D34982l267l357l572l274l151l731m033l301k501k623l019k886k877l697
$$ plain form
57831 389693 385167 380819 377092 373263 368470 362270 354341 344828 334917 325931 317942 310234 302760 295923
57817 295923 289349 282281 275025 268607 263168 257984 252880 248318 244218 240038 235934 232610 230131 228031
57803 228031 226381 225515 225017 224305 224013 225452 228855 233426 238968 246117 255115 265546 277085 289165
57789 289165 300249 308933 315712 322198 328618 333477 335677 335605 334053 331419 328019 323955 318647 311680
57775 311680 304012 297146 291242 285392 279524 274515 270516 266829 263620 262169 263038 265356 268239 271705
57761 271705 275900 280563 285536 290798 295882 300236 304079 307764 310576 311528 311205 311222 311824 311716 310479 309525
57745 309525 310169 312280 315307 319188 323637 327841 331583 335602 340325 345247 349983 354837 359890 364613
57731 364613 368928 373658 379460 386223 393911 402981 413463 424576 435738 447207 459309 471844 484593
$$ packed form
57831C89693m526m348l727l829m793o200p929r513r911q986p989p708p474o837
57817B95923o574p068p256o418n439n184n104m562m100m180m104l324k479k100
57803B28031j650q66m98p12k92J439L403M571N542P149Q998J0431J1539J2080
57789B89165J1084Q684O779O486O420M859K200p2j552k634l400m064n308o967
57775C11680p668o866n904n850n868n009l999l687l209j451Q69K318K883L466
57761B71705M195M663M973N262N084M354L843L685K812R52l23J7O02j08j237r54
57745C09525O44K111L027L881M449M204L742M019M723M922M736M854N053M723
57731C64613M315M730N802O763P688R070J0482J1113J1162J1469J2102J2535J2749
$$ plain form
57718 484593 497712 511377 525711 541157 558181 576616 596173 617451 641472 668307 697313
57707 697313 728574 762888 800395 840736 884685 934092 989963 1052125 1121136 1198930 1287058
57696 1287058 1385894 1496350 1620907 1761981 1920518 2097068 2293036 2509702 2746693 3002022
57686 3002022 3272429 3552466 3833636 4105138 4355026 4570743 4740310 4854871 4910561 4908305
57676 4908305 4853091 4754008 4623696 4476287 4325423 4183569 4061384 3966311 3901414 3864526
57666 3864526 3846285 3828549 3787690 3703562 3567935 3386151 3172602 2944714 2718212 2504145
57656 2504145 2308404 2133544 1980645 1849622 1739179 1647575 1573151 1513885 1467474 1432542
57646 1432542 1408948 1396251 1392792 1397071 1409137 1429739 1459022 1497103 1545096 1604294 1674822 1756361
$$ packed form
57718D84593J3119J3665J4334J5446J7024J8435J9557K1278K4021K6835K9006
57707F97313L1261L4314L7507M0341M3949M9407N5871O2162O9011P7794Q8128
57696A287058R8836J10456J24557J41074J58537J76550J95968K16666K36991K55329
57686C002022K70407K80037K81170K71502K49888K15717J69567J14561N5690k256
57676D908305n5214r9083j30312j47409j50864j41854j22185r5073o4897l6888
57666C864526j8241j7736m0859q4128j35627j81784k13549k27888k26502k14067
57656B504145j95741j74860j52899j31023j10443r1604p4424n9266m6411l4932
57646A432542k3594j2697l459M279J2066K0602K9283L8081M7993N9198P0528Q1539
$$ plain form
57634 1756361 1849954 1957929 2082050 2222744 2380176 2555150 2748424 2959299 3184804 3419836
57624 3419836 3657866 3891329 4111061 4305714 4462894 4571896 4625745 4621496 4560090 4446611
57614 4446611 4289595 4098869 3883805 3653280 3415841 3178787 2947444 2725832 2517430
57605 2517430 2324664 2148278 1988006 1843438 1713730 1597156 1491965 1397383 1313104 1238104
57595 1238104 1170718 1109695 1054491 1004626 959355 918023 880342 846214 815476 787780 762720
57584 762720 740200 720382 702863 686240 669322 652679 638040 626119 616071 607173 599779 594123
57572 594123 589535 585582 582885 581839 581508 580882 580505 581787 585235 590323 596666 604268 612948 622457 633079
57557 633079 645445 659895 676402 694742 714302 734401 755473 779364 807679 840293 876210
$$ packed form
57634A756361R3593J07975J24121J40694J57432J74974J93274K10875K25505K35032
57624C419836K38030K33463K19732J94653J57180J09002N3849m249o1406j13479
57614D446611j57016j90726k15064k30525k37439k37054k31343k21612k08402
57605B517430j92766j76386j60272j44568j29708j16574j05191r4582q4279p5000
57595A238104o7386o1023n5204m9865m5271m1332l7681l4128l0738k7696k5060
57584G62720k2520j9818j7519j6623j6918j6643j4639j1921j0048q898p394n656
57572E94123m588l953k697j046l31o26l77J282L448N088O343P602Q680R509J0622
57557F33079J2366J4450J6507J8340J9560K0099K1072K3891K8315L2614L5917
$$ plain form
57546 876210 915380 958840 1007629 1062594 1125014 1196388 1277620 1369126 1471672 1586363 1713841
57535 1713841 1854149 2007329 2173498 2352086 2541091 2736752 2933437 3123844 3299544
57526 3299544 3451351 3569663 3645828 3674448 3654621 3589142 3483257 3344300 3181177 3002693
57516 3002693 2816154 2627596 2442458 2265190 2098728 1945017 1805502 1680410 1568275
57507 1568275 1467278 1376848 1297241 1228035 1167945 1115800 1070825 1032199 999290 972184 951182
57496 951182 935752 924682 917173 913218 912967 916345 923273 933766 947875 965862 988302 1015749 1048574
57483 1048574 1087342 1132933 1186077 1247351 1317868 1399173 1491996 1596018 1711528 1840342 1984098
57472 1984098 2142238 2312499 2492337 2678408 2864922 3043733 3205913 3342437 3444068
$$ packed form
57546H76210L9170M3460M8789N4965O2420P1374Q1232R1506J02546J14691J27478
57535A713841J40308J53180J66169J78588J89005J95661J96685J90407J75700
57526C299544J51807J18312P6165K8620j9827o5479j05885j38957j63123j78484
57516C002693j86539j88558j85138j77268j66462j53711j39515j25092j12135
57507A568275j00997r0430p9607o9206o0090n2145m4975l8626l2909k7106k1002
57496I51182j5430j1070p509l955k51L378O928J0493J4109J7987K2440K7447L2825
57483A048574L8768M5591N3144O1274P0517Q1305R2823J04022J15510J28814J43756
57472A984098J58140J70261J79838J86071J86514J78811J62180J36524J01631
$$ plain form
57463 3444068 3502534 3512814 3474303 3390287 3267057 3112899 2936538 2745947 2548535 2351421
57453 2351421 2160320 1978406 1807139 1647815 1501544 1368418 1248063 1140637 1046076 962708
57443 962708 888011 820634 760484 707018 658933 615483 576633 541698 509264 478790 451005
57432 451005 426310 403954 383238 364318 347259 331361 316092 301891 289352 278281 268030
57421 268030 258180 248475 238750 229328 220927 213742 207157 200651 194456 189037 184390 180124 175775 170997
57407 170997 165979 161737 159278 158314 157422 155646 153290 151079 149334 148140 147532 147103 146066 144101 141702
57392 141702 139571 138163 137826 138610 139740 139975 138783 136659 134223 131712 129467 127983 127155 126195 124667
57377 124667 122965 121497 120097 118583 117179 115972 114599 112868 111106 109483 107594 105162 102679 100876
$$ packed form
57463C444068N8466J0280l8511q4016j23230j54158j76361j90591j97412j97114
57453B351421j91101j81914j71267j59324j46271j33126j20355j07426r4561q3368
57443I62708p4697o7377o0150n3466m8085m3450l8850l4935l2434l0474k7785
57432D51005k4695k2356k0716j8920j7059j5898j5269j4201j2539j1071j0251
57421B68030r850r705r725r422q401p185o585o506o195n419m647m266m349m778
57407A70997n018m242k459r64q92j776k356k211j745j194o08m29j037j965k399
57392A41702k131j408l37P84J130K35j192k124k436k511k245j484q28r60j528
57377A24667j702j468j400j514j404j207j373j731j762j623j889k432k483j803
$$ plain form
57363 100876 99967 99692 99749 99895 100027 100347 101023 101608 101402 100544 100138 100984 102741 104544 105854 106509 106603 106656 107302
57344 107302 108533 109739 110641 111484 112162 112094 111388 111239 112492 114492 115984 116609 116846 117068 117434 118364 120291
57327 120291 123032 125899 128413 130557 132560 134777 137591 141097 145014 149096 153391 157937 162509 166896
57313 166896 171144 175387 179736 184489 190005 196247 202786 209499 216837 225220 234496 244174 253915 263801
57299 263801 274508 287175 302491 319831 337853 356011 374887 394970 415975 437683 460684
57288 460684 485723 512803 541287 570465 599713 628480 656430 683240 708114 729854 747459
57277 747459 760228 767356 768092 762318 750352 732352 708816 681505 652599 622669 590768 556939
57265 556939 523375 492386 464314 438299 414014 391679 371233 352638 336414 322888 311434
$$ packed form
57363A00876r09k75N7J46J32L20O76N85k06q58m06Q46J757J803J310O55R4N3O46
57344A07302J231J206R02Q43O78o8p06j49J253K000J492O25K37K22L66R30J927
57327A20291K741K867K514K144K003K217K814L506L917M082M295M546M572M387
57313A66896M248M243M349M753N516O242O539O713P338Q383R276R678R741R886
57299B63801J0707J2667J5316J7340J8022J8158J8876K0083K1005K1708K3001
57288D60684K5039K7080K8484K9178K9248K8767K7950K6810K4874K1740J7605
57277G47459J2769P128P36n774j1966j8000k3536k7311k8906k9930l1901l3829
57265E56939l3564l0989k8072k6015k4285k2335k0446j8595j6224j3526j1454
$$ plain form
57254 311434 301345 292957 286934 282910 279796 277101 275033 273510 272063 270598 269510 268976 268787 268862 269472
57239 269472 270924 273256 276118 278817 280877 282637 284751 287029 288596 289451 290852 293547 296703 299447
57225 299447 302517 307267 313777 321138 329125 338367 349171 361302 374659 389097 403720 417438 430154
57212 430154 442518 454673 466247 477506 489493 502877 517499 533098 549622 566728 583854
57201 583854 601064 619159 638759 659768 681789 704488 727501 750557 773792 797438 821208
57190 821208 844486 867135 889593 912142 934563 956568 978144 999482 1020960 1043163 1066505
57179 1066505 1090836 1115719 1140997 1166785 1193114 1219890 1247007 1274227 1301254 1328220 1355662
57168 1355662 1383695 1411741 1439504 1467532 1496221 1524961 1553131 1581354 1610787 1641558 1672915
$$ packed form
57254C11434j0089q388o023m024l114k695k068j523j447j465j088n34j89P5O10
57239B69472J452K332K862K699K060J760K114K278J567Q55J401K695L156K744
57225B99447L070M750O510P361P987R242J0804J2131J3357J4438J4623J3718J2716
57212D30154J2364J2155J1574J1259J1987J3384J4622J5599J6524J7106J7126
57201E83854J7210J8095J9600K1009K2021K2699K3013K3056K3235K3646K3770
57190H21208K3278K2649K2458K2549K2421K2005K1576K1338K1478K2203K3342
57179A066505K4331K4883K5278K5788K6329K6776K7117K7220K7027K6966K7442
57168A355662K8033K8046K7763K8028K8689K8740K8170K8223K9433L0771L1357
$$ plain form
57157 1672915 1704592 1737023 1770396 1804498 1839391 1875297 1911849 1948328 1984593 2020971 2057386
57146 2057386 2093443 2129266 2165328 2201526 2237312 2272614 2307628 2341778 2373962 2403948 2432568
57135 2432568 2460425 2487348 2513278 2538735 2564166 2589685 2615737 2643238 2672844 2704762 2739387
57124 2739387 2777358 2818786 2863108 2909812 2958635 3009035 3060282 3112211 3165198 3219389 3274725
57113 3274725 3331703 3391295 3454239 3521403 3594905 3677928 3773369 3883669 4012053 4162976 4341562
57102 4341562 4554192 4810265 5122745 5507303 5982511 6570918 7297823 8187645 9262518
57093 9262518 10545101 12061393 13839334 15904485 18276019 20963061 23960403 27245576
57085 27245576 30780925 34522049 38429776 42476326 46631354 50822158 54888333 58570896
$$ packed form
57157A672915L1677L2431L3373L4102L4893L5906L6552L6479L6265L6378L6415
57146B057386L6057L5823L6062L6198L5786L5302L5014L4150L2184K9986K8620
57135B432568K7857K6923K5930K5457K5431K5519K6052K7501K9606L1918L4625
57124B739387L7971M1428M4322M6704M8823N0400N1247N1929N2987N4191N5336
57113C274725N6978N9592O2944O7164P3502Q3023R5441J10300J28384J50923J78586
57102D341562K12630K56073L12480L84558M75208N88407P26905Q89822J074873
57093I262518J282583J516292J777941K065151K371534K687042K997342L285173
57085B7245576L535349L741124L907727M046550M155028M190804M066175L682563
$$ plain form
57077 58570896 61559995 63581091 64469738 64198371 62855999 60605802 57643448 54165632
57069 54165632 50349669 46343083 42262449 38200161 34234918 30439254 26879243 23608075
57061 23608075 20659757 18047285 15764999 13792966 12102129 10659312 9430868 8384716
57053 8384716 7491543 6725622 6064882 5490475 4986760 4541769 4147128 3796996 3486817
57044 3486817 3212624 2970702 2757297 2568549 2400786 2250882 2116286 1994773 1884189
57035 1884189 1782561 1688470 1601220 1520436 1445553 1375932 1311305 1251647 1196576 1145312 1097371
57024 1097371 1052902 1012148 974984 941174 910660 883340 858807 836543 816110 797197 779885
57013 779885 764949 753311 744999 739224 735692 735211 738730 746566 759175 778075 805351 842799 892326
$$ packed form
57077E8570896K989099K021096Q88647k71367j342372k250197k962354l477816
57069E4165632l815963m006586m080634m062288l965243l795664l560011l271168
57061B3608075k948318k612472k282286j972033j690837j442817j228444j046152
57053H384716q93173p65921o60740n74407n03715m44991l94641l50132l10179
57044C486817k74193k41922k13405j88748j67763j49904j34596j21513j10584
57035A884189j01628r4091q7250q0784p4883o9621o4627n9658n5071n1264m7941
57024A097371m4469m0754l7164l3810l0514k7320k4533k2264k0433j8913j7312
57013G79885j4936j1638q312n775l532m81L519P836J2609J8900K7276L7448M9527
$$ plain form
57000 892326 956785 1039581 1143651 1271275 1423504 1596626 1776757 1938291 2050753 2091432
56990 2091432 2055416 1956008 1816136 1658081 1498198 1347126 1211344 1093523 992769 906097
56980 906097 830067 761425 697373 636454 579162 527201 482017 444069 413031 388239 369012
56969 369012 354773 344774 337884 333160 330741 331619 336368 344636 355953 370327 387859 408564 432734
56956 432734 460253 488718 513138 528604 533132 527583 513850 494191 471535 448765 427328 407333
56944 407333 388983 373168 360589 351111 344211 339712 338040 340207 347435 360317 378329 400549 426782
56931 426782 457500 492487 529477 563829 589499 601225 596851 578019 548673 513101 475105 437805
56919 437805 403222 372121 344693 321122 301239 284257 269437 256623 245686 236095 227647 220979
$$ packed form
57000H92326O4459Q2796J04070J27624J52229J73122J80131J61534J12462M0679
56990B091432l6016r9408j39872j58055j59883j51072j35782j17821j00754q6672
56980I06097p6030o8642o4052o0919n7292n1961m5184l7948l1038k4792j9227
56969C69012j4239r999o890m724k419Q78M749Q268J1317J4374J7532K0705K4170
56956D32734K7519K8465K4420J5466M528n549j3733j9659k2656k2770k1437j9995
56944D07333j8350j5815j2579r478o900m499j672K167P228J2882J8012K2220K6233
56931D26782L0718L4987L6990L4352K5670J1726m374j8832k9346l5572l7996l7300
56919D37805l4583l1101k7428k3571j9883j6982j4820j2814j0937r591q448o668
$$ plain form
56907 220979 216581 213802 211666 210150 209746 210230 210981 212206 214757 218801 223711 229339 236442 245719 257225
56892 257225 270968 287426 307319 331327 359969 393213 430145 469332 509026 546457 577419
56881 577419 597816 605892 602655 590514 572341 551260 529884 509322 489634 471379 456035 444960
56869 444960 438714 437372 440680 448121 459921 478117 505593 543806 592251 649957 715799 786340
56857 786340 854141 909290 942979 950443 932284 894080 844060 789809 736364 686671 642718 605795
56845 605795 576387 554610 540705 535079 538317 551422 575743 612573 663155 728954 811231 909883
56833 909883 1022382 1142731 1260161 1359313 1424220 1444701 1420259 1358841 1272631 1174182 1073795
56822 1073795 978070 890230 811955 744692 689321 645576 612632 590086 578118 577211 588149 611902
$$ packed form
56907B20979m398k779k136j516m04M84P51J225K551M044M910N628P103R277J1506
56892B57225J3743J6458J9893K4008K8642L3244L6932L9187L9694L7431L0962
56881E77419K0397Q076l237j2141j8173k1081k1376k0562j9688j8255j5344j1075
56869D44960o246j342L308P441J1800J8196K7476L8213M8445N7706O5842P0541
56857G86340O7801N5149L3689P464j8159l8204n0020n4251n3445m9693m3953l6923
56845F05795k9408k1777j3905n626L238J3105K4321L6830N0582O5799Q2277R8652
56833I09883J12499J20349J17430R9152O4907K0481k4442o1418q6210r8449j00387
56822A073795r5725q7840p8275o7263n5371m3745l2944k2546j1968r07J0938K3753
$$ plain form
56810 611902 649117 699930 764220 841045 926746 1013374 1089318 1142144 1162436 1147156 1100812
56799 1100812 1033172 954908 874377 797089 726348 663552 608681 561478 522178 490960 467330
56788 467330 450643 440977 439071 445632 460962 484923 516857 555573 599302 644930 686914 717763
56776 717763 730838 723469 697851 659369 613997 566370 519248 474178 432357 394671 361293 331911
56764 331911 306459 285155 267786 253585 241925 232588 225150 218777 212973 208005 204207 201340 199013
56751 199013 197239 196077 194971 193003 189771 185825 182226 179743 178315 177234 175942 174468 172950 171121
56737 171121 168743 166234 164181 162431 160383 158017 155867 154086 152412 151039 150489 150543 150261 149341 148448 147921
56721 147921 147178 145943 145075 145490 146918 148423 149552 150383 150968 151319 151607 151923 152162 152340 152545 152494 151756 150576
$$ packed form
56810F11902L7215N0813O4290P6825Q5701Q6628P5944N2826K0292j5280m6344
56799A100812o7640p8264q0531p7288p0741o2796n4871m7203l9300l1218k3630
56788D67330j6687r666j906O561J5330K3961L1934L8716M3729M5628M1984L0849
56776G17763J3075p369k5618l8482m5372m7627m7122m5070m1821l7686l3378k9382
56764C31911k5452k1304j7369j4201j1660r337p438o373n804m968l798k867k327
56751A99013j774j162j106j968l232l946l599k483j428j081j292j474j518j829
56737A71121k378k509k053j750k048k366k150j781j674j373n50N4k82r20q93n27
56721A47921p43j235q68M15J428J505J129Q31N85L51K88L16K39J78K05n1p38j180
$$ plain form
56703 150576 149715 149238 148338 146622 144630 142766 140804 138982 138398 139395 140584 140493 139485 138932 139155 139329 139079
56686 139079 139004 139686 141077 142919 145142 147779 150920 154654 158812 163005 167045 170885 173994 175595 175931
56671 175931 176487 178316 180814 182829 184246 185666 187136 188194 188816 189422 190186 191064 192261 193926 195618
56656 195618 196764 197459 198239 199230 199989 200004 198944 196806 194176 191936 190221 188122 184842 180671 176371 172250
56640 172250 168391 165119 162539 160149 157632 155559 154682 155112 156724 159632 163474 166963 169131 170459 171912
56625 171912 173487 174693 175835 177597 179753 181425 182354 182917 183166 182878 182208 181241 179208 175317 170216 165519
56609 165519 161991 159221 156957 155624 155428 155969 156883 158043 159045 159342 158939 158280 157500 156464 155372 154526
56593 154526 153625 152146 150314 148891 148128 147729 147736 148513 149944 151438 152735 153958 155045 155964 157251 159447
$$ packed form
56703A50576q61m77r00j716j992j864j962j822n84R97J189r1j008n53K23J74k50
56686A39079p5O82J391J842K223K637L141L734M158M193M040L840L109J601L36
56671A75931N56J829K498K015J417J420J470J058O22O06P64Q78J197J665J692
56656A95618J146O95P80R91P59J5j060k138k630k240j715k099l280m171m300m121
56640A72250l859l272k580k390k517k073q77M30J612K908L842L489K168J328J453
56625A71912J575J206J142J762K156J672R29N63K49k88o70r67k033l891n101m697
56609A65519l528k770k264j333j96N41R14J160J002K97m03o59p80j036j092q46
56593A54526r01j479j832j423p63l99PP77J431J494J297J223J087R19J287K196
$$ plain form
56577 159447 162143 164538 166685 169203 171966 174275 176213 178632 181734 184885 187986 191740 196284 200768
56563 200768 204789 209162 214723 221194 227790 234136 240166 245789 251226 257000 263122 268783 273249 276640
56549 276640 279510 282162 284636 286858 288503 289086 288452 286829 284287 280538 275431 269354 263040 257174 252071
56534 252071 247467 242813 238095 234079 231365 229595 228068 226634 225385 223995 222229 220629 219728 218893 216968
56519 216968 213822 210251 206604 202632 198570 195191 192720 190630 188526 186298 183588 180097 176382 173321
56505 173321 170896 168567 166569 165569 165166 164232 162764 161895 161808 161178 159183 156688 154848 153816 153400 153828
56489 153828 155096 156593 158021 159837 162248 164672 166746 168931 171577 174273 176732 179419 182688 186043
56475 186043 188802 190760 191778 191605 190663 190195 191034 192876 195148 197751 200506 202782 204387 206050 208412
$$ packed form
56577A59447K696K395K147K518K763K309J938K419L102L151L101L754M544M484
56563B00768M021M373N561O471O596O346O030N623N437N774O122N661M466L391
56549B76640K870K652K474K222J645N83o34j623k542l749n107o077o314n866n103
56534B52071m604m654m718m016k714j770j527j434j249j390j766j600r01q35j925
56519B16968l146l571l647l972m062l379k471k090k104k228k710l491l715l061
56505A73321k425k329j998j000m03r34j468q69q7o30j995k495j840j032m16M28
56489A53828J268J497J428J816K411K424K074K185K646K696K459K687L269L355
56475A86043K759J958J018j73r42m68Q39J842K272K603K755K276J605J663K362
$$ plain form
56460 208412 211144 213602 215686 217508 218887 219721 220249 220516 220198 219408 218959 219348 220102 220612 220995 221675 222690
56443 222690 223840 224954 225729 225900 225815 226122 226686 226588 225459 223902 222329 220387 217923 215521 213546 211629
56427 211629 209585 207881 206573 204767 201892 198632 195917 193844 192278 191626 192061 192743 192769 192428 192684 193861
56411 193861 195515 197251 198962 200582 202128 203711 205208 206315 207129 208096 209121 209417 208534 206897 205078
56396 205078 203275 201747 200894 200552 200081 199500 199660 200934 202722 204610 206996 210069 213252 216223 219358
56381 219358 222506 224456 224469 223376 222262 220987 218944 216446 214385 213170 212900 213912 216279 219269 222080
56366 222080 224646 227202 229668 232068 234772 237712 240068 241373 242168 242990 243571 243747 244298 246001 248572
56351 248572 251307 254094 257077 260026 262787 265703 268956 272145 275087 278266 282035 286291 291436 298484
$$ packed form
56460B08412K732K458K084J822J379Q34N28K67l18p90m49L89P54N10L83O80J015
56443B22690J150J114P75J71q5L07N64r8j129j557j573j942k464k402j975j917
56427B11629k044j704j308j806k875l260k715k073j566o52M35O82K6l41K56J177
56411A93861J654J736J711J620J546J583J497J107Q14R67J025K96q83j637j819
56396B05078j803j528q53l42m71n81J60J274J788J888K386L073L183K971L135
56381B19358L148J950J3j093j114j275k043k498k061j215k70J012K367K990K811
56366B22080K566K556K466K400K704K940K356J305P95Q22N81J76N51J703K571
56351B48572K735K787K983K949K761K916L253L189K942L179L769M256N145P048
$$ plain form
56337 298484 307430 316605 324505 331306 337816 344066 349902 355847 362256 368553 374342 380366 387304 394587
56323 394587 401464 408206 415043 420945 424829 427157 428980 430202 430130 429018 427630 425829 423020 419499 416057
56308 416057 412685 408921 405084 401963 399618 397618 396052 395259 395005 395005 395768 397849 400746 403627 406610 410226
56292 410226 414211 418087 422473 428433 435811 443503 451243 459972 470454 482491 495469 508952 522815
56279 522815 537475 553803 572366 593091 615972 641445 669611 700011 732752 768964 809483
56268 809483 854140 903163 958159 1020701 1090990 1169017 1255926 1352957 1459943 1576202 1702167
56257 1702167 1838818 1986086 2142835 2307599 2478174 2651205 2823288 2991743 3153391
56248 3153391 3303526 3437257 3551081 3642345 3708620 3749041 3765231 3759663 3734196 3691366 3635443
$$ packed form
56337B98484Q946R175P900O801O510O250N836N945O409O297N789O024O938P283
56323C94587O877O742O837N902L884K328J823J222p2j112j388j801k809l521l442
56308D16057l372l764l837l121k345k000j566p93k54%P63K081K897K881K983L616
56292D10226L985L876M386N960P378P692P740Q729J0482J2037J2978J3483J3863
56279E22815J4660J6328J8563K0725K2881K5473K8166L0400L2741L6212M0519
56268H09483M4657M9023N4996O2542P0289P8027Q6909R7031J06986J16259J25965
56257A702167J36651J47268J56749J64764J70575J73031J72083J68455J61648
56248C153391J50135J33731J13824R1264O6275M0421J6190n568k5467m2830n5923
$$ plain form
56237 3635443 3570383 3497865 3418957 3336277 3252468 3167790 3081425 2994168 2907469 2820595 2731122
56226 2731122 2637864 2541316 2441794 2339403 2235475 2131845 2028816 1925695 1823056 1722582
56216 1722582 1624953 1529874 1438028 1351156 1270267 1195435 1127142 1066039 1011499 961965 916635
56205 916635 875429 837784 803056 771680 744314 720302 698520 679155 662917 649096 636206
56194 636206 624116 613778 605312 598106 592300 588429 586125 584823 585090 587489 590982 594383 598546 605041
56180 605041 613472 622271 631299 641380 652021 662040 671745 681932 691297 697514 700441 701710 701623 699191
56166 699191 694903 690580 686539 681592 675904 671177 667936 665184 662866 662186 663341 665320 668032 672346
56152 672346 678103 684514 692447 703801 718609 735205 753281 774352 799326 828198 862074 902950
$$ packed form
56237C635443o5060p2518p8908q2680q3809q4678q6365q7257q6699q6874q9473
56226B731122r3258r6548r9522j02391j03928j03630j03029j03121j02639j00474
56216A722582r7629r5079r1846q6872q0889p4832o8293o1103n4540m9534m5330
56205I16635m1206l7645l4728l1376k7366k4012k1782j9365j6238j3821j2890
56194F36206j2090j0338q466p206n806l871k304j302K67K399L493L401M163O495
56180F05041Q431Q799R028J0081J0641J0019R705J0187R365O217K927J269q7k432
56166F99191m288m323m041m947n688m727l241k752k318o80J155J979K712M314
56152F72346N757O411P933J1354J4808J6596J8076K1071K4974K8872L3876M0876
$$ plain form
56140 902950 951565 1008051 1074551 1154391 1248662 1356181 1476405 1609098 1750798 1894643
56130 1894643 2034193 2165169 2283890 2387558 2476792 2555218 2626030 2690857 2751013 2806195
56120 2806195 2851951 2882098 2894466 2891799 2877433 2853495 2822936 2788856 2750533 2703208 2642497
56109 2642497 2566334 2473169 2362710 2239389 2111302 1984573 1861677 1745163 1638660 1543218
56099 1543218 1456736 1378289 1309360 1249782 1196505 1147837 1105135 1068899 1036951 1008070 983715
56088 983715 964465 948190 933439 921275 912125 904164 896473 890581 887284 885058 883036 882384 883415
56075 883415 884617 885875 889326 895666 902827 909477 916483 923965 930573 936762 944994 955567 966047 975766
56061 975766 986729 999060 1010039 1019087 1029119 1041371 1053443 1064166 1075791 1089475 1103245 1116438
$$ packed form
56140I02950M8615N6486O6500P9840R4271J07519J20224J32693J41700J43845
56130A894643J39550J30976J18721J03668Q9234P8426P0812O4827O0156N5182
56120B806195M5756L0147J2368k667j4366k3938l0559l4080l8323m7325o0711
56109B642497p6163r3165j10459j23321j28087j26729j22896j16514j06503r5442
56099A543218q6482p8447o8929n9578n3277m8668m2702l6236l1948k8881k4355
56088I83715j9250j6275j4751j2164r150p961p691n892l297k226k022o52J031
56075H83415J202J258L451O340P161O650P006P482O608O189Q232J0573J0480R719
56061I75766J0963J2331J0979R048J0032J2252J2072J0723J1625J3684J3770J3193
$$ plain form
56049 1116438 1131535 1149488 1167828 1185540 1205143 1227740 1250742 1272764 1296067 1321767 1347402
56038 1347402 1371637 1396615 1423271 1449304 1474207 1501338 1532471 1565316 1598704 1634885 1674213
56027 1674213 1713270 1750944 1790641 1833602 1875997 1915734 1956039 1999054 2042061 2083601 2127125
56016 2127125 2174798 2223816 2272553 2324130 2380153 2437442 2494891 2556853 2625617 2697295 2769403
56005 2769403 2845512 2928162 3014453 3103122 3198398 3302061 3409465 3518376 3633757 3758739
55995 3758739 3889334 4023458 4166299 4320875 4482357 4647909 4822772 5010285 5205932
55986 5205932 5408212 5625087 5862240 6115616 6383375 6673898 6993493 7337943 7705384
55977 7705384 8105404 8545850 9023706 9539623 10108137 10742369 11442963 12214320 13076731
$$ packed form
56049A116438J5097J7953J8340J7712J9603K2597K3002K2022K3303K5700K5635
56038A347402K4235K4978K6656K6033K4903K7131L1133L2845L3388L6181L9328
56027A674213L9057L7674L9697M2961M2395L9737M0305M3015M3007M1540M3524
56016B127125M7673M9018M8737N1577N6023N7289N7449O1962O8764P1678P2108
56005B769403P6109Q2650Q6291Q8669R5276J03663J07404J08911J15381J24982
55995C758739J30595J34124J42841J54576J61482J65552J74863J87513J95647
55986E205932K02280K16875K37153K53376K67759K90523L19595L44450L67441
55977G705384M00020M40446M77856N15917N68514O34232P00594P71357Q62411
$$ plain form
55968 13076731 14049640 15139750 16361057 17750736 19351628 21200657 23354534 25906829
55960 25906829 28957788 32587338 36881585 41968253 48012367 55221776 63909355 74538825
55952 74538825 87676471 103915089 123868375 148187811 177484605 212108151 251708382
55945 251708382 294485171 336435021 371521695 393462545 398403351 386585015 361764471
55938 361764471 329080694 293111642 257108095 223089464 192128312 164603461 140483900
55931 140483900 119582804 101668143 86474246 73718310 63117886 54373369 47161627
55924 47161627 41182400 36201496 32035358 28520491 25522119 22950460 20740121 18823762
55916 18823762 17141883 15660493 14357520 13202886 12168051 11241751 10418570 9682139
$$ packed form
55968A3076731R72909J090110J221307J389679J600892J849029K153877K552295
55960B5906829L050959L629550M294247N086668O044114P209409Q687579J0629470
55952G4538825J3137646J6238618J9953286K4319436K9296794L4623546L9600231
55945B51708382M2776789M1949850L5086674K1940850M940806j1818336k4820544
55938C61764471l2683777l5969052l6003547l4018631l0961152k7524851k4119561
55931A40483900k0901096j7914661j5193897j2755936j0600424q744517p211742
55924D7161627n979227m980904m166138l514867k998372k571659k210339j916359
55916A8823762j681879j481390j302973j154634j034835r26300q23181p36431
$$ plain form
55908 9682139 9014474 8411146 7872171 7387196 6943303 6538355 6173373 5840089 5528515
55899 5528515 5238913 4974458 4729621 4497193 4279397 4080858 3897361 3722149 3556794
55890 3556794 3405499 3264858 3129333 3000973 2883966 2775121 2669204 2568393 2477265 2393394
55880 2393394 2311790 2233793 2163006 2097058 2031843 1969379 1913260 1860648 1806995 1754594 1708436
55869 1708436 1667325 1626840 1587324 1551317 1516644 1479706 1442511 1409284 1379236 1349690 1323084
55858 1323084 1303701 1290327 1279090 1270828 1268846 1271928 1276111 1280695 1285924 1287366 1279547 1263331 1243498
55845 1243498 1221107 1194339 1164656 1135563 1106859 1076126 1044446 1014919 987107 958551 930177
55834 930177 904590 880598 855094 828986 805807 785745 766456 748489 734409 723515 712624
$$ packed form
55908I682139o67665o03328n38975m84975m43893m04948l64982l33284l11574
55899E528515k89602k64455k44837k32428k17796j98539j83497j75212j65355
55890C556794j51295j40641j35525j28360j17007j08845j05917j00811r1128q3871
55880B393394q1604p7997p0787o5948o5215o2464n6119n2612n3653n2401m6158
55869A708436m1111m0485l9516l6007l4673l6938l7195l3227l0048k9546k6606
55858A323084j9383j3374j1237q262j982L082M183M584N229J442p819j6216j9833
55845A243498k2391k6768k9683k9093k8704l0733l1680k9527k7812k8556k8374
55834I30177k5587k3992k5504k6108k3179k0062j9289j7967j4080j0894j0891
$$ plain form
55823 712624 701282 691284 681982 671021 658935 648324 639298 630178 621693 615889 611904 607485 603744
55810 603744 603740 607085 610499 613033 616268 619963 621980 622110 621809 620637 617007 611849 607391 602885 595591
55795 595591 585492 575005 564507 552180 537963 523785 510202 496524 483774 473751 465588 456942
55783 456942 448139 441467 437026 433099 430065 429812 431451 431576 428756 424143 417810 408319 396041 383265
55769 383265 370866 358209 346292 337351 331208 325423 319276 314331 310887 307114 301972 295987 289078
55756 289078 280711 272182 265679 260942 255797 249943 245140 241787 238552 235470 234073 234108 233236 230459 227026
55741 227026 223709 219999 216218 213646 212165 210441 208595 208186 209505 211439 213821 217111 219999 220328 218392
55726 218392 216405 214789 212101 208552 206194 205232 203440 199813 195802 192424 189125 186127 184884 185369 185656
$$ packed form
55823G12624j1342r998r302j0961j2086j0611r026r120q485n804l985m419l741
55810F03744mL345L414K534L235L695K017J30l01j172l630n158m458m506p294
55795E95591j0099j0487j0498j2327j4217j4178j3583j3678j2750j0023q163q646
55783D56942q803o672m441l927l034k53J639J25k820m613o333r491j2278j2776
55769C83265j2399j2657j1917q941o143n785o147m945l444l773n142n985o909
55756B89078q367q529o503m737n145n854m803l353l235l082j397L5q72k777l433
55741B27026l317l710l781k572j481j724j846m09J319J934K382L290K888L29j936
55726B18392j987j616k688l549k358r62j792l627m011l378l299k998j243M85K87
$$ plain form
55711 185656 184983 184710 185675 187221 189456 193762 200283 207395 214367 222153 230859 238867 245093 249847 252970
55696 252970 253538 251934 249757 247231 243178 237983 233880 231647 229656 226948 224561 222965 220840 217625
55682 217625 214931 214311 215657 218674 223694 230087 235995 240643 244984 249286 252241 253312 253766 254454 254647
55667 254647 254042 253838 254715 255592 255450 254685 253801 252545 251128 250512 250701 250459 249443 248833 249205 249524 248949 247819
55649 247819 246313 243944 240859 237692 233649 226896 217459 207669 199043 190896 182645 175102 168537 161726
55635 161726 154063 146584 139974 133632 127669 123543 121600 120116 117979 116182 115449 114632 112882 111267 110588
55620 110588 109633 107342 104930 103975 103970 103518 102532 101510 99960 97364 94670 93176 92729 92342 91678 90732 89062
55603 89062 86580 84262 82958 82346 81902 81886 82448 82824 82384 81506 80639 79574 78352 77701 77814 77932 77784 78114
$$ packed form
55711A85656o73k73R65J546K235M306O521P112O972P786Q706Q008O226M754L123
55696B52970N68j604k177k526m053n195m103k233j991k708k387j596k125l215
55682B17625k694o20J346L017N020O393N908M648M341M302K955J071M54O88J93
55667B54647o05k04Q77Q77j42p65q84j256j417o16J89k42j016o10L72L19n75j130
55649B47819j506k369l085l167m043o753r437r790q626q147q251p543o565o811
55635A61726p663p479o610o342n963m126j943j484k137j797p33q17j750j615o79
55620A10588r55k291k412r55nm52r86j022j550k596k694j494m47l87o64r46j670
55603H9062k482k318j304o12m44j6N62L76m40q78q67j065j222o51J13J18j48L30
$$ plain form
55585 78114 79136 79988 80486 81717 83916 85435 85006 83488 82185 80977 79455 78358 78340 78551 78002 77324
55569 77324 77719 79090 80539 81872 83403 85076 86833 88925 90894 91210 89018 85290 81338 77240 72713
55554 72713 68331 64747 61830 59712 59514 61783 65232 68333 71214 74754 78761 82340 85334 88115 90660
55539 90660 92914 95377 98326 101166 103489 105985 109379 113286 116983 120443 123686 126043 127041 127183 127049
55524 127049 126524 125640 125024 124645 123366 120685 117696 115276 112663 108923 104474 99816 94146 86825 79054
55509 79054 72401 66666 60940 55891 53114 52737 53337 53890 54309 54467 54102 53476 52844 51556 48828 45104
55493 45104 41616 38973 37073 35848 35045 33880 31982 30157 29204 28599 27410 25826 24643 23887 23226 23132
55477 23132 24303 26309 28080 29396 30772 32183 33082 33459 33854 34479 35144 35720 35951 35320 33924 32837
$$ packed form
55585G8114J022Q52M98J231K199J519m29j518j303j208j522j097j8K11n49o78
55569G7324L95J371J449J333J531J673J757K092J969L16k192l728l952m098m527
55554G2713m382l584k917k118j98K269L449L101K881L540M007L579K994K781K545
55539I0660K254K463K949K840K323K496L394L907L697L460L243K357R98J42j34
55524A27049n25q84o16l79j279k681k989k420k613l740m449m658n670p321p771
55509G9054o653n735n726n049k777l77O00N53M19J58l65o26o32j288k728l724
55493D5104l488k643j900j225q03j165j898j825r53o05j189j584j183p56o61r4
55477B3132J171K006J771J316J376J411Q99L77L95O25O65N76K31o31j396j087
$$ plain form
55461 32837 32733 32793 32002 30780 30176 30066 29478 28302 27374 27105 27135 27237 27576 28188 28993 30122 31521 32591
55443 32591 32915 32954 33324 33921 34401 34894 35457 35503 34650 33561 33070 33060 32987 32817 32658 32240 31685 31928 33367 34961
55423 34961 35709 36100 36900 37429 36629 35097 34489 35290 36617 37880 39155 40172 40376 39981 39854 40368 41298
55406 41298 42578 44193 45635 46448 46958 47592 47931 47431 46532 45929 45271 43775 41689 39964 38887 38140 37787
55389 37787 37975 38078 37354 36094 34997 33865 32184 30470 29677 29626 29374 28846 28689 28830 28604 28120 28106 28478
55371 28478 28408 27705 26783 25419 22945 19720 17033 15481 14596 14100 14248 14930 15639 16409 17617 18888 19402
55354 19402 19261 19344 19716 19567 18810 18439 18974 19762 20171 20410 20798 21164 21357 21529 21660 21544 21390 21716 22543
55335 22543 23428 24294 25473 26916 28158 29045 29746 30110 29797 28964 28121 27455 26911 26616 26513 26034 25083 24746
$$ packed form
55461C2837j04O0p91j222o04j10n88j176r28k69L0J02L39O12Q05J129J399J070
55443C2591L24L9L70N97M80M93N63M6q53j089m91j0p3j70j59m18n55K43J439J594
55423C4961P48L91Q00N29q00j532o08Q01J327J263J275J017K04l95j27N14R30
55406D1298J280J615J442Q13N10O34L39n00q99o03o58j496k086j725j077p47l53
55389C7787J88J03p24j260j097j132j681j714p93n1k52n28j57J41k26m84j4L72
55371B8478p0p03r22j364k474l225k687j552q85m96J48O82P09P70J208J271N14
55354A9402j41Q3L72j49p57l71N35P88M09K39L88L66J93J72J31j16j54L26Q27
55335B2543Q85Q66J179J443J242Q87P01L64l13q33q43o66n44k95j03m79r51l37
$$ plain form
55317 24746 25904 27618 28169 27340 26337 25811 25418 25202 25790 27109 28204 28551 28403 27846 26727 25504 24938
55300 24938 24933 24871 25009 26150 27951 29036 28943 28480 28035 27052 25505 24354 24023 23780 23134 22562 22332 21900 21062
55281 21062 20585 21002 21804 22333 22537 22469 22121 22129 23478 25934 27896 28393 28235 28590 29489 30356 31010 31394 31172
55262 31172 30422 30008 30571 31699 32640 33220 33640 34003 34469 35221 35932 35895 34996 33829 32610 30855 28505 26488
55244 26488 25624 25661 25840 25733 25208 24304 23586 23873 25174 26539 27271 27598 27881 28013 27998 28261 28905 29381 29423
55225 29423 29572 30316 31344 32164 32814 33510 34129 34527 34853 35149 35116 34615 33929 33358 33069 33373 34402 35325 34857
55206 34857 32959 31275 31363 33119 35320 37068 38184 38788 39117 39492 40039 40535 40651 40183 39163 38057 37646
55189 37646 38185 38912 38950 38328 37482 36286 34573 33109 32754 32952 32431 31277 30798 31330 31851 31947 32424 33458
$$ packed form
55317B4746J158J714N51q29j003n26l93k16N88J319J095L47j48n57j119j223n66
55300B4938no2J38J141J801J085r3m63m45r83j547j151l31k43o46n72k30m32q38
55281B1062m77M17Q02N29K04o8l48QJ349K456J962M97j58L55Q99Q67O54L84k22
55262C1172p50m14N63J128R41N80M20L63M66P52P11l7q99j167j219j755k350k017
55244B6488q64L7J79j07n25r04p18K87J301J365P32L27K83J32j5K63O44M76M2
55225B9423J49P44J028Q20O50O96O19L98L26K96l3n01o86n71k89L04J029R23m68
55206C4857j898j684Q8J756K201J748J116O04L29L75N47M96J16m68j020j106m11
55189C7646N39P27L8o22q46j196j713j464l55J98n21j154m79N32N21R6M77J034
$$ plain form
55171 33458 33884 33142 32406 32774 33664 34110 34516 35846 37844 39269 39446 38740 37801 37018 36385 35449 33799 31796
55153 31796 30326 29789 30064 31379 34033 37093 38717 38230 36777 35487 34351 33368 33304 34395 35632 36339
55137 36339 37306 39308 41664 43404 44834 46765 49108 51462 54231 57846 61591 64546 67092 70189 73523
55122 73523 75654 75794 74377 72112 69479 66987 64981 63227 61343 59479 57985 56780 55566 54325 53046
55107 53046 51493 49803 48751 48685 48748 47964 46584 45632 45535 45940 46514 47207 48077 49447 51779 54875 57731
55090 57731 59699 61127 62376 63095 63177 63475 64583 65731 66044 66100 67003 68499 69363 69327 69244 69571 69890 69943 70016
55071 70016 70305 70765 71549 72718 73660 73725 73288 73301 73897 74385 74567 75049 76193 77619 78867 79746 79934 79078
55053 79078 77484 76037 75206 74672 74051 73452 73191 73464 74406 76054 78125 80175 81968 83432 84341 84400 83589
$$ packed form
55171C3458M26p42p36L68Q90M46M06J330J998J425J77p06r39p83o33r36j650k003
55153C1796j470n37K75J315K654L060J624m87j453j290j136r83o4J091J237P07
55137C6339R67K002K356J740J430J931K343K354K769L615L745K955K546L097L334
55122G3523K131J40j417k265k633k492k006j754j884j864j494j205j214j241j279
55107E3046j553j690j052o6O3p84j380r52r7M05N74O93Q70J370K332L096K856
55090E7731J968J428J249P19Q2K98J108J148L13N6R03J496Q64l6q3L27L19N3P3
55071G0016K89M60P84J169R42O5m37J3N96M88J82M82J144J426J248Q79J88q56
55053G9078j594j447q31n34o21n99k61K73R42J648K071K050J793J464R09N9q11
$$ plain form
55036 83589 82144 80323 78454 76999 76228 75978 75926 75836 75475 74772 74323 75086 77137 79284 80401 80599 80564 80392
55018 80392 79818 79101 78769 78705 78181 76765 74677 72441 70573 69335 68445 67368 66136 65329 64945 64137 62587
55001 62587 61242 60854 60669 59621 58166 57677 58460 59592 60516 61532 62697 63419 63391 63090 63072 63357 63678 63872
54983 63872 63951 64127 64709 65666 66583 67365 68535 70393 72407 73967 75284 76828 78418 79664 80896 82815
54967 82815 85546 88816 92717 97437 102596 107711 113156 119804 127861 136801 146235 156124 166408 177195
54953 177195 189077 202447 216677 230643 243722 255489 264769 269943 270144 265470 256354 243579 228687
54940 228687 213462 198928 185277 172347 159650 146595 133681 122835 115457 110563 105982 100991
54928 100991 96584 93480 91332 89810 89120 89250 89828 90839 92539 94606 96376 97906 99951 102977 107187
$$ packed form
55036H3589j445j821j869j455p71k50n2r0l61p03m49P63K051K147J117J98l5j72
55018H0392n74p17l32o4n24j416k088k236j868j238q90j077j232q07l84q08j550
55001F2587j345l88j85j048j455m89P83J132R24J016J165P22k8l01j8K85L21J94
54983F3872P9J76N82R57R17P82J170J858K014J560J317J544J590J246J232J919
54967H2815K731L270L901M720N159N115N445O648Q057Q940R434R889J0284J0787
54953A77195J1882J3370J4230J3966J3079J1767R280N174K01m674r116j2775j4892
54940B28687j5225j4534j3651j2930j2697j3055j2914j0846p378m894m581m991
54928A00991m407l104k148j522o90J30N78J011J700K067J770J530K045L026M210
$$ plain form
54913 107187 113231 121725 132227 143810 156507 170865 186188 200664 213269 224041 232383 236720
54901 236720 236345 232159 225073 215076 202565 189167 176249 163622 150658 137862 126505 117318 110244
54888 110244 104875 100512 96348 92110 88193 84920 82222 80119 78701 77463 75599 73251 71513 70875
54874 70875 70593 70000 69350 68907 68302 67456 67089 67478 67623 66563 64758 63242 62114 60831 59429 58380 57535
54857 57535 56195 54189 52160 50844 50566 51306 52730 54282 55548 56437 56809 56339 55048 53566 52484 51806
54841 51806 51349 51194 51311 51173 50286 48889 47777 47620 48667 50726 53053 54645 55088 55007 55402 56734 58767
54824 58767 60967 62837 64179 65212 66221 67054 67351 67231 67234 67582 68079 68790 70086 71908 73815 76036 79590
54807 79590 84850 90793 96359 101957 108912 117869 128437 140082 152672 166222 180588 195354 209768
$$ packed form
54913A07187O044Q494J0502J1583J2697J4358J5323J4476J2605J0772Q342M337
54901B36720l75m186p086r997j2511j3398j2918j2627j2964j2796j1357r187p074
54888A10244n369m363m164m238l917l273k698k103j418j238j864k348j738o38
54874G0875k82n93o50m43o05q46l67L89J45j060j805j516j128j283j402j049q45
54857E7535j340k006k029j316k78P40J424J552J266Q89L72m70j291j482j082o78
54841E1806m57j55J17j38q87j397j112j57J047K059K327J592M43q1L95J332K033
54824E8767K200J870J342J033J009Q33K97j20LL48M97P11J296J822J907K221L554
54807G9590N260N943N566N598O955Q957J0568J1645J2590J3550J4366J4766J4414
$$ plain form
54794 209768 222981 234534 244269 251540 255050 253901 248502 240025 229402 217269 204507 192113 180584
54781 180584 169909 160203 151973 145652 141007 137145 133145 128806 124730 121540 119216 117431 116259 116037
54767 116037 116710 117948 119909 123170 127764 132951 138164 143652 150029 157764 167294 178975 192614 207521
54753 207521 223249 239783 256792 273179 287518 298395 304359 304452 299178 290260 279043 265717 250333
54740 250333 233762 217181 201292 186537 173352 161650 150640 139829 129736 121180 114327 108906
54728 108906 104779 101697 99065 96554 94493 93109 91906 90456 89256 89010 89426 89516 88864 87847 86793
54713 86793 85630 84376 83353 82816 82766 83115 83706 84266 84620 84971 85724 87113 88988 90774 91661 91277 90250
54696 90250 89610 89495 89061 87839 86447 85587 85117 84701 84689 85533 86803 87615 87831 88128 89010 90333 91678 92689
$$ packed form
54794B09768J3213J1553R735P271L510j149n399q477j0623j2133j2762j2394j1529
54781A80584j0675r706q230o321m645l862m000m339m076l190k324j785j172k22
54767A16037O73J238J961L261M594N187N213N488O377P735R530J1681J3639J4907
54753B07521J5728J6534J7009J6387J4339J0877N964R3n274q918j1217j3326j5384
54740B50333j6571j6581j5889j4755j3185j1702j1010j0811j0093q556o853n421
54728A08906m127l082k632k511k061j384j203j450j200k46M16R0o52j017j054
54713H6793j163j254j023n37n0L49N91N60L54L51P53J389J875J786Q87l84j027
54696I0250o40j15m34j222j392q60m70m16j2Q44J270Q12K16K97Q82J323J345J011
$$ plain form
54678 92689 93121 93009 92769 92917 93797 95674 98645 102218 105461 107962 110202 112591 114708 116060 117143 119065
54662 119065 122337 126574 131092 135291 138721 141423 144056 147197 150638 153719 156095 157797 158942 159970
54648 159970 161843 165317 170076 175084 179730 184250 189201 194898 201189 207421 212829 217228 220905 223505
54634 223505 223554 219845 212978 204855 196774 188629 179790 170112 160090 150598 142498 136061 130734 125776
54620 125776 121020 116708 112835 109222 106078 104036 103572 104693 107044 109967 112645 114609 116067 117453
54606 117453 118814 119922 120728 121350 121781 121918 121659 120634 118189 114103 109146 104548 101051 98747 97475
54591 97475 96892 96395 95485 94093 92303 90077 87588 85419 83919 82674 81064 79052 76939 74753 72448
54576 72448 70378 68910 67816 66669 65596 64945 64503 63817 63154 63307 64393 65595 66183 66158 65755 64926 63572
$$ packed form
54678I2689M32j12k40J48Q80J877K971L573L243K501K240K389K117J352J083J922
54662A19065L272M237M518M199L430K702K633L141L441L081K376J702J145J028
54648A59970J873L474M759N008M646M520M951N697O291O232N408M399L677K600
54634B23505M9l709o867q123q081q145q839r678j0022r492q100o437n327m958
54620A25776m756m312l873l613l144k042m64J121K351K923K678J964J458J386
54606A17453J361J108Q06O22M31J37k59j025k445m086m957m598l497k304j272
54591I7475n83m97r10j392j790k226k489k169j500j245j610k012k113k186k305
54576G2448k070j468j094j147j073o51m42o86o63J53J086J202N88k5m03q29j354
$$ plain form
54559 63572 61856 60094 58722 58406 59713 62435 65493 67670 68388 67894 67024 66723 67451 68974 70808 72740
54543 72740 74769 76838 78891 80979 83008 84697 86124 88023 91063 95044 99204 103136 106929 110612
54529 110612 113949 116706 118678 119567 119151 117491 114713 110887 106499 102646 100168 98699 97061 94501 91138
54514 91138 87427 83761 80526 78020 76264 75097 74350 73719 72785 71549 70666 70743 71594 72528 73084 73170 72884
54497 72884 72627 72923 73684 74160 74100 74355 75564 76821 76671 75073 73398 72664 72747 73224 73955 74715 75146 75307
54479 75307 75613 76148 76620 76976 77447 78013 78515 79178 80243 81141 80960 79819 78921 79053 79816 80535 81037 81177
54461 81177 80486 78902 77317 76754 77233 77827 77670 76655 75392 74679 74887 75726 76615 77130 76931 75672 73526
54444 73526 71547 70867 71525 72584 73268 73405 72937 71747 70045 68286 66652 65145 64161 64255 65223 66096 66262
$$ packed form
54559F3572j716j762j372l16J307K722L058K177P18m94q70l01P28J523J834J932
54543G2740K029K069K053K088K029J689J427J899L040L981M160L932L793L683
54529A10612L337K757J972Q89m16j660k778l826m388l853k478j469j638k560l363
54514I1138l711l666l235k506j756j167p47o31r34j236q83P7Q51R34N56Q6k86
54497G2884k57K96P61M76o0K55J209J257j50j598j675p34Q3M77P31P60M31J61
54479G5307L06N35M72L56M71N66N02O63J065Q98j81j141q98J32P63P19N02J40
54461H1177o91j584j585n63M79N94j57j015j263p13K08Q39Q89N15j99j259k146
54444G3526j979o80O58J059O84J37m68j190j702j759j634j507r84R4R68Q73J66
$$ plain form
54427 66262 66077 66214 66877 67749 68301 68099 67274 66667 67041 68200 69410 70455 71644 72959 74033 74951 76160
54410 76160 77549 78468 78812 79217 80019 80938 82043 84078 87359 91134 94545 97517 100316 103004 105822 109376
54394 109376 113766 118112 121573 124327 126950 129339 130908 131430 131023 129638 127259 124378 121600 118831 115424
54379 115424 111177 106733 102969 100287 98532 97258 96029 94690 93436 92547 92041 91585 90767 89457 87963
54364 87963 86774 86079 85643 85202 84771 84427 84118 83923 84191 85040 86043 86804 87512 88474 89448 90100 90770 92030
54346 92030 93713 95229 96704 98899 102002 105368 108554 111724 114909 117787 120463 123545 127051 129987
54332 129987 131443 131409 130236 128026 125016 121824 118757 115420 111532 107588 104218 101297 98185 94504 90281
54317 90281 85713 81172 77206 74215 72258 71205 70656 69791 67967 65608 63804 62855 61955 60571 59267
$$ packed form
54427F6262j85J37O63Q72N52k02q25o07L74J159J210J045J189J315J074R18J209
54410G6160J389R19L44M05Q02R19J105K035L281L775L411K972K799K688K818L554
54394A09376M390M346L461K754K623K389J569N22m07j385k379k881k778k769l407
54379A15424m247m444l764k682j755j274j229j339j254q89n06m56q18j310j494
54364H7963j189o95m36m41m31l44l09j95K68Q49J003P61P08R62R74O52O70J260
54346I2030J683J516J475K195L103L366L186L170L185K878K676L082L506K936
54332A29987J456l4j173k210l010l192l067l337l888l944l370k921l112l681m223
54317I0281m568m541l966k991j957j053n49q65j824k359j804r49r00j384j304
$$ plain form
54302 59267 58615 58146 57104 55722 54947 55126 55585 55406 54206 52309 50469 49257 48593 48105 47878 48343 49365
54285 49365 50143 50241 50075 50080 50110 50033 50248 51114 52412 53795 55246 56677 57721 58402 59407 61120 62887 63811
54267 63811 63826 63481 63127 62818 62589 62364 62019 61874 62526 63801 64588 64255 63512 63220 63170 62832 62552 62940 63656
54248 63656 63961 64093 64875 66137 66753 66358 65958 66561 68015 69472 70309 70302 69497 68251 67045 66033 65048 64063
54230 64063 63313 62911 62650 62157 61101 59383 57498 56412 56600 57309 57294 56277 55232 55261 56560 58484 60214
54213 60214 61303 61846 62137 62124 61453 60238 59352 59488 60230 60556 60040 59020 57856 56706 55916 55897 56480 56986
54195 56986 57124 57332 58035 59018 59816 60346 60809 61157 61016 60123 58657 57095 55868 55277 55588 56895 58732
54178 58732 60106 60296 59544 58649 58027 57571 57224 57064 56857 56307 55867 56467 58057 59196 58644 56761 54822
$$ packed form
54302E9267o52m69j042j382p75J79M59j79j200j897j840j212o64m88k27M65J022
54285D9365P78R8j66NL0p7K15Q66J298J383J451J431J044O81J005J713J767R24
54267F3811J5l45l54l09k29k25l45j45O52J275P87l33p43k92n0l38k80L88P16
54248F3656L05J32P82J262O16l95m00O03J454J457Q37pq05j246j206j012r85r85
54230F4063p50m02k61m93j056j718j885j086J88P09j5j017j045K9J299J924J730
54213F0214J089N43K91j3o71j215q86J36P42L26n16j020j164j150p90j9N83N06
54195E6986J38K08P03R83P98N30M63L48j41q93j466j562j227n91L11J307J837
54178E8732J374J90p52q95o22m56l47j60k07n50m40O00J590J139n52j883j939
$$ plain form
54161 54822 53536 52907 52946 53681 54747 55727 56771 58201 59683 60434 60193 59443 58759 58376 58345 58683 59337 60319
54143 60319 61696 63246 64405 64889 64983 64882 64179 62564 60614 59255 58698 58567 58818 59742 61166 62402 63082
54126 63082 63429 63615 63384 62453 60926 59184 57719 57047 57384 58268 58829 58525 57531 56455 55808 55635 55584 55467
54108 55467 55702 56795 58285 58819 57650 55542 53845 53173 53402 54327 55593 56473 56576 56495 57035 58001 58531
54091 58531 58421 58305 58564 58848 58803 58571 58376 58111 57560 56743 55956 55636 56073 57031 57839 58082 57844 57069 55279
54072 55279 52500 49938 48902 49369 50324 51225 52264 53398 54104 54185 54082 54221 54631 55267 56190 57352 58640
54055 58640 60102 61722 63166 64240 65350 66884 68384 69047 68893 68760 69269 70483 72374 74780 77001
54040 77001 78373 79216 80434 82174 83791 85192 87149 90039 93225 96135 99191 103145 108087 113536 119061
$$ packed form
54161E4822j286o29L9P35J066R80J044J430J482P51k41p50o84l83l1L38O54R82
54143F0319J377J550J159M84R4j01p03j615j950j359n57j31K51R24J424J236O80
54126F3082L47J86k31r31j527j742j465o72L37Q84N61l04r94j076o47j73n1j17
54108E5467K35J093J490N34j169k108j697o72K29R25J266Q80J03q1N40R66N30
54091E8531j10j16K59K84m5k32j95k65n51q17p87l20M37R58Q08K43k38p75j790
54072E5279k779k562j036M67R55R01J039J134P06Q1j03J39M10O36R23J162J288
54055E8640J462J620J444J074J110J534J500O63j54j33N09J214J891K406K221
54040G7001J372Q43J218J740J617J401J957K890L186K910L056L954M942N449N525
$$ plain form
54025 119061 124464 129755 135186 140982 146820 152062 156608 161095 166078 171438 176663 181261 184779 186974
54011 186974 188104 188672 188861 188656 188399 188528 188717 187965 185716 182364 178544 174544 170538 166777 163296 159939
53995 159939 156740 153838 151035 148063 145195 142815 140475 137407 134060 131941 131491 131221 129648 127144 125038
53980 125038 123633 122162 120300 118701 118029 118174 118488 118371 117654 116707 116143 116199 116534 116699 116597 116378 116187 116172
53962 116172 116389 116612 116567 116500 117108 118771 121261 124253 127541 130628 132784 133908 134814 136289 138362 140830
53946 140830 143824 147298 150491 152708 154442 156989 160952 165686 170305 174753 179698 185541 191798 197420
53932 197420 201625 204268 205447 205079 203193 200374 197419 194571 191492 188031 184587 181749 180001 179722 180960
53917 180960 183141 185521 187991 190939 194294 197420 200082 202880 206476 210991 216415 222927 230370 237946
$$ packed form
54025A19061N403N291N431N796N838N242M546M487M983N360N225M598L518K195
54011A86974J130N68J89k05k57J29J89p52k249l352l820m000m006l761l481l357
53995A59939l199k902k803k972k868k380k340l068l347k119m50k70j573k504k106
53980A25038j405j471j862j599o72J45L14j17p17r47n64N6L35J65j02k19j91j5
53962A16172K17K23m5o7O08J663K490K992L288L087K156J124R06J475K073K468
53946A40830K994L474L193K217J734K547L963M734M619M448M945N843O257N622
53932A97420M205K643J179l68j886k819k955k848l079l461l444k838j748k79J238
53917A80960K181K380K470K948L355L126K662K798L596M515N424O512P443P576
$$ plain form
53903 237946 244868 250870 255776 259097 260617 260970 261128 261474 261707 261396 260343 258692 256961 255663 254672 253264
53887 253264 250977 248058 244825 241039 236255 230441 223910 216966 209956 203365 197485 192124 186868 181470
53873 181470 175936 170596 166122 163013 160810 158315 154801 150630 146472 142472 138489 134667 131329 128588
53859 128588 126416 124806 123539 122096 120131 117844 115742 114221 113441 113197 112836 111694 109747 107462 105101
53844 105101 102731 100844 100073 100090 99641 98096 96239 95065 94599 94350 94195 94093 93582 92353 90921 89992 89567
53827 89567 89268 89189 89669 90528 91180 91392 91355 91230 91108 91261 91931 92975 94074 95080 95914 96478 96998 98044
53809 98044 99775 101621 103117 104604 106560 108715 110459 111784 113197 114978 117158 119919 123425 127457
53795 127457 131762 136506 141777 146925 151145 154525 157876 161556 165135 168203 170930 173742 176832 180097
$$ packed form
53903B37946O922O002M906L321J520L53J58L46K33l11j053j651j731j298r91j408
53887B53264k287k919l233l786m784n814o531o944p010o591n880n361n256n398
53873A81470n534n340m474l109k203k495l514m171m158m000l983l822l338k741
53859A28588k172j610j267j443j965k287k102j521p80k44l61j142j947k285k361
53844A05101k370j887p71J7m49j545j857j174m66k49j55j02n11j229j432r29m25
53827H9567k99p9M80Q59O52K12l7j25j22J53O70J044J099J006Q34N64N20J046
53809I8044J731J846J496J487J956K155J744J325J413J781K180K761L506M032
53795A27457M305M744N271N148M220L380L351L680L579L068K727K812L090L265
$$ plain form
53781 180097 183253 186001 188243 189985 190938 190631 189200 187612 186658 186057 185018 183272 181078 178646 176175
53766 176175 174102 172604 171124 168994 166331 163663 160990 157942 154720 152020 150080 148485 146958 145631
53752 145631 144496 143226 141702 140189 138868 137641 136442 135328 134226 133019 131918 131338 131359 131695 132142
53737 132142 132715 133360 133932 134424 134918 135426 136013 136825 137598 137496 136052 134051 132783 132480 132173 131090 129553
53720 129553 128359 127841 127760 127726 127528 127305 127412 127897 128239 127998 127515 127530 128198 129065 129928 131115 132793 134593
53702 134593 136111 137412 138826 140518 142414 144347 146265 148404 151152 154515 157945 160938 163595 166233
53688 166233 168827 171303 174036 177403 180998 184050 186596 189507 193288 197474 201408 204947 208196 211113
53674 211113 213714 216278 218930 221224 222416 222108 220591 218606 216768 215051 212949 210267 207515 205293
$$ packed form
53781A80097L156K748K242J742R53l07j431j588r54o01j039j746k194k432k471
53766A76175k073j498j480k130k663k668k673l048l222k700j940j595j527j327
53752A45631j135j270j524j513j321j227j199j114j102j207j101n80K1L36M47
53737A32142N73O45N72M92M94N08N87Q12P73j02j444k001j268l03l07j083j537
53720A29553j194n18q1l4j98k23J07M85L42k41m83J5O68Q67Q63J187J678J800
53702A34593J518J301J414J692J896J933J918K139K748L363L430K993K657K638
53688A66233K594K476K733L367L595L052K546K911L781M186L934L539L249K917
53674B11113K601K564K652K294J192l08j517j985j838j717k102k682k752k222
$$ plain form
53660 205293 203563 201891 200136 198411 196580 194452 192390 191107 190728 190511 189683 188163 186433 184979 183991
53645 183991 183368 182943 182738 182834 182890 182194 180551 178756 177750 177571 177608 177569 177638 177983 178742 180183 182184 183844
53627 183844 184418 184454 185144 186667 188124 189105 190235 191976 193870 195420 196882 198660 200598 202423 204297
53612 204297 206387 208371 209967 211623 214082 217412 220940 224157 227309 231055 235744 241105 246618 252047
53598 252047 257462 262711 267297 271026 274429 278101 281951 285623 289396 293913 299129 304243 308705 312636
53584 312636 316209 319354 322249 325397 328895 332218 335010 337616 340494 343583 346585 349494 352472 355445
53570 355445 358071 360024 361245 362101 363234 364941 366782 368146 369068 370019 371081 372037 373157 375100 377799
53555 377799 380214 381579 382322 383404 385195 387368 389468 391200 392547 393855 395572 397696 399780 401599
$$ packed form
53660B05293j730j672j755j725j831k128k062j283l79k17q28j520j730j454r88
53645A83991o23m25k05R6N6o96j643j795j006j79L7l9O9L45P59J441K001J660
53627A83844N74L6O90J523J457R81J130J741J894J550J462J778J938J825J874
53612B04297K090J984J596J656K459L330L528L217L152L746M689N361N513N429
53598B52047N415N249M586L729L403L672L850L672L773M517N216N114M462L931
53584C12636L573L145K895L148L498L323K792K606K878L089L002K909K978K973
53570C55445K626J953J221Q56J133J707J841J364R22R51J062R56J120J943K699
53555C77799K415J365P43J082J791K173K100J732J347J308J717K124K084J819
$$ plain form
53541 401599 403439 405570 407848 410007 411981 413793 415484 417238 419166 420878 421807 422050 422368 423187 424231
53526 424231 425356 427049 429704 433006 436522 440393 444937 450033 455524 461915 469922 479342 489001 497962
53512 497962 506558 516085 527674 541457 556677 572458 588457 604866 622003 640056 659036 678770
53500 678770 699042 719944 741904 765098 789090 813408 838281 864403 892123 921260 951442
53489 951442 982134 1012544 1042071 1070732 1098689 1125719 1151745 1177590 1204298 1231893 1259557
53478 1259557 1286799 1313528 1339297 1363703 1387472 1411868 1436884 1461268 1484559 1507689 1531083
53467 1531083 1553593 1574088 1592864 1610557 1626754 1640773 1652958 1664002 1673652 1681242 1687066 1692125
53455 1692125 1696659 1699832 1700689 1698703 1693611 1685498 1674911 1662302 1647612 1630902 1613004 1594759 1575869
$$ packed form
53541D01599J840K131K278K159J974J812J691J754J928J712R29K43L18Q19J044
53526D24231J125J693K655L302L516L871M544N096N491O391Q007R420R659Q961
53512D97962Q596R527J1589J3783J5220J5781J5999J6409J7137J8053J8980J9734
53500F78770K0272K0902K1960K3194K3992K4318K4873K6122K7720K9137L0182
53489I51442L0692L0410K9527K8661K7957K7030K6026K5845K6708K7595K7664
53478A259557K7242K6729K5769K4406K3769K4396K5016K4384K3291K3130K3394
53467A531083K2510K0495J8776J7693J6197J4019J2185J1044R650P590N824N059
53455A692125M534L173Q57j986n092q113j0587j2609j4690j6710j7898j8245j8890
$$ plain form
53442 1575869 1555258 1532434 1507891 1482305 1456049 1429466 1402962 1376634 1350180 1323183 1295325
53431 1295325 1266552 1237417 1209008 1182192 1156989 1132996 1110162 1088852 1069378 1051751 1035662
53420 1035662 1020583 1006231 993110 982103 973331 966052 959959 955765 953975 953856 954420 955820 958853
53407 958853 963549 969262 975998 984668 996064 1010244 1026848 1045372 1065181 1085907 1107867 1131592
53395 1131592 1157092 1184044 1212481 1242711 1274758 1308553 1344524 1383258 1424612 1467767 1512140
53384 1512140 1557696 1604518 1652744 1702881 1755387 1809830 1865076 1920520 1976630 2034065 2092746
53373 2092746 2152025 2211343 2270410 2328942 2386496 2442582 2496908 2549486 2600268 2648560 2693125
53362 2693125 2733132 2768678 2800140 2827408 2850223 2868787 2883397 2893637 2898639 2898154 2892850 2883603
$$ packed form
53442A575869k0611k2824k4543k5586k6256k6583k6504k6328k6454k6997k7858
53431A295325k8773k9135k8409k6816k5203k3993k2834k1310j9474j7627j6089
53420A035662j5079j4352j3121j1007q772p279o093m194j790j19N64J400L033
53407I58853M696N713O736Q670J1396J4180J6604J8524J9809K0726K1960K3725
53395A131592K5500K6952K8437L0230L2047L3795L5971L8734M1354M3155M4373
53384A512140M5556M6822M8226N0137N2506N4443N5246N5444N6110N7435N8681
53373B092746N9279N9318N9067N8532N7554N6086N4326N2578N0782M8292M4565
53362B693125M0007L5546L1462K7268K2815J8564J4610J0240N002m85n304r247
$$ plain form
53350 2883603 2870863 2854628 2834548 2810136 2781330 2748760 2713063 2674001 2630692 2582648 2530233
53339 2530233 2474329 2416073 2356777 2297565 2239060 2181744 2126362 2073425 2022456 1972341 1922457
53328 1922457 1873042 1824591 1777465 1731921 1687870 1644603 1601475 1558957 1518443 1480873 1446062
53317 1446062 1413536 1383369 1355907 1331214 1309153 1289673 1272581 1257194 1242537 1227884 1213054
53306 1213054 1198311 1184187 1171372 1160622 1152525 1147139 1143836 1141774 1140557 1140299 1141103 1142940 1146061
53293 1146061 1150913 1157378 1164705 1172531 1181446 1192062 1204103 1216989 1230782 1245915 1262473 1280504
53281 1280504 1300580 1323150 1347688 1373334 1400147 1428693 1458564 1488315 1516918 1544385 1570872
53270 1570872 1596158 1620195 1643265 1665211 1685249 1702957 1718806 1733352 1746433 1757522 1766404
$$ packed form
53350B883603j2740j6235k0080k4412k8806l2570l5697l9062m3309m8044n2415
53339B530233n5904n8256n9296n9212n8505n7316n5382n2937n0969n0115m9884
53328A922457m9415m8451m7126m5544m4051m3267m3128m2518m0514l7570l4811
53317A446062l2526l0167k7462k4693k2061j9480j7092j5387j4657j4653j4830
53306A213054j4743j4124j2815j0750q097n386l303k062j217k58Q04J837L121
53293A146061M852O465P327P826Q915J0616J2041J2886J3793J5133J6558J8031
53281A280504K0076K2570K4538K5646K6813K8546K9871K9751K8603K7467K6487
53270A570872K5286K4037K3070K1946K0038J7708J5849J4546J3081J1089Q882
$$ plain form
53259 1766404 1773151 1777816 1780484 1781350 1780506 1777821 1773080 1766054 1756574 1744881 1731736 1717676 1702270
53246 1702270 1684659 1664672 1642837 1619412 1594292 1567880 1541171 1514627 1487680 1459655 1430684
53235 1430684 1401476 1372783 1345331 1319598 1295282 1271431 1247451 1223582 1200282 1177652 1155725
53224 1155725 1134707 1114655 1095355 1076758 1059100 1042392 1026396 1011245 997375 984532 971645
53213 971645 958294 945596 934913 926138 917973 909547 900899 892019 882317 871306 859243 846734 833976
53200 833976 820673 806609 792043 777497 763226 749078 734914 720948 707519 694660 682177
53189 682177 669926 657688 644889 630913 615710 599780 583663 567746 552368 537583 522860
53178 522860 507611 492001 476704 461923 447299 432855 419270 407060 396062 385914 376354 366925
$$ packed form
53259A766404O747M665K668Q66q44k685m741p026r480j1693j3145j4060j5406
53246A702270j7611j9987k1835k3425k5120k6412k6709k6544k6947k8025k8971
53235A430684k9208k8693k7452k5733k4316k3851k3980k3869k3300k2630k1927
53224A155725k1018k0052j9300j8597j7658j6708j5996j5151j3870j2843j2887
53213I71645j3351j2698j0683q775q165q426q648q880r702j1011j2063j2509j2758
53200H33976j3303j4064j4566j4546j4271j4148j4164j3966j3429j2859j2483
53189F82177j2251j2238j2799j3976j5203j5930j6117j5917j5378j4785j4723
53178E22860j5249j5610j5297j4781j4624j4444j3585j2210j0998j0148r560r429
$$ plain form
53166 366925 357174 347520 339150 332551 326739 320440 313482 306534 300042 294014 288350 282735 276623 269967
53152 269967 263636 258500 254368 250466 246632 243323 240602 237966 235196 232707 230877 229584 228633 228111 228017
53137 228017 227915 227326 226340 225530 225303 225564 226066 226853 228179 230082 232317 234782 237643 240805 243602 245386
53121 245386 246269 246813 247150 246974 246305 245529 244558 242656 239404 235330 231188 227088 222705 217975 213149 208481
53105 208481 204185 200427 197041 193554 189816 186227 183019 179737 175937 172031 168845 166527 164504 162468
53091 162468 160789 159859 159445 158926 157866 156226 154237 152236 150489 149039 147789 146762 146164 146068 146084 145525
53075 145525 144096 142349 141225 141038 141194 141028 140552 140065 139468 138533 137533 136917 136493 135791 135188 135747 137656
53058 137656 139693 140723 140943 141095 141173 140631 139381 137769 135897 133789 132063 131602 132454 133598 133937 133083
$$ packed form
53166C66925r751r654q370o599n812o299o958o948o492o028n664n615o112o656
53152B69967o331n136m132l902l834l309k721k636k770k489j830j293r51n22r4
53137B28017j02n89r86q10k27K61N02P87J326J903K235K465K861L162K797J784
53121B45386Q83N44L37j76o69p76r71j902l252m074m142m100m383m730m826m668
53105B08481m296l758l386l487l738l589l208l282l800l906l186k318k023k036
53091A62468j679r30m14n19j060j640j989k001j747j450j250j027n98r6J6n59
53075A45525j429j747j124j87J56j66m76m87n97r35j000o16m24p02o03N59J909
53058A37656K037J030K20J52P8n42j250j612j872k108j726m61Q52J144L39q54
$$ plain form
53042 133083 131221 128724 126096 123843 122143 120830 119827 119397 119820 120882 121872 122115 121605 121041 121113 121706
53026 121706 121997 121391 120173 119099 118554 118340 118170 118138 118640 119866 121410 122477 122593 121962 120998 119776 118334
53009 118334 117248 117269 118313 119390 119715 119344 118612 117605 116569 116274 117325 119333 121232 122300 122612 122729
52993 122729 123258 124518 126285 127952 129145 130072 131214 132942 135519 139028 143060 146901 150353 154018 158402
52978 158402 163083 167145 170133 172155 173352 173786 173739 173636 173603 173387 172705 171501 169957 168420 167133 165905
52962 165905 164223 161846 159066 156225 153318 150342 147721 146027 145394 145516 146108 147011 147927 148306 147667 146078
52946 146078 144327 143393 143483 143784 143533 143052 143107 143490 143183 141938 140655 139910 139203 138263 138000 139249 141332 142954
52928 142954 143954 145095 146495 147485 147911 148482 149604 150760 151317 151253 150835 150164 149352 148662 148184 147720 147207
$$ packed form
53042A33083j862k497k628k253j700j313j003m30M23J062R90K43n10n64P2N93
53026A21706K91o06j218j074n45k14j70l2N02J226J544J067J16o31r64j222j442
53009A18334j086K1J044J077L25l71p32j007j036k95J051K008J899J068L12J17
52993A22729N29J260J767J667J193R27J142J728K577L509M032L841L452L665M384
52978A58402M681M062K988K022J197M34m7j03l3k16o82j204j544j537j287j228
52962A65905j682k377k780k841k907k976k621j694o33J22N92R03R16L79o39j589
52946A46078j751r34R0L01k51m81N5L83l07j245j283p45p07r40k63J249K083J622
52928A42954J000J141J400R90M26N71J122J156N57o4m18o71q12o90m78m64n13
$$ plain form
52911 147207 146966 147331 148262 149461 150743 152114 153590 154987 155955 156318 156354 156541 156979 157328 157342 157115 156768 156370
52893 156370 156299 157106 158702 160217 161055 161578 162315 163085 163520 163945 165003 166713 168583 170393 172188 173751
52877 173751 174758 175363 175982 176643 177156 177716 178697 179954 180985 181733 182603 183771 185091 186639 188700 191174
52861 191174 193568 195608 197364 198871 200172 201646 203675 206001 208025 209709 211504 213415 214846 215525
52847 215525 215884 216319 216709 216949 217389 218334 219474 220097 219594 217687 214617 211309 208897 207689 206788 204988
52831 204988 201986 198642 196178 195135 194966 194576 193333 191455 189405 187266 184937 182618 180654 179092 177710
52816 177710 176321 174729 172667 170170 167714 165640 163756 161938 160671 160355 160448 160044 159015 157872 156791
52801 156791 155631 154653 154289 154282 153938 153136 152163 150674 148015 144746 142585 142386 143141 143470 143132 142483 141393
$$ packed form
52911A47207k41L65R31J199J282J371J476J397R68L63L6J87M38L49J4k27l47l98
52893A56370p1Q07J596J515Q38N23P37P70M35M25J058J710J870J810J795J563
52877A73751J007O05O19O61N13N60R81J257J031P48Q70J168J320J548K061K474
52861A91174K394K040J756J507J301J474K029K326K024J684J795J911J431O79
52847B15525L59M35L90K40M40R45J140O23n03j907l070l308k412j208r01j800
52831B04988l002l344k464j043j69l90j243j878k050k139k329k319j964j562j382
52816A77710j389j592k062k497k456k074j884j818j267l16R3m04j029j143j081
52801A56791j160r78l64pl44q02r73j489k659l269k161j99P55L29l38o49j090
$$ plain form
52784 141393 139605 137619 136269 135655 135083 133927 132124 130007 128067 126722 126012 125656 125529 125806 126452 126897
52768 126897 126451 124915 122685 120537 119268 119136 119537 119551 118831 117563 115741 113102 109841 106625 103735 100887
52752 100887 98069 95849 94510 93566 92558 91690 91209 90767 89967 89011 88233 87457 86473 85741 85813 86257 85906 84225
52734 84225 81928 80132 79403 79708 80894 82820 85142 87283 88799 89760 90551 91241 91405 90788 89876 89418 89554
52717 89554 89827 89930 89933 89940 90100 90907 92813 95452 97924 99964 102204 105021 107801 109683 110483 110563 110260 109780
52699 109780 109245 108550 107520 106341 105370 104436 102956 100962 99252 98190 97050 95121 92842 91165 90296
52684 90296 89671 88826 87672 86171 84397 82763 81710 81171 80690 79939 78898 77756 76843 76416 76263 75860 75107
52667 75107 74524 74522 74855 75102 75189 75092 74517 73396 72348 72123 72775 73726 74367 74294 73329 71770 70368 69642 69367
$$ packed form
52784A41393j788j986j350o14n72j156j803k117j940j345p10l56j27K77O46M45
52768A26897m46j536k230k148j269j32M01J4p20j268j822k639l261l216k890k848
52752A00887k818k220j339r44j008q68m81m42q00r56p78p76r84p32P2M44l51j681
52734H4225k297j796p29L05J186J926K322K141J516R61P91O90J64o17r12m58J36
52717H9554K73J03LPJ60Q07J906K639K472K040K240K817K780J882Q00Q0l03m80
52699A09780n35o95j030j179r71r34j480j994j710j062j140j929k279j677q69
52684I0296o25q45j154j501j774j634j053n39m81p51j041j142r13m27j53m03p53
52667G5107n83kL33K47Q7r7n75j121j048k25O52R51O41p3r65j559j402p26k75
$$ plain form
52648 69367 69027 68468 67796 66962 65856 64633 63564 62745 62177 61955 62160 62770 63746 64965 66081 66961 68202
52631 68202 70552 73681 76328 77900 79049 80310 81136 80914 80054 79237 78357 77136 76124 75992 76223 75589
52615 75589 73780 71715 70380 70062 70522 71167 71282 70794 70580 71375 72706 73603 73962 74340 74787 74912 74924 75546
52597 75546 76925 78487 79856 81018 81711 81641 81312 81642 82667 83549 84001 84646 85800 86956 87841 88972 90669
52580 90669 92375 93552 94465 95504 96398 96757 96909 97567 98969 100789 102604 104081 105101 106022 107469 109562
52564 109562 111728 113517 115144 116921 118677 120149 121485 122891 124187 125182 126136 127381 128765 129966 131067
52549 131067 132345 133688 134728 135400 135869 135996 135423 134229 133119 132817 133490 134786 136228 137577 138958 140612
52533 140612 142444 143958 144812 145254 145774 146532 147394 148377 149641 151027 151969 152023 151277 150225 149387 149021 148899
$$ packed form
52648F9367l40n59o72q34j106j223j069q19n68k22K05O10R76J219J116Q80J241
52631F8202K350L129K647J572J149J261Q26k22q60q17q80j221j012j32K31o34
52615G5589j809k065j335l18M60O45J15m88k14P95J331Q97L59L78M47J25J2O22
52597G5546J379J562J369J162O93p0l29L30J025Q82M52O45J154J156Q85J131J697
52580I0669J706J177R13J039Q94L59J52O58J402J820J815J477J020R21J447K093
52564A09562K166J789J627J777J756J472J336J406J296R95R54J245J384J201J101
52549A31067J278J343J040O72M69J27n73j194j110l02O73J296J442J349J381J654
52533A40612J832J514Q54M42N20P58Q62R83J264J386R42N4p46j052q38l66j22
$$ plain form
52516 148899 148349 146870 144862 143439 143228 143610 143526 142838 142358 142540 142794 142384 141519 140992 141056 141295 141500 141962
52498 141962 142743 143232 142837 141758 140715 140112 139781 139466 139252 139552 140757 142860 145376 147779 149921 151817
52482 151817 153114 153284 152386 151188 150384 150150 150534 151696 153435 155079 156229 157166 158231 159369 160629 162386
52466 162386 164472 165830 165888 165653 166506 168340 169945 170927 172051 173742 175416 176511 177177 177642 177802 177775 178128
52449 178128 179123 180335 181369 182383 183557 184573 184986 184695 183822 182524 181048 179542 177758 175492 173293
52434 173293 171994 171426 170489 168802 167330 166870 166810 166148 164991 164145 163675 162838 161242 159254 157374 155866
52418 155866 154989 154946 155581 156514 157554 158584 159243 159239 158876 158718 158777 158500 157631 156629 156127 156349 157108 158086 159026
52399 159026 159901 160913 162126 163278 164209 165338 167200 169527 171385 172342 173005 174073 175325 176027 176062 176115
$$ packed form
52516A48899n50j479k008j423k11L82q4o88m80J82K54m10q65n27O4K39K05M62
52498A41962P81M89l95j079j043o03l31l15k14L00J205K103K516K403K142J896
52482A51817J297J70q98j198q04k34L84J162J739J644J150R37J065J138J260J757
52466A62386K086J358N8k35Q53J834J605R82J124J691J674J095O66M65J60k7L53
52449A78128R95J212J034J014J174J016M13k91q73j298j476j506j784k266k199
52434A73293j299n68r37j687j472m60o0o62j157q46m70q37j596j988j880j508
52418A55866q77m3O35R33J040J030O59ml63j58N9k77q69j002n02K22P59R78R40
52399A59026Q75J012J213J152R31J129J862K327J858R57O63J068J252P02L5N3
$$ plain form
52383 176115 176738 177724 178608 179419 180602 182309 184149 185706 187092 188799 191132 193996 197107 200207 203073
52368 203073 205580 207883 210328 213080 215964 218793 221613 224446 226981 228912 230534 232578 235272 237901
52354 237901 239650 240692 241953 243852 245781 247117 248215 249890 252224 254582 256691 258921 261267 262902
52340 262902 263258 263014 263374 264707 266550 268592 270899 273224 274928 275809 276412 277273 278323 279320 280469 282310
52324 282310 285126 288638 292102 294693 296085 296784 297624 298903 300269 301422 302562 304089 306265 309279 313269
52309 313269 318068 323223 328425 333707 339200 345074 351723 359548 368366 377514 386733 396475 407071 418159
52295 418159 429360 441070 453949 467876 481943 495433 508370 521162 534131 547396 560915
52284 560915 574554 588242 602021 615803 629248 642087 654470 666780 679202 691647 703917
$$ packed form
52383A76115O23R86Q84Q11J183J707J840J557J386J707K333K864L111L100K866
52368B03073K507K303K445K752K884K829K820K833K535J931J622K044K694K629
52354B37901J749J042J261J899J929J336J098J675K334K358K109K230K346J635
52340B62902L56k44L60J333J843K042K307K325J704Q81O03Q61J050R97J149J841
52324B82310K816L512L464K591J392O99Q40J279J366J153J140J527K176L014L990
52309C13269M799N155N202N282N493N874O649P825Q818R148R219R742J0596J1088
52295D18159J1201J1710J2879J3927J4067J3490J2937J2792J2969J3265J3519
52284E60915J3639J3688J3779J3782J3445J2839J2383J2310J2422J2445J2270
$$ plain form
52273 703917 715703 726553 736182 744792 752907 760851 768433 775066 780138 783552 786015 788518 791284 793456
52259 793456 794149 793589 792831 792511 792272 791407 789595 786973 783826 780407 776828 773058 769196 765729 763219 761639
52243 761639 760286 758611 757003 756594 758321 762263 767741 773877 780111 786377 792979 800308 808639 818054
52229 818054 828392 839139 849449 858499 866122 873117 880774 889807 899719 909227 917352 924011 929678
52216 929678 934721 939204 943146 946674 949791 952157 953277 953022 951755 949826 947021 942839 937258 930897
52202 930897 924237 917123 909357 901450 894218 887717 881155 873894 866055 858039 850009 842158 835069 829324
52188 829324 824884 821198 817809 814599 811564 808692 806108 804049 802611 801623 800826 800018 799005 797621 795974
52173 795974 794593 794091 794530 795204 795220 794235 792494 790235 787378 783903 780197 776770 773792 771115 768557 765937
$$ packed form
52273G03917J1786J0850R629Q610Q115P944P582O633N072L414K463K503K766K172
52259G93456O93n60p58l20k39q65j812k622l147l419l579l770l862l467k510j580
52243G61639j353j675j608m09J727L942N478O136O234O266O602P329Q331R415
52229H18054J0338J0747J0310R050P623O995P657R033R912R508Q125O659N667
52216I29678N043M483L942L528L117K366J120k55j267j929k805m182n581o361
52202I30897o660p114p766p907p232o501o562p261p839q016q030p851p089n745
52188H29324m440l686l389l210l035k872k584k059j438r88p97q08j013j384j647
52173G95974j381n02M39O74J6r85j741k259k857l475l706l427k978k677k558k620
$$ plain form
52157 765937 762968 759490 755759 752242 749122 746198 743189 739977 736672 733664 731383 729765 728098 725721
52143 725721 722702 719487 716133 712370 708224 703988 699627 694815 689668 684857 680761 676998 672964 668526
52129 668526 664067 660197 657456 655826 654371 651794 647599 642442 637271 632555 628446 625088 622463 620249
52115 620249 618213 616512 615386 614777 614410 614054 613664 613554 614403 616683 620049 623699 627359 631411 636086 641209
52099 641209 646883 653662 661728 670577 679966 690553 703097 717522 733262 750025 767695 785961
52087 785961 804599 823734 843242 862263 879986 896627 913045 929609 946054 962250 978399
52076 978399 994437 1009697 1023257 1034359 1042692 1048717 1053587 1058349 1063202 1067659 1071194 1073463 1074233
$$ packed form
52157G65937k969l478l731l517l120k924l009l212l305l008k281j618j667k377
52143G25721l019l215l354l763m146m236m361m812n147m811m096l763m034m438
52129F68526m459l870k741j630j455k577m195n157n171m716m109l358k625k214
52115F20249k036j701j126o09l67l56l90j10Q49K280L366L650L660M052M675N123
52099F41209N674O779Q066Q849R389J0587J2544J4425J5740J6763J7670J8266
52087G85961J8638J9135J9508J9021J7723J6641J6418J6564J6445J6196J6149
52076I78399J6038J5260J3560J1102Q333O025M870M762M853M457L535K269P70
$$ [...]
##END NTUPLES=NMR SPECTRUM
##END=
