
##TITLE=AC1350_CHIRS12168_7160055_efMWbtibv7
##JCAMPDX= 6.0         $$ Bruker NMR JCAMP-DX V2.0
##DATA TYPE= NMR SPECTRUM
##DATA CLASS= NTUPLES
##ORIGIN= BRUKER
##OWNER= Administrator
$$ 1.72 TOPSPIN		Version 2.1
$$ 2012-11-30 20:32:03.677 -0500  Administrator@X
$$ Compression mode = diff/dup
##.OBSERVE FREQUENCY= 400.02188249412
##.OBSERVE NUCLEUS= ^1H
##.ACQUISITION MODE= SIMULTANEOUS (DQD)
##.ACQUISITION SCHEME= undefined
##.AVERAGES= 8
##.DIGITISER RES= 22
##SPECTROMETER/DATA SYSTEM= spect
##.PULSE SEQUENCE= zg30
##.SOLVENT NAME= COFFEE_meoh
##.SHIFT REFERENCE= INTERNAL, COFFEE_meoh, 1, 14.98509
##AUDIT TRAIL= $$ (NUMBER, WHEN, WHO, WHERE, PROCESS, VERSION, WHAT)
$$ ##TITLE= Audit trail, TOPSPIN		Version 2.1
$$ ##JCAMPDX= 5.01
$$ ##ORIGIN= Bruker BioSpin GmbH
$$ ##OWNER= Administrator
$$ $$ E:\/data/COFFEE/nmr/AC1350_CHIRS12168_7160055_efMWbtibv7/10/pdata/1/auditp.txt
$$ ##AUDIT TRAIL=  $$ (NUMBER, WHEN, WHO, WHERE, PROCESS, VERSION, WHAT)
(   1,<2012-11-30 20:31:54.614 -0500>,<Administrator>,<X>,<go>,<TOPSPIN 2.1>,
      <created by zg
	started at 2012-11-30 20:30:48.916 -0500,
	POWCHK enabled, PULCHK disabled,
       configuration hash MD5:
       86 BA 57 50 F2 9D 5C 9B 26 00 A9 28 5F 66 2E 89
       data hash MD5: 64K
       46 33 95 54 CE EA 25 D4 EB A2 23 6E 8D EB 11 6F>)
(   2,<2012-11-30 20:31:58.068 -0500>,<Administrator>,<X>,<proc1d>,<TOPSPIN 2.1>,
      <Start of raw data processing
       efp LB = 0 FT_mod = 6 PKNL = 1 PHC0 = 0 PHC1 = 0 SI = 32K 
       data hash MD5: 32K
       DD FA 4E 84 20 12 A3 0E A0 D1 96 41 F5 D7 47 16>)
(   3,<2012-11-30 20:31:58.590 -0500>,<Administrator>,<X>,<proc1d>,<TOPSPIN 2.1>,
      <pk PHC0 = 95.55359 PHC1 = 0 
       data hash MD5: 32K
       83 7E CF A7 38 B0 68 84 3C 19 3E 30 4F E0 43 34>)
(   4,<2012-11-30 20:31:58.842 -0500>,<Administrator>,<X>,<proc1d>,<TOPSPIN 2.1>,
      <abs ABSG = 1 
       data hash MD5: 32K
       67 86 DB 59 0E 49 E8 64 4B CF FB 1F A6 9C ED 4C>)
(   5,<2012-11-30 20:31:59.011 -0500>,<Administrator>,<X>,<proc1d>,<TOPSPIN 2.1>,
      <abs ABSG = 2 
       data hash MD5: 32K
       73 A1 E7 2B 7F 07 3E A0 3D 90 DB 9F FE 9B F0 E5>)
(   6,<2012-11-30 20:31:59.162 -0500>,<Administrator>,<X>,<proc1d>,<TOPSPIN 2.1>,
      <abs ABSG = 3 
       data hash MD5: 32K
       B8 58 51 EC EF 49 D0 EB 5F 47 C1 C3 99 6D B6 39>)
(   7,<2012-11-30 20:31:59.314 -0500>,<Administrator>,<X>,<proc1d>,<TOPSPIN 2.1>,
      <abs ABSG = 4 
       data hash MD5: 32K
       D1 BC 7F A2 EC DE 78 BD 0F C4 F5 57 4B 50 48 41>)
(   8,<2012-11-30 20:31:59.483 -0500>,<Administrator>,<X>,<proc1d>,<TOPSPIN 2.1>,
      <abs ABSG = 5 
       data hash MD5: 32K
       6D 87 C9 41 C3 33 50 EA F9 E7 FB C5 C7 2C 81 74>)
$$ ##END=
$$ 
$$ $$ hash MD5
$$ $$ 21 C1 75 58 FA 02 C0 15 C0 1B 83 68 DC AB 9A B4
##$RELAX= 
##$RELAX= 
##$RELAX= 
##$RELAX= 
##$RELAX= 
##$RELAX= 
##$RELAX= 
$$ Bruker specific parameters
$$ --------------------------
##$DU= <E:\>
##$EXPNO= 10
##$NAME= <AC1350_CHIRS12168_7160055_efMWbtibv7>
$$ [...]
150 150 150 150 150 150 150 150
##$TP07= 0
##$TPNAME0= <>
##$TPNAME1= <>
##$TPNAME2= <>
##$TPNAME3= <>
##$TPNAME4= <>
##$TPNAME5= <>
##$TPNAME6= <>
##$TPNAME7= <>
##$TPOAL= (0..7)
0.5 0.5 0.5 0.5 0.5 0.5 0.5 0.5
##$TPOFFS= (0..7)
0 0 0 0 0 0 0 0
##$TUNHIN= 0
##$TUNHOUT= 0
##$TUNXOUT= 0
##$USERA1= <user>
##$USERA2= <user>
##$USERA3= <user>
##$USERA4= <user>
##$USERA5= <user>
##$V9= 5
##$VALIST= <valist>
##$VCLIST= <CCCCCCCCCCCCCCC>
##$VD= 0
##$VDLIST= <DDDDDDDDDDDDDDD>
##$VPLIST= <PPPPPPPPPPPPPPP>
##$VTLIST= <TTTTTTTTTTTTTTT>
##$WBST= 1024
##$WBSW= 4
##$XGAIN= (0..3)
0 0 0 0
##$XL= 0
##$YL= 0
##$YMAX_a= 645800
##$YMIN_a= -547894
##$ZGOPTNS= <>
##$ZL1= 120
##$ZL2= 120
##$ZL3= 120
##$ZL4= 120
##$ABSF1= 14.98509
##$ABSF2= -5.573092
##$ABSG= 5
##$ABSL= 3
##$ALPHA= 0
##$AQORDER= 0
##$ASSFAC= 0
##$ASSFACI= 0
##$ASSFACX= 0
##$ASSWID= 0
##$AUNMP= <proc_prof1d_extract_pilot.lims>
##$AXLEFT= 0
##$AXNAME= <>
##$AXNUC= <1H>
##$AXRIGHT= 0
##$AXTYPE= 0
##$AXUNIT= <>
##$AZFE= 0.1
##$AZFW= 0.1
##$BCFW= 0
##$BC_mod= 0
##$BYTORDP= 0
##$COROFFS= 0
##$CY= 15
##$DATMOD= 1
##$DC= 0
##$DFILT= <>
##$DTYPP= 0
##$F1P= 0
##$F2P= 0
##$FCOR= 0.5
##$FTSIZE= 32768
##$FT_mod= 6
##$GAMMA= 0
##$GB= 0
##$INTBC= 1
##$INTSCL= 1
##$ISEN= 128
##$LB= 0
##$LEV0= 0
##$LPBIN= 0
##$MAXI= 10000
##$MC2= 0
##$MEAN= 0
##$ME_mod= 0
##$MI= 0
##$NCOEF= 0
##$NC_proc= -8
##$NLEV= 6
##$NOISF1= 0
##$NOISF2= 0
##$NSP= 0
##$NTH_PI= 0
##$NZP= 0
##$OFFSET= 14.98509
##$PC= 1
##$PHC0= 95.55359
##$PHC1= 0
##$PH_mod= 1
##$PKNL= yes
##$PPARMOD= 0
##$PPDIAG= 0
##$PPIPTYP= 0
##$PPMPNUM= 2147483647
##$PPRESOL= 1
##$PSCAL= 4
##$PSIGN= 0
##$PYNMP= <proc.py>
##$REVERSE= no
##$SF= 400.02
##$SI= 32768
##$SIGF1= 0
##$SIGF2= 0
##$SINO= 400
##$SIOLD= 32768
##$SPECTYP= <>
##$SREGLST= <1H.CDCl3>
##$SSB= 0
##$STSI= 32768
##$STSR= 0
##$SW_p= 8223.68421052631
##$SYMM= 0
##$S_DEV= 0
##$TDeff= 65536
##$TDoff= 0
##$TI= <>
##$TILT= no
##$TM1= 0
##$TM2= 0
##$TOPLEV= 0
##$USERP1= <user>
##$USERP2= <user>
##$USERP3= <user>
##$USERP4= <user>
##$USERP5= <user>
##$WDW= 1
##$XDIM= 32768
##$YMAX_p= 458243088
##$YMIN_p= -702737
##$CURPLOT= <Network HP LaserJet P1505>
##$CURPRIN= <$Network HP LaserJet P1505>
##$DFORMAT= <normdp>
##$LAYOUT= <+/1D_H.xwp>
##$LFORMAT= <normlp>
##$PFORMAT= <normpl>
##$SURQMSG= 1
$$ End of Bruker specific parameters
$$ ---------------------------------
##NTUPLES= NMR SPECTRUM
##VAR_NAME=  FREQUENCY,     SPECTRUM/REAL,   SPECTRUM/IMAG
##SYMBOL=    X,             R,               I
##VAR_TYPE=  INDEPENDENT,   DEPENDENT,       DEPENDENT
##VAR_FORM=  AFFN,          ASDF,            ASDF
##VAR_DIM=   32768,         32768,           32768
##UNITS=     HZ,            ARBITRARY UNITS, ARBITRARY UNITS
##FACTOR=    0.250966925370066, 1,           1
##FIRST=     8223.43324360094, 116957,       -171080
##LAST=      0,             -120560,         -86224
##MIN=       0,             -702737,         0
##MAX=       8223.43324360094, 458243088,    0
$$ Real data points
##PAGE= N=1
##DATA TABLE= (X++(R..R)), XYDATA
$$ [...]
23804 -4000 -34171 131731 -143946 269720 101982 33842 34729 1088 166012 -202828 -390206
23793 -390206 -373936 -307825 128858 -12148 -271815 153723 145103 166391 37222 -153934 203458
23781 181605 -46846 63612 122311 -207592 -9505 -113146 92223 59652 222365 56220 -192336
23769 -85003 -145526 218985 50788 -602983 -304763 4371 -164086 28067 110670 -215614 -151357
23758 -151357 118745 133112 -14289 -308826 44267 68998 191974 -150115 8964 20989 -56174
23746 -270616 -39691 -184473 14454 115899 79519 20140 216670 -243679 122845 74329
23736 74329 -17072 26882 34012 6437 -16710 -52306 149020 -21700 -194052 152670 140337
23725 140337 -6900 84856 94186 -52337 -71204 13895 -141755 96831 -100001 -84897 131986
23713 -140977 22743 -114919 -114945 297385 81950 10083 11015 -46364 203696 -104174 -333210
23702 -333210 -576832 -299654 292150 79983 -141803 -218312 124345 -72004 -90414 -87138 14149
23690 -144792 127782 253948 -223633 -54464 264434 -189699 136743 -258801 -383336 292331
23679 -129027 162891 -43638 182494 -47962 -103951 -46197 126212 129872 106623 85606 -22225
23667 276743 126096 -178547 -127207 93196 -218062 -72902 64970 -62582 122706 -198898
23656 -321638 41473 -37817 -19399 -103159 172936 -99443 -16663 -141866 139801 -77885 -191320
23645 -191320 471129 -107288 91881 45220 -109295 55672 -88803 -368210 -186171 59945
23634 219035 -200303 -178008 2201 -166686 -236706 331238 -115474 2486 170752 12196 -361604
23622 314522 32430 79349 -123995 55908 104973 43046 165260 -105017 -107746 -291563 105747
23610 -244381 -245395 -1619 52647 365708 -57444 189245 -15746 -135540 47735 179419 -152647
23598 -171610 -6238 -255341 -384753 -117808 -134443 167888 152927 -104304 156745 -115172
23587 168463 -66898 -261133 37159 218108 -8530 -102311 -193418 -172489 342175 -75118 -87861
23576 -87861 166283 226425 219519 -149127 -63752 -68144 -19279 -91863 -92044 255633 -141483 140829
23563 27782 149735 498 169068 162390 -30004 -105781 -65456 -106182 -99628 44555 4740 346660
23551 346660 -114736 -135311 -58480 171579 -240413 42021 48872 178943 -123932 12293 -123205
23539 -62661 96622 -207319 68013 -234886 -314919 169443 -348986 18863 -114505 -165493 93452
23527 -105321 149695 44910 181267 -520436 -112799 -163137 -178203 -308209 -57075 186585
23516 153788 -497313 -66828 275944 137637 -116542 -83150 -108215 164543 -325733 394161
23505 -78151 -220224 -220305 197771 -98193 -138083 27262 -6068 151805 316860 4129 -220929 -289439
23493 -289439 -324350 129965 -253634 -41306 86103 -161873 157414 194178 29623 -147929
23482 -179989 -15347 13045 -66815 97136 118154 -102864 277095 -1893 304900 292860 -280630
23470 79643 -499375 -51362 -207897 -58228 -153473 141312 123107 55573 -237276 -333507 -124716
23458 -179719 27081 7584 -338508 -35122 -33771 185298 -14870 -274700 -6085 10634 277712
23447 277712 -30983 -111166 -80142 -251961 -108688 113416 212343 -173176 17745 -25944 -22415
23436 -22415 -21043 148779 16770 -130362 54642 -183394 -34797 -13688 25152 -143613 -251638
23425 -251638 207088 127477 50471 251257 -27529 37655 4232 8988 193866 158679 -113189
23413 -108663 32080 -19819 -3342 31983 39071 32407 -21685 -53489 -206650 17259 213576 -184366
23400 -76679 133996 -177383 128304 -91604 124290 8002 180601 161639 -143016 7746 -34002
23388 414740 -71829 -9366 -385604 -90987 146169 131925 -297478 139609 -150715 292961
23377 78026 194080 -212097 124073 -255807 -30697 -36099 -137359 -331170 271403 -272426
23366 18192 -362720 -50625 138002 -44658 26385 174009 -340773 85145 54842 -45224 138109
23354 -75260 -78550 -129961 336676 192063 -142409 -26022 104498 -253174 27283 97717 21093
23342 288876 -62045 8203 -29430 -219774 95828 -181960 71722 -149538 29559 -254221 -295054
23331 -295054 211701 -27450 160053 -213171 59841 -7149 173854 -121873 -67049 30344 -195252
23319 -191268 -43990 129960 283381 229401 -122407 202358 149890 92880 98360 171870 240540
23308 240540 -267533 60770 384284 -178402 -944 66283 216706 26672 -37859 108672 108627
23297 108627 -566810 -60482 335894 -274861 309942 131685 129046 -214159 109739 91715
23287 91715 203012 -318854 35432 -90461 93459 152071 -159538 162655 -28437 88411 70858
23276 70858 -207084 137891 -224151 -171731 -221826 222462 -108175 -199192 47368 -101570
23265 -45983 16429 -105100 -324530 119541 -387760 107291 47497 153478 -62160 -323411
23255 -323411 -116319 108723 -56478 161168 -113090 -255492 -169730 229937 305252 214087
23245 214087 194563 52012 206284 -75653 31583 -147104 146312 66155 -3611 -217278 -73523
23233 82684 -109311 -56675 -174837 48758 -159158 183723 -29715 -49433 100109 52356 -6887
23221 -26093 -25860 199548 -243881 -79904 -342090 -9589 127083 168128 45416 -235481 21648
23209 -321841 157209 -306532 -406248 206948 -128476 -81544 182000 -79016 254857 26229
23198 -24158 -95391 -169160 -41962 112434 78424 125810 19584 -182309 -160949 75032 -57875
23186 125977 183187 1307 -159382 -38436 274255 -264932 17523 -23540 9251 -350726 95851
23174 -9749 -152879 45814 -235909 -28334 -132982 -188337 179306 -171032 -299370 -208977 15816
23162 -102089 75637 244895 -98557 -210703 216974 37969 -416419 -38897 -91225 244229
23151 -469446 -7497 289213 176953 -43719 -114647 121927 55007 -316153 244398 125134
23141 125134 105353 -107342 143407 -81610 17217 -119769 124403 -91319 -122613 101029
23130 -2812 -269439 -66403 -38649 204916 -118603 -232086 107976 -138272 97309 54857 -78329
23118 -10341 -128846 -186522 -101838 -12655 -199709 -16839 281398 -184558 59917 -13863 -193863
23107 -193863 83513 299442 -61613 84885 -71860 -92941 72473 -66038 -195462 -123139 -95312
23096 -95312 132087 -435149 131929 33065 -8640 -4216 79381 161736 189188 -345874 145801
23084 291486 -21038 -280021 126924 -204425 -341577 -135491 6578 217126 -10734 202486
23073 -75349 -120500 -193344 43555 -218526 -274218 -193827 -264698 206777 85574 -59632 -25983
23061 44307 223308 45748 203403 -399691 125986 202064 209328 -57591 -126274 56704 112944
23050 112944 -276248 -56958 -195567 -77604 -63181 109211 -36639 167062 -241640 -101068
23039 215675 -16392 -176632 170850 -468381 116222 -318893 -244095 34904 84809 43446
23029 43446 -116561 -54925 47491 -314204 57443 -277130 170347 297974 417067 -107339
23018 -12067 -10579 -20502 -62432 -143534 -75394 -78344 -36317 67933 -372366 -133156 -102774 382146
23005 -46197 301057 -35894 -26387 -131100 -327256 -132717 56417 -94488 -270499 -195797 -347275
22994 -347275 373014 235008 -200549 -197300 -7884 -123424 90008 48421 -97691 84151 234096
22983 234096 72829 297681 -157013 85282 41317 -271836 -168827 -325754 -176435 -63661
22972 -103281 -66690 481426 304858 -120035 234266 -238706 91858 4239 -208140 96638
22961 -134798 146745 33279 121677 -95940 -412450 -223101 -77264 -19198 97991 164799 66818
22949 -228693 -13255 236236 31016 -353093 -54217 273236 127444 12765 -316306 -135977
22938 -154672 110706 313768 -81178 -236164 -143705 -148287 -227586 -402331 -292979 36530 -7962
22926 -106107 -135663 -213674 -64067 -246139 100792 101136 26405 160131 8035 -352543 106474
22914 49929 -122404 -233800 -421702 -14631 302149 -96584 -266777 141271 -269232 -87387
22903 -13961 58598 -394477 -221385 -163575 -276791 -335553 -114918 33419 -200340 -32384 -18194
22892 -18194 61364 137723 -702737 68005 71816 116052 -14735 -206120 -123991 -7240 -399608
22881 -399608 -281580 -12271 -295772 86136 93821 -179889 125676 -45318 -23501 99032 -198762
22869 -1478 73537 158840 46243 -151249 315246 -65193 248591 66185 11042 -416500 20330
22857 10171 -231058 -149796 -389229 53403 187845 -127473 21455 -162955 7310 -361176 231333
22845 103506 168321 172332 -55166 32365 232345 -58540 134049 148725 227249 27999 -153680
22833 -213948 62939 252526 -127585 50186 -47936 -170770 166798 135303 -179855 159265
22822 59291 -93280 -15790 -247986 47917 -167412 217605 -190079 -17858 162476 -103371
22811 -73822 121500 -199507 -182104 29370 97135 144884 138798 76489 -71063 -148405 275120
22799 168664 14151 8149 -42501 14533 -85622 47813 242436 259383 -99531 -265521 165161
22787 57256 -232933 -292037 265762 -29873 -199447 190594 -79346 137031 -238595 -10007
22776 173875 -404551 -7460 78839 24773 -223848 101491 -22550 150866 -283415 20684 186815
22765 186815 369898 -53904 -187213 4648 -122852 -142441 -116845 -145980 40460 -271093 113128
22753 -100891 176762 314596 -202258 -76670 160542 115596 225363 -29999 -68130 7951 -139225
22741 -350601 205787 157766 -1341 -245015 -50312 -16811 137519 30596 -240993 -398394 -276797
22730 -276797 342726 25380 -95225 187723 29767 -205602 -70391 163463 48774 -178105
22719 15397 -34076 100251 131474 -47932 -281369 -66615 103874 -340489 -68469 -10602 -47887
22708 -47887 -101069 48364 -32893 11276 148351 -243580 -100617 -122240 -45198 133816 77700
22697 77700 72269 168037 292677 99435 105591 -214782 -82036 138254 -7323 -246652 71229
22685 -86752 75105 -448890 123036 -29195 -84281 -4239 -23757 276045 -10988 -49236 264026
22673 40816 68545 -65989 90295 49454 -236985 -10588 19863 116740 -119573 -123530 -173061
22662 -173061 125694 -204003 -79805 -240985 23538 49839 -67398 -144900 -409477 -10793 130290
22650 -265412 -121206 28182 -142049 -213148 -78186 -243203 23906 -388885 -272056 -326469
22640 -326469 -77897 -97309 29484 24537 -395913 100395 168830 216636 11204 -147993 43299
22628 109422 55516 55467 61026 -130065 -347739 121558 14923 66774 -183007 280022 -174886
22616 13786 -121733 -337486 -132844 -77749 -110513 -200542 -151045 -39663 129760 -92805 176056
22604 35590 -384837 1945 140864 116735 65113 371991 -260016 -99554 258635 -480083 170775
22592 63113 71097 60984 -102713 -150537 46259 79222 -96322 -77096 -89204 -66977 56922 79134
22580 79134 -230710 -211041 -63932 187255 8230 -203066 -583135 177057 -158928 -92987 -109697
22569 -109697 46978 154193 177020 -325002 -373858 -172526 216045 -45993 45223 -44459 -90767
22558 -90767 -138728 -35207 -368575 -200473 -11554 -67264 -69735 42554 16424 116274 -36920
22546 94569 -270546 -39167 78052 288593 4765 -28351 103045 -12911 -156902 70076 -13165
22534 115363 -1184 159854 -66330 -63767 -196226 37487 214424 101917 -82225 -34442 67740
22522 15962 8472 -107525 -43281 -136948 -81351 44482 155036 -65854 -117633 -53493 -300757
22511 -300757 121660 47896 -6870 225226 38027 -310652 -177920 -64904 29293 101525 -1160
22499 99678 -173905 -124041 -262946 -223811 7313 -233274 278473 104422 -141218 29424 -283413
22487 -352418 -115207 222997 -104402 72979 -26936 108166 -276946 -107326 -22605 -17281
22477 -17281 154016 -53551 -87559 -14323 172153 114204 75190 -134554 15460 -191540 214273
22465 -100606 60483 -129917 -263794 -176554 98894 139065 -170761 -78503 288884 -147041
22454 -453772 -146735 149416 -284570 -64342 62479 252187 203962 -114658 240560 -57371
22443 96368 332647 76038 -21302 -294685 -3091 -23392 115942 -244002 -216972 -76792 -393970
22432 -393970 -68062 131142 -135484 -56535 -330886 48645 122019 -172144 -434568 86317
22421 -30618 -43426 -52592 46126 -46208 -255078 -74312 203380 413325 -242536 -157332 -37013
22409 -86143 119185 270474 -53932 -172128 -157926 -200497 83267 -75665 36291 -181201 178938
22397 53399 -395066 205480 31944 135354 143702 -147032 174792 310309 51542 -116156
22386 -153691 -206811 -43764 124025 125131 -149276 -44528 -345705 -221836 222381 -100326
22375 45822 -92302 -143822 403671 67165 -137486 -268202 214274 -98644 210688 -144827
22364 -31285 100821 228501 -589567 -65023 17676 117654 -31568 -23415 322848 16240 -429320
22352 -41730 -210269 -29804 -80293 -126439 104028 -195890 -85873 -427994 31602 -444574 9182
22340 80516 -257504 226165 -160765 -86818 -111678 -78928 23728 27950 180612 -160745 -169480
22329 -169480 85600 262424 -132082 77888 -234545 -239798 203224 -179503 90618 380942
22319 380942 -270341 384904 58495 -24837 15047 -100918 -282611 -65516 -59701 -233035 90460
22307 294655 -308548 -183806 25275 -446284 -231657 -144950 262498 -91727 -144975 -548646
22297 -548646 140794 -62691 -41354 -221862 -136708 -278968 -230690 -57532 240733 -110720
22286 -98604 43080 -82841 13916 82121 -189374 103945 168870 -210705 -93719 149860 31186
22274 -272018 53576 78973 123042 262093 -235324 52253 205652 100947 -13705 -43415 -192293
22263 -192293 -210584 154328 -2193 -85495 -278862 75668 165512 -250691 -209616 -129307 -252767
22252 -252767 -401488 274469 -164536 73231 88955 224768 -62262 -54006 -7207 -28595 104175
22240 -327779 123886 206183 -94563 403523 -59580 -136936 -207584 40780 -368493 -145442 283438
22228 135424 114887 39268 -3208 53023 -42998 -47605 -65241 76090 193029 -105674 -230125
22217 -230125 46358 164929 40370 41800 51441 151413 46192 -163549 82324 -130901 90709
22205 -190171 -97067 -116720 364166 -229177 -276743 -247997 152104 -120268 -377769 -19997
22194 68175 -343890 -105356 -64518 228175 174051 -289533 -181629 136606 100495 159236
22184 159236 -8932 -153497 -164287 -16078 76017 75502 -2322 174882 -214758 144515 42005
22172 -181467 91399 -137994 25808 -67972 -164390 -11868 161166 -121888 -6581 16921 -116605
22160 -268579 -122346 -258738 -218987 121265 42624 192868 -424360 123704 -380981 -261085
22150 -261085 -55175 165082 -44362 165824 -52926 -19581 -267628 -145040 140382 326265
22140 326265 -99117 283292 -101275 145159 -90371 -381941 -271499 -59472 -269048 29060
22129 71072 -90927 -228090 44092 -65591 -14555 123741 -34276 -336513 96809 107600 63099
22118 63099 87596 -217619 204381 4737 -52019 -114033 -196940 239358 55514 5995 -61887
22106 -102822 264308 -28681 77930 -16623 109037 -29256 234648 -179868 -171856 -62800 224397
22094 54945 -126720 -295313 -164558 -225820 25199 186406 134439 -172350 -176893 -214089 49207
22082 152119 -306296 -66610 188968 202451 -152552 29461 34852 90109 188171 -302450 -11580
22070 -288900 -247395 121683 -148623 -197284 -181247 -26187 -267966 113695 39681 -287862
22059 -169015 -374958 109519 133363 44829 -99947 -17970 31648 54972 320650 82115 60651
22048 60651 -474489 148848 153044 316311 186741 13724 2762 -342096 29395 1044 -259111
22036 -146814 -115280 -54291 -352610 -98692 -185312 -149861 -23785 -50708 135587 -322023 -389335
22025 -389335 -32561 -34079 -168956 -218205 -117832 -349300 14814 202280 -38949 -155829 201575
22013 -249907 143193 -96468 -275580 286976 -512434 -23676 330727 -155512 -128560 -475984
22003 -475984 26480 85126 -151838 -66098 -59608 -10887 -234137 -221291 19414 -166543 -212479
21992 -212479 369264 -21072 -191954 -44390 107227 184403 -357547 -156047 -28772 384531
21981 105048 -431247 -271224 -54625 -308424 -227191 169428 123074 130459 123549 100261 -180410
21969 -191503 75155 -39971 -130285 156524 -49170 127692 -81854 -259979 -256192 -54715 -224067
21958 -224067 -28019 199976 -284403 189876 409443 -245265 -25664 -399865 -13812 -749 25804
21946 -57094 153578 -30204 -245296 3484 98863 121894 196104 297477 52926 89923 18358
21934 -13600 -53129 172408 -100908 -90255 -172113 -1838 -416387 110627 216909 -40086 16705
21922 30583 -141888 -171712 -1079 227222 -300444 -251781 52243 -275927 -440307 -227363 182966
21910 -43820 -324929 2797 -30159 2081 18326 175715 -147378 -137795 30909 39605 -54996 218138
21897 -25527 -69082 -84261 69060 111064 87842 9255 -288637 144428 51383 -157520 -278045
21886 -278045 7307 -171282 -7823 21072 126995 180761 -247705 25293 -124274 -79831 339942
21874 -28523 77300 19494 126726 68619 -170950 -113108 -81557 -130307 9193 -134938 72596
21862 53589 -312877 57704 47833 68967 93183 -24409 -188095 96845 131560 146279 -62457
21850 -75850 192556 13310 220145 -95604 -299392 -229576 13537 116858 -307047 63456 119997
21839 119997 -34936 211762 -102216 -115776 332324 121072 -128078 -207938 -86326 -334228
21829 -334228 149776 -13034 -210508 -363177 -213320 -68247 -166027 -424463 69371 3340 -150257
21817 -41440 -144982 -257813 346608 76727 320154 -223223 -174543 -430075 330424 -106372
21806 55716 -326424 147631 212335 -24691 -264170 -38933 -264618 -213805 26161 17252 67901
21795 67901 11057 13378 -103705 -211107 -409345 136224 -126466 -317064 -215203 97772
21784 -43316 -238734 -62611 264848 -26460 -12594 366582 -147262 -91758 30644 33521 -197896
21772 -4051 -199011 -393471 858 -418026 159875 -58013 -100657 -68713 -145214 35329 -29750
21760 -136340 174682 -361792 40179 -304749 -32901 222888 -334159 -150360 -267186 -388710
21750 -388710 -117138 221902 107417 95917 226990 23676 -180136 31670 -28254 147346
21739 366162 -298768 41425 -345192 36930 -259788 75028 156977 208667 164698 203070 95427
21727 263899 147310 10401 -314647 -64089 -325197 -152902 -312959 -47779 -108096 -27503
21716 117090 236989 -189143 63957 -200470 -163522 -177526 8030 196340 199885 10344 11924
21705 11924 84064 -97499 -30970 3491 116040 -69567 -301323 -264156 -228283 -41345 96134
21693 -158183 -40516 402034 86957 -46907 -501103 -308113 -218258 -273702 -56748 51228 -47371
21681 48714 76582 116223 -225576 -8010 -15086 -151071 157738 60706 177550 -206086 5859
21669 6155 -264111 -95725 -275475 -361758 -244573 29439 -120559 12936 -148640 -498337 -164049
21657 15100 226594 180788 164469 -284754 -93281 -135021 -117242 -50166 158605 -188846 154484
21645 163641 -43972 -143673 -95990 -125022 -220383 296755 -68663 -117182 -17962 -48405 158934
21633 -354771 -370503 145142 -29238 368465 101169 -194325 32153 250100 -236569 -266644
21623 -266644 -8382 -128594 -126885 -62271 37460 340454 64158 215719 9487 -145877 134615
21611 77171 108985 75508 191309 -47004 -82534 184634 351832 -57587 -512090 -449563 -5767
21599 -220667 -50055 -52801 -56509 111003 115131 170482 22090 124310 -148068 -569030 -43719
21587 273357 189907 59476 -54152 -287678 446005 235548 -348319 -167215 -330203 -42358
21576 -281794 -340561 13374 313419 -181601 -42080 32265 47476 125671 184269 -183253 -237897
21565 -237897 -69892 166841 -234154 -131091 27543 68856 -72540 -136390 -284509 253769
21554 -217618 -60441 284310 -59511 -181801 -422185 114055 94065 -36131 -55936 69763 -116043
21542 -45231 -109585 137494 -23483 -62209 142337 -199316 -512757 -74213 -130626 -382428 -298166
21531 -298166 -157143 -145226 -6178 -86228 -268685 102090 18597 -61458 -88074 -263524 -91971
21519 129144 -68835 -467477 -188126 46785 -193409 -581302 -228045 -101000 -171202 -288809
21509 -288809 -73865 -327898 -115282 -148997 20958 -83701 59027 328870 -339676 88264 283809
21498 283809 -148283 192718 -211909 -144365 -4657 12879 -105651 120543 54024 -181541
21487 -94831 -140799 -412462 -106876 -178791 -227318 102369 -261729 -114303 -20574 -438890
21477 -438890 332392 -103922 -39263 -73500 31534 -134671 176611 -165294 -23917 -47636
21467 -47636 210 -94674 -346808 -144815 -454076 214351 -194329 125215 52798 -109498 -132034
21456 -132034 3572 41067 288762 11043 28108 -183536 -8481 20502 98041 -38934 -310446
21445 -310446 179356 5169 207608 -36480 316433 320717 96944 313624 114134 178062 588267
21434 588267 185262 -160458 205723 157365 -40585 -301541 121603 -87529 -298573 -252436
21424 -252436 -283616 3870 -84939 -324394 -69221 -28209 -26591 47158 -210256 -9110 -101836 -107811
21412 -107811 -43371 23392 -347019 111590 378480 -127294 19856 263884 -102470 -252139
21402 -252139 -437716 -260256 -291951 -319226 69283 167343 51622 -164192 -281174 -174583
21392 -174583 174461 -11053 263137 181571 -86947 -141930 109446 -207437 -261009 -52528 66390
21380 -160208 -80087 70257 -271783 -2324 106172 89011 -22960 -91758 464476 -8906 167324
21368 304249 165436 -86101 109998 -32961 18028 -22456 402420 114812 -338086 311344
21357 -85746 -1126 16021 -166811 241594 17964 -3254 -250920 43886 214327 -160450 -419169
21346 -419169 50289 -106945 -190831 -8245 16515 -188090 9082 180868 -87088 -179429 -74543
21334 31289 -31111 198317 -62415 -394129 17506 -22602 69903 -10290 -234429 -219691 13195
21322 -51116 59925 -32163 -554663 276298 30561 185554 194701 -344817 411087 41364 -334994
21310 122295 78854 -168301 -228481 -545883 -85745 15456 125957 -121279 -84739 -565591
21300 -565591 -119742 192122 -29199 154236 51594 296691 143075 146382 -288587 -373269
21290 -373269 178926 141466 29851 -310232 -236663 87788 -192690 -148 -37561 -176962 -291861
21279 -291861 -584787 -15113 -278815 339270 -88094 160387 1391 -30174 122426 24320 152005
21268 152005 -379669 70202 -235337 20719 -264607 -46916 -16609 -474226 -137565 -172135
21258 -172135 -88734 -186435 -211371 206610 -270969 -249084 -46667 168399 -105178 -90942 -37554
21246 238988 -74122 100177 96823 -105995 -36793 -61204 188632 -93880 68223 -149917 15297
21234 -167689 -63015 -71178 195842 81703 -171437 17965 190224 15867 14728 -109797 67015
21222 -3008 -31850 181304 -223066 -355254 -23314 -174041 -55758 44720 -332999 34540 -170173
21210 -233251 -33344 -245258 -77052 232364 -10790 -154645 40940 167486 -64755 -210317
21200 -210317 -165940 147980 -291210 -105486 64551 206150 -175090 224001 196781 155146
21190 155146 28199 -425787 54327 -37892 177636 -372386 149564 -106702 -304277 142610
21179 -182252 -91108 -268583 -501471 -117833 -171278 -199620 -174337 2471 196744 23972 -309115
21167 -72218 -343331 -329070 -97844 -157486 -64617 -268606 -28676 -245250 -183047 -268080 -168344
21156 -168344 -321385 -80696 -313549 -33769 -208982 76641 -92510 8841 -211020 -207639 -104330
21145 -104330 128821 93477 -254780 -149447 -480373 -93598 363148 262549 -4971 -242284
21135 -242284 119910 349572 -8873 72491 69230 107045 67690 -239007 196426 -67429 -71268
21124 -71268 -323330 -283062 186205 -233854 -394496 -371074 35256 161784 -68052 -266078
21114 -266078 -30377 83637 -80268 -121871 315445 -64288 -127483 -136868 -170779 158889 49107
21102 -387208 83500 -25321 -96665 -298737 -364298 -166786 570395 -12273 -197736 180610
21091 -59161 60208 255373 -112365 -487217 147945 139087 -53443 121400 -206993 -55514 -106627
21080 -106627 85564 -202182 183362 -16571 205880 -36631 -492318 -78954 186071 -39183
21069 299761 112293 -265089 4427 -138561 52303 -275952 -232860 -66181 -264811 -59319 299450
21057 -313048 -127309 -351546 30208 -191091 218620 165572 144907 -192520 -266161 28262
21046 -76132 127394 -69265 -178935 -154480 -293797 -348004 525872 -28044 191150 -1988 275673
21034 -93812 -74543 228171 -122532 314127 -65731 306636 -72289 62750 -74538 115095 -177258
21022 54137 117815 10350 -229799 -152612 -279957 190348 313889 4681 45820 146691 -136948
21010 102251 124329 203121 395068 -93199 -20172 131980 -257359 336 21308 -105556 86382
20998 -117463 118581 -53522 16507 31350 -337248 -297508 -19794 355318 -112482 454818
20987 -2082 9867 -330013 -24442 114899 -90295 56335 11846 76275 58933 -196398 -67992
20975 -89771 -306501 38458 179816 -43280 -130387 -126454 -130824 12582 -202455 128930 58341
20963 -47371 -82477 -164147 -110002 -30142 -411295 98905 -409922 -74013 -55953 -133894 -528632
20952 -528632 40091 -233646 85952 12978 -153829 -173753 130623 -34438 -236367 -136117
20942 -136117 -244610 -145658 264435 -340338 -68894 29815 15774 410476 -157106 11469
20931 279888 -57061 318389 279022 -194079 -289128 55787 75361 -196020 34386 -156260 -197470
20920 -197470 156655 116305 -176308 -228790 22061 310571 -105168 -28968 -310215 -73469
20909 -353630 104089 179932 -246753 159101 108977 -338165 -477090 95215 -317744 -247613
20899 -247613 -166371 241156 12171 33735 -29350 -53447 -47493 -245435 -393800 -374831 -299748
20888 -299748 -298479 88666 -35104 -280854 30087 -167350 -309105 -361262 160232 -178498 54965
20876 -233236 316991 115271 75245 -305732 103037 -115566 -224948 -451066 -250993 -72653
20865 -43382 -331028 69453 -8949 -6510 133381 11594 -253356 -19517 206978 -66581 -8399
20853 -102938 27991 -411625 3360 130450 -39243 -148490 -312582 7845 -8567 -264004 -172376
20842 -172376 108900 -64634 -182978 158369 304367 -67454 -69432 -42036 346822 273629 -527696
20830 -276205 -140263 -233742 -111506 25674 -177646 16260 223330 -142622 -105779 -25757
20819 -41684 -60221 -119108 205140 -292448 -278061 -218195 36432 122001 -129715 107355 -43237
20807 267684 -33756 -348224 2397 -4677 -168486 -59124 33533 166049 -30145 -23517 -420344
20796 -420344 42596 95690 -92633 -526770 79876 -124377 -334713 93193 -293126 179088
20785 -162022 -142508 -244357 -116780 -216521 54 175732 12705 -240054 128806 49486 -162644
20773 -54794 186285 -69266 -268384 -411724 -161760 -143608 106349 88814 -170971 266918
20762 -32133 -101625 92574 53122 -87515 -122162 -140810 151472 -5413 -49668 -13407 188620
20750 285008 99413 -290651 100013 -48452 50882 -49121 -310899 -25446 309967 101617
20739 -493381 -92608 -10147 -187352 -21420 -486015 -199600 -137210 51254 -69389 -329271 -376608
20728 -376608 -124559 -156043 -18000 367370 43800 -53407 17174 -85096 263222 -363102 -24751
20716 23277 50189 -279755 -27464 106654 60064 -323069 334849 -52336 211045 -12353 23616
20704 -153445 -123674 -78887 105370 191201 3631 125213 -339648 -148276 239615 58665 -135739
20692 236664 -278666 -109718 -35026 368100 -15193 -4488 -149679 -221115 313727 -204644
20681 61513 71889 34251 198559 -282998 64692 -239951 -567566 4476 -171370 -53707 103453
20669 -186546 127081 -378198 50122 103439 -338743 -159916 122515 -147519 -132251 39005
20658 248156 333543 -170777 -251307 -219701 104113 -125459 -177840 -78876 -159022 -175539 368423
20646 -281698 164147 -20041 -24008 13029 -147283 41009 70083 -44089 186855 35541 257393
20635 257393 177320 107115 6345 -431702 213038 -126982 -154117 -39161 -150399 -7686 -276148
20624 -276148 31972 88338 76849 295 73141 -61807 185144 384426 171219 269618 3919
20612 -106331 59646 -272254 -249010 -261601 89143 -415801 -188392 -197395 108076 -102057 72595
20600 -178711 -102554 -136676 -55974 -49172 -21931 -186987 11126 -36803 -186531 -124734 -20612
20588 -32271 -33356 -49086 22457 -58018 36762 299796 -169771 -76033 -109511 345540 -5449
20576 -47102 91543 4816 -29587 -365471 209739 -398182 104327 441653 -259699 55914 -303193
20564 -110742 -432448 34184 -85965 -29884 96132 -90970 2861 -228824 -88852 123885 -295971
20552 -312134 -161834 -186925 78330 -252418 117073 -105469 -53881 -25077 -237892 1969 -368046
20540 239355 -159296 -217018 -288583 -18465 108545 -131591 270176 -194672 31170 -294916
20529 -201945 -338774 16848 -285840 -85521 -39574 -207348 -251013 -127620 156811 55705
20518 91490 232573 179432 -78841 36111 251075 -308334 135768 -36959 20772 -167150 -46167
20506 24900 90529 -204704 -7972 -274517 -280718 -115410 -140345 -30234 -259209 -344166 -49185
20494 320497 -65662 -22374 -279609 -396310 93231 -65492 -220327 -316592 219212 2620 -13209
20482 317635 -294166 -118223 -325056 -110448 303012 139998 -347969 -383799 42727 31979
20472 31979 -22828 -41855 199341 -333978 134542 -100086 -103462 148348 -99451 -75979 -138707
20461 -138707 -54951 114036 63862 109101 -253344 192643 -342736 -273863 298284 47443
20450 144578 52937 30903 230422 -124711 -131805 -44356 227009 7043 43718 -130336 -215914
20439 -215914 -139749 -391396 -24690 -61328 -77234 -70788 -244437 -318680 -6640 83579 151136
20428 151136 -281504 202317 -394074 -63775 -279637 -211693 -286548 -227747 -316740 13802 272210
20417 272210 -232295 -97320 -135593 -79269 -43170 -146449 -205876 -61439 5297 -4709 387010
20405 -312573 -189877 -171613 85181 88976 244728 -167460 -261702 161758 192236 -191050 -212149
20394 -212149 -95133 13261 -234574 2607 144799 -137534 -336525 -28489 -32976 44390 29617
20383 29617 -66818 -141428 -150115 30080 -133268 -34242 31610 6670 -226971 242248 -145494
20371 -129008 114212 -61812 -310423 132960 -205325 126922 35083 -327288 66195 -185142
20360 -157132 -177699 -315068 -350669 -7370 199954 191095 403017 -253950 183232 54292 26633
20348 -226674 -72828 108654 -90384 -108893 -386315 -391388 -53133 20793 -442 8304 -87090 -140061
20336 -140061 -24385 87100 -45830 145906 262312 82340 -212173 156058 -16335 -280499
20326 -280499 191887 -286627 -195221 -8275 -239588 -164494 -5514 -344038 84313 -184084 -197024
20315 -197024 20268 126578 92400 67374 27536 131110 -140784 -213692 -49320 -386506 -147641
20303 23722 -272082 -170220 132025 4410 202632 228313 111254 122103 -77090 189753 -97921
20291 -562551 -92825 -41006 -124725 -220869 -64353 -76423 96461 -9804 -126229 -143376 72383
20279 88401 -51405 -220719 311700 -123214 -92593 103300 -188591 198577 -139212 292576
20268 -96615 63407 92586 126282 24289 -160794 4497 563894 -267243 -13551 -256384 -82407
20256 -190892 6844 -46925 -58828 61748 26745 -35521 28542 12708 52535 -24945 -113538 559
20243 -145447 -127053 164643 -50535 -183810 240999 -45951 -202240 -57547 171896 47009
20232 -99539 -443611 800 -358945 -213678 264050 -250620 -121284 -74138 -33463 -104076 -52818
20221 -52818 -70233 -531577 267331 -61238 -302792 16343 152012 -252659 168821 -7863 43227
20209 -19412 20321 -93779 -77735 -78158 64968 -78643 -385029 61848 -36711 -365090 -30467 -214758
20197 -214758 -315667 59694 -116836 -269189 -178897 -109752 -149093 -222511 -224593 -208778 -118361
20186 -118361 -275159 -317018 -254043 -272990 -396503 -248822 -245230 165524 -271007 -34461 169087
20174 829 -490 -192480 -123138 -110549 -131113 119476 -23094 287403 385214 -196737 151240
20162 439196 40874 -402379 -170082 -269212 -279390 -335789 -338141 -153151 305199 476124 194555
20150 -273229 68925 -25570 -89534 140632 90902 -266938 75610 -239475 133942 102069 3324
20138 -90140 -264886 -91577 -233913 -2747 17494 215711 -231640 -114575 -194813 105714 -355548
20126 53974 145454 249194 -149673 269848 -310232 141490 8889 -133220 -181249 49580 386586
20115 386586 65706 236159 63911 233870 67226 -389901 -198977 -327163 -268525 62012
20104 -92093 -56515 -269549 -326094 -230180 -153687 -110028 68502 -299571 -50463 -15624 102582
20092 308312 364877 4502 66156 -106857 -169606 96859 -35114 -176672 -108322 -261468 -5078
20080 167496 141971 -53484 -12925 -175976 -101569 -118659 -219696 30502 142648 -9212 -106172
20069 -106172 -68195 -7528 35347 32532 -140735 24390 30410 -118829 -171037 -191181 -113665 -309209
20057 -309209 -92910 -157841 -102387 77191 -106633 50266 244081 -148168 -307514 306975
20046 -178024 -286364 -40652 187673 17859 90443 -58736 -80833 -124925 120082 28543 -65040
20034 -247598 -48975 222928 198507 102206 -262770 67745 -26590 12541 -136974 -131704 168726
20022 -25599 -202381 -298656 -109222 162338 28250 -158004 108825 -156179 -178089 73261
20011 254533 9018 58737 18321 -349767 241778 35020 -1039 -154290 64940 8016 334341
20000 334341 -35627 151103 66258 -97825 -40024 15579 -110720 -304998 -248506 -23782 -49785
19989 -49785 32477 -92218 398251 153614 63773 171706 243595 121917 -241488 -81474 -80363
19978 -80363 260151 -129138 -229410 -55076 -245124 -699216 280207 -26557 32303 -123841
19967 46931 -343416 113952 -202851 -130234 261910 55423 -38965 -101364 -100793 -169226 -102430
19956 -102430 -47561 2712 -190718 -183267 -6340 -435324 262636 -26588 -167318 201953 16897
19944 -203860 188920 -100039 92543 -13337 -44815 60141 66893 -585857 -116866 83048 87687
19933 87687 -76358 145379 -151107 -83472 -497702 -38217 -281252 -79286 -242184 -286908 -159569
19922 -159569 -123828 -245758 43080 -223015 -28072 -404588 3751 -161330 -21605 223887 5861
19910 -33975 -61984 162590 82341 -114037 205397 132946 -50117 -10482 -19760 -127100 -213101
19899 -213101 143362 -159308 151915 -3569 56395 136583 -284422 -52138 -25453 55193 -225392
19887 275089 -169524 149151 -69455 -133221 -347745 -120018 239942 214603 181779 -49182
19876 -81846 -39973 -238236 -123839 -143340 -19195 -209683 -82291 50580 131210 112420 14153
19864 289759 -111721 -53302 -258705 75123 287940 -191397 162457 -42608 -11648 -103260
19854 -103260 -64553 55015 -90628 197869 -165821 12265 -18577 -66418 -100505 -306797 192
19842 -287193 -411245 -168714 3200 -159889 -214487 -316726 -189313 -599901 -14612 -271264
19832 -271264 -232971 -283938 -95088 29340 -197181 -24614 15107 187105 -129073 -212861 259953
19820 -235511 -261933 85535 -382293 108800 -212981 258336 -113018 -116131 137211 -134210
19809 49874 64259 -29728 130992 -1486 -97068 -220565 -204535 73377 -83728 52620 -349319
19797 -117061 74504 16021 -43613 -224343 229621 -14535 233969 149879 61994 144031 -215080
19785 -84982 98047 185416 -38700 260689 -314814 -138404 171867 -200069 85058 35100 34325
19774 34325 347136 41296 85525 -143015 -336099 86583 -392435 -37770 -81765 -65233 -348930
19763 -348930 -98276 -177093 44608 -14820 11521 -17727 35852 200638 78849 -84338 -5976
19751 -171942 96441 59168 -543819 27363 -61727 -232160 -306971 110476 -111116 -176344 -2515
19739 106215 -104370 -37296 251741 80585 -158197 -119193 -10641 -98759 148999 -202416
19728 35809 152368 -233797 -195717 -65835 248625 200208 15915 -148944 -197062 72417 -286877
19716 -87892 -127037 -289466 -125692 -114140 -237927 67044 -267939 -25025 -107779 -27649 -212589
19705 -212589 -115834 237306 -102976 68270 44344 -235834 -83980 42859 -4175 -93962 304140
19693 -96848 200945 -113893 -206415 -247795 -28816 9883 43895 175881 -135987 -83440 -357365
19682 -357365 -277473 5873 89211 155063 184264 -308749 -69918 -117829 -151247 -74764 -44778
19671 -44778 -36949 186522 -223305 -314442 -104852 -305822 -20522 196355 -100673 -141877 -28539
19659 8451 -219661 -112555 45295 -6856 -82114 -233518 -515097 -66495 -139516 -302381 -283633
19648 -283633 -234595 -52745 -54195 -233696 -26112 394167 92828 -80787 17766 -77148 -35213
19636 25848 -129259 25044 307132 -236670 144767 -377981 28337 -359586 -106619 21221
19625 81514 -129970 -275978 38851 34469 55708 -9535 91267 154008 -197642 -296414 -298448 -7196
19612 222021 -428693 16059 -217411 -203259 28711 297756 -56982 -254325 178114 -27065
19601 -187378 -142113 -183385 420480 -181147 -110332 -251410 -45262 244571 76185 160060 -93586
19589 195790 -201945 -332385 -230569 -150405 -117033 47393 222441 12983 31670 -294158
19578 35130 -161892 -223991 -148027 -262999 -232709 -142908 -186232 259496 132861 88988 -17080
19566 -6960 193259 -24486 17214 52013 -134804 -99838 -236798 136616 -125489 -83435 -228018
19555 -228018 47485 -204983 -116823 -3946 455274 -135641 54875 -223738 200267 30504 -219483
19543 -245126 -29118 -308528 260391 48231 25916 -168173 -113132 309508 -38363 -432153
19533 -432153 -291228 -69674 -69359 4173 -314881 48773 107051 285274 -38741 -64040 -246245
19522 -246245 125295 -320924 315781 -131688 -141515 -168032 11182 119880 328988 39548
19511 182081 -336269 -113572 -262041 -117987 12751 184189 98206 -35675 -218470 -194560
19501 -194560 167887 -32667 -252384 -276759 250862 152642 100426 -436185 154824 -191107
19490 -370582 -220624 50763 -157955 107982 105036 -273302 -68848 -77357 19174 89060 -403838
19478 -73902 166583 99771 -9310 -372228 -83820 -219853 -113892 -35713 -366708 -32330 142917
19466 212942 -170899 125379 -109844 -340796 -97545 -257436 -99544 -17037 87648 -312315
19455 -73496 -198819 -299769 245110 -17907 -134882 -36171 -187708 -215944 -303391 100239
19444 49204 126090 258754 -83157 213000 124700 -128936 -390757 28614 37500 37662 -29120
19432 64035 -30984 -22873 -37183 7874 -99149 -21724 -98341 -94860 -19349 -313147 -119276 99815
19419 -374625 -2179 -76348 211895 -94839 108016 -79802 347706 -54348 138510 240625 -220038
19407 -67079 -129406 192606 -494519 -279000 -75143 120972 -102191 -294888 -352018 179476
19396 -212382 -71482 -172103 -267614 -100313 159080 -58091 -332662 89485 -102485 -93396 -142710
19385 -142710 -134516 -192693 -273598 -217071 158216 -112236 -526344 -214979 -5182 44631 51657
19374 51657 -30168 -178088 -171803 49851 -144852 -300875 177191 214912 30356 -40110 -66217
19363 -66217 -313659 176075 -317998 -106373 -431428 3801 196840 -288111 -51938 -209777
19353 -209777 -107474 -221366 -175725 -20871 -89384 -94394 210664 -147140 -156988 -187084 44328
19341 -233946 -198568 143384 -26949 -762 -68399 -122628 -340953 -25021 -167700 -131944 144320
19329 62017 12246 -40592 70992 -203527 -103914 17557 -85571 -159416 -313292 -391349 41129
19317 -216975 101710 -39380 -168790 74841 -245810 -60451 -4302 301788 104968 162739 150820
19306 150820 -74935 -49259 78019 135636 277189 186199 33414 89584 41314 -331134 -343190
19295 -343190 -133382 109598 -30611 -19568 97691 -141149 -13375 120102 268985 -113686
19284 106086 -73506 -268877 344370 -181064 126006 4757 -56051 -491713 -381811 66547
19273 384644 70591 -150653 33180 -24392 -189281 -152942 -134329 80719 112412 -145875 -335316
19262 -335316 139483 46689 -52827 73934 -83355 349692 274690 81772 -144152 72509 -298822
19250 33144 64654 -17290 -126733 -405386 -53686 166949 -5573 60217 -264003 118303 -56480
19238 -199667 -126256 151499 -294894 200417 -170782 -188032 -300897 -232567 -315714 -53542
19227 -339429 74338 -288344 -230056 127903 -150549 162840 -290138 -160425 -289712 90384
19216 112938 -424516 -111142 -35594 86856 184820 84537 -366900 -83645 103752 19988 45507
19205 45507 -172713 -50514 -271268 76434 178900 55700 223198 -75942 -108278 -408339 157645
19193 -71394 -178967 -256961 -6008 151278 -59175 -147936 -24294 -169504 -347423 -361517 7603
19181 -114465 -173607 101443 -496153 -235280 -182180 -155921 142307 208736 -96045 -32378 -207894
19170 -207894 -238966 190942 165152 -38782 -322687 -158125 110777 70588 135081 -289854
19159 -143032 142295 -321547 -168595 -85109 3536 13619 -88416 64058 135849 -47056 -200091
19148 -200091 -12603 21828 64558 75146 195978 -14200 -291184 10018 223458 -160939 122914
19136 -214210 20253 -306287 -88793 -152888 -80371 283857 1798 -41079 -231788 -409677 -196351
19124 65684 -55439 175069 -86058 -269317 -309592 152161 144311 -281670 -119517 -48755 31632
19112 60305 276404 -312162 -38312 156867 -58156 -132614 91747 -285051 17188 -334745 -17984
19100 65342 -178203 -6126 -104327 -26409 -136530 -262187 237708 109747 68282 61079 -105309
19088 -240495 176162 -56659 -475693 -143133 -83803 320603 -70806 53109 -181054 -163197
19078 -163197 -295263 -116838 -202466 -133147 -226689 -148681 33569 243346 89641 11923 192541
19067 192541 -299484 145493 171799 11686 247199 -115810 -61643 49235 -29110 -125259 -123919
19056 -123919 370567 231652 -36921 -60141 3282 -61235 -89539 -282348 193096 -178992 -131602
19045 -131602 -75456 158994 5740 6104 -36814 -93255 -55529 -348601 -156677 -28268 89291
19033 -194940 -86110 -218909 29356 209569 167058 193748 -275680 -102469 244557 115856
19022 98883 -173256 -210760 -45794 -249193 50934 -294140 46840 -218108 -68269 -359262 -200172
19011 -200172 -234092 -56604 -130916 86398 -103003 152446 -109198 49391 -14168 -43338 -119439
19000 -119439 173801 262852 73839 209088 227013 13763 88222 -153794 15631 8251 -241478
18988 38064 -204240 11425 382308 -262196 378335 -323561 197416 7450 123683 46972
18977 -291445 -118081 -245837 107909 27029 70208 174267 944 413229 -80275 -94130 -383061
18966 -383061 -125861 24545 -65443 74037 124382 -115915 66535 -52673 57541 -220601 78406
18954 357738 -70899 2877 -20258 -199388 328318 -409162 -78990 -300259 100999 -119570
18943 -48684 -116780 -194432 -335050 -94430 60718 -191696 -285703 138416 52190 195364 -17705
18931 -165319 -130421 90455 312009 -6429 66471 69960 28600 -247137 184931 19999 -267176
18919 48012 -181088 -344280 81143 -6264 -36498 -109213 -171729 -213429 50510 6566 187150
18908 187150 -290911 -148745 -51136 -83806 54482 -15650 -49271 -292933 -157511 -35298 93785
18896 -55905 -414194 -40815 -68560 -171915 -103643 78028 97635 -320638 178687 46794 -64666
18884 78369 107914 -71103 -452868 152285 -145788 -174972 -223520 23279 -246718 15991 -74876
18872 372907 132531 -80695 -125861 -26828 -286744 44273 -235115 -147368 -153623 165402 108801
18861 108801 55405 -129320 -150774 -23671 19641 -66726 -234845 40273 -25298 -34344 -326301
18850 -326301 20443 -403035 233706 -165534 -46072 229099 -325537 -195653 -41017 -200224
18840 -200224 34760 140515 22136 70243 -163332 60429 18488 -237616 32585 43594 33360
18829 33360 -99080 -143108 -382717 104118 -111425 -49057 16363 -185984 -30235 470790 9323
18817 956 -32748 -104384 -91267 80275 11544 -95284 -260179 128066 80383 -76819 -101285 30186
18804 -23961 134972 160031 88947 256228 -234628 198554 -298088 393614 -87326 -72204
18794 -72204 -378278 -53211 -180556 -178757 -111339 -193675 -314096 91223 78022 -114692 -160631
18783 -160631 -2221 -377053 -274350 -107723 -24489 -135889 31720 -197067 -124431 56065 -180171
18771 -33867 277172 92172 -226230 -363668 65526 -84076 58580 54423 -88276 4388 113845
18760 113845 9081 83560 -238148 -122765 -260788 164927 -86054 -297977 46515 -129837
18749 215358 40799 24271 -310355 -213384 -197031 -1249 166160 -237578 -36621 -92183 -108397
18738 -108397 12627 -45526 -6189 -118059 -185247 -121487 -36224 5328 -117765 148092 -272891
18726 -149419 94691 -52268 -354529 221973 -57587 -60060 185946 -68758 -205881 -62936 116291
18714 -71600 -202075 -272012 -273784 14862 60779 -80197 -301794 -391808 -529847 -67613 -72925
18703 -72925 -225508 -207639 -22064 32541 -209530 -229341 285938 99394 135451 -149776 -65163
18691 -73386 -89013 -32822 -231931 -155246 166242 97556 50424 -48797 8691 -94328 -158839
18680 -158839 31559 57196 -125921 111119 -321992 -24083 -219733 -412491 -352213 43736
18669 -48991 65991 -91105 -406994 29000 -182472 63883 -135001 -151784 -265669 -136467 -193676
18658 -193676 106967 -87562 -78608 -1180 -126403 -159907 -29674 -64704 -325219 264273 -141729
18646 60061 -305398 -74274 444159 114396 22386 -112782 -285776 449 50607 -205713 -122079
18635 -122079 -115119 86650 -351687 -12487 43547 130814 -105623 -397526 -18792 -184218 64663
18623 211530 -235834 117897 272217 46235 268848 313510 -3275 217934 -5479 -301923 -116512
18611 72660 -572 57987 174709 -79061 -242402 -197821 182308 128849 119282 30338 -107628
18599 -299541 250627 304492 2162 -195623 -95993 89681 -103086 -40226 -34645 -21593 227328
18587 7907 118632 -314133 -465458 -129274 -118462 -31050 235253 77112 231751 237385 -175359
18575 159180 -264920 -37945 -197928 26492 -309168 -143774 136367 2103 -263037 199369
18564 81997 200761 115426 -238798 -182066 303568 -82943 183570 14167 -10204 -28762 -88150
18553 -88150 137628 199806 -190225 46009 47543 45007 211812 80884 -247696 -154147 -164044
18542 -164044 -79294 -277780 177843 59075 143156 -108832 -80662 21577 273018 158912
18532 158912 -165352 -166073 -87887 -133029 -336142 74714 -153379 -11501 12569 -66947 12068
18520 -34149 -64452 -73791 273707 73993 216676 221836 41464 -188390 211783 30368 -204417
18508 71930 259091 -52511 42717 49050 -53814 -92274 -323071 -346766 -78283 -326398 -156852
18496 -142735 -253917 -169961 -103670 -316008 77940 106379 166223 -191053 179521 257133 -19300
18484 -423880 -25903 62589 232542 -442411 111775 61871 -80171 -5789 16801 -213206 193939
18472 -156968 -157991 -472855 -334058 -86624 -89494 68721 -272908 -160428 96676 -141439 75284
18460 -85489 6921 -499260 -236105 280599 -224512 -58820 31014 -105 102595 -68578 -10472
18448 254578 -175456 344922 -241798 -3421 -200072 275296 136467 -179268 -137346 208373
18437 -82809 -353823 -90488 81871 -154365 39730 43479 -210188 -196349 26345 157198 -38348
18425 -169838 -112209 -106535 77592 -98943 -43536 -149293 -601208 254199 -371700 45542 158870
18414 158870 -300976 -143508 -10351 -362450 -80856 -66449 -256197 -43192 -270365 65022
18403 141292 -180173 -141448 -148502 -195618 -22109 55839 -371298 -336965 -33918 355914 -78509
18391 -86067 286999 -156684 -260733 -94873 -152555 -199551 -84437 197156 83161 136529 76821
18380 76821 -202106 -339070 -202565 -26738 68054 -80503 248583 -162316 99832 -96123 67388
18368 -66860 9978 29735 8592 -123382 113199 -92377 24574 -556744 -22804 -205317 -187321
18357 -187321 10098 183775 -315558 67777 -94654 -5499 70513 41920 40111 -144774 -352632
18346 -352632 251914 144071 -273289 133077 -197030 -234870 -205986 218816 -321597 -17488
18335 16545 -243922 -113568 -16854 342971 -65537 47979 39580 39770 -66273 -271796 61787
18323 188693 1169 -296419 -272741 2039 -30186 -80115 -165596 263298 -219893 -34491 -203653
18312 -203653 -478840 -177534 -44949 -240115 68798 199854 -174781 -305400 35319 7053
18301 64930 90235 -126893 -29749 -267947 -20305 -128947 268368 207806 238112 -5446 -293346
18290 -293346 52414 288262 21811 24277 -190578 102742 -162052 -40770 -210483 139961
18279 118635 31639 218345 -68783 -76529 117335 -35113 123240 139466 337724 -170133 70272
18267 912 -246477 -384067 -22041 -81575 36007 98636 320383 114037 51356 -58602 -88753
18256 -88753 -73612 -466107 -218864 -74955 -116879 194449 153597 -230378 81542 -91072 -207430
18245 -207430 -229298 -128676 -181331 -14186 56710 -148220 42123 -30509 -87065 -247876 365940
18233 -259742 -37545 -191621 -12268 -207790 7641 276700 78107 317898 108265 -179387
18222 228585 -244111 -134353 -189082 -41665 18499 50522 6370 -130350 -265868 -84339 -122260
18211 -122260 -62629 8918 -136028 -167813 -254430 -99572 -324704 -185854 16639 129843 -276067
18199 -90480 342493 -122954 -8686 9835 -158938 -88763 -27052 -93665 -81408 -117492 -13792
18187 -138717 372163 -38280 119643 -294441 -99507 172883 -168744 -318424 380754 -4596
18176 -107644 -309674 -30284 -9272 -368690 313655 -415121 195119 -109387 8717 124931
18166 124931 -141241 282124 -153188 149506 51654 -108001 -155192 256367 -15129 -73956
18156 -73956 -239492 -350540 200652 -159781 215931 -119972 -14703 103056 -141241 -51759
18145 -198187 -119576 -73478 21143 -22247 -454591 22624 198273 -218481 31387 -51594 -178602
18134 -178602 -246766 131422 -111431 227749 -64670 -231567 95432 -96602 -371368 161010
18123 -202379 161888 217105 -56135 -76711 -184880 35021 110211 -181186 289194 -136302
18112 67268 72736 -3565 -179291 -78333 -31817 272126 301853 -211329 246020 -59468 -86211
18101 -86211 15677 -111544 -140831 -65563 -211012 16136 14510 -295953 -63369 200149 127689
18090 127689 227336 -372119 -145022 -176875 37304 164619 67744 -137322 -79232 -59257 80282
18078 20664 -97606 182971 -361021 -281460 -219086 69276 29620 67770 399967 -53235 -58525
18067 -58525 193028 -295454 135236 -167432 10467 320428 -181918 -112016 57523 -16793
18056 186539 124003 249455 -101682 -230267 71316 -156974 -135172 -14521 10329 -189624
18045 -14641 140935 -40953 177331 420323 -31628 83846 13555 -205285 -226413 98867 171664
18034 171664 67608 -4114 -39923 -75016 -56035 11246 12003 -15382 90682 -59145 499963 -118129
18021 193069 254176 -259196 119941 38562 -282517 -116091 319947 121258 -61460 83372
18010 -310773 -125641 -25384 24549 -61179 -2341 63550 46930 -323080 -164311 -242177 -303598
17999 -303598 -208145 10729 126367 -214631 -95339 115934 -110019 -479769 -2272 -72616 25563
17987 -286101 240191 -124513 -44051 -261616 -295654 -183019 -139145 -123370 -170598 -257889 -208721
17976 -208721 -315083 24783 -4828 -124005 -355226 190364 125186 -236618 59300 68941 152494
17965 152494 -74873 347118 -116370 369706 165177 332847 75596 93771 55871 -345303
17954 281556 -5881 -139765 106160 -42613 136259 64228 94413 325562 -8926 107041 -40065
17942 -153644 137408 122016 101977 215586 172536 -29459 -352439 -212892 -142629 -275087
17932 -275087 -98832 5048 -13150 80540 -153798 220291 86714 -152423 -30103 -285830 -206977
17921 -206977 77552 -67068 172743 248802 210002 -270010 -358253 -194174 -38719 29147 -90800
17909 141178 -72181 -5929 -212910 -113539 191695 -172718 97106 -73826 -112663 -156768 65377
17897 321487 52251 -243144 -95254 -1907 145246 -436902 -43044 10301 94475 202303 123411
17886 123411 -203185 -196856 321823 307635 298261 200341 29077 -137989 89181 -175870 -100305
17875 -100305 -182266 236397 185996 81325 -53092 -261022 -129411 270993 69789 31242 -228339
17863 -104136 -338571 -50931 319578 -241545 197364 180034 143739 -162344 -97969 30919
17852 63121 113976 34475 -75021 141171 -457609 -48471 -386183 -285291 -292548 91043 -212074
17840 -281612 52881 -105110 104866 210153 35452 35714 120846 -86601 183472 -341007 33043
17828 -384026 202156 -33984 -105849 -341498 90913 -35994 63000 201878 107777 181557 -82628
17816 -68629 114222 329143 60709 19043 138532 -56668 -122848 -103209 22832 -41474 -27320
17805 -27320 19210 -205961 -119850 256107 -144249 -137010 -99915 270018 -297135 254386 273190
17794 273190 62904 140423 -61055 -153810 -337819 -79098 1815 -115936 -47995 -33620 -86244
17783 -86244 122133 142746 -324991 228626 -93878 186943 -29440 202432 106608 -45255 70052
17771 57932 6813 140210 113319 -279351 -138209 129903 -142008 -130272 -14509 155877 -159390
17759 60677 -15412 344931 157122 16344 -68354 -182240 -117856 413856 -129159 165756
17748 13521 -58722 63706 -119372 -130988 198547 8960 200241 423443 -70376 -24667 74492
17736 342384 -95979 -55382 -219086 131086 -170224 92854 -368414 -126176 -168609 -109142
17726 -109142 -145827 147494 -572 -43109 -55534 -22022 -153326 -255782 -75853 97127 -38648
17714 -144391 -143287 -155914 182427 225283 -70022 -172101 313594 174907 162018 -241912 93042
17702 -118684 61404 274028 -285436 18745 -84709 -215887 -121834 184053 -324366 175890
17691 184268 -178866 -22662 7777 408804 104053 -189785 60108 -118271 -112820 -183494 -452623
17680 -452623 190483 -35936 -28318 208317 -277138 -68305 -141263 -58546 115234 207614 72792
17668 -22523 -64678 58085 198003 -280732 176789 -205807 56846 -87362 156718 -193782
17657 -38107 -365751 339 13620 132095 102996 237018 -151229 18111 -141642 -151314 125599
17645 -228865 -126444 109803 -22053 -340621 41057 131804 -255982 171977 212532 -72771
17634 172426 275993 198119 -201325 249613 -58165 -105221 34516 80163 97215 40556 -40260
17622 82353 101433 280417 227294 246856 37742 6344 -9551 126054 186718 113757 -91041 -36044
17609 76480 57470 -23107 19730 48008 -3907 -315252 182962 -221252 21609 66042 274135
17598 274135 118943 -273514 111609 -57357 -106704 250643 12967 -174601 -147963 232363
17587 -288027 30516 12044 -67549 309895 499043 4935 -66812 10711 27192 4619 -22682
17575 -21503 202225 -7762 -140747 -291375 285845 119503 355659 -228931 40773 216774
17565 216774 -279227 180840 124501 -38957 336242 -271708 -133226 333166 156876 72733
17554 77175 -43873 106959 -65654 -167957 8892 11405 75305 -89557 302760 77352 197752
17543 197752 398023 70541 188435 255016 307191 -113699 54002 137732 -98997 122403 161546
17532 161546 241919 -182595 151514 -193031 97363 52936 -157768 3677 145686 61612 350425
17521 350425 185320 -26573 -7065 333666 57448 286331 -50673 -184285 -194127 153070 86100
17510 86100 360826 321349 291953 191812 63560 43693 2296 130299 16091 172169 129404
17499 129404 180013 82069 -139332 513818 169198 -136819 171057 146638 151394 -133923
17488 86947 -5216 146968 -49287 19640 -54207 127084 60204 212175 55730 223712 -83806
17476 188663 -15647 155277 -183553 143688 -33811 60758 225596 111049 164405 84191
17466 84191 -146325 48207 -126508 206247 27043 209393 310092 -63500 179842 378319
17456 378319 120479 36670 375019 168994 282285 350323 328994 578216 556410 646336
17446 646336 688871 243178 312317 94239 -171816 326060 -27541 277891 58441 228842
17436 228842 500719 438228 377292 276768 116776 -11998 294166 358334 -23363 239327
17425 277207 221679 268183 643527 223175 355101 302742 214881 384639 412765 102962
17414 443310 319363 15331 211134 300130 148821 353692 114790 193115 -38951 229002
17403 -29414 -88334 319099 57172 413025 301246 31425 23673 61493 352185 180878 130465
17392 130465 519858 -243386 241875 278408 298927 550971 188866 85118 312908 140017
17381 312996 220576 295150 344629 121727 68484 268540 48051 174693 56216 117830 264599
17370 264599 178254 23724 242713 -57320 -34561 60681 75259 483935 5861 -35584 -19282
17359 -19282 4367 84841 138325 260179 320403 -227635 -50351 252535 191322 -56569 712083
17347 180430 82125 57945 114768 143626 266084 370011 239528 -30157 -37342 -21371 1839
17335 28273 448084 426797 158721 32178 34638 345624 229383 157898 116682 377066 241202
17324 241202 -43770 307417 -265975 323446 -144870 8056 55001 265514 339045 -5974 -36283
17313 -36283 250672 147588 16828 225993 197321 117702 -83891 51570 90401 32241 45348
17302 45348 199419 271998 234217 -192551 198959 75435 454807 312498 -228246 365371
17291 382088 -47024 425457 104378 192836 199910 205197 517651 454020 144944 -184067 265995
17279 -226165 380393 60844 21119 80536 512207 34970 67457 332041 -62785 123872 -143544
17267 178258 219131 329128 555990 -31051 -35393 117013 128866 414127 163849 263691 -213392
17255 71479 152400 475620 348570 156085 330843 36925 186458 90277 259067 169211
17245 169211 283462 227151 283637 222831 152561 42428 -207256 230192 268395 217256 104567
17233 110398 55908 256882 270796 171931 263085 145583 202582 9159 78261 262798 582896
17222 582896 -89642 176428 -181884 -250307 31223 219181 -5669 190082 145440 103058 394902
17211 394902 245215 219240 253940 484749 179518 113152 71018 380269 155849 158885 373080
17200 373080 123555 102223 207786 282338 142087 77673 250996 481836 637861 219858
17189 247964 261194 180302 432109 290003 143525 132961 201219 203423 137617 252471 189798
17178 189798 274960 492966 201199 188343 161696 565553 -190383 621938 90736 372791
17168 372791 143663 318222 386107 176718 487542 143232 526316 569683 -3201 507147
17157 -23050 295460 411326 193773 504955 167809 -219085 -45552 203961 232559 428520
17147 428520 592257 230477 303451 665970 278181 -31894 371931 490306 362385 236159
17137 236159 112008 561507 538010 -100651 289633 301375 96214 230445 651285 182831
17126 324457 300141 520940 197993 285518 370725 53052 161559 382172 457877 559397
17116 559397 418022 190891 182521 294499 423731 304877 377124 370744 544255 573715 540258
17105 540258 353272 229796 313666 340207 357454 264315 506175 100807 157959 691770
17095 691770 189606 298912 338783 281895 455958 271772 361158 257872 263237 240153 591915
17084 591915 139050 216961 513070 488957 386925 487644 541094 495761 598304 284025
17073 581312 601234 434710 612446 888088 577922 651256 390782 333195 214977 321209
17063 321209 482187 257810 301481 524477 402509 656480 509048 630470 600171 383052
17053 383052 426484 778347 630043 523644 399719 357869 424122 377521 633957 133287
17042 461355 328822 396937 631462 406676 689463 569259 969479 798055 591561 423762
17032 423762 483951 442664 588896 527813 626593 549886 745536 608493 675720 487240 656721
17021 656721 640863 831864 793835 564118 736402 816496 462372 617609 984578 945875
17011 945875 864391 696284 571386 693749 1088354 561820 836593 788203 675953 376746
17001 376746 609235 569096 590383 711465 723694 727698 710280 599354 688860 581537 798327
16990 798327 872179 878839 1037490 961814 666833 828083 1050980 547298 962976 952740
16980 952740 589710 1062465 773123 904071 1060195 739589 1188310 673776 682731 844235
16970 844235 791471 757351 927203 928152 1021433 1029851 949655 1130421 817461 1055137 917073
16959 917073 1160828 1056449 860716 807767 1017194 1081162 1241096 1020996 957449 1075443
16949 1075443 1134334 935648 1033922 838713 1288543 1111764 1155274 1163833 1028591 1333788
16939 1333788 1369782 1300840 1034172 1180667 1317114 1470021 1271808 1416429 1654572 1623087
16929 1623087 1280206 1564343 1528694 1256739 1455929 1116985 1495683 1212823 1608132 1059638
16919 1059638 1474060 1452481 1555953 1758292 1544754 1284827 1277088 1417378 1600485 1497594
16909 1497594 1779482 1602092 1496395 1875224 1786450 2019109 1751883 1723767 1567071 1797356
16899 1797356 1686770 1698085 2254020 1881692 1623775 2087493 1994586 1808798 1897978 2326528
16889 2326528 2123704 2049836 1911371 2159075 2277373 2289202 2072866 2403032 2021963 2610183
16879 2610183 2026796 1961669 2497522 2798368 2178533 2494587 2631041 2442436 2336918 2533810
16869 2533810 2734381 2591527 2556596 2644750 2768051 2797935 2984895 2759110 3060521 2918738
16859 2918738 2847694 3195790 3322789 3492896 3267887 3268508 3224428 3550586 3552372 3418007 3270183
16848 3270183 3389269 3507112 3621133 3507452 3475190 3933428 3696262 4060629 3750291 4114675
16838 4114675 4315560 4366215 4015455 4260925 4350676 4340683 4662347 4602617 4614980 4793023
16828 4793023 4920576 4872345 4867149 5219264 5495034 5466963 5516576 5535905 6055298 5895196
16818 5895196 6127857 6096910 6063467 5994660 6533845 6740689 6679847 6797763 7229439 7719997
16808 7719997 7601046 7234511 7909099 7751485 7929836 8335842 8795206 8598672 8951383
16799 8951383 9011346 9277602 9567446 9869038 10146062 10344011 10693848 10667074 11044194 11384936
16789 11384936 11711633 12243640 12530756 12785052 12723170 13527471 13873008 14470749 14761288
16780 14761288 15010568 15878146 16507613 16668734 17235801 17903458 18666319 19044772 19628127
16771 19628127 20398914 20958240 21700573 22567927 23529150 24528270 25607273 26637174 27288363
16762 27288363 28611551 29677384 31417083 32577775 33761594 35214852 37196556 38757302
16754 38757302 40378744 42471636 44365791 46484092 49222525 51650603 54331872 56610115
16746 56610115 59591616 62982787 66463579 70335208 74030604 78022718 82536630 87169347
16738 87169347 92080602 97217426 102889878 108412313 114353555 120614172 127204856 133052182
16730 133052182 139534741 145912500 152261808 158276972 163793927 168615640 173157062 176448885
16722 176448885 179166150 180245786 181220909 180526870 179158508 176311686 172848338 168573546
16714 168573546 163517400 157858917 152092475 145978272 139568922 132913952 126661260 120213663
16706 120213663 114021401 108133610 102165892 96441103 91150970 86549267 81940701 77441927
16698 77441927 73266914 69233795 65838782 62325726 59088732 56231607 52843620 50530457
16690 50530457 48162216 46168696 43486316 41650896 39475111 37958525 36423581 34744547
16682 34744547 33338251 31812745 30495243 29371078 27941672 26980989 25799366 24786174
16674 24786174 23880545 22785969 22580357 21482258 20922101 20017731 19301199 18419758 17946964
16665 17946964 17434299 16499548 16375032 15675162 15178192 14876074 14324605 14222332 13407310
16656 13407310 13261409 13053090 12495908 12101285 11565723 11579386 11188203 10933850 10495475
16647 10495475 9950599 10082681 9800342 9517783 9267175 8938338 8974106 8701423 8052426
16638 8052426 7916428 8219916 8056968 7642876 7500071 7415801 7478828 6748751 6979290 6384361
16628 6384361 6471608 6262148 6311280 6373930 6313277 5867392 5693027 5833041 5552019 5369455
16618 5369455 5348843 5304142 5335328 4736965 4725103 4916871 4474041 4793891 4610223 4509092
16608 4509092 4677442 4504432 4087591 4203078 4025554 3998737 3945400 3819168 3894641 3803531
16598 3803531 3398460 3725446 3673083 3126674 3298648 3130727 3222274 3570175 3271300 3152183
16588 3152183 3045352 3206073 3125427 3087561 3083843 2634179 3058813 2983017 2509381 2843841
16578 2843841 2539667 2662085 2560632 2684840 2633105 2498548 2341656 2275150 2357655 2337734
16568 2337734 2283706 2182410 2306653 2306185 2143649 2406185 1908519 2361939 2168601 2299659
16558 2299659 2159268 1999054 2254488 2039715 2169583 1898253 1760895 1929256 2100093
16549 2100093 2008827 1892792 1758428 1720374 1871715 1923820 1994163 2013115 1721718 1947368
16539 1947368 2178615 1573627 1586302 1870581 1363538 1351064 1506028 1408303 1704728 1548743
16529 1548743 1671713 1487197 1752571 1489928 1411995 1410851 1423451 1429113 1260752 1304443 1330569
16518 1330569 1426396 1053145 1444845 892076 869358 985276 1326694 1214903 1155811 1073936
16508 1073936 1413740 939187 816398 1118848 1176404 933567 1292808 808805 1021706 742304
16498 742304 990306 897989 879091 837638 1189050 985133 1072345 775311 1078854 850822
16488 850822 1117927 940570 1206495 839577 986774 1048220 977515 554796 786321 949936
16478 949936 704627 759464 908451 1076314 1066118 630591 357003 628663 741848 689301
16468 689301 903030 835332 689188 646943 730188 746326 695795 1028279 752834 744567 718144
16457 718144 578116 798558 751181 595834 910987 802520 658561 664176 1095336 850494
16447 850494 542595 598466 714283 419764 986046 593799 499076 724922 737313 469142
16437 469142 724176 948228 748126 1004981 498352 685066 375035 495395 684129 392796
16427 392796 444387 437799 445514 404463 794033 405112 498858 581397 695999 249713 450500
16416 450500 653027 479112 507490 378284 474136 415565 462330 589324 696800 839558
16406 839558 571652 759271 273185 788317 322639 619194 556710 661859 332813 903578
16396 903578 641141 499800 321500 633247 344825 525528 507862 441608 282048 563347
16386 563347 326491 773528 214894 544694 206420 528120 555658 320059 479378 68213
16375 133951 558373 426412 143158 242728 162540 378149 298236 369843 279058 680615
16365 680615 59043 513216 177990 364230 220461 417012 600884 230574 434010 399590
16355 399590 458735 460644 632241 414959 284591 467057 196677 296417 414302 708158
16345 708158 627224 585308 123316 320884 231050 470365 171396 205222 391403 361352
16335 361352 130225 150701 289629 280150 -30339 288390 480638 127270 289205 93722
16324 246312 162424 949444 103689 237329 73267 45066 719335 148160 139281 124478 231202
16313 231202 173237 377901 114389 726982 24247 134968 692692 274800 321562 465544
16303 465544 6813 514762 506602 368895 200451 363931 211280 174011 314976 213228
16293 213228 144924 -54483 341935 98521 305667 120562 243660 243543 249665 245219 58242
16281 288079 359991 -183181 413405 157514 255996 565176 173341 -14846 247483 307327
16271 307327 169649 168090 -89544 292333 509606 248488 12292 -39642 304109 96197 -23754
16259 101274 -317507 116369 259460 332180 7504 2143 208440 314119 -293162 -90377 301578
16247 376539 128340 140558 63855 203511 233384 386707 216081 229501 160501 -210603
16236 417371 109066 179582 21771 231590 887 190704 525911 296202 122433 43260 184607
16225 184607 255118 300293 480229 203292 265968 118977 187526 70384 -171713 149955
16214 52728 61217 147640 -143565 316939 175073 336608 112224 136096 158049 78063 -133480
16202 -221088 28189 271040 56019 -120700 297520 14891 -192860 476424 2594 645674
16192 645674 359560 187632 -112696 38866 251972 -118805 212666 37396 323201 -151899
16181 229198 -221032 176700 30387 217101 322974 167295 313739 209214 -219933 109687
16170 352433 148879 339131 21781 278569 317817 17247 339535 196313 -330687 180799
16159 -78805 112146 26986 194977 -155464 100972 190138 235056 -53023 -93924 196030 -138342
16147 427525 117514 116744 17510 174921 232124 11511 97526 23528 152736 122180 -114002
16135 13936 -133593 192056 156898 -72050 -159671 334147 -56330 43682 17568 13877 7343
16124 7343 221603 -85927 486144 -44148 346970 -112009 -166359 -433912 78846 316636 49829
16112 123011 -48376 -214250 63962 531 -203613 362832 42923 256846 104623 128748 132192
16101 132192 16739 226474 191942 -36568 193057 -117281 -29325 -26460 124829 305928 2539
16089 373705 -232261 -224117 -157445 320850 105483 5945 -50547 -201267 -139467 141838 -52518
16077 142784 157309 227634 40931 94761 214473 -70543 141439 -80626 -220595 -151041 -290443
16066 -290443 243170 -56466 -271370 185065 -144629 -234364 -3915 -42688 37694 108377 271716
16055 271716 71857 -50309 259151 -145544 -190966 -328166 -281099 -206269 123222 322801
16045 322801 -210315 260183 -239202 14842 196181 -288708 132915 123030 91745 -263080
16034 59139 -5850 81763 -161247 -49094 20054 96293 224036 45465 -168040 -67846 148621
16022 -118960 214761 -31706 -156789 -89635 -126849 368671 98245 187853 -197625 -55409 152009
16010 98885 -60593 -3203 249372 -265975 135761 167818 151595 212555 -41479 139041 20667
15998 -7927 -52593 -408258 123865 -298658 -18689 -163005 -91412 -38184 -218432 190159 17917
15986 96466 73634 -176485 125570 -139544 379389 389160 35821 118446 424025 45563 -180171
15974 -596247 132339 -14365 191677 -108107 196611 -124038 -179511 85271 -45121 -158245
15964 -158245 298275 243266 12634 128120 5414 -69934 -152105 114096 25662 50316 -43363
15952 207203 16711 40570 119056 -242115 -17612 235755 -107957 -111670 119799 -93341 -214371
15941 -214371 -372426 117994 -125905 288308 -149622 -246522 25283 378953 -191276 -345198
15931 -345198 76332 35520 -175338 -296227 247658 -130584 -35860 290245 -96256 -256690
15921 -256690 180822 -170554 422221 68430 95467 -98670 -199044 -32938 191781 -661989
15910 -84713 -264888 -110514 -108730 1478 -193356 20855 11738 9017 98635 17551 318887 -138634
15897 -161686 -170603 -100180 240542 -26211 -93532 123840 -130598 140118 105138 14261 -205488
15885 -151668 -48838 140331 -7248 93693 -169772 126922 66550 -294238 -297313 -29063 5824
15873 165583 151482 -158170 314565 -205423 -192782 291952 119511 -198773 75076 -155017
15862 -218212 -195534 149623 -249908 26406 125910 87455 153268 108729 28 -181457 -17715
15850 -322817 117451 -85029 47055 -117054 -116817 82447 -24394 116311 106560 135450 106006
15839 106006 -265892 56795 21794 115213 45346 20884 -15708 3745 177886 1722 -64069
15827 -207597 37096 -147432 -89213 -270875 -71543 46945 -59981 -153314 -106278 -44751 -242574
15816 -242574 -259078 -312709 -84874 -17503 243687 182275 102940 138994 -268100 71274 -125835
15804 200206 -205381 -20895 -177886 155757 -176610 4028 95263 -226620 -55275 -79221 273278
15792 -131140 9523 31452 143018 135103 164707 -33069 -62788 -81238 128971 -191125 186492
15780 6522 70437 -360464 -76728 -110441 85855 159650 67181 136405 -441975 38280 -388619
15768 -121316 -357922 81422 -170296 -144792 87618 -101832 121625 -76967 -242865 -43237
15757 -148217 177719 -141504 37285 -71885 -106138 -96373 -92877 26406 -263153 120200 -136696
15745 116170 -185314 -15902 264434 30808 -106387 -56569 86023 64984 -228456 -143279 -186420
15734 -186420 188952 121150 77866 -44642 74440 86039 159867 249777 8966 -24008 54156
15722 -144392 43352 201621 173979 -49790 -147540 -147939 44331 148647 15408 -164541 -50741
15710 -85363 144086 -117429 -44811 -51579 -87796 -90480 -204201 -70353 149565 -232752 -93938
15698 -204822 25980 113317 152803 -181162 -134482 -57222 40952 -381472 -204893 49003 30889
15687 30889 -170560 -96032 -357122 -188071 90617 -33598 -9696 78070 181571 -166462 -103163
15676 -103163 -267033 110044 -174166 196412 -267580 163167 -7550 -58233 -344101 -108200
15665 303622 -77978 -288125 72971 83818 129414 -227541 -173911 115997 -142624 -49643 242850
15653 -21001 220259 -199118 -213104 -326889 24314 -77512 -260617 -77201 11884 190965 81100
15641 -501654 175182 -182203 165953 -121686 4596 -113419 -118710 48304 203313 -42475 -172011
15630 -172011 -164292 -154283 -358620 -147809 -124732 -33501 51814 -99291 -16055 322526 61898
15618 21831 -253483 107945 -69605 34462 194588 -96489 32464 161785 -78891 -89183 -265963
15607 -265963 44425 -168116 -331317 -11593 -239109 -19841 -56042 -116069 -47930 143288 58477
15595 126580 9869 56255 17180 -90576 -4863 128894 74510 272770 -125366 294133 72016
15583 -444949 168466 -58176 183040 68259 -85173 -89777 -205607 -49812 103237 -117756 -140061
15572 -140061 -301609 -255255 -22473 203970 -203999 -162979 -152836 522507 -293133 195550
15561 -113351 -269577 -232156 83584 -34805 -89570 201848 29342 -52266 211881 291686 133959
15549 259361 -100527 -134282 -316996 -204780 -404254 116903 72799 221994 80080 188751
15539 188751 -32392 -224594 25237 -382325 83738 -118067 86518 -5795 250428 124885 22044
15527 -70857 96721 37926 119677 287490 153146 98746 412162 104197 -156592 143240
15516 -95830 185760 58065 524300 192398 65022 2051 124441 -168162 -190224 34269 -8634
15504 -72814 -96767 -223878 -30389 -99265 -151315 -58411 -334578 -27043 -151818 -86242 109776
15492 84284 58860 -111679 42197 92022 -168887 -130232 -172691 19934 -202540 42032 131723
15481 131723 231640 -139445 124713 -337702 146371 -8288 241868 -64078 -93525 39406 62977
15470 62977 -235084 -73739 -73299 -942 126476 -42376 864 -102108 -130981 -19746 -18816 140708
15457 401120 78219 21233 223559 318512 265531 269789 -18960 -146316 -75901 -185410 22602
15445 357728 321981 91661 -223614 -113017 54350 34269 -343953 -424751 110887 253307
15435 253307 -270236 35317 -328366 -295263 152844 30900 -16522 52215 219318 254934 -81327
15423 -68523 316595 46699 -157685 68632 -145428 -106760 -23478 223050 -132808 -26917 -305282
15412 -305282 5658 294820 208721 -265104 151735 -99006 104087 195764 122315 192840 -75240
15400 42227 -154021 -70135 -295263 -155489 -63593 -68899 -45190 -227347 -137277 312527 323085
15389 323085 -72515 -294193 5872 200775 -115860 140611 265338 -106851 -76334 -159073
15379 -159073 35123 212655 145670 -4549 -55683 -154431 189971 -357802 333539 25406 39123
15368 39123 17624 -135043 389443 -201294 193232 -154858 -154508 207324 -10096 210763 124274
15357 124274 24163 -67154 -209469 -83327 -140159 281166 64642 -80363 47308 -186232 285063
15345 -87915 -95432 -304016 -172498 409553 183228 -103687 42556 290643 -56545 -59409 385617
15333 284959 3035 -1986 -84723 50381 -273336 20563 127567 -128051 249697 60478 41813
15322 41813 -46050 264911 -145677 176358 -345362 136737 55200 305205 -129360 -150653
15312 -150653 391972 76464 -105058 312449 -36481 260406 130647 -217524 283670 167192
15302 167192 -85779 -14766 -3038 126505 10696 -341716 -86521 29410 49339 -392708 192844
15290 -406377 46514 -24347 212436 221319 -368636 145485 229398 -95346 486410 -18144 -957
15278 147306 37643 257379 184200 106459 -164304 208116 138652 270287 305114 144640
15267 -23058 84890 5852 105448 293867 -134887 -116818 -80048 -101276 159771 165533 -244056
15255 193853 -111061 133631 270655 284291 230751 255432 623276 1422739 1836937 1568510
15245 1568510 1970018 1802961 801125 450892 29235 452724 -40905 176783 41083 477763
15235 477763 47578 131233 277547 156155 215109 339886 -250213 -88307 -55500 37476 229014
15224 229014 8257 -169284 -116538 -70971 119085 152644 -151577 -71527 214367 129281 193673
15213 193673 -371492 -5535 -76157 -94365 7576 -181912 63824 115663 451158 -393128 -74028
15201 -157526 131257 -159512 -184690 -236572 171478 84074 104603 230185 -182047 -11458
15190 265729 427716 -146033 88110 97078 -148186 -7702 169062 20932 -47122 -274694 -119473
15178 177640 30898 15399 238590 54792 52532 53170 143968 395747 189549 -163779 76153
15166 -202104 40046 122203 -37244 -262983 202102 143353 292137 98370 -76318 163435 183361
15155 183361 313617 68827 818 24284 -97516 305729 -8773 145950 128703 85590 268338
15144 268338 -185206 -270688 307380 74890 96011 127696 267937 -20210 85696 174127 165470
15133 165470 111302 118589 14855 239740 187448 -24960 -1202 97442 65969 -17033 -216265
15122 -216265 22684 -13713 -230291 135856 193556 401820 276658 259438 365703 -76875
15111 175834 366858 250027 42281 481917 368152 101847 274452 215848 18575 204480
15101 204480 290676 -86491 259967 354203 115516 345187 144381 -288839 325339 -87284
15090 27634 74329 188950 -310827 -176238 330117 359408 163438 -79117 -314256 272964
15079 105706 455747 403132 103203 336872 136575 -334299 664957 -221424 -78573 68040
15068 228814 67002 37109 -107426 265694 152038 119603 131547 159740 170829 -14130 173994
15056 413239 -21372 287655 -33751 338252 -442587 300315 379678 270229 415222 142542
15045 -44368 236231 -101727 107747 -129897 5616 112589 332790 2537 385812 234295
15035 234295 333009 287120 215076 6049 211845 77236 313876 29611 494551 346951 -104882
15023 304558 105677 -76939 429704 578201 67156 166502 476417 194660 352468 501127
15013 501127 415550 365761 248022 -41775 473164 38151 252914 53801 -110112 298052
15002 551268 -142649 196658 491011 89071 181071 -54863 112021 326836 217044 299159
14992 299159 234803 172522 405240 95690 138534 86870 513073 568012 -113003 84786 280931
14981 280931 164098 196115 294097 282792 262700 461938 172295 196158 454929 139706
14970 62630 219548 421523 163937 55265 187210 -285260 109846 300172 279858 441009
14960 441009 393443 150702 471359 -97497 377355 345705 366658 236117 286665 14054 173307
14949 173307 211067 120775 313987 167939 274381 128685 256797 290608 117376 294084
14939 294084 121631 124130 -86324 347691 78529 -66845 68007 215527 -305352 -8685 150648
14927 119353 216967 121452 146453 -185655 323637 224869 90540 220606 396148 377425 302450
14916 302450 325745 452206 363711 480480 754772 560098 74007 144365 644973 38226
14905 501369 256592 237240 181435 -90511 1841 418146 267398 278628 179383 28829 245745
14894 245745 328248 527814 104880 419341 438908 499759 121380 259006 278428 428940
14884 428940 412059 314419 238994 429886 154652 339875 550650 263868 293977 140228
14873 389145 408162 287571 293193 480994 518838 242557 605800 494037 311549 194559
14863 194559 555548 447834 405141 587069 396511 339577 541838 434945 249927 33028
14852 290009 247139 336591 324532 553013 161815 268367 133144 256389 440880 622087
14842 622087 392313 321816 543995 420991 762343 902567 411412 397999 318796 254685
14832 254685 421740 645883 377035 694900 178079 574750 485093 417104 403117 167925
14821 585150 472213 334732 664643 887176 656240 696370 360846 745802 363440 521147
14811 521147 298340 96683 169516 410003 423042 539398 729326 564577 381570 267157
14801 267157 413107 463611 418645 726595 530929 450912 541642 449781 290208 571415
14791 571415 657213 543477 616158 767127 746300 330310 875176 477041 552794 276494
14781 276494 369590 685454 673531 335121 728331 610486 1054661 502906 697534 918313
14771 918313 828752 808018 558144 699855 422374 611543 450297 761744 520419 527922
14761 527922 863095 603007 734349 759107 901496 1028595 652660 703686 545830 672216
14751 672216 710863 599143 484403 752785 512611 679029 424979 691355 724112 784205
14741 784205 744368 778424 573258 758175 894366 578359 947647 505229 537159 776628
14731 776628 629914 973441 816658 697531 561898 819235 654646 694330 933539 699448
14721 699448 872959 641081 735532 667790 807861 864276 644044 868931 776276 846929
14711 846929 922102 433456 689204 1154365 833608 599877 937012 885773 900586 918321
14701 918321 915282 1061292 691021 863361 1101869 919818 858171 1002714 953701 615281
14691 615281 875641 1053815 1183106 1041520 860871 712831 801609 998814 1147718 864856
14681 864856 995733 1050977 934687 851114 855808 918571 1058305 1060844 866385 1061252 979555
14670 979555 1161431 842165 1173014 940360 746935 903081 1118839 793291 1181525 1262437
14660 1262437 1131023 1044485 1418167 755673 1005111 876210 734348 1610491 1144179 1362152
14650 1362152 1065125 1401899 927634 1241329 1127808 1177291 981334 944921 1171506 1166135
14640 1166135 1176349 1223757 1525142 1704310 1308802 943515 1183549 1017176 1120655 1071834
14630 1071834 1192308 1385272 1031177 1741572 1278288 1198687 1539982 1268702 1466587 1371019
14620 1371019 1276914 1274655 1415703 1491324 1631915 1642472 1870550 1530254 1300845 1069233
14610 1069233 1434383 1627331 1638078 1125999 1284361 1579269 1451794 1655088 1589449 1427459
14600 1427459 1616874 1376645 2027837 1487613 1908080 1696128 1619469 1612365 1771436 1645574
14590 1645574 1903300 1944687 1774309 1894215 2167237 2040159 1784948 2272896 1979436 2234229
14580 2234229 2036575 1852153 1892389 2105725 2041271 1533801 1896259 1932179 2148044 2330585
14570 2330585 1876301 2047923 2309199 2337016 2145854 2659897 2486220 2326554 2314186 2559983
14560 2559983 2681215 3089748 2838129 2906322 3210884 3207700 3289744 3625185 4149713 4598727
14550 4598727 5726901 7404258 10816826 19817533 37500078 45513819 23130945 12982471
14542 12982471 7338110 4088706 2817953 2404968 1958436 2103376 1811382 1933428 2125453
14533 2125453 2125652 2251765 2307365 1798515 2617753 2346642 2234122 2281251 2429914 2553497
14523 2553497 2264902 2483116 2629386 2480719 2276171 2671452 2691000 2633712 2725631 2550917
14513 2550917 2729077 2751560 2861485 2612611 2787971 3030099 2908845 2767973 3130360 2801732
14503 2801732 3220664 2886013 3156507 2893623 3100447 3409954 3514797 3378074 3312460 3447781
14493 3447781 3303594 3694208 3308718 3356086 3263042 3695521 3427996 3653835 3650512 3684694
14483 3684694 3957016 3770376 3776712 3965721 3930220 3915489 4105674 3860268 4246726 4369524
14473 4369524 4250724 4181075 4250038 4282949 4273954 4459527 4360098 4493994 4610458 4638564 4744698
14462 4744698 4765677 4725389 5078866 4634469 4767911 4943730 4835935 4718737 5363364 5499242
14452 5499242 5305412 5254204 5251430 5412615 5379021 5506884 5883209 5961739 5779719 6070360
14442 6070360 5813519 6069427 5835229 6141359 6433997 6228397 6135954 6619673 6502317 6417244
14432 6417244 6876002 6489767 6983632 7057055 7109118 7056394 7450048 7295730 7232493 7545087
14422 7545087 7632171 7569430 7680088 8137576 8424641 8191942 8043608 8313479 8800634 8998112
14412 8998112 8812812 8922627 9070060 9241446 9578652 9663659 9619755 9607365 9880839 10195596
14402 10195596 10425800 10665127 10779917 11024263 11236790 11012722 10963603 11606294 11680417 11925764
14392 11925764 11805884 12322908 12793986 12548377 12781325 12888461 13775980 13531410 13693819
14383 13693819 14080888 14534785 14885204 14851623 15216221 15458445 15983141 16058214 16320471 16532561
14373 16532561 17073454 17734224 17648626 17872851 18110783 18773007 19054657 19162085 19781695
14364 19781695 20323739 20741528 21285587 21594897 22318622 22476822 22865331 23512542 24468598
14355 24468598 24766904 25298612 25756489 26673792 26899230 27464606 28270452 29109864 29978069
14346 29978069 30491690 31414735 32047373 33151149 33797012 35101042 35798244 36462947 38032050
14337 38032050 38869112 39968890 40760898 42436295 43729950 44660882 46296368 47658413
14329 47658413 49090990 50857955 52324978 54132045 55957289 57657370 59776619 61974292
14321 61974292 63533856 66244762 68845046 71173185 74141843 76534971 79379762 82738071
14313 82738071 85992917 89483863 93152541 97004595 100790572 105426704 109648547 114681256
14305 114681256 119760514 125207565 130690793 136854922 143197615 150026491 157312880 164915262
14297 164915262 172906582 181798075 190847120 200548064 210523089 221159780 232337275 244303768
14289 244303768 256428971 269388437 282836751 296713844 310824441 325217759 339857682
14282 339857682 354894092 369543194 384162289 398137982 411535832 424117147 435015128
14275 435015128 444383090 451770870 456334589 458243088 457333798 455324952 452387102 447433743
14267 447433743 443776989 436531124 427892913 417302752 405568364 392874939 378863584
14260 378863584 364217332 349559910 334330869 319432601 304216978 289670205 275876454
14253 275876454 263645506 251088708 238490371 226711325 215714355 204950400 195038549
14246 195038549 185341607 176821999 169021542 161163440 153574490 146277569 139656423 133617995
14238 133617995 128022817 122543330 117447202 112409600 107650313 103294514 98983872 95383808
14230 95383808 91875480 88204332 84779782 81542784 78504640 75548803 72971046 70447890
14222 70447890 67995769 65709853 63628309 61670720 59295505 57376999 55539013 53987059
14214 53987059 52365119 51184109 49635442 47755662 46293894 44608782 43842641 43091620
14206 43091620 42236591 40389595 39065545 37898108 37171183 36307559 35579978 34377478 33688731
14197 33688731 32717467 31787984 31096209 30138072 29708262 28717455 28125629 27304513 26916300
14188 26916300 26053164 25639645 24759454 24444097 24087761 23198043 22705143 22157024 21916198
14179 21916198 21236963 20906481 20406609 20050348 19490399 19293290 18801484 18723380 18399018
14170 18399018 17564744 17614628 16833371 16930512 16428919 16139291 15997846 15658705 15416089 15281013
14160 15281013 15049839 14880037 14559128 14287056 14109067 13568552 13392407 13614321 13019026
14151 13019026 12738944 12500517 12051156 12095705 12270604 11973228 11357062 11337425 10926148 11125642
14141 11125642 10912146 10841224 10364233 10289025 9976771 10082884 9660645 10156875 9815650 9902026
14131 9902026 9285258 9232297 9153606 8925951 9068333 8682082 8854906 8489479 8569845 8150132
14121 8150132 7859966 8200251 7851709 7861503 7881158 7595340 7457884 7573293 6929436 7418125
14111 7418125 6919314 7162256 7038012 6867738 6472306 7014679 6321979 6664551 6529879
14102 6529879 6292001 6121894 6299064 6237929 6130916 5979578 6206053 6129293 5475524 5708259
14092 5708259 5880256 5905146 5264372 5402199 5324020 5462952 5186970 5318685 4919061 5021274
14082 5021274 5100334 4914913 5122580 4890240 4721314 4934055 4579614 4693211 4404395 4348015
14072 4348015 4500433 4443616 4353798 4610977 4266353 4333134 4017800 4383879 3964420 4017196
14062 4017196 4267532 4114314 4145172 4174418 3800076 3797837 4085000 3729391 4059527 3995810
14052 3995810 3992853 3915321 3701841 3832021 3592758 3740113 3691620 3759698 3417008 3155250
14042 3155250 3219278 3210771 3656409 2990550 3363858 3426742 3214200 3265166 3188380 3142324 3225288
14031 3225288 3367784 3500208 3079463 3140586 2926994 3375400 3119491 2880552 3024218 2743265
14021 2743265 2912665 2901049 2763511 2812432 2690364 2805966 2474914 2786335 2392808 2377840
14011 2377840 2555642 2479032 2416478 2480245 2306302 2184478 2509327 2212181 2473202 1931010
14001 1931010 2077306 2453463 2268041 2311681 2186056 2135261 2112623 1906645 2072583 2197903
13991 2197903 2177046 2763394 3836486 5929804 12591954 30029524 46095307 27881995
13983 27881995 14927871 8821838 6900630 5163723 4247655 3957800 3892016 3148028 3028431
13974 3028431 3058554 2678883 2658124 2696768 2954698 2809068 2500032 2405598 2512378 2158627
13964 2158627 2508606 2417503 2123945 2049684 2224164 2238252 1978737 2245625 2127134 1881819
13954 1881819 2234104 1984927 2001779 1894688 2097270 2006091 1783108 2154605 1912726 2119759
13944 2119759 1790873 1478667 2226769 1962213 1928980 1836863 1742248 1787075 1788919 1703777 1880813
13933 1880813 1638613 1797084 1564516 1724423 1981753 1922775 1456062 1267447 1778178 1517857
13923 1517857 1573900 1746101 2029255 1832581 1625471 1662534 1509228 1457065 1697401 1481758
13913 1481758 1619332 1119609 1605971 1706114 1333402 1570954 1288268 1568067 1486536 1351842
13903 1351842 1554087 1201947 1528815 1567636 1117484 1437057 1499495 1382829 1032777 1511939
13893 1511939 1202585 1540327 1444894 1317383 1319850 1324997 1363102 1479379 1271551 1398936
13883 1398936 1365704 1000067 1322482 1335691 1083232 1327806 1446839 1210620 1365640 1261514
13873 1261514 1112204 1365662 1452628 1387963 1056579 1056719 1665004 1114948 1068919 1247367
13863 1247367 1189338 816054 1100793 1176105 1024004 687407 1242285 1069657 1100991 1138091
13853 1138091 1248910 911982 913625 954132 1178222 816024 838557 1000493 1218144 884829
13843 884829 993885 1094324 1226970 1200364 1268200 979450 1260586 951378 1548139 1007346
13833 1007346 485149 931087 954922 1072147 1135000 1149675 880342 971990 1049103 763651
13823 763651 939640 1073559 826213 587774 791339 869318 964850 984512 1110679 768947
13813 768947 1140180 867022 1029323 835600 828769 771263 665477 1092861 832229 861614
13803 861614 477024 900274 999426 722456 734256 460261 946524 712026 594264 674131
13793 674131 732158 676839 929014 813228 783518 434459 731746 1143358 392963 1005289
13783 1005289 1155934 734033 553651 482232 860544 950574 520766 857425 855413 554490
13773 554490 720120 468597 779579 538927 859865 753416 438540 536459 550754 898767
13763 898767 843658 587079 860788 749896 742283 731614 832113 851487 502757 596482 629179
13752 629179 1042021 909686 629150 978014 803496 825072 708458 672289 679003 902844
13742 902844 833760 640169 947675 840790 545564 533064 676784 322194 566408 697533
13732 697533 368294 603047 761016 608996 718363 640983 793253 471010 509761 464607
13722 464607 508886 586674 586755 868842 343785 700336 774812 515555 702357 601121 766769
13711 766769 590514 598945 522182 534386 488323 643584 459127 910945 384012 197704
13701 197704 375955 583005 439298 600946 511720 521192 677212 371514 907271 194170
13690 435352 459423 375853 388190 438546 403549 534759 517860 513019 614889 518032 665592
13679 665592 458354 309779 767989 771771 454694 660349 238193 467870 464893 292808
13669 292808 557182 734766 319958 448806 716678 554721 363963 406919 548800 709165
13659 709165 658949 519300 392868 549546 288396 549730 438493 525732 625068 602963
13649 602963 484884 599261 158419 350263 281284 302311 504309 401673 278005 146087
13639 146087 539561 414770 588467 468175 355337 181525 828827 495640 352563 349517
13629 349517 263806 179501 429640 685840 338574 313448 620287 377646 430939 525821
13619 525821 312534 649663 675182 379466 472623 635765 64963 534513 507727 518097
13609 518097 334690 486074 525378 478380 503837 534661 509356 439747 447057 494537 283178
13598 283178 583847 545941 488274 380698 413903 -3945 283973 514508 -32807 397947 177762
13586 329915 485647 294102 169702 445413 280119 575693 153200 540381 319163 536906
13576 536906 819176 185293 707083 271166 497673 477382 426792 510983 522242 295653
13566 295653 424451 475255 466251 50209 138877 390436 46169 522183 352473 491770 292734
13555 292734 115049 255256 449574 318312 589258 430813 392556 586768 492746 305249
13545 305249 449406 291966 510712 638487 614194 65665 305197 130287 346781 96476
13534 308342 238606 590251 314119 437769 326792 328245 211136 214929 239907 174865 189902
13523 189902 356036 107884 66258 673127 143783 481320 55678 136547 99759 558365
13513 558365 529276 511001 156720 345275 493276 289387 416935 52546 431523 429965
13503 429965 147964 186695 300666 -101571 154571 21872 485100 229192 269521 170308
13493 170308 593821 126952 428057 122333 303692 476865 425124 186521 -71219 285161
13482 376162 283094 1673 154187 530210 293290 203435 106969 15034 85615 140683 -43925
13470 108048 347887 163531 117433 -68639 197586 184946 243817 411800 94586 141919 290269
13459 290269 254745 359879 201189 340322 284522 -146943 173104 185604 274169 214824
13449 214824 286144 154675 165378 155609 91219 298806 -33021 43853 489306 353243 155000
13437 330652 133692 -157047 102985 145671 -85071 555204 235776 50784 101041 186059
13427 186059 129386 229411 184959 238821 426907 465000 357191 303151 125798 271010
13417 271010 272267 149410 53811 585209 222074 329485 313012 520163 346964 389728
13407 389728 133211 94054 67860 256728 198849 -64338 313298 373101 -116835 203492
13396 262106 136623 -250435 416601 130676 155815 65473 109963 173422 67913 -214090
13385 168215 380288 376854 254002 466969 233163 522671 -69690 466066 303183 386105
13375 386105 155148 181807 452002 469712 286297 -137522 205342 449302 118439 140702
13365 140702 182850 389194 319322 280666 185443 -113025 170611 396820 579998 -26096
13354 377607 355502 -36767 50560 -200418 359797 232264 -151227 -103487 130967 473221
13344 473221 187111 266818 173919 114189 524745 807617 548414 375934 325626 205948
13334 205948 394019 130333 161050 103137 394454 142921 107350 32364 649088 167422
13323 1290 341266 705311 317072 126144 411500 339884 475421 502299 453573 500792 720935
13312 720935 315448 99945 158698 260391 159816 383000 245562 33451 431276 200432
13301 81639 165774 -146548 264040 -298026 49492 166741 237979 -126013 97641 144105 332568
13290 332568 131797 -123431 -136451 225622 88755 148731 189106 254564 386941 244379
13280 244379 283616 -303054 -184997 150540 347138 60001 24017 -173331 -70880 278211
13269 -100092 319991 150126 325902 125595 35690 44887 180369 29673 -72083 43956 482582
13258 482582 18111 393366 86797 -70459 -166240 69991 290213 130469 3973 -54390 319572
13246 126534 127688 -47250 124843 84171 28375 92722 -65359 130935 111732 264386 -66073
13234 102989 44665 -35539 9300 189792 105199 317002 93842 177341 277156 193929 268686
13223 268686 274985 169476 230330 180507 225785 21288 370004 36441 238053 -19193 37807
13211 -26979 189902 227843 -282173 -36942 -75488 -32541 168264 -460504 344389 -145228
13200 68230 86838 492080 241260 249737 224896 252739 339582 -14151 184396 69827 -6033
13188 -62159 -89779 -13103 259442 243480 413811 39274 -264294 185120 169169 51954 -174590
13176 16247 139119 33158 131374 107916 -413103 200400 -57640 252514 326149 -133080 514995
13164 76510 128966 69543 91178 236724 -4343 -42128 190281 344500 3402 222118 52115
13152 127969 437130 187419 424322 -187306 56589 80122 80969 5121 29030 349048 -212682
13140 -139419 107358 479345 109767 -97320 -863 220883 194288 -9655 -156178 143367 99720
13129 99720 294551 192348 40461 -74101 -135633 300109 190783 -115675 75524 305045
13119 305045 -26445 4657 -107365 -83428 92637 29308 216104 101546 265503 90771 90816
13108 90816 66738 284958 -78154 179969 134907 177798 -53771 116010 16291 -147767 -174685
13097 -174685 236544 -26748 232025 291704 155398 149694 319562 -192741 -16299 471083
13086 -103078 218707 66737 240517 -141021 -11198 -50590 333132 68458 251771 29121
13075 73040 409930 99202 -446344 6123 150580 -75205 313298 32866 -26987 195425 -77657
13063 124671 166982 -93575 21309 496307 -95924 308589 -278063 238292 121354 220028
13053 220028 174286 78622 -224378 352634 -154269 77185 -52241 50347 266580 118380
13042 128058 29805 208938 78124 86564 131889 167235 -67751 56516 309827 116890 -66290
13030 49848 -229153 -47917 89634 -69857 27888 -46813 495243 199617 60059 70811 114224
13019 114224 89695 268441 -136219 139571 148883 -28531 242960 293115 117682 -1156 111079
13007 -81370 -199990 125155 5122 47052 82499 106506 118702 161015 -146540 -320404 -44256
12995 50241 195205 -155009 -12743 183380 115089 -17996 233142 282269 445618 232682
12985 232682 97432 -145102 82255 9163 -35814 -48157 102649 39539 118446 82790 -911 96927
12972 33162 82760 -100033 18357 95889 -182972 -58245 -103443 190191 396881 88303 -294638
12960 99613 -267318 -201984 176717 190304 -239453 -187706 -169099 -80269 52125 107982 -152616
12948 -215639 147080 27202 279540 -3150 223890 -120956 63384 -526706 210057 415801
12938 415801 88095 46576 -147438 -89291 -8650 -216472 165800 -18089 -104390 -104741 -93569
12927 -93569 -95830 -26122 -45864 89058 -186298 140495 395690 173955 -86495 58962 -511110
12915 373378 340437 256422 168016 211989 6057 170129 -38444 331456 316232 -135231 78666
12903 -60489 375104 -27807 148102 -167673 5092 9152 193703 -13061 -258388 -206308 132178
12891 65995 50638 -119955 195943 63852 54538 128072 145025 -12492 -363956 141288 289509
12880 289509 251697 129455 48170 227440 88109 211586 33455 65796 151458 -72916 -282849
12869 -282849 -202121 78631 220745 -295673 39868 125266 80505 -1261 -11490 148216 233546
12858 233546 -164112 41740 -216115 44490 39149 5780 -260917 -168112 -113432 -194499 210871
12846 193884 9598 148384 30289 31869 358275 176083 -38645 31280 92552 9102 30883
12835 30883 200799 -275432 289385 61530 -194790 566598 146032 197157 -57436 44077
12824 119414 -44282 -148754 10627 -191611 265955 -181599 -29667 198426 -104935 132374
12813 -5244 158423 -208520 -27095 56703 -92817 58414 -85848 299812 343690 23987 23388 -159007
12800 25172 -1429 166172 264087 300975 86313 -93792 68461 -43418 -136574 104910 -186486
12788 272821 15600 -15565 -73844 124881 169040 109912 241252 -2689 319852 54883 64740
12777 64740 87855 -14932 197615 -110439 165649 253144 -108682 39331 -3 56122 -83644 -90528
12765 -90528 126504 -52693 84526 5231 -84367 -320295 -140925 -120182 91657 -436799 -207810
12753 168909 100288 -71199 -254636 165821 -85792 -17427 -86541 5463 174141 68762 -43744
12741 357974 335312 184680 -58884 -110368 99586 39216 6101 125531 -50148 -77390 -129119
12730 -129119 9558 -225987 239247 -36238 108831 278053 -83063 -36249 221489 -93126 371838
12718 3214 153438 24144 141113 124042 187604 -216315 91244 345269 318501 359271 -15703
12706 -131814 -41560 -192917 21793 159442 289247 279197 88611 224899 72164 -286402
12695 261899 -65213 21902 212004 164628 94621 43923 52213 -44421 23894 86138 241131
12684 241131 359580 152581 -36828 127418 -47068 219218 -82930 146864 215708 -103094
12673 -12003 379768 293147 93185 205029 207181 -131436 23611 354495 -99214 308245 221183
12662 221183 220648 12578 339668 547880 101086 148750 -176582 -212178 12346 94676 45015
12650 300535 72074 57558 206321 228194 -144162 -12694 262383 176504 -280160 -255279 99489
12638 -51218 81896 104539 358857 170410 440098 198012 111088 7137 136536 264594 427713
12627 427713 387513 209311 240867 276678 306104 -110825 120437 70621 375108 62513 36452
12616 36452 325227 -187976 -50802 176986 241925 120505 -31346 13362 114667 333463
12606 333463 111232 -261535 207637 356123 104041 415921 301850 127411 -1034 -158872
12596 -158872 16004 -138169 -36802 13889 375035 44107 -88383 14216 -202350 -42444 42260
12584 -336930 -261556 -123550 335398 47254 76460 38686 -136386 -7213 -203629 291392 14979
12572 -191741 179605 -721 104788 78651 236017 14613 -219402 239961 -31253 247676 -200363
12560 308300 126513 421169 -130742 212691 2815 -89210 329009 392376 279148 68572
12549 207896 259295 -67144 105864 296668 -5458 -146532 107207 -56404 296783 19646 -178793
12537 88592 168967 38493 -98631 16614 -152908 27595 151619 49104 -169463 87314 -136472
12525 51203 214362 201440 195032 546730 319936 427800 105261 -41597 49038 74964 110351
12514 110351 243872 -98907 1752 69826 -247719 26890 91441 12045 -222942 -37498 50277
12502 164940 -215208 130193 -44948 331066 -99126 -38613 -173204 100590 361831 354479
12492 354479 365888 238664 272260 361370 -1637 21797 -4775 366327 124113 76423 113145
12481 113145 60491 157478 -160107 318020 137049 -53525 -132325 186553 -45717 -63546 34109
12469 52040 170743 -207461 -7782 -278326 148297 71094 -40071 -104439 111858 62753 176268
12458 176268 49034 59405 216062 -137489 -64990 -15508 -281068 67039 223234 34261 -270819
12446 -335538 37743 -211556 88185 -54061 -367485 130701 -134338 -460145 -51659 2164 294780
12435 294780 3206 4786 -403711 338493 134168 42709 152920 489315 120874 -12657 -99729
12424 -99729 123364 -248859 101225 489412 75638 106593 -297018 -36937 51509 -300118
12413 88258 77416 -194574 71015 -187795 -246380 208285 63054 161697 234467 -100966 -145079
12402 -145079 -88221 -354729 -44581 -282789 89562 112872 -844 -32068 -22099 -165739 -221501
12391 -221501 122468 -25005 -186285 -154890 1799 21133 222483 -120448 -296156 56389 17740
12379 -5225 143622 55066 -188841 115894 295979 -69168 -345225 -329180 330345 -166616
12368 204112 329984 120948 174399 -299628 22592 -108877 -250916 180284 -93316 23161
12357 128909 49714 205335 -143596 151109 -133780 -84835 117704 -16736 191813 111989
12347 111989 189623 41820 190244 -138177 180490 -206724 -66544 -54422 10030 -40987 152390
12335 153974 -257614 -314341 -46390 263687 22798 62120 -29329 -88345 288342 -193643 351425
12323 162337 -92111 106345 159918 -372057 -195218 318675 -71313 249195 -154710 -54399
12312 -267082 -41218 251834 -252316 53471 91940 -11048 4667 -11347 88340 235554 49395
12300 117276 265851 168992 116017 168013 15543 -221157 278816 -4493 52062 136477 58494
12288 89517 195412 -233680 143625 84775 77393 -47654 -61407 98212 -279982 -165938 -153492
12277 -153492 49412 -196971 -144786 99964 203337 210032 81933 157250 -70445 -84721 -135268
12266 -135268 158179 -235 -80203 48648 -68182 172857 89790 103214 44788 32278 301366
12255 301366 537919 78097 -47669 355117 -230498 140022 69331 272184 460598 464260
12245 464260 53805 50291 -6471 234002 194616 -169089 -22329 65855 -243869 105761 -273709
12233 87047 261708 480618 331033 -19813 194193 358605 320515 31052 48547 125167 353268
12222 353268 -52699 459715 220938 457645 197319 350397 79592 142834 249846 -9667
12211 -184752 88178 193947 39681 71751 -10800 -202943 164410 383856 428013 478009 439836
12200 439836 13971 220717 148116 172678 468110 107981 313076 211187 160404 54632
12189 222573 316867 -17765 -35695 327596 78473 14876 121836 313557 331082 -77204 -8289
12177 237794 -11282 181080 48452 253631 493926 358902 78669 134437 -33968 275432
12166 271036 204792 260402 212648 18872 535134 -25238 -1184 -38959 116081 -89583 -151741
12155 -151741 -262111 123580 107378 31590 -30724 -190504 -17983 -53904 -11083 -47781 7713
12143 -84432 230412 -58691 109481 282138 -16167 -54380 -118904 162096 -285811 107103
12132 42334 561333 80163 219599 -77904 78608 -29151 77240 17506 288860 -160088 10174
12120 124436 232613 290930 254344 495191 231325 201822 36194 -428974 56770 118085 351713
12109 351713 -46407 46644 158312 -70530 20721 -16100 214792 -54399 -38792 -97680 -268928
12098 -268928 419952 -7884 -209164 -59815 129615 156050 -117799 97048 -287456 -219864 59494
12086 31240 -224766 -197077 -147335 102 24739 -105827 -93204 112313 52851 151586 -249453
12074 167639 -215208 103613 -46028 121225 -161209 -171882 404326 -26253 337256 845360
12064 845360 1417939 777678 143432 -71637 -186868 -396866 231725 -272915 -63105 54148
12053 -26583 265352 135726 -168447 -112752 -4950 38674 -48401 -250784 108764 -101967 -261403
12042 -261403 -233961 -375214 83362 -135421 -263369 -106172 -373311 87270 -237257 -158763
12032 -158763 -138887 475054 65459 167784 2856 202542 -258684 24116 -33524 76630 250425
12021 250425 272278 225068 -179154 93993 -101931 -174696 61589 -43189 -188353 -281234 -199026
12010 -199026 153195 -88250 -113812 347467 -147309 9710 -165368 -16993 44165 -322354 -68091
11998 -71944 206361 -20418 -392218 119355 9197 -329342 -74277 -36065 304509 471817 329404
11987 329404 190727 -56387 127055 -219504 25589 -248648 -146218 77940 -156493 -305681
11977 -305681 207027 -189003 77597 226337 -47005 104488 25080 142991 149793 -165199
11966 136026 -75949 -105543 8520 -59621 29273 -208340 -11437 -12553 -155808 58210 -8222 -170344
11954 -170344 -275849 -141915 83047 31267 -130328 50813 118320 171635 -228739 -258644 -57461
11942 -100023 -8030 -101782 -86734 36831 -42069 11543 235256 128504 318971 -9983 -105871
11931 -105871 115687 -239280 305381 146016 78251 -143305 227741 -120453 241586 -92211
11920 -81568 -223232 270700 -76766 -77458 -299663 -202186 349000 -97711 62603 -409148 -170782
11908 -32818 30072 -186239 17812 -105061 98833 394316 408054 5536 216846 -12629 225304
11896 -80685 40257 -32344 104819 -66670 -223061 203346 -244600 -98843 249119 190311 -1574
11884 131295 -43869 -46595 -122384 146664 30073 223970 -271175 65647 39141 -4315 -185772
11873 -185772 -72495 -354169 -142668 -237124 -119106 -34107 178460 -200201 110457 147746
11863 147746 -12703 -67166 38722 -196982 233640 -479637 -199845 293555 2145 181272
11853 181272 -91581 -18534 93757 -187419 90607 17887 270809 -460612 -439202 44324 36662
11842 36662 71422 -74094 198407 122002 174266 26579 -124276 -251032 459634 113607 -380628
11830 -344715 -7573 -303422 -58689 -78932 125545 -120329 -27568 -28328 -157874 -41722 11475
11818 273604 -120138 28399 -87947 -183407 -104082 47038 70034 -38180 141142 2999 -103426
11806 15819 -524433 99238 -27568 -126799 -50643 -177665 -123087 -119980 -360089 -30630 151196
11794 51228 -71985 -6025 21460 -113849 101439 -277882 227382 22691 102738 47797 22006
11782 23002 -217710 -215435 -62629 54134 -146544 67273 -297088 -94368 342397 -129794 -196594
11771 -196594 -76603 166761 220795 330795 -207744 -122173 89813 25634 56707 -101933 -153048
11760 -153048 219893 252412 -65195 75340 151662 -224146 186076 -169350 91651 -21229 184884
11748 -27539 -96729 223896 56072 207685 316631 -97657 -85937 -109446 151011 22938 -331760
11736 21247 61868 280456 178084 -66704 42937 -266415 258771 25656 -199463 -155529 -132783
11725 -132783 -237214 -26182 -200102 -258697 106230 77737 -160540 -120574 -291264 -185187
11715 -185187 -178060 226384 -280698 56906 67719 -148074 -401638 -20938 8527 48407 188464
11704 188464 -150176 -198670 -14851 146867 -181183 -4714 169927 -87461 124137 -60226 -321741
11693 -321741 -231217 -173788 245382 307618 74777 -278030 -320562 93990 98436 1444 -150401
11681 -61526 -131651 121204 13997 10337 -159608 187530 -241534 -70158 258092 -79877 -28953
11669 -155244 -265671 69150 -175726 296815 -172891 -16782 247421 -109492 54167 -86148
11658 10141 -172622 -227094 247769 -214746 -260837 -137560 -102764 201921 -174713 -168558 129879
11646 16292 -334194 -142503 184916 111433 237391 -189109 -346582 -79862 -93029 210378
11635 51234 -81670 -281804 3686 105015 -11272 32543 -190849 -47247 34446 -3568 95199
11623 -284054 -337965 -196221 180445 240697 -36737 27754 -138767 197499 76314 162506 112349
11612 112349 250875 -311822 -30666 -250037 57072 112089 58169 -319403 204624 -375697
11601 194793 -135390 -384235 -115942 29934 -101709 106103 108534 -3233 -33308 273877 -145802
11589 316757 -87669 183407 -441299 -162725 -140466 -72690 56638 305223 -25592 3630 -104353
11577 -56411 -401505 39901 72249 368261 55347 388845 202947 -90318 -203891 -53578 92863
11565 -66554 160972 -261069 -161530 120233 33231 -373074 181553 68080 -247410 -137902
11555 -137902 4121 34894 -362653 -146435 169396 390891 -51265 87729 201786 266632 -228990
11543 22964 15936 -18638 -426624 99251 -20189 -29972 -201216 161817 -58579 227249 -50310
11531 -139487 79832 -70911 136741 147491 252350 465981 -89624 124274 135557 178524 77608
11519 343274 -18078 194773 45868 -205334 140333 151092 -124794 187416 286038 165273
11509 165273 253245 138678 -87538 290885 -21896 -34320 183362 79816 163039 330394 133370
11497 290183 112302 67155 308744 281384 -45735 263312 -49711 261936 35095 80466 473358
11486 473358 215172 240467 91993 222658 22173 317495 63650 293917 178263 262502
11476 262502 504165 379442 155602 94374 199133 34135 257620 129968 287203 241764
11466 241764 -37546 254264 27312 -805 194644 -95820 407716 102028 285329 285859 55116
11454 361412 -45430 20848 -15947 71717 201611 -25481 424529 187824 -200007 -252444 253811
11442 54112 63261 310044 -12595 137998 240961 -293980 -90111 220634 199051 201784 45275
11430 151037 -19083 -337312 318170 99405 414339 118219 89605 339503 -92118 166533
11419 -144564 -49356 93920 23191 -146979 178300 -165095 -40700 27554 130077 -23305 133626
11407 176435 366888 -253558 104281 195175 -44095 329919 120363 -45408 193616 -12049
11396 -63273 59765 -420021 101071 90133 111033 -53349 106102 13304 87760 -208459 103023
11384 -89667 -65163 110448 168403 331601 400188 -5992 -90891 308607 257194 243731 -156689
11372 -138139 21733 -106697 237572 -280127 -166943 10371 121562 -160340 -248474 206376
11361 -124466 -125012 111095 -315208 -351294 64110 66173 -303101 -136301 23047 -64337 -146497
11350 -146497 57690 -267528 -14522 -35145 -268056 193065 118252 72743 122247 -111268 -29879
11338 -372391 -257473 -151038 -253401 20548 -16062 -57318 147222 -165372 -184416 14057
11327 415764 -15135 204668 68204 -225032 225437 -235065 -31473 -89569 -88394 191596 258168
11316 258168 60410 -94058 -101887 -278456 38850 167278 251731 -13497 143310 -112184 66885
11304 33513 -218258 -81952 144507 61754 -193938 -120437 -107153 53640 -3655 88499 113114
11293 113114 26136 -32919 -140565 221130 -298368 -207922 -70277 -142121 -68340 46044 -101621
11281 -282847 -158601 94252 -64042 136767 44405 22991 2567 129362 16661 -99727 18519
11269 -109527 382637 -188684 -295505 -41779 -166424 100792 -158444 -86961 -57864 -74191
11259 -74191 195269 15902 -327729 -196505 -379239 -16544 14831 -14352 15498 -187630 -214837
11248 -214837 -228086 238801 -17192 82673 -112173 244622 -137186 -238321 -187827 -418292
11238 -418292 -121989 237982 -103505 -56290 -60204 91307 58756 153022 32742 832 25270
11227 25270 -109785 290677 309325 -384340 -84907 -43450 249128 -67076 -19679 -37374 -72653
11216 -72653 61457 -340163 -154555 32195 63624 163051 -61206 479454 -95187 -106904 -116953
11205 -116953 122386 -47344 -165079 38352 -229948 -141327 75529 46280 1945 -68127 -72000
11194 -72000 -159249 18301 -104780 -103242 -30196 123524 -272602 -91703 -53750 -259842 156094
11182 -316306 36533 24389 130889 228349 -83952 -32322 -122134 -188065 154108 -136157 135567
11170 34251 -127779 63484 -203751 -92802 -82712 -146114 153025 -94561 65084 305026 -28817
11158 -105675 188053 153920 219985 36712 186800 -19132 12663 194571 25943 -186562 291456
11146 -182629 262573 -116231 -78450 -36580 351619 131686 43153 16179 17958 563953 -214866
11134 -41322 -286170 132139 234897 -229444 -12231 62566 19898 128777 165190 470490
11124 470490 -21299 1989 -174351 342284 147112 31563 -22936 30454 380361 -57217 63409
11112 279638 344177 210076 109952 293422 155695 84016 232303 -3172 193367 -42521
11101 -19064 142127 289828 406178 390733 69426 221301 300575 373431 169425 80890 -12928
11089 123248 579540 53876 233804 491063 362129 59130 495729 54919 221074 341054
11079 341054 314384 427707 108316 438651 425783 100705 234277 589262 523482 135193
11068 258721 -31061 492669 655089 688705 334009 880829 450314 693991 703629 745174
11058 745174 607843 715321 522553 617194 816298 422410 686521 870838 1177373 1150838
11048 1150838 1047197 1085413 1016482 801376 1140896 1162810 916090 576689 803670 1141835
11038 1141835 1415181 1063750 1112275 1073692 1078239 1236714 1213303 927460 1152262 713614
11028 713614 1043974 982318 1164609 978970 1077464 915884 875923 853688 827289 728421 917614
11017 917614 1171303 777003 1048748 1016507 832193 972001 582482 904716 1039177 650009
11007 650009 1035211 1009534 761267 617452 699241 694851 727439 903879 1192992 818253
10997 818253 766989 1233659 1086175 1109730 914685 690019 869804 1171658 1200226 1281101
10987 1281101 1019571 1171790 945783 1428859 1380667 1569727 1552130 1249280 1995489 1996472
10977 1996472 2176490 2506689 2727179 3174264 3712620 4169377 4293937 4620352 4714728 4643082
10967 4643082 4223374 3259806 2685986 2295433 1928305 1589766 1772170 1458480 1285615
10958 1285615 1018609 1150600 1156656 1105755 862724 766834 423132 340634 475303 457091
10948 457091 451530 292507 210932 159545 294305 171795 -7722 155334 93221 93008 -169331
10936 43804 41173 84119 -138640 203919 122095 26050 -203868 228614 -47061 -8590 -153812
10925 -153812 49480 188143 -42044 -162439 -264645 62395 56018 -6493 -121927 192447 266089
10914 266089 230830 -29800 263514 101976 -51556 -242753 -42675 261003 125403 17557
10903 179063 427608 178579 -33906 265365 -349132 293835 -202869 -270053 90373 -106974
10892 -98432 264308 7988 -16348 160974 288425 133269 -174851 -80645 -289536 -52807 66168
10880 128359 326764 -140901 -191306 -95829 -13874 -95510 -166515 -41925 72488 -105002 50424
10868 -232320 -252845 -35161 -320440 125949 -401310 131294 23280 90798 132210 -118178
10857 162557 -255989 -96589 120644 113091 258271 185875 127122 104065 194888 313537 22595
10845 60760 -484540 116299 35405 -13463 -230306 -97434 115346 87234 -41623 -369560 115547
10833 -362857 -61597 78123 -179085 -210265 119850 -11488 143935 -223943 -139448 -91409 -357398
10822 -357398 1318 -110379 -169256 -6447 73445 -154900 138083 57850 33617 -164974 -74814
10810 4693 -48420 -284728 -183092 287106 -452114 88847 -237623 -175509 -16924 5290 101686
10799 101686 42996 -27652 -67862 -7404 -155268 -209250 105227 -94629 50463 -4418 -136348
10788 -136348 -35961 106306 -135990 -101836 -215323 -245120 87143 65158 -161112 -171995 -33007
10776 48704 -57337 -7352 756 -74771 -282999 360217 -21099 150706 -299061 -79376 2453 297102
10764 297102 -272497 100256 -70069 -201765 -239309 186314 -72112 -100624 -35357 78077 50864
10753 50864 -9319 35822 86103 -356418 -144494 12329 -72864 14123 55347 242558 295678
10742 295678 -122318 -49388 -323964 50636 -509222 192425 -362848 75488 148787 -291737
10731 -97482 -309488 239716 48005 -104300 -148907 456751 187468 -187787 -122400 -281772
10721 -281772 -173048 -8779 63937 -58660 70958 332018 188464 22799 -222335 15389 125018
10710 125018 129418 -272563 -75507 53948 188026 -283633 -13005 -140866 -32602 -73479 96164
10698 151253 97644 -284267 -190113 -125792 205202 -106549 -98527 -85588 -382019 -17116 114631
10686 -248860 -270993 75240 -89913 15316 78943 -65731 -127084 31359 -300935 100514 -367867
10674 99332 232117 12957 193735 1719 -66030 290932 -450199 51214 444611 23880 202805
10663 202805 -69612 -581597 -240125 -52586 75752 63593 -87639 -179247 14490 53508 -278377
10651 30022 -206539 -35475 165766 -285280 111803 -128089 120761 -12926 -344076 -176220
10641 -176220 177109 23914 -124638 85564 544916 157840 -149871 116303 122253 46292
10630 -450357 79969 -101328 -50728 -105780 -69656 -136961 141607 33041 80668 -173094 98583
10618 71501 317851 -20619 -104687 -278875 -538121 -164026 -53120 71959 172488 -215018
10607 -126730 128004 71438 -143678 234853 -58970 -249073 141638 115980 -40822 154174
10596 -223165 -242541 91614 181558 145281 127081 -44859 -180557 251396 178566 -50978 -5600
10584 -97252 105138 -231798 -1181 -9411 -167065 -435829 17155 41007 -42697 -107246 77586
10572 -138810 -94447 -350876 273616 -261840 50868 -110244 -304609 -4959 45872 -419707
10561 -119684 -179687 33513 -212149 -70404 -260705 195578 -173454 101899 211212 -82023
10550 239781 -177339 75367 -35396 -139401 -181636 -189212 8136 -187669 -89398 276315 -179306
10538 40858 171264 -248324 87931 -231851 21552 -36572 -225970 -224532 109888 -75022 -64256
10527 -64256 448214 19643 43063 105041 89321 123300 -223238 -71895 -170341 -223657 -7133
10515 -61910 152422 304302 53951 -169718 -2599 278644 -124694 53465 -38272 -247908 -33749
10503 -95072 -24439 34421 207534 -37614 203303 242373 92929 -160478 -122971 112799 -281608
10491 -123818 -158778 18187 -326611 -141438 -223006 -58547 -315880 -146603 153795 -204072
10480 66281 117398 -176426 191443 47906 351786 81166 -114785 178862 -251185 -237861
10470 -237861 112601 77754 -316151 -203261 96104 223512 -164160 -238606 96589 -186627
10459 26916 69381 -92499 -355751 332011 -216774 -52246 471729 -108104 159584 247597
10449 247597 -116936 -203496 69428 -260148 -55305 161280 -600406 6686 -90192 83652 -342023
10437 213268 44659 60317 58381 -140472 41654 190479 52605 110273 115658 41185 58996
10426 58996 -95497 -183009 27294 85179 12582 171888 -33332 204199 -83842 6688 -84496
10414 99240 -105284 19722 -159410 -107636 184693 -87542 -145611 186466 -115522 -38812 127459
10402 -22374 -2214 59906 157553 253516 219265 23886 7484 21190 221419 -90461 -116 481351
10389 150949 -1236 -26938 283414 300147 176089 215080 211092 170228 12179 54596 91861
10378 91861 -28540 255298 239301 571363 128760 368258 157730 149835 90485 263951 606723
10367 606723 540862 280739 707840 577864 592607 944943 381961 306358 188447 60636
10356 197989 270083 387657 741618 456067 619116 607307 885778 775333 728469 477181
10346 477181 226955 66988 408680 379276 349286 409498 336683 102103 241269 186004 358204
10335 358204 146171 236412 102280 92407 518538 68117 -94443 241999 130678 102188 -227491
10323 436924 302893 255297 106349 363102 143339 193139 470347 -107394 145230 -38139
10312 41371 230466 -210929 3649 -41175 43231 75569 -142294 271636 287700 56387 5791
10300 -31193 -107963 160217 54534 -35095 -191986 414799 -111856 291532 -91262 76702 114681
10289 114681 120297 -40258 67391 103144 -440778 167513 496948 98594 51365 -309185 -286817
10278 -286817 235011 -66163 144976 -135560 -44118 -139440 -81276 140912 77966 143610 -368616
10266 -301987 103346 55785 -61512 185091 97789 202517 110679 314614 -123890 -178080
10256 -178080 -214597 145209 246028 -102841 251742 -197988 163629 -16294 -156930 -135913
10246 -135913 45076 -155897 109664 -26531 -51360 344539 79217 -82478 67091 -79508 -55025
10235 -55025 -141439 -197284 229303 -131681 -55416 -216112 212599 217602 -335066 -178319 161330
10223 -205102 -44272 206980 219356 -79905 116880 120975 -197325 -239779 89465 -276635 -75109
10211 110474 416369 -8550 -96860 211629 -158821 -130676 -314733 -158488 39608 -245658
10200 90606 137685 -149783 -118986 274888 -64323 202500 73777 157038 -84942 84226 35892
10188 -182789 -123278 -90209 190768 72760 13555 -70582 145682 201754 -256747 -20535 87519
10176 -44750 -256438 -125677 32846 -14077 -80766 26644 -324903 -1206 6693 -181333 -197011
10165 -197011 -2512 -49196 -53527 133175 11471 44354 -64687 -243080 17901 -375780 -36388
10153 -312698 -234780 -380793 -310952 -196825 73383 192604 -110801 165050 28240 -251245
10142 107822 -20456 146131 -233018 5099 -205505 -68276 208575 201082 -147917 -116345 -80468
10131 -80468 143547 168788 29336 -9143 -53530 -386953 144416 -133741 258482 -201992 201629
10119 -98479 -89539 211557 67166 -126110 136292 -17536 128143 -107568 268836 -317721
10108 -2503 -130557 151763 330284 277583 -28967 -167318 -65901 -9217 41380 -466862 11400
10096 141807 59951 -307120 -99850 69926 -60122 -138550 -120560 -4284 -61103 77065 -94553
10084 208723 -205625 -89972 -179356 79093 -182737 8711 242540 367189 170247 -63598 -111475
10073 -111475 -52759 -48217 -168305 -329387 -504495 87904 65403 319752 -76484 140087 364474
10062 364474 -61356 99949 138109 21901 66188 255240 -283569 -211223 -183535 -270705 -134500
10050 -208252 11903 260840 37658 -152136 269977 -141406 4519 -264956 145713 -202860
10039 -191071 163155 -261518 96155 -172201 -42182 33709 -23057 -122055 -5292 -489827 -28328
10027 -418202 -83055 -245352 -98141 46149 -432200 -133640 -3998 17413 -141161 -182662 -109069
10016 -109069 -197682 -266319 -221375 -15963 9726 -256141 -442393 -58436 167291 -31211 -31721
10005 -31721 -148271 -84435 -5149 44646 -190642 14940 126566 28057 32826 -17376 41502
9993 -38590 18505 -5519 -426319 215476 -278994 211832 -209701 -115738 -360676 370503 -33838
9981 710 -306276 156052 -58122 85508 -111032 -227963 -261249 -295285 -40308 -46732 -139657 43375
9968 210278 102247 -166394 115475 13691 -212612 -137931 -74527 -328016 3920 23486 -58696
9956 -189058 219065 -212239 -118583 -82739 189222 -83109 -201480 12550 38591 -157345 -411416
9945 -411416 140161 -266084 -87492 -151812 -17561 100374 415465 -749 -216172 -130935 -15129
9933 183426 50782 111520 164969 163422 -157708 -424114 -82037 -274797 -250434 -52583 74570
9921 -133124 -197664 -29171 40937 160794 -309428 -330267 175184 77305 -207466 -176400 2231
9909 221623 -291973 -273205 -238564 -158952 128155 62376 166482 -333704 -330387 -250497 -91857
9897 38437 -76904 -412192 28528 290598 230701 -243621 -100783 -182336 -236355 -38504 72674
9885 -147441 21850 -263448 73032 -44627 117882 377250 -120466 -166556 -237986 110074 -166055
9873 -192892 -83960 -242464 -481548 164036 30150 -108051 -690362 -59451 57195 60081 -299804
9861 72243 167640 186771 107873 -128414 245559 10431 44336 112654 -65001 213738 74652
9849 -53942 -92745 191014 -58965 -228045 -112841 19596 -76516 -367252 123753 -194326 93895
9837 -164 -47860 -99075 -180722 -174041 36477 -96762 -121800 48963 -211266 75074 158477 108994
9825 108994 -64940 216082 57585 -226490 -40155 310895 -131653 -181227 17 -393361 -330288
9814 -330288 -425264 -98350 80607 140220 161493 159904 170578 1641 17840 196768 -92908 149839
9801 -240738 217058 -215652 1582 423077 56676 -201978 -374428 -97467 28894 -101277 13827
9789 -173829 -2094 -13943 108092 155880 -224580 -66720 392936 46335 -123045 -251969 -200919
9778 -200919 -152504 -377106 193534 -99273 220788 -296900 -23256 27558 -130971 -129062 -77621
9767 -77621 -27067 -74296 -249775 49063 -173585 -236806 330427 -233260 -247972 -37570 -25350
9756 -25350 -70184 247947 147065 -283767 -316540 -218725 58296 3385 -73968 -94738 -322169
9745 -322169 36429 -151623 -348060 -248224 -34527 -373163 -156152 -131502 -51929 -16220 230298
9733 -3370 21377 -120960 375722 -139445 -56986 50680 -251122 -42180 -109086 102942 490885
9722 490885 194569 -104542 -69440 -196530 86085 -50562 117823 275860 -33614 81659 -20852
9710 -626136 -202126 -15797 -105666 187995 -85746 44111 49315 -182407 -35570 -212771 -85141
9698 -50650 -222707 -132011 -105101 -122695 18308 -11980 81825 -153899 -246515 -353596 104094
9686 -231779 76505 17386 -331220 -50408 -101753 152609 -3022 -14621 -50979 29147 -98388
9674 -188672 175378 103010 -176217 162306 135080 -85238 23327 -360565 96348 53878 -124153
9662 -371417 -191054 -194404 175449 -212627 -103306 175036 -49454 -368801 -1244 -20521 -201226
9651 -201226 108625 -124443 -221415 265612 -32779 31651 -252946 -243160 -20221 -39027 -46454
9640 -46454 17237 -214032 -244054 -6963 -229552 191859 -377162 -159694 -214273 -206260 105126
9628 -239082 46617 -152320 -159977 -455005 38253 228091 -51128 35214 -318932 41281 -71116
9616 -264180 -101352 156875 -3431 4119 -194338 -17142 -369730 -14551 -106711 -93812 -37188
9604 90661 -10685 -63329 197260 57922 -222796 -263983 -58226 238234 -121112 -228638 -180854
9593 -180854 33416 37481 -342586 -180606 -141572 -108709 -95151 -317929 157421 153061 -49258
9581 -350305 -442552 97915 -139774 115788 -83688 -143695 39465 -355916 -50991 187151 11229
9569 -143002 2860 -99892 -207743 73879 -71462 168003 -35244 241257 -33617 -223177 -498371
9558 -498371 -238975 -87111 -156119 55622 79084 -145555 44181 -251832 74276 97329 247764
9547 247764 23227 -324933 194134 -389439 -377750 -172995 -269387 106214 -322315 -124897
9536 -390813 -172092 -400462 -376181 -140527 156309 99933 -152707 -222119 -197396 171209
9525 22997 43454 -12770 -92658 -217450 -24259 104072 -282907 86098 93004 -155237 -10265
9513 11959 22458 -196119 302222 -195021 91531 63497 -139020 -229577 -151586 -108096 161217
9501 92684 23495 -279625 -170258 -136751 -147465 57566 -77659 -89375 -183514 6137 -3943 -222417
9489 -222417 -99336 -188287 -322612 -16764 -37692 -6299 -422311 270183 220770 -65871 -136746
9478 -136746 -213521 -62711 48750 -262186 -448438 -36114 -81762 35223 45807 269849 -196175
9466 54520 -492601 19470 209661 -199870 -58459 -208050 -13894 159919 62452 -460688 180359
9454 197460 -34677 -48777 -12129 -96673 -201218 181901 182703 280371 -101741 -104076 -184658 -325874
9442 -325874 -112754 -297747 -293405 -1811 160158 -52331 -237573 -323210 41921 85419 -86720
9430 170829 90822 349109 -141460 -220495 -237541 77285 -155739 -90526 -259047 -106675 -96866
9419 -96866 -114091 -138723 -197481 -308996 -195882 -81267 103820 331427 -178168 -358882 38318
9407 -33691 175496 -51054 53334 -183216 -290352 -73424 10251 146051 70456 -146390 -312025
9396 -312025 -120578 -181169 -226296 -15862 158210 -1062 -182890 -96165 -117805 -21705 202667
9384 198800 -315013 -55419 -262247 -109717 41679 -6992 -266967 256289 -76174 -239568 -129913
9373 -129913 -113521 -42013 -115187 218434 242011 128661 -266243 -127688 -171611 181950 -109768
9361 -278708 -18869 261647 -258057 -126601 -171124 173355 18080 117112 -92492 127375 -112835
9349 90569 -117128 -82322 -178450 43892 214175 -170351 -228915 -373877 -51655 -59284 158714
9337 -144253 -78541 102704 -273563 78690 134764 138601 -118611 -83129 -289024 -239651 -309994
9326 -309994 -77805 165348 -3095 -68652 -221100 -109914 -116707 -269737 -95044 198709 -184501
9314 -17719 -81329 -286110 -216583 43677 -182011 -40472 -208612 -39544 -203692 -170643 73869
9302 215375 -112652 -97325 139267 -35817 265117 -149097 -60794 2775 133461 -213261 -53745
9290 -122893 -285737 331914 273180 -147425 7334 -152682 60060 -238065 -110996 -13258 -16270
9279 -16270 -181664 -27912 394159 -95876 242976 -118105 221925 77503 -300604 -77718 -182393
9268 -182393 8972 73164 68847 407297 68176 -164211 290769 136884 -69014 174352 61889
9256 -115271 394283 -154658 -151494 12665 -44844 139025 -356362 -215754 207017 234019 -89589
9244 396321 -368709 -319596 -309690 160302 -22494 -374552 -154165 -260954 -121651 -201771 728
9232 -131260 277902 -272625 -328018 -257765 10536 108486 38827 -337065 -259947 -53951 -54943
9221 -54943 -109462 -87201 -58977 101762 30674 148140 -253251 -88811 188213 -250806 208721
9209 -31283 -51041 289589 29009 198470 -73061 55106 46026 294644 224041 54247 -110338
9197 -99708 -172347 71853 64745 -257060 -133093 -254759 -12556 44512 234532 -110422 437617
9185 -277040 -250718 -14222 60462 44774 -164386 -71692 -267267 -83262 130244 4724 -235323
9173 192386 104890 114425 -380357 -135143 -127824 -44160 -24387 -470470 -276309 20080 -162611
9161 128757 70291 -168045 -221333 -122004 3097 -44593 -241850 -475740 -305419 -95769 344310
9149 -160702 -61144 320677 163236 -61365 198360 5832 150094 94214 -87374 -60951 -212169
9138 -212169 200491 109772 38744 -126265 281450 52735 -107593 -194244 -149477 -64043 -135201
9127 -135201 191838 -184184 -313734 32965 -156707 -183413 27476 -204198 7262 -277371 -42690
9115 200996 186662 -280600 60450 -182441 79752 258393 -36510 1086 -117929 -215310 -67573
9103 -268111 -193019 -121588 -55003 19936 -74375 -382654 -408766 48972 -337383 -25951 174928
9091 54617 -232223 97803 -251790 38873 148649 48553 -112317 32359 83066 -165350 -335273
9080 -335273 212357 -16616 19401 -260536 -180428 42944 -265072 -96964 24378 -333196 -234958
9069 -234958 -104 -204832 72963 120175 53637 -163503 -118064 63290 145996 -229210 63511
9057 84512 103551 552997 -192889 -140879 -107988 -159205 -401633 -108869 -400662 80463 80545
9046 80545 -146376 -12413 64172 124025 -25275 -5152 46284 -230905 -79256 107269 6116 154303
9034 154303 -171622 -215517 155421 -374656 -353546 248228 -3643 -235332 -59737 -22632 99182
9022 -73517 -18763 -134161 -244883 -61184 -34079 -91778 -172659 -226418 434239 -219797 124342
9010 238946 -163013 -79794 -278657 18934 139772 -32975 -216713 -304247 88787 -22532 -5262
8998 156844 43415 89639 41471 -270388 -202681 111586 -115206 -412852 200045 18131 -248417
8986 38904 14859 -110499 -194920 -519768 124505 -323097 -90088 -46566 58701 -219421 -79420
8974 5574 -116160 23409 -43921 -57843 -177730 -215940 132848 233999 -78198 -49403 -130171
8963 -130171 -24555 -52119 -91081 -160854 -51303 -203869 232 -206585 187420 -234249 147225
8951 -247826 -68955 -44085 12129 -126911 151784 100041 -126940 -146897 -365090 -173598 196757
8939 -6925 153999 -9245 -231700 -6391 146108 -147814 45982 -253993 55325 -195605 160762
8927 90749 -146834 -266574 330307 605599 2088948 7799283 13226251 3544533 1216593
8917 229857 319455 483822 -69099 -227472 20195 185856 92175 9822 173666 -97742 109950
8905 8510 -247980 373953 176463 42770 -19586 -141448 165304 75650 -34081 -108430 114832
8893 449144 -98072 -200719 -35266 -43159 -557964 -226265 -198708 76980 108458 -196104 73090
8881 101357 -189385 323824 -50564 376386 -126713 -276873 75757 -504311 -70771 149443
8870 43127 -93010 -157022 -71741 -215450 528 -152962 -113282 217250 -36941 -2387 -204589 188518
8857 -389998 -42373 -213327 -166268 -70024 -233549 276342 -82772 -150741 152803 100647 -30985
8845 -257532 -128452 231138 -50587 -31027 36769 -3456 116006 13180 -121063 -170623 -233416
8834 -233416 -109562 -145371 79315 -299250 -388039 -19606 -353154 328920 -153165 32206 1932
8822 -192369 25752 48943 -31236 140185 -202296 -256035 221918 397779 -5956 32583 -109051
8810 -59533 239145 314597 -211689 -88189 -61482 -207706 -99834 139453 -58450 -44510 -334021
8799 -334021 22349 166163 139219 -137771 83006 -165615 7536 -243167 -246021 47427 185970
8788 185970 -2849 -278485 78381 94487 -189212 -481173 -338706 -336674 -757 -364534 -417029
8777 -417029 -15102 52486 120379 -66922 -63884 -77666 -46668 -115774 121353 -56251 24880 -326010
8764 -295381 -263161 19347 -149376 -291372 -172375 -78932 -78503 52364 -211967 250235 -228660
8752 263214 -161164 -152630 66303 138968 -60380 74304 -100432 -31873 -454847 50069 -167648
8740 237293 47868 -64319 -94646 -89645 68925 -31815 -35508 -122074 -193635 -257401 -128919 73514
8727 -236167 -213087 -79742 -31108 188428 84756 -6196 298144 220544 -47817 -261958 -49413
8715 119519 -124740 -60612 -66732 82621 -88905 -55947 -389504 264547 124285 -8792 40646
8703 94244 55472 307408 -101865 139690 3930 -49253 -341746 -217927 -137215 118851 -241343
8691 -212654 88875 -159481 -292788 163003 24222 325082 -120781 -170020 383880 18466
8680 -153712 -282016 -254846 -34342 -43738 -201848 -225095 -181932 -81305 486667 -57739 -273441
8669 -273441 371712 -360286 151916 -96592 -273999 -45663 -393705 -253615 -1142 -104975
8659 -104975 -66675 -83458 -7219 159905 -113909 128767 -163542 -58750 -405341 174234 -10256
8647 31911 67407 139075 1522 135480 -176393 58357 43573 -190310 20034 167317 12898
8635 2163 -146170 -3180 -20063 -180520 1166 -32331 -5348 443826 -59318 -137036 -382149 82216
8622 171672 -190344 -29794 215966 62064 157900 -53425 261673 -196942 -103062 -69093 435079
8610 164285 -90411 -314718 -160965 -52988 -68094 -62883 -111610 -147210 -105583 -17933 120904
8598 -251675 145921 266178 78815 -480701 76574 -223550 82517 -56878 12388 -131658 231551
8586 335529 -225156 -218135 -49312 185821 55473 1309 14057 174545 385003 -39546 42657
8574 -113660 -101916 476722 72108 73105 41428 -49075 9527 27687 41651 -133313 50288 -91845
8561 -226944 -116718 66307 -232972 14863 -283932 -235604 -125922 -248875 21490 -170366
8550 25122 -348007 -14106 56877 -217227 -186903 -226491 -135606 -380898 58947 -463659 -56681
8538 122977 -74434 -112500 -165704 52099 -219138 378552 -61832 -174501 -230006 -346188 -20849
8526 -126281 -16933 368412 -53747 -202736 153010 113158 -289880 -92919 -88496 -96758 -79831
8515 -79831 -164438 -156993 -210303 -58594 -120149 -251117 -251293 -230729 146912 -53978 -201091 139810
8502 -27334 16626 -231635 -80149 -192460 -90066 -258983 57053 8061 4100 232787 -79422
8490 -102754 -209903 -72460 32291 139141 -37673 -266577 179685 138645 54065 -221388 41992
8478 74148 -17650 -45010 97556 -100830 38859 138431 -46927 -136548 337428 291914 -41555
8466 -189070 49911 -262076 253127 -406120 71278 -27521 111223 -217048 -40060 204591
8455 -182451 235207 -57671 -368356 107693 63583 171557 3382 -314414 160761 -263583
8444 -91199 -104162 295700 -79978 36933 -189710 -125333 100922 -151116 151601 203810 -174718
8432 -73888 -378719 -48448 -25499 18087 31698 -192186 80084 -239497 -49294 234947 -101473
8420 43556 -166014 250639 -335966 -80254 114384 316805 -202236 -224878 -118098 55797
8409 98727 234484 97956 -217619 173084 23950 -346156 -170512 -8012 -103249 28128 123586
8398 123586 -188109 -169737 285024 32532 -202329 -57549 -220610 -21542 71648 56003 204763
8387 204763 27446 8704 -85117 164110 283952 37595 235782 -91637 -349954 241608 -91807
8375 71340 -120053 -104862 -407159 -203829 242010 34972 158932 -165399 -138076 -92597 42464
8363 204050 152220 122555 -190408 94133 57493 -135437 100526 107941 68126 -104091 -149914
8352 -149914 -71422 -188212 -130527 -1531 146892 518713 -183803 -31831 523851 -270385 -380027
8341 -380027 -67741 -126232 -251745 214252 72268 206361 -174674 -72294 46354 21720 68972
8330 68972 -93657 -59025 257044 -50362 -44868 -184996 -209953 81676 -206782 -123759 76940
8318 -358053 100748 -217712 -96788 -39015 -41517 -116793 -43112 -378441 42059 32138 -215101
8306 -162186 229173 11871 -406377 141561 150231 115671 -271988 -277493 -294020 -60009 32374
8294 55344 261960 -1261 -244777 -455882 33174 -36287 3231 -189737 -228002 -335560 -74039
8282 43064 69350 -69108 -116477 -30898 -53779 -23362 63894 -387359 133192 -265238 -212819
8271 -212819 75442 -109305 -36286 -146716 -260185 -157498 -72969 -101878 -20882 -144488 -7058
8259 -29322 34396 -4098 69489 -74740 81299 -192833 -27381 -33927 -36428 85622 -250835 -168305
8247 -168305 229530 82244 -61781 -156281 69160 -319196 -148377 65425 -117754 -51432 36995
8235 -85882 -49591 -37394 -153114 -79506 -184708 176694 96386 -113255 -5411 596 195011
8224 195011 66441 78126 -16440 60508 69254 -105698 101337 12687 -322108 -37402 238809
8212 9146 150153 -37258 221927 85087 35741 -221106 260723 -51990 107528 186917 -110640
8200 -167542 21912 -279562 127420 -408039 335815 -210961 175257 -275807 257523 6095
8189 -444 -409905 197221 272340 -236299 -108293 -162768 267156 179239 94454 172053 40876
8177 -373108 171807 12715 171821 -247043 92804 -58188 188878 -293847 -163509 -195320
8167 -195320 -103841 338963 378029 -134147 60702 -158590 43987 -105873 -377571 -55679 237539
8155 -220818 95850 5151 -31023 145401 -49627 161079 -89500 -7862 -130339 -63378 -258908
8144 -258908 -212559 159931 139498 112602 215974 33437 -49255 -107240 -378703 -342561 -368760
8133 -368760 141872 62213 22303 140837 25640 -289605 -84369 -230009 65288 -294503 -57469
8121 15941 113709 174815 -444423 -209425 -182794 162253 70821 -283509 -160992 54696 -34510
8109 165911 -90349 -155228 -61576 309903 -327271 21905 -75849 -108502 -128970 18825 -28499
8097 -137178 -20784 164625 106734 -36798 14119 22728 -101697 -266431 -38182 94519 -194642
8085 24123 104280 -33192 255123 135181 -254108 127861 273710 -138245 35026 -50627 187738
8073 -42020 121265 119649 -165912 -292695 -71862 -400195 198472 125978 -412720 -132530 -21829
8061 -132966 17956 13212 125388 -34103 -117206 27112 -54132 -64102 -177066 25725 -42583 41167
8048 -46753 -56136 -162160 -268658 -308121 95151 265023 -207697 -157966 -118414 125118 -160583
8036 -123432 -232492 84958 222688 -279845 22397 52056 -189837 -194433 -384111 10712 -3166
8024 -277483 -207663 -181518 -56468 -321391 -24225 23872 -274595 86470 -11081 -63656 -32186
8013 -32186 -234082 -347976 -84531 244716 49664 -259097 -102863 -345482 -122695 101482
8002 -129284 -62766 318771 120673 -50667 -339872 76946 -189456 -63053 182201 259633 -48023
7990 -25505 -211786 51795 198184 -115698 -49839 -192084 -251161 -275936 -26353 102956 -74572
7978 -201741 -232943 65339 10951 57824 -201264 64109 204169 25294 45129 -1275 -199337
7967 -199337 225876 -194805 34750 -50168 -95745 -123657 -184664 161326 26868 -78823 33896
7955 -93430 -109127 -165019 -128437 -232874 289354 -174723 -80304 -95751 -235152 108071 -12512
7943 -227773 174414 72650 -150429 54507 -323730 -89331 231269 67059 -75967 -204943 243394
7931 -46211 31276 -234860 -13863 -118077 -63155 -254475 8910 -261563 -51669 -117393 -214755
7920 -214755 4849 152935 175027 -138015 110981 21385 -98042 -213029 293112 -258420 -50544
7908 273339 -253639 -175537 -61070 372263 247497 174051 -165573 189376 73890 198473
7898 198473 -393634 69227 120822 -162013 157388 -204047 52466 52312 113819 -5970 15661
7886 36751 -143676 151259 201712 -221312 46897 -39187 -12321 -82727 -133883 182868 8409
7874 35559 250259 -157882 321227 -2184 -147584 1330 -131206 -156045 61126 -25716 237289
7862 -40612 -66717 -7283 -3390 61074 47627 161593 31993 -257276 154563 -234579 -3516 -249269
7850 -249269 -18094 -33053 -76344 205816 -134978 -288876 -175498 -234788 105518 -302534
7839 136929 -383238 89547 -54449 -12335 -121118 49921 10647 -57096 -266121 -22874 -196007
7828 -196007 -324440 9457 -141713 -183627 -130955 49923 165814 123349 117856 -325238 -145476
7816 124606 -341717 -238416 123600 97713 302160 -83749 -226347 -363729 -100481 -212143
7806 -212143 124119 105466 84290 -191695 187738 292123 -84262 83130 -143455 -175748 -24264
7794 -96354 -109786 -86134 121279 85734 -199032 -236053 -65675 -623493 404874 -33574 -189314
7783 -189314 -42984 -77119 289010 47762 257649 47409 174087 -292538 201276 -41776 -18861
7771 -39553 -326228 -153203 -82245 -272786 67859 87905 -35021 259138 -56856 158720 -244039
7759 -30917 -168798 -279178 -109510 -287271 79367 -117595 60408 -86339 -248721 235218
7748 5710 -965 -26050 73539 -139346 45427 -342246 42776 90985 -275480 128648 -66911 115343
7735 -67294 -199948 -24566 24068 -16181 -262237 74248 -333608 258106 255029 -348803 -180735
7724 -180735 -26207 112965 204551 218739 41597 -308391 236426 116521 -191712 -122082 87819
7712 172132 89406 -27923 173729 -166609 42155 -45390 -143770 121396 -529218 -97211 281318
7700 -177764 -100787 -75258 -387684 -46004 236596 -183276 16673 -70112 173881 107753 4699
7688 121622 -182765 158891 11324 -182209 -56030 -41530 -183857 -244226 186860 42584 -91815
7676 -316776 -258352 -25351 -70371 -124547 16730 32449 -184549 260319 183592 -170652 -113441
7665 -113441 -260933 -21138 203052 5159 -52738 131019 -130495 -18679 -81776 -41608 54715
7653 -450579 -215472 -100989 -275979 -165671 -132430 -109020 241413 98403 -54084 -378113
7643 -378113 -310963 70181 -245279 257459 21401 -195774 -99849 171602 -112427 -122315 -68756
7632 -68756 10901 -83870 -15469 -99563 -132450 256973 119381 -57170 -253313 -257075 -107881
7620 -157055 -109142 268228 -590524 215494 41773 163179 -40798 -96187 -30646 -19817 -29490
7609 -29490 -208075 123440 -63803 -2285 -325063 -188771 -95255 -158408 213881 25925 5147
7597 -108643 -129726 85207 -216273 -4994 -398914 236692 137018 401510 -66698 134947 -141593
7585 -38167 -84439 -515978 204806 24561 50876 -108904 -62484 -80002 71790 -32670 -122695
7574 -122695 209496 -157560 -211073 8624 -115030 22011 181018 -168719 -331164 -50644 -47406
7563 -47406 -177565 58472 -109089 71416 -324166 -66301 3366 -93684 -95377 -323338 -357020
7552 -357020 -278842 143078 -100893 -172768 165469 183972 194442 -63446 395899 211677 1086
7540 -237983 20958 -302954 26614 189205 195197 -33994 198731 -167492 -25979 -130494 137071
7528 156332 -58197 -42157 -47542 37501 243754 12602 72737 -64469 -127077 134736 -104603
7516 -144993 -48543 -233209 93766 16346 128394 -278358 260459 -82855 8294 92781 -268949
7504 -115224 -135359 -307642 -32634 -68868 52087 216627 141506 -70663 144450 188089 119547
7493 119547 -19435 -64491 281997 -51902 100735 -281773 -34402 -256433 -16907 -357182 -80833
7481 208716 -10845 -66192 46267 177043 -164797 -166207 101604 194987 116922 -178829 -331715
7470 -331715 -156088 -89980 355530 27231 -158850 164618 34053 23886 223537 -308643
7459 47552 -224950 -77675 -16178 416668 311627 -414703 81649 -202364 147703 114270 282536
7448 282536 4162 -109838 -99294 33051 149582 -204549 14060 -250534 -111240 -100652 -294592
7437 -294592 -187830 -42118 10168 -359666 -38646 -39226 105951 -239084 -260998 -121980 -183281
7426 -183281 82177 -275868 -124311 168853 -217096 176844 42671 -107203 1568 -81473 141462
7414 118414 -238772 -14383 -11067 -10476 -55907 -1661 -38167 199870 109239 -63471 -17660 -151552
7402 -151552 182777 -42476 41867 -121142 15977 326740 -4617 -40516 208236 -286506 -117942
7390 183728 -84839 -3742 219543 -236449 -220459 -201233 -83951 -103299 -114776 244 -336544 -44126
7377 -198222 76601 -276843 -119708 -11650 -307091 117311 162856 -199928 205070 193265
7367 193265 -156981 99948 -58958 563 120827 364103 -129403 -169124 -277569 -67483 129711
7355 95731 39612 156751 13941 155244 -62201 80781 -63290 -136791 -11972 -253915 -278715
7344 -278715 180427 -195519 39285 165724 -123517 -147891 260207 204371 -136435 67815
7333 -42225 -99705 -92846 -170520 -245676 111662 -14278 -188819 474707 -82457 139708 208397
7322 208397 14323 13239 -18816 184717 72059 49087 134487 98492 27957 -192591 -348687
7311 -348687 -7972 -270143 -260513 128682 -69306 262787 584 63524 -345526 51604 362419
7300 362419 255068 170268 -139967 27881 398728 67719 84498 -13654 -176612 -7828 -92234
7289 -92234 59804 32689 191154 -189204 -149506 -76752 -45024 28955 221614 211458 -250157
7277 -125823 -95830 -16648 156121 -240233 56956 -103034 -364608 -378888 -114763 237611
7266 -83440 -288560 120558 -71461 -135262 -205342 -98831 -245188 65638 -4317 -122150 15092
7254 -257256 221897 220551 -113996 -119116 132201 151155 -310964 -106159 350184 -320056 417085
7242 -30243 128914 -282572 352380 210577 313277 -179855 -76350 -19332 -355831 -208701
7232 -208701 -11450 -106868 104805 -251473 -4735 -345959 -197584 133567 244069 -398931
7221 295618 -128192 -263410 425626 -205800 -188430 174264 -63310 -168708 -322897 -112262
7210 152957 -34377 234908 341933 26276 -37963 75178 -171624 102177 118852 -35271 -47182
7199 -47182 -237375 26174 -167743 151455 -66651 -456008 90875 -118581 -124590 64262 -102040
7187 253689 167552 -151043 -271392 -56546 -64711 -50911 300073 33733 -186837 109858 -191384
7175 -30 21987 -58791 -88476 -289227 -158327 151581 157 -23271 290167 -129612 143816 -34964
7162 78848 -50311 -267287 65997 -235218 -247097 199074 57137 239216 -181867 72187 -95098
7150 206251 -209984 -218925 -180152 278542 -52997 30326 -238313 -201768 -303973 79417 419889
7139 419889 -183086 -146562 -194370 130134 -115609 -281412 170310 -87339 124862 74974
7129 74974 27273 145212 -57706 -30657 160228 -211090 -40944 145969 -252973 -204294 89213
7117 28824 -93636 -135982 -509176 276789 59019 70026 -174371 34079 132416 -385942 58850
7105 10302 -145890 407371 35069 147499 168519 -125825 -292241 -465016 -51402 -2580 234279
7093 25116 -49458 54351 2825 -287155 -174963 111383 542449 90811 -92067 -247825 -367354
7082 -367354 -18961 34121 -271245 -269561 304284 267602 -145677 196542 -459351 88475 227042
7071 227042 151018 -68219 -47287 -528 -114831 267923 -106888 -352542 -94330 139101 163577
7060 163577 -36350 48687 -160373 -130746 11965 6899 -248064 -267395 -200291 49171 107598
7049 107598 79946 -13824 98629 86153 -22006 5602 -82680 283892 -90954 -95250 -151814 -31683
7036 92272 186369 -97991 122476 206585 267670 -57261 -2426 -310814 -272520 33012 -212801
7024 -102698 -21785 74999 312691 240749 195329 -104318 -110895 -250423 230708 307269 36717
7012 -157590 170382 547920 -52319 136745 8169 219809 215987 195702 30884 -85396 -82813
7001 -82813 -131783 -57073 100655 315548 -43998 -80924 217138 107422 27009 -205541 -67734
6989 -21055 -450603 23623 217250 -275020 -225072 -114571 -173524 -431780 -269032 -182696 -62427
6977 -93094 -111381 20568 -318026 54813 -169975 33265 135299 -139888 42171 -39537 -42742
6966 -42742 -175014 75538 5504 -19021 56844 43457 -101451 275837 99304 -30148 -225729
6955 -225729 85697 -217593 -96 -27697 167986 -240360 -80028 -16512 65601 -320856 187186
6943 65901 -117937 338025 -221938 162999 -123176 -288602 -69465 -329318 -249734 -332330
6933 -332330 167602 -101037 92829 -47998 -124306 46898 99200 -85928 -8039 -79272 -90208
6922 -90208 61054 108859 170559 -21639 142205 -98754 121004 -24781 -252740 -154879 -55984
6910 -182619 128098 27611 -212147 111169 311135 -68784 -258663 -375836 -207042 -280162
6900 -280162 -231804 -192346 267290 237544 33601 341366 301385 -365103 -158087 -284196 2711
6888 -4502 -201858 -155483 -6374 -210281 208719 -127742 39715 -148677 -71739 79016 -31942
6876 -128806 -28023 40185 -10210 199298 50815 -526280 108278 190559 -74333 129442 -165262
6864 55328 -237995 -63129 -53094 75292 197710 -293875 358013 -128611 -66879 111316 88338
6853 88338 -149446 -87825 -119112 -80299 193808 16727 256603 12657 104412 80571 -68515
6841 12885 -70160 -99732 -193797 579130 105152 -346795 -75661 -91821 -31210 -22662 316242
6829 -68318 254522 -156421 -135121 166464 -63756 14927 -87128 79848 244457 -126135 89075
6817 -18053 356762 -100663 -172190 28538 -138359 9181 -169124 -63598 -290385 245348 -159117
6805 6826 158741 54864 -170103 36459 -205880 131104 15080 71130 -165880 -3978 -183187
6794 -183187 -107965 157002 89283 211348 271677 233 -269299 -154541 -326466 82627 -132879
6782 -390632 -218576 -129751 2185 48848 -66336 275471 -147928 11610 -267957 80832 62803
6771 62803 451090 -219678 -62377 3556 83004 30320 154219 -40774 58105 -219247 -1742
6759 150225 -21532 34071 51110 225628 249998 149255 46277 204133 -98372 71837 495962
6748 495962 -170963 -78672 -23313 72955 217124 138579 -315035 -96619 -37253 27892 -423366
6736 -263499 277742 77758 -496 -190595 32128 -44852 -278563 -169259 255565 -330956 -437757
6725 -437757 -106473 -402669 117394 -147758 8841 57114 -96280 175656 -246288 -246435 153088
6713 262925 -173470 228514 124738 4367 87556 -138361 -35110 -1464 -41601 106650 -111940
6701 -392755 -151460 -53774 -134670 60425 5758 -147693 62216 192553 -21846 80136 112465
6690 112465 -148048 34016 -186352 -277355 -36291 131606 166202 43043 62338 -116675 -86054
6679 -86054 193512 -178758 -80994 31797 320556 -470001 -180683 -103967 -87793 -142280 -100922
6668 -100922 99834 -36753 -265774 -112696 -140267 61688 230312 55755 55406 -167217 -138055
6657 -138055 -72987 163770 131411 -140080 -50377 206254 126183 -19626 131688 -114891 41348
6645 55934 -122815 102309 -46446 -298760 15427 166143 84586 -267495 -154029 199474
6634 -118034 -28825 278422 -585656 33101 309975 210540 108597 -222619 -235392 252175
6623 -34681 9737 -134192 25715 -132142 114287 9252 -270393 -74301 70718 395608 174944
6611 -339425 196291 128145 72990 -27800 -210630 -172906 218171 -61994 295643 79092 -69280
6599 32512 126566 185365 21927 30935 -58358 -67707 -235476 -37715 -187293 -133949 -34274 -186992
6587 -186992 -191406 108083 2239 44784 -138746 -13492 -15550 74054 -81871 240140 3506 8233
6575 8233 -95390 -65478 174678 230096 27897 -217555 -203904 -97987 -80741 -31541 133841
6563 146994 -69586 -197760 -63795 20015 -110469 -373499 -81209 39305 -22272 -103922 -157623
6552 -157623 -81248 174126 -5627 -249108 91889 15607 -1389 67603 -21773 165794 363195
6541 363195 -109419 103136 -100826 326389 -251541 125462 27165 -63620 184635 54690
6530 322011 207207 -4594 228845 -156968 -166274 -57671 -261479 -100447 -160717 -149671 2887
6518 -76774 -181775 -52802 -73030 201249 217584 62891 -180617 63397 -133986 -94060 16338
6506 -90720 -184125 209988 -142510 39982 -122717 31681 156405 -103498 -183 2246 23453
6495 23453 -125921 -51264 -185563 -40388 -178259 -4447 51006 -41515 -16563 1145 99633 -363203
6482 29964 91772 -519242 73268 141324 -251392 342592 -249049 135972 13851 75568 184693
6471 184693 70213 451569 199396 -18313 134715 60319 -70909 -283003 -91232 -195863 -47592
6459 305659 -30417 -42692 -155832 -355945 -285514 -247475 23478 -356348 -53984 100164 76464
6448 76464 78577 133149 -123718 60750 -31897 237196 -138777 -29265 159330 -100977 -156003
6437 -156003 -294531 -204238 325184 123142 33079 -9698 200402 48604 -60305 -168789 -201002
6426 -201002 -235714 292846 40838 313472 115273 8256 -231881 -213348 518 251199 -176328
6414 108134 -252171 -222294 119854 -352896 294252 133316 -27597 -75032 98145 -48680 -64685
6403 -64685 -83519 30225 -60329 -214880 263622 293967 204493 107653 240534 -42979 200954
6391 -145257 137953 22728 -176145 -47421 -241468 44816 113079 -213032 -53429 82187 -12468
6379 -107578 231513 -261504 77870 -214543 29909 -43154 -114433 -28228 -53810 -104495 -354313
6368 -354313 80944 1784 -76374 -151608 -142698 141251 -262502 108507 107496 -19405 259237
6356 -153610 -122952 -207088 -211277 117072 -377107 214682 -91086 -208537 -138090 97084 258396
6345 258396 -28234 364479 -56576 -30588 198393 -264474 -216153 440142 81163 27330 -45880
6333 192794 259830 -100488 197429 35194 -33943 147108 -93024 -159068 138144 -272276 -174316
6322 -174316 -95147 -80585 157724 -238325 131059 -184809 -250273 264044 64913 -269216
6311 -36657 -18568 56998 -98947 -274957 168236 17165 193156 -109163 27766 45115 -243462
6299 -8628 -30666 -191342 120902 -71505 264644 206010 -180824 161949 240046 461177 -100047
6287 95177 139947 -126245 -55531 -384429 -261026 -172714 -18972 112946 11768 -97967 96781
6275 55896 -21683 -126514 26057 -122186 -36241 245061 -77006 268762 -15829 -300216 -71320
6263 -146582 42031 -113182 129452 -46925 -35910 -216506 -44074 141744 17925 82585 354598
6252 354598 56044 -271215 -66008 -33155 79609 2121 -8425 -379663 85102 -56931 -180745
6241 -180745 -529373 -73855 -370392 -11100 -35578 -52429 -51583 64051 151314 -76982 -126711 -184567
6229 -184567 -18018 54669 -287477 132058 -638079 -61635 -279929 -262726 -45495 154238 -35972
6217 55839 240738 -248209 -141139 263122 -87851 228554 10048 34690 -288656 176735
6206 -325273 48814 -228361 128021 28999 -47420 14869 274302 214996 -80328 64044 136341
6195 136341 52743 290005 65518 -187333 140389 -369119 -3758 6074 -118496 64528 -25639
6183 67343 164219 -9962 -137938 56625 92042 -267154 -71832 -63389 -23334 -262228 -177726 96502
6170 -39523 -118711 -174156 -37305 94065 -1259 -195667 73891 -85759 -4507 -24030 189296 130753
6158 130753 278949 -220566 184337 -140775 -224433 242305 25305 -113295 -23205 121040
6147 53957 30300 -76064 71477 200021 93704 70707 -256708 -233047 -78186 156745 -56459
6135 116695 -107301 55451 -81785 -132762 -52819 62700 163021 -96257 -144438 46887 277583
6124 277583 -42532 87010 109281 -70201 267282 132866 5980 99082 -90441 53999 -114515
6112 -45449 336050 -328649 -375792 93331 -175478 -283202 -159860 -132882 -96213 -131592 90998
6100 -79544 -137996 18727 276834 -123721 77895 -190642 -67987 152401 -309046 171623 48676
6088 -46575 -471664 61148 -93413 230002 75495 -308725 315840 -122923 -35032 137863 4528
6076 -128473 197301 -138759 -180149 98276 152119 -217096 -3407 -64676 224378 129088 69402
6065 69402 -288072 -39633 -207367 -5232 14831 57724 73617 -217670 -126897 247151 -266724
6053 189416 27880 -247296 58061 284301 -162356 4797 -86440 238541 -75168 171369 66105
6041 -99987 -23641 35317 48245 93825 -20551 130927 -110887 116053 -287032 214710 140195
6030 140195 186670 323130 31592 -110749 133660 -120874 105742 -299329 178265 -190690
6019 -345040 -29804 -274387 -208101 -131285 162490 -42464 -233164 -173389 34725 168683 -266219
6007 -162066 90992 86617 220875 -73232 115037 -154981 205461 40849 370610 -43732 178897
5995 -148428 126002 -61450 31941 -24238 32410 121949 -37907 234320 -47598 -234326 -171940
5984 -171940 -247474 77683 -164391 139358 -206031 -4151 -368652 318685 52558 351607 272303
5973 272303 -180277 34355 249085 250881 -221821 -49990 -51131 140884 -102430 -16263 4688
5961 10659 -27215 53437 96897 -223896 -91084 -163236 147705 64376 202820 59622 -52962
5949 99309 -40619 -147974 118242 62067 -126105 175327 246050 15301 39892 -141335 -97474
5938 -97474 -77725 -27309 -82455 88335 -3701 -93282 -74823 66553 179001 -72802 -70795 67004
5925 123445 121726 -119481 108523 -127576 314384 -157991 -153017 77123 326503 316221 -24558
5913 -79884 133088 111950 -49361 60577 -127651 -281378 -19814 20543 36092 259089 -120510
5901 -216450 -13811 234148 116252 88358 66565 64377 173667 67773 -12704 -88256 -17528
5889 -196698 155146 -160354 -332639 -280829 42895 215051 -86103 -239430 -162075 -205431 11898
5877 229066 -64817 240430 -240848 -94621 -160068 42518 -111018 113432 110891 -51806 43057
5865 -122203 -63926 -142014 182493 206137 54687 -215321 60726 -8059 132791 -50805 -234679
5854 -234679 -235547 -268575 -400403 -271315 97652 -169291 -14656 2832 -271286 179184 47272
5842 -23049 -205328 -197565 130554 200976 -188002 -326824 -200156 -14706 129218 -150248 -19825
5830 104647 117268 35904 11657 418157 115022 205567 -50951 -75657 153635 -240167 197100
5818 371228 124391 -62390 -230640 -82954 191418 -33339 269662 -101163 221822 -56965
5807 20827 -108841 -322720 -318066 -27159 165278 -70562 162452 84707 5393 10725 23832 -104241
5794 -22864 8222 -111535 -73023 -161073 -3377 15105 202886 -65844 98753 37722 -291676 -108302
5781 -118970 30936 -218498 99405 101213 -313196 -18625 71981 -204635 94644 2764 -159747
5769 52998 -166785 -174994 136286 212822 -36075 -97618 -9782 186785 11370 43737 207411
5758 207411 -262589 -1620 143229 -131333 -11162 -108534 -117348 171405 29303 15498 250368
5747 250368 203853 45323 -171883 92464 181639 131703 248610 -170883 123256 -1003 196775
5735 118669 -217488 195463 -209019 -92498 -356224 -157265 132293 -358097 56354 90578
5725 90578 -35567 -24078 104133 155919 267758 -260224 145493 -108460 -25619 181523 -63257
5713 9120 -180073 -107108 56430 -151455 -70400 350366 197321 222693 -170294 -19529 -224748
5702 -224748 86017 -303458 81730 -103589 -14928 30549 31491 201773 -246673 210808 -107461
5690 -135148 207779 -94533 262340 196847 -91052 -246283 -177703 125416 -76447 250679 126125
5679 126125 60951 108835 49602 -96015 -45710 178260 95411 52089 -53472 230030 5723
5667 24223 -50434 -85851 -164559 74168 78428 17678 -166842 322467 -210263 -92673 -88688 472642
5654 128852 41247 -147945 67259 -10438 -60069 -124490 -227737 -139080 75885 -112682 -89017
5643 -89017 300688 -105884 337411 82347 -457233 -11511 -149578 -9521 -114749 -290347 -11276
5631 181445 142044 139904 -43980 157551 111151 19254 70244 -188468 -188831 14323 12823 -109275
5618 -75090 -79030 -214067 20309 14415 118755 25101 -147179 -312127 -225525 277216 237810
5607 237810 -206347 -286527 146833 -139096 22882 -323900 -354375 -118933 -226678 41877
5596 301055 197181 -235114 -119754 167120 -243872 -258111 -78480 116850 51768 84509
5586 84509 -173037 -132084 185675 -90905 -17492 232721 -83232 127286 -90590 94300 -22973
5574 -76782 -66947 155027 -150487 31940 -180316 -232900 118948 39563 39066 -134335 -67887
5563 -67887 5958 31895 30225 222438 207419 176398 -145171 -23424 -141686 -38237 83173 2271
5550 137307 -23228 306213 -246706 -116453 -134890 -19838 160891 -90111 61543 -275320 -125336
5538 32391 46794 108019 -117582 -142837 56700 222712 -40765 -166595 -421618 -223387 -293848
5527 -293848 43382 15881 -3932 102872 210615 -15639 -148165 65735 119902 62139 69055
5516 69055 86885 -36629 196765 -225296 84656 -139013 -23252 -428050 81950 -277952 316590
5504 -202002 -57945 51503 -92091 -78503 -160479 181406 152292 30425 -112222 274067 -152461
5492 70448 -281387 -280764 298561 -2331 -43068 120407 447204 241347 104917 -156389 -203538
5481 -203538 -53414 139891 15279 -79656 32659 15120 82446 50012 -212289 19602 -286268
5469 -194126 3750 319694 -184005 -173936 3378 -56922 167913 36739 150441 -183844 -173472
5458 -173472 67430 49642 -121121 395750 7270 28022 -244006 -93922 -167078 -72019 -192645
5447 -192645 234284 -43811 -183519 231709 254157 -152090 -161314 -297 321840 233537 197671
5436 197671 -343327 -384035 -102156 -290573 -38468 -247040 -2176 -35223 -60878 -81878 293836
5424 -148129 57430 -282416 305899 -73943 -164697 162314 201994 -19613 22112 -357746 -82097
5412 -254839 -203624 15098 214977 -80505 -410510 189489 195283 93780 139960 -235563 -52282
5400 154827 140020 -110923 256412 216599 31970 -273146 -103718 4299 -202645 196094 172402
5389 172402 72844 -21083 -29384 -48104 4258 -112632 -483706 -334081 -306341 -69622 74577
5377 83180 76129 40506 -20709 59383 -210846 -86556 -48491 373224 -340349 -130387 85014
5365 -259451 141956 362216 234580 156720 -4700 101706 293722 208993 -129959 -166982 -31836
5353 -130766 127590 -135751 -267935 -73929 -17732 137653 -83878 -47497 -57867 -149522 -81308
5342 -81308 -145899 -2990 -18712 227084 -12452 57127 159199 87111 -61923 230248 -20635
5330 -178899 37163 3726 -169726 -210397 146947 14432 48053 -110545 -49802 -53132 110078
5318 -229684 -63985 41832 178536 52949 221494 -41823 47261 -81336 -43201 -12149 158712
5306 -83450 113847 -37698 179447 -34367 101354 70885 -47635 -338919 -81310 236763 -137940
5294 172804 224535 51854 76285 272419 -157498 163068 66629 185272 103316 49409 71277
5283 71277 191018 -112549 26105 66455 32197 -210882 -96648 4928 110740 84625 -80892
5271 -399151 17060 -1177 241692 93028 -176087 244561 98972 210687 -201131 188955 -188073
5259 -9673 -312734 60509 -151422 232022 388645 156267 -372042 285432 -22037 135215
5248 -390954 10850 401855 -55384 44186 -94250 206213 85426 26436 64866 -238824 -279746
5237 -279746 216471 27877 -106511 -2440 160525 -102502 -436644 -365767 217364 -269531
5226 120228 -177815 258144 60967 -271452 182848 -76836 68055 -180906 14891 -182216
5215 27689 -82450 28541 102846 -3353 -81537 -54638 55035 -223205 -139913 -133556 29685 -76398
5202 25841 100978 706416 1092 10250 23231 -87464 16494 149072 -37440 91513 128133 71411
5190 71411 117538 -123348 -14528 45746 -37741 -75602 -129618 -174120 126445 128694 344365
5179 344365 183521 -149716 -35894 -371648 126388 -25794 85638 157558 -287883 -26758 -12167
5167 -257905 67437 -38516 320676 108793 80875 -1796 -35430 11720 469723 -22726 -125233
5156 -125233 -95353 -327276 68819 -170701 104643 -36010 -138436 -164472 -178962 24819 151649
5145 151649 -54328 -222125 124024 -260527 -349459 -169371 153753 -22527 104177 13057
5134 121568 256603 -186076 -9887 175247 174836 2535 93272 -101076 -48626 -61236 233120
5122 -63530 -393419 52627 -246667 171814 320367 162711 235994 299037 -18695 -180377 -31772
5110 -74295 -12755 -161533 354981 5049 -56751 -345818 171988 51855 -174752 -232401 -139365
5099 -139365 -150406 -19457 31956 121774 24640 206163 135089 -164278 105312 -192648 39268
5087 -56061 255136 164343 37613 -64730 241796 81024 -48815 112546 309881 -241499 37422
5075 -154096 58382 -44519 -242278 -63501 5683 50890 73909 -210608 295274 82233 117295
5064 117295 -208222 120831 -75956 11941 102105 122602 179205 2954 380204 101885 234291
5053 234291 158821 264371 108902 -119233 126651 -2783 48389 -35808 -124748 -67829 239565
5041 23454 -67093 -155500 117284 116035 64901 -81922 -66229 64344 -137219 -199754 218641
5029 -15777 12717 -114726 204379 -200081 113150 -291406 -53292 207978 66326 60974 263538
5018 263538 147910 254245 153138 -21770 -16741 -125177 175139 -108701 198910 154705
5008 154705 101799 118955 -113223 125481 272338 -568 -88273 -113098 -126099 94557 40487
4996 -59317 64493 -315992 -116080 315041 100409 -329961 62058 -120768 -23338 193629
4985 96554 -239361 67306 -31677 -143766 5625 -272820 -91403 71144 -190570 36988 -146262
4973 -13768 -186225 190708 -273598 63511 -161905 119162 -205260 -21385 38406 -54552 83377
4961 140272 174156 101296 23193 -71356 -291870 74130 103075 -94668 118422 -57100 -29482
4950 -29482 162720 9103 -66494 16938 80190 -160440 230819 -126026 -23038 -115595 -179930
4939 -179930 130520 84016 185360 -156924 -181396 41932 -23027 80430 -14942 26834 456861
4928 456861 101546 157070 196858 -142964 45029 -73308 -163079 49923 58021 -142912 242029
4916 23852 -156148 17586 84291 264887 37155 -108828 209336 -77408 -183820 367975 123123
4904 115437 -152357 320748 53636 103016 24943 87368 -5684 -143617 -58404 9764 -34204
4892 60477 -310428 -108945 210926 -9940 -15002 -196764 -255210 -195254 -75242 65479 196703
4881 196703 216099 -11601 -208277 148502 96297 -68752 -5760 4601 -57994 -88008 -98750 20069
4868 -16134 113179 -244220 -344811 -27625 -4508 234860 -154900 52457 -20262 239167 271742
4857 271742 -367915 85800 52681 147299 1098 40025 312848 -215809 290460 -39078 184322
4845 193451 220290 122777 -108054 -63537 60313 -46949 147624 57805 303832 139674 116395
4834 116395 -79058 -70952 375376 11927 77337 167108 22991 -118532 -230892 -18029 63067
4822 -168591 213510 -201380 91825 284249 146935 -59130 196126 -166697 234404 191445
4812 191445 141720 20165 -179085 215488 -67071 -158838 -42953 139633 88054 -143578 85122
4800 -53758 101126 -1645 281747 -11237 -94332 81214 -125404 -98655 76190 -191427 200848
4788 289427 -54702 -153982 -108114 -274556 -159930 -72864 -9068 -146192 -371624 -185114 -73033
4776 305819 42807 -229192 -18619 46928 -149403 118715 159551 103140 -171136 -30971 -249516
4765 -249516 220223 -124268 26029 -229556 42550 145532 -139885 27152 228725 122628
4755 122628 99471 132101 112620 -22195 -151673 38093 68963 208974 -25142 191545 158313
4744 158313 243092 -152097 -80989 171881 104493 -340582 -79620 170934 -1127 10418 174717
4733 174717 130547 154533 103585 -131687 -285471 -17524 -43493 -234791 17367 60881 102562
4722 102562 -165098 -124475 -193644 60000 198317 -176434 158248 180218 -21807 374795 -233785
4710 -183169 146636 215150 -24192 105889 -56289 38903 -195863 -208106 1106 136808 -97502
4698 223875 -347109 -52288 -82254 189350 -96417 -54858 -119809 -265153 -81820 -244919 -70396
4686 -218009 189414 -33990 -243680 4333 -143808 -13498 306610 291528 146512 -107122 111998
4674 23595 52983 124671 -157397 122616 -173113 -77913 -14682 90079 -164365 131517 -228455
4662 103670 55273 -137587 -228460 233234 62944 -269740 -110955 45471 34642 -65756 28397
4650 181206 -32573 18174 -12265 -171520 217804 -117300 194796 186936 -118308 -136972 255629
4638 -46846 17182 -149987 -84426 342197 59871 -2126 377742 139811 -75053 -51514 86979
4626 -138576 -403308 51323 -197173 -242703 -22208 -2278 256219 369699 230411 -210690 80137
4614 -91222 -34819 509513 201843 295211 18914 -151110 169506 126082 152480 -118698 301078
4602 -4821 24948 213700 151540 214827 -25146 -28250 89923 -141957 92343 -514884 -230056
4590 99741 284918 117948 -126656 -3733 -151989 -50111 -136245 55840 -8910 190029 -83397
4578 119169 -49807 -196738 155440 405051 -118317 396400 143368 -210611 164423 264126
4568 264126 -79907 80443 -27257 86224 119166 -226576 -117793 315224 248716 161822 -17089
4556 -107468 -63766 -153680 65703 381833 191881 -306387 -266727 660898 50314 -105940 222591
4544 -45532 -144332 134001 -60708 -90654 -133276 214877 116295 193889 -352536 -151228 233541
4532 -115686 47226 14011 123301 -5038 -38392 277086 -31541 279547 340431 -224426 361849
4520 12508 64943 142432 5247 45068 38673 45701 110665 118214 -8709 -62238 154207 -111494
4507 59771 -60774 -182042 -103216 238034 -152496 100940 -143408 148674 34815 -163229
4496 174938 118199 100671 474956 -67484 27366 81600 -224876 -322566 133486 212229 158728
$$ [...]
##END NTUPLES=NMR SPECTRUM
##END=
